##TITLE=1H_Pr A-05
 CDCl3, 8 sc, 
 24.9.2020
##JCAMPDX= 6.0         $$ Bruker NMR JCAMP-DX V2.0
##DATA TYPE= NMR FID
##DATA CLASS= NTUPLES
##ORIGIN= UXNMR, Bruker Analytische Messtechnik GmbH
##OWNER= root
$$ XWIN-NMR		Version 3.5
$$ Thu Sep 24 11:07:57 2020 Russian Standard Time (UT+4h)  she@DPX200
##.OBSERVE FREQUENCY= 200.1315066352
##.OBSERVE NUCLEUS= ^1H
##.DELAY= (6, 6)
##.ACQUISITION MODE= SIMULTANEOUS
##.ACQUISITION SCHEME= undefined
##.AVERAGES= 8
##.DIGITISER RES= 18
##SPECTROMETER/DATA SYSTEM= spect
##.PULSE SEQUENCE= zg30
##.SOLVENT NAME= CDCl3
##.SHIFT REFERENCE= (INTERNAL, CDCl3, 0, 15.7039)
##AUDIT TRAIL= $$ (NUMBER, WHEN, WHO, WHERE, WHAT)
$$ ##TITLE= Audit trail, XWIN-NMR		Version 3.5
$$ ##JCAMPDX= 5.01
$$ ##ORIGIN= Bruker BioSpin GmbH
$$ ##OWNER= she
$$ F:/spectra/data/she/nmr/H-F/1/audita.txt
$$ ##AUDIT TRAIL=  $$ (NUMBER, WHEN, WHO, WHERE, WHAT)
(   1,<2020-09-24 11:07:08.18 +0400>,<she>,<DPX200>,
      <created by zg, POWCHK disabled, PULCHK disabled
       configuration hash MD5:
       00 E9 B6 7A A2 85 ED C7 34 08 36 98 17 FE 4E 26
       data hash MD5: 16K
       2E 51 57 5F C0 8F 61 65 76 CE 25 D6 A8 58 84 A2>)
$$ ##END=
$$ 
$$ hash MD5
$$ 62 D1 2B AB 02 3A 94 3A D9 50 A6 C0 8A C4 56 6F
##$RELAX= 
##$RELAX= 
##$RELAX= 
##$RELAX= 
##$RELAX= 
##$RELAX= 
$$ Bruker specific parameters
$$ --------------------------
##$DU= <F:/spectra>
##$EXPNO= 1
##$NAME= <H-F>
##$PROCNO= 1
##$TYPE= <nmr>
##$USER= <she>
##$AMP= (0..31)
100 100 100 100 100 100 100 100 100 100 100 100 100 100 100 100 100 100 
100 100 100 100 100 100 100 100 100 100 100 100 100 100 
##$AQSEQ= 0
##$AQ_mod= 1
##$AUNM= <au_zg>
##$AUTOPOS= <>
##$BF1= 200.13
##$BF2= 200.13
##$BF3= 200.13
##$BF4= 200.13
##$BF5= 200.13
##$BF6= 200.13
##$BF7= 200.13
##$BF8= 200.13
##$BYTORDA= 1
##$CFDGTYP= 0
##$CFRGTYP= 5
##$CHEMSTR= <none>
##$CNST= (0..31)
1 1 145 1 1 1 1 1 1 1 1 1 1 1 1 1 1 1 1 1 1 1 1 1 1 1 1 1 1 1 1 1 
##$CPDPRG= <>
##$CPDPRG1= <>
##$CPDPRG2= <>
##$CPDPRG3= <>
##$CPDPRG4= <mlev>
##$CPDPRG5= <mlev>
##$CPDPRG6= <mlev>
##$CPDPRG7= <mlev>
##$CPDPRG8= <mlev>
##$CPDPRGB= <>
##$CPDPRGT= <>
##$D= (0..31)
0 1.2 0 0 0 0 0 0 0 0.06 0 0.03 0 0 0 0 0.0002 0 0 0 0 0 0 0 0 0 0 0 0 
0 0 0 
##$DATE= 1600931227
##$DBL= (0..7)
120 120 120 120 120 120 120 120 
##$DBP= (0..7)
150 150 150 150 150 150 150 150 
##$DBP07= 0
##$DBPNAM0= <>
##$DBPNAM1= <>
##$DBPNAM2= <>
##$DBPNAM3= <>
##$DBPNAM4= <>
##$DBPNAM5= <>
##$DBPNAM6= <>
##$DBPNAM7= <>
##$DBPOAL= (0..7)
0.5 0.5 0.5 0.5 0.5 0.5 0.5 0.5 
##$DBPOFFS= (0..7)
0 0 0 0 0 0 0 0 
##$DE= 6
##$DECBNUC= <off>
##$DECIM= 32
##$DECNUC= <off>
##$DECSTAT= 4
##$DIGMOD= 1
##$DIGTYP= 9
##$DL= (0..7)
0 120 120 120 120 120 120 120 
##$DP= (0..7)
150 150 150 150 150 150 150 150 
##$DP07= 0
##$DPNAME0= <>
##$DPNAME1= <>
##$DPNAME2= <>
##$DPNAME3= <>
##$DPNAME4= <>
##$DPNAME5= <>
##$DPNAME6= <>
##$DPNAME7= <>
##$DPOAL= (0..7)
0.5 0.5 0.5 0.5 0.5 0.5 0.5 0.5 
##$DPOFFS= (0..7)
0 0 0 0 0 0 0 0 
##$DQDMODE= 0
##$DR= 18
##$DS= 0
##$DSLIST= <SSSSSSSSSSSSSSS>
$$ [...]
##$SUBNAM2= <"">
##$SUBNAM3= <"">
##$SUBNAM4= <"">
##$SUBNAM5= <"">
##$SUBNAM6= <"">
##$SUBNAM7= <"">
##$SUBNAM8= <"">
##$SUBNAM9= <"">
##$SW= 16.880792210976
##$SWIBOX= (0..15)
0 0 2 0 0 0 0 0 0 0 0 0 0 0 0 0 
##$SW_h= 3378.37837837838
##$TD= 16384
##$TD0= 1
##$TE= 0
##$TE2= 300
##$TE3= 300
##$TEG= 300
##$TL= (0..7)
0 120 120 120 120 120 120 120 
##$TP= (0..7)
150 150 150 150 150 150 150 150 
##$TP07= 0
##$TPNAME0= <>
##$TPNAME1= <>
##$TPNAME2= <>
##$TPNAME3= <>
##$TPNAME4= <>
##$TPNAME5= <>
##$TPNAME6= <>
##$TPNAME7= <>
##$TPOAL= (0..7)
0.5 0.5 0.5 0.5 0.5 0.5 0.5 0.5 
##$TPOFFS= (0..7)
0 0 0 0 0 0 0 0 
##$TUNHIN= 0
##$TUNHOUT= 0
##$TUNXOUT= 0
##$USERA1= <user>
##$USERA2= <user>
##$USERA3= <user>
##$USERA4= <user>
##$USERA5= <user>
##$V9= 5
##$VALIST= <valist>
##$VCLIST= <CCCCCCCCCCCCCCC>
##$VD= 0
##$VDLIST= <DDDDDDDDDDDDDDD>
##$VPLIST= <PPPPPPPPPPPPPPP>
##$VTLIST= <TTTTTTTTTTTTTTT>
##$WBST= 1024
##$WBSW= 4
##$XGAIN= (0..3)
0 0 0 0 
##$XL= 0
##$YL= 0
##$YMAX_a= 141921
##$YMIN_a= -141704
##$ZGOPTNS= <>
##$ZL1= 120
##$ZL2= 120
##$ZL3= 120
##$ZL4= 120
##$ABSF1= 10
##$ABSF2= 0
##$ABSG= 5
##$ABSL= 3
##$ALPHA= 0
##$AQORDER= 0
##$ASSFAC= 0
##$ASSFACI= 0
##$ASSFACX= 0
##$ASSWID= 0
##$AUNMP= <proc_1d>
##$AZFE= 0.1
##$AZFW= 0.1
##$BCFW= 1
##$BC_mod= 2
##$BYTORDP= 1
##$COROFFS= 0
##$CY= 11.3945322036743
##$DATMOD= 1
##$DC= 2
##$DFILT= <>
##$DTYPP= 0
##$F1P= 16.9975609425685
##$F2P= -3.02152046262296
##$FCOR= 0.5
##$FTSIZE= 0
##$FT_mod= 4
##$GAMMA= 1
##$GB= 0.15
##$INTBC= 1
##$INTSCL= 1
##$ISEN= 128
##$LB= 0.24
##$LEV0= 0
##$LPBIN= 0
##$MAXI= 10000
##$MC2= 0
##$MEAN= 0
##$ME_mod= 0
##$MI= 1.114404
##$NCOEF= 0
##$NC_proc= 0
##$NLEV= 6
##$NOISF1= 3.799351
##$NOISF2= 2.8
##$NSP= 1
##$NTH_PI= 0
##$NZP= 0
##$OFFSET= 15.70392
##$PC= 1
##$PHC0= -9967.893
##$PHC1= 6.000898
##$PH_mod= 1
##$PKNL= yes
##$PPARMOD= 0
##$PSCAL= 0
##$PSIGN= 0
##$REVERSE= no
##$SF= 200.130013532006
##$SI= 16384
##$SIGF1= 3
##$SIGF2= 2
##$SINO= 400
##$SIOLD= 16384
##$SREGLST= <1H.CDCl3>
##$SSB= 0
##$STSI= 0
##$STSR= 0
##$SW_p= 3612.71676300578
##$SYMM= 0
##$S_DEV= 0
##$TDeff= 0
##$TDoff= 0
##$TI= <>
##$TILT= no
##$TM1= 0
##$TM2= 0
##$TOPLEV= 0
##$USERP1= <user>
##$USERP2= <user>
##$USERP3= <user>
##$USERP4= <user>
##$USERP5= <user>
##$WDW= 1
##$XDIM= 8192
##$YMAX_p= 0
##$YMIN_p= 0
$$ End of Bruker specific parameters
$$ ---------------------------------
##NTUPLES= NMR FID
##VAR_NAME=  TIME,          FID/REAL,        FID/IMAG
##SYMBOL=    X,             R,               I
##VAR_TYPE=  INDEPENDENT,   DEPENDENT,       DEPENDENT
##VAR_FORM=  AFFN,          ASDF,            ASDF
##VAR_DIM=   8192,          8192,            8192
##UNITS=     SECONDS,       ARBITRARY UNITS, ARBITRARY UNITS
##FACTOR=    0.000296,      1,               1
##FIRST=     0,             0,               0
##LAST=      2.424536,      0,               0
##MIN=       0,             -141704,         0
##MAX=       2.424536,      141921,          0
$$ Real data points
##PAGE= N=1
##DATA TABLE= (X++(R..R)), XYDATA
$$ plain form
0 0 0 0 0 0 0 0 0 0 0 0 0 0 0 0 0 -5 8 -8 8 -8 8 -16 16 -16 24 -24 32 -36 40 -48 56 -62 71 -80 93 -102 117
37 117 -132 147 -165 181 -203 225 -250 276 -305 337 -371 410 -450 497 -548 602 -665 733 -811
56 -811 897 -999 1113 -1246 1403 -1593 1826 -2124 2510 -3050 3847 -5165 7881 -29771 90086
71 90086 36486 -141704 -43113 87892 13061 -76420 8199 61253 6868 -20271 39919 34601
83 34601 -648 2864 47751 24543 -26721 10683 51702 2790 -37034 26481 40188 -23091
95 -23091 -11849 47105 14906 -40342 32624 64421 -19735 -37360 64050 64381 -39887 -30892
107 -30892 64479 56052 -47521 -29775 52071 34500 -39450 -30139 38015 19000 -33740 -16790
119 -16790 30144 4111 -21257 3509 18029 2171 -8980 11313 6245 1170 3379 -1636 -7523
$$ packed form
0@%%%%%%%%%%%%%%%nJ3j6J6j6J6k4L2l2M0m8N6o8P6q8J04j18J33j51J73j95K19
37A17k49K79l12L46l84M28m75N26n81O42p08P81q60R47j045J150j267J398j544
56h11J708j896K112k359K649k996L419l950M634n560O897r012J3046l7652J19857
71I0086n3600j78190R8591J31005p4831q9481Q4619N3054n4385k7139O0190n318
83C4601l5249L512M4887k3208n1264L7404M1019m8912l9824O3515J3707o3279
95b3091J1242N8954l2199n5248P2966L1797q4156j7625J01410L31j04268Q995
107c0892R5371q427j03573J7746Q1846j7571p3950R311O8154j9015n2740J6950
119a6790M6934k6033k5368K4766J4520j5858j1151K0293n068n075K209n015n887
$$ plain form
132 -7523 2661 5255 -21780 -18360 425 438 -29359 -29600 -405 -1668 -24971 -29424 -506 3183
146 3183 -13100 -22175 768 12890 -6995 -10821 1993 16174 -2269 -11654 4250 14806 -4051
159 -4051 -18299 2574 13971 -4753 -29092 571 21383 -8882 -30245 -609 26618 -7046
171 -7046 -26187 1809 25074 -2718 -17097 5747 13840 2022 -7688 5959 4238 441 2258
184 2258 3059 -2350 -53 8857 -1702 -2073 4892 9602 -3587 -442 16217 5937 -8351 3119
198 3119 23225 1438 -15070 4211 22337 -1418 -22544 3237 14167 -4275 -20339 -1756
210 -1756 8181 -4658 -10852 -3179 4963 -651 1186 -1166 5407 8400 5043 2936 7271 15363 3399
225 3399 -560 10433 17550 -4149 -9786 13141 12690 -11464 -17879 11215 8418 -16732 -15960 7121
$$ packed form
132g523J0184K594k7035L420J8785J3k9797k41K9195j263k3303m453K8918L689
146C183j6283r075K2943J2122j9885l826J2814J4181j8443r385J5904J0556j8857
159d051j4248K0873J1397j8724k4339K9663K0812l0265k1363K9636K7227l3664
171g046j9141K7996K3265k7792j4379K2844Q093j1818r710J3647j721l797J817
184B258Q01n409K297Q910j0559l71O965M710j3189L145J6659j0280j4288J1470
198C119K0106k1787j6508J9281J8126k3755k1126K5781J0930j8442j6064J8583
210a756R937j2839o194P673Q142n614J837k352O573K993l357k107M335Q092j1964
225C399l959J0993P117k1699n637K2927m51k4154o415K9094k797k5150P72K3081
$$ plain form
239 7121 3243 -14988 -4589 3509 -2406 -6849 8404 3297 -10465 4334 16539 176 -14138
252 -14138 10581 16634 -6546 -11450 12434 8497 -17266 -1347 13559 -7525 -24709 8434 16987
265 16987 -23573 -28240 15779 17713 -32699 -24638 18375 11285 -29821 -16694 17487 -1496 -20718
278 -20718 -1033 11458 -14605 -9079 17266 3663 -22159 123 30921 -2442 -24121 8708
290 8708 29549 -6592 -19234 14843 15886 -11871 -8489 17703 -3344 -19722 7421 16907 -17486
303 -17486 -23275 20911 17402 -23464 -17243 28198 16358 -20127 -1688 27176 11771 -10063 13952
316 13952 21296 -727 1018 23752 10579 -14919 7271 24030 -1451 -22363 7159 18948
328 18948 -12918 -18864 6401 8673 -16125 -7325 8823 -1627 -13075 5373 12969 -10238 -6887
$$ packed form
239G121l878j8231J0399Q098n915m443J5253n107j3762J4799J2205j6363j4314
252a4138K4719O053k3180m904K3884l937k5763J5919J4906k1084j7184L3143Q553
265A6987m0560m667M4019J934n0412Q061M3013p090m1106J3127L4181j8983j9222
278b0718J9685J2491k6063N526K6345j3603k5822K2282L0798l3363k1679L2829
290H708K0841l6141j2642L4077J043k7757L382K6192k1047j6378K7143R486l4393
303a7486n789M4186l509m0866O221M5441j1840l6485J8439K8864j5405k1834K4015
316A3952P344k2023J745K2734j3173k5498K2190J6759k5481k0912K9522J1789
328A8948l1866n946K5265K272k4798Q800J6148j0450j1448J8448P596k3207L351
$$ plain form
341 -6887 14660 10939 -14312 -3422 17145 1897 -15431 -968 12086 -10223 -14579 2058 2247
354 2247 -17112 -12476 6512 -5177 -17851 -5633 8623 -7576 -12234 3981 6291 -6541 -5836
367 -5836 10502 1284 -7846 836 9576 -3892 -10099 3661 4330 -7250 -9683 4049 -821 -7687
381 -7687 -1589 3426 -2206 -4347 8354 5940 -2645 431 15118 9886 -3043 3737 14150 10725
395 10725 -3313 1886 8545 5388 -2222 -2144 924 -1170 -415 -3669 -3004 -3996 -154 1124 -2331 -1455
411 -1455 195 5878 3797 1739 902 7125 8763 2759 364 3248 8256 868 -2381 -1265 491
426 491 -2801 -3984 -3591 -8719 -5989 -2433 -3024 -12589 -7827 3462 -1435 -10915 -5166 8233 225
441 225 -7309 670 9234 -1668 -5271 8190 5547 -6596 -3879 11628 1732 -12915 -1974 11194
$$ packed form
341f887K1547l721k5251J0890K0567j5248j7328J4463J3054k2309m356J6637J89
354B247j9359M636J8988j1689j2674J2218J4256j6199m658J6215K310j2832P05
367e836J6338r218r130Q682Q740j3468o207J3760O69j1580k433J3732m870o866
381g687O098N015n632k141J2701k414q585L076J4687n232j2929O780J0413l425
395A0725j4038N199O659l157p610P8L068k094P55l254O65r92L842J278l455Q76
411a455J650N683k081k058q37O223J638o004k395K884N008p388l249J116J756
426D91l292j183L93n128K730L556n91r565M762J1289m897r480N749J3399q008
441B25p534P979Q564j0902l603J3461k643j2143K717J5507r896j4647J0941J3168
$$ plain form
455 11194 -1458 -14472 2075 7667 -4485 -8402 5664 3607 -8345 1379 9574 -1882 -10398
468 -10398 8772 11909 -7081 -9281 11259 11044 -10799 -4206 11086 4324 -9225 2858 10537
481 10537 -4952 -5100 11787 8777 -13006 -1100 18114 4640 -15580 -18 18484 -1655 -13945
494 -13945 2127 10380 -7804 -8460 5505 -1317 -11821 -699 9534 -9929 -13543 8412 11590
507 11590 -12298 -11007 14543 8981 -10000 -4078 13918 2588 -7618 5728 7434 -7336 -4944
520 -4944 12253 68 -16222 -2402 14534 -5284 -20468 1997 12094 -7138 -15469 6797
532 6797 8306 -8652 -3385 10941 2377 -8632 8058 12637 -4883 -7953 12989 11090 -11814
545 -11814 -5620 12269 4487 -13866 -1572 8797 -4258 -10153 4453 5386 -11450 -3724 10395
$$ packed form
455A1194j2652j3014J6547N592j2152l917J4066k057j1952R724Q195j1456q516
468a0398J9170L137j8990k200K0540k15k1843O593J5292o762j3549J2083P679
481A0537j5489j48J6887l010k1783J1906J9214j3474k0220J5562J8502k0139j2290
494a3945J6072Q253j8184o56J3965o822j0504J1122J0233j9463l614K1955L178
507A1590k3888J291K5550n562j8981N922J7996j1330j0206J3346J706j4770K392
520d944J7197j2185j6290J3820J6936j9818j5184K2465J0097j9232q331K2266
532F797J509j6958N267J4326q564j1009J6690M579j7520l070K0942j899k2904
545a1814O194J7889p782j8353J2294J0369j3055n895J4606R33j6836P726J4119
$$ plain form
558 10395 509 -13055 2730 14323 -3936 -11049 6770 12631 -8394 -7617 9581 5635 -11177
571 -11177 -4692 10398 -2226 -12208 -286 8859 -6423 -10485 4423 5529 -6247 -5684 8031
584 8031 2220 -5049 1351 7924 -715 -4167 6682 5077 -3842 -2924 7500 1886 -6414 -604 4816
599 4816 -1400 -6409 2884 2527 -4160 -3554 6205 2992 -6000 742 8685 4711 -5129 1325 9707 5403
615 5403 -3019 -709 7702 4923 -1053 -3105 3265 3175 -1249 -2897 -1119 1080 -2123 -2041 -2042 -1522 -2416
632 -2416 -482 274 -3121 -2789 71 2814 -2728 -3215 227 2045 -1079 -3024 -189 -1077 76 -344
648 -344 -1600 -5250 -816 4330 -3242 -8689 -1650 7147 -3504 -11121 -1246 7117 -3382 -10883 1509
663 1509 4362 -4215 -6964 3813 2590 -6147 -1806 6196 1480 -6305 2768 7439 487 -3517 4327
$$ packed form
558A0395r886j3564J5785J1593j8259p113J7819N861k1025P77J7198l946j6812
571a1177O485J5090j2624r982J1922R145j5282m062J4908J106j1776N63J3715
584H031n811p269O400O573q639l452J0849j605q919R18J0424n614q300N810N420
599D816o216n009R293l57o687O06R759l213q992O742P943l974r840O454Q382m304
615E403q422K310Q411k779n976k052O370r0m424j648J778K199l203Q2jN20q94
632b416J934P56l395L32K860K743n542m87L442J818l124j945K835q88J153m20
648c44j256l650M434N146p572n447P039Q797j0651p617R875Q363j0499p501J2392
663A509K853q577k749J0777j223q737M341Q002m716p785R073M671o952m004P844
$$ plain form
678 4327 6365 -422 1376 4140 2189 -289 5845 3435 -3859 566 8160 2500 -8144 1181 9335
693 9335 777 -8023 2473 9070 -1615 -3808 5303 7065 -3822 495 8692 3056 -4230 2622
707 2622 9608 -519 -4255 2717 6240 -2391 -3541 1696 -665 -2157 -161 -475 -7081 -1548 4741
722 4741 -3377 -10777 -386 9238 -4888 -11113 1377 8270 -5439 -8802 4250 4076 -6067 -4570
736 -4570 5430 -1779 -7831 463 4887 -6149 -8654 4799 3232 -7681 -5925 5357 825 -7292
750 -7292 -272 3825 -2694 -3852 6205 1085 -7194 1014 10044 -1542 -10665 5133 11256 -4385
764 -4385 -10500 7670 9895 -7272 -6381 9013 6401 -8434 -167 9590 1221 -7422 4071 9324
778 9324 -3807 -4611 7000 6403 -6519 -1502 7807 1034 -5795 1972 6837 -4140 -3811 5958 3800
$$ packed form
678D327K038o787J798K764j951k478O134k410p294M425P594n660j0644R325Q154
693I335q558q800J0496O597j0685k193R111J762j0887M317Q197n636p286O852
707B622O986j0127l736O972L523q631j150N237k361j492J996l14o606N533O289
722D741q118p400J0391R624j4126o225J2490O893j3709l363J3052j74j0143J497
736d570J0000p209o052Q294M424j1036k505J3453j567j0913J756J1282m532q117
750g292P020M097o519j158J0057n120q279Q208R030j1586r123J5798O123j5641
764d385o115J8170K225j7167Q91J5394k612j4835Q267R757q369q643J1493N253
778I324j3131q04J1611n97j2922N017R309o773o829P767M865j0977L29R769k158
$$ plain form
793 3800 -7314 -1514 8614 -253 -7846 1446 8601 -3584 -7448 4754 5934 -6153 -5386 7159
807 7159 2066 -7495 -2568 7462 -138 -7827 562 5617 -1257 -5684 2568 3442 -1903 -1632 2766
822 2766 613 -2591 2514 2194 -2487 -2966 3716 1559 -4859 -2332 2833 1233 -4945 -1010 1910 -160
838 -160 -2464 472 1776 -1824 378 2589 1690 -2286 889 4112 1454 -2311 -1041 3727 1101 -2163
854 -2163 -3194 667 772 -2532 -3709 -2228 390 -2017 -2560 -2834 -809 -190 -695 -848 -2005 868 1861
871 1861 1790 -1648 233 3334 2302 -1169 -1591 2548 655 -1552 -1478 65 -1580 -1925 373 -1488 -3263
888 -3263 -1598 3204 -1012 -4168 933 4689 966 -2964 3185 4931 1313 59 4242 2951 -243
903 -243 3291 4256 27 -2392 5178 3934 -3287 -3033 4772 3188 -4899 -1179 4159 1284 -4136 1680
$$ packed form
793C800j1114N800J0128q867p593R292P155j2185l864J2202J180j2087P67J2545
807G159n093r561M927J0030p600p689Q389N055o874m427Q252Q74n345K71M398
822B766k153l204N105l20m681m79O682k157o418K527N165j600o178L935K920k070
838a60k304K936J304l600K202K211q99l976L175L223k658l765J270M768k626l264
854b163j031L861J05l304j177J481K618k407n43k74K025O19n05j53j157K873R93
871A861p1l438J881L101j032l471m22M139j893k207P4J543j645l45K298j861j775
888c263J665M802m216l156N101L756l723l930O149J746l618j254M183j291l194
903b43L534R65m229k419P570j244p221K54P805j584q087L720N338k875n420N816
$$ plain form
919 1680 4092 -2088 -1629 4600 3467 -4607 204 6329 949 -5700 660 5772 -2165 -4423 1439
934 1439 2582 -5181 -2455 3196 -2245 -6914 304 4809 -5704 -7048 3693 4546 -7416 -6326 5530
949 5530 2053 -7710 -3362 5137 -2091 -6654 1308 3248 -5223 -5307 4874 1153 -7335 -2624 6552
964 6552 -344 -7477 874 5686 -1699 -4833 4059 2971 -3825 -710 5394 -564 -5813 3823 6309
979 6309 -3584 -5549 6157 5906 -5186 -3059 7474 4910 -5459 480 7322 1813 -3647 3462
993 3462 6518 -1578 -1462 5024 3979 -3799 -302 5541 288 -3710 557 4134 -2446 -2237 2604 1457
1009 1457 -3273 -35 4380 -908 -2881 2149 4528 -2581 -2408 3907 2341 -3856 -2173 3788 -881
1024 -881 -4608 -1006 2140 -3009 -5322 217 406 -3318 -4417 589 -366 -2687 -1384 61 -161 -533
$$ packed form
919A680K412o180M59O229j133q074M811O125n380o649O360N112p937k258N862
934A439J143p763K726N651n441m669P218M505j0513j344J0741Q53j1962J090J1856
949E530l477r763M348Q499p228m563P962J940q471q4J0181l721q488M711R176
964F552o896p133Q351M812p385l134Q892j088o796L115O104n958n249R636K486
979F309r893j965J1706k51j1092K127J0533k564j0369N939O842n509n460P109
993C462L056q096J16O486j045p778L497N843n253l998M267L577o580K09M841j147
1009A457m730L238M415n288j973N030K379p109J73O315j566o197J683N961m669
1024h81l727L602L146n149k313N539J89l724j099N006r55k321J303J445k22l72
$$ plain form
1040 -533 1259 -814 -931 1418 2639 -1527 -2456 2410 1872 -2326 -3184 1648 719 -2701 -1929 409 -423
1057 -423 -2614 402 223 -1541 -1346 2557 1823 -1552 363 3161 3035 -665 804 2542 2425 1046
1073 1046 -46 400 938 2297 -148 -1919 -699 2219 475 -3499 -1295 1577 1039 -2822 -1111 1222
1089 1222 1221 -596 -532 1094 449 786 498 767 -240 477 1043 514 -305 -1214 553 659 -155 -2297 -987
1108 -987 1572 188 -2312 -2134 1861 597 -1803 -2013 1055 760 -1417 -385 393 353 -379 1484 -6
1125 -6 -1131 972 2017 -178 -1806 1736 1903 -782 -1069 1807 981 -1928 629 1936 -1028 -3289
1141 -3289 2133 2532 -3326 -3280 2929 2756 -4668 -2279 3399 2063 -4118 -748 3540 -551 -2517 1522
1157 1522 2976 -2713 -1435 3636 1384 -4214 -783 4115 -929 -4857 -56 3206 -3029 -3549 1659
$$ packed form
1040e33J792k073j17K349J221m166r29M866n38m198q58M832r29l420P72K338q32
1057d23k191L016j79j764J95L903p34l375J915K798j26l700J469J738j17j379
1073A046j092M46N38J359k445j771J220K918j744l974K204K872n38l861J711K333
1089A222jj817O4J626o45L37k88K69j007P17N66n29q19r09J767J06q14k142J310
1108i87K559j384k500J78L995j264k400k10L068k95k177J032P78m0p32J863j490
1125fj125K103J045k195j628L542J67k685k87K876q26k909K557J307k964k261
1141c289N422L99n858M6O209j73p424K389N678j336o181L370M288m091j966M039
1157A522J454n689J278N071k252n598L431M898n044l928M801L262o235n20N208
$$ plain form
1172 1659 649 -3907 -1393 3302 -1471 -4258 1740 4619 -2614 -3758 4381 4074 -3163 -2301 5141
1187 5141 2253 -3956 -140 4250 -208 -3757 2290 2301 -3116 -2890 3742 1211 -4856 -287 4247 464
1203 464 -4192 1845 4309 -524 -1279 3385 3043 -1768 1185 4005 211 -2679 2283 3749 -2487 -2631
1219 -2631 2508 2103 -3984 -1707 2423 -735 -3752 -146 2749 -2340 -2456 1810 2085 -2803 -1333 3483
1235 3483 834 -3036 -315 3256 -1302 -2322 1026 907 -2443 -2124 1791 -1335 -3490 -789 1644
1250 1644 -2084 -3487 520 950 -2320 -1990 1963 -82 -2100 674 2383 -1187 -2269 2830 2252 -2138
1266 -2138 -1927 3538 1876 -2954 -892 2733 1139 -2545 161 1295 251 -866 1680 1327 -1027
1281 -1027 720 2331 391 -1623 1312 2690 439 -939 1245 2277 -105 136 1251 910 74 996
$$ packed form
1172A659j010m556K514M695m773k787N998K879p233j144Q139l07p237Q62P442
1187E141k888o209L816M390m458l549O047J1n417K26O632k531o067M569M534l783
1203D64m656O037K464m833p55M664l42m811K953K820l794k890M962J466o236j44
1219b631N139m05o087K277M130l158l017L606K895n089j16M266K75m888J470M816
1235C483k649l870K721L571m558j020L348j19l350L19L915l126k155K701K433
1250A644l728j403M007M30l270L30L953k045k018K774J709l570j082N099n78m390
1266b138K11N465j662m830K062L625j594l684K706J134j044j117K546l53k354
1281a027J747J611j940k014K935J378k251j378K184J032k382K41J115l41q36R22
$$ plain form
1297 996 1263 -951 -139 1888 1893 -1630 -868 2358 1842 -1670 -2052 1767 1255 -1466 -2205 573 660 -1331
1315 -1331 -1617 -709 73 -1410 -908 -350 -647 -1243 -388 846 -1117 -1352 251 1655 -719 -1768 240
1332 240 1148 -640 -1964 -330 -285 -694 -1062 -506 -1535 -1466 642 -316 -2318 -1626 2282 355 -2475 -782
1350 -782 3134 1036 -2197 1067 3440 537 -1654 2107 2778 -1338 -1055 2758 1818 -3340 -784 2811
1366 2811 606 -3475 -833 2892 -372 -2328 668 2242 -1167 -252 2340 1013 -992 1391 3657
1381 3657 -594 -1376 2604 3084 -2015 -1696 2884 803 -2878 -1029 2298 -1468 -3407 629 1710 -2788
1397 -2788 -3059 2658 1420 -3140 -1885 3798 1466 -3107 -88 3030 851 -1916 1011 1556 -831
1412 -831 -938 1509 -217 -2294 160 1458 -1729 -2772 1298 1138 -2321 -1457 1464 758 -2572 570
$$ packed form
1297I96K67k214Q12K027Nl523P62L226n16l512l82L819n12k721p39K778Q7j991
1315a331k86R08P82j483N02N58k97n96Q55J234j963k35J603J404k374j049K008
1332B40R08j788j324J634M5m09l68N56j029O9K108r58k002O92L908j927k830J693
1350g82L916k098l233L264K373k903k191L761O71m116K83L813r40n158K556L595
1366B811k205m081K642L725l264j956K996J574l409R15K592j327k005K383K266
1381C657m251p82L980M80n099L19M580k081l681J849L327l766j939M036J081m498
1397b788k71N717j238m560J255N683k332m573L019L118k179k767K927N45k387
1412h31j07K447j726k077K454J298l187j043M070j60l459Q64K921p06l330L142
$$ plain form
1428 570 2570 -775 -1984 2064 2644 -1812 -1003 3054 1974 -2337 -445 2248 391 -2071 -316 1543
1444 1543 -1547 -1043 442 -124 -1866 -103 1386 -1172 -1500 648 1426 -1639 -642 1452 328 -1566
1460 -1566 377 2108 -1083 -1731 1210 1578 -2240 -1649 2409 875 -2272 -1415 2219 239 -2080 -330
1476 -330 1303 -432 -1347 933 -102 -1360 -483 1529 -475 -1577 638 1377 -213 -1459 1486 1388
1492 1388 -508 -36 1407 823 -598 1443 1459 -498 -1146 2146 1545 -1642 -1089 1574 1485 -2217 -900
1509 -900 1126 943 -938 -436 1161 332 -427 548 377 -236 1006 1272 248 -520 554 1458 564 -406
1527 -406 151 678 -172 -1978 -623 -443 -637 -1008 -563 -1508 -1298 -291 -284 -1233 -1533 164 556 -321 -1024
1546 -1024 435 1158 154 -641 -360 1113 -12 -732 -654 77 -558 -1048 -467 -958 -1313 -1083 -444 -1132 -1571
$$ packed form
1428E70K000l345j209M048N80m456Q09M057j080m311J892K693j857k462J755J859
1444A543l090N04J485n66j742J763J489k558l28K148P78l065R97K094j124j894
1460a566J943J731l191o48K941L68l818N91M058j534l147Q57L634j980k319J750
1476c30J633j735r15K280j035j258Q77K012k004j102K215P39j590j246K945r8
1492A388j896M72J443n84j421K041J6j957o48L292o01l187N53K663q9l702J317
1509i00K026j83j881N02J597q29p59R75j71o13J242K66j024p68J074R04q94r70
1527d06N57N27q50j806J355J80j94l71M45r45K10J007Pr49l00J697L92q77p03
1546a024J459P23j004p95K81J473j125p20P8P31o35m90N81m91l55K30O39o88m39
$$ plain form
1565 -1571 46 799 24 -480 937 1666 627 46 1354 1663 631 893 1581 758 -477 1165 1307
1582 1307 -519 -790 1093 1059 -1687 -921 1053 594 -1471 -36 1357 -97 -545 1279 2094 -704 216
1599 216 2171 1305 -1050 162 2289 231 -1366 147 1439 -995 -1560 566 -143 -1979 -1122 767
1615 767 -1299 -2460 -165 1058 -1516 -1955 1105 1015 -1191 -1066 1514 110 -1498 257 903 -833
1631 -833 -1492 1240 586 -2138 -1545 1644 18 -2809 -463 1195 -537 -2299 604 985 -1093 -1002 1306
1648 1306 379 -1643 684 2131 -101 -1478 1244 2264 -891 -907 1364 1566 -1417 -339 1666 233
1664 233 -1227 582 1685 -1231 -845 1610 1298 -1494 -513 1759 290 -1399 44 1759 -700 -955
1680 -955 973 1219 -1226 -666 1861 79 -1871 -129 2085 -311 -1701 613 1563 -447 -1675 1043
$$ packed form
1565a571J617P53p75n04J417P29j039n81J308L09j032K62O88q23j235J642J42
1582A307j826k71J883l4k746P66J974m59k065J435J393j454m48J824Q15k798R20
1599B16J955q66k355J212K127k058j597J513J292k434n65K126p09j836Q57J889
1615G67k066j161K295J223k574m39L060r0k206J25K580j404j608J755O46j736
1631h33o59K732o54k724N93L189j626k827K346J658j732j762K903L81k078R1K308
1648A306r27k022K327J447k232j377K722J020l155j6K271K02k983J078K005j433
1664B33j460J809J103k916L86K455l12k792R81K272j469j689J443J715k459k55
1680i55J928K46k445N60K527j782j950J742K214k396j390K314R50k010j228K718
$$ plain form
1696 1043 153 -1079 -534 535 -603 -1711 454 837 -1027 -1243 1156 835 -1442 -818 1181 677 -1004
1713 -1004 548 658 294 -402 649 676 -981 115 1281 323 -1453 35 1370 118 -1232 -356 1192
1730 1192 -86 -710 -150 498 -58 283 469 -351 155 646 911 -411 -263 564 870 -39 -545 508 311
1749 311 239 -594 52 46 -443 -300 -577 -450 -391 204 -324 -736 -420 308 231 -546 -399 124 491 -590 -439
1770 -439 -79 196 -160 -506 46 -396 -43 -142 -132 -619 -343 327 -98 -357 -550 643 207 -393 -350 455 300
1791 300 -258 213 376 316 85 709 536 -185 501 818 380 -787 476 1022 265 -366 293 900 -391
1810 -391 -262 615 547 -692 464 685 -201 -675 223 1237 -897 -691 693 602 -1022 -574 734 74
1828 74 -625 -46 921 -540 -870 594 586 -1239 -657 1191 139 -1241 -501 807 -757 -1244 -208 197
$$ packed form
1696A043q90j232N45J069j138j108K165L83j864k16K399l21k277O24J999n04j681
1713a004J552J10l64o96J051K7j657J096J166r58j776J488J335j252j350Q76J548
1730A192j278o24N60O48n56L41J86q20N06M91K65j322J48Q27L06r09n06J053j97
1749C11p2q33O46om89J43k77J27N9N95n28m12L16P28p7p77J47N23L67j081J51
1770d39L60K75l56l46N52m42L53r9J0m87K76O70m25k59j93J193m36o00M3Q05j55
1791C00n58M71J63o0k31O24j73p21O86L17m38j167J263N46p57o31O59O07j291
1810c91J29Q77o8j239J156K21q86m74Q98J014k134K06J384r1j624M48J308o60
1828G4o99N79R67j461l30J464qj825N82J848j052j380P40J308j564m87J036M05
$$ plain form
1846 197 -1156 -1296 538 -389 -1348 -192 975 -466 -1492 880 1439 -500 -855 1368 1191 -691 -231
1863 -231 1100 353 -1111 418 898 -619 -1331 617 475 -1499 -916 1065 617 -1370 -53 1232 220
1880 220 -561 885 1580 -108 659 1776 993 -452 757 1980 -58 -851 318 1454 -1084 -1265 557
1897 557 376 -1278 -1134 410 -592 -1290 -86 848 -712 -862 766 912 -337 -535 1303 561 -347
1914 -347 64 796 11 -575 97 -245 -1120 -723 184 -718 -1575 -385 -160 -835 -1657 -92 484 -235 -705
1933 -705 562 188 -115 705 890 376 -389 1126 841 -199 -325 648 623 -609 -624 -139 156 -529 -587 -441
1953 -441 -261 243 126 -7 -351 821 844 250 41 766 1284 145 36 840 826 121 188 558 -215 -69
1973 -69 -100 200 -885 -621 -3 -186 -345 -599 272 98 -284 -582 39 361 262 -349 40 173 245 432 -145
$$ packed form
1846A97j353j40J834r27r59J156J167j441j026K372N59j939l55K223j77j882M60
1863b31J331p47j464J529M80j517p12J948j42j974N83J981m48j987J317J285j012
1880B20p81J446O95j688P67J117p83j445J209J223k038p93J169J136k538j81J822
1897E57j81j654J44J544j002o98J204R34j560j50J628J46j249j98J838p42r08
1914c47M11P32p85n86O72l42q75L97R07r02q57J190K25o75q22J565N76p19m70
1933g05J267l74l03Q20J85n14p65J515k85j040j26R73k5j232j5M85K95o85n8J46
1953d41J80N04j17j33l44J172K3n94k09P25N18j139j09Q04j4p05O7L70p73J46
1973f9l1L00j085K64O18j83j59k54Q71j74l82k98O21L22r9o11L89J33P2J87n77
$$ plain form
1994 -145 -85 266 219 -356 -743 -259 47 -373 -768 66 -50 -352 -597 -167 138 -479 -108 400 492 -523 -55
2015 -55 805 12 -242 -48 950 278 -445 -256 521 480 -439 -137 268 272 -359 200 292 -460 -78 535 297 -424
2037 -424 410 611 20 -383 303 465 -594 -91 346 378 -634 202 441 -261 -675 729 1039 -913 -939
2056 -939 661 752 -803 -952 581 378 -916 -466 663 -145 -1011 138 468 -473 -767 700 259 -795
2074 -795 -495 911 -147 -687 222 627 -11 -619 591 357 -605 -78 969 195 -1009 343 1084 -188
2092 -188 -1195 627 1128 -679 -680 747 943 -641 -72 866 412 -487 276 1060 -284 -427 761 618
2110 618 -946 -142 638 373 -596 -189 782 -189 -137 394 255 -642 -86 719 -411 -772 -169 859 -693
2129 -693 -1085 257 485 -798 -813 434 5 -600 -466 112 -120 -647 -189 251 -489 -871 397 95 -580
$$ packed form
1994a45O0L51m7n75l87M84L06m20l95Q34j16l02k45M30L05o17L71N08R2j015M68
2015e5Q60p93k54J94R98o72p23J89P77m1r19L02M05Mo31N59R2p52L82O13k38p21
2037d24Q34K01n91m03O86J62j059N03M37L2j012Q36K39p02m14J404L10j952k6
2056i39J600R1j555j49J533k03j294M50J129q08q66J149L30r41k94J467m41j054
2074g95L00J406j058n40R09M05o38o08J210k34r62N27J047p74j204J352P41j272
2092a88j007J822N01j807jJ427J96j584N69R38m54q99P63P84j344j43J188j43
2110F18j564Q04P80k65r69M07R71r71N2N31j39q97N56Q05j130l61O03J028j552
2129f93l92J342K28j283j5J247m29o05J34N78k32n27M58M40p40l82J268l02o75
$$ plain form
2148 -580 -460 440 269 -637 -179 99 -11 -260 247 17 -443 58 310 -59 -860 234 575 179 -382 18
2168 18 652 65 108 531 602 183 403 588 31 -18 391 660 -89 -272 610 187 -146 -290 195 99 11 -178
2190 -178 279 -37 401 536 155 184 17 945 113 -46 12 499 162 -250 -199 -21 -234 -595 -261 -432 -596
2211 -596 -118 -427 -300 -735 -291 12 -252 -370 30 447 106 -98 157 436 87 -14 -181 34 -121 -94
2231 -94 -59 -220 -360 -373 -13 -421 -650 -115 -116 -239 -256 275 174 122 102 364 511 138 338 406 413 -29 453 399
2255 399 75 51 108 492 -436 -6 107 64 -504 -195 101 -157 -310 36 629 -215 -18 686 250 -323 45
2276 45 910 485 -135 227 543 -159 -305 -25 118 -509 -339 180 -446 -597 -286 156 -268 -709 487 294
2296 294 9 -115 125 295 -300 133 302 -32 -267 697 278 -459 -267 483 70 -760 -661 315 28 -688
$$ packed form
2148e80J20R00j71r06M58K78j10k49N07k30m60N01K52l69q01J094L41l96n61M00
2168A8O34n87M3M23P1m19K20J85n57m9M09K69p49j83Q82m23l33j44M85r6q8j89
2190a78M57l16M38J35l81K9j67R28q32j59N8M87l37m12N1J78k13l61L34j71j64
2211e96M78l09J27m35M44L03k64j18M00M17l41k04K55K79l49j01j67K15j55K7
2231i4L5j61j40j3L60m08k29N35jj23j7N31j01n2k0K62J47l73K00O8Pm42M82n4
2255C99l24k4N7L84r28M30J13m3n68L09K96k58j53L46N93q44J97P04m36n73L68
2276D5Q65m25o20L62L16p02j46K80J43o27J70N19o26j51L11M42m24m41J196j93
2296B94k85j24K40J70n95M33J69l34k35R64m19p37J92P50m13q30R9R76k87p16
$$ plain form
2316 -688 -138 154 -14 -269 59 238 -242 34 181 391 -272 473 563 45 -101 394 657 21 -308 193
2336 193 36 -103 96 305 -267 -287 166 249 -539 -353 681 54 -404 -57 667 -5 -507 -88 314 -99
2356 -99 -186 166 67 -188 -197 613 -129 -683 -148 156 -428 -731 137 -69 -130 -410 -41 -40 -254 142 63 -243 -416
2379 -416 684 270 -182 -69 467 600 -234 -90 306 458 -209 240 256 35 -35 99 54 -219 -87 498 254
2400 254 -320 150 445 69 -134 -212 364 -41 -16 54 137 250 -4 576 -239 6 28 557 -246 -459 44 391
2422 391 -141 -568 -42 483 -345 129 45 -452 -353 26 6 -309 -315 -40 212 -401 -379 -237 364 -405 -302 -95
2444 -95 -212 -410 -292 -40 -205 -48 -108 149 -336 44 241 3 -188 80 220 -118 -192 15 324 -2 -298
2465 -298 -76 126 232 -27 512 31 -47 119 489 122 -66 340 628 227 -159 229 363 136 67 266 269
$$ packed form
2316f88N50K92j68k55L28J79m80K76J47K10o63P45R0n18j46M95K63o36l29N01
2336A93j57j39J99K09n72k0M53Q3p88J86J034o27m58L47P24o72n02M19M02m13
2356i9q7L52r9k55rQ10p42n54N35L04n84l03Q68k06o1k80L69Jk14L96p9l06j73
2379d16J100m14m52J13N36J33q34J44L96J52o67M49J6k21p0J34m5k73J32N85k44
2400B54n74M70K95l76k03p8N76m05K5P0Q3J13k54N80q15K45K2N29q03k13N03L47
2422C91n32m27N26N25q28M74q4m97R9L79k0l15oK75K52o13K2J42O01p69J03K07
2444i5j17j98J18K52j65J57o0K57m85L80J97k38j91K68J40l38p4K07L09l26k96
2465b98K22K02J06k59N39m81p8J66L70l67j88M06K88m01l86L88J34k27o9J99L
$$ plain form
2486 269 -55 168 219 -321 -119 -25 -49 -234 -175 17 170 -390 -392 81 -151 -167 -71 485 -330 -65 67 -48 -160
2509 -160 -158 563 -121 -496 -180 292 -187 -697 -274 -175 -177 -364 -89 -301 -361 -117 301 -261 -485 229 222 -97 -7
2532 -7 390 367 31 223 131 444 231 137 273 0 -193 268 109 -252 -205 256 -162 -440 -271 352 288 -289
2554 -289 213 567 -79 385 542 320 -113 380 807 245 -18 -100 562 -223 -419 -44 99 -203 -472 85
2574 85 -255 -274 -488 -36 -310 -285 185 75 -194 -215 520 55 -206 -67 493 306 -217 279 214 -267 -439 276
2596 276 -102 -653 -113 -17 -142 -817 -291 50 -31 -436 -79 110 207 166 140 181 -74 525 600 -19 -310 288
2618 288 416 75 -272 213 421 -275 -403 -40 34 -254 -452 104 -132 41 119 83 -159 -66 400 150 0
2639 0 -148 450 340 -167 126 276 86 -130 -23 -13 -16 -370 -143 -252 -512 -149 -109 141 -251 -112 241 295
$$ packed form
2486B69l24K23N1n40K02R4k4j85N9J92J53n60kM73k32j6R6N56q15K65J32j15j12
2509a60KP21o84l75L16M72m79n10M23R9kj87K75k12o0K44M18n62k24P14pl19R0
2532gL97k3l36J92r2L13k13r4J36k73j93M61j59l61M7M61m18k78J69O23o4n77
2554b89N02L54o46M64J57k22m33M93M27n62k63q2O62p85j96L75J43l02k69N57
2574H5l40j9k14M52k74K5M70j10k69k1P35m65k61J39N60j87n23M96o5m81j72P15
2596B76l78n51N40R6j25o75N26L41q1m05L57J89R7m1k6M1k55N99P5o19k91N98
2618B88J28l41l47M85K08o96j28L63P4k88j98N56k36J73P8l6k42R3M66k50j50
2639@j48N98j10n07K93J50j90k16J07J0ll54K27j09k60L63M0K50l92J39L53N4
$$ plain form
2661 295 -257 -58 199 -242 46 2 -15 -34 144 229 -271 -30 91 302 -142 -323 -51 372 -125 -424 337
2682 337 -81 -167 -39 170 -34 148 148 151 -62 9 515 111 -201 259 330 286 232 142 323 161 -152 247 91
2705 91 -43 114 110 74 -351 61 188 163 -108 138 393 -44 -135 93 51 -128 185 200 -192 -260 134 320 -129
2728 -129 -398 -152 196 -400 -339 103 -250 39 -371 71 -440 -85 6 -242 33 -228 290 -276 -160 8 185
2749 185 162 -412 85 179 -89 -384 196 -91 -28 50 246 -91 -342 51 116 6 35 330 140 115 36 173 237
2772 237 -31 260 51 4 79 187 171 -251 290 257 259 -251 44 197 299 -40 -36 187 -49 6 -206 196 -143
2795 -143 149 392 -149 -326 -157 134 -444 -425 -95 110 173 -579 -101 28 -224 -272 -346 -125 -135 -107 -42 -108 -213
2818 -213 176 174 -270 -142 105 124 -369 -291 56 -89 -152 -147 -149 -32 -185 -79 16 -341 125 286 137 -31 200
$$ packed form
2661B95n52J99K57m41K88m4j7j9J78Q5n00K41J21K11m44j81K72M23m97k99P61
2682C37m18q6J28K09k04J82%Lk13P1N06m04l12M60P1m4n4r0J81j62l13L99j56
2705I1j34J57ml6m25M12J27k5k71K46K55m37r1K28m2j79L13J5l92o8L94J86m49
2728a29k69K46L48n96O1M42l53K89m10M42n11L55R1k48K75k61N18n66J16J68J77
2749A85k3n74M97R4k68k95N80k87O3P8J96l37k51L93O5j10K9K95j90k5p9J37O4
2772B37k68K91k09m7P5J08j6m22N41l3Kn10K95J53J02l39MK23k36N5k12M02l39
2795a43K92K43n41j77J69K91n78J9L30K05O3p52M78J29k52m8p4K21j0K8O5o6j05
2818b13L89km44J28K47J9m93P8L47j45o3NkJ17j53J06R5l57M66J61j49j68K31
$$ plain form
2841 200 248 58 273 128 377 380 287 174 48 -31 120 345 94 -228 -288 193 -85 -440 -39 270 47 -155
2863 -155 22 3 73 166 255 155 -134 390 336 60 -45 244 277 -332 -472 -102 108 -388 -288 -75 -253 -396
2885 -396 -332 -21 -261 -46 -90 -81 -377 -213 163 -93 -159 180 309 0 -124 255 -39 161 41 -20 59 -314
2907 -314 -347 71 -462 -324 98 137 -357 -183 319 182 70 231 346 151 179 264 379 174 191 489 376 9
2929 9 -193 201 353 -209 105 -38 -229 -241 -44 -203 -234 -145 104 -76 -461 205 107 225 -48 93 109 131 111
2952 111 -33 273 -21 -178 -17 -261 -285 -277 149 -497 -99 87 -346 -573 -338 245 110 146 -129 38 0 24
2974 24 177 216 148 -25 203 180 34 -36 164 -173 -104 168 89 42 -199 -226 -51 -97 188 -310 214 -46 205
2997 205 256 -63 -42 202 131 33 76 71 310 -177 167 -27 35 -51 -121 30 65 -87 -19 -186 -171 170 -97 141
$$ packed form
2841B00M8j90K15j45K49Lr3j13j26p9J51K25k51l22o0M81k78l55M01L09k23k02
2863a55J77j9P0R3Q9j00k89N24n4k76j05K89L3o09j40L70K10m96J00K13j78j43
2885c96O4L11k40K15m4Rk96J64L76k56o6L39J29l09j24L79k94K00j20o1P9l73
2907c14l3M18n33J38M22L9m94J74N02j37j12J61J15j95K8Q5J15k05J7K98j13l67
2929Ik02L94J52n62L14j43j91j2J97j59l1Q9K49j80l85O66r8J18k73J41J6K2k0
2952A11j44L06k94j57J61k44k4QM26o46L98J86m33k27K35N83j35L6k75J67l8K4
2974B4J53L9o8j73K28k3j46p0K00l37O9K72p9m7k41k7J75m6K85m98N24k60K51
2997B05N1l19K1K44p1r8M3nK39m87L44j94O2q6p0J51L5j52O8j67J5L41k67K38
$$ plain form
3021 141 -347 -229 66 118 -128 -232 -199 -21 -2 -18 -82 86 26 137 -17 -123 -272 106 -15 -410 -187 -29
3043 -29 288 71 -99 90 -83 -17 -165 270 -144 0 82 147 118 31 392 -50 109 -128 326 115 72 142 142
3066 142 242 -43 102 -134 62 -26 31 57 -46 317 129 -161 -182 348 152 -44 300 264 2 -41 231 -41
3088 -41 27 -105 133 180 -367 -317 63 84 -334 -16 66 31 -108 -153 -23 -314 -86 -106 -174 -335 78 470 -195
3111 -195 -286 -68 63 -329 -83 -177 -43 -17 46 10 -87 -42 208 282 -479 -92 145 51 -286 -139 230 -281 -202
3134 -202 -9 230 -104 34 150 -14 -119 6 87 143 -325 140 150 95 -309 70 323 245 -218 329 112 43
3156 43 101 104 31 -292 320 11 0 22 40 62 -341 -167 -182 -51 -5 -117 0 16 33 -132 -68 -210 34 150 29
3181 29 -156 119 60 -232 -206 40 211 -122 -77 48 -215 -191 -124 -121 -141 141 -21 -50 -146 179 76 -170 102 23
$$ packed form
3021A41m88J18K95N2k46j04L3J78J9j6o4J68o0J11j54j06j49L78j21l95K23J58
3043b9L17k17j70J89j73O6j48M35m14J44Q2O5k9q7L61m42J59k37M54k11m3P0%
3066A42J00k85J45k36J96q8N7K6j03L63j88k90k1N30j96j96L44l6k62m3K72k72
3088d1O8j32K38M7n47N0L80K1m18L18Q2l5j39m5J30k91K28k0o8j61M13L92o65
3111a95r1K18J31l92K46r4J34K6O3l6r7M5K50P4p61L87K37r4l37J47L69n11P9
3134b02J93K39l34J38J16j64j05J25Q1N6m68M65J0n5m04L79K53p8m63N47k17o9
3156D3N8Lp3l23O12l09j1K2J8K2m03J74j5J31M6j12J17J6J7j65O4j42K44J16j21
3181B9j85K75n9k92K6K46J71l33M5J25k63K4O7Lk0K82j62k9r6L25j03k46K72p9
$$ plain form
3205 23 122 -145 412 4 -6 121 83 175 -105 -128 130 152 -249 -98 235 18 -135 -88 -127 -21 275 197 -74
3228 -74 -75 137 114 -171 47 219 225 126 176 230 271 245 61 -26 212 -113 -115 -116 -276 -124 139 30 -249 -16 78 266
3254 266 -242 129 22 105 63 4 -118 -78 171 160 -38 218 356 -53 -185 -41 -123 -100 -84 112 -134 -69 -115
3277 -115 -47 -349 -173 -6 74 -25 -384 1 194 190 146 101 46 -131 51 59 72 37 -77 -67 -63 80 -29 163 -188
3302 -188 57 64 -83 -123 30 -122 -96 223 -164 4 138 294 149 -251 174 179 -163 36 -4 3 -108 -312 -243
3325 -243 -258 -209 19 293 -93 -299 -45 233 96 -238 -74 214 147 8 118 63 65 50 142 143 125 -163 351 -42
3349 -42 -241 143 67 -154 53 172 55 -197 -203 -44 -51 -109 -26 -54 38 48 194 18 88 249 302 133 -65 18 15
3374 15 230 -188 155 129 75 221 154 27 -219 300 147 -156 -163 -170 78 -261 178 -134 32 -296 214 -129 -313
$$ packed form
3205B3R9k67N57m08j0J27l8R2k80k3K58K2m01J51L33k17j53M7l9J06K96p8k71
3228g4jK12k3k85K18J72Or9N0N4M1k6j84q7K38l25kjj60J52K63j09k79K33R4J88
3254B66n08L71j07Q3m2n9j22M0K49j1j98K56J38m09j32J44q2K3J6J96k46O5m6
3277a15O8l02J76J67Q0r9l59L85J93mm4m5n5j77J82QJ3l5j14J0MJ43j09J92l51
3302a88K45Pj47m0J53j52K6L19l87J68J34J56j45m00M25Nl42J99m0Pj11k04O9
3325b43j5M9K28K74l86k06K54K78j37l34J64K88o7j39J10n5Kj5R2Jj8k88N14l93
3349d2j99L84p6k21K07J19j17k52oJ59pn8Q3k8R2J0J46j76P0J61N3j69j98Q3l
3374A5K15m18L43k6n4J46o7j27k46N19j53l03ppK48l39M39l12J66l28N10l43j84
$$ plain form
3397 -313 -126 96 -82 -215 -123 -136 -150 -88 -22 -68 -253 -263 -361 -148 -80 -194 142 -163 4 127 168 -183 88
3420 88 -3 -149 -47 60 -47 -41 57 -4 201 -42 213 282 -126 -139 21 141 136 6 288 70 48 459 43 6
3444 6 -218 -155 418 -27 91 230 78 49 -7 228 -62 -140 -37 -10 119 109 41 -17 79 -57 6 42 -156 198
3468 198 39 -197 -301 236 3 -100 -163 111 -51 -188 -80 -4 -291 -55 156 27 -232 17 -135 -76 -316
3489 -316 189 -75 -58 -133 140 -122 54 93 72 -381 -30 290 92 61 -60 50 -30 -154 48 172 -262 -305
3511 -305 -50 213 168 269 144 100 -355 303 224 -146 -236 -19 42 -101 121 114 31 -261 115 43 -51 -111 250 186
3535 186 -78 -5 250 194 -34 -75 87 -175 -160 -203 -4 -85 145 245 -138 -256 102 50 -24 -2 176 -196 -57
3558 -57 -108 46 128 -245 4 71 -161 -180 -58 303 -25 -8 189 10 -163 50 96 129 -185 424 89 100 -127
$$ packed form
3397c13J87K22j78j33R2j3j4O2O6m6j85j0r8K13O8j14L36l05J67J23M1l51K71
3420H8r1j46J02J07j07OR8o1K05k43K55O9m08j3J60J20nj30K82k18k2M11m16l7
3444Fk24O3N73m45J18J39j52k9n6K35k90p8J03K7J29j0o8n8R6j36O3L6j98L54
3468A98j59k36j04N37k33j03o3K74j62j37J08P6k87K36K11j29k59K49j52N9k40
3489c16N05k64J7p5K73k62J76L9k1m53L51L20j98l1j21J10q0j24K02J24m34m3
3511c05K55K63m5J01j25m4m55O58p9l70r0K17O1j43K22pq3k92L76p2r4o0L61o4
3535A86k64P3K55n6k28m1J62k62J5m3J99q1K30J00l83j18L58n2p4K2J78l72J39
3558e7n1J54Q2l73K49O7k32j9J22L61l28J7J97j79j73K13M6L3l14O09l35J1k27
$$ plain form
3581 -127 144 103 -168 -285 -112 90 -174 41 195 -61 72 121 -64 -69 152 311 -57 71 276 302 73 105
3603 105 -43 -136 -85 153 0 108 -109 -130 -49 0 -119 -19 -82 -161 -44 129 -264 40 198 -173 -187 -258 248
3626 248 -83 -164 121 60 -354 45 -164 -94 -82 -209 61 4 -216 -53 309 10 -11 -170 -90 -58 62 130 -37
3649 -37 193 81 3 48 274 159 159 336 -81 186 77 100 194 173 -27 -101 30 -210 -305 100 6 111 -85 76
3673 76 230 29 132 204 251 237 37 212 56 -91 122 49 92 -175 101 29 -61 -161 -5 66 -216 -43 -172
3696 -172 -123 65 36 141 -279 -9 142 -83 -189 17 -97 17 -176 -79 63 -278 28 -108 27 -169 126
3717 126 -62 -178 -163 155 17 -47 -147 50 -47 135 267 -23 -12 -7 180 72 -1 -108 14 -6 -137 215 19
3740 19 -113 -9 120 109 -90 -131 18 305 27 -2 -31 -269 42 77 32 -17 172 176 43 17 110 156 10 26 34
$$ packed form
3581a27K71m1k71j17J73K02k64K15J54k56J33M9j85nK21J59l68J28K05K6k29L2
3603A05j48r3N1K38j53J08k17k1Q1M9j19J00o3p9J17J73l93L04J58l71j4p1N06
3626B48l31q1K85o1m14L99k09P0J2j27K70n7k20J63L62k99k1j59Q0L2J20O8j67
3649c7K30j12p8M5K26j15%J77m17K67j09K3R4k1k00p4J31k40r5M05r4J05j96J61
3673G6J54k01J03P2M7j4k00J75j56j47K13p3M3k67K76p2r0j00J56P1k82J73j29
3696a72M9J88k9J05m20K70J51k25j06K06j14J14j93R7J42l41L06j36J35j96K95
3717A26j88j16J5L18j38o4j00J97r7J82J32k90J1NJ87j08p3j07J22k0j31L52j96
3740A9j32J04J29j1j99m1J49K87k78k9k9k38L11L5m5m9J89Mj33k6R3M6j46J6Q
$$ plain form
3765 34 -192 -130 -22 0 -198 -264 68 14 60 -44 181 -148 -166 41 -414 -7 -91 419 9 -298 167 169 4
3788 4 -163 -286 -33 -130 5 9 42 -138 13 148 -25 -114 97 -29 -105 -240 34 176 -94 88 115 38 3 145
3812 145 -19 -245 284 82 -119 -149 25 -26 0 -175 -124 190 -355 -146 6 224 -297 226 1 -35 -292 125
3834 125 130 -182 -14 -72 28 -61 -34 95 -34 -84 -97 83 -348 -29 -249 -184 -260 -82 149 -74 70 -8 14 -266
3858 -266 107 113 108 -21 -1 -30 -156 -215 69 12 117 44 92 -182 -281 67 85 -134 5 145 -136 49 181 -34
3882 -34 4 274 174 107 -210 28 177 270 -153 5 86 -71 -12 14 65 -272 -190 48 -51 -214 96 361 -101
3905 -101 74 154 -29 -116 119 161 200 -4 -99 259 -8 -332 163 53 -120 71 361 0 -150 -224 77 -84
3927 -84 -272 -12 -170 -74 5 195 129 -308 -103 239 204 -34 189 7 107 -153 -59 43 -133 -158 0 140
$$ packed form
3765C4k26O2J08K2j98o6L32n4M6j04K25l29j8K07m55M07q4N10m10l07M65Kj65
3788Dj67j23K53r7J35ML3j80J51J35j73q9K11j26p6j35K74J42k70J82K7p7l5J42
3812A45j64k26N29k02k01l0J74n1K6j75N1L14n45K09J52K18n21N23k25l6k57M17
3834A25Nl12J68n8J00q9K7J29j29n0j3J80m31L19k20O5p6J78K31k23J44p8K2k80
3858b66L73Onj29K0k9j26n9K84n7J05p3M8k74r9L48J8k19J39J40k81J85J32k15
3882c4L8K70j00o7l17K38J49R3m23J58Q1j57N9K6N1l37Q2K38r9j63L10K65m62
3905a01J75Q0j83q7K35M2L9k04r5L58k67l24M95j10j73J91K90l61j50p4L01j61
3927h4j88K60j58R6P9J90o6m37K05L42l5k38K23j82J00k60R4J02j76k5J58J40
$$ plain form
3949 140 -280 156 197 -22 53 323 180 -61 46 129 97 114 217 173 134 3 207 263 19 314 53 51 58 -79
3973 -79 270 -103 -209 -241 157 -20 17 8 73 -273 -226 254 -20 103 -185 6 -81 7 112 -32 -196 28 -60
3996 -60 -42 -239 56 -70 -264 -117 124 -82 -52 -30 51 -146 42 -44 -361 -117 143 113 85 -18 102 289 -176
4019 -176 129 -117 -242 -135 -145 178 -162 -2 94 69 21 -50 -41 -172 -59 135 -101 24 21 204 188 -135 2
4042 2 200 51 36 266 -30 86 -138 -86 62 -103 257 -65 -167 -37 41 104 -182 -297 -119 -54 -128 -35 -2
4065 -2 -74 -157 -198 211 -88 69 70 -48 -292 -91 110 -118 -215 -9 13 -148 -54 188 -178 129 -15 102 -318
4088 -318 31 102 201 -70 -264 200 -84 -25 -153 379 -102 198 180 58 24 29 62 -250 -32 -56 109 -135 -186
4111 -186 -179 -90 18 21 242 -78 -157 92 232 -91 91 271 133 10 -110 5 121 -315 153 214 -33 -102 48
$$ packed form
3949A40m20M36M1k19P5K70j43k41J07Q3l2J7J03m4l9j31K04N6k44K95k61kPj37
3973g9L49l73j06l2L98j77L7rO5l46M7M80k74J23k88J91q7Q8J05j44j64K24q8
3996f0J8j97K95j26j94J47K41k06L0K2Q1j97J88q6l17K44K60l0k8j03J20J87m65
4019a76L05k46j25J07j0L23l40J60R6k5m8p1Rj31J13J94k36J25lJ83j6l23J37
4042BJ98j49j5K30k96J16k24N2J48j65L60l22j02J30P8O3k86j15J78O5p4R3L3
4065bp2q3m1M09k99J57Jj18k44K01K01k28r7K06K2j61R4K42l66L07j44J17m20
4088c18L49P1R9k71j94M64k84N9j28N32m81L00j8j22l4NL3l12K18k4J65k44n1
4111a86PQ9J08LK21l20p9K49J40l23J82J80j38j23j20J15J16m36M68O1k47o9J50
$$ plain form
4134 48 -112 7 -99 -8 99 -264 124 111 -225 -284 -52 -105 -199 -111 -326 -64 -177 -165 -72 -68 7 36 -35 -108 -233
4159 -233 122 -212 -74 47 -66 8 143 28 196 60 47 -4 -72 71 265 26 -54 -121 -54 174 -54 -12 -75
4182 -75 -274 95 -82 83 -167 -159 70 48 28 109 243 9 -200 -235 230 -5 -12 -229 179 35 -47 147 -18
4205 -18 -71 -57 117 -47 -306 -133 41 -78 -56 14 -34 -112 131 227 -200 -100 -31 101 -54 -100 105 -123 34
4228 34 177 178 -31 -62 19 -268 -64 -305 142 25 20 148 -78 -23 -182 32 75 146 -206 155 103 3 233 119
4252 119 -61 -131 -88 -124 -8 58 72 -129 46 -101 141 -177 -208 -17 -88 82 -60 153 35 163 217 95 -85
4275 -85 -247 -48 180 -299 -71 128 32 64 149 -205 -206 -242 80 140 -41 -268 -126 -209 -59 5 -135 -127 -159 150
4299 150 -50 72 7 33 -55 -349 -58 7 -219 -34 113 36 -101 -121 278 -34 -295 119 155 -138 229 104
$$ packed form
4134D8j60J19j06R1J07l63L88j3l36n9K32n3r4Q8k15K62j13J2R3MP5K9p1p3j25
4159b33L55l34J38J21j13P4J35j15J68j36j3n1o8J43J94k39q0o7O7K28k28M2o3
4182g5j99L69j77J65k50QK29k2k0Q1J34k34k09l5M65k35pk17M08j44q2J94j65
4205a8n3J4J74j64k59J73J74j19K2P0m8p8K43R6m27J00O9J32j55m6K05k28J57
4228C4J43Jk09l1Q1k87K04k41M47j17nJ28k26N5j59K14M3P1l52L61n2j00K30j14
4252A19j80p0M3l6J16O6J4k01J75j47K42l18l1J91p1J70j42K13j18J28N4j22j80
4275h5j62J99K28m79K28J99r6L2Q5l54jl6L22O0j81k27J42q3J50O4j40Ql2L09
4299A50k00J22o5K6q8k94K91O5k26J85J47p7j37k0L99l12k61M14L6k93L67j25
$$ plain form
4321 104 -7 -341 -29 24 -155 41 23 311 20 -40 49 -19 -250 -211 302 -155 -110 303 98 -92 48 206
4343 206 -118 26 84 -56 262 -97 126 297 84 -170 -50 -165 -11 -24 152 45 -29 254 -126 40 -264
4364 -264 -104 -7 -275 -105 242 -32 9 -31 29 64 -23 90 -97 -446 -128 149 -135 -116 70 -44 29 -29 220
4387 220 137 -102 -227 -63 16 -86 43 245 10 -146 -41 249 -50 -98 98 176 83 -21 49 96 51 105 2
4410 2 55 34 189 95 -130 147 177 -257 209 90 -140 -65 -253 110 -46 2 -31 153 7 -26 252 176 -79 22
4434 22 338 182 45 163 40 52 -135 26 -215 -143 -193 25 12 -28 33 -42 97 -104 57 -44 -288 28 59
4457 59 -107 -209 126 -164 123 149 352 -37 -235 2 3 9 169 102 -157 -158 -17 62 13 90 -208 -45 -90 108
4481 108 27 93 8 88 -97 94 -22 183 38 -79 24 163 32 215 171 238 277 205 29 -9 -222 -41 -3
$$ packed form
4321A04j11l34L12N3j79J96j8K88k91o0Q9o8k31L9N13m57M5M13k05j90J40J58
4343B06l24J44N8j40L18l59K23J71k13k54J20j15J54j3J76j07p4K83l80J66l04
4364b64J60R7k68J70L47k74M1m0O0L5q7J13j87l49L18K77k84J9J86j14P3n8K49
4387B20q3k39j25J64P9j02J29K02k35j56J05K90k99m8J96P8r3j04P0M7m5N4j03
4410BN3k1J55r4k25K77L0m34M66j19k30P5j88L63j56M8l3J84j46l3K78p6k55J01
4434B2L16j56j37J18j23J2j87J61k41P2n0K18j3m0O1p5J39k01J61j01k44L16L1
4457E9j66j02L35k90K87K6K03l89j98K37JOJ60o7k59jJ41P9m9P7k98J63m5J98
4481A08q1O6q5Q0j85J91j16K05j45j17J03J39j31J83m4O7L9p2j76l8k13J81L8
$$ plain form
4504 -3 -53 -5 -122 167 27 36 55 -200 53 89 10 -45 65 209 193 -264 80 78 -97 -138 150 62 140 -138 -1
4529 -1 -172 24 -78 -88 -216 -96 152 -117 -243 -22 143 42 105 -164 302 -110 -211 -20 253 -53 -192
4550 -192 248 91 -35 -89 166 -140 -8 -86 -48 -200 -20 101 -41 62 -306 226 248 -83 43 27 98 54
4572 54 4 100 -146 -8 -104 266 -26 22 206 -116 -113 -49 -104 -180 175 104 -37 -101 -31 142 32 -115 43 15 -299
4597 -299 -144 184 -311 -154 66 126 -318 -111 0 56 -65 107 -206 42 -187 106 46 24 -102 86 35 -16
4619 -16 -195 -194 83 -81 -38 26 -92 -61 -118 43 -28 -2 -64 38 59 77 301 -14 270 121 233 161 109 245 -164
4644 -164 -284 -4 136 -108 50 -68 -129 81 -326 65 193 -59 -89 75 88 3 -191 131 76 -174 175 23
4666 23 2 100 -137 -36 -84 -109 -7 -170 -187 4 -105 -86 14 56 -135 -51 38 185 52 -91 -185 -117 21 72
$$ packed form
4504cn0M8j17K89j40RJ9k55K53L6p9n5J10J44j6m57L44kj75m1K88q8P8k78J37
4529aj71J96j02j0j28J20K48k69j26K21J65j01O3k69M66m12j01J91K73l06j39
4550a92M40j57j26n4K55l06J32p8L8j52J80J21j42J03l68N32K2l31J26j6P1m4
4572E4n0R6k46J38r6L70k92M8J84l22LO4n5p6L55p1j41o4P0J73j10j47J58k8l14
4597b99J55L28m95J57K20O0m44K07J11N6j21J72l13K48k29K93o0k2j26J88n1n1
4619a6j79JK77j64M3O4j18L1n7J61p1K6o2J02K1J8K24l15K84j49J12p2n2J36m09
4644a64j20K80J40k44J58j18o1K10m07L91J28k52l0J64J3q5j94L22n5k50L49j52
4666B3k1R8k37J01m8k5J02j63j7J91j09J9J00M2j91Q4Q9J47j33j43r4O8J38N1
$$ plain form
4690 72 -58 78 -203 69 33 3 2 57 201 -134 148 413 221 -39 -106 380 107 -30 -182 -45 102 103 -39
4713 -39 -56 -121 -107 6 -84 -116 187 98 246 -128 20 -35 -242 105 -229 -14 -86 -17 -32 -157 -220 -321 181 266
4737 266 -107 -79 253 267 34 48 73 -47 -88 263 -21 171 -183 -46 -81 104 -8 15 118 46 -142 -117 109
4760 109 -101 -36 -164 -193 -9 -100 -225 321 -322 -148 30 84 -77 232 22 34 115 164 45 -8 40 59 97 -230
4784 -230 17 -26 -89 -89 63 -120 -42 -205 68 105 104 -135 -43 -60 -108 -39 83 -39 286 305 163 255 148 42 -76
4809 -76 -122 -10 -100 -118 -66 16 49 42 309 -119 -75 -257 -243 -114 -89 106 -97 154 60 -36 -93 -100 26 101 201 83
4835 83 -146 -85 158 -153 -22 73 -58 -113 115 -63 -178 -94 201 29 -111 47 -5 -107 136 123 -161 -129 -108
4858 -108 -132 -25 -90 -26 90 -136 -119 47 82 -12 100 127 333 -155 -14 -3 41 -6 -267 -99 -176 -263 145 69
$$ packed form
4690G2j30J36k81K72l6l0jN5J44l35K82K65j92k60o7M86k73j37j52J37J47Jj42
4713c9j7o5J4J13r0l2L03q9J48l74J48n5k07L47l34K15p2O9j5j25o3j01N02Q5
4737B66l73K8L32J4k33J4K5j20m1L51k84J92l54J37l5J85j12K3J03p2j88K5K26
4760A09k10O5j28k9J84r1j25N46o43J74J78N4j61L09k10J2Q1M9j19n3M8J9L8l27
4784b30K47m3o3%J52j83P8j63K73L7jk39R2j7m8O9J22j22L25J9j42R2j07j06j18
4809g6m6J12r0j8N2Q2L3pK67m28M4j82J4J29K5J95k03K51r4r6n7pJ26P5J00j18
4835H3k29O1K43l11J31R5j31n5K28j78j15Q4K95j72j40J58n2j02K43j3k84L2K1
4858a08k4J07o5O4J16k26J7J66L5r4J12K7K06m88J41J1M4m7k61J68p7q7M08p6
$$ plain form
4882 69 -6 -85 245 -212 -127 101 -94 292 -192 51 38 -49 -183 -274 55 1 40 207 -87 -111 29 -193 139
4905 139 -81 120 75 16 133 -84 -38 -106 -40 174 104 148 100 -119 -31 -116 20 -74 -71 -129 166 245 -25 -6 1 -279
4931 -279 23 36 -121 -25 -49 121 -20 -70 110 -18 116 19 11 -176 -38 41 -269 -33 124 -232 -193 -176 161
4954 161 -197 -18 0 22 141 26 -36 50 -74 -36 -44 91 -292 -131 106 116 141 132 187 -27 66 137 121 257 -180
4979 -180 -159 -52 -15 122 15 -247 -86 174 -201 300 153 140 172 71 -206 65 17 72 318 133 -167 -189
5001 -189 -3 -22 -5 -201 35 -99 -29 145 -1 93 -33 189 26 -106 76 312 -6 -178 36 182 -120
5022 -120 -147 204 138 -86 194 178 134 -140 46 134 -1 47 -61 -43 -82 -5 56 -6 -196 -149 -76 -223 -17 77 -76
5047 -76 -132 213 102 -198 -129 -40 4 -8 -138 15 1 127 129 -82 -77 74 10 155 0 -153 8 270 -192 459
$$ packed form
4882F9p5p9L30m57Q5K28j95L86m84K43j3q7j34r1L29n4L9J67k94k4J40k22L32
4905A39k20K01m5n9J17k17M6o8O6K14p0M4m8k19Q8q5J36r4Ln8K95P9k70J9Pk80
4931b79L02J3j57R6k4J70j41n0J80j28J34r7qj87J38P9l10K36J57l56L9J7L37
4954A61l58J79J8K2J19j15o2Q6j24L8qJ35l83J61K37J0K5rN5k14R3P1j6J36m37
4979a80K1J07L7J37j07k62J61K60l75N01j47j3L2j01k77K71m8N5K46j85l00k2
5001a89J86j9J7j96K36j34P0J74j46R4j26K22j63j32J82K36l18j72K14J46l02
5022a20k7L51o6k24K80j6m4k74J86Q8j35M8j08J8l9P7O1o2j90M7P3j47K06R4j53
5047g6n6L45j11l00O9Q9M4j2j30J53j4J26Kk11NJ51o4J45j55j53J61K62m62O51
$$ plain form
5071 459 -15 152 100 206 202 -148 -23 44 -37 79 45 -21 6 -70 -206 288 -25 -56 317 106 175 36 -56 -14
5095 -14 -100 37 -51 143 -18 7 106 53 33 -187 -201 -28 -38 -128 -163 -162 143 -23 35 99 -37 -162 123 18 161
5120 161 -215 99 179 -15 135 -205 73 -147 -70 69 201 10 14 -12 83 67 -106 149 16 85 326 -88 -3
5143 -3 119 -100 226 -259 187 -3 206 -110 -269 95 330 28 155 -12 -134 -369 -201 49 -78 -82 46
5164 46 -7 142 17 137 -193 -149 -202 -249 -98 -11 259 -166 86 -63 75 123 -109 65 -155 -127 197 34 36
5187 36 21 -191 -17 119 13 -165 23 -11 31 5 -121 236 282 140 114 -184 -83 -53 5 -116 -197 60 17 147
5211 147 -274 -163 14 84 -141 145 100 -4 -202 -113 46 113 -118 -243 14 -87 -6 99 -57 -161 -73 69
5233 69 54 141 -12 254 8 81 -144 39 92 97 102 70 -41 218 241 -90 -70 109 135 -139 137 -31 24 117 1
$$ packed form
5071D59m74J67n2J06ml50J25O7q1J16l4o6K7p6j36M94l13l1L73k11O9j39r2M2
5095a4q6J37q8J94j61K5R9n3k0k20j4J73j0r0l5JL05j66N8O4j36j25K85j05J43
5120A61l76L14Q0j94J50l40K78k20P7J39J32j91Mk6R5j6j73K55j33O9K41m14Q5
5143cJ22k19L26m85M46j90K09l16j59L64K35l02J27j67j22k35J68K50j27mJ28
5164D6n3J49j25J20l30M4n3m7J51Q7K70m25K52j49J38M8k32J74k20K8L24j63K
5187C6j5k12J74J36j06j78J88l4M2k6j26L57M6j42k6k98J01L0N8j21q1K57m3J30
5211A47m21J11J77P0k25K86m5j04j98Q9J59O7k31j25K57j01Q1J05j56j04Q8J42
5233F9j5Q7j53K66k46P3k25J83N3NNl2j11K59K3l31K0J79K6k74K76j68N5R3j16
$$ plain form
5258 1 38 196 -237 258 14 -81 100 52 112 43 -95 -11 64 -22 -64 -40 -59 -161 245 -74 11 58 135 -94 -96 191
5284 191 -1 340 152 -86 65 -236 -32 -23 94 143 -187 77 -131 -91 216 30 -10 -107 166 -146 -263 13
5306 13 -5 -71 81 -75 -111 58 -3 97 10 -128 -59 17 -28 -126 18 281 161 -26 -56 31 -41 -71 95 -127 -51
5331 -51 -179 209 -1 -20 -202 36 -49 110 33 -57 103 80 23 -174 193 -131 217 -22 102 -136 112 12
5353 12 -163 64 -82 -74 37 139 -259 11 -121 -109 58 160 106 -77 -90 58 205 -13 -107 -161 186 24 -39
5376 -39 86 61 224 110 -50 1 37 -92 -23 -380 -93 128 50 -107 -170 99 28 227 125 -76 51 191 -7
5399 -7 -101 74 20 -41 72 31 323 -148 -107 538 13 19 248 -18 -79 119 -15 -37 -184 30 23 1 -28 -141 -68
5424 -68 -62 12 138 -30 -133 129 149 1 -17 48 191 -297 -20 67 46 18 -53 234 45 28 131 -101 -179 17
$$ packed form
5258AL7J58m33M95k44r5J81m8O0o9j38Q4P5q6m2K4j9j02M06l19Q5M7P7k29kK87
5284A91j92L41j88k38J51l01K04RJ17M9l30K64k08M0L07j86m0r7K73l12j17K76
5306A3j8o6J52j56l6J69o1J00q7j38O9P6m5r8J44K63j20j87l0Q7p2l0J66k22P6
5331e1j28L88k10j9j82K38q5J59p7r0J60k3n7j97L67l24L48k39J24k38K48j00
5353A2j75K27j46QJ11J02l98K70j32J2J67J02n4j83j3J48J47k18r4n4L47j62o3
5376c9J25k5J63j14j60N1L6j29O9l57K87K21p8j57o3K69p1J99j02k01J27J40j98
5399gr4J75n4o1J13m1K92m71M1O45n25OK29k66o1J98j34k2j47K14pk2k9j13P3
5424f8OP4J26j68j03K62K0j48j8O5J43m88K77Q7k1k8p1K87j89j7J03k32p8J96
$$ plain form
5448 17 0 -78 183 268 -20 57 -140 130 19 -66 117 -11 189 -136 -67 -7 174 -138 213 162 -76 -100 18
5471 18 5 -126 -172 -4 242 -182 42 206 -56 37 -112 -54 88 -55 -172 131 -14 53 147 -94 -34 248 33
5494 33 81 -5 -79 -393 -79 203 11 -104 -288 126 13 95 -18 55 -28 71 -75 80 -241 -164 111 -74 -150
5517 -150 -176 47 19 -76 9 -8 -3 -39 75 20 22 -15 -8 21 -92 11 -37 -40 128 71 -56 -130 -7 92 -20 -48 74
5544 74 -111 -116 3 52 276 290 -74 -77 -182 69 -264 39 -64 -43 519 -157 -197 -106 44 361 159 -79 18 -105
5568 -105 2 2 -164 28 -165 147 -28 215 129 58 -21 -35 -92 -15 -7 -186 77 115 -55 -91 -50 -197 -36 -95 241
5593 241 141 13 -65 250 -90 98 -288 -22 17 -228 -2 128 11 11 150 -165 -38 141 -100 80 261
5614 261 -162 -20 197 301 -133 181 -210 -52 36 121 26 320 218 -198 -51 -74 204 76 -35 -148 254
$$ packed form
5448A7j7p8K61Q5k88P7j97K70j11q5J83j28K00l25O9O0J81l12L51n1k38k4J18
5471A8j3j31m6J68K46m24K24J64k62R3j49N8J42j43j17L03j45O7R4k41O0K82k15
5494C3M8q6p4l14L14K82j92j15j84M14j13Q2j13P3q3R9j46J55l21P7K75j85p6
5517a50k6K23k8r5Q5j7Nl6J14n5Kl7PK9j13J03m8lJ68n7j27p4J23R9j12k8J22
5544G4j85nJ19M9K24J4l64lj05K51l33L03j03K1N62o76m0R1J50L17k02k38R7j23
5568a05J07%j66J92j93L12j75K43q6p1p9j4n7P7Qj79K63L8j70l6M1j47J61n9L36
5593B41j00j28p8L15l40J88l86K66L9k45K26J30j17%J39l15J27J79k41J80J81
5614B61m23J42K17J04m34L14l91J58Q8Q5r5K94j02m16J47k3K78j28j11j13M02
$$ plain form
5635 254 41 -146 18 -29 -86 -38 18 60 82 86 -34 -91 42 -87 -66 -15 -90 -111 -11 75 -174 164 -124 -110 -46
5660 -46 59 -144 -119 79 100 -212 30 20 133 -114 -306 -194 -105 -90 78 144 -156 -206 27 34 210 -109 64
5683 64 3 21 146 179 56 88 172 210 128 163 -45 5 -145 -53 151 -16 -125 145 -60 -120 -68 -26 11 74 -132
5708 -132 115 -160 165 139 -143 15 -220 43 -148 -128 60 108 -151 -39 -115 241 -2 -82 -8 9 -49 -146 -184
5731 -184 -11 -31 61 -10 13 114 10 -32 -94 -70 286 -222 43 288 -285 70 -95 -102 227 -50 121 -18 123
5754 123 39 54 105 -132 127 -184 -58 120 -182 145 -244 -315 73 -152 60 26 36 -104 -55 125 -105 14
5776 14 -170 173 -167 -25 60 171 -62 -82 -282 -51 46 37 -143 38 -49 -117 -64 27 164 39 -11 99 -28 -82
5800 -82 79 -161 -85 -99 197 -74 123 -50 171 -36 85 -65 -202 107 -68 163 -244 44 152 -79 -106
$$ packed form
5635B54k13j87J64m7n7M8N6M2K2Mj20n7J33j29K1N1p5k1J00Q6k49L38k88J4O4
5660d6J05k03K5J98K1l12K42j0J13k47j92J12Q9J5J68O6l00n0K33PJ76l19J73
5683F4o1J8J25L3j23L2Q4L8q2L5k08N0j50R2K04j67j09K70k05o0N2M2L7O3k06
5708a32K47k75L25k6k82J58k35K63j91K0J88M8k59J12p6L56k43q0P4J7n8r7l8
5731a84J73k0R2p1K3J01j04m2o2K4L56n08K65K45n73L55j65pL29k77J71j39J41
5754A23q4J5N1k37K59l11J26J78l02L27l89p1L88k25K12l4J0j40M9J80k30J19
5776A4j84L43l40J42Q5J11k33k0k00K31R7rj80J81q7o8N3R1J37j25n0J10j27n4
5800h2J61k40P6j4K96k71J97j73K21k07J21j50j37L09j75K31m07K88J08k31k7
$$ plain form
5821 -106 15 -49 140 -52 -29 -15 -67 62 -111 209 19 -125 105 -65 -261 -222 39 165 92 -206 182 -4
5843 -4 305 177 46 109 48 220 -187 -11 14 141 -26 127 -70 125 -129 -31 -99 181 -10 -206 -226 -122 49
5866 49 5 11 56 0 109 152 -9 -60 -15 -137 96 180 -112 231 112 -110 123 24 -8 99 -251 2 -222 199
5890 199 -219 -12 -73 36 61 42 82 -213 65 -20 -234 -143 -30 -28 259 26 151 80 66 44 -8 53 277 237 -103
5915 -103 -51 -14 -12 -101 -128 80 9 -230 -146 251 97 -78 290 134 -50 142 223 -37 126 -53 164 -88 -235
5938 -235 -140 -161 104 188 57 -163 -172 -157 96 -217 -203 -98 -78 4 204 -113 -339 -21 53 144 101 -144 -39 102
5962 102 101 -67 27 3 -172 28 80 -145 103 -128 173 -52 -32 13 -96 259 -174 182 7 -85 59 183 -38
5985 -38 -58 100 348 83 125 84 -46 51 28 -197 81 312 223 -100 176 3 72 -229 -75 57 85 76 -5 -204
$$ packed form
5821a06J21o4J89j92K3J4n2J29j73L20j90j44K30j70j96L9K61J26p3k98L88j86
5843dL09j28j31O3o1J72m07J76K5J27j67J53j97J95k54R8o8K80j91j96k0J04J71
5866D9m4OM5n6J09M3j61n1M5j22K33Q4k92L43j19k22K33r9l2J07l50K53k24M21
5890A99m18K07o1J09K5j9M0k95K78q5k14R1J13KK87k33J25p1j4k2n2O1K24m0l40
5915a03N2L7Kq9k7K08p1k39Q4L97j54j75L68j56j84J92Q1k60J63j79K17k52j47
5938b35R5k1K65Q4j31k20rJ5K53l13J4J05K0Q2K00l17k26L18P4R1m3k45J05J41
5962A02jj68R4k4j75K00N2k25K48k31L01k25K0M5j09L55m33L56j75r2J44J24k21
5985c8k0J58K48k65M2m1j30R7k3k25K78K31q9l23K76j73O9l01J54J32K8rq1j99
$$ plain form
6009 -204 21 -187 43 147 -34 2 138 113 46 59 -61 79 -81 34 -197 -89 -231 3 53 -33 -51 -22 -11
6032 -11 219 -153 -64 26 -250 -140 75 -106 -78 31 -97 -114 32 -169 -36 57 -70 -244 -136 -144 -57 -10 -111
6055 -111 -303 -185 26 64 95 102 -5 -13 54 -78 -163 -222 27 -171 -32 -86 82 307 81 -51 -96 132 -146 -41
6079 -41 128 207 152 -7 112 191 63 143 92 -35 -190 -106 94 197 51 -77 -63 278 25 35 207 -33 248
6102 248 36 69 112 68 -53 19 -87 102 142 -110 -21 102 226 -144 -40 -27 91 -224 85 231 55 -211
6124 -211 -136 -125 54 -164 -72 166 25 11 75 -134 37 -121 -30 100 112 74 -157 -77 166 130 60 -116 -227 -67
6148 -67 287 13 291 -4 -45 -180 -159 56 -6 -29 -157 13 28 88 -119 -178 -162 9 -57 166 -76 11 -57 246
6172 246 -13 293 -132 -60 -74 -29 -110 56 196 101 48 -18 -67 -51 -136 94 146 116 -149 -104 -184 -122 -60 -190 12
$$ packed form
6009b04K25k08K30J04j81L6J36k5o7J3j20J40j60J15k31J08j42K34N0q6j8K9J1
6032a1K30l72Q9R0k76J10K15j81K8J09j28j7J46k01J33R3j27j74J08qQ7M7j01
6055a11j92J18K11L8L1Pj07qO7j32q5n9K49j98J39n4J68K25k26j32m5K28k78J05
6079d1J69P9n5j59J19P9j28Q0n1j27j55Q4K00J03j46j28J4L41k53J0J72k40K81
6102B48k12L3M3m4j21P2j06J89M0k52Q9J23J24l70J04J3J18l15L09J46j76k66
6124b11P5J1J79k18R2K38j41j4O4k09J71j58R1J30J2l8k31Q0K43l6p0j76j11J60
6148f7L54k74K78k95m1j35K1K15o2k3j28J70J5O0k07n9J6J71o6K23k42Q7o8L03
6172B46k59L06m25P2j4M5q1J66J40r5n3o6m9J6q5K30N2l0k65M5q0O2O2j30K02
$$ plain form
6197 12 -17 189 91 -22 -88 -58 -10 -4 6 191 -120 350 -23 -52 287 -134 89 35 31 -55 186 42 -50 -124 2
6222 2 140 17 -86 -28 -155 -56 -2 11 -166 -11 211 239 1 -21 -175 51 -217 -241 85 85 -193 -102 -31 -86 -110
6247 -110 -115 236 -54 174 -50 -74 -17 101 66 46 67 -167 61 23 -46 24 -175 -9 -281 140 191 -31 -44 97
6271 97 -116 -5 16 -96 -31 -58 -214 -57 208 -89 230 43 -114 174 -73 98 406 -41 -91 -191 -5 1
6293 1 46 182 81 -14 42 79 144 18 -66 65 50 93 88 176 -29 -243 -102 19 -36 29 -209 91 26 -22 -147 57
6319 57 -36 -135 200 -24 11 -80 17 136 -94 98 -104 -145 122 254 184 111 -10 -23 -47 -27 -252 -128 59 -138
6343 -138 -102 93 -97 161 -110 53 -161 -142 61 -147 -146 -11 -103 202 -14 190 -76 -56 17 38 -44 -97 19
6366 19 168 109 -15 107 122 149 -86 -82 -101 56 -45 156 179 -8 53 148 -129 29 149 115 290 -118 -89 -43
$$ packed form
6197A2k9K06r8j13o6L0M8OJ0J85l11M70l73k9L39m21K23n4mq6K41j44r2p4J26
6222BJ38j23j03N8j27R9N4J3j77J55K22K8k38k2j54K26k68k4L26%k78R1P1n5k4
6247a10nL51k90K28k24k4N7J18l5k0K1k34K28l8o9P0j99J66k72M21N1k22j3J41
6271I7k13J11K1j12O5k7j56J57K65k97L19j87j57K88k47J71L08m47n0j00J86O
6293AM5J36j01r5N6L7O5j26q4J31j5M3nQ8k05k14J41J21n5O5k38L00o5m8j25K04
6319E7r3r9L35k24L5r1R7J19k30J92k02m1K67J32p0p3j21j3k4K0k25J24J87j97
6343a38L6J95j90K58k71J63k14J9K03k08JJ35r2L05k16K04k66K0P3K1q2n3J16
6366A9J49n9j24J22J5K7k35Mj9J57j01K01K3j87O1R5k77J58J20l4J75m08K9M6
$$ plain form
6390 -43 -97 -21 -114 116 -65 -142 0 -54 5 275 -17 -129 -81 232 -14 42 134 21 25 -124 45 -6 40 174 27
6415 27 -161 -13 -180 235 84 -35 -190 -30 128 -97 97 -5 89 35 -147 219 -165 103 241 61 -65
6436 -65 -94 -202 109 -39 -216 344 26 40 68 76 -44 -47 -91 -215 -51 93 226 -46 -171 165 322 15 -56
6459 -56 80 -212 -69 109 -30 58 -44 35 26 121 16 27 -52 63 82 111 -27 -26 139 22 109 -5 -56 119 -210
6484 -210 157 105 -136 -45 34 -14 -63 -201 -207 -243 66 -248 -95 -39 169 127 -58 -32 132 129 -209 208 -94 266
6508 266 229 137 -53 138 -35 137 -70 -27 -148 35 114 76 -52 -99 75 117 100 44 97 30 -68 36 189 -130
6532 -130 -28 -112 74 42 -22 59 155 18 -4 56 -136 58 180 158 185 -38 111 118 109 39 259 -5 -117 -151 -28
6557 -28 68 26 -180 -119 -165 -30 -119 2 -150 202 -43 39 21 252 -46 153 -108 -129 -68 -121 -97 -145 -174 121 -131
$$ packed form
6390d3n4P6r3K30j81p7J42n4N9K70k92j12M8L13k46N6R2j13Mj49J69n1M6J34j47
6415B7j88J48j67M15j51j19j55J60J58k25J94j02R4n4j82L66l84K68J38j80j26
6436f5k9j08L11j48j77N60l18J4K8Qj20lm4j24J64J44J33k72j25L36J57l07p1
6459e6J36k92J43J78j39Q8j02P9rR5j05J1p9J15J9K9j38JJ65j17Q7j14n1J75l29
6484b10L67n2k41R1P9m8m9j38ol6L09l14J53N6K08m2j85K6J64ll38M17l02L60
6508B66l7r2j90J91j73J72k07M3j21J83P9l8j28m7J74M2j7n6N3o7r8J04J53l19
6532a30J02q4J86l2o4Q1R6j37k2O0j92J94J22k2K7k23J49Prp0K20k64j12l4J23
6557b8R6m2k06O1m6J35q9J21j52L52k45Q2j8K31k98J99k61k1O1n3K4m8k9K95k52
$$ plain form
6582 -131 -57 131 205 132 -40 -29 -23 143 -83 26 70 -59 60 -77 -24 1 159 234 130 86 -87 -104 -100 214 178
6607 178 -143 144 209 -232 187 209 -70 -148 -49 -21 -139 -149 -49 16 -56 23 -192 187 189 108 -127 11 129 41
6631 41 12 -11 66 30 -83 251 158 156 139 -333 -71 -17 -123 -171 -19 92 -21 -22 51 90 -125 127 -206 -96 72
6656 72 -28 -31 -117 264 165 10 -112 77 44 104 -107 147 9 -125 236 167 -123 35 271 -80 -75 103 -120
6679 -120 -94 -9 -4 17 -25 150 162 -79 -73 -126 40 237 10 86 62 141 197 134 -99 -59 -4 -121 209 -34 75 109
6705 109 -39 -31 207 -262 -63 -305 -75 119 -127 -67 -17 -84 22 14 -18 7 143 242 -11 -163 -218 -129 202 -32
6729 -32 -112 69 65 255 122 -41 78 -118 35 -39 -57 47 -184 -22 -14 48 -56 -60 -45 105 67 88 -31 122 122
6754 122 -205 7 -72 158 69 54 -38 125 2 80 275 125 -39 -306 -26 90 0 -40 -57 -87 80 207 -108
$$ packed form
6582a31P4J88P4p3j72J1OJ66k26J09M4j29J19j37N3K5J58P5j04m4j73j7ML14l6
6607A78l21K87O5m41M19K2k79p8R9K8j18j0J00O5p2P9k15L79Kq1k35J38J18q8
6631D1k9k3P7l6j13L34r3kj7m72K62N4j06m8J52J11j13jP3L9k15K52l33J10J68
6656G2j00lq6L81r9j55j22J89l3O0k11K54j38j34L61o9k90J58K36l51NJ78k23
6679a20K6Q5NK1m2J75J2k41On3J66J97k27P6k4P9N6o3k33M0N5j17L30k43J09L4
6705A09j48QK38m69J99k42K30J94k46O0N0o7J06ql2K5J36R9k53j52n5Q9L31k34
6729c2q0J81mJ90j33j63J19j96J53p4j8J04k31J62QO2j04mJ5J50l8K1j19J53%
6754A22l27K12p9K30q9j5r2J63j23P8J95j50j64k67K80J16r0m0j7l0J67J27l15
$$ plain form
6777 -108 117 22 71 -53 92 104 -8 112 -103 113 65 90 142 127 107 7 -80 -169 -225 45 74 22 -38 -32 -190
6802 -190 238 -116 -180 -250 -103 -41 -164 40 -148 -102 -111 -38 52 175 -65 77 -83 13 71 93 184 236 49 18 295
6827 295 29 -260 30 -1 -57 196 157 -72 -85 82 -101 49 102 -134 -138 -188 -244 -51 191 63 -153 62 67 -2
6851 -2 100 150 10 -221 105 -49 -172 53 175 -90 -232 81 38 52 -67 213 -37 -181 38 -144 -34 35
6873 35 80 37 -40 -80 11 164 20 -196 123 200 55 142 -95 131 -97 -57 -16 -48 -140 -56 11 -76 -113 -41 24 -38
6899 -38 -116 -35 -12 -46 169 303 28 106 -5 108 243 97 55 174 -17 138 268 20 24 -140 62 151 -6
6922 -6 -17 24 57 -120 23 -158 67 -11 -73 112 -92 -5 -117 57 64 55 -249 -72 -186 -59 140 34 16 -63 -85
6947 -85 -12 8 39 -159 -179 -121 -22 -1 -30 111 -112 -147 -5 -19 60 158 347 136 22 -9 45 -229 -76 86 -111
$$ packed form
6777a08K25r5M9j24J45J2j12J20k15K16m8K5N2j5k0j00q7q9n6K70K9n2o0Oj58
6802a90M28l54o4p0J47O2j23K04j88M6rP3R0J23k40J42j60R6N8K2R1N2j87l1K77
6827B95k66k89K90l1n6K53l9k29j3J67j83J50N3k36mn0n6J93K42j28k16K15No9
6851bJ02N0j40k31L26j54j23K25J22k65j42L13m3J4j19K80k50j44K19j82J10O9
6873C5M5m3p7m0R1J53j44k16L19P7j45Q7k37K26k28M0M1l2r2Q4O7q7l7P2O5o2
6899c8p8Q1K3l4K15J34k75P8j11J13J35j46m2J19j91J55J30k48Mj64K02Q9j57
6922fj1M1L3j77J43j81K25p8o2J85k04Q7j12J74Prl04J77j14J27J99j06j8p9k2
6947h5P3K0L1j98k0N8R9K1k9J41k23l5J42j4P9R8J89k11j14l1N4k74J53J62j97
$$ plain form
6972 -111 -116 223 117 138 70 75 103 -46 -86 303 -209 -21 -18 -103 28 -212 -85 132 158 155 -165 -211 153 -35 93
6997 93 -65 16 -182 -57 -35 -381 114 -102 -35 -181 278 -65 33 5 136 -96 155 54 -29 -160 60 -44
7019 -44 254 -228 -128 -3 14 -86 129 61 113 131 99 -20 -39 190 -311 -26 153 -84 118 356 -279 -2
7041 -2 34 16 -141 6 45 -190 23 -140 -166 165 -26 55 -72 -260 -112 -90 72 29 208 230 1 -223 -182 169
7065 169 119 203 57 -35 -104 190 -57 -111 64 -24 98 -16 -33 -147 -12 68 169 -68 -127 34 176 -124 -69
7088 -69 -114 82 28 -186 404 -28 -217 -39 197 66 15 -10 79 -10 -76 104 -31 149 -19 20 -113 245 128
7111 128 -58 -54 126 329 -46 -86 45 109 -37 157 140 -44 -150 -224 -202 103 -29 7 286 -80 -85 75 -32
7134 -32 158 -90 -119 -102 -244 -86 38 -85 -213 -7 -98 19 44 -177 -163 -92 -93 -84 204 101 -100 243 119 -91
$$ packed form
6972a11nL39j06K1o8NK8j49m0L89n12J88Lq5J31k40J27K17K6ll20m6L64j88J28
6997I3j58Q1j98J25K2l46M95k16O7j46M59l43R8k8J31k32K51j01q3j31K20j04
7019d4K98m82J00J25J7j00K15o8N2J8l2j19j9K29n01K85J79k37K02K38o35K77
7041bL6j8j57J47L9k35K13j63k6L31j91Q1j27j88J48K2J62m3J79K2k29k24M1L51
7065A69n0Q4j46r2o9K94k47n4J75q8J22j14j7j14J35Q0J01k37n9J61J42l00N5
7088f9m5J96n4k14N90m32j89J78K36j31n1k5Q9q9o6J80j35J80j68L9j33L58j17
7111A28j86MJ80K03l75m0J31O4j46J94j7j84j06p4K2L05j32L6K79l66nJ60j07
7134c2J90k48k9J7j42J58J24j23j28K06r1J17K5k21J4P1jRK88j03k01L43j24k10
$$ plain form
7158 -91 -53 -10 6 -55 -78 -72 -16 -314 110 269 -105 -40 -50 81 273 -218 375 29 121 -51 -42 -38 212 104 0
7183 0 148 -216 -20 -176 14 159 -62 301 276 -13 -149 103 -177 -372 299 198 -49 251 -165 229 -145
7204 -145 6 -61 95 -12 180 57 -111 -90 -181 -13 -17 -35 -116 74 105 148 -160 197 104 -107 216 -41 36 30
7228 30 -143 -42 -84 -182 -135 160 -128 -295 -81 -9 47 69 -71 102 -13 128 106 75 8 146 -63 94 15 22
7252 22 109 -34 -98 207 39 -216 66 -81 87 17 71 222 -106 141 78 47 95 -35 -83 65 281 63 -133
7275 -133 113 -100 -118 -74 -123 85 46 14 -244 -93 -4 47 100 44 239 14 -225 -50 144 -64 -159 30 93 -29
7299 -29 -88 -22 326 -70 -268 236 -99 -87 -16 13 42 -325 -342 129 -117 146 156 -32 76 287 -42 -55 28 109
7323 109 103 28 -127 20 106 158 -189 195 -184 243 156 77 -30 -139 144 119 67 -23 -203 -50 -185 -27 205
$$ packed form
7158i1L8M3J6o1k3ON6k98M24J59l74O5j0J31J92m91N93l46R2j72RMK50j08j04
7183@J48l64J96j56J90J45k21L63k5k89j36K52k80j95O71j01k47L00m16L94l74
7204a45J51o7J56j07J92j23j68K1r1J68mj8q1J90L1M3l08L57r3k11L23k57P7o
7228C0j73J01m2r8M7K95k88j67K14P2N6K2j40J73j15J41k2l1o7J38k09J57p9P
7252B2Q7j43o4L05j68k55K82j47J68p0N4J51l28K47o3l1M8j30m8J48K16k18j96
7275a33K46k13j8M4m9K08l9l2k58J51Q9N1N3n6J95k25k39J75J94k08r5J89O3j22
7299b9n9O6L48l96j98N04l35J2P1K9K9l67j7M71k46K63J0j88J08K11l29j3Q3Q1
7323A09op5j55J47Q6N2l47L84l79M27q7p9j07j09K83k5n2r0j80J53j35J58K32
$$ plain form
7346 205 -86 -28 37 7 -285 -71 8 185 259 73 23 129 57 191 -57 -296 -153 115 140 26 202 246 26
7369 26 -126 -46 -101 -184 6 -77 18 -88 208 20 -115 -54 -98 -55 -87 28 123 4 300 189 -101 65 -51 51
7393 51 -34 97 -109 186 -71 -113 -63 5 182 98 207 63 -152 -70 95 22 0 -50 96 9 -9 75 227 -114
7417 -114 79 -54 282 45 -144 101 194 31 40 -63 9 90 64 -50 -25 123 223 172 -39 24 -5 -2 7 181 74
7442 74 85 -129 69 97 62 -41 66 110 -51 -40 24 -32 16 65 -15 64 -84 -123 -24 96 17 73 17 -397 -119 -80
7468 -80 -68 -193 -134 23 -222 -83 33 73 48 -85 -19 -60 -7 105 54 -167 -59 5 -165 -203 28 113 -7 98
7492 98 75 -120 109 -97 -59 36 45 -118 -12 -123 -51 -57 -98 -31 -69 100 -213 58 -285 29 146 -36 52 -326
7516 -326 -131 -24 -45 -20 79 138 103 91 -100 -90 203 188 -51 -128 37 -153 100 -104 -61 66 1 73 53 -12 -68
$$ packed form
7346B05k91N8O5l0k92K14P9J77P4j86n0J06p2J34k48k39J43K68K5j14J76M4k20
7369B6j52Q0n5q3J90q3R5j06K96j88j35O1m4M3l2J15R5j19K96j11k90J66j16J02
7393E1q5J31k06K95k57m2N0O8J77q4J09j44k15Q2J65p3k2n0J46q7j8Q4J52l41
7417a14J93j33L36k37j89K45R3j63Rj03P2Q1k6j14K5J48J00n1k11O3k9LRJ74j07
7442G4J1k14J98K8l5j03J07M4j61J1O4n6M8M9q0P9j48l9R9J20p9N6n6m14K78L9
7468h0J2j25N9J57k45J39J16M0k5j33O6m1N3J12n1k21J08O4j70l8K31Q5j20J05
7492I8k3j95K29k06L8R5Rj63J06j11P2om1O7l8J69l13K71l43L14J17j82Q8l78
7516c26J95J07k1K5R9N9l5j2j91J0K93j5k39p7J65j90K53k04M3J27o5P2k0o5n6
$$ plain form
7541 -68 138 -56 -166 -147 215 -88 94 184 87 185 -101 59 -58 -165 -182 90 161 142 31 -177 -90 -53 11 -129
7565 -129 -62 -142 247 -249 96 66 90 424 72 -139 74 -75 45 -110 -136 -143 -98 85 -43 84 45 16 -15 -18
7589 -18 -64 46 71 205 -150 -128 -44 12 -102 -48 127 -83 5 -183 -192 -55 52 -76 -136 98 -53 54 160 195
7613 195 -2 -243 -73 -161 130 -181 133 1 42 -66 -68 45 -123 43 -279 19 -153 29 52 111 -129 -12
7635 -12 174 -160 -57 -90 -165 -20 -32 -14 211 -184 -259 155 -73 -32 -151 46 -135 88 30 148 74 169 190 242
7659 242 -37 199 51 -70 -15 -240 62 -13 144 -117 -5 136 74 -19 -63 152 60 62 -160 -363 108 -71 -135
7682 -135 -190 196 -85 109 -76 -53 -34 142 205 -76 -128 -140 -72 154 -131 -124 7 57 52 -14 -14 98 86 -23 3 49
7708 49 -10 45 -88 -136 -52 159 38 -138 3 204 32 -178 -117 41 135 -62 101 -254 -90 12 110 55 -41
$$ packed form
7541f8K06j94j10J9L62l03J82R0r7R8k86J60j17j07j7K72P1j9j11k08Q7L7O4j40
7565a29O7q0L89m96L45l0K4L34l52k11K13j49J20j55k6pM5J83j28J27l9k9l1l
7589a8m6J10K5J34l55K2Q4N6j14N4J75k10Q8j88rJ37J07j28o0K34j51J07J06L5
7613A95j97k41J70q8K91l11L14j32M1j08kJ13j68J66l22K98j72J82K3N9k40J17
7635a2J86l34J03l3p5J45j2J8K25l95p5M14k28M1j19J97j81K23n8J18p4R5K1N2
7659B42k79K36j48j21N5k25L02p5J57k61J12J41o2r3m4K15r2Kk22k03M71j79o4
7682a35n5L86k81J94j85K3J9J76O3k81n2j2O8K26k85PJ31N0no6%J12j2j09K6M6
7708D9n9N5j33m8Q4K11j21j76J41K01j72k10O1J58R4j97J63l55J64J02R8n5r6
$$ plain form
7731 -41 -128 222 -236 173 -195 -40 7 87 -84 -467 6 4 -14 -260 112 33 80 -90 -188 219 1 163 48
7754 48 74 -104 5 142 82 -276 -52 -53 -184 -9 24 210 199 -54 238 78 40 -74 73 -83 -196 71 -248
7777 -248 -247 45 -102 -151 129 -514 -16 126 50 -137 105 -34 -18 32 160 213 32 128 6 -140 -83 -58 -153 -212
7801 -212 139 -83 -133 65 101 -351 52 -136 132 -10 -23 -23 148 -10 -407 -22 -172 39 -78 55 -49 -226
7823 -226 13 -63 81 99 114 -21 -39 -139 26 -36 -13 -307 43 -141 -74 -64 2 -73 38 130 -160 97 7 -81
7847 -81 28 42 10 -135 -58 101 -75 94 31 -1 87 -13 292 -75 -64 -151 -194 -197 -124 50 -83 -172 -224 -241 -139
7872 -139 32 -127 -22 -116 -137 122 155 -71 -37 -137 56 -72 -94 26 167 -109 -145 101 219 6 113 22
7894 22 95 -137 26 95 -135 65 -25 -4 75 -60 22 -9 -167 56 -255 -178 155 -385 -49 67 196 39 10
$$ packed form
7731d1q7L50m58M09l68J55M7Q0j71l83M73kj8k46L72p9M7j70r8M07k18J62j15
7754D8K6j78J09J37o0l58K24jj31J75L3J86j1k53K92j60l8j14J47j56j13K67l19
7777b48JK92j47m9K80o43M98J42p6j87K42j39J6N0J28N3j81R6j22j46N7K5r5n9
7801b12L51k22n0J98L6m52M03j88K68j42j3%J71j58l97L85j50K11j17J33j04j77
7823b26K39p6J44J8J5j35j8j00J65o2K3k94L50j84O7J0O6p5J11R2k90K57r0q8
7847h1J09J4l2j45P7J59j76J69o3l2Q8j00L05l67J1q7m3lP3J74j33q9n2j7J02
7872a39J71j59J05r4k1K59L3k26L4j00J93j28k2J20J41k76l6K46J18k13J07r1
7894B2P3k32J63O9k30K00r0K1P9j35Q2l1j58K23l11P7L33n40L36J16J29j57k9
$$ plain form
7917 10 -49 -104 105 82 181 209 -4 -14 232 197 -65 81 -57 185 7 117 61 -143 -147 357 17 -132 -150 -63
7941 -63 -77 -17 -95 -233 -47 -149 126 -3 166 190 234 113 -7 -62 -235 170 88 162 -73 -92 -51 -52 -281 -174
7965 -174 -27 83 -36 -193 133 72 -95 -59 9 -65 38 107 138 37 -35 -156 -93 -117 60 -255 -189 -65 -3 -118
7989 -118 74 85 -115 79 8 -144 171 20 -39 -242 -99 63 89 -81 232 -149 95 -85 -25 48 26 241
8011 241 -48 -265 -10 97 174 -20 -175 135 69 144 3 267 -246 147 -87 -59 -180 209 104 25 238 41
8033 41 -53 9 -49 18 -218 -77 52 -79 -183 61 64 -297 -110 272 124 -98 222 27 4 -96 -54 -295 251
8056 251 89 10 -194 28 112 -27 -50 34 -66 57 -212 -196 182 72 108 -32 -175 -212 -60 -59 -63 -220 -85 96
8080 96 -242 113 204 -98 52 -15 -88 -11 52 153 -191 -114 164 131 -134 37 9 69 161 -176 109 -149 63 17
$$ packed form
7917A0n9n5K09k3R9K8k13j0K46l5k62J46j38K42j78J10n6k04mN04l40j49j8Q7
7941f3j4O0p8j38J86j02K75j29J69K4M4j21j20n5j73M05q2P4k35j9M1jk29J07
7965a74J47J10j19j57L26o1j67L6O8p4J03O9L1j01p2j21O3k4J77l15O6J24O2j15
7989a18J92J1k00J94p1j52L15j51n9k03J43J62K6j70L13l81K44j80O0P3k2K15
8011B41k89k17K55J07P7j94j55L10o6P5j41K64n13L93k34K8j21L89j05p9K13j97
8033D1r4O2n8O7k36J41J29j31j04K44Ll61J87L82j48k22L20j95k3j00M2k41N46
8056B51j62p9k04K22Q4j39k3Q4j00J23k69J6L78j10L6j40j43l7J52Jmj57J35J81
8080I6l38L55R1l02J50o7p3P7O3J01l44P7K78l3k65J71k8O0R2l37K85k58K12m6
$$ plain form
8104 17 79 43 92 -71 -28 -14 -91 -310 -61 96 154 -65 59 129 47 14 -24 -35 -234 -26 91 -28 -53 -94 -116
8129 -116 145 60 362 179 -193 -29 173 -171 -80 191 -88 49 183 -95 -31 61 -40 161 170 -90 75 124
8151 124 -208 39 -72 290 0 -69 -160 -86 -35 -57 156 -155 43 -77 82 28 -41 -109 -88 -116 20 110 -27 265
8175 265 379 22 -54 2 84 78 -70 -79 59 29 -16 81 300 319 -84 -47
$$ packed form
8104A7O2l6M9j63M3J4p7k19K49J57N8k19J24P0q2l3l8j1j99K08J17j19k5m1k2
8129a16K61q5L02j83l72J64K02l44R1K71k79J37J34k78O4R2j01K01Rk60J65M9
8151A24l32K47j11L62k90o9r1P4N1k2K13l11J98j20J59n4o9o8K1k8J36R0j37K92
8175B65J14l57p6N6Q2oj48rJ38l0m5R7K19J9m03L7
8191d7
$$ Imaginary data points
##PAGE= N=2
##DATA TABLE= (X++(I..I)), XYDATA
$$ plain form
0 0 0 0 0 0 0 0 0 0 0 0 0 0 -7 8 -8 8 -8 16 -16 16 -24 25 -32 40 -44 49 -58 71 -80 89 -105 119 -136 152 -172
35 -172 192 -216 244 -272 304 -337 375 -415 461 -509 562 -621 685 -753 830 -913 1008 -1109
53 -1109 1225 -1355 1499 -1665 1855 -2078 2341 -2657 3047 -3539 4185 -5073 6375 -8472 12409
68 12409 -22364 101952 137965 -86495 12033 141921 60747 -70263 11409 63940 -5002
79 -5002 -58634 -548 740 -44300 -40434 1192 -6818 -51259 -13641 40756 4058 -28300 33223
92 33223 69987 6171 11516 70098 51857 -11620 38809 76851 -10491 -41775 42210 44490 -69207
105 -69207 -68820 23443 11774 -91434 -79984 16034 -3344 -73662 -59055 19594 9958 -43548
117 -43548 -20570 33839 18146 -17304 13262 30373 12306 -4267 12356 12005 -6385 -4284 -10537
$$ packed form
0@%%%%%%%%%%%%pJ5j6J6j6K4l2L2m0M9n7P2q4R3j07J29j51J69j94K24k55K88l24
35a72L64m08M60n16N76o41P12p90Q76r70J071j183J306j438J583j743J921k117
53a109K334k580K854l164L520l933M419m998N704o586P724r258J1448j4847K0881
68A2409l4773J24316L6013k24460R8528J29888q1174j31010Q1672N2531o8942
79e002n3632N8086J288m5040L866M1626q010m4441L7618N4397l6698l2358O1523
92C3223L6764o3816N345N8582j8241o3477N0429L8042q7342l1284Q3985K280j13697
105f9207L87R2263j1669j03208J1450R6018j9378p0318J4607P8649r636n3506
117d3548K2978N4409j5693l5450L0566J7111j8067j6573J6623l51j8390K101o253
$$ plain form
130 -10537 -16596 -14406 -9886 -32623 -32331 -8441 -10070 -30706 -29895 5869 6325 -13552 -12728 17844
144 17844 24794 4236 875 19138 32616 7335 448 12861 19891 2166 -13512 2478 8289
157 8289 -8709 -24092 -2745 8559 -9550 -25732 -101 26708 -3261 -19133 11468 40228
169 40228 9069 -12918 18956 39951 12197 -9812 16347 22849 4945 -8286 2243 3793
181 3793 -8276 -6869 -8027 -10658 -12424 -2953 -9863 -12589 -1843 1806 -3780 -4904 14647 8451
195 8451 -4112 7284 25971 9710 -9670 11745 26507 5264 -18362 6385 19442 -4845
207 -4845 -19835 -4072 8885 -9560 -16609 -8605 564 -7050 -8669 -5825 -3582 2352 -2990 -2386
221 -2386 910 8580 780 -4170 7543 12587 -1888 -10569 13634 13749 -9051 -14121 12089 13622
$$ packed form
130a0537o059K190M520k2737K92K3890j629k0636Q11L5764M56j9877Q24L0572
144A7844O950k0558l361J8263J3478k5281o887J2413P030j7725j5678J5990N811
157H289j6998j5383K1347J1304j8109j6182K5631K6809k9969j5872L0601K8760
169D0228l1159k1987L1874K0995k7754k2009K6159O502j7904j3231J0529J550
181C793j2069J407j158k631j766R471o910k726J0746L649n586j124J9551o196
195H451j2563J1396J8687j6261j9380K1415J4762k1243k3626K4747J3057k4287
207d845j4990J5763J2957j8445p049Q004R169p614j619K844K243N934n342O04
221b386L296P670p800m950J1713N044j4475q681K4203J15k2800n070K6210J533
$$ plain form
235 13622 -15786 -13752 8433 6742 -16546 -8168 3574 -3895 -10637 -975 111 -16490 -3712
248 -3712 7732 -6212 -20371 1316 12477 -11790 -15523 7066 10288 -16351 -4075 15915 -1552
261 -1552 -17116 9154 24263 -14533 -19329 21272 26185 -23085 -19745 27078 17999 -23500 -15555
274 -15555 23683 5818 -20295 -2050 14059 -8642 -12472 15382 4656 -19178 -1867 28768
286 28768 1040 -24408 10706 32011 -907 -18524 18965 24676 -4791 -4532 22781 10501 -12565
299 -12565 12365 22737 -7791 -17934 22026 20941 -22759 -18362 23397 14927 -28897 -12047 18693
312 18693 3274 -22753 -2668 12790 -10671 -11101 10522 5134 -19572 67 20956 -2407 -20616
325 -20616 6061 23614 -9028 -17142 9287 13883 -13139 -10769 9349 -2238 -15985 -3965 6299
$$ packed form
235A3622k9408K034K2185j691k3288Q378J1742p469o742R662J086j6601J2778
248c712J1444j3944j4159K1687J1161k4267l733K2589L222k6639J2276J9990j7467
261a552j5564K6270J5109l8796m796M0601M913m9270L340M6823r079m1499P945
274a5555L9238j7865k6113J8245J6109k2701l830K7854j0726k3834J7311L0635
286B8768k7728k5448L5114K1305l2918j7617L7489N711k9467K59K7313j2280k3066
299a2565K4930J0372l0528j0143L9960j085m3700M397M1759q470m3824J6850L0740
312A8693j5419k6027K0085J5458k3461m30K1623n388k4706J9639K0889k3363j8209
325b0616K6677J7553l2642q114K6429M596k7022K370K0118j1587j3747J2020J0264
$$ plain form
338 6299 -16794 -17680 4151 497 -22147 -14875 10674 -3224 -19668 -4621 13343 -4947 -12191
351 -12191 9176 11248 -4805 -3919 17606 7934 -7846 3620 16329 1611 -9636 6728 8385
364 8385 -5373 -8487 6682 1296 -11817 -1603 6855 -2289 -10352 5773 9047 -1228 -2615 10769
378 10769 11052 -50 6998 11704 6724 1632 10890 9285 -2842 -500 9162 4902 -11503 -4518
392 -4518 5473 116 -12355 -7668 3537 -1031 -6276 -5003 2661 1381 1835 1819 1710 3937 4497 6281
408 6281 657 691 984 3004 -958 -6243 -6320 -4223 -2330 -10827 -11637 -8321 -3331 -7874 -11007 -4844 -1893
425 -1893 -1033 -2189 2279 925 4209 8694 7818 1904 3229 14303 7085 -3393 -598 9962 1157
440 1157 -11195 -4352 1902 -7265 -15104 -2015 -2030 -13095 -9710 5780 1742 -12361 1094 15813
$$ packed form
338F299k3093q86K1831l654k2644P272K5549j3898j6444J5047J7964j8290p244
351a2191K1367K072j6053Q86K1525r672j5780J1466J2709j4718j1247J6364J657
364H385j3758l114J5169n386j3113J0214Q458r144q063J6125L274j0275j387J3384
378A0769K83j1102P048M706m980n092R258j605j2127K342R662m260j6405O985
392d518R991n357j2471M687J1205m568n245J273P664j280M54j6j09K227N60J784
408F281n624L4K93K020l962n285p7K097J893q497q10L316M990m543l133O163K951
425a893Q60j156M468j354L284M485q76n914J325J1074p218j0478K795J0560q805
440A157j2352O843O254r167p839J3089j5j1065L385J5490m038j4103J3455J4719
$$ plain form
454 15813 6786 -5461 10813 20601 6535 2099 13789 14895 -1039 4314 12051 -224 -10915
467 -10915 2484 7280 -14618 -17195 1153 3161 -19088 -14777 5250 -512 -13053 -2571 10545
480 10545 -2737 -3614 12716 13010 -6063 1518 22700 8190 -11396 889 20135 -127 -16951
493 -16951 -212 8737 -9428 -16030 477 -3722 -15138 -6522 5126 -9231 -15842 7387 11176
506 11176 -9846 -10610 16577 13410 -8107 -2206 16706 8295 -7451 5550 9549 -4556 -6018
519 -6018 9683 1283 -16672 -3584 12049 -3828 -21364 1406 13599 -6463 -14888 6562 12971
532 12971 -7026 -3738 11821 5991 -7514 5879 13515 -4237 -8414 10078 10985 -13032 -8455
545 -8455 10591 3315 -15503 -5729 9237 -4613 -11358 1867 6529 -9223 -4561 11274 2648
$$ packed form
454A5813r027j2247J6274R788j4066m436J1690J106j5934N353P737j2275j0691
467a0915J3399M796k1898k577J8348K008k2249M311K0027n762j2541J0482J3116
480A0545j3282q77J6330K94j9073P581K1182j4510j9586J2285J9246k0262j6824
493a6951J6739Q949j8165o602J6507m199j1416Q616J1648j4357o611K3229L789
506A1176k1022p64K7187l167k1517N901J8912q411j5746J3001L999j4105j462
519f018J5701q400j7955J3088J5633j5877j7536K2770J2193k0062q425K1450O409
532A2971j9997L288J5559n830j3505J3393P636j7752m177J8492R07k4017M577
545h455J9046p276j8818R774J4966j3850o745J3225M662j5752M662J5835q626
$$ plain form
558 2648 -10268 2204 16230 -1619 -10295 7197 14020 -6288 -9573 9943 6194 -10487 -6525
571 -6525 9828 -753 -13173 -951 8518 -4364 -11565 4984 6825 -4993 -5748 8284 5757
584 5757 -4697 2230 8749 2134 -3759 6929 7050 -2732 -1870 7060 4362 -6742 57 5135 -585
599 -585 -6337 1291 3551 -4732 -3880 3615 2260 -7752 -1746 6307 1665 -7014 -2250 7622 1743
614 1743 -5871 -3423 5619 2343 -4628 -4159 1299 2965 -3575 -3668 -1633 1141 -2201 -3166 -1628 -1704 -1753
631 -1753 -1889 -22 -3492 -2912 -486 1117 -2745 -4787 462 1230 -1303 -3865 17 -118 -170 209 -1318
648 -1318 -2281 285 5760 -954 -5018 1766 9439 689 -7802 3308 10808 1266 -7406 4756 9551
663 9551 -805 -4083 5509 6840 -4084 -600 6723 2845 -5705 1515 7948 -708 -4340 2589 6384
$$ packed form
558B648j2916J2472J4026j7849q676J7492O823k0308l285J9516l749j6681L962
571f525J6353j0581j2420J2222R469j2882p201J6549J841j1818p55J4032k527
584E757j0454O927O519o615n893J0688J21r782Q62Q930k698j1104O799N078n720
599e85n752P628K260q283Q52P495j355j0012O006Q053m642q679M764R872n879
614A743p614K448R042l276o971M69N458J666o540r3K035K774l342r65J538p6m9
631a753j36J867l470N80K426J603l862k042N249P68k533k562L882j35n2L79j527
648a318r63K566N475o714m064O784P673q750q491J1110P500r542q672J2162M795
663I551j0356l278R592J331j0924L484P323l878q550P220O433q656l632O929L795
$$ plain form
678 6384 -1594 -1198 3790 1974 -568 3607 4380 -3343 1143 7758 3442 -6815 563 10270 103
693 103 -8149 375 7993 -3788 -8052 958 3076 -7473 -6854 3176 -2448 -9415 -3727 4194 -4254
708 -4254 -9483 208 3976 -3086 -6138 2200 1194 -1289 533 1051 -3230 -624 6130 -1871 -8492
723 -8492 -311 8467 -4512 -12617 367 6700 -6083 -12108 2616 3991 -6664 -5800 5176 1547
737 1547 -6254 3030 8067 -798 -4356 8732 9301 -2996 -1422 9686 6311 -4330 1678 6226
751 6226 -223 -3905 4161 1924 -7491 -657 7500 -1548 -11505 3445 11251 -4022 -9460 7728
765 7728 12689 -5204 -5114 10436 9534 -6079 -908 11344 2230 -6959 1712 8384 -5387 -8128 3530
780 3530 3485 -9155 -6652 5045 -1498 -8421 -1458 5398 -3881 -5503 5688 4645 -5022 -1423 10029
$$ packed form
678F384p978L96M988j816k542M175P73p723M486O615m316j0257P378R707j0167
693A03q252Q524P618j1781m264R010K118j0549O19J0030n624o967N688P921q448
708d254n229R691L768p062l052Q338j006k483J822N18m281K606O754q001o621
723h492Q181Q778j2979q105J2984O333j2783o025J4724J375j0655Q64J0976l629
737A547p801R284N037q865l558J3088N69j2297J574J1108l375j0641O008M548
751F226o449l682Q066k237r415O834Q157r048r957J4950P806j5273n438J7188
765G728M961j7893R0J5550r02j5613N171J2252r114r189Q671O672j3771k741J1658
780C530m5j2640K503J1697o543o923O963O856r279j622J1191j043r667L599J1452
$$ plain form
795 10029 2008 -6820 2203 9409 -1886 -8244 3937 5139 -6683 -7916 4345 851 -10290 -5008
809 -5008 4604 -1182 -9938 -704 5709 -1087 -5502 2742 6009 -392 82 4588 3890 -641 3070 4278
825 4278 -1215 -1565 3146 2258 -5706 -3022 2109 -360 -6576 -3631 1156 -2187 -4022 -1713 1051 -2179
841 -2179 -644 2643 1366 -1228 918 5094 1761 -918 286 4579 2067 -2238 -1310 1165 1907 -2663
857 -2663 -3251 -1835 681 -1832 -3283 -2152 -887 850 -1301 -710 -916 1349 2399 1956 -333 373
873 373 4851 2899 299 -238 3962 2639 -872 426 1703 1112 -665 1752 268 -1557 103 3561
889 3561 308 -3647 1383 4394 904 -3506 1809 4489 -60 -1701 2237 2572 -1869 1216 2574
904 2574 -1046 -3127 2428 3634 -4368 -3468 3197 2892 -5888 -2698 3766 96 -4928 -833 3345 -3213
$$ packed form
795A0029q021q828R023P206j1295o358J2181J202j1822j233J2261l494j1141N282
809e008R612n786q756R234O413o796m415Q244L267o401M74M506o98m531L711J208
825D278n493l50M711q88p964K684N131k469o216K945M787l343j835K309K764l230
841b179J535L287j277k594K146M176l333k679J204M293k512m305R28K475P42m570
857b663n88J416K516k513j451J131J265J737k151N91k06K265J050m43k289P06
873C73M478j952k600n37M200j323l511J298J277n91j777K417j484j825J660L458
889C561l253l955N030L011l490m410N315K680m549j641L938L35m441L085J358
904B574l620k081N555J206q002R00O665l05q780L190O464l670n024M095M178o558
$$ plain form
920 -3213 -3738 2001 1441 -5845 -3015 4328 -869 -7127 -1866 4786 -3244 -6043 657 1946 -4339 -3926
936 -3926 3275 -1269 -5692 687 4970 -3750 -6541 4741 5387 -5294 -5731 6690 3625 -6299 -2610
951 -2610 6519 1287 -6022 2330 5250 -2389 -3991 5864 3760 -5635 -728 7937 2598 -6010 1995
966 1995 7690 365 -3767 4261 5794 -2383 111 5920 1898 -4588 3458 7005 -2540 -4811 5445
981 5445 6958 -5445 -3712 6667 4334 -6411 -2297 6609 159 -5361 500 4998 -3177 -4184
995 -4184 3288 2198 -4652 -2789 4798 -398 -4728 -345 3255 -2257 -4023 1884 549 -3793 -2182
1010 -2182 2912 -2124 -5054 43 2127 -3702 -5451 2166 975 -4545 -3519 3010 169 -4644 -108
1025 -108 2921 -647 -4052 2018 3247 -1494 -2021 2262 2523 -1656 -619 573 576 -888 235 -648 -1842
$$ packed form
920c213n25N739n60p286K830P343n197o258N261O652q030k799O700J289o285M13
936c926P201m544m423O379M283q720k791J1282O46j0681m37J2421l065r924L689
951b610R129n232p309Q352K920p639j602R855k104r395M907Q665n339q608Q005
966A995N695p325m132Q028J533q177K494N809m022o486Q046L547r545k271J0256
981E445J513j2403J733J0379k333j0745M114Q906o450n520N861M498q175j007
995d184P472j090o850J863P587n196m330M383L600n512j766N907j335m342J611
1010b182N094n036k930N097K084n829j749P617j191n520J026O529k841m813M536
1025a08L029l568l405O070J229m741n27M283K61m179J037J192Lj464J123q83j194
$$ plain form
1042 -1842 1131 1167 -1502 -2644 2505 2883 -1193 -1557 3419 3923 -604 1003 3317 2959 298 2250
1058 2250 2750 5 239 2030 1816 -2737 -1265 1576 212 -3089 -2623 318 -419 -1488 -2116 -388
1074 -388 449 1591 495 -1198 1180 3727 2400 -1698 746 3217 2403 -1641 -1396 1800 154 -1803
1090 -1803 -2685 -803 -1827 -2494 -2345 -2160 -2022 -2244 -292 -1126 -883 -921 1247 1900 855 321 1240 4309
1108 4309 2107 -68 287 3561 2226 -1731 -1035 924 647 -2860 -2213 -1192 -1448 -2191 -1178 -1180 -2885
1125 -2885 -39 1116 -55 -1543 1817 3359 264 171 2830 3190 -540 1420 3131 115 -2374 1457
1141 1457 2449 -4087 -3884 1110 1313 -6235 -4683 2386 623 -4984 -2595 3471 -143 -3084 1391 3918
1157 3918 -1097 -691 4680 2660 -2235 145 5558 448 -4135 784 3440 -1675 -4386 1426 882
$$ packed form
1042a842K973L6k669j142N149L78m076l64M976N04m527J607K314l58k661J952
1058B250N00k745K34J791k14m553J472K841j364l301M66K941p37j069o28J728
1074c88Q37J142j096j693K378K547j327m098K444K471q14m044K45L196j646j957
1090a803q82J882j024o67J49J85J38k22J952q34K43l8K168O53j045n34R19L069
1108D309k202k175L55L274j335l957O96J959k77l507O47J021k56p43J013kj705
1125b885K846J155j171j488L360J542l095r3K659L60l730J960J711l016k489L831
1141A457R92o536K03M994K03p548J552P069j763n607K389O066l614k941M475K527
1157C918n015M06N371k020m895K380N413n110m583M919K656n115k711N812n44
$$ plain form
1172 882 -3634 -2359 2511 -1054 -4568 1505 4280 -1794 -3790 4645 4902 -2646 -1741 5749 4090 -3165
1188 -3165 694 4819 878 -3294 1727 3484 -2968 -2660 2712 1403 -5187 -1570 3548 -519 -4952
1203 -4952 82 3897 -1444 -2398 2077 2594 -2331 -357 3667 194 -2759 1073 3539 -2737 -2858 2044
1219 2044 1809 -3955 -2917 2417 -671 -4144 -1296 2301 -2235 -3544 1195 1471 -3313 -2408 3035 589
1235 589 -2990 -526 3174 -179 -2765 1628 1710 -1394 -1399 2421 427 -2436 130 2547 -267 -2713
1251 -2713 1822 1984 -1116 -1608 2439 989 -1937 1082 2462 -96 -1803 2746 2745 -1874 -1332 3373
1267 3373 2765 -2574 -314 3357 1822 -2042 93 2559 60 -602 1117 1547 -1032 381 1982 134
1283 134 -1891 -101 2335 -923 -2108 20 1708 -701 -1521 89 152 -546 -586 254 -1865 -1219 907
$$ packed form
1172H82m516J275M870l565l514O073K775o074j996Q435K57p548R05P490j659p255
1188c165L859M125l941m172N021J757o452L08N372j309o590L617N118m067m433
1203d952N034L815n341r54M475N17m925J974M024l473k953L832K466o276j21M902
1219B044k35n764J038N334l088l473K848L597m536j309M739K76m784R05N443k446
1235E89l579K464L700l353k586M393Q2l104nL820j994k863K566K417k814k446
1251b713M535J62l100m92M047j450k926L019J380k558j707M549jm619N42M705
1267C373o08n339K260L671j535l864K135K466k499o62J719M30k579J413J601j848
1283A34k025J790K436l258j185K128J688k409q20J610O3o98m0Q40k119O46K126
$$ plain form
1300 907 296 -2130 -1915 1647 772 -2338 -2661 1268 958 -2262 -2423 220 1274 -1744 -1351 -420 199
1317 199 -912 -863 86 -370 -825 -31 890 -1142 -1401 -163 1330 -269 -2034 746 1691 159 -1586
1334 -1586 786 1203 -89 363 1042 742 -84 1928 1065 -778 -213 2646 1421 -2273 -96 2987 1210
1351 1210 -2579 268 2794 -165 -2134 928 2702 -1757 -1219 2508 2239 -2432 -693 3778 1262
1366 1262 -2480 -417 4042 477 -2216 522 2224 -845 -1824 1187 -145 -2414 -932 1767 -1925
1381 -1925 -3397 1196 1447 -2709 -2653 2367 1255 -2785 -867 2919 407 -2595 1667 2655 -1376 -2311
1397 -2311 2835 1976 -3485 -2240 2789 1068 -4273 -1630 1761 -436 -3408 -474 1409 -1221 -924
1412 -924 1266 1059 -1417 1155 2950 -156 -750 2411 3027 -1392 -389 2426 969 -2137 -211 2156
$$ packed form
1300I07o11k426K15L562q75l110l23L929l10l220j61K643J054l018L93R31O19
1317A99j111M9R49m56m55P94R21k032k59J238J493j599j765K780R45j532j745
1334a586K372M17j292M52O79l00q26K012q63j843N65K859j225l694K177L083j777
1351A210l789K847K526k959j969L062J774m459N38L727k69m671J739M471k516
1366A262l742K063M459l565k693K738J702l069r79L011j332k269J482K699l692
1381a925j472M593K51m156N6N020j112m040J918L786k512l002M262R88m031r35
1397b311N146q59n461J245N029j721n341K643L391k197k972K934J883k630K97
1412i24K190k07k476K572J795l106n94L161O16m419J003K815j457l106J926K367
$$ plain form
1428 2156 -1303 -2642 251 1030 -3202 -2444 1516 727 -3005 -1452 2972 641 -1755 447 2727 593
1444 593 -180 2148 1683 -315 327 2079 -792 -1509 464 805 -2188 -2190 775 -885 -2682 -1497 966
1461 966 -1523 -2344 1115 1791 -1392 -1408 3284 2443 -737 171 3619 2051 -835 833 2438 750 -937
1478 -937 964 685 -1501 -837 682 -502 -2756 -412 825 -1172 -2167 652 1298 -877 -8 1907
1494 1907 1629 -1 1601 2560 204 44 2167 2295 -1668 -1178 1478 879 -2566 -2434 750 -472 -2560
1511 -2560 -2344 -61 -875 -1213 -581 -65 -1055 141 1209 -540 -367 206 1796 63 -1143 266 974
1528 974 811 -1493 -788 -332 -316 -593 -1293 -1161 -1408 -387 -795 -992 -1342 391 629 -489 -744 718 1928
1547 1928 329 -32 671 2003 1284 12 885 1280 832 79 667 172 -54 27 657 -147 -1703 392
$$ packed form
1428B156l459j339K893P79m232P58L960p89l732J553M424k331k396K202K280k134
1444E93p73K328m65j998O42J752k871p17J973L41k993kK965j660j797J185K463
1461I66k489q21L459O76l183j6M692q41l180R08L448j568k886J668J605j688j687
1478i37J901k79k186O64J519j184k254K344J237j997r95K819O46k175Q69J915
1494A907k78j630J602R59k356j60K123J28l963M90K656n99l445J32L184j222k088
1511b560K16K283q14l38O32N16r90J196J068j749J73N73J590j733j206J409P08
1528I74j63k304P05M56J6k77p00J32k47J021m08j97l50J733K38j118k55J462J210
1547A928j599l61P03J332p19j272Q73L95m48p53N88m95k26Q1O30q04j556K095
$$ plain form
1565 392 1418 -119 -904 920 1905 123 -302 562 1831 127 581 1154 869 -40 837 1415 -361 -578
1583 -578 795 1347 -1528 -1087 689 256 -1615 -956 1016 -876 -1709 139 529 -1389 -1304 1110 190
1600 190 -1903 -847 1305 -359 -2122 -182 1004 -783 -1762 584 495 -1529 -809 1125 -448 -2046
1616 -2046 51 1188 -891 -2042 623 703 -1493 -1388 1136 662 -1464 144 1027 -84 -959 1605
1632 1605 1277 -1512 -368 2020 1125 -2072 -33 2183 312 -1384 692 1851 -414 -616 1178 948
1648 948 -1560 289 2214 -142 -1650 708 2136 -710 -1450 1327 1550 -1124 -845 1961 456 -968
1664 -968 369 1509 -801 -1109 1514 861 -1621 -1079 1814 253 -1787 -537 1522 -799 -1691 683
1680 683 913 -1079 -1257 1553 314 -1933 -355 1549 -206 -2257 634 1264 -720 -1718 627 656 -880
$$ packed form
1565C92J026j537p85J824R85j782m25Q64J269j704M54N73k85r09Q77N78j776k17
1583e78J373N52k875M41J776m33j871O59J972j892q33J848L90j918Q5K414r20
1600A90k093J056K152j664j763J940J186j787r79K346q9k024P20J934j573j598
1616b046K097J137k079j151K665Q0k196J05K524m74k126J608Q83j111q75K564
1632A605l28k789J144K388q95l197K039K216j871j696K076J159k265k02J794k30
1648I48k508J849J925k356j508K358J428k846p40K777K23k674K79K806j505j424
1664i68J337J140k310l08K623o53k482N42K893j561k040J250K059k321q92K374
1680F83K30j992j78K810j239k247J578J904j755k051K891O30j984r98K345K9j536
$$ plain form
1697 -880 -289 1046 430 -1070 557 991 -657 -822 1404 1107 -1193 -510 1341 987 -1011 -65 1222
1714 1222 -101 -641 -85 430 -1166 -70 1030 13 -1315 -64 1737 23 -993 9 1883 489
1730 489 -494 271 623 477 -212 585 -132 -292 86 206 -1011 -1089 122 29 -1111 -1245 80 185 -337
1749 -337 -476 81 235 84 193 182 402 455 1097 342 -262 67 568 459 -886 -780 91 -55 -914 -1255
1769 -1255 -125 -136 -432 -909 96 80 24 194 562 673 233 1430 1081 643 398 1519 1108 40 129
1788 129 786 630 -693 -9 -171 -409 -744 -417 -106 -1242 -427 445 -149 -804 119 1290 250 -164 601
1807 601 1656 424 281 1124 645 -353 -121 812 -571 -1145 -490 226 -1486 -1810 -130 -283 -1836 -1448
1825 -1448 17 -366 -1009 -124 922 147 -539 1305 877 -246 111 1881 438 -757 -182 1027 152
$$ packed form
1697h80N91J335o16j500J627M34j648j65K226k97k300O83J851l54j998R46J287
1714A222j323n40N56N15j596J096J100j017j328J251J801j714j016J002J874j394
1730D89r83P65L52j46o89P97p17j60L78J20j217p8J211r3j140j34J325J05n22
1749c37j39N57J54j51J09j1K20N3O42p55o04L29N01j09j345J06Q71j46q59l41
1769a255J130j1k96m77J005j6n6J70L68J11m40J197l49m38k45J121m11j068Q9
1788A29O57j56j323O84j62k38l35L27L11j136Q15Q72n94o55R23J171j040m14P65
1807F01J055j232j43Q43m79r98K32R33j383n74O55P16j712l24J680j53j553L88
1825a448J465l83o43Q85J046p75o86J844m28j123L57J770j443j195N75J209q75
$$ plain form
1842 152 -1560 146 378 -1017 -1177 199 -131 -1390 -364 973 -105 -1419 923 1657 -184 -343
1858 -343 1494 1739 -415 293 1955 1361 -565 580 1422 -145 -906 657 992 -1520 -1091 890 129
1875 129 -1661 -759 1017 -311 -1058 -95 1106 -492 0 1347 386 -682 360 1875 -209 -1124 512
1892 512 1353 -687 -1335 437 335 -1224 -888 368 -505 -1769 -705 385 -664 -1413 508 730 -610
1909 -610 -765 1082 378 -457 -3 827 177 -378 676 112 -506 -158 650 28 -1139 166 653 -458
1927 -458 -1061 307 1033 -349 -245 499 541 -304 269 737 214 -358 658 939 -401 -51 594 1089 -422
1946 -422 -211 509 698 71 -302 256 -100 195 283 -321 -408 91 675 -424 -619 298 612 -708 -643 329
1966 329 201 -523 -381 307 -146 -115 41 242 -227 -499 341 24 -169 -663 399 139 -506 -657 -303 391
$$ packed form
1842A52j712J706K32j395j60J376l30j259J026J337j078j314K342P34j841j59
1858c43J837K45k154P08J662n94j926J145Q42j567p61J563L35k512M29J981p61
1875A29j790R02J776j328p47R63J201j598M92J347r61j068J042J515k084r15J636
1892E12Q41k040o48J772j02j559L36J256q73j264J064J090j049p49J921K22j340
1909f10j55J847p04q35M54Q30o50n55J054n64o18L48Q08o22j167J305M87j111
1927d58o03J368P26j382J04P44M2q45N73M68n23n72J016K81j340L50O45M95j511
1946d22K11P20J89o27l73N58l56K95Q8o04q7M99N84j099j95R17L14j320O5R72
1966C29j28p24J42O88m53L1J56K01m69k72Q40l17j93m94J062k60o45j51L54O94
$$ plain form
1986 391 -34 -369 -266 -64 -172 -223 -407 -405 467 201 -200 -485 276 688 98 -196 324 648 -79 135 239
2007 239 558 -2 -123 349 -45 -50 -217 644 -61 -318 -346 677 372 -800 119 624 348 -756 -20 480
2027 480 159 -297 -58 716 -204 184 505 162 -380 -74 550 -421 -491 83 452 -424 -201 409 120 -666
2047 -666 -200 845 -468 -662 335 799 -634 -810 562 589 -733 -1190 844 459 -875 -207 858 199
2065 199 -769 261 858 -132 -596 676 606 -733 -356 919 289 -1100 -5 554 -95 -679 561 414
2083 414 -631 -150 721 33 -921 534 1153 -111 -958 729 1338 -387 -499 934 958 -817 -355 760
2101 760 21 -827 -199 697 -825 -1058 328 350 -860 -895 598 212 -785 -279 913 119 -323 483 494
2120 494 -432 -63 1086 -8 -714 -40 798 -310 -1426 -8 290 -742 -956 -72 134 -764 -435 392
$$ packed form
1986C91m25l35J03K02j08n1j84KQ72k66m01k85P61M12n90k94N20L24p27K14J04
2007B39L19n60j21M72l94nj67Q61p05k57k8J023l05j172R19N05k76j104P36N00
2027D80l21m56K39P74r20L88L21l43n42L06O24r71p0N74L69q76K23O10k89p86
2047f66M66J045j313j94R97M64j433j76J372K7j322m57K034l85j334O68J065o59
2065A99r68J030N97r90m64J272p0j339L77J275o30j389J095N59o49n84J240j47
2083D14j045M81Q71o88r54J455O19j264q47J687O09j725j12J433K4j775M62J115
2101G60p39q48O28Q96j522k33J386K2j210l5J493l86r97N06J192p94m42Q06J1
2120D94r26L69J149j094p06O74Q38j108j116J418K98j032k14Q84K06q98L29Q27
$$ plain form
2138 392 240 -493 443 749 70 -235 896 1203 -224 310 1086 884 -69 86 450 2 -147 210 35
2157 35 -507 -91 -3 91 -701 113 849 -267 -498 332 1095 271 251 436 683 142 232 541 -78 -21 407 483
2179 483 -392 -803 -61 -13 -717 -857 -45 -238 -505 -543 -385 -331 -215 46 -293 -389 341 435 91 -397 196 568
2201 568 141 -528 -178 24 -113 -413 -425 -421 -513 -366 -365 -360 -556 -224 41 -266 -355 -45 309 87 95 176 615 460
2225 460 338 510 587 349 -164 182 -136 -121 197 246 -146 -334 369 156 -93 -296 316 148 62 -292 224
2246 224 400 2 174 225 226 61 24 410 -262 -128 131 364 -365 -248 224 71 -274 -334 39 -321 -429 -87
2268 -87 128 -614 -399 267 11 -869 -528 672 19 -460 -293 418 -279 -634 243 60 -278 -185 199 -93
2288 -93 -619 299 138 -91 -597 348 409 -552 -488 -339 147 -391 61 314 241 -350 314 506 -302 -219 568 689
$$ packed form
2138C92j52p33R36L06o79l05J131L07j427N34P76k02r53J55L64m48j49L57j75
2157C5n42M16Q8R4p92Q14P36j116k31Q30P63q24k0J85K47n41R0L09o19N7M28P6
2179D83q75m11P42M8p04j40Q12j93k67l8J58N4J16K61l39r6P30R4l44m88N93L72
2201E68m27o69L50K02j37l00j2Mr2J47JNj96L32K65l07q9L10L54k22QQ1M39j55
2225D60j22J72P7k38n13L46l18J5L18M9l92j88P03k13k49k03O12j68q6l54N16
2246B24J76l98J72N1Jj65l7L86o72J34K59K33p29J17M72j53l45o0L73l60j08L42
2268h7K15p42K15O66k56q80L41J200o53m79J67P11o97l55Q77j83l38R3L84k92
2288i3n26R18j61k29n06R45O1r61O4J49M86n38M52K53p3n91O64J92q08Q3P87J21
$$ plain form
2310 689 -703 143 1012 261 -372 -8 590 -112 -39 84 -100 -139 -167 370 -233 -406 78 506 -329 -514 199
2331 199 508 -415 -341 123 280 32 -404 123 -115 -288 14 122 -420 -475 614 120 -691 -405 380 40
2351 40 -566 81 305 -297 -131 186 44 -423 -122 254 88 -285 183 657 1 -536 295 352 -144 -71 158
2372 158 173 -195 166 416 -174 182 423 507 -290 37 597 574 -392 16 633 175 -124 56 430 -317 -211
2393 -211 111 337 -230 -74 379 -4 -268 -94 911 -1 -542 -105 -166 -86 -429 -8 -132 -292 -187 208
2413 208 -327 -653 95 281 -255 -826 270 221 -151 -559 -30 232 -529 -169 160 259 -356 48 59 44 -23
2434 -23 -11 316 -239 50 133 439 -280 -420 102 146 56 -292 99 12 -31 402 188 21 98 546 308 59 180
2457 180 499 -86 78 290 465 129 -185 189 230 -269 -283 162 -336 -400 -7 126 142 -219 -91 292 129
$$ packed form
2310F89j392Q46Q69p51o33L64N98p02P3J23j84l9k8N37o03j73M84M28q35j85P13
2331A99L09r23P4M64J57k48m36N27k38j73L02J08n42n5J089m94q11K86P85l40
2351D0o06O47K24o02J66L17j42m67L01L76j66l73M68M74o56n37Q31N7m96P3K29
2372A58J5l68L61K50n90L56K41Q4p97L27N60k3r66M08O17m58k99J80L74p47J06
2393b11L22K26n67J56M53l83k64J74J005r12n41M37o1Q0l43M21j24j60J05L95
2413B08n35l26P48J86n36n71J096m9l72m08N29K62p61L60L29R9o15M04J1j5o7
2434b3J2L27n55K89Q3L06p19j40N22M4r0l48L91q7m3M33k14j67P7M48k38k49J21
2457A80L19n85J64K12J75l36l14L74M1m99j4M45m98o4L93J33J6l61J28L83j63
$$ plain form
2478 129 -348 137 460 -84 -94 -42 116 -190 -261 150 -317 -241 -183 87 -532 -581 -109 -124 -430 -742 -109 -241
2500 -241 -401 118 24 -234 -225 112 202 -32 -98 607 267 -304 396 284 -23 -372 168 369 153 -411 -14 -57
2522 -57 -330 -15 159 -21 -338 15 350 144 -238 306 711 186 240 439 451 289 199 445 289 410 286
2543 286 -1 -458 -232 383 252 -360 -76 415 -34 -419 -23 169 -235 -343 59 -34 -264 81 532 -147
2563 -147 -430 24 401 -185 -209 -50 123 -226 -383 211 -371 -264 -54 58 -270 -381 52 -238 -149 -217 294
2584 294 260 -484 63 246 307 -476 -15 255 32 -149 456 296 -336 -80 245 231 -668 -157 572 389 -44
2605 -44 -50 671 53 -8 182 -6 -62 192 94 285 107 -59 535 -111 105 308 317 -118 -174 262 304 -250 -98
2628 -98 374 -233 -523 197 3 -208 -420 283 41 -203 -492 -35 200 -419 -411 108 -64 -343 -137 79 -163
$$ packed form
2478A29m77M85L23n44j0N2J58l06p1M11m67P6N8K70o19m9M72j5l06l12O33j32
2500b41j60N19r4k58RL37R0k34o6P05l40n71P00j12l07l49N40K01k16n64L97m3
2522e7k73L15J74j80l17L53L35k06l82N44M05n25N4J99J2j62r0K46j56J21j24
2543B86k87m57K26O15j31o12K84M91m49l85L96J92m04j08M02r3k30L45M51o79
2563a47k83M54L77n86k4J59J73l49j57N94n82J07K10J12l28j11M33k90Q9o8N11
2584B94l4p44N47J83O1p83M61K70k23j81O05j60o32K56L25j4q99N11P29j83m33
2605d4oP21o18o1J90j88n6K54r8J91j78j66N94o46K16K03Rm35n6M36M2n54J52
2628i8M72o07k90P20j94k11k12P03k42k44k89M57K35o19QN19j72k79K06K16k42
$$ plain form
2649 -163 -138 -158 135 58 -161 139 -147 -211 -307 345 54 -176 -94 120 -89 -154 -148 18 28 114 301 28 91 -19
2673 -19 267 200 -164 342 323 197 -267 336 529 100 201 376 -81 -8 206 186 19 83 26 247 -286 -129
2695 -129 88 -132 -70 -80 96 35 9 56 -241 -89 76 252 -98 -119 12 372 -110 -338 -204 234 -237 -255
2717 -255 -180 -141 57 -228 -140 -178 -231 -133 -67 -141 -107 141 63 -11 -590 34 -59 21 -53 124 88 -76 184 56 57 68
2743 68 308 21 112 156 441 88 -174 57 -27 38 60 41 239 23 115 132 23 -33 30 304 -135 6 -35 462
2767 462 109 89 71 52 88 -120 123 51 -199 -156 -37 -511 -76 59 -169 -461 -530 199 -12 -385 -199 212
2789 212 -299 -53 -109 99 -155 -144 160 -81 111 -182 16 -1 -603 -168 -83 -122 -347 -133 87 -44 -229 -102
2811 -102 -48 -72 184 367 247 291 352 281 106 169 345 551 -11 166 115 166 -70 73 349 -23 -72 110 -27
$$ packed form
2649a63K5k0K93p7k19L00k86o4r6O52k91k30Q2K14k09o5OJ66J0Q6J87k73O3j10
2673a9K86o7l64N06j9j26m64O03J93m29J01J75m57P3K14k0j67O4n7K21n33J57
2695a29K17k20O2j0J76o1k6M7k97J52J65J76l50k1J31L60m82k28J34M38m71j8
2717b55P5L9J98k85Q8l8n3R8O6p4L4K48p8p4n79O24r3Q0p4J77l6j64K60j28JJ1
2743F8K40k87R1M4K85l53k62K31q4O5K2j9J98k16R2J7j09n6O3K74m39J41m1M97
2767D62l53k0j8j9L6k08K43p2k50M3J19m74M35J35k28k92o9P29k11l73J86M11
2789B12n11K46n6K08k54J1L04k41J92k93J98j7o02M35Q5l9k25K14K20j31j85J27
2811a02N4k4K56J83j20M4O1p1j75O3J76K06n62J77n1N1k36J43K76l72m9J82j37
$$ plain form
2834 -27 -196 -157 81 -207 -429 -204 394 94 43 119 304 -23 -136 378 -120 255 -48 233 -39 -224 -90
2855 -90 -119 -194 -757 -23 29 -91 -350 5 -142 -410 -23 185 -30 -339 166 83 -104 35 325 220 2 -254
2877 -254 130 375 -184 -93 125 -53 -78 -129 10 -361 -106 -75 -39 -380 -70 495 -79 -381 131 324 130 -97
2899 -97 380 278 342 22 540 59 13 30 167 -8 -302 194 315 -59 -365 339 6 -333 32 2 96 -79
2921 -79 -1 61 -316 -80 147 126 -201 -133 122 83 -162 195 -6 24 -213 -128 48 -90 3 17 -135 -520 -103
2944 -103 -23 -149 -115 -146 -144 -139 -157 16 141 -92 -370 91 -35 161 110 155 16 -160 282 -7 -73 26 56 85 -156
2969 -156 134 -9 72 -187 -87 57 102 115 206 129 -149 178 215 -108 -104 42 218 342 11 -207 283 146 202
2992 202 74 -95 -88 81 -21 -189 -171 -124 -142 -64 -205 -116 52 -314 -458 -85 -76 -49 -20 91 -43 156 13 17
$$ packed form
2834b7j69L9K38k88k22K25N98l00n1P6J85l27j13N14m98L75l03K81k72j85J34
2855i0k9p5n63P34N2j20k59L55j47k68L87K08k15l09N05q3j87J39K90j05k18k56
2877b54L84K45n59R1K18j78k5n1J39l71K55L1L6l41L10N65n74l02N12J93j94k27
2899i7M77j02O4l20N18m81m6J7J37j75k94M96J21l74l06P04l33l39L65l0R4j75
2921g9P8O2l77K36K27k1l27O8K55l9k45L57k01L0k37Q5J76j38R3J4j52l85M17
2944a03Q0j26L4l1KNj8J73J25k33k78M61j26J96n1M5j39j76M42k89o6R9L0K9k41
2969a56K90j43Q1k59J00J44M5J3R1p7k78L27L7l23MJ46J76J24l31k18M90j37N6
2992B02j28j69PJ69j02j68J8M7j8P8j41Q9J68l66j44L73RK7K9J11j34J99j43M
$$ [...]
8191A76
##END NTUPLES=NMR FID
##END=
