##TITLE=1H_Pr 98-H
 CDCl3, 8 sc, 
 13.2.2019
##JCAMPDX= 6.0         $$ Bruker NMR JCAMP-DX V2.0
##DATA TYPE= NMR FID
##DATA CLASS= NTUPLES
##ORIGIN= UXNMR, Bruker Analytische Messtechnik GmbH
##OWNER= root
$$ XWIN-NMR		Version 3.5
$$ Wed Feb 13 15:51:53 2019 Russian Standard Time (UT+4h)  she@DPX200
##.OBSERVE FREQUENCY= 200.1313
##.OBSERVE NUCLEUS= ^1H
##.DELAY= (6, 6)
##.ACQUISITION MODE= SIMULTANEOUS
##.ACQUISITION SCHEME= undefined
##.AVERAGES= 8
##.DIGITISER RES= 18
##SPECTROMETER/DATA SYSTEM= spect
##.PULSE SEQUENCE= zg30
##.SOLVENT NAME= D2O
##.SHIFT REFERENCE= (INTERNAL, D2O, 0, 15.7039)
##AUDIT TRAIL= $$ (NUMBER, WHEN, WHO, WHERE, WHAT)
$$ ##TITLE= Audit trail, XWIN-NMR		Version 3.5
$$ ##JCAMPDX= 5.01
$$ ##ORIGIN= Bruker BioSpin GmbH
$$ ##OWNER= she
$$ F:/spectra/data/she/nmr/H-F/1/audita.txt
$$ ##AUDIT TRAIL=  $$ (NUMBER, WHEN, WHO, WHERE, WHAT)
(   1,<2019-02-13 15:50:52.65 +0400>,<she>,<DPX200>,
      <created by zg, POWCHK disabled, PULCHK disabled
       configuration hash MD5:
       00 E9 B6 7A A2 85 ED C7 34 08 36 98 17 FE 4E 26
       data hash MD5: 16K
       13 F9 BF AC 85 86 63 C2 4B 5F B8 CA 65 AC 23 C0>)
$$ ##END=
$$ 
$$ hash MD5
$$ A1 E5 5D C7 DC B8 42 97 38 46 48 C7 90 6F 6E 3B
##$RELAX= 
##$RELAX= 
##$RELAX= 
##$RELAX= 
##$RELAX= 
##$RELAX= 
$$ Bruker specific parameters
$$ --------------------------
##$DU= <F:/spectra>
##$EXPNO= 1
##$NAME= <H-F>
##$PROCNO= 1
##$TYPE= <nmr>
##$USER= <she>
##$AMP= (0..31)
100 100 100 100 100 100 100 100 100 100 100 100 100 100 100 100 100 100 
100 100 100 100 100 100 100 100 100 100 100 100 100 100 
##$AQSEQ= 0
##$AQ_mod= 1
##$AUNM= <au_zg>
##$AUTOPOS= <>
##$BF1= 200.13
##$BF2= 200.13
##$BF3= 200.13
##$BF4= 200.13
##$BF5= 200.13
##$BF6= 200.13
##$BF7= 200.13
##$BF8= 200.13
##$BYTORDA= 1
##$CFDGTYP= 0
##$CFRGTYP= 5
##$CHEMSTR= <none>
##$CNST= (0..31)
1 1 145 1 1 1 1 1 1 1 1 1 1 1 1 1 1 1 1 1 1 1 1 1 1 1 1 1 1 1 1 1 
##$CPDPRG= <>
##$CPDPRG1= <>
##$CPDPRG2= <>
##$CPDPRG3= <>
##$CPDPRG4= <mlev>
##$CPDPRG5= <mlev>
##$CPDPRG6= <mlev>
##$CPDPRG7= <mlev>
##$CPDPRG8= <mlev>
##$CPDPRGB= <>
##$CPDPRGT= <>
##$D= (0..31)
0 1.2 0 0 0 0 0 0 0 0 0 0.03 0 0 0 0 0 0 0 0 0 0 0 0 0 0 0 0 0 0 0 0 
##$DATE= 1550058652
##$DBL= (0..7)
120 120 120 120 120 120 120 120 
##$DBP= (0..7)
150 150 150 150 150 150 150 150 
##$DBP07= 0
##$DBPNAM0= <>
##$DBPNAM1= <>
##$DBPNAM2= <>
##$DBPNAM3= <>
##$DBPNAM4= <>
##$DBPNAM5= <>
##$DBPNAM6= <>
##$DBPNAM7= <>
##$DBPOAL= (0..7)
0.5 0.5 0.5 0.5 0.5 0.5 0.5 0.5 
##$DBPOFFS= (0..7)
0 0 0 0 0 0 0 0 
##$DE= 6
##$DECBNUC= <off>
##$DECIM= 32
##$DECNUC= <off>
##$DECSTAT= 4
##$DIGMOD= 1
##$DIGTYP= 9
##$DL= (0..7)
0 120 120 120 120 120 120 120 
##$DP= (0..7)
150 150 150 150 150 150 150 150 
##$DP07= 0
##$DPNAME0= <>
##$DPNAME1= <>
##$DPNAME2= <>
##$DPNAME3= <>
##$DPNAME4= <>
##$DPNAME5= <>
##$DPNAME6= <>
##$DPNAME7= <>
##$DPOAL= (0..7)
0.5 0.5 0.5 0.5 0.5 0.5 0.5 0.5 
##$DPOFFS= (0..7)
0 0 0 0 0 0 0 0 
##$DQDMODE= 0
##$DR= 18
##$DS= 0
##$DSLIST= <SSSSSSSSSSSSSSS>
##$DSPFIRM= 0
$$ [...]
##$SUBNAM2= <"">
##$SUBNAM3= <"">
##$SUBNAM4= <"">
##$SUBNAM5= <"">
##$SUBNAM6= <"">
##$SUBNAM7= <"">
##$SUBNAM8= <"">
##$SUBNAM9= <"">
##$SW= 20.0189088683792
##$SWIBOX= (0..15)
0 0 2 0 0 0 0 0 0 0 0 0 0 0 0 0 
##$SW_h= 4006.41025641026
##$TD= 16384
##$TD0= 1
##$TE= 0
##$TE2= 300
##$TE3= 300
##$TEG= 300
##$TL= (0..7)
0 120 120 120 120 120 120 120 
##$TP= (0..7)
150 150 150 150 150 150 150 150 
##$TP07= 0
##$TPNAME0= <>
##$TPNAME1= <>
##$TPNAME2= <>
##$TPNAME3= <>
##$TPNAME4= <>
##$TPNAME5= <>
##$TPNAME6= <>
##$TPNAME7= <>
##$TPOAL= (0..7)
0.5 0.5 0.5 0.5 0.5 0.5 0.5 0.5 
##$TPOFFS= (0..7)
0 0 0 0 0 0 0 0 
##$TUNHIN= 0
##$TUNHOUT= 0
##$TUNXOUT= 0
##$USERA1= <user>
##$USERA2= <user>
##$USERA3= <user>
##$USERA4= <user>
##$USERA5= <user>
##$V9= 5
##$VALIST= <valist>
##$VCLIST= <CCCCCCCCCCCCCCC>
##$VD= 0
##$VDLIST= <DDDDDDDDDDDDDDD>
##$VPLIST= <PPPPPPPPPPPPPPP>
##$VTLIST= <TTTTTTTTTTTTTTT>
##$WBST= 1024
##$WBSW= 4
##$XGAIN= (0..3)
0 0 0 0 
##$XL= 0
##$YL= 0
##$YMAX_a= 302045
##$YMIN_a= -438661
##$ZGOPTNS= <>
##$ZL1= 120
##$ZL2= 120
##$ZL3= 120
##$ZL4= 120
##$ABSF1= 10
##$ABSF2= 0
##$ABSG= 5
##$ABSL= 3
##$ALPHA= 0
##$AQORDER= 0
##$ASSFAC= 0
##$ASSFACI= 0
##$ASSFACX= 0
##$ASSWID= 0
##$AUNMP= <proc_1d>
##$AZFE= 0.1
##$AZFW= 0.1
##$BCFW= 1
##$BC_mod= 2
##$BYTORDP= 1
##$COROFFS= 0
##$CY= 11.3945322036743
##$DATMOD= 1
##$DC= 2
##$DFILT= <>
##$DTYPP= 0
##$F1P= 18.9103706918063
##$F2P= -1.10871071338519
##$FCOR= 0.5
##$FTSIZE= 0
##$FT_mod= 4
##$GAMMA= 1
##$GB= 0.15
##$INTBC= 1
##$INTSCL= 1
##$ISEN= 128
##$LB= 0.24
##$LEV0= 0
##$LPBIN= 0
##$MAXI= 10000
##$MC2= 0
##$MEAN= 0
##$ME_mod= 0
##$MI= 1.114404
##$NCOEF= 0
##$NC_proc= 0
##$NLEV= 6
##$NOISF1= 3.799351
##$NOISF2= 2.8
##$NSP= 1
##$NTH_PI= 0
##$NZP= 0
##$OFFSET= 15.70392
##$PC= 1
##$PHC0= -9049.833
##$PHC1= 13.60014
##$PH_mod= 1
##$PKNL= yes
##$PPARMOD= 0
##$PSCAL= 0
##$PSIGN= 0
##$REVERSE= no
##$SF= 200.130013532006
##$SI= 16384
##$SIGF1= 3
##$SIGF2= 2
##$SINO= 400
##$SIOLD= 16384
##$SREGLST= <1H.CDCl3>
##$SSB= 0
##$STSI= 0
##$STSR= 0
##$SW_p= 3612.71676300578
##$SYMM= 0
##$S_DEV= 0
##$TDeff= 0
##$TDoff= 0
##$TI= <>
##$TILT= no
##$TM1= 0
##$TM2= 0
##$TOPLEV= 0
##$USERP1= <user>
##$USERP2= <user>
##$USERP3= <user>
##$USERP4= <user>
##$USERP5= <user>
##$WDW= 1
##$XDIM= 8192
##$YMAX_p= 0
##$YMIN_p= 0
$$ End of Bruker specific parameters
$$ ---------------------------------
##NTUPLES= NMR FID
##VAR_NAME=  TIME,          FID/REAL,        FID/IMAG
##SYMBOL=    X,             R,               I
##VAR_TYPE=  INDEPENDENT,   DEPENDENT,       DEPENDENT
##VAR_FORM=  AFFN,          ASDF,            ASDF
##VAR_DIM=   8192,          8192,            8192
##UNITS=     SECONDS,       ARBITRARY UNITS, ARBITRARY UNITS
##FACTOR=    0.0002496,     1,               1
##FIRST=     0,             0,               0
##LAST=      2.0444736,     0,               0
##MIN=       0,             -438661,         0
##MAX=       2.0444736,     302045,          0
$$ Real data points
##PAGE= N=1
##DATA TABLE= (X++(R..R)), XYDATA
$$ [...]
$$ plain form
2329 6529 -4397 -4792 8548 277 -5242 5798 1118 -4450 5217 2450 -1968 7975 1640 -7224
2343 -7224 5336 4275 -7879 2460 6551 -5127 -286 3293 -5557 -464 2467 -6824 1603 7935
2357 7935 -6777 -3835 7565 -4435 -6088 7238 302 -4215 4670 -1046 -4179 4597 -2914 -6613
2371 -6613 7375 2022 -7801 3995 3247 -8485 377 4138 -4162 1997 3837 -5125 2202 5168
2385 5168 -6256 -305 8142 -2260 -70 7283 -2076 -2632 4833 -2446 -1736 6928 -2836 -4305 6680
2400 6680 -1827 -8382 3837 843 -6423 3105 1469 -5175 2170 -1059 -7486 5015 3929 -8472
2414 -8472 2218 7750 -6436 -2160 6304 -3257 -1593 5938 -1553 -88 5255 -4937 -2620 7440
2428 7440 -2552 -4647 7825 589 -6561 3956 1177 -5132 3223 1396 -3528 4809 1153 -6706
$$ packed form
2329F529j0926l95J3340q271n519J1040m680n568R667k767m418R943o335q864
2343g224J2560j061j2154J0339M091j1678M841L579q850N093K931r291Q427O332
2357G935j4712K942J1400j2000j653J3326o936m517Q885n716l133Q776p511l699
2371f613J3988n353r823J1796p48j1732Q862L761q300O159J840q962P327K966
2385E168j1424N951Q447j0402K190P353r359n56P465p279P10Q664r764j469J0985
2400F680q507o555J2219k994p266R528j636o644P345l229o427J2501j086j2401
2414h472J0690N532j4186M276Q464r561J664P531p491J465N343j0192K317J0060
2428G440r992k095J2472p236p150J0517k779o309Q355j827m924Q337l656p859
$$ plain form
2442 -6706 3061 3493 -6147 1682 5148 -4473 601 3789 -5719 -547 4282 -5346 -610 6855 -4489
2457 -4489 -4287 4920 -2997 -4104 5197 -1101 -2966 5061 -1771 -4555 6015 -730 -6427 6804 4253
2472 4253 -6160 2785 4279 -4892 1119 3522 -3703 2662 3753 -5774 1173 4826 -6910 -1789
2486 -1789 6593 -3801 -3490 5020 -2543 -4385 3964 -1788 -3105 4576 -1825 -3489 5851 -486 -5741
2501 -5741 4380 1949 -4925 4355 2752 -5537 2446 2633 -5598 1885 4223 -5328 341 4636 -4353
2516 -4353 -896 3661 -4385 -480 5370 -3823 -1825 5938 -3170 -3613 6406 -723 -4889 4997 1059
2531 1059 -3984 3138 329 -4110 4120 501 -4949 3902 1522 -6908 2480 4256 -5966 -71 4600
2546 4600 -4185 -439 4068 -4037 -340 4573 -3536 -582 5532 -3492 -2541 5982 -2108 -3973 5794
$$ packed form
2442f706R767M32r640P829L466r621N074L188r508N172M829r628M736P465j1344
2457d489K02R207p917j107R301o298j865Q027o832k784J0570o745n697J3231k551
2472D253j0413Q945J494r171O011K403p225O365J091r527O947L653j1736N121
2486a789Q382j0394L11Q510p563j842Q349n752j317P681o401j664R340o337n255
2501e741J0121k431o874R280j603q289P983J87q231P483K338r551N669M295q989
2516d353L457M557q046L905N850r193J998P763r108m43J0019p129m166R886l938
2531A059n043P122k809m439Q230l619n450Q851k380q430R388J776j0222N895M671
2546D600q785L746M507q105L697M913q109K954O114r024R51Q523q090j865R767
$$ plain form
2561 5794 -66 -4793 4071 233 -4770 3436 773 -5155 2801 1381 -5113 2469 2147 -5588 1616
2576 1616 3485 -4829 1510 4624 -4686 -545 5422 -2684 -1178 4562 -2221 -1418 4761 -2131 -2142 4958
2592 4958 -2388 -2984 5633 -1191 -5060 4504 987 -5456 3083 1317 -5072 2146 2546 -4282 1843
2607 1843 1906 -5175 2078 3988 -4954 153 4504 -4487 -534 5256 -3386 -2690 4738 -1753 -2143 4475
2623 4475 -1589 -3026 4258 -426 -3135 4038 -393 -4215 4502 1269 -4609 3076 1913 -4721 2378
2638 2378 3291 -4630 653 3015 -3304 1004 3081 -4363 402 3984 -4121 -1002 4404 -4025 -2339
2653 -2339 5128 -2266 -3592 3705 -1313 -3644 3607 -567 -3486 3467 -120 -3707 4585 853 -4729
2668 -4729 3822 3005 -4359 2160 3708 -3747 1002 4001 -3250 253 3421 -3555 -192 3812 -3404
$$ packed form
2561E794n860m727Q864l838n003Q206k663n928P956j420o494P582l22p735P204
2576A616J869q314O339L114r310M141N967q106J506N740o783Q03O179o892j1P100
2592D958p346n96Q617o824l869R564l517o443Q539j766o389P218M00o828O125
2607A843O3p081P253J910q942N107M351q991L953N790q642O96P428o491l90O618
2623D475o064j437P284m684k709P173m431l822Q717l233n878P685j163o634P099
2638B378R13p921N283K362o319M308K077p444M765L582q105L119N406q429J686
2653b339P467p394j326P297n018k331P251m174k919O953l587l587Q292l732n582
2668d729Q551q17p364O519J548p455M749K999p251L503L168o976L363M004p216
$$ plain form
2683 -3404 -1563 4117 -2959 -2616 4214 -2385 -3537 3990 -512 -4007 3273 459 -3562 3130 1116
2698 1116 -3512 2738 1186 -3737 2601 1796 -4638 1879 3204 -4783 184 3486 -3727 -981 3923
2713 3923 -2755 -1015 3433 -2394 -609 4103 -1964 -1597 5277 -952 -2548 4919 185 -3558 3723
2728 3723 953 -3545 2436 1069 -4036 1894 967 -4797 1307 1632 -5008 338 2528 -4281 -318
2743 -318 3045 -3226 -595 4077 -2354 -911 4233 -1762 -1684 4609 -813 -2087 4124 -214 -2591 3360
2759 3360 -480 -3266 3337 437 -4169 2701 1563 -4395 1111 2151 -3792 826 2561 -2625 1021
2774 1021 2702 -3447 761 3911 -3380 -650 4393 -2299 -2404 3398 -1779 -2896 2345 -1148 -2206
2789 -2206 2846 -1549 -3612 3001 -396 -3786 3372 1460 -3586 2316 2333 -3209 1960 2445 -2689 2340
$$ packed form
2683c404J841N680p076L43O830o599j152P527m502l495P280k814m021O692k014
2698A116m628O250j552m923O338q05o434O517J325p987M967L302p213K746M904
2713C923o678J740M448n827J785M712o067L67O874o229j596P467m734l743P281
2728C723k770m498N981j367n105N930r27n764O104L25o640N346K190o809L963
2743c18L363o271K631M672o431J443N144n995P8O293n422j274O211m338k377N951
2759C360l840k786O603k900m606O870j138n958N506J040n943M618J735n186L646
2774A021J681o149M208L150p291K730N043o692j05N802n177j117N241l493j058
2789b206N052m395k063O613l397l390P158j912n046N902J7n542N169M85n134N029
$$ plain form
2805 2340 3718 -3349 621 3553 -3200 -794 3644 -2425 -1616 3084 -2489 -2281 2593 -2580 -2733 4085
2821 4085 -772 -3374 2856 357 -3561 2206 1262 -2547 2432 1153 -2877 2170 1266 -4218 1648
2836 1648 3151 -3283 -266 2871 -2563 -887 2064 -1903 -180 2807 -2523 -570 3766 -2187 -2324
2851 -2324 3957 -229 -2361 3630 648 -2205 2360 -314 -2529 3080 177 -3386 2637 1333 -4543
2866 -4543 352 2198 -3400 -66 2093 -2269 507 1814 -3477 32 3868 -2587 -708 4474 -1154
2881 -1154 -2207 2928 -673 -2125 2709 -536 -1502 3208 -851 -3371 2794 404 -3764 2179 2286
2896 2286 -2832 729 1213 -2640 1090 1359 -2634 1500 2770 -3216 -65 3328 -2535 -1438 3038
2911 3038 -780 -878 2246 -1922 -1314 2719 -1859 -1917 3750 -213 -2985 2670 540 -3273 1345 1096
$$ packed form
2805B340J378p067L970K932o753K406M438o069Q09M700n573K08M874n173j53O818
2821D085m857k602O230k499l918N767r44l809M979j279m030N047r04n484N866
2836A648J503o434L017L137n434J676K951l967J723K987n330J953M336n953j37
2851b324O281m186k132N991k982k853M565k674k215N609k903l563O023j304n876
2866d543M895J846n598L334K159m362K776J307n291L509L836o455J879N182n628
2881a154j053N135l601j452M834l245r66M710m059k520O165k390m168N943J07
2896B286n118L561M84l853L730K69l993M134J270n986L151L393n863J097M476
2911C038l818r8L124m168O08M033m578n8N667l963k772N655k130l813M618k49
$$ plain form
2927 1096 -1861 2419 658 -2867 1828 1261 -3961 1019 3153 -2673 -481 3026 -1930 -1190 1702
2942 1702 -1917 -139 3148 -2111 -978 3211 -1675 -2828 3080 352 -2580 2251 376 -2000 1815
2957 1815 -192 -2867 2379 968 -2931 1785 2101 -3466 248 2252 -1887 652 2056 -1933 724
2972 724 2157 -2870 -316 3414 -2029 -1183 3446 -947 -2454 1623 -879 -1453 2039 -793 -1765 2908
2988 2908 -667 -3451 2398 704 -3307 1771 2048 -2158 670 1141 -1943 1033 1830 -2268 1371 2969
3004 2969 -2731 -528 2763 -1884 -1347 2742 -540 -1322 2055 -1235 -2058 2228 -1268 -2191 2827 335
3020 335 -2539 1673 522 -2398 1541 1038 -1868 1804 1063 -2482 915 1690 -2585 377 2522 -2241
3036 -2241 -627 1593 -1883 -697 1599 -1919 -253 2800 -1788 -1370 3099 -846 -1999 2655 673
$$ packed form
2927A096k957M280j761l525M695n67n222M980K134n826K192L507m956P40K892
2942A702l619J778L287n259J133M189m886j153N908k728k932M831j875k376L815
2957A815k007k675N246j411l899M716L16n567L714K004m139K539J404l989K657
2972G24J433n027K554L730n443Q46M629m393j507M077k502n74L492k832r72M673
2988B908l575k784N849j694m011N078K77m206K828M71l084K976P97m098L639J598
3004B969n700K203L291m647N37M089l282p82L377l290q23M286l496r23N018k492
3020C35k874M212j151k920L939n03k906L672p41l545L397P75m275K962K145m763
3036b241J614K220l476J186K296l518J666L053m588M18M469l945j153M654j982
$$ plain form
3051 673 -1643 2215 610 -1554 1876 193 -2110 2071 1193 -2955 966 1285 -2996 223 1745 -2221
3067 -2221 -315 1850 -1827 -556 1608 -1966 -611 2469 -1215 -828 2710 -887 -1551 2255 -229
3082 -229 -1261 2388 -170 -1949 2372 204 -2638 1538 792 -2016 1241 1148 -2175 1029 1039 -2531
3098 -2531 778 1808 -2438 214 2689 -1849 -835 2370 -1038 -1292 1871 -782 -1016 1786 -1324
3113 -1324 -1664 2192 -761 -2250 1861 94 -2381 1274 408 -2206 846 718 -1636 1107 1114 -1838
3129 -1838 1120 1745 -1748 758 2121 -1650 210 2393 -1439 -643 1948 -1372 -917 2090 -1242 -1593
3145 -1593 2055 -884 -1859 1792 -283 -1783 1935 -43 -2344 1834 836 -2294 1169 1419 -2344 492
3161 492 1449 -2091 -32 1231 -1505 -15 1462 -1478 -329 1885 -1537 -604 1958 -1079 -1428 2185
$$ packed form
3051F73k316L858j605k164L430j683k303M181q78m148L921L19m281L219J522l966
3067b221J906K165l677J271K164l574J355L080l684L87L538l597o64L806k484
3082b29j032L649k558j779M321k168k842M176p46k808L257r3l323L204J0l570
3098b531L309J030m246K652K475m538J014L205l408k54L163k653k34K802l110
3113a324l40L856k953j489M111j767k475L655q66k614L052j28k354K743Pk952
3129a838K958O25l493K506J363l771J860K183l832P96K591l320M55L007l332l51
3145a593L648k939r75L651k075j500L718j978k301M178r98l130L463K50l763K836
3161D92R57l540K059J263k736J490J477k940J149K214l422R33K562l037l49L613
$$ plain form
3177 2185 -245 -1329 1880 -170 -1185 1935 -97 -1499 1580 315 -1622 1498 820 -2270 1056
3192 1056 1177 -2371 543 1615 -2104 -315 1430 -1735 -564 1125 -2083 -648 1897 -1286 -1068
3207 -1068 1668 -957 -1115 2198 -189 -1756 2154 417 -1832 1563 805 -1771 1290 491 -1755 997
3223 997 602 -1919 999 1240 -2216 281 1615 -2158 -260 1633 -1525 -425 1767 -1019 -564 1687
3239 1687 -1245 -814 1911 -964 -1232 1865 -265 -1677 1627 70 -1849 1232 481 -1681 822 706
3255 706 -2000 690 864 -1718 717 1431 -1918 424 1834 -1537 191 2188 -1199 -228 2267 -1053
3271 -1053 -761 2041 -503 -1002 1572 -460 -1389 1674 -487 -1850 1352 -110 -2002 1196 608 -1677
3287 -1677 639 860 -1922 420 1113 -1611 584 1330 -1376 638 1718 -1506 -204 1829 -1090 -850
$$ packed form
3177B185k430j084L209k050j015L120k032j402L079j265j937L120o78l090L326
3192A056J21l548K914J072l719J789J745l165J171J689l208J435K545l183K18
3207a068K736k625j58L313k387j567L910j737k249L395p58k576L061p99k246K752
3223I97l95k521K918K41l456K497J334l773J898J893l158J100K192k786M55K251
3239A687k932M31K725k875k68L097k130j412L304j557j919L081p51k162K503j16
3255G06k706K690J74k582K435P14l349K342J410l371J728J997l387R71K495l320
3271a053K92K802k544m99K574k032r29L063k161j363L202j462j892L198n88k285
3287a677K316K21k782K342O93k724K195P46k706K014J080l224J302K033k919K40
$$ plain form
3303 -850 1864 -798 -953 1704 -687 -1090 1498 -368 -1307 1318 -318 -1672 1346 398 -1761 1398
3319 1398 925 -1442 1111 918 -1642 400 1215 -1630 119 1545 -1495 -498 1256 -1332 -467 1381
3335 1381 -1103 -635 1717 -1131 -1222 1751 -139 -1537 1760 324 -1411 1304 458 -1051 1567 686
3351 686 -1385 1373 642 -1838 915 1044 -1973 111 1358 -1416 -382 1121 -1211 -230 1134 -1279
3367 -1279 -639 1905 -1117 -803 1853 -472 -1420 1482 -253 -963 1216 -85 -1496 966 338 -1764
3383 -1764 1212 437 -1787 742 943 -1688 484 783 -1388 445 1380 -1478 30 1631 -1561 -605
3399 -605 1879 -775 -757 1704 -541 -666 1026 -711 -1046 1581 -130 -1317 1512 121 -1920 793
3415 793 866 -1273 633 781 -1106 606 491 -1591 561 1275 -1466 126 1422 -1132 -589 1349 -767
$$ packed form
3303h50K714k662j55K657k391m03K588j866r39K625j636j354L018r48k159L159
3319A398m73k367K553j93k560K042Q15k845J749J426l040R97J754k588Q65J848
3335A381k484M68K352k848r1K973j890j398L297j436j735K715q46j509K618q81
3351F86k071K758p31k480K753J29l017K084J247k774J034J503k332R81J364k413
3367a279O40K544l022L14K656k325r48K902j735p10K179j301j411K462o28k102
3383a764K976p75k224K529K01k631K172K99k171J833R35k858J508J601l192R56
3399f05K484k654J8K461k245j25J692j737l35K627j711j187K829j391k041K713
3415G93P3k139J906J48j887J712j15k082K152P14k741J592J296k554N43J938k116
$$ plain form
3432 -767 -425 1100 -736 -478 1433 -851 -1086 1527 -436 -1340 1372 293 -1181 878 -205 -1407
3448 -1407 980 277 -1241 1064 951 -1862 431 1217 -1277 88 1397 -919 -115 1183 -1069 -108
3464 -108 1517 -999 -330 2003 -592 -1161 1254 -380 -1076 1110 117 -881 1048 -154 -1163 1157
3480 1157 -188 -1437 952 887 -1554 487 961 -1364 -113 854 -1026 252 1353 -1341 97 1607
3496 1607 -1060 -677 1523 -312 -926 1052 -447 -819 1135 -701 -893 1549 -47 -1317 1187 232
3512 232 -1619 589 730 -994 786 683 -975 611 714 -1500 258 1069 -1380 -330 1117 -1101
3528 -1101 -590 900 -791 -648 1122 -760 -603 1163 -641 -1404 1200 48 -989 1074 582 -1042
3544 -1042 693 224 -870 1047 606 -957 1152 833 -1247 266 811 -1114 -88 1047 -859 -243
$$ packed form
3432g67L42J525j836K58J911k284k35K613j963r04K712j079j474K059j083j202
3448a407K387p03j518K305j13k813K293P86k494J365J309k316Q04J298k252R61
3464a08J625k516O69K333k595n69K415j634o96K186r93r98J929j202j009K320
3480A157j345j249K389o5k441K041M74k325J251R67j880J278J101k694J438J510
3496A607k667L83K200j835o14J978j499l72J954j836j92K442j596j270K504r55
3512B32j851K208J41j724J780j03j658J586J03k214J758Q11k449J050J447k218
3528a101N11J490j691J43J770j882J57J766j804p63K604j152j037K063m92j624
3544a042J735m69j094J917m41j563K109l19k080J513N45j925J026J135j906O16
$$ plain form
3560 -243 592 -883 -142 1166 -1058 -658 1670 -161 -1048 971 131 -988 829 187 -691 807 47
3577 47 -1030 904 60 -1405 699 765 -1347 196 698 -1465 24 556 -1041 105 1384 -903 -161
3594 -161 1078 -752 -434 1261 -292 -297 900 -289 -655 1248 -206 -895 1184 -119 -1311 690 146
3611 146 -1238 312 542 -1198 491 549 -1150 483 524 -1234 274 1290 -1003 25 1304 -635
3627 -635 -468 844 -484 -258 985 -651 -655 1114 -646 -1052 1115 114 -869 1079 480 -936 844
3644 844 275 -1093 689 691 -966 565 799 -1050 321 1141 -856 -64 690 -1118 -384 587 -991 -689
3662 -689 854 -534 -794 968 -345 -855 810 -228 -552 946 232 -917 972 68 -1128 902
3678 902 722 -830 352 861 -879 190 602 -1039 316 838 -1010 -109 814 -725 -269 898 -858
$$ packed form
3560b43Q35j475P41J308k224M00K328j831q87K019q40j119J817o42q78J498p60
3577D7j077J934q44j465K104O6k112J543N02k163J489N32j597J146J279k287P42
3594a61J239j830L18J695j553nJ197j189l66J903j454o89K079j303j192K001n44
3611A46j384J550K30j740J689N8j699J633M1j758J508J016k293J028J279j939
3627f35J67J312j328K26J243j636mJ769j760m06K167j001r83J948n99j416J780
3644H44n69j368J782Kj657J531K34j849J371Q20j997P92P54j808P34R71j578L02
3662f89J543j388k60J762j313n10J665j038l24J498p14j149J889r04j196K030
3678I02j80j552J182N09j740J069M12j641J355N22j848R01R23j539M56J167j756
$$ plain form
3695 -858 -350 1081 -437 -575 956 -254 -795 917 -205 -945 678 202 -1075 745 200 -1034 297
3712 297 273 -889 466 616 -901 70 833 -876 55 1047 -612 -133 1017 -641 -33 1030 -63
3729 -63 -211 993 -147 -543 1220 -128 -792 653 -101 -615 482 -45 -594 675 473 -839 205
3746 205 472 -909 336 719 -901 82 742 -825 -111 890 -520 -177 656 -523 -263 861 -320
3763 -320 -597 934 2 -621 902 -179 -870 780 375 -768 603 325 -860 479 432 -1004 388
3780 388 620 -795 434 551 -768 48 729 -763 -336 1051 -444 -315 765 -386 -408 874 -129
3797 -129 -420 572 -123 -493 496 -71 -825 742 296 -1048 751 412 -680 536 533 -875 267 785
3815 785 -530 207 799 -674 -1 757 -560 -448 881 -579 -371 777 -530 -463 865 -459 -307
$$ packed form
3695h58N08J431j518j38J531j210n41J712j122p40J623m76j277J820n45j234J331
3712B97k4j162J355J50j517R71P63j709R31R92j659M79J150j658O08J063j093
3729f3j48J204j140l96J763j348o64J445p54n14J097n27n49J269k02j312J044
3746B05K67j381J245L83j620R83O60j567P14J001j410L43Q33j179K60J124j181
3763c20k77J531r32o23J523j081o91J650m05j143J371k78j185J339m7j436J392
3780C88K32j415J229J17j319Q16O81j492M27J387j495J29J080j151k2J282j003
3797a29k91R92o95l70R89n67p54J567m46j344J799l39j092J216lj408J142N18
3815G85j315P37N92j473O73P58j317J12J329j460K08J148j307O7J328j324J52
$$ plain form
3832 -307 592 -121 -746 585 -80 -846 724 -27 -644 485 573 -709 395 565 -595 -85 504 -736
3850 -736 -100 550 -605 -284 655 -467 -148 697 -402 -524 644 -107 -505 679 8 -761 219 125 -512
3869 -512 507 51 -752 554 114 -752 433 507 -658 183 599 -605 -7 494 -597 -164 615 -350
3887 -350 -100 696 -501 -91 693 -780 -364 648 -254 -523 742 -16 -510 690 167 -783 368 143
3905 143 -689 334 353 -657 98 117 -757 355 459 -670 81 713 -635 -308 688 -293 -216 758 -437
3924 -437 -143 648 -148 -331 421 -113 -598 340 113 -616 704 -16 -507 615 313 -787 473 222 -706
3943 -706 193 545 -641 -32 676 -696 -241 497 -401 -364 740 -277 -194 582 -358 -511 677 -63 -506
3962 -506 679 57 -652 666 21 -588 314 186 -535 358 373 -526 313 308 -248 89 548 -401 -82 457
$$ packed form
3832c07Q99p13o25J331o65p66J570p51o17J129Q8j282J104J70j160N10N89j240
3850g36O36O50j155L21R39j122L19Q45j099j22J168p51l98J184o71p69R80r4o37
3869e12J019m56q03J306m40q66J185P4j165Q41M16j204N98N01j091M33P79r65
3887c50K50P96j197M10P84j473M16J012r02k69J265p58m94J200n23r50J151k25
3905A43q32J023J9j010P55J9q74J112J04j129P51O32j348L27R96r81P7R74j195
3924d37K94P91p96j83P52n34m85R38k27p29J320p20m91J122l02j100J260k51r28
3943g06Q99L52j186O09P08j372M55P38q98L7J104j017Q3P76r40j53J188p40m43
3962e06J185o22p09J318o45o09R02j28p21Q93J5q99Q39nn56L37M59r49L19N39
$$ plain form
3982 457 -467 -53 303 -584 -203 948 -252 -432 688 -23 -404 533 -203 -340 346 -80 -555 500 -2
4001 -2 -550 500 235 -586 127 513 -619 286 327 -574 148 442 -196 280 617 -423 -217 412 -334 -269
4021 -269 466 -157 -144 603 -258 -359 429 -195 -510 545 65 -526 68 94 -537 292 270 -536 352 406 -684
4042 -684 18 276 -443 198 399 -314 -408 396 -260 -489 335 -252 33 487 -286 -447 493 -17 -357 428
4062 428 64 -525 433 431 -608 297 -144 -465 394 438 -719 183 359 -558 -32 335 -427 -49 450 -323
4082 -323 -167 442 -88 -391 676 -244 -257 184 -65 -300 205 8 -364 341 -114 -376 165 119 -371 116
4102 116 142 -240 56 452 -373 -15 157 -379 -21 342 -249 -91 629 -348 -415 240 117 -201 310 -198 -139
4123 -139 278 -521 -400 481 -69 -447 165 169 -486 116 157 -549 340 178 -346 401 296 -300 -174 557 -484
$$ packed form
3982D57r24M14L56q87L81J151j200j80J120p11l81R37p36j37O86m26m75J055n02
4001bn48J050k65q21P13L86j132R05M1r01P22K94o38M76L37j040K06O29p46O5
4021b69P35o23J3P47q61j01P88o24l15J055m80n91N94K6o31Q29k2q06Q88N4j090
4042f84P02K58p19O41K01p13r4Q04o56k29Q24n87K85M54p73j61R40n10l40P85
4062D28l64n89R58kj039R05m41l21Q59M4j157R02J76r17N26L67p62L78M99p73
4082c23J56O09n30l03J067r20j3M41k49k35N05j97l72P05m55k62N41m6m90M87
4102A16K6l82K96L96q25L58J72n36L58L63n91J58P20r77o7O55j23l18N11n08N9
4123a39M17p99J21Q81n50l78O12Mo55O02M1p06Q89j62n24P47j05n96J26P31j041
$$ plain form
4144 -484 -73 377 -93 -179 396 -109 -74 465 -282 -282 483 153 -437 435 -158 -599 201 245 -244 96 125 -315
4166 -315 12 362 -477 164 180 -110 205 98 -382 64 342 -236 77 301 -246 -49 442 -297 -145 329
4186 329 -169 -279 549 -164 -439 150 -37 -190 209 278 -322 182 459 -184 -27 129 -353 106 236 -270
4206 -270 44 313 -146 -76 386 -439 -51 338 -185 -19 97 33 -65 371 -111 -136 167 -46 -471 226 42
4227 42 -315 313 103 -361 88 67 -164 129 246 -108 230 310 -284 59 347 -176 -71 333 -283 36 107
4248 107 -219 33 476 -9 -387 392 15 -579 206 -37 -213 196 -58 -470 361 244 -123 9 114 -305
4268 -305 214 343 -441 47 327 -272 -2 441 -422 55 111 -299 -233 202 -345 -116 462 -72 -6 152 -27
4289 -27 -64 283 198 -254 264 216 -446 331 73 -106 -10 102 -276 -301 274 -372 352 123 -219 -312 80 -403
$$ packed form
4144d84M11M50m70q6N75n05L5N39p47%P65l30n90Q72n93m41Q00M4m89L40K9m40
4166c15L27L50q39O41J6k90L15j07m80M46K78n78L13K24n47J97M91p39J52M74
4186C29m98j10Q28p13k75N89j87j53L99O9o00N04K77o43J57J56m82M59J30n06
4206b70L14K69m59P0M62q25L88L89n23J66J16o4r8M36m82k5L03k13m25O97j84
4227D2l57O28k10m64M49k1k31K93J17l54L38Q0n94L43K88n23J05M04o16L19P1
4248A07l26K52M43m85l78P79l77n94P85k43j76M09k54m12Q31j17l67J32J05m19
4268c05N19J29p84M88K80n99K70M43q63M77N6m10O6M35n47K29N78n34O6J58j79
4289b7l7L47q5m52N18m8o62P77k58j79R6J12l78k5N75o46P24k29l42r3L92m83
$$ plain form
4311 -403 -47 322 -38 -110 152 -85 -186 292 -115 -485 390 -85 -111 145 241 -258 10 29 -222 -6 91 -453
4333 -453 -6 116 -236 -67 328 -275 -93 377 -189 -79 482 73 -117 191 -121 -441 262 -199 -499 146
4353 146 128 -174 174 -83 -232 274 31 -213 188 212 -283 174 79 -102 17 272 -215 -142 267 -383 -50
4374 -50 57 -342 -17 74 -209 -290 355 184 -512 209 99 -284 264 -63 -305 7 -60 -63 202 42 -232 44
4396 44 96 -51 156 234 -158 96 294 -335 -113 158 -200 14 403 87 42 384 80 -69 410 -37 98
4417 98 -1 -25 -458 61 159 -222 259 12 -304 300 289 -248 283 -171 -289 31 341 -292 49 199 -342 -310
4439 -310 567 12 -286 110 -12 -198 367 182 -106 248 -254 -153 221 125 -277 56 179 -318 185 264 -361
4460 -361 -173 52 -109 -40 225 -90 41 199 -93 -304 369 132 -75 498 -142 -111 293 -110 -412 -61 22
$$ packed form
4311d03L56L69l60p2K62k37j01M78m07l70Q75m75k6K56R6m99K68J9k51K16R7n44
4333d53M47J22l52J69L95o03J82M70n66J10N61m09j90L08l12l20P03m61l00O45
4353A46j8l02L48k57j49N06k43k44M01K4m95M57r5j81J19K55m87P3M09o50L33
4374e0J07l99L25R1k83q1O45j71o96P21j10l83N48l27k42L12o7lK65j60k74K76
4396D4N2j47K07P8l92K54J98o29K22K71l58K14L89l16m5L42l04j49M79m47J35
4417I8r9k4m33N19R8l81M81k47l16O04j1n37N31m54j18L20L10o33L41J50n41L2
4439c10Q77n55k98L96j22j86N65j85k88L54n02J01L74r6m02L33J23m97N03P9o25
4460c61J88K25j61O9K65l15J31J58k92k11O73k37k07N73o40L1M04m03l02L51Q3
$$ plain form
4481 22 -157 71 114 -195 44 -169 -125 59 193 -55 291 -49 -322 -115 269 -215 -150 262 -286 -118 99
4502 99 45 -221 517 -122 -275 228 -289 -231 102 22 -255 235 12 -117 218 -59 -323 24 103 -120 137 -107
4524 -107 -215 309 293 90 68 -9 -122 -48 64 -130 -187 376 -390 -75 200 0 -147 178 93 -325 192 -18
4546 -18 -232 200 -147 9 56 -26 -387 -28 346 -74 141 106 -19 57 87 -99 -155 319 13 -123 309 83
4568 83 18 58 168 -223 312 120 -96 256 53 -363 101 101 -333 176 93 3 6 -6 -265 92 -46 -147 225
4591 225 165 -302 -101 132 -106 -225 142 -71 -74 189 -174 -184 141 -106 -7 -83 -100 -274 239 226 -237 -13 82
4614 82 -265 34 38 -178 119 99 106 27 118 -20 40 68 -183 96 268 -55 -14 162 -119 41 173 48 -51 -54 -41
4639 -41 -145 122 148 200 105 -286 -226 244 109 -486 134 165 1 9 -289 -102 -98 440 -86 133 165 -145 38 -26
$$ packed form
4481B2j79K28M3l09K39k13M4J84J34k48L46l40k73K07L84m84O5M12n48J68K17
4502I9n4k66P38o39j53N03n17N8L33q0k77M90k23j29L35k77k64L47P9k23K57k44
4524a07j08N24j6k03k2p7j13P4J12j94n7N63p66L15K75k00j47L25q5m18N17k10
4546a8k14M32l47J56M7q2l61L59L74m20K15l5j25P6L0j86n6M74l06j36M32k26
4568H3o5M0J10l91N35j92k16L52k03m16M64%m34N09q3r0Lj2k59L57j38j01L72
4591B25o0m67K01K33k38j19L67k13lK63l63j0L25k47R9p6j7j74N13j3m63K24R5
4614H2l47K99Mk16K97k0Pp9R1j38O0K8k51K79J72l23M1J76k81J60J32j25r9lJ3
4639d1j04K67K6N2r5l91O0M70j35n95O20L1j64Qk98J87MN38n26K19L2l10J83o4
$$ plain form
4663 -26 153 -113 188 -85 -123 198 223 74 24 73 -357 -49 -66 54 163 49 16 -120 60 -158 91 115 -280
4686 -280 75 235 -154 20 87 -367 -73 -80 19 -149 45 115 84 -129 53 -231 88 137 -199 -66 -54 -225 -81
4709 -81 249 -256 55 -51 52 -42 44 -4 69 273 -120 -90 277 -122 -19 277 -11 -171 295 3 -4 15 -208
4732 -208 -239 10 -57 -352 139 87 -236 99 157 -259 -97 -103 -192 150 384 -100 54 273 -1 -90 -99 -50 -42 258
4756 258 73 -25 301 90 -296 -75 19 -244 -154 -229 -152 44 -36 -229 150 -166 -35 94 281 -161 28 143
4778 143 -190 190 173 -57 -110 113 -365 -260 115 213 -261 83 -165 149 -91 238 -150 208 -37 -46 287 -62
4800 -62 -293 6 135 -191 163 83 -261 55 315 -179 -53 184 -157 -150 234 -108 -100 -43 -62 -135 184 -233 -66
4823 -66 94 55 -124 75 -17 61 267 30 -194 321 -66 54 -67 160 -280 -130 218 -230 -115 68 121 63
$$ packed form
4663b6J79k66L01k73l8L21K5j49n0M9m30L08j7J20J09j14l3j36J80k18K49K4l95
4686b80L55J60l89J74O7m54K94pR9j68J94P0l1k13J82k84L19M9l36J33J2j71J44
4709h1L30n05L11j06J03r4Q6m8P3K04l93L0L67l99J03K96k88j60M66k92pJ9k23
4732b08l1K49o7k95M91n2l23L35N8m16J62oq9L42K34m84J54K19k74q9rM9QL00
4756B58j85r8L26k11l86K21R4k63R0p5P7J96q0j93L79l16J31J29J87m42J89J15
4778A43l33L80j7k30n3K23m78J05L75R8m74L44k48L14k40L29l88L58k45rL33l49
4800f2k31K99J29l26L54q0l44L16K60m94J26K37l41PL84l42QN7j9p3L19m17J67
4823f6J60l9j79J99r2P8K06k37k24N15l87J20j21K27m40J50L48m48J15J83N3n8
$$ plain form
4845 63 137 -167 -55 145 134 17 37 -57 -156 84 70 -81 203 -83 -202 103 272 45 146 86 -76 146 137
4868 137 -105 6 -230 -35 -27 -26 -175 3 -12 -94 -180 47 -161 -161 441 -303 10 56 121 -148 11 12 -238 -14
4892 -14 85 -34 -50 -118 -56 -41 84 -85 104 39 -97 73 -183 -99 40 211 -47 231 151 151 147 151 62 -304 20
4917 20 -32 13 70 -131 -144 111 -30 -296 134 148 -85 -14 -200 -125 186 -49 -36 133 236 -133 -66 59 -171
4940 -171 -185 -117 224 70 -88 -269 -205 239 71 23 81 -62 -100 161 -25 44 129 -16 -20 -91 34 -250 -49 2
4964 2 -102 55 -88 -134 -115 332 -49 89 348 -126 77 270 -132 9 340 -39 -71 90 18 -84 43 83
4986 83 -251 192 114 -16 176 191 -260 247 6 -21 49 20 -209 -317 30 -59 -167 235 12 -47 198 -244 -113
5009 -113 87 -117 -266 265 -83 -224 178 56 -188 -44 -136 42 179 -212 69 -15 59 -216 -108 179 -136
$$ packed form
4845F3P4l04J12K00j1j17K0r4r9K40j4j51K84k86j19L05J69k27J01o0j62K22r
4868A37k42J11k36J95QJj49J78j5q2q6K27k08%O02p44L13M6O5k69J59Jk50K24
4892a4R9j19j6o8O2J5J25j69J89o5j36J70k56Q4J39J71k58K78q0%mMq9l66L24
4917B0n2M5N7k01j3K55j41k66M30J4k33P1j86P5L11k35J3J69J03l69O7J25k30
4940a71j4O8L41j54j58j81O4M44j68m8N8j43l8K61j86O9Q5j45mp1J25k84K01N1
4964Bj04J57j43m6J9M47l81J38K59m74K03J93m02J41L31l79l2J61p2j02J27M0
4986H3l34M43p8j30J92J5m51N07k41k7P0k9k29j08L47q9j08M02k23n9K45m42J31
5009a13K00k04j49N31l48j41M02j22k44J44r2J78J37l91K81q4P4k75J08K87l15
$$ plain form
5030 -136 -150 162 -242 -173 237 -118 -139 86 46 -166 192 61 -74 129 -4 -219 220 -103 -192 135 150 -60
5052 -60 212 -109 -146 -7 65 27 -73 -211 36 9 85 -200 -183 253 -106 -51 206 -121 -22 42 -256 -267 281 12
5076 12 -151 373 -167 -173 162 -16 29 56 -26 -199 113 -20 -323 327 -49 -507 68 -2 -180 -76 62 181
5098 181 -52 17 12 128 339 12 -17 24 -242 -63 187 -92 199 68 6 -226 33 153 -148 -136 195 -148
5120 -148 -11 51 -415 104 188 -185 -20 33 -19 -94 269 9 -14 42 6 8 59 -12 -230 182 55 -102 221 132
5144 132 -49 57 -54 42 -23 54 -243 126 -97 -4 30 40 -98 96 128 -171 -111 4 -130 -52 -87 -54 -146 120
5168 120 -135 -45 294 -14 -81 197 43 -169 100 13 -229 181 -138 104 58 -354 -145 -59 -114 -186 209 180 -66
5191 -66 -56 24 -93 139 6 -268 26 94 89 -31 11 71 -129 -8 -183 -183 212 14 -170 185 53 -303 147
$$ packed form
5030a36j4L12m04O9M10l55k1K25m0k12L58j31j35K03j33k15M39l23q9L27J5k10
5052f0K72l21l7J39P2l8j00j38K47k7P6k85J7M36l59N5K57l27R9O4k98j1N48k69
5076A2j63N24n40oL35j78M5K7q2j73L12j33l03O50l76m58N75p0j78J04J38J19
5098A81k33O9nJ16K11l27k9M1k66J79K50k79K91j31o2k32K59J20l01J2L31l43
5120a48J37O2m66N19Q4l73J65N3n2p5L63k60k3N6l6KN1p1k18M12j27j57L23q9
5144A32j81J06j11R6o5P7k97L69k23R3L4J0j38J94L2k99O0J15j34P8l5L3r2K66
5168A20k55R0L39l08o7K78j54k12K69q7k42M10l19K42m6m12K09Q6n5p2L95k9k46
5191f6J0Q0j17K32j33k74K94O8nj20M2O0k00J21j75%L95j98j84L55j32l56M50
$$ plain form
5214 147 -41 74 82 99 -113 -5 193 -307 324 54 -216 219 124 56 -221 76 -50 87 10 52 113 246 -23
5237 -23 -263 -10 -253 -226 189 99 28 -23 103 -211 162 70 -129 128 195 -53 1 120 -266 85 64 -141 53
5260 53 194 51 48 67 13 8 -114 -182 35 231 100 -156 96 -302 -224 59 -56 -85 262 -98 -25 -121 -16 -183
5284 -183 65 71 -172 -71 -15 -51 -146 248 -171 -129 -42 -150 -7 59 24 103 -64 266 88 101 -157 -72 139 91
5308 91 -170 17 3 -262 123 109 -48 14 37 -38 22 103 -172 -205 99 25 -25 2 -1 -6 399 60 172 104 58 -269
5334 -269 182 6 -193 55 -32 -264 87 -98 -220 -79 183 -176 374 107 -168 77 -159 67 -103 -27 18
5355 18 -76 155 -121 57 164 -217 -118 122 16 21 182 25 -19 174 137 -113 50 135 -6 -2 -56 -16 270 -122
5379 -122 -271 -62 -92 7 166 18 52 -72 81 67 165 -282 93 105 87 106 -291 22 30 -107 24 13 -171 285
$$ packed form
5214A47j88J15QJ7k12J08J98n00O31k70k70M35r5o8k77K97j26J37p7M2O1J33k69
5237b3k40K53k43K7M15r0p1n1J26l14L73r2j99K57O7k48N4J19l86L51k1k05J94
5260E3J41j43lJ9n4nj22o8K17J96j31k56K52l98P8K83j15k9L47l60P3r6J05j67
5284a83K48Ok43J01N6l6r5L94m19M2Q7j08J43O6l5P9j67L30j78J3k58Q5K11m8
5308I1k61J87j4k65L85j4j57O2K3p5O0Q1k75l3L04p4n0K7lnM05l39J12o8m6l27
5334b69M51j76j99K48q7k32L51j85j22J41K62l59N50k67k75K45k36K26j70P6M5
5355A8r4K31k76J78J07l81R9K40j06NJ61j57m4J93l7k50J63Q5j41Mn4M0K86l92
5379a22j49K09l0R9J59j48L4j24J53j4R8m47L75J2j8J9l97L13Qj37J31j1j84M56
$$ plain form
5403 285 -91 -174 183 53 -128 216 -74 -57 -36 94 -224 205 135 75 17 164 -204 91 255 -90 -191 67
5425 67 -292 -207 159 -3 -107 -20 1 -79 21 -155 -160 -111 90 -303 108 -9 -313 286 -112 31 165 19 -168
5448 -168 301 111 145 81 165 106 19 167 -65 110 62 -205 78 295 -30 -14 34 -124 -235 17 -91 41 -46
5471 -46 -16 -10 75 -23 57 -55 -34 -228 182 -241 -309 37 154 23 259 15 -65 -74 38 -284 -73 -121 -204 -26 -72
5496 -72 -164 -68 46 -227 116 119 185 -88 271 146 39 149 27 -27 -32 96 1 71 106 -297 137 -50 -249 -44
5520 -44 53 -71 -8 188 -109 -100 214 -223 28 -30 -38 -26 99 -37 -1 5 -103 -219 230 -102 -123 444 -62 -161 -72
5545 -72 53 -54 104 98 -120 -6 -60 -38 -114 227 -117 172 -86 -84 -36 127 -33 -139 171 18 -159 192 -170
5568 -170 -202 67 162 -6 -58 -175 -126 92 67 -168 -62 48 -305 -127 -400 -311 155 128 -94 -3 124 -157 -2
$$ packed form
5403B85l76q3L57j30j81L44k90J7K1J30l18M29p0o0n8J47l68K95J64l45j01K58
5425F7l59Q5L66j62j04Q7K1q0J00j76nM9K01l93M11j17l04N99l98J43J34j46j87
5448a68M69j90L4o4Q4n9q7J48k32J75m8k67K83K17l25J6M8j58j11K52j08J32q7
5471d6L0OQ5r8Q0j12K1j94M10m23o8L46J17j31K36k44q0rJ12l22K11m8q3J78m6
5496g2r2R6J14k73L43LO6k73L59j25j07J10j22n4nJ28r5P0L5m03M34j87j99K05
5520d4R7j24O3J96k97RL14m37K51n8qJ2J25j36L6Oj08j16M49l32k1N67n06r9Q9
5545g2J25j07J58ok18J14n4K2p6L41l44K89k58KM8J63j60j06L10j53j77L51l62
5568a70l2K69R5j68n2j17M9K18k5k35J06J10l53J78k73Q9M66k7k22R1J27k81J55
$$ plain form
5591 -2 103 -82 -54 44 -145 -78 68 -31 127 -37 109 -45 6 38 -243 -79 -113 71 -273 170 -120 -73 -136 -112
5615 -112 -125 -161 -130 8 -14 -250 -85 84 -15 -51 -32 -138 161 51 2 -164 47 66 -101 112 -263 -49 169
5638 169 -12 -213 26 -15 -97 -31 106 -259 22 21 -176 189 -172 -70 -196 35 -332 57 259 -23 5 109
5660 109 159 -105 18 -130 -214 166 -25 -95 -28 314 73 -142 -89 -86 16 65 -278 78 59 -132 78 191 83
5683 83 98 156 -71 12 31 -290 -117 -102 -306 -358 56 -264 -277 340 -64 -39 26 -145 -238 130 -42 -200 127 -208
5707 -208 -7 188 5 -4 3 -54 -167 -194 45 -90 224 195 -233 39 -89 43 -211 167 73 -32 315 48 180
5730 180 300 33 -88 91 -7 -38 195 -241 -297 41 94 64 90 40 -44 130 -51 86 165 118 -168 33 197
5753 197 -225 206 169 -51 -79 -45 -20 -15 93 51 15 328 -168 -95 36 78 -197 241 165 30 16 82 -133 45
$$ packed form
5591bJ05j85K8R8j89O7J46r9J58j64J46j54N1L2k81J64l4J84l44M43k90M7o3K4
5615a12j3l6L1J38k2k36J65J69r9l6J9j06K99j10m9j66K11J9j67K13l75K14K18
5638A69j81k01K39m1q2O6J37l65K81jj97L65l61J02j26K31l67L89K02k82K8J04
5660A09N0k64J23j48q4L80j91p0O7L42k41k15N3LJ02M9l43L56j9j91K10J13j08
5683H3J5N8k27Q3J9l21J73J5k04n2M14l20j3O17m04K5O5j71r3L68j72j58L27l35
5707b08K01J95j83rPn7j13k7K39j35L14k9m28K72j28J32k54L78r4j05L47k67J32
5730A80J20k67j21J79r8l1K33m36n6L38N3l0K6n0q4J74j81J37P9m7k86K01J64
5753A97m22M31l7k20k8L4K5NJ08m2l6L13m96P3J31M2k75M38p6j35j4O6k15J78
$$ plain form
5777 45 33 -58 69 -25 61 -88 -118 -130 16 129 -5 -178 109 -185 -107 208 11 -25 -54 -4 -95 -175 -164 -148 -70
5802 -70 -276 14 81 -17 51 166 170 155 19 -52 -211 32 31 -144 -176 89 -300 -168 -5 147 -86 203 -341 -57
5826 -57 -48 87 -40 100 -117 -104 220 -130 -101 78 -74 -38 136 -70 163 159 -177 -18 15 250 -152 134 -134
5849 -134 -128 122 39 64 -31 111 11 90 268 -144 -87 -105 -30 -127 -38 -34 -45 55 -57 -41 252 10 85 46 11 -176
5875 -176 179 215 -32 232 115 -157 104 268 -100 79 244 -14 300 -93 -227 -68 54 -68 -48 -3 -283
5896 -283 126 158 -20 -111 29 89 7 187 -176 -42 110 -93 -135 -165 -49 -78 -27 75 -188 -22 18 76 -67
5919 -67 213 -198 -208 29 -190 -102 289 -18 137 138 4 -115 151 -175 -138 268 -116 108 70 7 -113 -314 -32
5942 -32 -99 -154 -67 81 -14 -160 -86 159 77 -299 114 263 -74 -48 49 -114 230 19 6 -154 -92 -65 -357 -1
$$ packed form
5777D5j2r1J27r4Q6j49l0j2J46J13j34j73K87k94P8L15j97l6k9N0r1q0J1J6P8
5802g0k06K90O7r8O8J15Mj5j36p1j59K43jj75l2K65l89J32J63J52k33K89n44K84
5826e7RJ35j27J40k17J3L24l50K9J79j52L6J74k06K33ml36J59L3K35m02K86k68
5849a34OK50q3K5r5J42j00P9J78m12N7j8P5r7Q9Mj1J00j12J6K93k42P5l9l5j87
5875a76L55L6k47K64j17k72K61J64l68J79J65k58L14l93j34J59J22j22K0M5k80
5896b83M09L2j78r1J40O0q2J80l63J34J52k03m2l0J16k9N1J02k63J66M0N8j43
5919f7K80m11j0K37k19Q8L91l07J55Jj34j19K66l26L7M06l84K24l8o3j20k01K82
5942c2o7n5Q7J48r5j46P4K45q2l76M13J49l37K6R7j63L44k11j3j60O2K7k92L56
$$ plain form
5966 -1 10 -442 175 221 -154 53 -154 132 315 46 -133 -22 71 25 155 -10 43 -34 201 -71 -17 76 -147
5989 -147 -1 -67 -207 -242 -165 -315 -66 283 183 -72 41 -137 -29 71 -79 -33 9 142 -48 72 -59 -54
6011 -54 328 120 137 120 181 -26 272 76 -221 66 -75 -178 -134 -37 -32 128 -73 -117 22 112 -120 -51 -34 182
6035 182 -169 211 -31 -102 127 -157 -80 4 -53 -82 -1 36 -50 51 149 -140 230 25 67 -87 -149 168 59 -10
6059 -10 16 -112 271 -83 -84 363 61 -41 -123 -191 72 -209 6 -87 125 -61 1 -80 -70 -176 -34 -154 0
6082 0 207 309 -162 51 -47 6 157 -30 -197 -103 53 -209 66 161 -121 60 165 -222 -26 70 45 -95 167
6105 167 145 99 155 -53 53 60 117 52 162 144 -117 -102 191 141 -16 56 -28 90 108 -314 18 -7 64 73 110 -53
6131 -53 42 213 90 54 181 -116 -328 73 141 115 0 60 -98 108 -35 -57 145 169 -74 -100 38 -409 -77
$$ packed form
5966aJ1m52O17M6l75K07k07K86J83k69j79J11R3m6J30j65N3p7K35k72N4R3k23
5989a47J46o6j40l5P7j50K49L49j00k55J13j78J08J00j50M6M2J33j90J20j31N
6011e4L82k08J7j7O1k07K98j96k97K87j41j03M4R7NJ60k01m4J39R0k32O9J7K16
6035A82l51L80k42p1K29k84P7Q4n7k9Q1L7q6J01R8k89L70k05M2j54o2L17j09o9
6059a0K6j28L83l54jM47l02j02q2o8K63k81K15r3K12j86O2q1J0j06J42j20J54
6082@K07J02m71K13r8N3J51j87j67R4J56k62K75R5k82J81J05l87J96R6k5j40K62
6105A67k2m6N6k08J06PN7o5J10j8k61J5K93n0j57P2q4J18J8m22L32k5P1RL7j63
6131e3R5J71j23l6J27k97k12M01O8k6j15O0j58K06j43k2K02K4k43k6J38m47L32
$$ plain form
6154 -77 -87 -53 -43 66 -19 -7 275 -19 -145 37 -112 -116 20 -108 -70 4 217 -250 -24 -14 -331 -104 59 -259
6178 -259 80 -26 -210 -90 -179 69 -55 217 40 -3 272 -44 333 54 -145 3 159 -115 127 175 82
6199 82 -146 131 189 37 73 -96 -291 29 252 13 0 -42 -154 -63 180 -223 75 14 -204 -216 -26 122 3
6222 3 35 50 76 232 131 130 39 -115 -46 -139 132 -94 238 -96 128 214 -111 -186 86 -94 -41 -27 225 -108 -59
6247 -59 86 -129 156 -32 -242 -114 270 -178 119 64 -48 -130 219 130 -52 339 8 -103 -29 246 -68 273
6269 273 -120 -22 8 111 -182 50 -19 -150 131 320 -47 -88 -99 -94 -77 137 -180 79 110 -126 -52 98 4 55
6293 55 135 11 -132 19 -58 -41 99 5 -268 77 46 -143 87 10 -87 -81 172 -60 -135 -61 -139 -140 125 147 -115
6318 -115 127 15 81 172 -192 -218 94 -185 -320 -217 -11 143 117 155 -148 181 63 -258 -162 -71 -61 -79 80
$$ packed form
6154g7j0L4J0J09q5J2K82k94j26J82j49mJ36j28L8P4K13m67K26J0l17K27J63l18
6178b59L39j06j84J20q9K48j24K72j77m3K75l16L77k79j99J48J56k74K42M8r3
6199H2k28K77N8j52L6j69j95L20K23k39j3m2j12R1K43m03K98o1k18j2J90J48j19
6222CL2J5K6J56j01jr1j54O9r3K71k26L32l34K24Q6l25p5K72j80N3J4K52l33M9
6247e9J45k15K85j88k10J28L84m48K97n5j12q2L49q9j82L91l31j11P4K75l14L41
6269B73l93R8L0J03k93K32o9j31K81J89l67m1j1NJ7K14l17K59L1k36P4J50r4N1
6293E5Q0j24j43J51p7J7J40r4k73L45l1j89K30p7r7OK53k32p5P4p8jK65K2k62
6318a15K42j12O6R1l64k6L12k79j35J03K06J54k6L8l03L29j18l21R6R1J0j8J59
$$ plain form
6341 80 -198 -136 -35 -59 -95 260 -137 -303 375 -158 -115 152 -115 96 111 -59 42 -39 115 -21 37 47 -102
6364 -102 134 87 50 293 13 -41 -95 126 73 -49 -55 -129 -48 -108 45 101 -179 -21 -95 -60 -124 70 197 159 -27
6389 -27 115 -265 -111 268 -67 65 69 -153 -54 88 203 -46 7 48 20 188 15 -255 -59 40 -74 9 -111
6412 -111 -258 165 -23 -154 209 -37 102 -26 43 116 -41 -143 -89 -28 168 203 -27 110 -22 -327 69 83
6434 83 222 13 -18 -61 164 -15 -23 -199 18 41 -36 -51 -89 41 49 -51 -271 -111 -127 -237 9 -130 6 -27
6458 -27 90 -45 10 -8 101 -88 172 -167 -200 46 -135 402 -28 -74 -75 292 -58 -207 -65 51 -50 -20 -49
6481 -49 159 -87 35 167 -50 3 -25 60 131 -79 149 201 122 29 -125 -53 -31 75 -140 87 -169 -187 37 -106
6505 -106 -55 -87 52 -221 64 18 -2 -179 171 -20 9 -35 -1 85 -29 50 84 -146 -154 193 -184 -3 -417 -65
$$ packed form
6341H0k78O2J01k4l6L55l97j66O78n33M3K67k67K11J5j70J01q1J54j36N8J0j49
6364a02K36m7l7K43k80n4n4K21n3j22op4Q1o0J53N6k80J58p4L5o4J94J27l8j86
6389b7J42l80J54L79l35J32Mk22R9J42J15k49N3M1k8J68j73k70J96R9j14Q3j20
6412a11j47M23j88j31L63k46J39j28O9P3j57j02N4O1J96L5k30J37j32l05L96J4
6434H3J39k09l1m3K25j79qj76K17K3p7j5l8J30Qj00k20J60j6j10K46j39J36l3
6458b7J17j35N5j8J09j89K60l39l3K46j81N37m30m6jL67l50j49J42J16j01L0k9
6481d9K08k46J22J32k17N3k8Q5P1k10K28N2p9r3j54P2K2J06k15K27k56j8K24j43
6505a06N1l2J39k73K85m6k0j77L50j91K9m4L4Q6j14P9L4k30qL47l77J81m14L52
$$ plain form
6529 -65 -93 24 -31 162 192 162 111 100 -218 -131 -5 -115 110 27 -68 183 -80 30 -74 -7 37 236 -236 100
6553 100 70 -176 4 141 -8 0 -193 91 -90 -127 -48 -267 -177 -135 76 -17 -2 -130 -183 134 12 -63 53 -137
6577 -137 107 50 6 -25 140 17 189 19 -27 -131 -124 54 -10 149 62 -287 -111 -58 -48 248 75 -5 -62 -258
6601 -258 94 173 84 -67 -117 56 84 175 303 -99 164 153 -38 -122 -7 137 153 115 -65 92 192 221 162 -83
6625 -83 156 -99 244 -116 -137 79 -105 -138 -160 -110 31 26 -84 62 -125 -26 -115 -90 49 -136 95 193 -124 -22
6649 -22 148 -114 14 140 65 299 104 -75 121 -84 -41 149 261 -17 118 232 -7 -49 -207 -17 39 -56
6671 -56 35 268 163 -125 91 -97 -31 -38 90 -159 -12 -50 -25 -81 -68 -35 -161 168 282 -237 -60 43 188
6694 188 -206 -46 130 -170 78 -168 168 -43 -220 -89 197 1 -33 -50 37 82 -61 -5 -85 -208 183 22
$$ packed form
6529f5k8J17n5J93L0l0n1j1l18Q7J26j10K25q3r5K51k63J10j04O7M4J99m72L36
6553A00l0k46J80J37j49Qj93K84j81l7P9k19R0M2K11r3J5j28n3L17j22p5J16j90
6577a37K44n7m4l1J65j23J72j70m6j04PJ78o4J59q7l49J76N3J0K96j73q0n7j96
6601b58L52P9q9j51n0J73K8R1J28m02K63j1j91q4J15J44J6l8j80J57J00K9n9k45
6625h3K39k55L43l60k1K16j84l3k2N0J41nj10J46j87R9q9K5J39j85K31R8l17J02
6649b2J70k62J28J26p5K34j95j79J96k05M3J90J12k78J35J14k39m2j58J90N6r5
6671e6R1K33j05k88K16j88O6pJ28k49J47l8K5n6J3L3j26L29J14n19J77J03J45
6694A88l94J60J76l00K48k46L36k11j77J31K86j96l4j7Q7M5j43N6q0j23L91j61
$$ plain form
6716 22 73 264 220 -158 351 36 126 -62 -32 -48 123 70 172 -43 71 27 -98 -76 36 -88 -332 -155 -120
6739 -120 -182 28 -64 -87 9 -45 6 72 7 149 20 -60 7 -81 21 -39 -77 -30 213 -7 181 230 94 133 -207
6764 -207 -95 76 74 -46 29 38 87 85 -9 108 79 -436 -121 22 78 101 -121 97 56 128 168 157 -57 -72 -32 31
6790 31 151 -27 113 -13 95 -150 210 -84 24 129 -43 150 -31 -11 -57 44 242 142 -108 47 13
6811 13 -34 125 64 -125 93 -274 86 -26 141 -126 156 12 -165 57 25 -43 109 7 -399 -37 202 -107
6833 -107 95 30 164 194 41 -220 -74 23 91 210 -86 91 12 16 173 -193 193 -123 -143 136 89 90 56 175
6857 175 4 40 -41 -79 85 82 -13 -15 51 -141 116 -221 44 -47 205 -164 50 -137 198 -67 -52 -140 -79 20 -118
6882 -118 69 111 -36 -339 -53 -53 -258 72 -65 102 -46 -42 -101 -139 4 28 130 182 -48 196 -62 -132 -92 -69
$$ packed form
6716B2N1J91m4l78N09l15R0j88L0j6J71n3J02k15J14m4j25K2J12j24k44J77L5
6739a20o2K10r2k3R6n4N1O6o5J42j29q0O7q8J02o0l8M7K43k20J88M9j36L9l40
6764b07J12J71kj20P5RM9kr4J17k9n15L15J43N6K3k22K18m1P2M0j1k14j5M0O3
6790C1J20j78J40j26J08k45L60k94J08J05j72J93j81K0m6J01J98j00k50J55l4
6811A3m7J59o1j89K18l67L60j12J67k67K82j44j77K22l2o8J52j02m06L62K39l09
6833a07K02o5J34L0j53k61J46R7O8J19k96J77p9MJ57l66L86l16k0K79m7Jl4J19
6857A75j71L6q1l8J64lr5kO6j92K57l37K65r1K52l69K14j87L35k65J5q8O1R9j38
6882a18J87M2j47l03K86%k05L30j37J67j48Mn9l8J43K4J02N2k30K44k58p0M0K3
$$ plain form
6906 -69 73 -229 75 73 -4 -8 -92 85 162 96 75 -41 -48 -228 23 83 -13 -145 -23 150 254 105 -39 11 -99
6931 -99 203 86 -20 41 -15 48 76 -41 -21 -212 -88 -251 -239 111 -33 -154 -66 104 -127 102 43 96 -87
6954 -87 70 -137 -151 -25 -151 -167 197 -55 -186 -25 -76 91 -48 109 -44 86 54 97 -8 -75 50 -73
6976 -73 -7 -179 32 113 24 -67 170 -218 81 -178 -103 176 167 -89 -90 136 -137 124 -40 -5 -122 87 19 -249
7000 -249 84 90 -239 -147 -302 -75 58 -119 16 96 -5 -60 -65 25 -52 -132 211 59 -129 212 -83 17 264
7023 264 -84 -163 -4 27 -66 364 70 53 121 192 -150 -77 -28 52 -9 132 -330 15 53 -278 -182 93 -233 -94
7047 -94 -8 -55 111 -105 -146 -46 -142 -2 -257 31 -27 30 200 -15 5 13 144 -48 2 -74 39 -82 275 316
7071 316 -113 -36 -36 61 163 30 118 291 -91 33 130 -293 124 16 -314 -178 205 -4 17 64 63 34 158 72
$$ packed form
6906f9J42l02L04kp7mq4J77P7o6k1j16pj80K51O0r6j32J22J73J04j49j44N0j10
6931i9L02j17j06O1n6O3K8j17K0j91J24j63J2L50j44j21Q8J70k31K29n9N3j83
6954h7J57k07j4J26j26j6L64k52j31J61n1J67j39J57j53J30l2M3j05o7J25j23
6976g3O6j72K11Q1q9r1K37l88K99k59P5K79rk56jK26k73K61j64L5j17K09o8k68
7000b49L33Ol29R2j55K27J33j77J35Q0j01n5nR0p7q0L43j52j88L41k95J00K47
7023B64l48p9J59L1r3M30k94j7O8P1l42P3M9Q0o1J41m62L45L8l31R6K75l26J39
7047i4Q6m7J66k16m1J00r6J40k55K88n8N7J70k15K0QJ31j92N0p6J13j21L57M1
7071C16m29P7%R7J02j33Q8J73l82J24R7m23M17j08l30J36L83k09K1M7jk9J24q6
$$ plain form
7095 72 -37 -152 118 105 111 72 5 -24 -8 -210 -211 -41 -151 -87 -88 -155 -240 86 23 -118 94 -74 -14 76 -92 -417
7121 -417 74 139 -2 200 67 -167 56 -39 -110 -20 -12 0 20 -4 85 -131 274 -1 69 204 64 61 111 115 67 -21
7147 -21 23 32 213 52 -9 147 117 -101 -59 60 87 -9 47 -211 142 53 -40 -62 168 107 100 -98 -189 -141 27 166
7173 166 -142 -117 -114 119 2 -226 -164 53 -172 269 79 -38 179 -28 -247 139 131 -156 166 106 -82 33
7195 33 24 -29 -175 -8 -154 -247 11 -271 20 8 220 -185 -87 241 -39 159 13 -166 68 75 67 -55 57 5
7219 5 -335 40 -74 -190 99 66 -169 138 62 -149 377 -190 173 -60 -97 -1 128 97 -21 142 15 52 -43
7242 -43 -90 -14 139 115 -162 239 235 -161 -19 44 209 103 290 -112 -162 85 52 -89 134 28 -64 51 -111
7265 -111 -6 13 -34 -19 21 345 69 125 -11 -56 42 -83 -167 113 162 24 -56 -89 -150 149 -48 0 118 -100
$$ packed form
7095G2j09j15K70j3Ol9o7k9J6k02jJ70j10O4jo7q5L26o3j41K12j68O0R0j68l25
7121d17M91O5j41K02j33k34K23r5p1R0QJ2K0k4Q9k16M05k75P0J35j40lN0Mm8q8
7147b1M4RJ81j61o1J56l0k18M2J19K7r6N6k58L53q9r3k2K30o1pj98r1M8J68J39
7173A66l08K5LK33j17k28O2K17k25M41j90j17K17k07k19L86qk87L22o0j88J15
7195C3rn3j46J67j46r3K58k82K91j2K12m05R8L28k80J98j46j79K34Pqj22J12n2
7219El40L75j14j16K89l3k35L07p6k11N26n67L63k33l7R6J29l1j18J63j27L7r5
7242d3m7P6J53k4k77M01ml96J42O3J65j06J87m02n0K47l3j41K23j06r2J15j62
7265a11J05J9m7J5M0L24k76N6j36m5R8j25q4K80M9j38q0l3o1K99j97M8J18k18
$$ plain form
7289 -100 15 26 -16 -89 180 86 -15 54 -49 114 -122 45 -175 -12 217 69 -92 -153 -105 -45 83 19 157
7312 157 218 106 -16 53 -105 129 73 248 6 -39 -45 -31 -21 4 3 -294 1 -149 -130 58 126 45 -135 217 -132
7337 -132 -68 82 -169 -33 -117 -173 115 -4 5 162 -46 -58 -29 228 137 118 110 -85 -97 -98 -91 91 85 -6 139 -44
7363 -44 65 -43 77 42 100 93 40 238 202 30 115 -6 -118 -104 -64 108 -55 -142 157 -227 -12 68 121 -75
7387 -75 115 -87 59 302 163 -322 -40 -49 -55 247 306 14 99 34 -201 -471 270 -103 -51 60 -170 15 -18
7410 -18 -172 -45 36 -54 -62 -80 -62 -31 45 -48 153 43 -117 -67 -104 -185 39 79 -5 -20 -81 61 -105 16 -106 196
7436 196 -170 -20 44 38 106 204 253 -40 -16 -54 43 139 -116 -6 138 -38 93 -142 51 159 -10 -94 35 -85
7460 -85 -102 34 175 106 281 -54 227 -232 -5 -259 51 162 -141 120 -47 12 92 136 49 -148 -90 -61 36
$$ packed form
7289a00J15J1m2p3K69r4j01O9j03J63k36J67k20J63K29j48j61o1M8O0J28o4J38
7312A57O1j12j22O9j58K34n6J75k42m5oJ4J0K5jk97K95j50J9J88O8q1j80L52l49
7337a32O4J50k51J36q4n6K88j19RJ57k08j2K9K57r1j9qj95j2jPJ82or1J45j83
7363d4J09j08J20l5N8pn3J98l6j72Q5j21j12J4M0J72j63q7K99l84K15Q0N3j96
7387g5J90k02J46K43j39m85K82roL02N9k92Q5o5k35k70P41l73N2J11k30J85l3
7410a8j54J27Q1r0qj8J8L1P6r3K01j10j60N0l7q1K24M0q4j5o1J42j66J21j22L02
7436A96l66J50O4oO8R8M9k93K4l8R7R6k55J10J44j76J31k35J93J08j69q4J29j20
7460h5j7J36J41o9J75l35K81m59K27k54L10J11l03K61j67N9Q0M4q7j97N8K9R7
$$ plain form
7483 36 -36 63 -329 44 -41 -59 266 -300 -179 108 89 -61 232 -292 -147 27 159 -175 45 -55 -52 -94 66
7506 66 -2 -151 66 29 161 70 -93 -39 274 67 -140 66 -88 94 -34 -147 -56 -77 -199 -118 368 121 -90
7529 -90 -64 72 -176 188 170 157 -103 76 25 -99 116 -14 -50 -111 -254 -69 185 -140 25 30 -190 169 -57
7552 -57 10 -50 57 -110 235 141 113 -186 79 -147 48 342 -113 -84 66 -68 -93 17 -88 -265 -270 56 6
7575 6 55 -161 -166 -55 -102 43 -128 83 89 -230 49 -72 -24 -64 -12 -88 143 11 -343 68 -236 -45 -201 106
7599 106 125 -102 -59 -32 100 -2 -90 -23 62 34 -24 187 -313 -395 35 -55 -75 -123 -107 100 71 59 89 161 183 108
7625 108 -10 -45 -110 99 104 -22 -89 104 -242 -30 140 -74 4 21 -267 9 35 -35 49 -13 -60 -84 254 -64
7649 -64 -80 -40 33 -7 105 -164 26 69 17 -180 196 -246 -9 83 17 -61 27 140 -61 148 -9 -150 -120 139
$$ packed form
7483C6p2R9l92L73q5j8L25n66J21K87j9j50K93n24J45J74J32l34K20j00Lm2J60
7506F6o8j49K17l7J32r1j63N4L13k07k07K06j54J82j28j13R1k1j22Q1M86k47k11
7529i0K6J36k48L64j8j3k60J79n1j24K15j30l6o1j43J85K54l25J65Nk20L59k26
7552e7O7o0J07j67L45r4k8k99K65k26J95K94m55K9J50j34k5J10j05j77nL26n0
7575FM9k16nJ11m7J45j71K11Ol19K79j21M8m0N2p6K31j32l54M11l04J91j56L07
7599A06J9k27M3K7J32j02q8O7Q5k8n8K11n00q2M30r0k0m8J6K07k9j2L0P2K2p5
7625A08j18l5o5K09Nj26o7J93l46K12J70k14P8J7k88K76K6p0Q4o2m7k4L38l18
7649f4j6M0P3m0J12k69J90M3n2j97L76m42K37R2o6p8Q8J13k01K09j57j41L0K59
$$ plain form
7673 139 -322 102 6 165 -26 25 108 99 -64 -10 32 7 268 -160 142 -7 -207 -18 -50 -151 -105 -105 -31 59 7
7698 7 70 109 229 -217 -15 -145 -192 98 -176 -22 14 -98 -265 -157 83 -26 120 149 61 -26 169 -33 112
7721 112 -13 -30 35 23 -281 6 14 -18 -53 160 31 -67 -59 217 -143 3 194 -63 -13 81 -12 173 271 54 20
7746 20 -22 120 111 -5 -154 15 -69 224 -145 211 -46 -132 -135 86 5 89 -2 10 87 -233 -249 55 196 70 -5
7771 -5 -47 -151 -175 -95 -5 -121 -57 -234 -62 15 -18 123 -242 -76 166 -163 -102 15 -147 -133 225 -18 -34 -5
7795 -5 151 -58 155 101 -98 -90 3 -2 25 -38 229 -53 14 -49 246 -44 78 115 168 -21 -193 154 -188 -226 -216
7820 -216 -105 -369 -161 -28 -46 -17 63 51 18 104 75 -121 -143 -213 -23 48 17 -40 -4 52 96 175 -48 -46 40 -3 33
7847 33 1 99 -92 53 139 229 163 205 -52 -62 -3 -109 -48 151 141 221 -130 -92 -35 88 34 -183 -287 89 -149
$$ packed form
7673A39m61M24r6J59j91N1Q3rj63N4M2k5K61m28L02j49k00J89l2j01M6%P4R0n2
7698GO3L9J20m46K02j30m7K90k74J54L6j12j67J08K40j09J46K9q8q7J95k02J45
7721A12j25j7O5j2l04K87Ql2l5K13j29r8QK76l60J46J91k57N0R4r3J85R8k17l4
7746B0m2J42rj16j49J69q4K93l69L56k57q6lK21q1Q4r1J2P7l20j6L04J41j26p5
7771em2j04k4Q0R0j16O4j77J72P7l3J41l65J66K42l29O1J17j62J4L58k43j6K9
7795eJ56k09K13n4j99QR3nK7o3K67k82O7o3K95k90J22L7N3j89j72L47l42l8J0
7820b16J11k64K08J33j8K9Q0j2l3Q6k9j96k2p0J90P1l1n7L6N6M4P9k23KQ6m3L6
7847C3l2R8j91J45Q6R0o6M2k57j0N9j06O1J99j0Q0l51L8N7J23n4k17j04L76k38
$$ plain form
7872 -149 -6 140 -222 170 18 74 -71 227 -51 -90 159 -209 -362 137 30 10 -139 40 37 92 85 121 44
7895 44 87 37 153 140 8 -41 -68 -148 -11 -2 -38 29 153 -182 -120 37 89 61 65 -2 -226 239 -34 -43 -12 35 22
7922 22 188 -90 -172 124 -55 -232 -69 142 -175 -81 172 3 120 70 -241 -119 70 -41 134 88 -69 35
7944 35 267 -42 13 206 4 29 -43 -53 82 -18 -277 -37 -107 -80 49 -42 -94 -76 -136 239 -131 6 186 -76
7968 -76 103 100 0 95 -209 -150 99 184 -33 -26 82 -111 -67 34 19 116 7 153 -109 -150 7 -12 164 -122
7992 -122 -141 2 103 233 104 85 126 8 172 -192 20 19 89 66 159 -155 -77 126 -161 134 42 -209 36
8015 36 347 32 -283 222 -62 -186 262 -56 -95 -20 80 -49 58 6 -57 96 -149 -18 110 1 -111 -39
8037 -39 -146 -125 -58 164 -35 -10 16 -24 -25 248 -89 -26 -44 -145 -223 62 -57 -198 182 -69 -183 7 34 -153
$$ packed form
7872a49J43J46l62L92j52N6j45K98k78l9K49l68j53M99j07k0j49J79lN5pL6p7
7895D4M3n0J16j3j32m9k7q0J37Rl6O7J24l35O2J57N2k8Mo7k24M65k73rL1M7j3
7922B2J66k78q2K96j79j77J63K11l17R4K53j69J17n0l11J22J89j11J75m6j57J04
7944C5K32l09N5J93k02K5p2j0J35j00k59K40p0K7J29r1n2J8o0L75l70J37J80k62
7968g6J79lj00R5l04N9K49Q5k17PJ08j93M4J01j5R7j09J46k62m1J57j9J76k86
7992a22j9J43J01J30j29j9M1j18J64l64K12jP0k3R3l14P8K03k87K95r2k51K45
8015C6L11l15l15N05k84j24M48l18l9P5J00j29J07n2o3J53k45J31J28j09j12P2
8037c9j07K1O7K22j99K5K6m0jK73l37O3j8j01p8K85j19j41L80k51j14J90K7j87
$$ plain form
8061 -153 97 55 -76 147 166 -11 -47 247 -16 63 -129 -353 -28 217 -41 194 130 -292 28 -131 -178 53
8083 53 209 -41 -52 -1 75 -169 126 92 -26 5 -81 36 203 37 -172 123 -256 -291 6 213 103 -151 -57
8106 -57 -158 -83 163 -144 32 -81 -282 -146 213 -383 4 305 -226 85 232 -110 -174 -115 223 -110 93
8127 93 24 -79 222 31 -91 70 114 -197 -111 -24 11 156 -175 -11 -134 -41 -15 309 124 27 38 162 -70
8150 -70 -43 -90 -2 -114 -87 -189 -3 242 39 86 220 55 -181 -36 52 -83 5 88 -211 68 5 -252 15
8173 15 47 -46 -149 318 -166 -37 143 -187 98 211 -97 -7 202 76 8 202 43 119
$$ packed form
8061a53K50m2j31K23J9j77l6K94k63P9j92k24L25K45k58K35o4m22L20j59m7K31
8083E3J56k50j1N1P6k44K95l4j18L1q6J17J67j66k09K95l79l5K97K07j10k54R4
8106e7j01P5K46l07J76j13k01J36L59n96L87L01n31L11J47l42o4N9L38l33K03
8127I3o9j03L01j91j22J61M4l11Q6Q7L5J45l31J64j23R3K6L24j85r7J1J24k32
8150g0K7m7Q8j12K7j02J86K45k03M7J34j65k36J45Q8j35Q8Q3k99K79o3k57K67
8173A5L2r3j03M67m84J29J80l30K85J13l08R0K09j26o8J94j59P6
8191A19
$$ Imaginary data points
##PAGE= N=2
##DATA TABLE= (X++(I..I)), XYDATA
$$ plain form
0 0 0 0 0 0 0 0 0 0 0 0 8 -8 8 -8 16 -16 22 -24 32 -40 43 -54 64 -72 88 -99 115 -135 154 -177 202 -228 259
33 259 -294 331 -373 418 -467 522 -582 646 -717 795 -881 975 -1074 1186 -1308 1440 -1585
50 -1585 1748 -1926 2123 -2345 2592 -2873 3196 -3566 4001 -4513 5137 -5910 6896 -8204 10023
65 10023 -12731 17189 -25772 48178 -228394 -438661 199000 104137 -127724 107320 153908
76 153908 -47310 61126 67247 16518 132449 59938 -36926 219443 188290 -117361 -17572
87 -17572 123231 -86604 -64297 132837 53122 -65568 -36128 -32332 -23167 -57520 -97084 30443
99 30443 108883 786 -24361 -37718 -91533 36505 84570 -78371 10014 133742 -82022
110 -82022 -110412 84738 -46020 -157155 8687 3422 -31633 58999 -92115 -168601 50696
$$ packed form
0@%%%%%%%%%%Qj6J6j6K4l2L8m6N6p2Q3r7J18j36J60j87K14k50K89l31L79m30M87
33B59n53O25p04P91q85R89j104J228j363J512j676J856k049K260k494K748l025
50a585L333l674M049m468M937n465O069o762P567q514R650j1047J2806j5100J8227
65A0023k2754K9920m2961P3950k76572k10267O37661r4863k31861K35044M6588
76A53908k01218J08436O121n0729J15931p2511r6864K56369l1153l05651R9789
87a7572J40803k09835K2307J97134p9715j18690K9440L796R165l4353l9564J27527
99C0443P8440j08097k5147j3357n3815J28038M8065j62941Q8385J23728k15764
110h2022k8390J95150j30758j11135J65842n265l5055R0632j51114p6486K19297
$$ plain form
121 50696 -24610 -140108 165416 154998 -182273 4665 221582 -54529 -74112 180481 118418
132 118418 34857 79855 16221 59306 97566 -97813 -48110 173750 1971 -129845 67464
143 67464 5484 -182879 -61772 4541 -70310 -9137 -9505 -75690 -17299 -51381 -102911 42871
155 42871 51585 -64465 40461 81920 -50419 467 46517 -49981 37037 102210 -49502
166 -49502 -7589 112066 -34226 -92123 25350 6169 8560 59890 -28708 -8265 73675 -74035
178 -74035 -70707 147041 45303 -98078 85996 96970 -78551 -354 62803 -30682 -304
189 -304 13520 -21262 61373 -15634 -162048 12546 78390 -148296 -69326 116840 -55883
200 -55883 -119348 35509 -21974 -66633 36776 -6870 -13890 82806 -14417 -50812 97559 27515
$$ packed form
121E0696p5306j15498L05524j0418l37271J86938K16917k76111j9583K54593o2063
132A18418q3561M4998o3634M3085L8260j95379M9703K21860j71779j31816J97309
143F7464o1980j88363J21107O6313p4851O1173l68o6185N8391l4082n1530J45782
155D2871Q714j16050J04926M1459j32339N0886M6050r6498Q7018O5173j51712
166d9502M1913J19655j46292n7897J17473j9181K391N1330q8598K0443Q1940j47710
178g4035L328K17748j01738j43381J84074J0974j75521P8197O3157r3485L0378
189c04J3824l4782Q2635p7007j46414J74594O5844k26686P8970J86166j72723
200e5883o3465J54857n7483m4659J03409m3646p020R6696r7223l6395J48371p0044
$$ plain form
212 27515 -59020 97531 74202 -61493 56424 84641 -58771 405 56260 -37981 13010
223 13010 59655 -48107 -29923 24282 -44502 -14549 27467 -49538 -4475 46164 -67007 -32943
235 -32943 72110 -42781 -68357 66983 18460 -46988 21964 -9177 -30387 38933 -22134
246 -22134 -38811 69382 -14162 -79917 76540 30130 -118000 28338 87517 -66437 -5548
257 -5548 71396 -44803 -10942 60387 -32305 7029 69977 -52030 -13854 103310 -29493
268 -29493 -61903 77494 -3401 -63662 70847 18144 -83759 24115 26779 -57466 17078
279 17078 15807 -62372 11197 25095 -50942 9043 16891 -61845 15324 50409 -51388 -5008
291 -5008 49433 -41345 -7760 64486 -20084 -22401 42817 -9523 3706 48717 -37904 -19682
$$ packed form
212B7515q6535J56551k3329j35695J17917K8217j43412N9176N5855r4241N0991
223A3010M6645j07762J8184N4205o8784K9953M2016p7005M5063N0639j13171L4064
235c2943J05053j14891k5576J35340m8523o5448O8952l1141k1210O9320o1067
246b2134j6677J08193q3544o5755J56457m6410j48130J46338N9179j53954O0889
257e548P6944j16199L3861P1329r2692L9334O2948j22007L8176J17164j32803
268b9493l2410J39397q0895o0261J34509n2703j01903J07874K664q4245P4544
279A7078j271p8179P3569J3898p6037N9985P848p8736P7169L5085j01797M6380
291e008N4441r0778L3585P2246q4570k317O5218n2340J3229M5011q6621J8222
$$ plain form
303 -19682 68948 -23585 -41421 68203 -14804 -73624 55786 19975 -73037 23317 18854 -63585
315 -63585 23749 27184 -64047 16850 34682 -63270 21091 62292 -66360 -8528 81279 -35724
327 -35724 -23878 75535 -19643 -35476 67158 -3351 -39448 50869 -4140 -43355 47549 -1092
339 -1092 -54903 39091 6531 -62982 31133 21795 -64254 15181 33034 -51498 6294 33993
351 33993 -42605 6967 37578 -41853 2470 43846 -39431 -5292 47622 -39519 -18121 53598
363 53598 -30944 -33062 49280 -20365 -37586 48906 -10449 -41904 48642 1927 -42018 53944
375 53944 17392 -48504 48304 35138 -47083 39026 44687 -50894 22785 52296 -50064 1779
387 1779 46749 -54940 -16168 48572 -53099 -39311 42463 -44735 -51466 39955 -29656 -56509
$$ packed form
303a9682Q8630r2533j7836J09624q3007n8820J29410l5811r3012R6354m463q2439
315f3585Q7334L435r1231Q0897J7832r7952Q4361M1201j28652N7832Q9807j17003
327c5724J1846R9413r5178j5833J02634p0509l6097R0317n5009l9215R0904m8641
339a092n3811R3994l2560o9513R4115r338q6049P9435J7853q4532N7792K7699
351C3993p6598M9572L0611p9431M4323M1376q3277L4139N2914q7141K1398P1719
363E3598q4542k118Q2342o9645j7221Q6492n9355l1455R0546m6715m3945R5962
375E3944l6552o5896R6808j3166q2221Q6109N661r5581P3679K9511j02360N1843
387A779M4970j01689L8772O4740j01671J3788Q1774q7198o731R1421o9611k6853
$$ plain form
399 -56509 35962 -12843 -46840 43217 446 -48790 46396 25492 -39911 44398 39656 -37295
411 -37295 32102 47208 -27512 22782 39867 -31517 17850 41535 -39079 1013 38106 -42924
423 -42924 -8769 46722 -36338 -23664 41111 -30623 -25939 48308 -23024 -36914 49884 -6082
435 -6082 -42000 39675 -4470 -50072 35550 5934 -52132 28559 3955 -71555 21356 27494
447 27494 -74242 -1584 45673 -51243 -14610 45909 -30283 -13079 42615 -13458 14059 62107
459 62107 -23406 -4196 81950 -4024 -27681 75511 23351 -35884 44304 23737 -35410 13102
471 13102 -2970 -34601 26400 -8357 -63208 14685 -727 -80142 -1366 23857 -61528 -11296
483 -11296 32502 -40453 -12466 25382 -39944 -917 54893 -19644 -8010 52151 -17271 -19596
$$ packed form
399e6509R2471m8805l3997R0057m2771m9236R5186k0904o5403Q4309m742p6951
411c7295O9397J5106p4720N0294J7085p1384M9367K3685q0614M0092L7093q1030
423d2924L4155N5491q3060J2674O4775p1734M684P4247p1332j3890Q6798n5966
435f082l5918Q1675m4145m5602Q5622k9616n8066Q0691k4604p5510R2911O138
447B7494j01736P2658M7257r6916L6633O0519p6192J7204N5694n6073K7517M8048
459F2107q5513J9210Q6146q5974k3657J03192n2160n9235Q0188k0567n9147M8512
471A3102j6072l1631O1001l4757n4851P7893j5412p9415P8776K5223q5385N0232
483a1296M3798p2955K7987L7848o5326L9027N5810p4537J1634O0161o9422k325
$$ plain form
495 -19596 47689 -10562 -18266 55023 -6153 -31961 53845 -3902 -64843 37332 37719 -37987
507 -37987 20729 34314 -26727 9081 14899 -21567 38281 28063 -43626 37097 60467 -65000
519 -65000 -29826 59870 -23513 -41459 34662 -6571 -38414 -8943 -42396 -25340 17972 -52022
531 -52022 -38979 58741 -14979 -74200 26040 15088 -48021 30874 49281 -9436 26544 23961
543 23961 -18688 41313 38207 -30798 35487 66562 -20184 2026 34456 -38828 -14697 35277
555 35277 -25050 -3177 43999 -46194 -52193 35742 -17097 -53979 27873 19235 -19961 10864
567 10864 -15447 -25649 27268 -18113 -35293 64878 24297 -72008 13156 41593 -63275 -34358
579 -34358 37652 1657 -5036 299 -26061 9094 497 -60542 21611 80177 -28804 -21361 74872
$$ packed form
495a9596O7285n8251p704P3289o1176k5808Q5806n7747o0941J02175L87p5706
507c7987N8716J3585o1041L5808N818l6466N9848j0218p1689Q0723K3370j25467
519f5000L5174Q9696q3383j7946P6121m1233l1843K9471l3453J7056M3312o9994
531e2022J3043R7720p3720n9221J00240j0952o3109P8895J8407n8717L5980k583
543B3961m2649O0001l106o9005O6285L1075q6746K2210L2430p3284K4131M9974
555C5277o0327K1873M7176r0193n999Q7935n2839l6882Q1852q638l9196L0825
567A0864k6311j0202N2917m5381j7180J00171m0581r6305Q5164K8437j04868K8917
579c4358P2010l5995o693N335k6360L5155q597o1039Q2153N8566j08981P443R6233
$$ plain form
592 74872 2601 -45681 37777 34973 4933 39550 10284 -4722 38389 -16453 -48161 34173
604 34173 10970 -46440 27287 21622 -66547 -30632 -7574 -48577 10432 30518 -48331 -15346
616 -15346 30049 -39259 -27112 33048 -7317 -5788 38811 7281 11443 23984 -48863 -18139
628 -18139 77006 5781 -41714 50829 26618 -56359 -6719 20816 -16583 1267 9297 11415
640 11415 39125 -25385 -67918 39933 49474 -47497 11448 68236 -25569 -31183 36350 40
652 40 -25885 -4456 -9156 29386 36902 -54968 -46661 22800 -32027 -38508 48759 6290 -52116
665 -52116 6605 2818 -31208 14884 1978 -25214 44700 39253 -27971 11371 23934 -27064
677 -27064 13447 39332 -5192 22825 27326 -38403 1036 33607 -50432 -24991 65971 5405
$$ packed form
592G4872p2271m8282Q3458k804l0040L4617k9266j5006M3111n4842l1708Q2334
604C4173k3203n7410P3727n665q8169L5915K3058m1003N9009K0086p8849L2985
616a5346M5395o9308J2147O0160m0365J529M4599l1530M162J2541p2847L0724
628a8139R5145p1225m7495R2543k4211q2977M9640K7535l7399J7850Q030K118
640A1415K7710o4510m2533J07851R541r6971N8945N6788r3805n614O7533l6310
652D0k5925K1429m700L8542P516r1870Q307O9461n4827o481Q7267m2469n8406
665e2116N8721l787l4026M6092j2906k7192O9914n447o7224L9342J2563n0998
677b7064M0511K5885m4524K8017M501o5729L9439L2571q4039K5441R0962o0566
$$ plain form
689 5405 -43947 6992 -7659 -30815 3094 -3373 4737 29995 -28785 -28557 53025 -2692 -69034
702 -69034 24388 47192 -30979 1047 35839 -18381 -25397 -8991 -9656 29622 14548 -37583 13695
715 13695 30020 -51748 -19729 48672 -8015 -17702 36708 1434 -15454 22054 -9937 -15105
727 -15105 34199 991 -13557 39846 3033 -37570 13664 -432 -29862 30689 16456 -38191
739 -38191 15015 12982 -57068 -1717 41548 -26290 -14929 30355 -8871 -12524 7225 -20180
751 -20180 7416 28600 -30537 -2081 57535 -20237 -46878 37179 12062 -37941 19956 30164
763 30164 -13101 -3874 -8116 -10054 23119 -6568 -24559 38234 13720 -49786 10809 34591 -34531
776 -34531 -12738 28753 -9013 -2501 14956 -20819 -3504 15509 -27444 -1137 37518 -18278
$$ packed form
689E405m9352N0939j4651k3156L3909o467Q110K5258n8780K28Q1582n5717o6342
702f9034R3422K2804p8171L2026L4792n4220p016J6406o65L9278j5074n2131N1278
715A3695J6325q1768L2019O8401n6687r687N4410l5274j6888L7508l1991n168
727a5105M9304l3208j4548N3403l6813m0603N1234j4096k9430O0551j4233n4647
739c8191N3206k033p0050N5351M3265o7838J1361M5284l9226l653J9749k7405
751b0180K7596K1184n9137K8456N9616p7772k6641Q4057k5117n0003N7897J0208
763C0164m3265R227m242j938L3173k9687j7991O2793k4514o3506O0595K3782o9122
776c4531K1793M1491l7766O512J7457l5775J7315J9013m2953K6307L8655n5796
$$ plain form
788 -18278 -15738 31954 -17450 -25759 36491 1190 -24418 33729 6923 -33347 21941 14210 -30567
801 -30567 14338 17845 -24433 10246 12826 -28269 9072 11322 -41002 9489 39427 -34293 -18741
814 -18741 35157 -16471 -24979 26841 2067 -12715 14922 -7463 -4409 24873 -16831 -18092 35267
827 35267 -3156 -29661 28981 8391 -37741 12329 19455 -22418 3669 9964 -14974 15671
839 15671 9636 -27505 13902 23068 -23656 12488 31533 -28223 -5017 35491 -16351 -11171 30181
852 30181 -17304 -22965 27065 -6890 -26477 11726 -14915 -23681 24667 -8248 -35749 18566
864 18566 1094 -33840 24421 17984 -37862 11406 33881 -18909 3693 26796 -13117 5778
876 5778 27079 -10662 6194 22150 -24333 -121 36144 -21128 -22986 28507 -7961 -22807
$$ packed form
788a8278K540M7692m9404q309O2250l5301k5608N8147k6806m0270N5288p731m4777
801c0567M4905L507m2278L4679K580m1095L7341K250n2324N0491K9938p3720J5552
814a8741N3898n1628q508N1820k4774j4782K7637k2385L054K9282m1704j261N3359
827C5267l8423k6505N8642k0590m6132N0070P126m1873K6087O295k4938L0645
839A5671o035l7141M1407R166m6724L6144J9045n9756K3206M0508n1842N180M1352
852C0181m7485n661N0030l3955j9587L8203k6641q766M8348l2915k7501N4315
864A8566j7472l4934N8261o437n5846M9268K2475n2790K2602K3103l9913J8895
876E778K1301l7741J6856J5956m6483K4212L6265n7272j858N1493l6468j4846
$$ plain form
888 -22807 22084 -5012 -27076 15095 2519 -14923 16115 -5704 -20553 25195 5277 -26974
900 -26974 19659 10457 -32500 12893 21226 -31101 -3006 16493 -24682 -2820 15513 -26806
912 -26806 -6876 19909 -21655 -5153 26140 -20615 -9460 39005 -6839 -16579 37873 6500
924 6500 -16553 33456 13122 -18379 24747 13091 -19049 19710 8679 -29070 12399 11358
936 11358 -35383 1837 13354 -37286 -7362 19403 -30565 -16041 18257 -18859 -11621 19248
948 19248 -15492 -9737 25122 -9239 -10135 27574 -5622 -13970 29891 1174 -20035 22895 5164
961 5164 -20798 19079 7543 -22362 14482 8982 -22068 15664 13591 -25513 12381 23005 -21000
974 -21000 7742 24710 -21180 3413 30824 -17903 -6810 28249 -16374 -15429 24388 -14861
$$ packed form
888b2807M4891k7096k2064M2171j2576j7442L1038k1819j4849M5748j9918l2251
900b6974M6633r202m2957M5393Q333n2327K8095J9499m1175K1862J8333m2319
912b6806J9930K6785m1564J6502L1293m6755J1155M8465m5844r740N4452l1373
924F500k3053N0009k0334l1501M3126j1656l2140L8759j1031l7749M1469j041
936A1358m6741L7220J1517n0640K9924K6765m9968J4524L4298l7116P238L0869
948A9248l4740N755L4859l4361q96L7709l3196q348M3861k8717k1209M2930j7731
961E164k5962L9877j1536k9905L6844n500l1050L7732k073l9104L7894J0624m4005
974b1000K8742J6968m5890K4593K7411m8727J1093L5059m4623R45L9817l9249
$$ plain form
986 -14861 -23614 18673 -13242 -27887 16678 -11073 -34176 14631 -1490 -32853 14505 9601
998 9601 -30048 10715 19582 -20445 9626 22959 -13742 12787 27712 -15105 7097 30814
1010 30814 -13732 -1324 31665 -8615 -9980 22029 -9971 -12675 19469 -12005 -17010 21231
1022 21231 -8976 -23903 18936 -3972 -28461 15806 7248 -22378 11105 5732 -22784 12234
1034 12234 6991 -27114 12925 17556 -29588 2074 23196 -25733 -9751 20974 -15796 -5720
1046 -5720 21655 -16489 -8964 25200 -13927 -13247 32592 -2558 -17389 32051 8195 -20780 20784
1059 20784 10109 -15266 23246 12376 -20915 16704 12782 -29930 5170 18919 -24953 -3809
1071 -3809 15568 -20320 -6765 6677 -28342 -5321 21270 -21566 -11882 24912 -14805 -21305
$$ packed form
986a4861q753M2287l1915j4645M4565k7751k3103M8807j6121l1363M7358m904
998I601l9649M0763Q867m0027L0071J3333l6701K6529J4925m2817K2202K3717
1010C0814m4546J2408L2989m0280j365L2009l2000k704L2144l1474n005L8241
1022B1231l0207j4927M2839k2908k4489M4267q558k9626L3483n373k8516L5018
1034A2234n243l4105M0039M631m7144L1662K1122m8929J5982L0725l6770J0076
1046e720K7375l8144P525L4164l9127O80M5839l5150j4831M9440k3856k8975M1564
1059B0784j0675k5375L8512j0870l3291L7619l922m2712L5100J3749m3872K1144
1071c809J9377l5888J3555J3442l5019K3021K6591m2836R684L6794l9717o500
$$ plain form
1083 -21305 20817 -178 -12899 18107 2257 -3460 21095 -9374 -17019 29500 3885 -23671
1095 -23671 27419 18295 -29790 3085 16270 -16968 3500 9422 -16119 13545 14846 -30806
1107 -30806 -260 22962 -25429 -5254 35286 -10148 -17547 20094 -8086 -15297 18834 -6827
1119 -6827 -12417 26749 -3158 -26144 16086 -232 -30158 12325 15061 -15381 7012 1095 -24249
1132 -24249 12014 10887 -28188 10071 30877 -17029 -4828 22335 -11995 -9048 15439 -1581
1144 -1581 9948 19694 -19751 -4748 26252 -21794 -21255 35009 2828 -28273 15063 7729 -23736
1157 -23736 -2806 -3861 -7932 21367 -2651 -24572 21943 7915 -39139 6826 29685 -16708
1169 -16708 505 24865 -10810 -5262 11094 -15857 2149 24369 -12058 -1785 26558 -18018
$$ packed form
1083b1305M2122k0995j2721L1006j5850n717K4555l0469p645M6519k5615k7556
1095b3671N1090r124m8085L2875J3185l3238K0468N922k5541K9664J301m5652
1107c0806L0546K3222m8391K0175M0540m5434p399L7641k8180p211L4131k5661
1119f827n590L9166k9907k2986M2230j6318k9926M2483K736l0442K2393n917k5344
1132b4249L6263j127l9075L8259K0806m7906J2201K7163l4330K947K4487j7020
1144a581J1529R746l9445J5003L1000m8046N39N6264l2181l1101M3336p334l1465
1157b3736K0930j055m071K9299k4018k1921M6515j4028m7054M5965K2859m6393
1169a6708J7213K4360l5675N548J6356k6951J8006K2220l6427J0273K8343m4576
$$ plain form
1181 -18018 -24587 19575 -1357 -14406 19090 -1344 -15553 16178 -8492 -28627 18603 10185
1193 10185 -24576 14681 22591 -19293 -7679 1814 -11856 16487 14578 -20015 11862 20628 -30365
1206 -30365 -6955 30196 -15437 -16849 29298 7655 -12832 2451 -11106 -4292 16504 -11629
1218 -11629 -3706 33699 -10164 -32638 23697 10882 -31666 5965 21593 -4801 7216 -1195
1230 -1195 -24022 7688 8850 -20364 12845 19467 -27224 -5211 20858 -20615 -14745 15366 -9773
1243 -9773 -1743 24344 -13196 -17956 15434 -10691 -14681 30393 10923 -16974 11217 6081 -8284
1256 -8284 14001 -2086 -12068 31645 14914 -27371 10796 19144 -27802 -6406 22461 -6775
1268 -6775 -5390 5639 -13277 -1185 460 -29381 666 25833 -21338 -13195 28350 -14490 -32245
$$ packed form
1181a8018o569M4162k0932j3049L3496k0434j4209L1731k4670k0135M7230q418
1193A0185l4761L9257P910m1884J1614R493j3670K8343j909l4593L1877Q766n0993
1206c0365K3410L7151m5633j412M6147k1643k0487J5283j3557O814K0796k8133
1218a1629P923L7405m3863k2474N6335j2815m2548L7631J5628k6394J2017q411
1230a195k2827L1710J162k9214L3209O622m6691K2013K6069m1473N870L0111k5139
1243i773Q030K6087l7540m760L3390k6125l990M5074j9470k7897K8191n136j4365
1256h284K2285j6087r982M3713j6731m2285L8167Q348m6946K1396K8867k9236
1268f775J385J1029j8916J2092J645k9841L0047K5167m7171Q143M1545m2840j7755
$$ plain form
1281 -32245 18174 11964 -10974 9347 1897 -4899 16900 -7017 -18620 23399 8459 -21378
1293 -21378 19175 18972 -24323 -533 12451 -17349 5340 20952 -12678 274 15851 -17187
1305 -17187 -4664 20506 -7965 -2365 23012 -6470 -8055 16818 -11394 -12598 22863 -6692
1317 -6692 -22454 21359 3818 -31577 -747 3582 -19868 144 1663 -12877 8165 -5046
1329 -5046 -29014 12247 18511 -23594 5266 30927 -12342 -6700 26132 1187 -3704 17139 2688
1342 2688 7116 19129 -10845 -4034 22741 -12970 -18557 24932 2290 -24416 8516 769 -23129
1355 -23129 4191 2206 -16781 10185 5361 -21329 6396 10259 -18905 6011 15007 -17595 3664
1368 3664 19548 -17585 -5753 17794 -16947 -11385 21305 -7996 -16632 13657 -5522 -15484 11667
$$ packed form
1281c2245N0419o210k2938K0321p450o796K1799k3917j1603M2019j4940k9837
1293b1378M0553k03m3295K3790J2984k9800K2689J5612l3630J2952J5577l3038
1305a7187J2523K5170k8471N600K5377k9482j585K4873k8212j204L5461k9555
1317f692j5762M3813j7541l5395L0830M329k3450K0012J519j4540K1042j3211
1329e046k3968M1261O264m2105K8860K5661m3269N642L2832k4945m891K0843j4451
1342B688M428J2013k9974O811K6775l5711n587M3489k2642k6706L2932p747k3898
1355b3129K7320j985j8987K6966m824k6690K7725L863k9164K4916Q996l2602K1259
1368C664J5884l7133J1832K3547l4741N562L2690k9301q636L0289j9179r962K7151
$$ plain form
1381 11667 -1244 -7102 18210 -1545 -12538 24192 8973 -17070 20594 21172 -14643 8174
1393 8174 21270 -7115 1935 8706 -11809 3544 8058 -18610 -1310 7057 -27651 -11110 15906
1406 15906 -19179 -18740 12806 -10624 -16646 12205 -4459 -12265 14593 263 -7360 19840 1476
1419 1476 -12679 21055 9279 -15381 15925 11835 -19097 10278 16425 -20438 -2478 14809
1431 14809 -12677 -1313 13350 -13848 -4791 13701 -8962 112 18481 -12966 -7770 25513
1443 25513 -1862 -13685 17264 422 -15835 13009 5173 -15873 2246 -3270 -14639 7385
1455 7385 -4282 -23405 5432 3548 -22256 4232 10837 -21145 -522 19369 -7814 -260 16275
1468 16275 -5005 4251 21300 -3912 786 20262 -5243 -2212 23158 -6049 -14976 17534 -34
$$ packed form
1381A1667j2911n858K5312j9755j0993L6730j5219k6043L7664N78l5815K2817
1393H174J3096k8385R050O771k0515J5353M514k6668J7300Q367l4708J6541K7016
1406A5906l5085M39L1546k3430o022K8851j6664p806K6858j4330p623K7200j8364
1419A476j4155L3734j1776k4660L1306m090l0932K9375O147l6863J7960J7287
1431A4809k7486J1364J4663k7198R057J8492k2663R074J8369l1447N196L3283
1443B5513k7375j1823L0949j6842j6257K8844p836k1046J8119n516j1369K2024
1455G385j1667j9123K8837j884k5804K6488O605l1982K0623J9891k7183P554J6535
1468A6275k1280R256J7049k5212M698J9476k5505L031K5370k9207q927L2510j7568
$$ plain form
1481 -34 -17570 11286 -177 -21215 6215 3767 -17348 3745 2391 -17334 7046 8483 -16740
1494 -16740 4311 12431 -15685 2730 17755 -13825 -4790 17294 -7527 -7393 12763 -7654 -8444
1507 -8444 12245 -6974 -9649 13019 -5836 -11287 16283 -729 -15035 15270 6822 -13916 12397
1520 12397 11042 -12090 8792 11668 -9974 6987 10081 -12626 4881 12110 -15812 -2023 12700
1533 12700 -15177 -6679 13116 -13175 -11815 12777 -8237 -12505 11250 -4904 -11042 12569 -1742
1546 -1742 -11373 13177 1403 -12170 14314 5740 -14071 11163 9050 -14663 7056 11350 -14224
1559 -14224 2418 12577 -10993 -80 10120 -11720 -188 13020 -11774 -3670 15790 -9859
1571 -9859 -8910 15832 -5033 -12061 13620 -288 -11410 10507 -188 -11848 9946 564 -12930
$$ packed form
1481c4j7536K8856j1463k1038K7430k448k1115K1093j354j9725K4380J437k5223
1494a6740K1051Q120k8116J8415J5025l1580R035K2084k4821J34K0156k0417p90
1507h444K0689j9219k675K2668j8855n451K7570j7012j4306L0305q448k0738K6313
1520A2397j355k3132K0882K876k1642J6961L094k2707J7507P229k7922J3789J4723
1533A2700k7877Q498J9795k6291J360K4592k1014m268K3755j6154o138K3611j4311
1546a742r631K4550j1774j3573K6484q574j9811K5234k113k3713K1719M294k5574
1559a4224J6642J0159k3570J0913J0200k1840J1532J3208k4794Q104J9460k5649
1571i859R49K4742k0865p028K5681j3908j1122K1917j0695j1660K1794r382j3494
$$ plain form
1584 -12930 11231 4129 -16418 7712 9274 -15548 2570 10962 -11212 1749 11126 -11406 -29
1597 -29 12017 -11226 -2345 15264 -8246 -6536 13925 -5996 -8786 12392 -3644 -8626 13363
1610 13363 -1111 -11274 12116 359 -14784 10820 6609 -13304 6327 6804 -11785 4060
1622 4060 5159 -13152 5303 9745 -14227 1384 12838 -13478 -5399 13144 -6746 -3528 12394
1635 12394 -5732 -3944 12710 -7047 -6518 16013 -2292 -9715 15780 1855 -14237 7709 3054
1648 3054 -11257 7284 2935 -12191 7030 2174 -18421 3887 9515 -16137 -641 13530 -8809
1661 -8809 -4259 8203 -8046 -554 12358 -6396 207 16582 -7039 -8158 15796 -547 -10615
1674 -10615 12160 4279 -7846 6821 -1639 -10363 7396 -1067 -11811 11439 5372 -16952 2779
$$ packed form
1584a2930K4161p102k0547K4130J562k4822J8118Q392k2174J2961R377k2532J1377
1597b9J2046k3243Q881J7609k3510J710K0461j9921k790K1178j6036m982K1989
1610A3363j4474j0163K3390j1757j5143K5604m211j9913J9631M77j8589J5845
1622D060J099j8311J8455M442k3972J5611J1454k6316Q079J8543j9890L218J5922
1635A2394j8126J788J6654j9757N29K2531j8305p423K5495j3925j6092K1946m655
1648C054j4311J8541m349j5126J9221m856k0595K2308N628k5652J5496J4171k2339
1661h809M550J2462j6249P492J2912j8754O603J6375k3621j119K3954j6343j0068
1674a0615K2775p881j2125J4667q460q724J7759q463j0744K3250o067k2324J9731
$$ plain form
1687 2779 8265 -12580 169 8738 -7026 4289 8464 -12075 2 10967 -12657 -3265 16988
1700 16988 -5323 -9227 8942 -5723 -9538 7524 -5487 -7104 13341 -3102 -13078 12121 1380
1713 1380 -17169 9025 13774 -6674 4777 8607 -5754 5277 5365 -8357 10226 13504 -12124
1726 -12124 1034 15106 -11892 -11843 9802 -2343 -6021 5329 -6368 -6869 3151 -12474 -8742
1739 -8742 13157 -4242 -12220 12454 3007 -14495 3542 4375 -6433 8624 5927 -5871 9450
1752 9450 3693 -15158 5303 12227 -10166 1444 12687 -7157 -3115 5989 -10003 -878 12338
1765 12338 -7088 -1509 16961 -6467 -13405 11695 2890 -7630 9586 4343 -4767 6481 -3844
1778 -3844 -10290 9416 -477 -15932 9800 9852 -18029 -6752 5293 -10864 -4564 5060 -4454 1529
$$ packed form
1687B779N486k0845J2749Q569j5764J1315M175k0539J2077J0965k3624R392K0253
1700A6988k2311l904J8169j4665l815J7062j3011j617K0445j6443r976K5199j0741
1713A380j8549K6194M749k0448J1451L830j4361J1031Q8j3722J8583L278k5628
1726a2124J3158J4072k6998M9K1645j2145l678J1350j1697n01J0020j5625L732
1739h742K1899j7399p978K4674r447j7502J8037Q33j0808J5057k697j1798J5321
1752I450n757j8851K0461O924k2393J1610J1243j9844M042R104j5992R125J3216
1765A2338j9426N579J8470k3428o938K5100q805j0520J7216n243r110J1248j0325
1778c844o446J9706r893j5455K5732N2k7881J1277J2045j6157O300R624r514N983
$$ plain form
1792 1529 2784 -12505 1490 11449 -10995 -2472 20185 1534 -6015 11411 808 -5724 9753
1805 9753 3228 -156 12719 -1387 -9613 10267 644 -14965 5038 6886 -8788 3305 2022
1818 2022 -14065 -331 3383 -11769 4038 11243 -12245 -4230 11072 -6995 -7295 6917 -2337
1831 -2337 646 9713 -6941 -4712 9124 -9921 -10580 16106 2963 -13756 6450 5506 -10512
1844 -10512 874 2783 -3536 8557 3728 -6676 10561 6117 -14136 5743 16947 -6890 -1091
1857 -1091 14088 -2236 -4942 4821 -5502 -2564 7223 -6783 -4300 7931 -10382 -14385 6116
1870 6116 -2954 -10804 5615 -707 -9921 4812 -448 -10249 6674 4967 -7374 8530 9687 -7044
1884 -7044 2867 7244 -5497 5630 9105 -6209 4816 10468 -12137 -3512 13304 -6537 -7468
$$ packed form
1792A529J255j5289J3995R959k2444Q523K2657j8651p549J7426j0603o532J5477
1805I753o525l384J2875j4106q226J9880r623j5609K0003J848j5674J2093j283
1818B022j6087J3734L714j5152J5807P205k3488Q015J5302j8067l00J4212r254
1831b337K983R067j6654K229J3836j9045o59K6686j3143j6719K0206r44j6018
1844a0512J1386J909o319J2093m829j0404J7237m444k0253J9879J1204k3837N799
1857a091J5179j6324k706R763j0323K938R787j4006K483J2231j8313m003K0501
1870F116r070p850J6419o322r214J4733n260r801J6923j707j2341J5904J157j6731
1884g044R911M377j2741J1127L475j5314J1025N652k2605Q625J6816j9841r31
$$ plain form
1897 -7468 12084 -425 -8223 4712 -3057 -4368 8573 -3390 -6367 12935 -23 -12729 8967
1910 8967 5102 -14347 3366 10189 -7859 -1705 2997 -9199 -1387 2798 -9576 882 6099
1923 6099 -11961 -3567 9451 -7036 -6081 9164 -1192 -2065 10834 -256 -3390 10651 1444
1936 1444 -3059 11270 3873 -3902 8854 1418 -7461 6434 1233 -9569 6571 3537 -14129
1949 -14129 414 4927 -12817 -2174 7112 -8531 -3643 5860 -6029 -456 6646 -9045 -1156
1962 -1156 13696 -5635 -6898 13229 -1252 -10867 8582 3354 -8599 5094 2073 -7896 3923
1975 3923 764 -7955 6017 3619 -10024 5362 8280 -8726 1709 10258 -5912 -461 10260
1988 10260 -2075 -12 7310 -4957 -1777 7934 -4276 -3837 6112 -6120 -6176 7247 -5915 -10633
$$ packed form
1897g468J9552j2509p798J2935p769j311J2941j1963k977J9302j2958j2706K1696
1910H967l865j9449J7713O823j8048O154M702j2196P812M185j2374J0458N217
1923F099j8060Q394J3018j6487R55J5245j0356q73J2899j1090l134J4041r207
1936A444m503J4329p397p775J2756p436q879J3895n201j0802J6140l034j7666
1949a4129J4543M513j7744J0643R286j5643M888R503j1889N573P102j5691P889
1962a156J4852j9331j263K0127j4481r615J9449n228j1953J3693l021r969J1819
1975C923l159q719J3972k398j3643J5386K918j7006J0435Q549j6170N451J0721
1988A0260j2335K063P322j2267L180R711j2210M39R949j2232n6J3423j3162m718
$$ plain form
2002 -10633 6571 -1754 -10635 5151 943 -9534 4208 3604 -6609 5085 4037 -6538 6919
2015 6919 7333 -8387 4033 8927 -8245 2052 12561 -7437 -5870 8977 -2778 -4191 6819
2028 6819 -4881 -5521 7648 -3054 -5783 7974 -2688 -8855 9340 2763 -9216 5718 4244
2041 4244 -8552 4301 5934 -7599 866 4454 -6419 1709 3932 -9460 3 6506 -7682
2054 -7682 -2192 7000 -7082 -3401 9419 -3896 -5209 7691 -1102 -3932 8360 -192 -4352 7386
2068 7386 -43 -4436 8719 397 -8824 7109 3488 -9407 4046 4379 -9934 1412 5934 -7960
2082 -7960 -507 5094 -6866 400 6294 -7701 -759 9004 -6489 -3642 10367 -3997 -6231 9409
2096 9409 -553 -7206 7073 618 -6791 6032 1026 -7025 5237 2032 -7434 5392 3435 -9044
$$ packed form
2002a0633J7204q325q881J5786m208j0477J3742o04j0213J1694j048j0575J3457
2015F919M14j5720J2420M894j7172J0297J0509j9998J567J4847j1755j413J1010
2028F819j1700o40J3169j0702k729J3757j0662o167J8195o577j1979J4934j474
2041D244j2796J2853J633j3533Q465L588j0873Q128K223j3392R463O503j4188
2054g682N490R192j4082L681J2820j3315j313J2900q793k830J2292q552m160J1738
2068G386p429m393J3155q322r221J5933l621j2895J3453L33j4313J1346M522j3894
2082g960P453N601j1960P266N894j3995O942R763j5493K847J4009j4364k234J5640
2096I409r962o653J4279o455p409J2823n006q051J2262l205r466J2826j957j2479
$$ plain form
2110 -9044 3237 6261 -7993 822 6813 -6613 -534 7108 -5452 -1982 6242 -4699 -2134 6599
2124 6599 -4788 -3320 7216 -4249 -4999 8178 -2083 -7029 7994 1185 -7459 5451 2248
2137 2248 -6620 5305 3153 -6402 4787 3071 -8178 4168 5088 -9683 1460 7860 -7729
2150 -7729 -2059 7572 -5917 -3258 6645 -4034 -2683 7084 -4316 -3950 8623 -3109 -6349 8675
2164 8675 -32 -7471 6517 1474 -7711 4429 2087 -7184 4511 3288 -7964 3047 4805 -7708
2178 -7708 1629 6568 -5724 1089 7522 -4945 9 7542 -4831 -1139 9349 -3222 -4040 7854
2192 7854 -1959 -5955 5001 -1793 -5617 5150 -2058 -6904 5205 -1792 -9542 5026 3172 -8881
2206 -8881 3240 5277 -6639 1548 4798 -5385 2911 6266 -5499 2774 8119 -7050 -1904 9297
$$ packed form
2110i044J2281L024j4254Q815N991j3426O079P642j2560L470Q224j0941K565Q733
2124F599j1387J468J0536j1465p50J3177j0261m946J5023o809q644J2910l203
2137B248q868J1925k152r555J1189j716j1249J2346R20j4771J1143O400j5589
2150g729N670R631j3489K659R903j0679J351R767j1400L66J2573j1732l240J5024
2164H675q707p439J3988n043r185J2140k342r271J1695j223j1252J1011J758j2513
2178g708R337M939j2292O813O433j2467M954P533j2373L692J0488j2571q18J1894
2192G854r813l996J0956o794l824J0767p208m846J2109o997p750J4568j854j2053
2206h881J2121K037j1916Q187L250j0183Q296L355j1765Q273N345j5169N146J1201
$$ plain form
2220 9297 -4088 -3867 8168 -2168 -4961 5763 -2813 -5671 6653 -1499 -6250 8351 1278 -8705
2234 -8705 4745 3769 -6658 3786 4642 -4958 3122 3260 -7582 1641 4672 -8320 -276 6986
2248 6986 -6731 -4362 4114 -5498 -3849 4176 -3957 -1810 6798 -4556 -4354 8478 -1298 -5533
2262 -5533 9119 4026 -4061 6300 3004 -4566 5396 2149 -5407 6780 4331 -8953 2158 5269
2276 5269 -9313 -2411 6125 -5235 -1779 4336 -6213 -2395 4520 -7380 -3021 9336 -2600
2289 -2600 -5473 7342 -535 -6683 4399 1101 -3489 5331 25 -5362 5425 -715 -9236 4626
2303 4626 4771 -7461 2215 5788 -5949 -479 3934 -3886 3070 6451 -5243 2412 8763 -5699
2317 -5699 -2943 8987 -1436 -3066 7879 -726 -4600 3825 -3729 -5481 5757 -1771 -7773 5212
$$ packed form
2220I297j3385K21J2035j0336k793J0724q576k858J2324q152m751J4601p073r983
2234h705J3450r76j0427J0444Q56r600Q080J38j0842R223L031j2992Q044P262
2248F986j3717K369Q476r612J649Q025q133K147Q608j1354K02J2832r776m235
2262e533J4652n093q087J0361l296p570R962l247p556J2187k449j3284J1111L111
2276E269j4582O902Q536j1360L456O115j0549L818O915j1900M359J2357j1936
2289b600k873J2815p877o148J1082l298m590Q820n306n387J0787o140q521J3862
2303D626J45j2232R676L573j1737N470M413p820O956L381j1694P655O351j4462
2317e699K756J1930j0423j630J0945q605l874Q425p554j752J1238p528o002J2985
$$ plain form
2331 5212 654 -9855 854 1886 -7056 1953 3630 -4267 2965 2292 -7731 2773 7584 -5723
2345 -5723 588 9343 -2758 -2661 5553 -2476 -1393 5452 -3033 -328 8118 -4605 -6815 7029 -757
2360 -757 -7200 6287 3345 -6046 2735 1694 -5216 3012 1252 -6019 5819 4869 -8302 641 5181
2375 5181 -7656 -2084 6234 -3268 -1810 3510 -5093 -2314 4537 -5602 -3630 7512 -1397 -4359
2389 -4359 5555 -1097 -4792 4926 1135 -2332 6773 961 -5152 6272 2412 -7348 4142 5810
2403 5810 -4839 1506 4323 -5210 -334 1956 -6348 2272 5564 -7971 -1869 7540 -5611 -6210
2417 -6210 6174 -1445 -4791 4915 -404 -3898 3897 -2591 -4512 7194 667 -6548 6171 3170
2431 3170 -7695 2202 4579 -4851 1409 4107 -3663 1749 2820 -6312 1230 5758 -4910 -398
$$ packed form
2331E212m558j0509J0709J032q942R009J677p897P232o73j0023J0504M811j3307
2345e723O311Q755j2101R7Q214q029J083O845q485K705Q446j2723k210J3844p786
2360g57o443J3487k942r391Q781j041o910Q228j760p271J1838r50j3171Q943M540
2375E181j2837N572Q318r502J458N320q603K779O851j0139J972J1142q909k962
2389d359R914o652l695R718l791l467R105n812o113J1424l860r760J1490J668
2403E810j0649O345K817r533M876K290q304Q620L292j3535O102R409j3151n99
2417f210J2384p619l346R706n319l494P795o488j921J1706o527p215J2719l001
2431C170j0865R897K377r430O260K698p770N412J071r132P542M528j0668M512
$$ plain form
2445 -398 6346 -3042 -2206 4810 -3314 -1956 5873 -1996 -2488 6800 -2003 -6447 5020 260 -5520
2460 -5520 3990 1346 -5298 3035 33 -6302 3603 1650 -7505 3258 5641 -7208 -819 5773
2474 5773 -4281 -1575 5243 -2058 122 5025 -3956 -802 6557 -3840 -3139 8094 -483 -5465
2488 -5465 5159 378 -5499 3637 932 -4697 3061 434 -5284 3382 1030 -6781 2547 4011 -5076
2503 -5076 1110 4364 -5345 -51 4661 -4016 100 5809 -4128 -1858 5668 -2491 -3088 4527 -2080
2518 -2080 -2463 5260 -1900 -4411 5000 -900 -5638 5218 1493 -6226 3368 3024 -5050 1535 2656
2533 2656 -3777 2449 3053 -4730 2271 3970 -6071 663 6325 -4877 -2396 5697 -2460 -3138 4300
2548 4300 -2402 -2965 4508 -1962 -2999 5193 -1535 -4607 5216 514 -5104 4632 2449 -5188 2824
$$ packed form
2445c98O744r388Q36P016q124J358P829p869m92R288q803m444J1467m760n780
2460e520R510k644o644Q333l002o335R905j953r155J0763K383j2849O389O592
2474E773j0054K706O818p301K180M903q981L154P359j0397P01J1233q577m982
2488e465J0624m781n877R136k705n629P758k627n718Q666k352p811R328J464r087
2503e076O186L254r709N294M712q677M116N709r937K270P526q159n97P615o607
2518b080l83P723p160k511R411n900m738J0856l725p719R594l44q074O585J121
2533B656o433O226O04p783P001J699j0041O734N662j1202K481Q093q157o78P438
2548D300o702n63P473o470j037Q192o728l072R823m702n618R736k183p637Q012
$$ plain form
2563 2824 2995 -4682 2152 3639 -4639 951 3758 -4383 424 3606 -4706 -790 4594 -4058 -1562
2578 -1562 4988 -3813 -3154 5440 -1404 -3729 4274 -442 -3218 4133 -263 -3573 4089 261 -4073
2593 -4073 4567 1249 -5710 3506 3428 -5145 1717 3585 -4660 717 4094 -3710 -363 3536 -4092
2608 -4092 -9 5039 -3926 -2260 4901 -2918 -2951 5320 -1591 -4477 4377 263 -4096 3530 291
2623 291 -4453 3178 1503 -4314 2692 1394 -4774 2716 3129 -4953 1137 3732 -4529 350 4392
2638 4392 -3401 -937 4641 -2393 -968 3701 -2493 -1144 4946 -2086 -2240 4871 -1383 -3475 5095
2653 5095 326 -4872 3456 983 -4077 2451 1347 -4685 1520 1178 -4578 1504 2072 -5490 899
2668 899 3622 -4835 -575 4421 -3297 -1356 4606 -2205 -1577 4551 -1401 -1703 4596 -979 -2271 4879
$$ packed form
2563B824J71p677O834J487q278N590K807q141M807L182q312L916N384q652K496
2578a562O550q801O59Q594o844k325Q003m716k776P351m396l310P662l828m334
2593d073Q640l318o959R216p8q573O862J868q245N377L377p804L347L899p628
2608d092M083N048q965J666P161p819l3Q271o911k886Q854m114m359P626l239
2623B91m744P631j675n817P006j298o168P490M13q082O090K595q261M879M042
2638D392p793K464N578p034J425M669o194J349O090p032j54P111o254k092Q570
2653E095m769n198Q328k473n060O528j104o032O205l42n756O082N68p562O389
2668H99K723q457M260M996p718J941N962o811O28O128n952l02O299n575j292P150
$$ plain form
2684 4879 -514 -3491 4103 475 -4310 3424 1495 -4653 2010 1958 -4284 1473 2212 -3899 698 2930
2700 2930 -3804 679 3277 -3782 97 4156 -3327 -1642 4482 -2436 -2449 3730 -1295 -3344 2933
2715 2933 -1257 -3118 3138 -893 -3373 3851 476 -4408 3357 1912 -4309 2644 3663 -3333 1638
2730 1638 3333 -2818 1443 3260 -3116 446 3755 -3558 -950 3851 -3245 -2544 3398 -2419 -2875
2745 -2875 3323 -1848 -3684 2964 -932 -3657 3088 416 -3290 3032 1567 -3478 2295 1664 -3288
2760 -3288 2490 2714 -3959 1394 3276 -4022 -244 3997 -3014 -805 3254 -2232 -991 2805 -2620
2775 -2620 -901 4429 -1788 -2087 4493 -689 -3164 3546 770 -3144 2734 944 -2687 2182 -84
2790 -84 -3755 1957 1231 -4535 1250 2011 -4386 -174 2562 -3642 -560 2798 -2346 68 3577 -2814
$$ packed form
2684D879n393k977P594l628m785P734j929o148O663n2o242N757P39o111M597K232
2700B930o734M483K598p059L879M059p483J685O124o918j3O179n025k049O277
2715B933m190j861O256m031k480P224l375m884P765j445o221O953J019o996M971
2730A638J695o151M261J817o376L562L309p313K608M801p096P01N942n817m56
2745b875O198n171j836O648l896k725O745k672l706O322j465n045N773o31m952
2760c288N778K24o673N353J882p298L778M241p011K209M059n486J241L796n425
2775b620J719N330o217k99O580n182k475O710k776l914N878j790l631M869k266
2790h4l671N712p26n766N785P61o397M212K736o204L082L358n144K414L509o391
$$ plain form
2806 -2814 -906 4334 -1354 -1627 4650 -236 -2161 3480 -119 -2577 3198 -194 -3284 3369 803
2821 803 -4406 1459 1544 -4112 915 2313 -2724 547 1997 -2875 657 2312 -3398 510 4479 -2271
2837 -2271 -1706 3703 -1595 -2231 2562 -729 -1314 2574 -1736 -2593 2976 -1354 -3938 3330 1053 -3461
2853 -3461 1977 1673 -3266 1215 1784 -2565 2229 2069 -3162 1518 2780 -3767 -277 3749 -1857 -1065
2869 -1065 2944 -1834 -1332 2090 -2604 -1676 3351 -1443 -2706 3664 -453 -3801 2168 899 -2212
2884 -2212 1992 918 -2178 2266 649 -3408 1939 2577 -3677 1445 3411 -2948 -811 2186 -1944
2899 -1944 -189 2120 -2346 123 3087 -2562 -1709 3465 -1272 -2396 3450 514 -2125 2022 -600
2914 -600 -2184 2741 -362 -2828 3045 931 -3949 1291 1802 -3489 421 2493 -1750 689 1315 -2718
$$ packed form
2806b814J908N240n688k73O277m886j925N641l599k458N775l392l090O653k566
2821H03n209N865Q5n656N027J398n037L271J450m872L532J655n710L908L969o750
2837b271N65N409n298o36M793l291n85L888m310q57N569m330k584P268k277m514
2853c461N438l04m939M481N69m349M794j60n231M680J262o547L490M026n606P92
2869a065M009m778N02L422m694R28N027m794j263O370m117l348N969j269l111
2884b212M204j074l096M444j617m057N347O38o254N122J966o359K137K997m130
2899a944J755K309m466K469K964n649Q53N174m737j124N846k936k639M147k622
2914f00j584M925l103k466N873k114m880N240N11n291L910K072m243K439O26m033
$$ plain form
2930 -2718 444 2396 -2869 116 3925 -1846 -1642 3280 -889 -2085 2191 -289 -1061 2797 -1110
2945 -1110 -2500 2699 -625 -3243 2781 1263 -3059 1269 1253 -2636 759 935 -2300 1617 2140 -2730
2961 -2730 495 2272 -3088 -1063 3108 -1256 -807 1991 -1480 -1059 2149 -1991 -1517 3398 -746 -2194
2977 -2194 3051 142 -3006 1652 1148 -1551 1690 637 -2247 1941 358 -3571 1231 2042 -3190
2992 -3190 225 2618 -2517 -1230 1570 -1721 -382 2208 -1893 -195 2995 -2165 -1793 3292 -417
3007 -417 -2095 3070 607 -2050 1798 -4 -2174 1917 533 -2459 2035 931 -3063 758 1342
3022 1342 -2522 311 1712 -1672 529 1515 -2459 33 2514 -1893 -329 3267 -1086 -1548 1952
3037 1952 -940 -1508 1780 -805 -1179 2446 -1091 -2927 2216 -98 -3269 1862 1379 -2631 788 1287
$$ packed form
2930b718L162J952n265K985L809n771K04M922m169j196M276k480p72L858l907
2945a110j390N199l324k618O024j518m322M328j6l889L395J76l235L917N23m870
2961b730L225J777n360K025M171m364M49K798l471M21L208m140M74M915m144j448
2977b194N245k909l148M658n04k699L241j053k884M188j583l929M802Q11n232
2992c190L415K393n135J287K800l291J339K590m101J698L190n160L72N085l709
3007d17j678N165k463k657L848j802k170M091j384k992M494j104l994L821N84
3022A342l864K833J401l384K201R86l974K492K481m407J564L596m353m62L500
3037A952k892n68L288k585l74L625l537j836N143k314l171N131m83m010L419M99
$$ plain form
3053 1287 -1897 962 1301 -1888 1616 2455 -2349 265 2618 -2007 -649 2827 -1024 -1011 2012 -1187
3069 -1187 -1360 1522 -1380 -1591 2097 -835 -2074 1988 -196 -2595 1485 573 -1925 1554 748 -2237
3085 -2237 1610 1359 -2764 512 1873 -1677 148 1614 -1899 -167 1755 -1809 -326 2310 -1803
3100 -1803 -981 2663 -949 -1846 2475 -236 -1539 2079 421 -1520 1577 203 -1534 2116 599
3115 599 -2432 1429 1296 -2479 371 1188 -2108 -145 1364 -1976 -136 1045 -2030 -452 1652 -1696
3131 -1696 -542 2211 -1284 -1042 2705 -655 -1262 2474 -48 -1480 2408 296 -1912 1830 712
3146 712 -1793 1651 914 -2057 1202 1147 -2426 928 1623 -2526 5 2307 -1839 -568 2289 -1299
3162 -1299 -993 1940 -1053 -852 1835 -872 -1160 2046 -739 -1734 1735 -143 -2202 1558 491 -2166
$$ packed form
3053A287l184K859L39l189L504Q39m804K614K353m625J358L476l851J3L023l199
3069a187j73K882k902k11L688k932j239M062k184k399M080r12k498L479q06k985
3085b237L847k51m123L276J361l550J825J466l513J732J922l564J483K636m113
3100a803Q22L644l612q97M321k711j303L618j658j941L097j374j737L650j517
3115E99l031L861j33l775K850Q17l296J963J509l340J840J181l075J578K104l348
3131a696J154K753l495K42L747l360o07L736k522j432L888k112k208L742j118
3146G12k505L444p37k971L259n5l573L354O95m149K531K302m146J271K857l588
3162a299L06K933k993K01K687k707k88L206k785r95L469j878k059L760j067k657
$$ plain form
3178 -2166 1063 542 -1663 1022 769 -2001 981 1217 -1754 845 1546 -1925 448 2264 -1464 -113
3194 -113 2351 -1204 -608 2222 -777 -1239 1766 -787 -1358 1959 -803 -2013 1525 -350 -1919 1458
3210 1458 -79 -2307 1019 920 -2260 570 1102 -1780 564 1322 -1545 302 1528 -1837 223 2183
3226 2183 -1579 -691 2465 -1304 -697 2055 -646 -1099 1537 -359 -1286 1613 -528 -1242 1766 -104
3242 -104 -1978 1424 703 -1755 1206 997 -2030 886 1381 -1865 253 1081 -1837 -69 1379 -1654
3258 -1654 -525 1475 -1796 -839 1748 -1139 -916 1841 -572 -1092 1698 -69 -1462 1666 464 -1325
3274 -1325 1609 615 -1423 1639 821 -1643 1424 1215 -2014 526 1463 -1810 -61 1376 -1625 -281
3290 -281 1355 -1259 -672 1430 -1222 -506 1556 -1105 -685 2075 -282 -1285 1777 -36 -1367 1583
$$ packed form
3178b166L229n21k205K685k53k770K982K36k971K599P01l471K373J816l728J351
3194a13K464l555N96K830k999m62L005k553n71L317k762j210L538j875j569L377
3210A458j537k228L326r9l180K830N32k882K344P58k867J847J226l365K060J960
3226B183l762Q88L156l769O07K752k701m53K636j896r27K899k141p14L008j870
3242a04j874L402p21k458K961k09l027K916M95l246K118Q28k918J768J448l033
3258a654J129K000l271R57K587k887K23K757k413n20K790j767j393L128j202j789
3274a325K934r94k038L062q18k464L067k09l229K540R37l273J749J437l001J344
3290b81J636k614N87K102k652P16K062k661M20K760k357j003L062j813j331K950
$$ plain form
3306 1583 304 -1459 1227 409 -1673 940 321 -1828 729 1006 -1588 417 1283 -1613 46 1459
3322 1459 -1091 21 1663 -935 -349 1790 -709 -815 1797 -445 -833 1793 -439 -1351 1246 -398
3338 -398 -1714 1486 134 -2298 1116 658 -1816 347 719 -1468 265 818 -1507 554 1270 -1476
3354 -1476 410 1679 -1285 -496 1902 -427 -873 1344 -566 -809 1231 -663 -891 1396 -540 -1391
3370 -1391 1424 -177 -1904 885 717 -1360 834 444 -1583 968 1097 -1473 459 1071 -1682 124
3386 124 1353 -1433 -530 1333 -1005 -193 1377 -991 -873 1611 -887 -1205 1756 55 -1248 1445
3402 1445 200 -1190 934 152 -926 1424 592 -1443 991 538 -1911 399 1361 -1489 -100 1126
3418 1126 -1273 -206 733 -1483 8 1523 -1050 -592 1557 -1008 -1195 1455 -28 -865 1252 -70
$$ packed form
3306A583j279j763K686q18k082K613o19k149K557K77k594K005Q66k896J659J413
3322A459k550J112J642k598N86K139k499j06K612k242l88K626k232r12K597j644
3338c98j316L200j352k432L414m58k474K163L72k187J733N53k325K061P16k746
3354a476J886J269k964P89K398k329m46K217j910k43K040j894k28K287j936q51
3370a391K815j601j727K789j68k077K194l90k027K551J29k570J932O12k753J806
3386A24J229k786R03J863k338Q12J570k368J18K484k498l18K961j701j303K693
3402A445j245j390K124p82j078K350q32k035K434m53k449K310R62k850J389J226
3418A126k399J067R39k216J491J515k573M58K149k565j87K650j483q37K117j322
$$ plain form
3434 -70 -650 1064 -569 -1411 1509 518 -1386 1054 723 -1550 349 731 -1311 625 1087 -1245 292
3451 292 1035 -1695 -112 1631 -1093 -654 1421 -379 -926 1166 -714 -877 1352 -296 -746 1348
3467 1348 -60 -1667 1169 424 -1279 696 704 -803 618 675 -1353 631 896 -1354 540 1440 -1513
3484 -1513 -281 980 -717 -451 1362 -963 -370 1056 -1107 -591 1463 -702 -1029 1582 128 -1219
3500 -1219 948 9 -1085 847 188 -1353 1131 252 -1662 517 900 -1677 158 1330 -963 -136
3516 -136 915 -1072 -13 1184 -992 121 1302 -919 -584 1814 -379 -999 1114 264 -1027 856
3532 856 -242 -1045 1167 -273 -1365 873 275 -1726 298 677 -1342 61 690 -1014 645 831
3548 831 -947 278 1048 -1302 -321 1447 -582 -270 1106 -132 -411 879 -366 -774 1367 -533
$$ packed form
3434g0n80J714j633q42K920r91j904K440l31k273J899L82k042J936M62k332J537
3451B92P43k730J583J743k724M39K075j800n47K092j880j63K229j648m50K094
3467A348j408j607K836p45j703J975Qj507J421N7k028J984K65k250J894R00k953
3484a513J232J261j697K66J813k325N93J426k163N16K054k165l27K611j454j347
3500a219K167r39j094J932o59j541K484q79j914K179L83k577J835J172k293Q27
3516a36J051j987J059J197k176J113J181k221L35K398k193o20K113q50j291J883
3532H56j098q03K212j440j092K238n98k001K024L79k019J403O29j704J659J86
3548H31j778J225P70k350R81J768k029L12J376j238k79J290j245m08K141j900
$$ plain form
3564 -533 -950 1270 -158 -1469 759 512 -1269 804 697 -794 572 436 -1149 859 956 -1292 538
3581 538 1303 -1000 -292 1228 -787 -435 880 -832 -415 1137 -845 -1012 864 -443 -1236 1029 213
3598 213 -923 1001 70 -612 948 353 -706 952 841 -1275 613 1111 -1194 101 971 -590 -8
3615 -8 858 -1094 -194 564 -819 -196 1213 -704 -557 991 -60 -1031 883 128 -583 948 13 -952
3633 -952 884 276 -1194 794 443 -1177 552 472 -1201 31 550 -952 292 906 -1123 210 1133
3650 1133 -736 -162 1288 -288 -328 1297 -432 -385 1088 -303 -854 908 -262 -1025 763 30 -1151
3667 -1151 417 384 -1107 453 159 -1245 406 616 -1254 388 677 -900 -149 1156 -731 -386 875
3684 875 -663 -150 932 -322 -502 966 -412 -583 1128 -83 -927 974 104 -829 551 105 -787
$$ packed form
3564e33m17K220j428j311K228k47j781K073j07j491J366j36j585K008R7k248J830
3581E38P65k303P08J520k015L52J315j712M17J552j982j67J876j307p93K265q16
3598B13j136J924r31o82J560n95j059J658j11k116J888M98k305J295Q70j561N82
3615hQ66j952R00P58j383O23J409j917J47J548j051r71J914p55p11J531r35r65
3633i52J836o08j470J988l51j620J729q0j673J232N19j502J244O14k029J333R23
3650A133j869N74J450j576m0J625j729M7J473j391n51J762j170p63J788p33j181
3667a151J568l3j491J560k94j404J651K10j870J642K89j577P51J305j887L45J261
3684H75j538N13J082j254j80J468j378j71J711j211q44J901q70r33J380m46q92
$$ plain form
3701 -787 709 440 -1043 533 745 -787 465 753 -996 147 825 -895 -66 848 -1133 -276 1024
3718 1024 -535 -439 723 -662 -1024 823 -346 -767 927 -125 -757 703 84 -806 855 422 -871
3735 -871 550 719 -562 386 742 -876 121 684 -711 151 683 -890 -163 936 -754 -463 1114
3752 1114 -451 -750 942 -330 -445 772 -350 -679 1019 70 -600 506 247 -825 550 461 -1000
3769 -1000 361 578 -846 150 586 -698 -203 664 -774 -105 761 -523 -61 1036 -577 -428 843
3786 843 -237 -453 826 -225 -647 733 -142 -613 690 85 -783 604 143 -773 645 337 -878
3803 -878 508 381 -914 91 745 -643 -44 449 -750 -159 818 -278 -61 831 -320 -432 747
3820 747 -512 -340 927 -59 -626 783 23 -866 462 51 -597 581 145 -937 398 442 -960 63
$$ packed form
3701g87J496k69j483J576K12j532J252K88j749J143O78j720Q29R14j981Q57J300
3718A024j559R6J162j385l62J847j169m21J694j052o32J460o19q90J661m33j293
3735h71J421J69j281R48L56j618R97N63j395Q62N32j573P27J099j690K91J577
3752A114j565k99J692j272j15J217j122l29J698r49o70J106k59j072J375q9j461
3769a000J361K17j424R96M36j284M95Q67j438O69Q66j284M62J097j613J49J271
3786H43j080k16J279j051m22J380q75m71J303o05q68J387m61r16J418l08j215
3803h78J386j27j295J005O54j388N99M93j199N91R77j096K17Q92j151j12J179
3820G47j259J72J267r86n67J409p60q89J328m11o48J178m36j082J335M4j402J023
$$ plain form
3838 63 502 -831 255 485 -774 101 679 -621 -189 895 -373 -197 950 -365 -450 656 -350
3855 -350 -585 571 -80 -709 837 -3 -550 334 312 -897 351 182 -737 568 -16 -871 156 501
3873 501 -659 131 605 -787 -1 829 -511 -142 803 -515 -589 746 -418 -508 537 -99 -516 586
3891 586 -240 -831 426 -88 -636 552 270 -672 358 260 -713 169 516 -536 109 561 -330 -118 594
3910 594 -592 42 554 -427 -355 702 -339 -542 738 -142 -395 413 -87 -488 511 -69 -439 550 220
3929 220 -463 414 221 -685 365 493 -504 172 606 -604 87 310 -787 -88 758 -659 -149 851
3947 851 -351 -172 645 -320 -460 388 -129 -282 869 46 -517 540 210 -687 301 605 -638 217 -27
3966 -27 -598 150 487 -483 12 355 -535 -88 843 -581 -72 805 -54 -117 525 -195 -34 529 -196 -284 723
$$ packed form
3838F3M39j333J086K30j259Q75N78j300M32J084j268J76J147j315q5J106j006
3855c50k35J156o51o29J546q40n47Q84k2j209J248j69r19J305n84q55J027L45
3873E01j160P90M74j392P86Q30j340L69R45j318p4J335j164r0J045o36m17J102
3891E86q26n91J257n14n48J188k82r42J030r8r73Q82L47j052O45M52q91K12P12
3910E94j186O34N12r81P2J057j041k03J280q80k53Q08n00m01R99n80l70R89l30
3929B20o83Q77j93r06J050J28r97O76M34j210O91K23j097O99Q46j417N10J000
3947H51j202J79Q17r65j40Q48n17j53J151q23n63J057l30q97R88L04j243Q55k44
3966b7n71P48L37r70M95L43q90M47R31j424N09Q77q59o3O42p20J61N63p25q8J007
$$ plain form
3987 723 86 -645 583 -56 -613 204 119 -259 325 241 -490 91 122 -885 -26 443 -447 -160 432 -327
4007 -327 -100 384 -511 -109 657 -277 28 589 -196 -239 602 -119 -465 628 137 -286 374 -239 -488 307
4027 307 299 -381 157 279 -481 -196 527 -368 291 412 -389 20 135 -341 24 597 -379 -352 554 -177 -290
4048 -290 549 114 -290 514 -162 -441 394 -148 -383 342 205 -442 273 333 -502 256 244 -499 192 398 -458
4069 -458 89 379 -396 -41 391 -411 -236 659 -272 -191 556 -176 -391 207 -416 -332 269 102 -511 335 156
4090 156 -705 293 53 -234 279 308 -548 174 513 -423 91 234 -359 58 343 -339 -90 324 -188 -249 402
4111 402 -220 -262 383 -240 -357 532 2 -280 273 136 -479 477 -22 -270 446 164 -300 188 298 -440
4131 -440 -187 200 -354 203 245 -293 83 223 -282 -209 329 -456 -213 473 -65 -299 168 -84 -39 187 139
$$ packed form
3987G23o37p31J228o39n57Q17q5l78N84q4p31N81L1j007Q59M69q90K87N92p59
4007c27K27M84q95M02P66r34L05N61p85m3Q41p21l46J093m91m23O60o13k49P95
4027C07qo80N38J22p60K85P23q95O59J21q01M09J15m76L65N73r76K7R06p31j13
4048b90Q39m35m04Q04o76k79Q35n42k35P25j37o47P15O0q35P58j2p43O91K06q56
4069d58N47K90p75L55M32q02J75Q95r31Q1P47p32k15N98o23Q4O01j67o13Q46j79
4090A56q61R98k40k87N13K9q56P22L39r36N14J43n93M17K85o82K49M14n12o1O51
4111D02o22m2O45o23j17Q89n30k82N53j37o15R56m99k48P16k82m64M88J10p38
4131d40K53L87n54N57M2n38L76J40n05P3N38p85K43O86n38k34M67k52M5K26m8
$$ plain form
4152 139 -501 417 -32 -278 335 174 -586 59 163 -170 127 288 -437 -213 390 -480 70 118 -288 -186
4172 -186 400 -216 -221 430 -396 -331 404 -499 -184 498 -167 -500 508 224 -359 288 153 -394 -60 103 -141
4193 -141 166 260 -389 100 285 -409 65 554 -195 -115 81 -602 -209 379 -356 -250 317 121 -362 307 -59
$$ packed form
4152A39o40R18m49k46O13j61p60O45J04l33K97J61p25K24O03q70N50M8m06J02
4172a86N86o16nO51q26O5P35r03L15O82o65l33J008k84n83O47j35n47L34J63k44
4193a41L07R4o49M89J85o94M74M89p49Q0J96o83L93N88p35J06N67j96m83O69l66
$$ [...]
8191A62
##END NTUPLES=NMR FID
##END=
