##TITLE=1H_Pr 98-H-2
 CDCl3, 8 sc, 
 12.2.2019
##JCAMPDX= 6.0         $$ Bruker NMR JCAMP-DX V2.0
##DATA TYPE= NMR FID
##DATA CLASS= NTUPLES
##ORIGIN= UXNMR, Bruker Analytische Messtechnik GmbH
##OWNER= root
$$ XWIN-NMR		Version 3.5
$$ Tue Feb 12 13:54:10 2019 Russian Standard Time (UT+4h)  she@DPX200
##.OBSERVE FREQUENCY= 200.1313
##.OBSERVE NUCLEUS= ^1H
##.DELAY= (6, 6)
##.ACQUISITION MODE= SIMULTANEOUS
##.ACQUISITION SCHEME= undefined
##.AVERAGES= 8
##.DIGITISER RES= 18
##SPECTROMETER/DATA SYSTEM= spect
##.PULSE SEQUENCE= zg30
##.SOLVENT NAME= CDCl3
##.SHIFT REFERENCE= (INTERNAL, CDCl3, 0, 15.7039)
##AUDIT TRAIL= $$ (NUMBER, WHEN, WHO, WHERE, WHAT)
$$ ##TITLE= Audit trail, XWIN-NMR		Version 3.5
$$ ##JCAMPDX= 5.01
$$ ##ORIGIN= Bruker BioSpin GmbH
$$ ##OWNER= she
$$ F:/spectra/data/she/nmr/H-F/1/audita.txt
$$ ##AUDIT TRAIL=  $$ (NUMBER, WHEN, WHO, WHERE, WHAT)
(   1,<2019-02-12 13:52:56.92 +0400>,<she>,<DPX200>,
      <created by zg, POWCHK disabled, PULCHK disabled
       configuration hash MD5:
       00 E9 B6 7A A2 85 ED C7 34 08 36 98 17 FE 4E 26
       data hash MD5: 16K
       58 66 75 A6 BA E3 67 FA D4 AC 74 E3 6F 3E D8 94>)
$$ ##END=
$$ 
$$ hash MD5
$$ A2 9D B7 F6 6A 78 6C 54 DC C1 F0 A6 CE 52 82 D3
##$RELAX= 
##$RELAX= 
##$RELAX= 
##$RELAX= 
##$RELAX= 
##$RELAX= 
$$ Bruker specific parameters
$$ --------------------------
##$DU= <F:/spectra>
##$EXPNO= 1
##$NAME= <H-F>
##$PROCNO= 1
##$TYPE= <nmr>
##$USER= <she>
##$AMP= (0..31)
100 100 100 100 100 100 100 100 100 100 100 100 100 100 100 100 100 100 
100 100 100 100 100 100 100 100 100 100 100 100 100 100 
##$AQSEQ= 0
##$AQ_mod= 1
##$AUNM= <au_zg>
##$AUTOPOS= <>
##$BF1= 200.13
##$BF2= 200.13
##$BF3= 200.13
##$BF4= 200.13
##$BF5= 200.13
##$BF6= 200.13
##$BF7= 200.13
##$BF8= 200.13
##$BYTORDA= 1
##$CFDGTYP= 0
##$CFRGTYP= 5
##$CHEMSTR= <none>
##$CNST= (0..31)
1 1 145 1 1 1 1 1 1 1 1 1 1 1 1 1 1 1 1 1 1 1 1 1 1 1 1 1 1 1 1 1 
##$CPDPRG= <>
##$CPDPRG1= <>
##$CPDPRG2= <>
##$CPDPRG3= <>
##$CPDPRG4= <mlev>
##$CPDPRG5= <mlev>
##$CPDPRG6= <mlev>
##$CPDPRG7= <mlev>
##$CPDPRG8= <mlev>
##$CPDPRGB= <>
##$CPDPRGT= <>
##$D= (0..31)
0 1.2 0 0 0 0 0 0 0 0 0 0.03 0 0 0 0 0 0 0 0 0 0 0 0 0 0 0 0 0 0 0 0 
##$DATE= 1549965176
##$DBL= (0..7)
120 120 120 120 120 120 120 120 
##$DBP= (0..7)
150 150 150 150 150 150 150 150 
##$DBP07= 0
##$DBPNAM0= <>
##$DBPNAM1= <>
##$DBPNAM2= <>
##$DBPNAM3= <>
##$DBPNAM4= <>
##$DBPNAM5= <>
##$DBPNAM6= <>
##$DBPNAM7= <>
##$DBPOAL= (0..7)
0.5 0.5 0.5 0.5 0.5 0.5 0.5 0.5 
##$DBPOFFS= (0..7)
0 0 0 0 0 0 0 0 
##$DE= 6
##$DECBNUC= <off>
##$DECIM= 32
##$DECNUC= <off>
##$DECSTAT= 4
##$DIGMOD= 1
##$DIGTYP= 9
##$DL= (0..7)
0 120 120 120 120 120 120 120 
##$DP= (0..7)
150 150 150 150 150 150 150 150 
##$DP07= 0
##$DPNAME0= <>
##$DPNAME1= <>
##$DPNAME2= <>
##$DPNAME3= <>
##$DPNAME4= <>
##$DPNAME5= <>
##$DPNAME6= <>
##$DPNAME7= <>
##$DPOAL= (0..7)
0.5 0.5 0.5 0.5 0.5 0.5 0.5 0.5 
##$DPOFFS= (0..7)
0 0 0 0 0 0 0 0 
##$DQDMODE= 0
##$DR= 18
##$DS= 0
##$DSLIST= <SSSSSSSSSSSSSSS>
##$DSPFIRM= 0
$$ [...]
##$SUBNAM2= <"">
##$SUBNAM3= <"">
##$SUBNAM4= <"">
##$SUBNAM5= <"">
##$SUBNAM6= <"">
##$SUBNAM7= <"">
##$SUBNAM8= <"">
##$SUBNAM9= <"">
##$SW= 20.0189088683792
##$SWIBOX= (0..15)
0 0 2 0 0 0 0 0 0 0 0 0 0 0 0 0 
##$SW_h= 4006.41025641026
##$TD= 16384
##$TD0= 1
##$TE= 0
##$TE2= 300
##$TE3= 300
##$TEG= 300
##$TL= (0..7)
0 120 120 120 120 120 120 120 
##$TP= (0..7)
150 150 150 150 150 150 150 150 
##$TP07= 0
##$TPNAME0= <>
##$TPNAME1= <>
##$TPNAME2= <>
##$TPNAME3= <>
##$TPNAME4= <>
##$TPNAME5= <>
##$TPNAME6= <>
##$TPNAME7= <>
##$TPOAL= (0..7)
0.5 0.5 0.5 0.5 0.5 0.5 0.5 0.5 
##$TPOFFS= (0..7)
0 0 0 0 0 0 0 0 
##$TUNHIN= 0
##$TUNHOUT= 0
##$TUNXOUT= 0
##$USERA1= <user>
##$USERA2= <user>
##$USERA3= <user>
##$USERA4= <user>
##$USERA5= <user>
##$V9= 5
##$VALIST= <valist>
##$VCLIST= <CCCCCCCCCCCCCCC>
##$VD= 0
##$VDLIST= <DDDDDDDDDDDDDDD>
##$VPLIST= <PPPPPPPPPPPPPPP>
##$VTLIST= <TTTTTTTTTTTTTTT>
##$WBST= 1024
##$WBSW= 4
##$XGAIN= (0..3)
0 0 0 0 
##$XL= 0
##$YL= 0
##$YMAX_a= 224836
##$YMIN_a= -347576
##$ZGOPTNS= <>
##$ZL1= 120
##$ZL2= 120
##$ZL3= 120
##$ZL4= 120
##$ABSF1= 10
##$ABSF2= 0
##$ABSG= 5
##$ABSL= 3
##$ALPHA= 0
##$AQORDER= 0
##$ASSFAC= 0
##$ASSFACI= 0
##$ASSFACX= 0
##$ASSWID= 0
##$AUNMP= <proc_1d>
##$AZFE= 0.1
##$AZFW= 0.1
##$BCFW= 1
##$BC_mod= 2
##$BYTORDP= 1
##$COROFFS= 0
##$CY= 11.3945322036743
##$DATMOD= 1
##$DC= 2
##$DFILT= <>
##$DTYPP= 0
##$F1P= 18.9103706918063
##$F2P= -1.10871071338519
##$FCOR= 0.5
##$FTSIZE= 0
##$FT_mod= 4
##$GAMMA= 1
##$GB= 0.15
##$INTBC= 1
##$INTSCL= 1
##$ISEN= 128
##$LB= 0.24
##$LEV0= 0
##$LPBIN= 0
##$MAXI= 10000
##$MC2= 0
##$MEAN= 0
##$ME_mod= 0
##$MI= 1.114404
##$NCOEF= 0
##$NC_proc= 0
##$NLEV= 6
##$NOISF1= 3.799351
##$NOISF2= 2.8
##$NSP= 1
##$NTH_PI= 0
##$NZP= 0
##$OFFSET= 15.70392
##$PC= 1
##$PHC0= -8688.961
##$PHC1= 10.40018
##$PH_mod= 1
##$PKNL= yes
##$PPARMOD= 0
##$PSCAL= 0
##$PSIGN= 0
##$REVERSE= no
##$SF= 200.130013532006
##$SI= 16384
##$SIGF1= 3
##$SIGF2= 2
##$SINO= 400
##$SIOLD= 16384
##$SREGLST= <1H.CDCl3>
##$SSB= 0
##$STSI= 0
##$STSR= 0
##$SW_p= 3612.71676300578
##$SYMM= 0
##$S_DEV= 0
##$TDeff= 0
##$TDoff= 0
##$TI= <>
##$TILT= no
##$TM1= 0
##$TM2= 0
##$TOPLEV= 0
##$USERP1= <user>
##$USERP2= <user>
##$USERP3= <user>
##$USERP4= <user>
##$USERP5= <user>
##$WDW= 1
##$XDIM= 8192
##$YMAX_p= 0
##$YMIN_p= 0
$$ End of Bruker specific parameters
$$ ---------------------------------
##NTUPLES= NMR FID
##VAR_NAME=  TIME,          FID/REAL,        FID/IMAG
##SYMBOL=    X,             R,               I
##VAR_TYPE=  INDEPENDENT,   DEPENDENT,       DEPENDENT
##VAR_FORM=  AFFN,          ASDF,            ASDF
##VAR_DIM=   8192,          8192,            8192
##UNITS=     SECONDS,       ARBITRARY UNITS, ARBITRARY UNITS
##FACTOR=    0.0002496,     1,               1
##FIRST=     0,             0,               0
##LAST=      2.0444736,     0,               0
##MIN=       0,             -347576,         0
##MAX=       2.0444736,     224836,          0
$$ Real data points
##PAGE= N=1
##DATA TABLE= (X++(R..R)), XYDATA
$$ plain form
0 0 0 0 0 0 0 0 0 0 0 0 -1 8 -8 8 -9 16 -16 24 -25 32 -40 48 -56 65 -80 94 -106 126 -145 167 -191 215 -247
33 -247 279 -313 353 -400 447 -499 557 -620 690 -767 851 -939 1037 -1145 1264 -1391 1533
50 1533 -1689 1862 -2051 2262 -2500 2764 -3065 3412 -3812 4281 -4840 5522 -6374 7472 -8945
65 -8945 11046 -14292 20022 -33184 131038 -75168 -150054 224836 64573 -22872 136438
76 136438 119276 14132 69561 -8339 -17655 47582 -78587 -116828 105280 47597 -137811
87 -137811 -33988 21281 -139182 -101282 38487 28005 -20915 -21828 734 33237 -38525 -85272
99 -85272 19479 69208 28719 40858 -22241 -84117 19690 14718 -98114 15128 79973 -80493
111 -80493 -46999 75624 -38192 -74994 18793 -14103 36121 132170 -1308 -24476 113503
$$ packed form
0@%%%%%%%%%%jRj6J6j7K5l2M0m9N7p2Q8j04J21j45J74k00K32k71L12l58M06m62
33b47N26n92O66p53Q47r46J056j177J310j457J618j790J976k182K409k655K924
50A533l222L551l913M313m762N264n829O477p224Q093r121J0362j1896J3846j6417
65h945J9991k5338L4314n3206J64222k06206p4886L74890j60263q7445J59310
76A36438j7162j05144N5429p7900r316O5237j26169l8241K22108n7683j85408
87a37811J03823N5269j60463L7900J39769j0482m8920r13K2562L2503p1762m6747
99h5272J04751M9729m0489J2139o3099o1876J03807m972j12832J13242O4845j60466
111h0493L3494J22623j13816l6802R3787l2896N0224R6049j33478k3168J37979
$$ plain form
122 113503 -17556 -76036 180596 135971 -101655 42255 147363 -61006 -82259 38396
132 38396 5310 -9081 -20384 -77045 5372 11073 -160245 -96473 60215 -57732 -96652 58976
144 58976 15613 -89453 -23258 2964 -7804 40180 27748 31022 73472 -9561 -40455 71390
156 71390 39713 -36483 52262 58405 -21697 19142 3645 -62580 23691 40614 -61524 4536
168 4536 75885 -19597 -32623 6473 -31761 13826 49057 -26142 25883 74736 -72676 -63991
180 -63991 84203 -5863 -83159 45805 29726 -71459 -17145 -1498 -41593 -14670 -45201
191 -45201 -35163 75835 -4249 -115474 35251 70981 -90530 -17039 107128 3255 -19048
202 -19048 56854 10297 3532 39846 -9744 26790 79972 -22965 -23013 73615 -16493 -64776 53892
$$ packed form
122A13503j31059n8480K56632m4625k37626J43910J05108k08369k1253J20655
132C8396l3086j4391j1303n6661Q2417N701j71318O3772J56688j17947l8920J55628
144E8976m3363j05066O6195K6222j0768M7984j2432L274M2450q3033l0894J11845
156G1390l1677p6196Q8745O143q0102M0839j5497o6225Q6271J6923j02138O6060
168D536P1349r5482j3026L9096l8234M5587L5231p5199N2025M8853j47412Q685
180f3991J48194r0066p7296J28964j6079j01185N4314J5647m0095K6923l0531
191d5201J0038J10998q0084j11225J50725L5730j61511P3491J24167j03873k2303
202a9048P5902m6557o765L6314m9590L6534N3182j02937m8R6628r0108m8283J18668
$$ plain form
215 53892 19970 -65511 13654 23388 -44781 -8731 -10366 -50099 10472 16184 -38209 3057 3742
228 3742 -45379 8438 16589 -42678 19354 40430 -48363 -2870 56077 -31370 -29282 40137 -2908
241 -2908 -2497 34823 -21869 -8937 43097 -29961 -17738 69865 -19728 -53395 75743 23446
253 23446 -79051 25055 46582 -43808 10961 36127 -32910 6865 18193 -44294 21705 41985
265 41985 -62444 -11573 62892 -34987 -34605 47258 -24458 -46009 41704 5764 -37470 13278
277 13278 -8210 -25382 27231 -5719 -32471 26194 1978 -28029 35659 11113 -40014 24998
289 24998 27105 -25257 24877 27183 -34072 12806 35301 -20574 8844 18364 -36851 13185 36523
302 36523 -47768 -13055 40488 -43098 -27401 50854 -26888 -49399 38396 -2783 -37674 33709
$$ packed form
215E3892l3922q5481P9165R734o8169L6050j635l9733O0571N712n4393M1266O85
228C742m9121N3817Q151n9267O2032K1076q8793M5493N8947q7447K088O9419m3045
241b908M11L7320n6692J2932N2034p3058J2223Q7603q9593l3667J29138n2297
253B3446j02497J04106K1527r0390N4769K5166o9037L9775J1328o2487O5999K0280
265D1985j04429N0871P4465r7879L82Q1863p1716k1551Q7713l5940m3234N0748
277A3278k1488j7172N2613l2950k6752N8665k4216l0007O3688k4546n1127O5012
289B4998K107n2362N0134K306o1255M6878K2495n5875K9418R520n5215N0036K3338
302C6523q4291L4713N3543q3586J5697P8255p7742k2511Q7795m1179l4891P1383
$$ plain form
314 33709 2129 -35809 36211 13777 -31832 39825 19724 -44857 34729 44357 -44565 6801
326 6801 44040 -34636 -6473 38719 -28657 -18319 26291 -26679 -17655 25360 -29246 -22670 31687
339 31687 -21565 -27825 35909 -8636 -32436 33447 5670 -28537 26644 9489 -23482 26748
351 26748 8769 -28898 26106 13675 -35693 18818 18443 -39103 12236 26580 -39532 1939
363 1939 34275 -30598 -3094 37095 -24931 -6162 44147 -17153 -12853 45094 -12705 -22816
375 -22816 44541 -4172 -32820 34399 -1087 -41680 25801 5151 -49294 12197 9726 -47807
387 -47807 5547 13949 -48085 -1071 24918 -37271 -3638 33009 -26417 -5513 38835 -12988
399 -12988 -3267 41068 -7824 -3820 46212 -1588 -12321 40912 1520 -19525 35580 6749
$$ packed form
314C3709l1580l7938P2020k2434m5609P1657k0101o4581P9586R628q8922N1366
326F801L7239p8676K8163M5192o7376J0338M4610n2970R024M3015n4606O576N4357
339C1687n3252o260O3734m4545k3800O5883k7777l4207N5181j7155l2971N0230
351B6748j7979l7667N5004j2431m9368N4511l75n7546N1339J4344o6112M1471
363A939L2336o4873K7504M0189o2026J8769N0309o1300M300N7947n7799j0111
375b2816O7357m8713k8648O7219l5486m0593O7481k0650n4445O1491k471n7533
387d7807N3354Q402o2034M7014K5989o2189L3633L6647n9426K0904M4348n1823
399a2988R721M4335m8892M004N0032m7800j0733N3233l9392k1045N5105k8831
$$ plain form
411 6749 -25918 20935 2000 -27152 18701 -1146 -35946 17173 4249 -41811 13186 14319
423 14319 -45461 1401 23687 -33798 -1905 25248 -32939 -6981 30956 -26654 -12022 34224
435 34224 -22032 -17903 38501 -14282 -29818 32124 -4397 -27702 36228 5767 -35614 28268
447 28268 19146 -30986 21884 29643 -21236 15058 28884 -14049 14982 21037 -24260 17467 37150
460 37150 -29199 -4568 36294 -26337 -26295 25468 -13188 -27945 8155 -17232 -20211 5105 -36004
473 -36004 -28226 25852 -20695 -38165 33155 2666 -46248 16991 23303 -22009 16551 24984 -8057
486 -8057 26879 22420 -23093 23191 35167 -22150 16001 44511 -23035 -10190 31796 -19723
498 -19723 -15676 29227 -15280 -18281 30982 -12320 -33778 17552 -5270 -26202 22550 7865
$$ packed form
411F749l2667M6853j8935k9152M5853j9847l4800N3119j2924m6060N4997J133
423A4319n9780M6862K2286n7485L1893K7153n8187K5958L7937n7610J4632M6246
435C4224n6256M129N6404n2783j5536O1942l6521k3305O3930l0461m1381O3882
447B8268r122n0132N2870P759n0879L6294J3826m2933K9031O055m5297M1727J9683
460C7150o6349K4631M0862o2631M2N1763l8656j4757L6100k5387k979K5316m1109
473c6004P778N4078m6547j7470P1320l0489m8914O3239O312m5312L8560Q433l3041
486h057L4936m459m5513M6284J1976n7317L8151K8510o7546J2845M1986n1519
498a9723M047M4903m4507l001M9263m3302k1458N1330k2822k0932M8752j4685
$$ plain form
510 7865 -18347 15449 -8836 -31459 26410 7773 -43095 18351 31373 -40629 -17733 17177
522 17177 -26093 -19081 8264 -9629 7510 5222 -38784 4106 35991 -32367 -11359 62519
534 62519 8813 -20991 40289 20899 -17697 17787 20551 15463 37156 -4074 -20795 32390
546 32390 -1703 -48534 16683 21879 -40866 -7395 13686 -38168 -23824 -5057 -34919 -142
558 -142 24145 -26075 -10764 21150 -25291 -18524 27827 1354 3204 35080 -5824 -10039 29846
571 29846 -15511 -28727 41667 18435 -32206 15710 21017 -28355 -14394 -1446 -3737 26082
583 26082 4786 -19524 35341 17853 -53584 7337 58356 -13385 -11160 48139 10136 -23282
595 -23282 -5465 -10998 4475 14778 -27060 -6630 28089 -41958 -53708 24750 -6462 -57275
$$ packed form
510G865k6212L3796k4285k2623N7869j8637n0868O1446J3022p2002K2896L4910
522A7177m3270P012K7345j7893J7139k288m4006M2890L1885o8358K1008P3878
534F2519n3706k9804O1280j9390l8596L5484K764n088K1693m1230j6721N3185
546C2390l4093m6831O5217N196o2745L3471K1081n1854J4344J8767k9862L4777
558a42K4287n0220J5311L1914m6441O767M6351k6473J850L1876m0904m215L9885
571B9846m5357j3216P0394k3232n0641M7916N307m9372J3961J2948k291K9819
583B6082k1296k4310N4865j7488p1437O0921N1019p1741K225N9299l8003l3418
595b3282J7817n533J5473J0303m1838K0430L4719p0047j1750P8458l1212n0813
$$ plain form
607 -57275 6408 25579 -14874 -2713 -8140 -26252 13658 17514 -1775 41044 30802 -28534
619 -28534 6257 34849 -9037 5608 28957 -6526 12681 31895 -28026 -27366 17466 -15791
631 -15791 -18485 31274 4601 -26626 -2977 -10872 -10364 12471 -19077 -8955 54557 8478 -48374
644 -48374 12795 18813 -40460 2416 45637 -1978 -20703 -10763 -10535 12312 -9081 -46090 13018
657 13018 37756 -32737 -11574 40005 -27728 -48000 30462 34402 3266 13777 854 902 22024
670 22024 -10526 -8954 44610 10818 -25342 29028 18189 -40805 -9969 10526 -17212 6450
682 6450 10224 -27523 -2145 8195 -38022 -16619 18616 -10392 -237 25186 -9468 -11886 4485
695 4485 -21182 5825 45455 -8835 -22061 34290 3220 -37407 10068 18102 -13753 1401
$$ packed form
607e7275O3683J9171m0453J2161n427j8112L9910L856j9289M2819j0242n9336
619b8534L4791K8592m3886J4645K3349l5483J9207J9214n9921O60M4832l3257
631a5791k694M9759k6673l1227K3649p895N08K2835l1548J0122O3512m6079n6852
644d8374O1169O018n9273M2876M3221m7615j8725R940K28K2847k1393l7009N9108
657A3018K4738p0493K1163N1579o7733k0272P8462L940l1136J0511j2923M8K1122
670B2024l2550J572N3564l3792l6160N4370j0839n8994L0836K0495k7738K3662
682F450L774l7747K5378J0340m6217K1403L5235k9008J0155K5423l4654k418J6371
695D485k5667K7007L9630n4290j3226N6351l1070m0627M7475Q034l1855J5154
$$ plain form
707 1401 5830 3244 16611 -20078 -33910 29379 17268 -34615 21693 44944 -29788 -23763 24239
720 24239 -1200 -6307 16546 2069 7115 6553 -31841 -3792 30154 -25774 -25772 36658 2460 -34103
734 -34103 11003 3165 -28110 4758 7153 -9271 20975 7927 -25758 6589 10352 -18945 12405
747 12405 22970 -12010 7054 12726 -25387 493 22760 -19656 -5821 29756 -10061 -18500
759 -18500 16381 -2773 -14705 5507 -3790 7308 23637 -19116 -17103 30277 -9676 -34878
771 -34878 31302 24619 -31716 -2695 15937 -14951 -4165 2914 -9987 14274 4434 -26094 15355
784 15355 21514 -36131 -5007 39597 -12086 -16614 31044 3611 -18043 9916 -2032 -5592 18598
797 18598 -5885 -12518 19651 -9112 -28897 15423 5476 -24565 9711 7504 -24437 6314 13247
$$ packed form
707A401M429k586J3367l6689j3832O3289j2111n1883N6308K3251p4732O025M8002
720B4239k5439n107K2853j4477N046n62l8394K8049L3946n5928KO2430l4198l6563
734c4103M5106p838l1275L2868K395j6424L0246j3048l3685L2347L763k9297L1350
747A2405J0565l4980J9064N672l8113K5880K2267m2416J3835L5577l9817q439
759a8500L4881j9154j1932K0212r297J1098J6329m2753K013M7380l9953k5202
771c4878O6180o683n6335K9021J8632l0888J0786P079j2901K4261r840l0528M1449
784A5355O159n7645L1124M4604n1683m528M7658k7433k1654K7959j1948l560K4190
797A8598k4483o633L2169k8763j9785M4320r947l0041L4276k207l1941L0751O933
$$ plain form
810 13247 -20459 1483 15280 -11310 6929 18913 -11601 1243 13270 -12403 7900 22540
822 22540 -18379 -4805 25683 -16215 -18015 24568 -5347 -23496 15483 4269 -15294 6679
834 6679 -6050 -11222 21856 -1159 -22132 22902 11374 -27505 14787 22372 -26987 -2224 24892
847 24892 -12651 -7106 10497 -18444 -7184 12967 -16379 -7596 14200 -21062 -13179 26409 -6716
860 -6716 -20691 19685 4654 -11351 22823 9534 -14242 15388 13698 -5802 16289 7725 -13758
873 -13758 13911 9578 -18668 8145 7704 -26973 1839 16150 -24196 -11499 12186 -17598 -8952
886 -8952 14008 -13931 -9702 14076 -9926 -3047 21132 -13406 -12758 29424 -897 -20112 21772
899 21772 5550 -22924 13787 10904 -19866 5621 7128 -17708 8757 9819 -20345 7647 17105
$$ packed form
810A3247l3706K1942J3797k6590J8239J1984l0514J2844J2027k5673K0303J4640
822B2540m0919J3574L0488m1898j800M2583k9915j8149L8979j1214j9563K1973
834F679j2729n172L3078k3015k0973M5034j1528l8879M2292P585m9359K4763K7116
847B4892l7543N545J7603k8941J1260K0151k9346Q783K1796l5262P883L9588l3125
860f716j3975M0376j5031j6005L4174j3289k3776K9630j690j9500K2091q564k1483
873a3758K7669m333k8246K6813m41l4677K8812J4311m0346J2697K3685k9784Q646
886h952K2960k7939M229K3778k4002O879K4179l4538O48M2182l0321j9215M1884
899B1772j6222k8474L6711k883l0770K5487J507k4836K6465J062l0164K7992R458
$$ plain form
912 17105 -18949 4808 24880 -15208 -3061 28560 -4775 -8273 20602 -2009 -7375 16853
924 16853 -5375 -12059 13895 -7454 -17936 11910 -7900 -24582 9377 -1388 -26335 4343
936 4343 3525 -22085 3769 8072 -16649 5220 11309 -12536 10253 17145 -14080 6749 23259
949 23259 -10176 2854 24299 -10936 -4643 24955 -6681 -11677 19339 -4574 -13189 17578 -4429
962 -4429 -17505 16408 -853 -20286 16109 4725 -24427 10234 11178 -21895 4947 13034 -20593
975 -20593 20 14581 -17456 -4368 12320 -17249 -5521 16011 -14960 -11397 16073 -9618
987 -9618 -12506 16097 -4342 -10961 16792 -375 -10228 18692 3710 -11895 18307 9967 -10432
1000 -10432 15221 9566 -12239 13206 10640 -14914 10138 12409 -18151 4258 13512 -21010 -4245
$$ packed form
912A7105l6054K3757K0072m0088J2147L1621l3335l498K8875k2611n366K4228
924A6853k2228o684K5954k1349j0482K9846j9810j6682L3959j0765k4947L0678
936D343q18k5610K5854M303k4721K1869O089k3845K2789O892l1225K0829J6510
949B3259l3435J3030K1445l5235O293K9598l1636m996L1016k3913q615L0767k2007
962d429j3076L3913j7261j9433L6395j1384k9152L4661R44l3073K6842Q087l3627
975b0593K0613J4561l2037J3088J6688k9569J1728K1532l0971L563K7470k5691
987i618k888K8603k0439o619K7753j7167r853K8920j4982j5605L0202q340k0399
1000a0432K5653n655k1805K5445k566k5554K5052K271l0560K2409R254l4522J6765
$$ plain form
1013 -4245 14432 -17940 -8541 13610 -16311 -12029 12621 -15948 -13463 18496 -9207 -18166 18754
1026 18754 -622 -19517 13824 4756 -14592 15811 8731 -14768 14592 11392 -18295 10184
1038 10184 18545 -15217 3762 19277 -11447 -2522 14072 -10389 -1578 14958 -11175 -2593 19355
1051 19355 -13645 -14315 19204 -3109 -15197 14271 2419 -11636 8587 -3796 -13285 12183
1063 12183 -2202 -17047 15184 4424 -25638 4027 8953 -20896 631 11816 -13521 1508
1075 1508 9353 -16550 1900 15836 -15884 722 27597 -6001 -6753 20417 -3845 -7616 20705
1088 20705 177 -6405 22709 -1844 -18455 16113 2171 -24076 8682 10331 -16701 1988
1100 1988 2262 -20166 746 3667 -18878 8852 16095 -22220 -3640 21915 -12904 -13122 16550
$$ packed form
1013d245J8677l2372R399K2151k9921M282K4650k8569K485L1959k7703q959L6920
1026A8754j9376j8895L3341r068j9348L0403p080k3499K9360l200k9687K8479
1038A0184Q361l3762J8979J5515l0724Q925J6594k4461Q811J6536k6133Q582K1948
1051A9355l3000o70L3519k2313j2088K9468j1852j4055K0223j2383r489K5468
1063A2183j4385j4845L2231j0760l0062K9665M926k9849K1527J1185k5337J5029
1075A508P845k5903J8450J3936l1720J6606K6875l3598p52K7170k4262l771K8321
1088B0705k0528o582K9114k4553j6611L4568j3942k6247L2758J649k7032J8689
1100A988K74k2428K0912K921k2545K7730P243l8315J8580K5555l4819k18K9672
$$ plain form
1113 16550 2510 -935 11909 -5396 -2429 11231 -14595 -7889 25378 -2958 -19291 16483
1125 16483 4097 -22071 3569 5644 -9504 10108 6093 -9478 12444 1297 -23103 12468
1137 12468 21109 -15341 3110 21075 -11763 -6552 10315 -12769 -2129 17218 -12550 -7952
1149 -7952 18762 -13187 -23094 10833 -1497 -12469 13383 1806 -10878 10172 -5201 -16079
1161 -16079 19410 9307 -17453 16543 20424 -18919 -4541 13945 -6751 -466 8416 -3381
1173 -3381 9496 3875 -27569 -1395 21126 -18455 -13022 24571 -1244 -18165 7126 -2037 -11817
1186 -11817 6214 15 2675 19970 -7648 -18946 17081 3816 -20645 14947 17711 -14773
1198 -14773 1575 10897 -12031 -1432 2116 -14135 12383 20934 -16487 -7897 12156 -13114 -7183
$$ packed form
1113A6550j4040l445J2844j7305K967J3660k5826O706L3267k8336j6333L5774
1125A6483j2386k6168K5640K075j5148J9612m015j5571K1922j1147k4400L5571
1137A2468Q641l6450J8451J7965l2838N211J6867k3084J0640J9347k9768M598
1149g952K6714l1949r907L3927j2330j0972K5852j1577j2684K1050j5373j0878
1161a6079L5489j0103k6760L3996L881l9343J4378J8486k0696O285Q882j1797
1173c381J2877n621l1444K6174K2521l9581N433L7593k5815j6921K5291r163r780
1186a1817J8031o199K660J7295k7618j1298L6027j3265k4461L5592K764l2484
1198a4773J6348R322k2928J0599L548j6251K6518Q551l7421Q590K0053k5270N931
$$ plain form
1211 -7183 16729 -4114 -2937 15265 -10222 -10540 15687 -10756 -19203 20810 9955 -16008 5619
1224 5619 2040 -16666 1607 2423 -6451 13409 1830 -17586 15046 11287 -30050 -2979 27979
1237 27979 -2308 -4851 13666 -3650 -6663 2810 -6702 8022 16812 -14603 -4640 24372 -8554
1250 -8554 -21420 14384 3607 -13471 13397 9464 -10507 1349 -5912 -12604 14028 3881 -17545
1263 -17545 11433 11184 -22917 -5595 7942 -14554 156 12199 -12488 -1051 12445 -17812
1275 -17812 -9060 19134 -3803 -7788 18226 4456 -4286 10231 -4598 -4764 19149 1366 -5637
1288 -5637 23269 2167 -24796 8718 12740 -16932 -616 11005 -6986 -2868 -3965 -14325 6061
1301 6061 2487 -22198 6419 21643 -17793 -10502 17494 -7842 -13040 14064 3511 -3047 9093
$$ packed form
1211g183K3912k0843J177J8202k5487l18K6227k6443q447M0013j0855k5963K1627
1224E619l579j8706J8273Q16q874J9860j1579j9416L2632l759m1337K7071L0958
1237B7979l0287k543J8517j7316l013R473r512J4724Q790l1415R963K9012l2926
1250h554j2866L5804j0777j7078K6868l933j9971J1856p261o692K6632j0147k1426
1263a7545K8978k49l4101J7322J3537k2496J4710J2043k4687J1437J3496l0257
1275a7812Q752K8194k2937l985K6014j3770q742J4517j4829j66K3913j7783p003
1288e637K8906k1102k6963L3514M022k9672J6316J1621j7991M118j097j0360K0386
1301F061l574k4685K8617J5224l9436P291K7996k5336n198K7104j0553o558J2140
$$ plain form
1314 9093 -7058 -7976 10408 -8350 -10849 19152 318 -19653 9886 5572 -17221 4754 8711
1327 8711 -9603 9101 12095 -9904 7127 14247 -10838 3330 18122 -1856 4869 13298 -11712
1340 -11712 -3197 12723 -13234 -8120 16741 -10499 -20265 7821 -5434 -20606 1805 -2273 -12064
1353 -12064 4723 -3350 -9863 12443 -1375 -17224 16804 15913 -14552 8497 21635 -8643 -2906
1366 -2906 13114 -1716 2986 9164 -8331 1426 9494 -15205 -4864 15782 -10843 -11768 15628
1379 15628 -2408 -13061 10827 1441 -9434 10519 3332 -6720 13550 3251 -13487 8463
1391 8463 4248 -14768 6464 6604 -18498 -1259 5121 -19691 -3698 9510 -17170 -9873 11197
1404 11197 -7655 -6490 10529 -5376 -2866 15660 -298 164 20061 -345 -6119 22169 7395
$$ packed form
1314I093j6151r18J8384j8758k499L0001j8834j9971K9539m314k2793K1975L957
1327H711j8314J8704K994k1999J7031P120k5085J4168J4792j9978O725Q429k5010
1340a1712Q515J5920k5957N114K4861k7240r766K8086j3255j5172K2411m078r791
1353a2064J6787q073o513K2306j3818j5849L4028q91l0465K3049J3138l0278N737
1366b906J6020j4830M702O178j7495R757Q068k4699J0341K0646k6625r25K7396
1379A5628j8036j0653K3888r386j0875J9953p187j0052K0270j0299j6738K1950
1391H463m215j9016K1232J40k5102J7239O380k4812J5993J3208k6680P297K1070
1404A1197j8852J165J7019j5905K510J8526j5958M62J9897k0406n774K8288j4774
$$ plain form
1417 7395 -10831 13692 9730 -10679 5177 5352 -11655 904 1374 -12043 3414 315 -20011
1430 -20011 1275 9632 -15945 -3792 11446 -11153 -4383 15156 -4575 -6304 9868 -3975
1442 -3975 -2078 13947 -5193 -8838 11256 -4108 -10637 12927 -2422 -17408 9475 5654 -14571
1455 -14571 5751 6896 -12700 5847 12044 -7644 4645 10906 -6514 6943 14553 -8848 1671
1468 1671 15928 -7911 -3980 14731 -7797 -12190 9966 -3318 -12040 3841 -6256 -11841 5756
1481 5756 -5460 -12653 7200 -2516 -13394 10418 4878 -14085 6997 10768 -9661 4929 11402
1494 11402 -7659 3168 10294 -7078 3189 9981 -10601 149 13462 -10059 -5715 14127
1506 14127 -5941 -8517 12672 -2422 -10307 11216 1108 -9387 9168 1024 -9725 9399
$$ packed form
1417G395j8226K4523l962k0409J5856J75j7007J2559M70j3417J5457l099k0326
1430b0011K1286Q357k5577J2153J5238k2599O770J9539j9731j729J6172j3843
1442c975J897J6025j9140l645K0094j5364o529K3564j5349j4986K6883l821k0225
1455a4571K0322J145j9596J8547O197j9688J2289O261j7420J3457P610k3401J0519
1468A671J4257k3839L931J8711k2528m393K2156j3284q722J5881j0097n585J7597
1481E756j1216p193J9853r716j0878K3812n540j8963K1082L771k0429J4590O473
1494A1402j9061J0827P126j7372J0267O792k0582J0750J3313k3521M344J9842
1506A4127k0068k576K1189j5094p885K1523j0108j0495J8555q144j0749J9124
$$ plain form
1518 9399 2616 -12458 7092 4666 -13425 4620 7197 -14570 -354 8395 -11559 -2401 8578
1531 8578 -9606 -3734 9421 -6988 -3137 10026 -6276 -2945 13650 -4518 -7037 13811 -486
1544 -486 -8300 12260 2552 -10001 8789 3749 -9137 6919 2758 -10179 6865 5412 -12075
1557 -12075 4937 7892 -13301 1653 10796 -10379 -2387 9769 -8259 -3577 9133 -8346 -5062
1570 -5062 10555 -6137 -6946 10472 -4467 -9206 10266 -764 -9133 10160 1765 -9651 9348
1583 9348 4188 -10510 7585 7158 -9783 5164 8166 -9643 1877 7082 -9545 1364 8092
1596 8092 -10976 -1273 10550 -10213 -6645 10903 -5308 -6837 10164 -2210 -6093 8520 -2973
1609 -2973 -6082 11571 -536 -8826 11787 3300 -12337 6578 5531 -10737 3689 5983 -9132
$$ packed form
1518I399o783j5074J9550k426j8091J8045K577k1767J4216Q749j9954R158J0979
1531H578j8184N872J3155j6409L851J3163j6302L331J6595j8168k519K0848j4297
1544d86p814K0560r708j2553J8790n040j2886J6056m161j2937J7044j453j7487
1557a2075J7012K955k1193J4954R143k1175P992J2156j8028M682J2710j7479L284
1570e062J5617j6692q09J7418j4939m739J9472j1030q369J9293q395j1416J8999
1583I348n160j4698J8095m27j6941J4947L002j7809J1520N205j6627J0909O728
1596H092j9068R703J1823k0763L568J7548j6211j529J7001j2374l883J4613j1493
1609b973l109J7653j2107q290K0613q487j5637J8915j047j6268J4426K294j5115
$$ plain form
1622 -9132 2583 4053 -12195 2040 8136 -11629 -334 12381 -7738 -4476 10094 -4455 -3681
1635 -3681 10028 -2772 -2163 11775 -4267 -8315 10618 -1653 -11297 8799 2958 -10793 3567
1648 3567 1162 -10224 3014 1173 -9852 7129 6525 -11772 2957 9957 -9190 -61 12408
1661 12408 -2686 1202 9678 -5454 -519 10014 -7407 -3814 13675 -3722 -9316 9028 -2806
1674 -2806 -12320 4013 -1047 -8116 7137 -1163 -11395 6665 1225 -14173 5837 10156 -9129
1687 -9129 1946 9758 -6096 -799 5009 -6194 4383 10337 -8721 -863 11757 -8823 -9087
1700 -9087 10721 -670 -6651 7591 220 -4560 4807 -4934 -5837 11960 642 -8057 11936 4782
1714 4782 -13234 3097 7160 -7084 2606 5709 -5972 3067 1958 -14060 -159 7611 -11142
$$ packed form
1622i132J1715J470j6248J4235O096j9765J1295J2715k0119L262J4570j4549P74
1635c681J3709j2800O09J3938j6042m048J8933j2271r644K0096n841j3751J4360
1648C567k405j1386J3238j841j1025J6981o04j8297J4729P000j9147R129J2469
1661A2408j5094L888Q476j5132M935J0533j7421L593J7489j7397n594J8344j1834
1674b806r514J6333n060p069J5253q300j0232J8060n440j5398K0010M319j9285
1687i129J1075P812j5854N297N808j1203J0577N954j9058P858J2620k0580k64
1700i087J9808j1391n981J4242p371m780R367r741r03J7797j1318q699J9993p154
1714D782j8016J6331M063j4244R690L103j1681R039j109j6018J3901P770j8753
$$ plain form
1727 -11142 -2700 11327 -6890 -8599 4775 -5896 -4705 9129 -3190 -3232 12432 -2462 -10210
1740 -10210 10396 3808 -8332 8774 9046 -3502 4643 1218 -7618 6437 4032 -8689 8367
1753 8367 10318 -12681 -3324 9011 -7501 -6066 5811 -1482 250 3219 -9468 -2932 6585 -10491
1767 -10491 -5219 15003 -1984 -11819 6794 1172 -9916 2454 1139 -2922 8430 294 -8217
1780 -8217 7015 724 -13501 6728 12299 -7227 399 8046 -6892 -952 6180 -5813 2379
1793 2379 11607 -5137 -1650 11394 -5821 -8630 9198 2624 -2837 7282 -2006 -5993 6044
1806 6044 -4653 -10278 8659 2254 -11953 3774 4867 -12994 -5466 1567 -5058 2498 1976 -7925
1820 -7925 4255 4389 -12401 947 13296 -5992 -2099 14976 1806 -4768 5229 -604 765
$$ packed form
1727a1142Q442J4027j8217j709J3374j0671J191J3834j2319m2J5664j4894p748
1740a0210K0606o588j2140J7106K72j2548Q145l425q836J4055k405j2721J7056
1753H367J951k2999R357J2335j6512J435J1877p293J732K969j2687O536R517j7076
1767a0491N272K0222j6987r835J8613n622j1088J2370j315m061J1352q136q511
1780h217J5232o291j4225K0229N571j9526P626P647j4938N940P132j1993Q192
1793B379R228j6744L487J3044j7215k809J7828o574n461J0119r288l987J2037
1806F044j0697n625J8937o405j4207J5727J093j7861P528P033o625P556n22r901
1820g925J2180J34j6790J3348J2349j9288L893J7075j3170o574R997n833J369
$$ plain form
1833 765 9635 -1412 -1049 11227 -4128 -10959 8698 1767 -11228 4651 5279 -7688 925 461
1847 461 -9491 2353 3746 -8089 4624 8139 -9338 -2308 7020 -6301 -2162 7767 -3711 -988
1861 -988 7023 -9065 -7077 8634 -4532 -8989 8754 1218 -8895 3072 433 -4942 5309
1874 5309 516 -3302 12125 4907 -8753 8138 9424 -8220 3450 13608 -1876 -1442 5260
1887 5260 -4079 -951 2058 -8418 125 6423 -11523 -7337 7190 -8043 -11964 5301 -756 -6901
1901 -6901 4552 -361 -4702 5671 -1149 -5147 9562 4306 -6038 7821 5257 -9082 3131
1914 3131 6464 -6648 2534 6168 -8245 -609 6902 -8243 -3598 8079 -4199 -2880 8503
1927 8503 -1968 -3033 7199 -3163 -2555 12054 293 -6724 9502 2407 -10257 3397 3716
$$ packed form
1833G65Q870j1047L63J2276j5355o831J9657o931j2995J5879O28j2967Q613m64
1847D61r952J1844J393j1835J2713L515j7477P030R328j3321M139R929j1478K723
1861i88Q011j6088J988J5711j3166m457J7743p536j0113J1967k639n375J0251
1874E309m793l818J5427p218j3660J6891J286j7644J1670J0158j5484M34O702
1887E260r339L128L009j0476Q543O298j7946M186J4527j5233l921J7265o057o145
1901f901J1453m913m341J0373o820l998J4709n256j0344J3859k564j4339J2213
1914C131L333j3112R182L634j4413P636P511j5145M645J1677j2278J319J1383
1927H503j0471j065J0232j0362O08J4609j1761p017J6226p095j2664J3654L19
$$ plain form
1940 3716 -7544 94 871 -7987 -484 -1624 -10181 1414 2101 -11117 198 8036 -7443 -2856
1954 -2856 8499 -2224 -916 8819 615 2046 8663 -2394 -681 10401 -1480 -3875 9724
1967 9724 -662 -7944 6144 -290 -9387 4542 1462 -9712 2210 3132 -8892 2142 4569
1980 4569 -8502 1427 7068 -5154 1655 7561 -7094 -1364 9125 -5027 -4196 8521 -4195
1993 -4195 -7765 5724 -1021 -6966 2725 -1858 -4956 5407 -1340 -6639 6302 1857 -6609 7003
2007 7003 6075 -6332 4190 8414 -3604 2003 5645 -3511 2765 5371 -5748 637 4838 -8413
2021 -8413 -2140 7627 -7370 -6973 6099 -3915 -5818 6031 -2998 -7421 5820 525 -4806 6295
2035 6295 117 -6385 7208 3229 -7390 5354 4057 -8506 3323 6712 -7880 -353 6366
$$ packed form
1940C716j1260P638P77q858P503j140q557J1595O87j3218J1315P838j5479M587
1954b856J1355j0723J308R735q204J431O617j1057J713J1082j1881k395J3599
1967I724j0386p282J4088o434r097J3929l080j1174J1922R22j2024J1034K427
1980D569j3071R929N641j2222O809N906j4655N730J0489j4152Q31J2717j2716
1993d195l570J3489o745n945R691m583l098J0363o747n299J2941m445q466J3612
2007G003r28j2407J0522M224j2018N607L642r156O276K606j1119O385M201j3251
2021h413O273R767j4997L97J3072j0014j903J1849r029m423J3241n295n331J1101
2035F295o178o502J3593l979j0619J2744j297j2563J1829L389j4592P527O719
$$ plain form
2048 6366 -5892 -1269 6295 -5160 -2316 6348 -3881 -1598 7009 -3993 -3125 9439 -1292 -5995
2062 -5995 7068 784 -5905 5349 1292 -6440 2931 1100 -6070 3420 879 -7574 3171 2821
2076 2821 -8097 2102 5203 -7647 287 7036 -5065 -991 6663 -3620 -954 6809 -4070
2089 -4070 -2264 7251 -3436 -3931 7193 -2850 -5959 7232 -523 -7497 5547 1341 -7114 4633
2103 4633 2859 -7127 3361 4323 -6084 3038 4709 -6581 2002 5927 -6550 -231 6480 -6510
2117 -6510 -2739 7306 -4409 -4692 6128 -2664 -4221 5942 -1595 -3959 6529 -613 -4521 7358
2131 7358 614 -6459 6649 3343 -6669 3773 3773 -6292 1879 3246 -6365 958 2872 -7142
2145 -7142 644 4332 -7766 -1595 6370 -5568 -2116 7484 -3001 -3027 7162 -1615 -3067 7977
$$ packed form
2048F366j2258M623P564j1455K844Q664j0229K283Q607j1002Q68J2564j0731m703
2062e995J3063o284o689J1254m057p732R371j831p170R490k541q453J0745l50
2076B821j0918J0199L101j2850P934O749j2101M074P654j0283K666P763j0879
2089d070J806R515j0687m95J1124j0043l109J3191p755o974J3044m206q455J1747
2103D633j774r986J0488R62j0407R122J671j1290Q583L925j2477O319O711j2990
2117f510L771J0045j1715k83J0820q792j557J0163p537k364J0488p142l908J1879
2131G358o744p073J3108l306j0012J0442%j0065Q171J367r611P323J914j0014
2145g142P786L688j2098O171P965j1938L452R600j0485k6J0189q777j452J1044
$$ plain form
2159 7977 -700 -3981 7360 470 -6122 5434 1245 -6544 4584 1897 -7628 3133 2743 -8055
2173 -8055 1927 4789 -7303 487 6681 -4922 -945 5843 -3915 -153 6454 -3696 -1007 7462
2187 7462 -4429 -4821 7124 -2278 -6732 5239 -67 -6469 2929 -1010 -6261 3603 81 -6161
2201 -6161 5355 3340 -7034 3775 6246 -5366 1974 7320 -2738 2131 6013 -4264 869
2214 869 6134 -5678 -1376 7611 -4412 -5322 5366 -3813 -6587 3835 -2099 -5066 5123 -1999
2228 -1999 -6527 5562 54 -7469 5595 4800 -6091 3023 4545 -5051 1723 3602 -5352 2905
2242 2905 5566 -6538 -280 6575 -6635 -3957 6869 -1809 -2961 5701 -1543 -2702 5066 -2599
2256 -2599 -2922 8407 468 -4877 7378 2393 -7015 3077 3037 -4465 3257 1693 -5251 2473 383
$$ packed form
2159G977q677l281J1341o890o592J1556m189p789J1128k687r525J0761l90j0798
2173h055R982K862j2092P790O194j1603L977O788r758L762O607j0150K689Q469
2187G462j1891l92J1945r402m454J1971n306o402R398l939n251R864l522o242
2201f161J1516k015j0374J0809K471j1612P340N346j0058M869L882j0277N133
2214H69N265j1812M302Q987j2023r10J0688r179k774J0422n934k967J0189p122
2228a999m528J2089n508p523J3064p95j0891R114J522r596O774J879q954Q257
2242B905K661j2104O258O855j3210K678J0826q678j152Q662p244j159P768p665
2256b599l23J1329p939n345J2255m985r408J0092m0p502P722j564o944P724k090
$$ plain form
2271 383 -9452 869 4601 -7885 -1252 5925 -5761 -3789 3633 -3895 -1231 5830 -3475 -711
2285 -711 8568 -3744 -5360 8414 848 -5016 7181 3850 -4356 3615 768 -4651 4486 1534
2299 1534 -5934 5470 4943 -8392 213 4871 -5932 -975 5304 -2745 15 2856 -6058 -1097
2313 -1097 5029 -5548 -2571 7924 -2338 -5333 4551 -2050 -5418 3852 -679 -2836 6016 -1523
2327 -1523 -6751 5343 1223 -7983 4328 5876 -4940 1336 4211 -4377 1037 3202 -4463 3686
2341 3686 7395 -5955 -941 7855 -4712 -4373 6822 -46 -2586 4418 -1469 -3043 3627 -4292
2355 -4292 -4985 6927 -106 -7174 4664 1081 -8845 666 2106 -4377 2276 1769 -5156 2918 2252
2370 2252 -8082 1573 7465 -4383 457 7669 -2713 -2451 4847 -2698 -103 7136 -2719 -2559 7331
$$ packed form
2271C83r835J0321L732j2486O633P177j1686J972P422p528K664P061r305K764
2285g11R279j2312j616J3774p566n864J2197l331q206P971k847n419R137k952
2299A534p468J1404n27j3335Q605M658j0803M957O279q049K760K841q914M961
2313a097O126j0577K977J0495j0262k995R884o601l368R270m531k157Q852p539
2327a523n228J2094m120r206J2311J548j0816O276K875q588N414K165p665Q149
2341C686L709j3350N014Q796j2567L39J1195o868k540P004n887j574O670p919
2355d292o93J1912p033p068J1838l583r926R511J440o483O653n07o925Q074o66
2370B252j0334R655N892j1848M840P212j0382K62P298p545K595P239r855J60R890
$$ plain form
2385 7331 -2655 -6848 4929 1195 -5478 4086 2102 -4699 2082 -820 -5616 4702 2462 -6548
2399 -6548 3838 5517 -6923 -1250 4792 -3588 -590 4201 -2605 599 2974 -6885 -1838 5931
2413 5931 -5068 -3792 7414 -1359 -6024 3989 -272 -4585 4275 1031 -2230 6764 1038 -5582
2427 -5582 5659 3570 -6371 4085 6338 -4473 814 3659 -5123 -353 3132 -5774 -155 5402
2441 5402 -5463 -3666 4508 -4181 -4655 4494 -1180 -2626 4582 -1913 -3453 5438 -996 -4553 6907
2456 6907 2853 -5080 3319 2580 -4678 1656 1810 -3930 2998 1976 -6313 2071 3825 -7986 -819
2471 -819 6835 -3559 -1659 6051 -2498 -2174 4615 -1808 -585 6373 -2030 -3157 6728 -1139 -6255
2486 -6255 4834 1282 -6019 3168 1353 -5894 1472 670 -5921 2097 2594 -5822 1615 4610 -4985
$$ packed form
2385G331r986m193J1777l734o673R564j984o801O781k902m796J0318k240r010
2399f548J0386J679j2440N673O042q380K998M791o806L204K375r859N047P769
2413E931j0999J276J1206q773m665J0013m261m313Q860l244l261Q994n726o620
2427e582J1241k089r941J0456K253j0811N287K845q782M770L485q906N619N557
2441E402j0865J797Q174q689m74R149n674j446P208o495j540Q891o434l557J1460
2456F907m054p933Q399p39p258O334J54n740O928j022q289Q384J754j1811P167
2471h19P654j0394J900P710q549L24O789o423J223O958q403j127R885p867n116
2486f255J1089l552p301R187j815p247P366q02o591Q018M97q416P437K995r595
$$ plain form
2501 -4985 -164 4717 -3590 937 5880 -2847 -370 5589 -3252 -2558 6131 -1537 -3837 4761 -969
2516 -969 -4320 3482 -1353 -4499 3945 -369 -5237 4733 1226 -6702 2973 3839 -5486 1897 5082
2531 5082 -3693 1034 3546 -3921 666 4496 -4753 -335 5369 -4267 -2897 5230 -3068 -4257 4709
2546 4709 -974 -3534 4365 -618 -3802 4311 226 -3848 4658 1573 -4852 3898 2549 -5288 2272
2561 2272 3163 -4961 1591 3546 -5650 -484 4211 -4511 -1219 4008 -3709 -1309 4916 -2962 -2058
2576 -2058 5018 -2646 -2538 6567 -449 -4269 4810 821 -4206 3591 1440 -4394 2615 949 -4402
2591 -4402 2627 1283 -5642 2293 3614 -5390 647 4302 -4410 -623 4903 -3200 -1241 4379 -2624
2606 -2624 -1176 4358 -3237 -3078 4775 -1996 -3585 4444 -1631 -5229 4168 414 -4803 3224 1464
$$ packed form
2501d985M821M881q307M527M943q727K477N959q841O94Q689p668k300Q598n730
2516i69l351P802m835l146Q444m314m868R970l507p928R675Q66r325P383L185
2531E082q775M727K512p467M587L830r249M418N704r636J370Q127q298j189Q966
2546D709n683k560P899m983l184Q113m085m074Q506l085o425Q750j349p837P560
2561B272Q91q124O552J955r196N166M695q722L292N227p717K400O225p878R04
2576b058P076p664J08R105p016l820R079l989n027P797k151n834P009j666n351
2591d402P029j344o925P935J321r004O037L655q712L787N526q103J959N620p003
2606b624J448N534p595J59P853o771j589Q029o075l598R397l754n217Q027j760
$$ plain form
2621 1464 -4547 2890 2904 -4213 2366 3211 -4017 2383 4132 -4183 819 4517 -4080 -947 4694 -3923
2637 -3923 -2554 3987 -2781 -3433 3353 -2434 -3023 3661 -1662 -3671 4306 -654 -3785 4479 859
2652 859 -4671 3769 2767 -4204 2342 2823 -4297 1612 2877 -4618 652 3056 -4823 5 4214
2667 4214 -4487 -1155 4822 -2870 -2100 5248 -1628 -1945 5091 -218 -2467 4873 323 -3006 4268
2682 4268 604 -4285 3218 746 -5055 2230 1232 -5806 978 2061 -5502 71 2690 -4681 -401
2697 -401 3818 -3038 -313 4262 -2605 -117 5095 -2250 -1043 5735 -1016 -2606 5109 -425 -3798
2712 -3798 3619 166 -3929 2822 13 -4026 2595 537 -4923 2484 2162 -4963 1916 3822 -3708
2727 -3708 519 4187 -3171 320 3721 -3237 -324 3917 -3176 -2179 4063 -2814 -3226 3588 -1980
$$ packed form
2621A464o011P437J4p117O579Q45p228O400J749q315N002L698q597L133N641q617
2637c923J369O541o768o52O786n787n89O684n323k009P977m960l131Q264l620
2652H59n530Q440j002o971O546M81p120N909J265p495N270K404p879M828M209
2667D214q701L332N977p692P70P348o876l17P036n309k249P340m550l329P274
2682D268l664m889P503k472n801P285r98p038O784J083p563N573K619p371M280
2697d01M219o856K725M575o867K488N212p345J207O778o751j590P715n534l373
2712c798P417l453m095O751k809m039O621k058n460P407l22p125O879J906p530
2727c708M227L668p358L491L401o958K913M241p093R97O242o877m12O814n568
$$ plain form
2742 -1980 -4029 2983 -1022 -4079 3554 307 -3601 3730 1825 -3832 3290 3055 -3246 2661 3585
2757 3585 -2871 2064 3354 -4266 618 3675 -3927 -1383 3988 -3165 -2767 3230 -2714 -2785 2930 -2138
2773 -2138 -2468 4056 -1760 -3141 4111 -296 -4025 3955 1883 -3855 2440 1900 -3298 1805 1403 -3960
2789 -3960 1934 1951 -4831 539 3237 -4172 -724 4016 -2408 -1035 3782 -2089 -925 3969 -2161
2804 -2161 -1193 5357 -504 -2616 4253 -72 -4116 2947 497 -3173 2613 304 -4095 2301 717
2819 717 -5740 1448 2719 -4356 176 3464 -3140 -707 2836 -2475 596 3686 -2732 -64 4755
2834 4755 -2949 -2654 4365 -573 -2792 3723 160 -2774 2414 -630 -2870 3522 -18 -3406 3719
2849 3719 1728 -4463 1278 2943 -3284 1092 2853 -2326 999 1942 -4253 376 3323 -4027 -1143
$$ packed form
2742a980k049P012m005l057P633l247l908P331j905n657P122k35o301N907R24
2757C585o456M935J290p620M884L057p602K544N371p153L98N997n944p1N715n068
2773b138l30O524n816j381P252m407l729P980k072n738O295n40n198N103m02n363
2789c960N894J7o782N370K698p409L448M740o424J373M817n871J164M894o130
2804b161R68O550n861k112O869m325m044P063k450l670N786k309m399O396j584
2819G17o457P188J271p075M532L288o604K433L543n311L071L090o418K668M819
2834D755p704K95P019m938k219O515l563k934N188l044k240O392l540l388P125
2849C719j991o191N741J665o227M376J761n179L325R43o195M629K947p350K884
$$ plain form
2864 -1143 4719 -2402 -2765 2770 -1736 -2325 2960 -1132 -1406 4047 -1217 -3469 4017 549 -4224 3302
2880 3302 2913 -2982 1267 1232 -3222 1284 1357 -3251 2022 2936 -4192 -360 3513 -3525 -1795 3716
2896 3716 -1160 -749 2727 -2113 -1010 3310 -2301 -1556 5112 -370 -3618 3256 353 -3921 1563
2911 1563 631 -2517 2386 540 -3764 2163 892 -4872 1714 3623 -2977 41 3403 -1955 -359
2926 -359 2451 -1838 1008 3627 -2605 -562 4398 -2802 -3625 3783 -197 -3102 2411 -217 -2880
2941 -2880 1677 -1097 -3300 3260 843 -3660 2995 2476 -4078 867 2820 -2146 922 2933 -1937
2956 -1937 945 2166 -3670 -216 3556 -3154 -1601 4215 -1556 -3135 2199 -1431 -2047 3012 -877
2971 -877 -1465 3967 -1053 -3383 3298 1413 -3331 2444 2468 -2370 1307 993 -2990 1437 1579 -3416
$$ packed form
2864a143N862p121l63N535m506n89N285m092k74N453n264k252P486l468m773P526
2880C302l89n895M249l5m454M506P3m608N273R14p128L832L873p038J730N511
2896C716m876M11L476m840J103M320n611P45O668n482l248O874k903m274N484
2911A563r32l148M903j846m304N927j271n764O586J909o600L018L362n358J596
2926c59K810m289K846K619o232K043M960p200q23P408l980k905N513k628k663
2941b880M557k774k203O560k417m503O655n19o554M945J953m966L068K011m870
2956a937K882J221n836L454L772o710J553N816n771j579N334l630o16N059l889
2971h77n88N432n020k330O681j885m744N775K4m838L677l14l983M427J42m995
$$ plain form
2987 -3416 1239 3186 -4336 -1129 3324 -2722 -1778 3011 -941 -817 2625 -1774 -1106 3684 -1335 -1944
3003 -1944 5160 693 -3117 3011 1167 -3350 1650 1061 -2592 1898 579 -3794 925 902 -4483 435
3019 435 3050 -2922 -344 2633 -2076 -665 2567 -2022 90 3589 -1889 -1201 3811 -1305 -2762
3034 -2762 3175 214 -2346 2297 -337 -2681 2208 -282 -3517 2826 961 -3607 1970 2357 -3395
3049 -3395 641 2551 -2019 975 2442 -2179 752 2804 -3201 -248 3648 -2158 -1856 3414 -1226
3064 -1226 -2711 2017 -846 -2233 2455 -772 -2314 2759 -11 -3372 2598 1119 -3064 1924 2301
3079 2301 -2369 1232 2040 -2454 1124 2277 -2821 621 2664 -2850 -688 2862 -1947 -1220 2889
3094 2889 -1675 -1354 2809 -1718 -1927 3178 -507 -2726 3103 237 -3101 2030 475 -2751 1473
$$ packed form
2987c416M655J947p522L207M453o046R44M789l952J24L442m399O68M790n019o09
3003a944P104m467l810O128j844m517N000n89l653M490j319m373M719k3n385M918
3019D35K615n972K578K977m709J411L232m589K112L499n478O88N012n116j457
3034b762N937k961k560M643k634k344M889k490l235O343j865m568N577L87n752
3049c395M036J910m570K994J467m621K931K052o005K953L896n806L02N270m640
3064a226j485M728k863j387M688l227j542N073k770l361N970j479m183M988L77
3079B301m670L601Q08m494L578J153n098L442K043n514K162L550m809P27M109
3094B889m564L21M163m527k09N105l685k219N829k866l338N131j555l226M224
$$ plain form
3109 1473 810 -2825 1867 997 -3556 1206 2003 -3380 -84 2871 -2324 -111 2778 -1903 -667 2866
3125 2866 -1556 -346 3408 -1448 -1617 3326 -817 -2432 2846 -158 -2615 2322 284 -2869 1670
3140 1670 641 -3089 1893 1307 -3062 1406 1872 -2979 764 2296 -2829 251 2882 -2454 -623
3155 -623 2594 -2262 -1515 2728 -1690 -1943 2576 -1366 -1866 2608 -825 -1931 2731 165 -2200 2788
3171 2788 842 -2432 2016 1895 -2294 1653 1783 -2291 1322 1609 -2596 493 2066 -3140 -207 2331
3187 2331 -2826 -1307 2625 -1834 -1418 2763 -1441 -1750 2825 -831 -1860 2787 -156 -2073 2572
3202 2572 450 -2547 1880 520 -2881 1389 904 -3302 581 1632 -3054 687 2017 -2077 208
3217 208 2396 -1741 58 2812 -1471 34 3236 -1297 -1087 3362 -748 -1673 2705 -579 -2323 1892
$$ packed form
3109A473o63l635M692q70m553M762P97n383L296K955n195K213K889m681J236L533
3125B866m422J210L754m856j69M943m143j615N278l004k457M937k038l153M539
3140A670j029l730M982n86m369M468M66m851L743J532n125L080K631n336J831
3155f23L217m856P47M243m418k53M519l942n00M474l433j106M662k566k365M988
3171B788j946l274M448j21m189L947J30m074L613K87m205L089J573n206K933K538
3187B331n157J519L932m459M16M181m204l09M575l656j029M647k943j917M645
3202B572k122k997M427j360l401M270m85m206L883J051m686L741J330m094K285
3217B08K188m137J799K754m283J505L202m533K10M449m110r25M378l284j744M215
$$ plain form
3233 1892 -410 -2785 1720 -258 -3398 1443 519 -3512 1141 1361 -2905 775 2250 -2515 618
3248 618 2881 -1688 231 2811 -1668 -129 3041 -1603 -1008 2753 -1559 -1870 2613 -927 -2495 2125
3264 2125 -432 -2614 2297 152 -2568 1925 1135 -2445 1994 1564 -2078 1610 1785 -2350 972 2205
3280 2205 -2440 -27 2260 -2509 -1047 2058 -2262 -1375 1913 -2014 -1508 2221 -1132 -1588 2783 -368
3296 -368 -2131 3055 702 -2064 2590 1247 -1979 2197 1498 -1871 1560 1334 -2440 1020 1766 -2828
3312 -2828 91 2005 -2828 -828 2070 -2043 -1160 2041 -1462 -669 2486 -1197 -1410 3011 -543 -1898
3328 -1898 2964 -123 -2204 2171 476 -2210 1567 520 -3010 1535 929 -2929 684 1609 -2803
3343 -2803 332 2247 -1825 405 2242 -1769 125 2682 -1570 -492 3403 -1120 -1493 2676 -805
$$ packed form
3233A892k302k375M505j978l140M841r24m031M653K20m266L680J475m765L133
3248F18K263m569J919K580m479J539L170m644N95L761m312l11M483l540j568M620
3264B125k557k182M911k145k720M493p90l580M439m30l642L688J75m135L322J233
3280B205m645K413K287m769J462L105m320Q87L288l927N06L729l353m56M371l151
3296c68j763N186k353k766M654j343l226M176o99l369L431k26l774L460P46m594
3312b828K919J914m833K000K898m113Q83L201l503P93L155l683k13M421l554j355
3328a898M862l087k081M375j695k686L777j047l530M545o06l858L613R25m412
3343b803L135J915m072K230J837m011J894K557m252J078L895m523l73M169l481
$$ plain form
3358 -805 -2235 2025 -393 -1923 2018 -407 -2398 1933 75 -2873 1713 1365 -2430 1030 1771 -2495
3374 -2495 587 1867 -1860 959 2263 -2166 215 2316 -2317 -938 2972 -1242 -1452 2365 -937
3389 -937 -1793 1756 -1239 -1643 2266 -108 -2016 2482 746 -2664 1553 1308 -1759 1359 1229 -2165
3405 -2165 1308 1142 -2596 605 1842 -2615 -43 2385 -2112 -1534 1863 -1403 -668 2166 -1235 -505
3421 -505 2594 -1128 -1445 3049 -121 -2129 2531 757 -2176 1275 18 -2346 1447 303 -2527
3436 -2527 1368 941 -3083 409 1744 -2776 -100 2258 -1210 -58 1853 -1507 -101 2215 -1459
3451 -1459 -429 3154 -1038 -1721 2072 -637 -2208 1372 -69 -1700 1891 -178 -2180 2094 360
3466 360 -2656 1837 1756 -1946 1040 1759 -1715 572 1545 -1567 913 2009 -2236 -200 2292 -2416
$$ packed form
3358h05j430M260k418j530L941k425j991M331j858k948M586l48l795L460P41m266
3374b495L082J280l727K819J304m429K381K101m633J379L910m214k10L817l302
3389i37q56L549k995m04L909k374j908M498j736l410M217k45l067L118j30l394
3405b165L473j66l738L201J237m457K572K428m497N78L397l266P35K834l401P30
3421e05L099l722l17M494l170k008M660j774k933L451j257k364L793j144k830
3436b527L895m27m024L492J335m520K676K358l468J152J911l360J406K316l674
3451a459J030L583m192o83L793k709j571L580j441j631L591k069k002M274j734
3466C60l016M493q1l702K986P19l474K287R73l112K480J096m245K036K492m708
$$ plain form
3482 -2416 -1513 2488 -1035 -1578 1644 -1086 -1793 1607 -1516 -1800 2599 -85 -2188 2465 1104 -2451
3498 -2451 1394 1623 -1372 1132 1399 -1448 1303 1363 -2706 661 2172 -2297 -592 2313 -1788 -1493
3514 -1493 1294 -1662 -1024 1899 -1287 -874 2610 -1041 -1801 2713 458 -1634 2056 1238 -1683 1214
3530 1214 265 -2100 1395 270 -2620 1140 1427 -2862 -160 1476 -2116 -189 2004 -1378 175
3545 175 1658 -1496 -39 2774 -1060 -590 3292 -176 -1545 2102 280 -1642 1579 -75 -1823
3560 -1823 1563 -326 -2776 1416 372 -3162 830 1408 -2163 69 1458 -1813 60 1500 -1648
3575 -1648 513 2246 -1640 -579 2633 -1308 -1266 2227 -475 -1306 1903 -595 -1648 1521 -637 -2059
3591 -2059 2192 383 -2207 1683 1066 -2149 1037 1161 -1348 1224 1507 -1658 823 1401 -2348 143
$$ packed form
3482b416R03M001l523n43L222k730p07L400l123k84M399k684k103M653j361l555
3498b451L845K29k995K504K67k847K751O0m069L367J511m469J705K905m101K95
3514a493K787k956O38K923l186M13L484l651p60M514k255k092L690q18k921K897
3530A214r49k365L495j125k890L760K87m289K702J636l592J927K193l382J553
3545A75J483l154J457K813l834M70L882l468j369L647j822j922L221j654j748
3560a823L386j889k450M192j044l534L992N78l571K232J389l271J873J440l148
3575a648K161J733l886J061L212l941M2L493k702q31L209k498j053L169k158j422
3591b059M251j809k590L890o17l215L186J24k509K572K83l165K481N78l749K491
$$ plain form
3607 143 1895 -1992 -724 1853 -1445 -1284 1507 -1383 -946 1884 -1255 -1225 2138 -822 -2288 1958
3623 1958 522 -1977 1686 609 -1606 1118 727 -1763 1352 1093 -2040 1285 1840 -2274 -96 1605
3639 1605 -1627 -515 1677 -1290 -609 1915 -1482 -738 2140 -1237 -1256 2328 -314 -1697 1534 -55
3655 -55 -1892 1385 84 -1826 1450 193 -2346 1220 961 -2333 763 1645 -1815 123 1458 -1852
3671 -1852 -6 1863 -1517 -146 1935 -1297 -967 2112 -1284 -1181 1840 -244 -1486 1672 -359
3686 -359 -1582 1897 90 -1774 1868 818 -1895 1359 1051 -2015 863 1170 -1689 681 1187 -2005
3702 -2005 189 1634 -2047 -136 1852 -1748 -804 1719 -1023 -1127 1756 -756 -967 1956 -183 -1081
3718 -1081 1987 -194 -1395 1908 921 -1614 1237 817 -1846 1014 690 -1978 661 1216 -2181 138
$$ packed form
3607A43J752l887J268K577l298J61K791k890M37K830l139L0L363k960j466M246
3623A958j436k499L663j077k215K724l91k490L115k59l133L325N55m114K178J701
3639A605l232J112K192k967O81K524l397P44K878l377j9L584k642j383L231j589
3655e5j837L277j301j910L276j257k539L566k59l294L096Q82l460J938J335l310
3671a852J846J869l380J371K081l232L30L079l396J03L021k084j242L158k031
3686c59j223L479j807j864L642j050k713L254l08l066K878L07k859K370N06l192
3702b005K194J445l681J911J988l600R44K523k742j04K883k512k11K923k139q98
3718a081L068k181j201L303r87k535K851m20k663K860l24k668K639N55l397K319
$$ plain form
3734 138 1414 -2019 68 1577 -1489 -350 1711 -1533 -542 2147 -943 -865 2152 -527 -1144 1956
3750 1956 -329 -1848 1690 111 -1793 1144 187 -1843 977 639 -2114 923 1078 -1552 505 1727
3766 1727 -1660 533 1728 -1605 56 2006 -1171 -331 1889 -956 -884 1751 -745 -1264 1332 -755
3782 -755 -1564 1258 -462 -2102 1303 39 -1841 1311 527 -2032 1044 1041 -1559 728 1349 -1662 599
3799 599 1538 -1793 24 1935 -1423 -425 1502 -1199 -1064 1323 -1058 -1189 1721 -858 -1206 1411
3815 1411 -184 -1651 1601 225 -1430 1431 413 -1354 1202 759 -1768 1077 1159 -1899 438 1241
3831 1241 -1717 -59 1342 -1662 -259 1416 -1080 -700 1387 -1266 -636 1939 -804 -824 2082 -355
3847 -355 -1172 1721 288 -1286 1408 -18 -1530 1044 666 -1753 903 845 -1959 396 1245 -2015
$$ packed form
3734A38J276l433K087J509l066J139K061l244R91K689l090P8L017k679o17L100
3750A956k285j519L538j579j904K937r57k030K820l38k753L037J55k630K057J222
3766A727l387K193J195l333J661J950l177Q40K220k845P2K635k496n19K596k087
3782g55q09K822j720j640L405j264j880L152p84k559L076lk600K287O21l011K261
3799E99R39l331J817J911l358R98J927k701J35K387k381j31K910k579l48K617
3815A411j595j467L252j376j655K861j018j767K556m43k527K845Q2l058K337Q03
3831A241k958J658J401l004J403J675k496L80K087k653O30K575k743k0K906k437
3847c55q17K893j433j574K694j426j512K574l78k419K656n8k804K355Q49l260
$$ plain form
3863 -2015 101 1182 -1519 -95 1471 -1423 -276 1749 -1172 -561 1820 -941 -644 1653 -318
3878 -318 -1328 1325 -277 -1198 1434 -223 -1629 1164 465 -1867 1096 595 -1796 422 1159 -1601
3894 -1601 261 1183 -1375 434 1479 -1298 217 1994 -1386 -522 1348 -796 -1041 1196 -548 -843
3910 -843 1291 -545 -1184 1537 -202 -1478 1473 343 -1494 1208 808 -1367 936 721 -1586 663
3926 663 1044 -1555 403 1350 -1603 -553 1384 -1192 -258 1375 -1116 -806 1330 -977 -800 1562
3942 1562 -555 -966 1800 149 -1372 1225 258 -1170 1073 322 -1527 818 -23 -1791 520 721
3958 721 -1782 330 1368 -1600 -108 1236 -1021 12 1308 -857 -238 1677 -1199 -460 2030 -668
3974 -668 -822 1410 -75 -1459 843 -269 -1367 1037 -40 -1568 1208 279 -1756 543 908 -1421
$$ packed form
3863b015K116J081k701J424J566k894J147K025k921O11K381k761K97K297j971
3878c18j010K653j602r21K632j657j406K793o99k332K963n01k391K218P37k760
3894a601J862R22k558J809J045k777J515J777l380Q64J870k144k45K237j744k95
3910h43K134j836o39K721j739j276K951j130j837K702m00k175K303k15k307K249
3926F63L81k599J958R47k953J050J937k576R34J633k491L10K136k307J77K362
3942A562k117m11K766j651j521K597r67j428K243p51j849K345q41j768K311K01
3958G21k503K112J038k968J492J344k257J033J296k165O19J915k876P39K490k698
3974f68j54K232j485j384K302j112j098K404j077j528K776r29k035K299L65k329
$$ plain form
3990 -1421 606 1161 -971 393 1115 -1299 71 1330 -811 168 1677 -834 -712 1345 -819 -1121
4006 -1121 942 -549 -664 1151 -467 -1378 1348 -117 -1402 1213 854 -1358 766 1050 -983 499
4022 499 762 -1052 865 1040 -1302 25 1154 -1558 -600 1291 -986 -709 858 -880 -504 1019
4038 1019 -1043 -675 1733 -476 -1218 1652 205 -1226 1158 811 -873 1176 593 -1278 987 414
4054 414 -1520 336 917 -1546 14 840 -1401 -528 709 -880 -188 1118 -813 -156 1545 -690
4070 -690 -836 1852 -3 -830 1462 186 -1089 892 -250 -1067 782 -54 -1394 796 760 -1834 276
4087 276 722 -1097 364 1037 -735 136 1018 -1116 244 1658 -891 -187 1621 -750 -972 1152 -330
4104 -330 -1249 855 -118 -645 858 -353 -1236 877 47 -1489 613 875 -1187 433 779 -1031 376
$$ packed form
3990a421K027N55k132J364P22k414J370J259k141R79J509k511J22K057k164l02
4006a121K063j491j15J815j618r11K726j465j285K615l59k212K124K84k033J482
4022D99K63j814J917J75k342J327J129k712R58J891k277K77J567j738L76J523
4038A019k062L68K408k209p42K870j447j431K384l47j684K049n83j871K265n73
4054D14j934J856N81k463J560Q26k241Q73J237j589O92J306j931O57J701k235
4070f90j46K688j855q27K292j276j275J981j142q17J849q36j340K190l6k594K110
4087B76M46j819J461O73j772Q71Q82k134J360J414k549P04J808k371k22K124j482
4104c30r19K104r73n27J503j211q83K113q30j536K102K62k062J620L46j810J407
$$ plain form
4121 376 845 -768 732 1233 -1197 -201 1510 -965 -389 1173 -582 -447 1013 -422 -531 986 -793
4138 -793 -830 1454 -12 -1133 1324 144 -1260 925 701 -982 768 409 -1251 423 587 -1646
4154 -1646 138 1047 -1249 -312 1169 -965 -450 788 -736 -346 1085 -539 -490 1361 -377 -994 1150
4171 1150 23 -952 947 188 -929 769 283 -947 898 587 -1382 712 622 -1305 193 759 -889
4188 -889 235 1086 -733 90 1035 -947 -223 1041 -667 -591 1464 -398 -939 826 -383 -794 1023
4205 1023 -128 -907 955 -37 -1344 940 112 -1442 326 649 -1049 288 625 -918 233 831
4221 831 -1148 143 1001 -952 -298 703 -778 -587 818 -401 -523 967 -325 -1001 831 -513
4237 -513 -1156 1055 156 -879 754 602 -1185 633 485 -870 560 698 -915 357 775 -1279 18
$$ packed form
4121C76M69j613J500N01k430R96J711k475N76J562j755J35J460j435j09J517j779
4138g93l7K284j466j121K457j180j404K185k24j683J750l59j660J674J64k233
4154a646J784R09k296R37J481k134N15J238j524L90J431j624M9J851j738o17K144
4171A150j127r75J899p59j117J698m86j230J845l11j969K094r0j927J498N66j648
4188h89J124Q51j819Q23R45j982P24J264j708P6K055j862n41J765j209m11J817
4205A023j151p79J862r92j307K284q28j554J768L23j698J337L37j543J151N98
4221H31j979J291Q58j953O54J001j481J91J405j219j22J490j292o76J832j344
4237e13o43K211q99j035J633j52j787J818j48j355J430J38j613J272M18k054J297
$$ plain form
4254 18 986 -976 -278 1009 -970 -395 803 -610 -162 988 -485 -616 946 -61 -875 954 183
4271 183 -952 944 350 -871 647 212 -983 593 374 -1273 175 593 -1019 -45 579 -728 39
4288 39 828 -798 -190 1206 -714 -191 1253 -135 -479 906 -78 -610 760 -170 -1032 616 -204 -986
4306 -986 902 114 -1069 549 757 -1081 549 578 -1067 317 801 -922 134 955 -751 119 984
4323 984 -704 -368 929 -526 -471 886 -509 -834 807 -464 -830 789 64 -694 683 177 -867
4340 -867 496 457 -788 571 441 -758 627 728 -816 103 618 -840 -38 685 -811 -369 605 -722
4358 -722 -385 812 -614 -350 1001 -292 -699 918 -76 -914 807 412 -771 674 517 -782 564
4375 564 372 -1043 415 638 -1012 151 335 -931 117 771 -921 -344 981 -589 -345 862 -348
$$ packed form
4254A8R68j962O98J287j979N75J198j413M48J150j473j31J562j007q14J829p71
4271A83j135J896n94j221J518m35j195J576k19j647J448M18j612R74O24j307P67
4288C9P89j626O08J396j920N23J444j388l44J385r84n32J370r30q62J648q20p82
4306i86J888p88j183J618K08j838J630K9j645J384M84j723J056Q21j706Q70Q65
4323I84j688L36J297j455N5J357j395l25J641j271l66J619p25p58J377n06j044
4340h67J363l9j245J359j30j199J385J01j544R19N15j458Q02P23j496M42R74j327
4358g22L37J197j426K64J351j293m07J617r94q38J721l95j183J445j57j299J346
4375E64j92j415J458K23j650J163J84j266J048O54j692N77J325j570K44J207j210
$$ plain form
4392 -348 -165 1044 -335 -349 1109 -283 -480 941 -49 -905 843 184 -915 341 241 -1148 345
4409 345 532 -711 394 649 -943 5 590 -757 106 1166 -673 -242 1154 -459 -212 1124 -343
4426 -343 -621 518 -208 -452 547 -186 -767 751 123 -1138 717 322 -804 768 325 -661 366 547
4444 547 -770 222 443 -780 -185 823 -999 -260 782 -721 -286 696 -552 -408 535 -266 -450 877
4462 877 -269 -651 760 149 -557 795 449 -505 551 222 -650 306 360 -711 83 729 -783 42
4480 42 420 -899 -315 762 -540 -192 967 -420 -96 892 -407 -483 912 -106 -728 955 109 -628
4498 -628 585 -139 -718 548 -334 -897 368 348 -728 424 361 -737 -18 609 -512 -110 749 -718
4516 -718 29 867 -349 -33 894 -458 -387 1001 -89 -581 586 -297 -509 713 -238 -942 563 -2
$$ packed form
4392c48J83J209j379j4J458j392j97J421r90q56J748o59j099J256j00j389J493
4409C45J87j243J105K55j592R48N85j347Q63J060j839M31J396j613K47J336j467
4426c43k78J139p26k44R99p33n81J518o28j261J855l95j126J572m43r86J027J81
4444E47j317R92K21j223N95J008j822P39J042j503M35R82j248J44R43q01j84J327
4462H77j146l82J411o11p06J352l46r54J056l29q72R56N4j071P94O46j512Q25
4480D2L78j319N84J077j302L48J159j387L24R88j299p6J395j018o22J683q46p37
4498f28J213p24n79J266q82n63J265k0j076J152o3j098P19O27j121M02Q59j467
4516g18P47Q38j216L16R27j352P1J388j090m92J167q83k12J222r51p04J505n65
$$ plain form
4534 -2 -935 329 413 -600 443 469 -752 233 319 -737 326 790 -628 171 917 -528 -340 625 -481
4553 -481 -264 470 -400 -534 775 -432 -430 782 -252 -335 725 395 -709 568 483 -679 571 302
4571 302 -669 400 368 -834 368 600 -1086 -114 565 -542 -310 583 -597 -458 465 -614 -452 781
4589 781 -104 -472 839 -246 -498 588 56 -537 889 -67 -778 607 251 -818 288 337 -925 -135
4607 -135 563 -704 -165 421 -480 -73 646 -502 -61 895 -403 -387 864 51 -540 777 -120 -604 532
4626 532 -171 -677 629 48 -937 388 -116 -788 387 270 -717 365 709 -583 325 476 -437 394
4644 394 688 -561 10 833 -627 -394 478 -365 -588 653 -265 -355 639 -334 -630 689 -220 -621 807
4663 807 344 -742 491 472 -376 160 492 -734 615 265 -980 38 578 -634 -302 496 -221 -17
$$ packed form
4534br33J264Q4j013J043K6j221R85Q6j056J063M64j418P99P46j445J88R65j106
4553d81K17P34q70j34J309j207KJ212j034q3J060l30j104J277q5j162J250k69
4571C02r71J069l2j202J202K32j686R72O79j107K32Q93j180J39R23j079J62J233
4589G81q85l68J311j085k52J086n32n93J426r56p11J385l56j069J106M9j262P90
4607a35O98j267N39N86r01M07P19j148M41R56j298J6J251q13n91J317q97m84J136
4626E32p03n06J306n81r85J325n04o72J175j17r87J082L44j292R08J51r13Q31
4644C94K94j249N71Q23j460K33Q72q43k23J241r18r0R94r73k96J319r09m01J428
4663H07m63j086J233j9q48N36L32j226J349l50j245J018N40j212L32P98p17K04
$$ plain form
4681 -17 312 -347 -342 528 -641 -462 646 -98 -532 695 -79 -563 595 232 -288 500 99 -836 378
4700 378 288 -657 283 209 -578 211 480 -653 -67 568 -605 121 757 -204 12 743 -286 -566 704
4719 704 -92 -302 425 1 -476 580 -345 -842 617 54 -867 319 142 -595 145 424 -511 235 628
4738 628 -482 51 428 -634 27 745 -314 -67 817 -294 -385 467 -373 -340 645 76 -534 635 -266
4757 -266 -513 551 136 -384 360 245 -619 357 50 -410 305 352 -633 239 629 -529 43 419 -690
4776 -690 -119 588 -431 -402 393 -457 -258 614 -456 -444 746 -24 -328 440 57 -195 652 331 -559 650
4796 650 50 -455 342 168 -790 198 444 -764 64 270 -523 -145 552 -373 -151 611 -543 -109 790
4815 790 -245 -483 628 62 -169 691 -14 -320 336 -86 -880 474 28 -583 213 214 -785 215 464
$$ packed form
4681a7L29o59NQ70j169J79J108p44m34J227p74m84J158l63n20P88m01r35J214
4700C78r0r45R40p4p87P89K69j133N86O35j173P26O36r61K16P31j029k80J270
4719G04p96k10P27m24m77J056r25m97J459n63r21J186j77p37P40K79r35P46L93
4738F28j110N33L77j062O61P18j059K47Q84j111r1Q52q40L3R85n69o10J169r01
4757b66k47J064m15n20P44j15q64R76l07m60P15M7r85Q72L90j158N72L76j109
4776f90N71P07j019K9P95q50J99Q72j070J2J190p70l04P68l83k52Q47l21q90J209
4796F50o00n05P97j74r58R88K46j208Q28K06p93L78O97r25K22P62j154M34Q99
4815G90j035k38J111n66k31Q60p05l06O56m22p94J354m46o11P96Jr99J000K49
$$ plain form
4834 464 -659 114 178 -646 157 733 -203 93 707 -433 -238 889 -141 -301 418 -238 -165 409 95
4853 95 -408 447 -138 -668 413 177 -667 279 418 -450 262 394 -483 368 570 -576 207 567 -532
4872 -532 20 369 -534 -191 430 -342 -196 452 -35 -278 648 -17 -607 635 18 -215 689 70 -358 303
4892 303 422 -370 291 245 -516 359 294 -370 -224 452 -333 -148 587 -412 -214 93 -585 -399 567 -645
4912 -645 -118 663 -122 -316 533 7 -414 472 18 -539 329 57 -408 512 76 -624 177 231 -727 126
4932 126 274 -489 26 373 -185 -35 471 -268 -6 462 -325 -296 485 -14 -97 457 -397 -363 390 49 -839
4953 -839 529 130 -153 296 83 -428 303 524 -531 51 137 -284 13 210 -440 105 560 -417 -89 294
4973 294 -308 -273 483 -251 -424 533 10 -282 308 -121 -391 535 313 -587 409 -59 -326 223 326 -241
$$ packed form
4834D64j123P73O4q24Q03N76r36K96O14j140J95J127j030j60P19o56P3N74l14
4853I5n03Q55n85n30J081k36q44R46J39q68P12J32q77Q51K02j146P83L60j099
4872e32N52L49r03L43O21p72J46O48m87k43R26o65n90J242o17k33R04o19m28O61
4892C03J19p92O61m6p61Q75o5o64J46O76p85J85P35r99J98L07o78J86R66j212
4912f45N27P81p85j94Q49n26m21Q86m54n57Q68k72m65R20m36p00Q01N4r58Q53
4932A26J48p63N15L47n58J50N06p39K62M68p87K9P81m99q3N54q54L4P53l41q88
4953h39J368l99k83M49k13n11P31K21j055N82Q6m21K97J97o50N45M55r77L28L83
4973B94o02L5P56p34j73R57n23k92N90m29k70R26k22r00R96m68k67N49J03n67
$$ plain form
4993 -241 306 263 -545 68 261 -462 24 385 -434 0 232 -477 -246 291 -402 -127 620 -206 -75 615
5013 615 61 -185 143 118 -368 385 -14 -277 184 47 -206 445 -73 -556 351 219 -318 -332 153 -465 186
5034 186 469 -334 -160 165 -149 -214 404 -156 -289 328 -66 -353 618 71 -505 230 -307 -472 184 0
5054 0 -546 142 265 -545 128 189 -416 213 420 -375 76 427 -518 -258 428 -316 -165 278 -55 -121 304
5075 304 -336 -494 221 -277 -413 341 -37 -449 113 46 -219 301 119 -478 270 214 -259 237 220 -448 327
5096 327 486 -342 -66 438 -175 -44 472 -430 -320 262 -112 -239 602 -1 -234 365 26 -199 476 -151
5116 -151 -299 265 288 -451 159 113 -215 57 364 -290 -114 259 -212 263 35 -311 -66 352 -497 7 422
5137 422 -281 -141 362 183 -551 494 -243 -179 359 -4 -689 220 110 -114 242 61 -466 292 329 -458
$$ packed form
4993b41N47m3q08O13J93p23M86L61q19M34K32p09K31N37o93K75P47q26J31O90
5013F15n54k46L28k5m86P53l99k63M61j37k53O51n18m83R07j32n37j4M85o18O51
5034A86K83q03J74L25l14o5O18n60j33O17l94k87R71n47n76P35n37j65O56j84
5054@n46O88J23q10O73O1o05O29K07p95M51L51r45K60O86p44J51M43l33o6M25
5075C04o40j58P15m98j36P54l78m12N62o7k65N20j82n97P48n6m73M96j7o68P75
5096C27J59q28K76N04o13J31N16r02J10N82l74j27Q41o03k33N99l39k25O75o27
5116a51j48N64K3p39O10m6l28K72L07o54J76L73m71M75k28l46K45M18q49N04M15
5137D22p03J40N03j79p34J045p37O4N38l63o85R09j10k24L56j81n27P58L7p87
$$ plain form
5157 -458 8 311 -383 59 239 -421 -30 264 45 211 290 -35 -226 125 -202 -421 160 -369 -222 572
5177 572 138 -154 328 -11 -401 178 39 -243 201 6 -290 458 211 -424 60 239 -79 -63 370 -322
5197 -322 -2 182 -214 -53 99 -291 -6 447 -243 -496 274 34 -292 370 189 -451 27 94 -482 260
5217 260 46 -569 234 363 -426 107 298 -240 166 279 -168 -129 262 -207 -72 286 35 -92 304 -203
5237 -203 -240 424 26 -60 241 -296 -204 63 -19 -368 232 69 -382 114 219 -324 -44 319 -348 -90 348
5258 348 -113 170 48 -144 -225 510 -120 -256 316 -20 -227 145 134 -108 202 77 -427 372 113 -288 386
5279 386 -171 -403 119 107 -445 314 273 -224 109 9 -471 207 353 -524 9 450 -241 -171 237 -224 21
5300 21 186 -279 -373 159 -316 -102 140 172 -328 271 141 -260 554 205 -448 405 36 -219 183 223 -76
$$ packed form
5157d58M66L03o94M42J80o60L91K94k19J66P9l25j91L51l27k19N81n29J47P94
5177E72m34k92M82l39l90N79j39k82M44j95k96P48k47o35M84J79l18J6M33o92
5197c22L20J84l96J61J52l90K85M53o90k53P70k40l26O62j81o40M78O7n76P42
5217B60k14o15Q03J29p89N33J91n38M06J13m47L9L91m69J35L58k51j27L96n07
5237b03l7O64l98q6L01n37R2K67q2l49O00j63m51M96J05n43K80L63o67K58M38
5258C48m61K83j22j92q1P35o30j36N72l36k07L72j1k42L10j25n04P99k59m01O74
5279C86n57k32N22j2n52P59m1m97L33j00m80O78J46q77N33M41o91P0M08m61K45
5300B1J65m65r4N32m75K14K42L2n00N99j30m01Q14l49o53Q53l69k55M02M0k99
$$ plain form
5321 -76 -175 367 -230 -278 229 -352 -100 17 -212 -130 124 -57 -224 508 -167 -188 425 2 -252 88 153 -140
5343 -140 232 -20 -218 38 318 -344 -194 166 -309 -11 142 -98 -119 427 -29 168 433 -321 -74 93
5363 93 -71 -67 214 63 -171 71 -392 -153 13 -91 -361 4 38 -349 9 96 -49 -24 135 -36 71 -148
5385 -148 -123 143 336 -250 117 426 -151 -62 280 -38 -95 65 -228 -23 385 -93 -333 65 -202 -385 183
5406 183 59 -177 271 132 -282 182 427 -137 -30 180 -329 27 186 -392 67 8 -246 -109 382 -42
5426 -42 -52 244 9 -131 213 -95 -238 318 111 10 133 157 -245 94 74 -289 179 191 -231 115 77 -296
5448 -296 83 77 -2 131 180 -391 -141 255 -443 -14 157 -11 -208 -29 -156 -141 29 -9 47 -71 -130 -192 133
5471 133 175 -302 235 -95 -280 84 -89 -371 97 285 -165 -11 148 -87 112 311 -17 -15 262 -150 57
$$ packed form
5321g6r9N42n97m8N07n81K52J17k29Q2K54j81j67P32o75k1O13m23k54L40O5k93
5343a40L72k52j98K56K80o62J50L60m75K98J53k40k1N46m56J97K65p54K47J67
5363I3j64MK81j51k34K42m63K39J66j04k70L65L4l87L58Q7j45K5J59j71J07k19
5385a48K5K66J93n86L67L09n77Q9L42l18n7J60k93K05M08m78k40L98k67j83N68
5406A83j24k36M48j39m14M64K45n64J07K10n09L56J59n78M59n9k54J37M91m24
5426d2j0K96k35j40L44l08j43N56k07j01J23K4m02L39k0l63M68J2m22L46l8l73
5448b96L79op9J33M9n71K50L96o98M29J71j68j97J79j27J5J70l8N6j18n9o2L25
5471A33M2m77N37l30j85L64j73k82M68J88m50J54J59k35J99J99l28KK77m12K07
$$ plain form
5492 57 442 -103 18 260 -13 -139 141 63 -273 -99 153 -97 -52 174 -61 -67 165 -242 -56 254 -169 52
5514 52 206 -12 144 -45 -88 -2 240 -289 -96 76 -99 -149 220 -169 -289 24 -48 -99 40 -52 -196 298
5536 298 69 -248 138 87 -242 189 -64 -165 12 307 -196 23 246 -194 -153 36 130 -9 64 -168 -18
5557 -18 401 17 -27 -71 136 127 193 170 -69 175 -58 -182 200 140 -79 4 135 -232 116 200 -283 192 138 -145
5581 -145 -53 306 45 -118 447 -85 146 156 62 -214 254 266 -86 -119 145 -105 161 -247 -363 -235 114 -99
5603 -99 88 298 6 -115 176 -158 -156 94 -114 -67 139 -237 7 82 -24 103 213 21 -169 235 96 221
5625 221 -14 16 38 327 -99 50 -96 -194 84 235 166 -188 199 138 127 86 -103 39 -203 -41 153 56 -130
5648 -130 -233 -50 69 -183 -121 204 -2 -123 18 65 -70 166 135 -256 169 -8 39 135 -14 46 151 169
$$ packed form
5492E7L85n45J21K42k73j26K80p8l36J74K52k50M5K26k35oK32m07J86L10m23K21
5514E2J54k18J56j89m3Q6K42n29J93J72j75n0L69l89j20L13p2n1J39r2j44M94
5536B98k29l17L86n1l29M31k53j01J77K95n03K19K23m40M1J89R4j39P3k32J50
5557a8M19l84m4m4K07rO6k3k39K44k33j24L82o0k19Q3J31l67L48Q4m83M75n4k83
5581a45R2L59k61j63N65n32K31J0r4k76M68J2l52l3K64k50K66m08j16J28L49k13
5603i9J87K10k92j21K91l34KK50k08M7K06l76K44P5j06J27J10j92j90M04j39J25
5625B21k35L0K2K89m26J49j46r8K78J51o9l54L87o1j1m1j89J42k42J62J94r7j86
5648a30j03J83J19k52O2L25k06j21J41M7j35K36l1l91M25j77M7R6j49O0J05J8
$$ plain form
5670 169 -39 72 201 -18 52 207 -64 253 117 169 -157 68 -65 -108 161 -91 74 88 -253 -21 -162
5691 -162 -127 -306 -64 135 295 12 275 -33 35 255 -202 54 59 -254 68 54 -19 -78 113 66 -160 -33 44
5714 44 -112 -125 -110 317 -67 150 -165 264 -70 -121 171 -65 -235 -115 -119 28 171 146 129 211 -82 -195 30
5737 30 81 -40 -346 119 46 253 158 46 -125 199 135 -160 264 -118 -183 131 -188 -32 244 -19 109 -57
5759 -57 -105 81 38 59 -28 119 3 -89 32 294 -278 -170 293 -78 -188 -12 -97 60 101 -284 -270 203 -329
5782 -329 157 -43 222 -38 -78 -189 -175 467 225 -34 -61 -47 -128 -226 137 -287 -221 113 -364 -15 293 -116
5804 -116 40 199 -45 276 92 9 126 39 68 275 -38 -9 60 -25 -80 -18 110 -169 -87 -50 -103 86 -67 113
5828 113 -70 -63 -103 -69 220 43 64 -1 172 -154 -17 112 -137 58 -41 89 -198 -67 -272 -10 103 -142
$$ packed form
5670A69k08J11J29k19P0J55k71L17j36N2l26K25j33m3K69k52J65J4l41K32j41
5691a62L5j79K42J99J60k83K63l08O8K20m57K56Nl13L22j4p3n9J91m7k26J27P7
5714D4j56j3J5M27l84K17l15M29l34n1K92k36j70J20mJ47J43k5j7Q2k93j13K25
5737C0N1j21l06M65p3K07r5j12j71L24o4k95M24l82o5L14l19J56K76k63J28j66
5759e7m8J86m3K1q7J47j16r2J21K62n72J08M63l71j10J76q5J57M1l85J4M73n32
5782c29M86k00K65k60m0j11J4O42k42k59k7J4q1r8L63m24O6L34m77L49L08m09
5804a16J56J59k44L21j84q3J17q7K9K07l13K9O9q5n5O2J28k79Q2L7n3J89j53J80
5828A13j83Pm0L4K89j77K1o5J73l26J37J29k49J95r9J30k87J31k05K62J13k45
$$ plain form
5850 -142 -26 34 98 -176 -90 -92 -228 4 -93 -39 -45 -102 -68 127 -115 -219 33 224 -20 85 -81 -214 -52 72
5874 72 90 21 414 -30 -130 -94 -89 -343 60 -10 -249 130 57 108 187 162 -178 376 -144 -120 106 133 -67 97
5898 97 131 117 -122 -219 79 -285 166 -150 -140 22 -3 -184 -27 240 -119 -201 -60 -106 42 -44 86 17 -81 145
5922 145 28 8 -200 -102 -90 -16 -173 29 -34 -202 222 268 155 95 76 -191 41 171 -233 -61 62 -38 -135
5945 -135 -126 -23 -149 31 67 -130 -104 15 -142 -22 187 124 249 114 143 219 218 -30 86 -236 -28 150 48
5968 48 19 59 94 -35 -237 -191 -19 -81 140 187 -48 180 -92 -89 118 171 81 188 -107 -16 14 -153 11 -119
5992 -119 34 109 -147 -132 -305 -94 -102 58 242 -267 31 250 195 -86 55 26 -16 -32 279 34 38 287 -37
6015 -37 -183 -28 -119 -242 -20 50 90 137 101 67 -65 -50 -35 177 334 119 -23 -57 -81 156 187 49 161 83
$$ packed form
5850a42J16O0O4k74Q6kj36K32r7N4on7L4J95k42j04K52J91k44J05j66j33J62J24
5874G2J8o9L93m44j00L6Nk54M03p0k39L79p3N1P9k5l40N54n20K4K26K7k00J64
5898I7L4j4k39r7K98l64M51l16J0J62k5j81J57K67l59q2J41m6J48q6J30o9r8K26
5922A45j17k0k08R8J2P4j57K02o3j68M24M6j13o0j9k67K32J30m04J72J23j00r7
5945a35RJ03j26J80L6j97K6J19j57J20K09o3J25j35K9P6jk48J16l22K08J78j02
5968D8k9M0L5j29k02M6J72o2K21M7k35K28k72LK07N3r0J07k95R1L0j67J64j30
5992a19J53P5k56J5j73K11qJ60J84n09K98K19n5k81J41k9m2j6L11k45MK49l24
6015c7j46J55r1j23K22P0M0M7l6l4j32J5J5K12J57k15j42l4k4K37L1j38J12p8
$$ plain form
6039 83 -2 66 -98 52 188 3 0 -272 257 -84 -75 39 21 -184 97 -5 62 94 -55 151 106 -74 -234 181
6063 181 -10 40 -118 167 23 27 -133 2 -76 173 -57 -65 205 -220 -127 142 -47 -68 -27 -150 66 347 20
6086 20 -61 339 136 -29 68 5 82 268 166 -215 -113 170 -134 133 354 -12 -151 22 -91 -217 315 -155
6108 -155 12 -13 153 148 208 -251 -66 120 -13 -237 140 124 -116 42 47 -409 -219 207 -28 41 -67 -112 -143
6131 -143 -133 -204 68 33 -40 46 422 66 -278 77 175 72 203 189 -16 -134 44 -229 82 -188 -93 21 -3
6154 -3 9 209 -93 -213 -89 379 -53 148 316 -114 163 269 69 15 -8 27 -21 22 113 -146 203 -138 -289
6177 -289 -14 -239 -199 -138 143 -159 -68 180 2 166 -203 -234 85 41 40 -141 191 -240 44 267 -139 -128 -24
6200 -24 -124 79 37 -130 3 64 48 -62 441 146 -22 -121 -56 -45 20 168 49 2 365 -391 -11 164 -29
$$ packed form
6039H3q5O8j64J50J36j85lk72N29l41RJ14j8k05K81j02O7L2j49K06m5j80j60M15
6063A81j91N0j58K85j44Mj60J35p8K49k30qK70m25R3K69j89k1M1j23K16K81l27
6086B0q1M00k03j65R7o3P7J86j02l81J02K83l04K67K21l66j39J73j13j26N32m70
6108a55J67k5J66nO0m59J85J86j33k24L77j6k40J58Nm56J90M26k35O9j08m5l1
6131a43J0p1K72l5p3Q6L76l56l44L55R8j03J31j4k05j18J78k73L11k70R5J14k4
6154cJ2K00l02j20J24M68m32K01J68m30K77J06k00n4k3L5m8M3R1k59L49l41j51
6177b89K75k25M0O1K81l02R1K48j78J64l69l1L19m4jj81L32m31K84K23m06J1J04
6200b4j00K03m2j67J33O1j6j10N03k95j68r9O5J1O5J48j19m7L63p56L80J75j93
$$ plain form
6223 -29 -157 236 110 128 60 -228 -126 195 24 -56 43 -221 -99 121 55 -105 306 114 67 71 67 -237 199 -132
6247 -132 -215 -49 68 -436 187 124 -203 44 158 70 -1 227 159 -84 59 18 -55 357 -194 -161 -164 -94 -124 286
6271 286 -81 -16 179 99 -41 -68 50 -177 -58 194 42 232 50 24 30 150 25 -159 267 -45 132 -99
6293 -99 196 -116 16 -179 226 -127 -54 -187 -180 64 -199 162 145 -76 33 -51 -274 65 92 -128 -61 119 -291
6316 -291 -19 93 -260 -92 74 78 59 245 -70 -157 -146 -31 -49 182 -108 -323 130 159 -112 259 -63 -86 136
6339 136 -30 -141 155 71 -115 67 156 -120 40 -111 -21 105 77 -90 170 152 140 -40 86 -16 -56 150
6361 150 -141 -20 284 -107 107 272 178 149 -14 -54 8 -22 -172 -227 82 237 -98 -52 136 -192 -15 -6 -105
6384 -105 -153 143 -81 -244 38 -105 -156 113 155 -203 -144 71 56 -46 8 -329 271 -87 -277 188 -209 -133
$$ packed form
6223b9j28L93j26J8o8k88J02L21j71q0R9k64J22K20o6j60M11j92m7Mml04M36l31
6247a32q3J66J17n04O23o3l27K47J14q8p1K28o8k43J43m1p3M12n51L3lP0l0M10
6271B86l67O5J95q0j40k7J18k27J19K52j52J90j82k6OJ20j25j84M26l12J77k31
6293i9K95l12J32j95M05l53P3j33PK44k63L61j7k21J09q4k23L39K7k20O7J80m10
6316b91K72J12l53J68J66Mj9J86l15q7J1J15j8K31k90k15M53K9k71L71l22k3K22
6339A36j66j11K96q4j86J82Q9k76J60j51R0J26k8j67K60j8j2j80J26j02m0K06
6361A50k91J21L04l91K14J65r4k9j63m0O2l0j50n5L09J55l35M6J88l28J77Rr9
6384a05m8K96k24j63K82j43n1K69M2l58N9K15j5j02N4l37O00l58j90M65l97P6
$$ plain form
6406 -133 342 103 -22 -24 20 5 184 194 -125 207 137 -197 -301 34 -120 -182 208 -57 -14 227 -2 -229 11
6429 11 64 -204 123 133 -132 142 323 -176 221 219 -40 295 395 147 114 99 -253 18 23 -229 18 -48 31 -50
6453 -50 1 -18 -88 299 -134 -182 112 98 -281 155 -203 -138 46 -274 -131 254 85 -204 149 87 -368 28 135
6476 135 -165 54 107 -100 -47 -78 -297 -55 320 -74 -18 304 159 -165 51 3 123 71 -200 -422 81 328
6498 328 -100 272 -73 -160 75 -81 -155 215 110 -95 145 92 -281 160 390 -154 133 244 -100 -101 -73 -21
6520 -21 -50 20 -63 -177 3 12 -191 216 19 -111 337 -19 -126 226 -24 -154 -8 35 32 68 299 -243 -230 86
6544 86 -86 -156 -63 -112 43 187 41 -152 85 -22 -88 152 -19 -59 201 -21 113 324 37 -42 189 -28
6566 -28 -129 9 -113 -252 75 52 -96 35 186 -220 -45 262 -110 -71 164 -28 -155 394 -37 -12 167
$$ packed form
6406a33M75k39j25kM4j5J79J0l19L32p0l34j04L35j54o2L90k65M3K41k29k27K40
6429A1N3k68L27J0k65K74J81m99L97kk59L35J00k48l3j5l52K71Nk52K47o6P9q1
6453e0N1j9p0L87m33m8K94j4l79M36l58O5J84l20J43L85j69k89L53o2m55L96J07
6476A35l00K19N3k07N3l1k19K42L75l94N6L22j45l24K16m8J20n2k71k22N03K47
6498C28m28L72l45q7K35j56p4L70j05k05K40n3l73M41K30n44K87J11l44jK8N2
6520b1k9P0q3j14J80Rk03M07j97j30M48l56j07L52k50j30J46M3lL6K31n42J3L16
6544H6j72p0R3m9J55J44j46j93K37j07o6K40j71m0K60k22J34K11k87p9K31k17
6566b8j01J38j22j39L27k3j48J31J51m06J75L07l72L9K35j92j27N49m31K5J79
$$ plain form
6587 167 -282 -116 180 -80 3 100 3 -275 -35 49 -294 -228 -14 -11 53 305 -273 -12 12 -118 199 27 -222
6610 -222 8 46 23 -34 136 -214 -147 408 21 -101 465 -8 -250 262 -91 -177 72 -89 -370 80 108 -218
6632 -218 25 -24 -31 -75 221 -215 -72 176 -199 -7 124 -169 2 233 -240 46 153 -9 79 167 -124 98
6654 98 30 32 -67 230 158 -203 217 320 -259 67 113 -175 291 225 -70 -8 365 -209 -160 385 -54 141 114 -169
6678 -169 -153 342 -139 15 221 142 -49 238 48 213 198 133 -75 23 131 -283 14 107 -328 19 84 -63
6700 -63 25 205 -336 143 124 -181 366 274 -133 167 -33 -186 -247 243 -7 9 -83 -111 -79 244 -16 -184 122
6723 122 24 -139 256 183 -106 250 101 -210 -47 353 -161 168 65 76 93 223 -236 -108 286 -193 -85
6744 -85 45 -205 -195 111 -162 16 32 -126 -66 193 89 -313 123 43 -161 -18 202 -165 -75 -148 -61 163 125
$$ packed form
6587A67m49J66K96k60Q3R7r7k78K40Q4l43O6K14LO4K52n78K61K4j30L17j72k49
6610b22K30L8k3n7J70l50O7N55l87j22N66m73k42N12l53q6K49j61k81M50K8l26
6632b18K43m9pm4K96m36J43K48l75J92J31k93J71K31m73K86J07j62Q8Q8k91K22
6654I8o8Kr9K97p2l61M20J03n79L26M6k88M66o6k95O2L73n74M9N45m39J95k7k83
6678a69J6M95m81J54K06p9j91K87j90J65j5o5k08R8J08m14K97R3m35L47O5j47
6700f3Q8J80n41M79j9l05N47r2m07L00k00j53o1M90k50J6r2k8L2L23k60j68L06
6723A22r8j63L95p3k89L56j49l11J63M00n14L29j03J1J7J30m59J28L94m79J08
6744h5J30k50J0L06k73J78J6j58O0K59j04m02M36q0k04J43K20l67R0p3Q7K24l8
$$ plain form
6767 125 -266 85 159 -388 -202 -35 -5 -129 35 163 -49 82 152 -158 50 -160 11 127 90 -69 82
6788 82 250 -394 51 78 -279 219 214 -380 108 -55 -234 -93 191 45 89 297 -37 9 106 -28 170 466
6810 466 -48 -168 293 190 -135 208 19 -160 161 -207 -363 314 -24 -217 17 71 -291 -83 147 -270
6830 -270 36 320 -178 -69 312 -87 143 174 -20 15 -15 -78 61 44 -28 -312 172 -199 -172 223 100 -265
6852 -265 -100 76 -190 198 -19 47 32 38 -279 80 91 -268 -34 -86 -213 -271 -92 -246 -16 203 -149 -76 285
6875 285 -199 -70 551 -2 -95 250 -45 -165 -22 -54 -150 169 34 -60 -60 118 20 205 147 -381 32 -124 -310
6898 -310 -157 137 -43 45 126 -63 -109 559 -237 -82 201 -81 -164 74 57 -7 167 -62 -290 132 -53 -177
6920 -177 246 -79 -152 111 -5 -142 120 360 -274 -123 98 -180 218 111 -179 117 194 -116 -61 33 -50 20
$$ packed form
6767A25l91L51P4n47J86J67L0j24J64J28k12J31P0l10K08k10J71J16l7j59J51
6788H2J68o44M45K7l57M98nn94M88j63j79J41K84j46M4K08l34M6R7j34J98K96
6810D66n14j20M61j03l25L43j89j79L21l68j56O77l38j93K34N4l62K08K30m17
6830b70L06K84m98J09L81l99K30L1j94L5l0o3J39j7p2k84M84l71K7L95j23l65
6852b65J65J76k66L88k17O6j5Ol17L59J1l59K34n2j27n8J79j54K30K19l52P3L61
6875B85m84J29O21n53r3L45k95j20J43l2r6L19j35r4%J78r8J85n8n28M13j56j86
6898c10J53K94j80Q8Q1j89m6O68p96J55K83k82q3K38j7o4J74k29k28M22j85j24
6920a77M23l25p3K63j16j37K62K40o34J51K21k78L98j07k90K96P7l10N5R4q3P0
$$ plain form
6942 20 287 -247 -143 24 -16 -208 -32 -52 -273 107 -150 -221 325 115 -108 -56 241 -286 203 81 -118 37
6964 37 11 -384 104 -52 -46 -233 96 -46 -89 240 -282 146 215 96 -114 97 90 -334 331 23 -80 300 -4
6987 -4 -137 157 4 -399 74 181 -274 110 -132 -81 226 81 -375 -9 256 -232 -156 404 -164 3 329
7008 329 88 -129 269 -58 83 276 183 54 63 -81 -393 2 102 -97 15 -32 -99 85 65 -92 258 216
7030 216 -168 -163 451 -160 -26 310 205 76 326 -63 -2 222 -109 -109 237 92 -318 130 -82 -65 -132 77
7052 77 -108 256 132 -177 102 206 -219 219 211 -369 218 152 -118 56 209 105 -225 236 -255 -283 122 -1
7074 -1 -231 205 93 -370 177 362 -62 373 -29 -177 128 -114 -232 249 -149 -283 -55 94 -129 124 304
7095 304 -137 -237 130 -29 -107 266 -114 -14 44 -130 66 230 -161 -39 54 -32 -326 429 15 -354 144
$$ packed form
6942B0K67n34J04J67m0j92J76k0k21L80k57p1N46k10k23N2K97n27M89j22j99J55
6964C7k6l95M88j56Oj87L29j42m3L29n22M28O9j19k10K11pm24O65l08j03L80l04
6987dj33K94j53m03M73J07m55L84k42N1L07j45m56L66K65m88P6N60n68J67L26
7008C29k41k17L98l27J41J93r3j29Rj44l12L95J00j99J12m7o7J84k0j57L50m2
7030B16l84NO14o11J34L36j05j29K50l89O1K24l31%L46j45m10M48k12J7o7K09
7052G7j85L64j24l09K79J04m25M38qn80N87o6k70J74J53j04l30M61m91k8M05j23
7074ak30M36j12m63N47J85m24M35m02j48L05k42j18M81l98j34K28J49k23K53J80
7095C04m41j00L67j59p8L73l80J00N8j74J96J64l91J22R3q6k94P55m14l69M98
$$ plain form
7116 144 189 -336 63 306 -268 267 259 -284 -173 276 -399 57 361 -193 62 85 70 86 202 122 -287 -48
7138 -48 -38 -296 55 -35 -54 103 -178 -113 505 59 -80 237 66 -328 -93 -4 -137 44 72 -434 9 294
7160 294 -238 -201 135 -362 -208 335 52 -234 120 -232 -141 199 -279 -196 216 -35 -122 230 -129 -150 -91 31
7182 31 -119 340 128 -392 -64 -145 -313 191 511 3 -11 62 -322 29 315 -284 207 192 -230 -122 65 -123
7204 -123 -39 203 -73 -160 396 26 -287 142 -48 -272 -28 127 -182 67 -130 -81 74 187 -363 66 392
7225 392 -168 112 251 66 -27 318 -312 42 323 -227 -25 147 -189 -358 291 113 -235 124 87 -310 43
7246 43 -10 -458 301 -75 -229 73 105 -69 322 89 -173 -6 434 -316 -125 -67 -163 -63 60 -117 -88 235
7268 235 -191 -241 71 125 -261 205 -154 -277 225 64 -504 443 414 -286 8 -110 -98 -11 -55 -160 273 392
$$ packed form
7116A44M5n25L99K43n74N35qn43J11M49o75M56L04n54K55K3j5J6J16q0m09K39
7138d8J0k58L51r0j9J57k81O5O18m46j39L17j71l94K35Q9j33J81K8n06M43K85
7160B94n32L7L36m97J54N43k83k86L54l52R1L40m78Q3M12k51q7L52l59k1N9J22
7182C1j50M59k12n20L28q1j68N04L20n08j4P3l84L51K86n99M91j5m22J08J87j88
7204a23Q4K42k76q7N56l70l13M29j90k24K44J55l09K49j97M9J55J13n50M29L26
7225C92n60K80J39j85r3L45o30L54K81n50K02J72l36j69O49j78l48L59l7l97L53
7246D3n3m48P59l76j54L02L2j74L91k33k62J67M40p50J91N8r6J00J23j77K9L23
7268B35m26n0L12N4l86M66l59j23N02j61n68R47k9p00K94j18J2Q7m4j05M33J19
$$ plain form
7290 392 -538 -123 223 -425 -10 116 -39 -30 422 -83 -372 88 -120 36 167 58 -80 339 112 -92 139
7311 139 -129 -351 204 128 -261 181 43 -281 63 54 -236 -59 30 -217 64 324 -252 -172 361 78 -237 16
7333 16 151 -175 242 18 -83 473 2 -491 98 42 -257 -37 29 -128 151 98 114 -77 248 -116 181 348
7355 348 -298 77 369 -205 -109 64 -252 17 408 -111 -149 326 -55 -294 234 112 -390 126 -74 -256 173
7376 173 137 -6 277 19 43 97 448 -284 210 322 -289 -48 90 -2 -190 108 -322 107 125 -336 -234 429
7398 429 -344 -202 194 -134 -264 115 -76 -349 176 -4 -370 294 137 -131 -99 -40 -98 18 355 -225 -70
7419 -70 161 -201 -3 286 -93 38 295 -7 -27 264 -61 -303 396 -17 -81 250 -138 -325 391 -59 -250
7440 -250 96 217 -179 51 195 -59 148 103 -190 52 50 -224 77 115 -162 -216 137 -129 -109 293 -141 -145 171
$$ packed form
7290C92r30M15L46o48M15J26j55RM52n05k89M60k08J56J31j09j38M19k27k04K31
7311A39k68k22N55p6l89M42j38l24L44rk90J77Q9k47K81K60n76Q0N33k83l15K53
7333A6J35l26M17k24j01N56m71m93N89n6k99K20O6j57K79n3J6j91L25l64K97J67
7355C48o46L75K92n74R6J73l16K69L91n19l8M75l81k39N28j22n02N16k00j82M29
7376A73l6j43K83k58K4N4L51p32M94J12o11K41J38r2j88K98m30M29J8m61J02O63
7398D29p73J42L96l28j30L79j91k73N25j80l66O64j57k68L2N9n8J16L37n80J55
7419g0K31l62J98K89l79J31K57l02k0K91l25k42O99m13o4L31l88j87P16m50j91
7440b50L46J21l96K30J44k54K07m5k93K42kk74L01L8k77n4L53k66K0M02m34mL16
$$ plain form
7463 171 -151 -220 365 89 -198 107 -97 -304 216 -169 -355 134 -14 -526 43 131 -352 131 489 -45 282
7484 282 46 -331 42 136 -117 -68 418 -108 -223 88 166 -234 186 -48 -333 354 156 -357 20 71 -189
7505 -189 314 -76 -226 179 133 -208 141 131 -120 27 15 -212 27 39 -214 -86 218 -158 -127 344 -286 -486
7527 -486 292 108 -215 237 -132 -211 238 -8 -194 137 97 -308 47 -67 -355 84 170 -332 246 111 -274
7548 -274 192 383 -276 -44 248 -255 130 358 28 -43 201 4 -227 74 -20 -164 416 33 -269 54 -61
7569 -61 -308 107 4 -80 72 138 -349 110 276 -450 325 258 -70 74 383 -109 -70 642 73 -306 83 103
7591 103 -41 196 -41 -357 286 46 -173 296 66 40 252 30 -394 378 38 -342 -152 526 -89 -297
7611 -297 377 -391 35 199 -56 -187 256 -171 -266 195 -162 -37 231 -79 -266 277 -168 28 161 83 -39
$$ packed form
7463A71l22o9N85k76k87L05k04k07N20l85j86M89j48n12N69Q8m83M83L58n34L27
7484B82k36l77L73R4k53M9M86n26j15L11P8m00M20k34k85O87j98n13L77N1k60
7505a89N03l90j50M05m6l41L49j0k51J47j2k27K39J2k53J28L04l76L1M71o30k00
7527d86P78j84l23M52l69p9M49k46j86L31m0m05L55j14k88M39Q6n02N78j35l85
7548b74M66J91o59K32K92n03L85K28l30p1K44j97k31L01r4j44N80l83l02L23j15
7569f1k47M15j03q4J52O6m87M59J66p26P75o7l28J44L09m92L9P12n69l79L89K0
7591A03j44K37k37l16O43k40k19M69k30k6K12k22m24P72l40l80J90O78o15k08
7611b97O74p68M26J64k55j31M43m27r5M61l57J25K68l10j87N43m45J96J33p8j22
$$ plain form
7632 -39 188 -171 -219 146 103 42 216 53 -94 -140 104 -449 187 -56 -216 110 11 -400 -42 295 39 -294
7654 -294 302 -25 1 248 -295 -187 17 -199 -28 367 -306 -156 -29 23 -60 62 22 -73 148 74 -336 9
7676 9 194 -219 63 390 -134 238 229 6 195 258 -226 -41 -23 131 -80 196 -104 -286 173 -15 -95 70
7698 70 112 -380 256 66 -70 113 134 -114 299 105 -220 35 255 -148 -28 406 -394 -32 216 -235 -270
7719 -270 178 -30 -110 425 -285 -285 251 19 -83 132 28 -338 240 47 -315 -2 89 -1 392 224 -146 -378
7741 -378 88 4 -90 -101 -117 -84 19 -168 8 282 -5 -120 256 -100 -217 344 109 -180 144 -54 -281 -27
7763 -27 -214 -246 498 165 -55 47 49 -172 248 176 -294 101 103 -153 189 258 -192 -180 387 -55 -110 298 -138
7786 -138 19 159 -11 -322 143 -77 -128 140 -27 -217 302 -44 -278 -32 161 -212 75 193 -380 -16
$$ packed form
7632c9K27l59m8L65m3o1J74j63j47m6K44n53O36k43j60L26r9m11L58L37k56l33
7654b94N96l27K6K47n43J08K04k16J71L95o73J50J27N2q3J22m0r5K21p4m10L45
7676IJ85m13K82L27n24L72rk23J89O3m84J85J8J54k11K76l00j82M59j88q0J65
7698G0M2m92O36j90j36J83K1k48M13j94l25K55K20m03J20M34q00L62K48m51l5
7719b70M48k08q0N35p10%N36k32j02K15j04l66N78j93l62L13R1r0L93j68l70k32
7741c78M66q4r4j1j6L3J03j87J76K74k87j15L76l56j17N61k35k89L24j98k27K54
7763b7j87l2P44l33k20J02Kk21M20p2m70L95Kk56L42O9m50J2N67m42n5M08m36
7786a38J57J40j70l11M65k20n1K68j67j90N19l46k34K46J93l73K87J18n73L64
$$ plain form
7806 -16 315 -79 -113 185 -169 47 244 68 -106 -23 -358 37 218 -214 -70 154 -89 -286 204 8 -293
7827 -293 357 21 -105 226 133 -212 143 93 -363 148 89 -171 305 -47 -159 178 233 -87 -156 293 -158 14
7849 14 303 -144 -119 213 -209 -86 68 -154 -31 286 -132 -226 197 -193 -301 94 106 -303 107 -60 -183
7870 -183 131 145 -341 32 70 -202 -40 85 -119 -108 359 -361 -81 71 -173 -232 312 -214 -103 242 -144
7891 -144 -149 230 1 -132 309 31 -280 99 1 -370 133 198 -108 71 199 -186 -30 416 -146 68 204
7912 204 40 -195 107 -99 -109 165 13 -426 88 -4 -354 264 -10 -497 206 -79 -155 237 46 -298 67
7933 67 -57 -152 57 217 -288 -58 249 -211 -90 405 -172 -20 -55 -96 -88 138 5 -115 329 -284 -202 314
7955 314 3 -411 99 115 -284 179 10 -155 182 21 -540 118 -90 -16 195 96 -161 105 438 -133 -212
$$ packed form
7806a6L31l94l4K98l54K16J97j76j74Q3l35L95J81m32J44K24k43j97M90j96l01
7827b93O50l36j26L31r3l45L55n0m56N11n9k60M76l52j12L37N5l20o9M49m51J72
7849A4K89m47K5L32m22J23J54k22J23L17m18r4M23l90j08L95J2m09M10j67j23
7870a83L14J4m86L73L8k72J62J25k04J1M67p20K80J52k44n9N44n26J11L45l86
7891a44nL79k29j33M41k78l11L79r8l71N03O5l06J79J28l85J56M46n62K14J36
7912B04j64k35L02k06j0K74j52m39N14r2l50O18k74m87P03k85p6L92j91l44L65
7933F7j24r5K09J60n05K30L07m60J21M95n77J52l5m1QK26j33j20M44o13Q2N16
7955C14l11m14N10J6l99M63j69j65L37j61n61O58k08P4K11r9k57K66L33n71p9
$$ plain form
7976 -212 488 70 -119 265 -65 214 385 -244 -298 410 59 -321 175 -191 -385 351 -86 -327 88 95 -145
7997 -145 156 225 -248 324 128 -184 183 269 -138 -129 246 12 -79 371 -155 -233 312 -296 27 416 82 -245
8019 -245 341 -177 61 370 -76 -304 461 -3 -162 229 118 -69 78 267 -207 23 60 -240 -122 -132 -237
8040 -237 5 11 -488 -60 193 -241 -304 292 -158 -407 260 -133 -98 268 -209 33 186 -198 -320 41 31 -229
8062 -229 235 -68 110 311 117 -185 -80 324 -490 -62 316 -301 106 176 120 -17 247 -28 -339 216 -128
8083 -128 -262 167 65 -237 201 -140 -326 12 -4 -37 253 -1 -307 195 16 -70 -69 144 -89 48 332 -281
8105 -281 21 6 -134 20 421 -246 -92 228 -190 -209 165 191 -127 224 40 -35 43 -243 -32 186 148 -447
8127 -447 146 339 -220 66 134 -311 107 101 -53 87 244 -413 -240 177 -464 -28 10 -184 -325 413 38
$$ packed form
7976b12P00m18j89L84l30K79J71o29n4P08l51l80M96l66j94P36m37k41M15Pk40
7997a45L01O9m73N72j96l12L67Q6m07RL75k34r1M50n26p8N45o08L23L89l34l27
8019b45N86n18K38L09m46k28P65m64j59L91j11j87J47J89m74K30L7l00J18j0j05
8040b37K42Om99M28K53m34o3N96m50k49O67l93L5L66m77K42J53l84j22L61j0k60
8062b29M64l03J78K01j94l02J05M04q14M28L78o17M07P0n6j37K64k75l11N55l44
8083a28j34M29j02l02M38l41j86L38j6l3K90k54l06N02j79q6JK13k33J37K84o13
8105b81L02j5j40J54M01o67J54L20m18j9L74K6l18L51j84p5P8k86K11K18l8n95
8127d47N93J93n59K86O8m45M18oj54J40J57o57J73M17o41M36L8j94j41P38l75
$$ plain form
8148 38 -235 322 -350 -189 407 -57 -210 273 10 -111 290 -113 -308 232 3 -151 -66 -68 -275 113 224
8169 224 -318 -131 240 -212 -66 227 -140 -98 96 -123 49 474 -159 -45 382 -33 30 275 -110 -515 170
8190 170 260
$$ packed form
8148C8k73N57o72J61N96m64j53M83k63j21M01m03j95N40k29j54Q5kk07L88J11
8169B24n42J87L71m52J46K93l67M2J94k19J72M25o33J14M27m15O3K45l85m05O85
8190A70R0
8191B60
$$ Imaginary data points
##PAGE= N=2
##DATA TABLE= (X++(I..I)), XYDATA
$$ plain form
0 0 0 0 0 0 0 0 0 0 0 0 0 -8 8 -8 8 -16 16 -24 24 -32 39 -42 52 -64 72 -82 96 -112 128 -146 169 -192 218
33 218 -245 276 -313 349 -392 437 -486 541 -601 665 -736 813 -899 991 -1094 1206 -1326
50 -1326 1461 -1610 1776 -1958 2167 -2400 2669 -2979 3340 -3769 4286 -4931 5749 -6835 8342
65 8342 -10583 14258 -21321 39696 -187475 -347576 167661 97198 -94152 64888 111313
76 111313 -32843 45329 56756 25973 102472 48385 -21146 164829 142534 -85022 -19949
87 -19949 92752 -61108 -64678 86994 53244 -48037 -45660 -25357 -7257 -47322 -80153 23556
99 23556 85732 6023 -12956 -24256 -68128 23672 65807 -49975 7805 97762 -57901 -86133
111 -86133 56585 -32093 -118055 -750 -1746 -30229 44278 -56617 -127584 27569 -11241 -104285
$$ packed form
0@%%%%%%%%%%%qJ6j6J6k4L2m0M8n6P1q1R4j16J36j54J78k08K40k74L15l61M10
33B18m63N21n89O62p41Q29r23J027j142J266j401J549j712J890k085K300k532
50a326K787l071L386l734M125m567N069n648O319p109Q055r217J0680j2584J5177
65H342j8925K4841l5579O1017k27171j60101N15237p0463j91350J59040M6425
76A11313j44156P8172J1427l0783P6499n4087o9531J85975k2295k27556O5073
87a9949J12701j53860l570J51672l3750j01281K377K0303J8100m0065l2831J03709
99B3556O2176p9709j8979j1300m3872R1800M2135j15782N7780Q9957j55663k8232
111h6133J42718q8678q5962J17305r96k8483P4507j00895p0967J55153l8810r3044
$$ plain form
123 -104285 115122 135872 -119740 -13897 169489 -12562 -63061 118055 104214 35973 50759
134 50759 9485 42918 73424 -70729 -53235 115418 11741 -101366 32676 14352 -130485
145 -130485 -67897 -263 -39264 -14664 -12500 -40861 -4893 -42876 -78622 36535 47876 -45986
157 -45986 24171 69065 -26053 -6786 29504 -32498 22634 70619 -34435 -11773 76429 -18099
169 -18099 -63527 12448 -3459 4469 54115 -12760 -9531 60400 -42728 -63619 99967 51696
181 51696 -67407 49791 75613 -51692 -12652 42740 -16649 -6364 -926 -23164 47503 142
193 142 -126985 -10510 69014 -94505 -71161 81595 -14605 -86989 13479 -2085 -40010
204 -40010 17836 -2469 -1318 62397 -9482 -40206 70420 25277 -51499 62482 68411 -43080
$$ packed form
123a04285K19407K0750k55612J05843J83386j82051n0499J81116j3841o8241J4786
134E0759m1274L3433L0506j44153J7494J68653j03677j13107J34042j8324j44837
145a30485O2588O7634l9001K4600K164k8361L5968l7983l5746J15157J1341r3862
157d5986P0157M4894r5118J9267L6290o2002N5132M7985j05054K2662Q8202r4528
169a8099m5428P5975j5907P928M9646o6875L229O9931j03128k0891J63586m8271
181E1696j19103J17198K5822j27305L9040N5392n9389J0285N438k2238P0667m7361
193A42j27127J16475P9524j63519K3344J52756r6200p2384J00468j5564l7925
204d0010N7846k0305J151O3715p1879l0724J10626m5143p6776J13981N929j11491
$$ plain form
216 -43080 17577 62336 -23475 -7508 26388 -20173 14211 37856 -31045 -13241 15649 -37654
228 -37654 -8087 26417 -36698 -8541 37034 -44911 -32550 48444 -23267 -51329 35996 9831
240 9831 -27302 20135 -13497 -29207 34634 -10585 -35166 53755 1644 -65960 51563 42390
252 42390 -81899 4507 70693 -34292 -12221 49081 -22627 -12566 34497 -24272 4538 52981
264 52981 -39749 -25497 71876 -9275 -49749 47479 6885 -48599 38961 27561 -44677 4673
276 4673 13086 -26866 16275 6791 -39894 11006 12560 -38136 10655 14569 -48730 1926 32509
289 32509 -31868 -3769 28028 -32626 -5023 43132 -13490 -7668 31239 -16664 4871 50169
301 50169 -24418 -20893 54308 -11110 -34347 51964 -703 -57415 31213 18556 -50330 12533
$$ packed form
216d3080O0657M4759q5811J5967L3896m6561L4384K3645o8901J7804K8890n3303
228c7654K9567L4504o3115K8157M5575q1945J2361Q0994p1711k8062Q7325k6165
240I831l7133M7437l3632j5710O3841m5219k4581Q8921n2111o7604J17523r173
252D2390j24289Q6406O6186j04985K2071O1302p1708J0061M7063n8769K8810M8443
264E2981r2730J4252R7373q1151m0474R7228m0594n5484Q7560j1400p2238M9350
276D673Q413l9952M3141r484m6685N0900J554n0696M8791L914o3299N0656L0583
289C2509o4377K8099L1797o0654K7603M8155n6622N822L8907m7903K1535M5298
301E0169p4587L525P5201o5418k3237Q6311n2667n6712Q8628j2657o8886O2863
$$ plain form
313 12533 12249 -49279 10124 19802 -45573 8399 25822 -47845 8918 52094 -38539 -13772 56030
326 56030 -14387 -17588 50331 -3640 -22514 38927 1330 -20125 32331 -5444 -28499 31011
338 31011 -3427 -38566 25295 3433 -44940 16523 13972 -40377 7820 17423 -30850 8943
350 8943 18693 -29946 11593 26934 -31395 5400 32973 -30289 -3045 36369 -29751 -14985
362 -14985 38357 -21467 -24538 33970 -16131 -27766 35887 -7491 -31686 36134 3479 -32775
374 -32775 38099 17932 -34137 30796 27781 -32220 24841 34863 -33937 10436 36964 -31582
386 -31582 -2475 31674 -34824 -15359 31263 -31093 -27903 25835 -26995 -35070 22982 -17122
398 -17122 -34605 20969 -9762 -30377 27608 1467 -30291 28661 14676 -24492 29493 25096
$$ packed form
313A2533k84o1528N9403R678o5375N3972J7423p3667N6763M3176r0633K4767O9802
326E6030p0417l201O7919n3971j8874O1441l7597k1455N2456l7775k3055N9510
338C1011l4438l5139O3861k1862m8373O1463k551n4349M8197R603m8273L9793
350H943R750m8639M1539J5341n8329L6795K7573o3262K7244L9414o6120J4766
362a4985N3342n9824l071N8508n0101j1635O3653m3378k4195O7820l2655l6254
374c2775P0874k0167n2069O4933l015o0001N7061J0022o8800M4373K6528o8546
386c1582K9107L4149o6498J9465M6622o2356L190N3738n2830q075N8052m0104
398a7122j7483N5574l0731k0615N7985k6141l1758N8952j3985l9168N3985m397
$$ plain form
410 25096 -22985 20115 27034 -16482 20023 24695 -22423 16568 28184 -28782 6482 32038
422 32038 -32345 -8519 36427 -22493 -17274 29338 -21839 -22096 32075 -14565 -27996 30554 -8408
435 -8408 -32392 29862 -1744 -41291 21894 9601 -38191 17368 12578 -46385 5892 23835
447 23835 -38762 -2799 29140 -27788 -9565 27384 -16746 -5508 25423 -14856 5982 44520
459 44520 -13460 -10911 48128 1283 -19966 42670 19139 -17426 23307 12445 -12372 15487
471 15487 -7773 -22430 27788 -2897 -45933 15035 6088 -60171 -8950 20857 -37958 -17299
483 -17299 13067 -26556 -8386 10637 -32105 -1183 34969 -18831 -3630 44833 -12522 -20609
495 -20609 40048 4708 -15615 37822 9518 -19165 31008 6729 -33545 17987 16718 -22757
$$ packed form
410B5096m8081M3100O919m3516L6505M672m7118L8991J1616n6966L5264K5556
422C2038o4383K3826M4946n8920N219M6612n1177k57N4171m6640j3431N8550l8962
435h408k3984O2254l1606l9547O3185j2293m7792N5559m790n8963N2277J7943
447B3835o2597L5963L1939n6928J8223L6949m4130J1238L0931m0279K0838L8538
459D4520n7980K549N9039m6845k1249O2636k3531l6565M0733j0862k4817K7859
471A5487k3260j4657N0218l0685m3036O0968q947o6259N1221K9807n8815K0659
483a7299L0366l9623J8170J9023m2742L0922L6152n3800J5201M8463n7355q087
495b0609O0657l5340k0323N3437k8304k8683N0173k4279m0274N1532j269l9475
$$ plain form
507 -22757 17317 18958 -24389 3765 6157 -25404 21192 26389 -32692 9975 43590 -29990 -24234
520 -24234 32198 -6218 -19422 17957 -1497 -10028 -1398 -38451 -17505 25325 -32917 -39234 37580
533 37580 -1746 -56022 7772 14041 -35019 2751 27635 6351 21781 5348 -17455 35347
545 35347 30149 -23445 29718 56801 -15045 -2411 38324 -13364 -18264 18966 -8902 -2946 25408
558 25408 -25108 -33790 10006 -23406 -35285 18677 1450 -21508 13073 -9635 -30142 17488
570 17488 -731 -28032 36211 31347 -34890 1980 28405 -26175 -18723 14425 2435 12528
582 12528 2927 -31458 6989 14079 -52005 -8277 60814 -6874 -30313 39972 16343 -30086
594 -30086 5312 19795 19214 32647 -48 -766 38076 -11938 -40987 36209 24014 -46568 1695
$$ packed form
507b2757M0074J641m3347K8154K392l1561M6596N197n9081M2667L3615p3580N756
520b4234N6432l8416j3204L7379j9454q531Q630l7053K0946M2830n8242o317P6814
533C7580l9326n4276O3794O269m9060L7770K4884k1284J5430j6433k2803N2802
545C5347n198n3594N3163K7083p1846J2634M0735n1688m900L7230k7868N956K8354
558B5408n0516q682M3796l3412j1879N3962j7227k2958L4581k2708k0507M7630
570A7488j8219k7301O4243m864o6237L6870K6425n4580P452L3148j1990J0093
582A2528r601l4385L8447P090o6084M3728O9091o7688k3439P0285k3629m6429
594c0086L5398J4483n81J3433l2695p18L8842n0014k9049P7196j2195p0582M8263
$$ plain form
607 1695 33050 -28085 -32058 -15086 -33702 -4940 11753 -20616 504 7354 -46705 -18625 33526
620 33526 -5022 -7871 32042 4300 1329 31659 -12434 -23263 35052 16354 -10202 32981
632 32981 15177 -32445 -5429 4589 -9400 11087 -4080 -14372 35591 6926 -58568 -787
644 -787 35677 -24955 -1252 52710 1034 -30605 -265 4786 12654 5225 -29452 9488 42635
657 42635 -28753 -35723 26710 -21123 -56907 23692 35837 -22463 -16321 -8911 -15764 9033 -3176
670 -3176 -12761 36496 20736 -27542 19076 32230 -28425 -3961 39332 5895 7793 22925 -16272
683 -16272 -7494 17517 -22715 -16983 27655 -1246 -15591 12702 -14637 -30078 1590 -8910
695 -8910 -2404 35566 -7013 -36875 21909 12366 -38030 6372 31995 -10529 -4344 12594 -2144
$$ packed form
607A695L1355o1135l973J6972j8616K8762J6693l2369K1120O850n4059K8080N2151
620C3526l8548k849L9913k7742k971L0330m4093j0829N8315j8698k6556M3183
632C2981j7804m7622K7016J0018j3989K0487j5167j0292M9963k8665o5494N7781
644g87L6464o0632K3703N3962n1676l1639L0340N051P868p429l4677L8940L3147
657D2635p1388o970O2433m7833l5784Q0599J2145n8300O142P410o853K4797j2209
670c176r585M9257j5760m8278M6618J3154o0655K4464M3293l3437J898J5132l9197
683a6272Q778K5011m0232N732M4638k8901j4345K8293k7339j5441L1668j0500
695h910O506L7970m2579k9862N8784r543n0396M4402K5623m2524O185J6938j4738
$$ plain form
708 -2144 3238 -13187 -30437 23555 27798 -33710 854 39491 -30753 -37772 29583 12705 -11679
721 -11679 16657 8102 -2936 7253 -16887 -3186 37720 -5660 -25828 36014 15962 -38833
733 -38833 2731 16361 -25071 -473 17282 -12011 3748 5040 -31338 -5421 17074 -15484
745 -15484 1515 24214 -13245 -8853 14307 -17016 -5473 29369 -7624 -13036 28540 -2168
757 -2168 -26210 14162 6978 -17919 6320 6640 -682 15190 -14003 -24260 25605 5664 -32730
770 -32730 24128 33504 -32430 -12630 25678 -8028 -9594 11510 -4724 4705 8168 -24409 1354
783 1354 22622 -30120 -17041 38676 -5222 -30870 23076 9187 -26752 6468 10872 -5862
795 -5862 16305 5057 -14207 16989 5525 -23844 15808 20523 -21302 1993 15657 -22404
$$ packed form
708b144N382j6425j7250N3992M243o1508L4564L8637p0244p019O7355j6878k4384
721a1679K8336q555j1038J0189k4140J3701M0906m3380k0168O1842k0052n4795
733c8833M1564J3630m1432K4598J7755k9293J5759J292l6378K5917K2495l2558
745a5484J6999K2699l7459M392K3160l1323J1543L4842l6993n412M1576l0708
757b168k4042M0372p184k4897K4239L20p322J5872k9193j0257M9865j9941l8394
770c2730N6858R376o5934J9800L8308l3706j566K1104j6234R429L463l2577K5763
783A354K1268n2742J3079N5717m3898k5648N3946j3889l5939L3220M404j6734
795e862K2167j1248j9264L1196j1464k9369L9652M715m1825K3295J3664l8061
$$ plain form
807 -22404 -4148 16232 -20426 -10972 15822 -11653 -8328 14095 -13111 -11570 14156 -6551 -1563
820 -1563 22776 -10561 -12107 27239 -2646 -20397 25442 9259 -24080 13113 14707 -18432 610
833 610 3689 -13059 12861 4302 -26549 10832 17607 -27157 2445 28258 -20461 -9407 32413
846 32413 -2468 -13165 17170 -3461 -7384 19799 -4401 -12559 15053 -10666 -20226 20081 -3115
859 -3115 -32952 7286 6325 -23739 4535 6645 -24458 1885 15687 -10724 4956 13017 -11136
872 -11136 10206 20783 -9991 7187 22729 -12050 2518 28491 -10816 -12660 20678 -4367
884 -4367 -13522 14713 -7403 -18311 10986 -5447 -15411 12987 -8780 -21793 20842 5502 -27360
897 -27360 12604 14680 -23342 6502 20089 -17851 -1613 15255 -13911 -524 13597 -18910
$$ packed form
807b2404J8256K0380l6658R454K6794k7475L325K2423k7206J541K5726k0707M988
820a563K4339l3337j546L9346k9885j7751M5839j6183l3339L7193J594l3139J9042
833F10L079j6748K5920q559l0851L7381O775m4764K9602K5813m8719J1054M1820
846C2413l4881j0697L0335k0631l923K7183k4200q158K7612k5719r560M0307k3196
859c115k9837M0238r61l0064K8274K110l1103K6343J3802k6411J5680Q061k4153
872a1136K1342J0577l0774J7178J5542l4779J4568K5973l9307j844L3338k5045
884d367r155K8235k2116j0908K9297j6433r964K8398k1767j3013M2635j5340l2862
897b7360L9964K076l8022K9844J3587l7940J6238J6868k9166J3387J4121l2507
$$ plain form
909 -18910 -4746 17510 -18041 -10183 21017 -13320 -16832 23415 -173 -18345 17646 7588
921 7588 -10533 17242 8142 -9082 18618 9899 -11166 16638 10672 -16637 11456 13619 -20936
934 -20936 753 12356 -20309 -6069 9585 -19468 -9819 7908 -17744 -8239 10536 -18408
946 -18408 -9608 18418 -10457 -11353 20352 -5198 -12815 23843 3008 -15920 18976 8165 -14441
959 -14441 16169 8290 -16858 13731 11550 -18540 10575 14951 -21534 3936 20494 -16996 -2332
972 -2332 20221 -13043 -5868 20737 -8503 -9901 17350 -6913 -10356 17683 -6501 -17632 14381
985 14381 -2604 -19886 10040 -468 -20088 6674 677 -20096 6251 3833 -20001 6237
997 6237 10804 -16763 3539 12716 -13134 5268 17150 -11089 4779 21037 -10169 928 23456
$$ packed form
909a8910J4164K2256l5551P858L1200l4337l512M0247k3588j8172L5991j0058
921G588j8121K7775r100j7224K7700q719k1065K7804n966k7309K8093K163l4555
934b0936K1689J1603l2665J4240J5654k9053R649J7727k5652R505J8775k8944
946a8408Q800K8026k8875q96L1705k5550p617L6658k0835j8928L4896j0811k2606
959a4441L0610p879k5148L0589k181l0090K9115M376l6485K5470J6558l7490J4664
972b332K2553l3264P175K6605k9240j398K7251k4263l443K8039k4184j1131L2013
985A4381j6985j7282K9926j0508j9620K6762n997k0773K6347k418k3834K6238
997F237M567k7567K0302R177k5850J8402J1882k8239J5868J6258l1206J1097K2528
$$ plain form
1010 23456 -8404 -4925 24666 -3634 -9259 20074 -3024 -14186 15471 -3555 -16789 16231
1022 16231 -1069 -24264 10435 4475 -26211 3170 8539 -20284 2256 9553 -20175 300
1034 300 12651 -19182 -890 20758 -12921 -6823 20732 -7066 -9857 16527 -2320 -6317 17243
1047 17243 -2973 -8075 18545 -4611 -16832 19092 7437 -17080 11516 10917 -13692 4949
1059 4949 6024 -10833 10711 8711 -14508 10807 13015 -22172 -693 18048 -14337 -5618 16406
1072 16406 -11117 -9607 8669 -14975 -9486 13186 -13961 -12511 19880 -7586 -22187 12529
1084 12529 -133 -15455 15884 6992 -11718 16388 7178 -18135 14802 16753 -16428 9571
1096 9571 23776 -10327 -1898 11781 -12624 -1206 12807 -12183 398 16071 -20458 -15263
$$ packed form
1010B3456l1860L479K9591k8300n625K9333k3098j1162K9657j9026j3234L3020
1022A6231j7300k3195L4699n960l0686K9381N369k8823K2540P297k9728K0475
1034C00J2351l1833J8292K1648l3679O098K7555k7798k791K6384j8847l997K3560
1047A7243k0216n102K6620k3156j2221L5924j1655k4517K8596n99k4609J8641
1059D949J075j6857K1544k000k3219K5315K208l5187K1479J8741l2385Q719K2024
1072A6406k7523J510J8276k3644N489K2672k7147J450L2391k7466j4601L4716
1084A2529j2662j5322L1339q892j8710K8106r210k5313L2937J951l3181K5999
1096I571J4205l4103Q429J3679k4405J1418J4013k4990J2581J5673l6529N195
$$ plain form
1108 -15263 19348 -8958 -21471 14537 6464 -10494 5706 -3127 -8809 10340 -4297 -9099 23908
1121 23908 4975 -22770 10699 11708 -21875 -257 14383 -8574 1757 7393 -13830 75
1133 75 4233 -20795 5250 24865 -13739 -8065 21137 -7255 -12831 15817 -276 -3290 21134
1146 21134 -1737 -11743 18071 -2786 -22959 13228 10976 -14112 6817 4408 -18417 -81
1158 -81 -507 -18223 10682 12675 -20965 2707 19278 -20011 -12498 19258 689 -3742 13445
1171 13445 882 1956 6773 -18003 -2110 27916 -6797 -17007 23302 4614 -25416 2532
1183 2532 5267 -13086 4176 5944 -4649 9017 -7127 -23674 11666 12548 -19246 7756 22631
1196 22631 -15294 -7625 14844 -8207 -6078 10386 -5324 6453 20105 -15541 -16748 14310
$$ packed form
1108a5263L4611k8306j2513L6008q073j6958J6200q833n682J9149j4637m802L3007
1121B3908j8933k7745L3469J009l3583K1618J4640k2957J0331N636k1223J3905
1133G5M158k5028K6045J9615l8604N674K9202k8392n576K8648j6093l014K4424
1146B1134k2871j0006K9814k0857k0173L6187k252k5088K0929k409k2825J8336
1158h1m26j7716K8905J993l3640K3672J6571l9289P513L1756j8569m431J7187
1171A3445j2563J074M817k4776J5893L0026l4713j0210M0309j8688l0030K7948
1183B532K735j8353J7262J768j0593J3666j6144j6547L5340Q82l1794K7002J4875
1196B2631l7925P669K2469k3051K129J6464j5710J1777J3652l5646j207L1058
$$ plain form
1208 14310 -3583 -9676 18320 2314 -10340 11018 -4031 -15174 14318 1224 -17178 18588
1220 18588 16663 -19822 -2304 8469 -14074 -106 10531 -5539 5061 3968 -19545 3484
1232 3484 12890 -26003 -8480 30734 -131 -17426 8434 -1813 -12077 4940 919 3299 14959
1245 14959 -10082 -11474 21038 -1634 -24039 13935 15115 -13161 7688 13384 -13340 -3691 3690
$$ packed form
1208A4310j7893o093K7996j6006j2654K1358j5049j1143K9492j3094j8402L5766
1220A8588j925l6485J7518J0773k2543J3968J0637j6070J0600j093k3513K3029
1232C484R406l8893J7523L9214l0865j7295K5860j0247j0264J7017m021K380J1660
1245A4959k5041j392L2512k2672k2405L7974J180k8276K0849N696k6724R649P381
$$ [...]
8191a59
##END NTUPLES=NMR FID
##END=
