##TITLE=1H_Pr 97-H
 CDCl3, 8 sc, 
 13.2.2019
##JCAMPDX= 6.0         $$ Bruker NMR JCAMP-DX V2.0
##DATA TYPE= NMR FID
##DATA CLASS= NTUPLES
##ORIGIN= UXNMR, Bruker Analytische Messtechnik GmbH
##OWNER= root
$$ XWIN-NMR		Version 3.5
$$ Wed Feb 13 15:46:20 2019 Russian Standard Time (UT+4h)  she@DPX200
##.OBSERVE FREQUENCY= 200.1313
##.OBSERVE NUCLEUS= ^1H
##.DELAY= (6, 6)
##.ACQUISITION MODE= SIMULTANEOUS
##.ACQUISITION SCHEME= undefined
##.AVERAGES= 8
##.DIGITISER RES= 18
##SPECTROMETER/DATA SYSTEM= spect
##.PULSE SEQUENCE= zg30
##.SOLVENT NAME= D2O
##.SHIFT REFERENCE= (INTERNAL, D2O, 0, 15.7039)
##AUDIT TRAIL= $$ (NUMBER, WHEN, WHO, WHERE, WHAT)
$$ ##TITLE= Audit trail, XWIN-NMR		Version 3.5
$$ ##JCAMPDX= 5.01
$$ ##ORIGIN= Bruker BioSpin GmbH
$$ ##OWNER= she
$$ F:/spectra/data/she/nmr/H-F/1/audita.txt
$$ ##AUDIT TRAIL=  $$ (NUMBER, WHEN, WHO, WHERE, WHAT)
(   1,<2019-02-13 15:45:29.87 +0400>,<she>,<DPX200>,
      <created by zg, POWCHK disabled, PULCHK disabled
       configuration hash MD5:
       00 E9 B6 7A A2 85 ED C7 34 08 36 98 17 FE 4E 26
       data hash MD5: 16K
       81 6A EE 2C 84 42 E4 9B 18 84 8A 99 12 C5 34 02>)
$$ ##END=
$$ 
$$ hash MD5
$$ B7 85 33 C1 7C C7 9A 06 92 77 E8 3D 46 5D 5B E7
##$RELAX= 
##$RELAX= 
##$RELAX= 
##$RELAX= 
##$RELAX= 
##$RELAX= 
$$ Bruker specific parameters
$$ --------------------------
##$DU= <F:/spectra>
##$EXPNO= 1
##$NAME= <H-F>
##$PROCNO= 1
##$TYPE= <nmr>
##$USER= <she>
##$AMP= (0..31)
100 100 100 100 100 100 100 100 100 100 100 100 100 100 100 100 100 100 
100 100 100 100 100 100 100 100 100 100 100 100 100 100 
##$AQSEQ= 0
##$AQ_mod= 1
##$AUNM= <au_zg>
##$AUTOPOS= <>
##$BF1= 200.13
##$BF2= 200.13
##$BF3= 200.13
##$BF4= 200.13
##$BF5= 200.13
##$BF6= 200.13
##$BF7= 200.13
##$BF8= 200.13
##$BYTORDA= 1
##$CFDGTYP= 0
##$CFRGTYP= 5
##$CHEMSTR= <none>
##$CNST= (0..31)
1 1 145 1 1 1 1 1 1 1 1 1 1 1 1 1 1 1 1 1 1 1 1 1 1 1 1 1 1 1 1 1 
##$CPDPRG= <>
##$CPDPRG1= <>
##$CPDPRG2= <>
##$CPDPRG3= <>
##$CPDPRG4= <mlev>
##$CPDPRG5= <mlev>
##$CPDPRG6= <mlev>
##$CPDPRG7= <mlev>
##$CPDPRG8= <mlev>
##$CPDPRGB= <>
##$CPDPRGT= <>
##$D= (0..31)
0 1.2 0 0 0 0 0 0 0 0 0 0.03 0 0 0 0 0 0 0 0 0 0 0 0 0 0 0 0 0 0 0 0 
##$DATE= 1550058329
##$DBL= (0..7)
120 120 120 120 120 120 120 120 
##$DBP= (0..7)
150 150 150 150 150 150 150 150 
##$DBP07= 0
##$DBPNAM0= <>
##$DBPNAM1= <>
##$DBPNAM2= <>
##$DBPNAM3= <>
##$DBPNAM4= <>
##$DBPNAM5= <>
##$DBPNAM6= <>
##$DBPNAM7= <>
##$DBPOAL= (0..7)
0.5 0.5 0.5 0.5 0.5 0.5 0.5 0.5 
##$DBPOFFS= (0..7)
0 0 0 0 0 0 0 0 
##$DE= 6
##$DECBNUC= <off>
##$DECIM= 32
##$DECNUC= <off>
##$DECSTAT= 4
##$DIGMOD= 1
##$DIGTYP= 9
##$DL= (0..7)
0 120 120 120 120 120 120 120 
##$DP= (0..7)
150 150 150 150 150 150 150 150 
##$DP07= 0
##$DPNAME0= <>
##$DPNAME1= <>
##$DPNAME2= <>
##$DPNAME3= <>
##$DPNAME4= <>
##$DPNAME5= <>
##$DPNAME6= <>
##$DPNAME7= <>
##$DPOAL= (0..7)
0.5 0.5 0.5 0.5 0.5 0.5 0.5 0.5 
##$DPOFFS= (0..7)
0 0 0 0 0 0 0 0 
##$DQDMODE= 0
##$DR= 18
##$DS= 0
##$DSLIST= <SSSSSSSSSSSSSSS>
##$DSPFIRM= 0
$$ [...]
##$SUBNAM2= <"">
##$SUBNAM3= <"">
##$SUBNAM4= <"">
##$SUBNAM5= <"">
##$SUBNAM6= <"">
##$SUBNAM7= <"">
##$SUBNAM8= <"">
##$SUBNAM9= <"">
##$SW= 20.0189088683792
##$SWIBOX= (0..15)
0 0 2 0 0 0 0 0 0 0 0 0 0 0 0 0 
##$SW_h= 4006.41025641026
##$TD= 16384
##$TD0= 1
##$TE= 0
##$TE2= 300
##$TE3= 300
##$TEG= 300
##$TL= (0..7)
0 120 120 120 120 120 120 120 
##$TP= (0..7)
150 150 150 150 150 150 150 150 
##$TP07= 0
##$TPNAME0= <>
##$TPNAME1= <>
##$TPNAME2= <>
##$TPNAME3= <>
##$TPNAME4= <>
##$TPNAME5= <>
##$TPNAME6= <>
##$TPNAME7= <>
##$TPOAL= (0..7)
0.5 0.5 0.5 0.5 0.5 0.5 0.5 0.5 
##$TPOFFS= (0..7)
0 0 0 0 0 0 0 0 
##$TUNHIN= 0
##$TUNHOUT= 0
##$TUNXOUT= 0
##$USERA1= <user>
##$USERA2= <user>
##$USERA3= <user>
##$USERA4= <user>
##$USERA5= <user>
##$V9= 5
##$VALIST= <valist>
##$VCLIST= <CCCCCCCCCCCCCCC>
##$VD= 0
##$VDLIST= <DDDDDDDDDDDDDDD>
##$VPLIST= <PPPPPPPPPPPPPPP>
##$VTLIST= <TTTTTTTTTTTTTTT>
##$WBST= 1024
##$WBSW= 4
##$XGAIN= (0..3)
0 0 0 0 
##$XL= 0
##$YL= 0
##$YMAX_a= 186456
##$YMIN_a= -242207
##$ZGOPTNS= <>
##$ZL1= 120
##$ZL2= 120
##$ZL3= 120
##$ZL4= 120
##$ABSF1= 10
##$ABSF2= 0
##$ABSG= 5
##$ABSL= 3
##$ALPHA= 0
##$AQORDER= 0
##$ASSFAC= 0
##$ASSFACI= 0
##$ASSFACX= 0
##$ASSWID= 0
##$AUNMP= <proc_1d>
##$AZFE= 0.1
##$AZFW= 0.1
##$BCFW= 1
##$BC_mod= 2
##$BYTORDP= 1
##$COROFFS= 0
##$CY= 11.3945322036743
##$DATMOD= 1
##$DC= 2
##$DFILT= <>
##$DTYPP= 0
##$F1P= 18.9103706918063
##$F2P= -1.10871071338519
##$FCOR= 0.5
##$FTSIZE= 0
##$FT_mod= 4
##$GAMMA= 1
##$GB= 0.15
##$INTBC= 1
##$INTSCL= 1
##$ISEN= 128
##$LB= 0.24
##$LEV0= 0
##$LPBIN= 0
##$MAXI= 10000
##$MC2= 0
##$MEAN= 0
##$ME_mod= 0
##$MI= 1.114404
##$NCOEF= 0
##$NC_proc= 0
##$NLEV= 6
##$NOISF1= 3.799351
##$NOISF2= 2.8
##$NSP= 1
##$NTH_PI= 0
##$NZP= 0
##$OFFSET= 15.70392
##$PC= 1
##$PHC0= -9052.923
##$PHC1= 15.60014
##$PH_mod= 1
##$PKNL= yes
##$PPARMOD= 0
##$PSCAL= 0
##$PSIGN= 0
##$REVERSE= no
##$SF= 200.130013532006
##$SI= 16384
##$SIGF1= 3
##$SIGF2= 2
##$SINO= 400
##$SIOLD= 16384
##$SREGLST= <1H.CDCl3>
##$SSB= 0
##$STSI= 0
##$STSR= 0
##$SW_p= 3612.71676300578
##$SYMM= 0
##$S_DEV= 0
##$TDeff= 0
##$TDoff= 0
##$TI= <>
##$TILT= no
##$TM1= 0
##$TM2= 0
##$TOPLEV= 0
##$USERP1= <user>
##$USERP2= <user>
##$USERP3= <user>
##$USERP4= <user>
##$USERP5= <user>
##$WDW= 1
##$XDIM= 8192
##$YMAX_p= 0
##$YMIN_p= 0
$$ End of Bruker specific parameters
$$ ---------------------------------
##NTUPLES= NMR FID
##VAR_NAME=  TIME,          FID/REAL,        FID/IMAG
##SYMBOL=    X,             R,               I
##VAR_TYPE=  INDEPENDENT,   DEPENDENT,       DEPENDENT
##VAR_FORM=  AFFN,          ASDF,            ASDF
##VAR_DIM=   8192,          8192,            8192
##UNITS=     SECONDS,       ARBITRARY UNITS, ARBITRARY UNITS
##FACTOR=    0.0002496,     1,               1
##FIRST=     0,             0,               0
##LAST=      2.0444736,     0,               0
##MIN=       0,             -242207,         0
##MAX=       2.0444736,     186456,          0
$$ Real data points
##PAGE= N=1
##DATA TABLE= (X++(R..R)), XYDATA
0@%%%%%%%%%%%%qJ6j6J6k4L2m0M8n6P1q0R3j14J34j53J78k09K40k73L12l58M06
$$ 0 0 0 0 0 0 0 0 0 0 0 0 0 -8 8 -8 8 -16 16 -24 24 -32 39 -41 52 -62 72 -81 97 -112 128 -145 167 -191 215
34B15m57N15n82O54p31Q18r13J016j129J250j384J530j689J865k058K268k496
$$ 215 -242 273 -309 345 -386 432 -481 535 -594 656 -728 802 -887 978 -1080 1188 -1308
51a308K750l030L342l691M080m518N017n593O265p059Q015r196J0695j2671J5409
$$ -1308 1442 -1588 1754 -1937 2143 -2375 2642 -2951 3314 -3745 4270 -4926 5769 -6902 8507
66H507j9485K6292m0498J23755j59412j9367K52627j97463L2254J79246j54635
$$ 8507 -10978 15314 -25184 98571 -60841 -80208 172419 -25044 7210 186456 31821
77C1821q2023J53740j32156n4289J48371q3942n7992J70250j07442j28082J56606
$$ 31821 -50202 103538 -28618 -82907 65464 -18478 -76470 93780 -13662 -141744 14862
88A4862k6155j32377J71244O2052j40198K4311K2964n5257Q1219N87n7809J09261
$$ 14862 -11293 -143670 27574 89626 -50572 -26261 -3297 -58554 22665 23252 -34557 74704
100G4704j8881j38091R5692R183j42830J46791J10962j96594Q082R9028j46832
$$ 74704 55823 -82268 13424 22607 -120223 26568 137530 -59064 -50982 48046 -98786
111i8786L0361J60418r9059k90J07073j60902j6670J99553j15612p3416K20411
$$ -98786 -68425 91993 -7066 -7356 99717 -61185 -77855 121698 6086 -67330 153081
122A53081p6624j63350J75422k5003j90990J64257Q0955j74909O3234N0390j63074
$$ 153081 76457 -86893 88529 63526 -127464 36793 117748 -57161 6073 56463 -106611
133a06611N0613P4451j16743Q9728R4616j80926Q551J25630j31099J5954J83355
$$ -106611 -55998 18453 -98290 -8562 86054 -94872 -86321 39309 -91790 -75836 107519
144A07519r6273o4720J27267p7366p0806J34470j6448m3059R8910p5928q0608
$$ 107519 11246 -53474 73793 -3573 -74379 60091 43643 584 99494 23566 -57042
155e7042J20753n4628r6698J62761L812j53202R2598K1842j50814Q8454Q8177
$$ -57042 63711 9083 -87615 75146 78958 -74244 18354 40196 -110618 -22164 66013
166F6013j13353N1361O6175j24119K6978O2881j10377P2801J23080j46938j5674
$$ 66013 -47340 4021 70196 -53923 -26945 35936 -74441 -1640 121440 -25498 -41172
177d1172J23069j37061m5031J79342n5916q2478J19616o2801j04643J19113r484
$$ -41172 81897 -55164 -100195 79147 23231 -59247 60369 -2432 -107075 12038 2554
188B554p0023J25777k4780j13221J22175q228j49598J40463Q7726j57111N9953
$$ 2554 -67469 58308 33528 -79693 42482 34254 -115344 25119 112845 -44266 15687
199A5687Q8808j58598J4026J19194r4805J2090J02211j13972k6098R3067j07082
$$ 15687 104495 -54103 -40077 79117 -15688 -3598 98613 -15359 -41457 51610 -55472
210e5472j2178J52127q5631p2142J37949o8492j22610J32687K6634q5677Q9320
$$ -55472 -67650 84477 -1154 -73296 64653 -3839 -126449 6238 32872 -52805 36515
221C6515K255j04791O6646J2842p6198R8334K8185j10033P3341L3343j42744N7967
$$ 36515 38770 -66021 625 13467 -62731 35603 63788 -46245 27096 60439 -82305 -24338
233b4338J01126j07644K2134R5899j10901k5865Q3940p1715J4247J11014r4392
$$ -24338 76788 -30856 -8722 87177 -23724 -49589 34351 -37364 -23117 87897 -6495
244f495l5586J09403r2761n7826J51558m3257r1566J37481k1442j45371R5187
$$ -6495 -42081 67322 -25439 -83265 68293 25036 -66530 70951 49509 -95862 -675
255f75L5896j02799R1908M5649j24727M7754M1235j19584O7540R6908j19295J9487
$$ -675 35221 -67578 24330 69979 -54748 -6994 34241 -85343 -17803 79105 -40190 -20703
267b0703J00133j20704k1655J20676p3257l0416J23642n2099p1247P4783m4535
$$ -20703 79430 -41274 -62929 57747 -15510 -45926 77716 25617 -45630 29153 -15382
278a5382m1145J11384k5446o7917Q7182l5443r4229J00479J5956r0718Q5573L0140
$$ -15382 -56527 54857 29411 -38506 48676 13233 -80996 19483 35439 -55279 30294 60434
290F0434j10628M5663L6397r4824N8585P0230q9219K7417M7211j17584K4433J05039
$$ 60434 -50194 -4531 31866 -62958 -4373 65857 -23362 4055 51266 -66318 -41885 63154
302F3154r0229k771J09360r3967n2560J09538n4309n3517J21471k4259p6817Q7862
$$ 63154 -27075 -29846 79514 -14453 -67013 42525 -11784 -65301 56170 31911 -44906 42956
314D2956k9115r0539J01999J7720q6563Q7305J5988j27809N7582N8665j02817
$$ 42956 13841 -76698 25301 43021 -43542 43763 59751 -68058 -10476 48189 -54628
325e4628M6985P9901j01034K471O7127r1747L035R6058o4054r311Q4956p9750
$$ -54628 -7643 72258 -28776 -26305 40822 -50925 -47890 48168 -15886 -25197 59759 -19991
337a9991m0832R8339m3601l7076J09867l2960p8525P8548j8569p2984Q8749J2866
$$ -19991 -60823 37516 -6085 -43161 66706 33746 -44779 33769 15200 -57784 30965 43831
349D3831p4072O6191o00j01432O1029L7632q4207O0085N2072j05016K0793O0353
$$ 43831 -30241 35950 35350 -66082 -5053 32579 -51628 8457 60529 -44487 -23694 36659
361C6659r1762K1244R4436p2445q071P7769q2318k9343R9031m6500l2379J00446
$$ 36659 -55103 -33859 60577 -11868 -19939 57830 -24488 -53831 45200 -1300 -33679 66767
373F6767m8770p5851Q5726k1175p1660R5765Q688q6497O5901R291r9657O2524
$$ 66767 17997 -57854 27872 6697 -64963 30802 39490 -47007 18894 28185 -71472 -8948
385h948N0805q0678M9536N3185j00270J4703O6500p6311J8416Q7994p2113k0514
$$ -8948 41857 -38821 10715 63900 -36370 -21667 44833 -31478 -13062 74932 2819 -17695
397a7695O8819p0421k6365R1135m1952l6981Q3009m6455o8830P5290j5782n5565
$$ -17695 51124 -19297 -45662 45473 3521 -33460 49549 3094 -65736 9554 -6228 -61793
409f1793Q6564K562p6316N7062J567p6824P0896L8192p2997N1766L3907r7051
$$ -61793 24771 27333 -48983 8079 9646 -67178 3718 41910 -31087 20679 54586 -42465
421d2465L0869O1676p8089K4827P6638q0432j5426O6965p0433j6897R0768m5238
$$ -42465 -11596 50080 -28009 -3182 73456 -6976 -22402 44563 -25870 -42767 48001 2763
433B763l1538P7556n5806n8909Q9774j4429n7030Q8037l289q6736N9172J5047
$$ 2763 -28775 48781 -7025 -65934 23840 9411 -47619 40418 37129 -49607 9565 24612
445B4612p8228N9976M2535p2447L3336K7626q7391K7022N6513o8135K4971O6096
$$ 24612 -53616 6360 48895 -23552 9784 37410 -49981 -22959 33554 -34581 -9610 56486
457E6486q4345j6631P1982n6711j3119Q8124l8218l5717O6748m0457m3953P7841
$$ 56486 -27859 -44490 27492 -29219 -42338 45786 7568 -28149 38599 -1858 -45811 32030
469C2030j4410l8541P8735k2542p7740O6195L530p3471P0787L2761q6676K9405
$$ 32030 17620 -20921 57814 35272 -42468 23727 27257 -46214 24573 57334 -29342 63
481F3K9608q1018K8773N4311o2684K1939M9785q0203j354O5036o1171L671R0767
$$ 63 29671 -51347 -22574 31737 -30947 -9008 40777 -39426 -40780 24256 -36915 -33244 57523
494E7523n6674m1614P4514l8495m6903Q2520m957m7096N8607j8280o3535N8744
$$ 57523 849 -40765 33749 -4746 -51649 30871 25914 -21182 37425 19145 -44390 14354
506A4354Q77n6207P1566J6535q4354L9692K7842q2841L9338O7829o5243N184M8712
$$ 14354 15231 -40976 30590 47125 -37229 2463 30305 -52536 -13198 54631 -10612 -5428 43284
519D3284o7474l846O0103m5606M628O6033o1889k8674O7503n0920l5950R1495
$$ 43284 -24190 -28036 32067 -13539 -8911 57122 -4767 -33441 34062 -16858 -52808 38687
531C8687j7806o0630O1249j4426p0261N9086J9386m9306N0933Q643o8146M1737
$$ 38687 20881 -39749 21500 7074 -63187 -4101 15285 -34021 16912 25555 -42591 -854
543h54J8577o6917N4007N1537p5676J8450N0894p8393r30P4572m1670q360N8409
$$ -854 17723 -49194 4813 56350 -19326 -876 50018 -28375 -29305 45267 3597 -4763 53646
556E3646n3102l0503N3532l6138j3516P5090l7892m7395O5342l0835o2335P8594
$$ 53646 544 -29959 23573 -12565 -26081 49009 11117 -36278 29064 -1771 -64106 14488
568A4488J4578o5587M9621J5490p2924L1309K8845n0492M0807L3654o4245K1656
$$ 14488 29066 -36521 13100 28590 -44334 -13025 15820 -34672 6135 39789 -24456 -2800
580b800L0180p5632K4466P4967n9972q707O5611n9435l5810P0582j9488k5924
$$ -2800 27380 -48252 -23786 51181 -8791 -17498 48113 -11322 -47132 23450 3962 -21962
592b1962O0364k3560l9208M7633k8272l8476P6574k315n7087N7986l958q3327
$$ -21962 38402 14842 -24366 23267 -5005 -43481 33093 30778 -26309 31677 27719 -55608
604e5608N0350M4321o0010K5648L3271o3883J1282L4840n2889J9282M6126n4373
$$ -55608 -5258 39063 -20947 4701 37972 -25911 -14629 20211 -32678 -13396 32730 -21643
616b1643J3119N1197p6583j8384Q0263l1049k3002P1630l5436n8886N3837J73
$$ -21643 -8524 42673 -33910 -52294 27969 -3080 -26082 45548 10112 -48774 5063 5236
628E236k9827N5669q520m6228M8538j0039n9103N8272J9547o1353M8804L1494
$$ 5236 -24591 31078 22558 -23670 24868 14829 -44274 13998 33545 -27808 20996 52490
640E2490q6481Q577N2649m5456J2068M7462n1054q805L8192m6081K742N5378m7129
$$ 52490 -33991 -25414 27235 -18221 -6153 41309 -9745 -18550 19642 -26439 -23697 31681 -15448
653a5448q848P0664m7413m8483O5720j4663m0371P1566L210o4323K8290K281l8509
$$ -15448 -24296 46368 -1045 -49528 16192 1529 -38842 32724 35934 -28389 -99 2182 -36327
666c6327N3003J3916n3118L7665J0098p0445L7629M3038o4050K2168N7548o3372
$$ -36327 16676 30592 -22526 15139 25237 -45208 -7579 35459 -28591 -6423 51125 -12247
678a2247j4717N1378l9419p556N7234k8355j5506M0894m3897k1294O2079k6856
$$ -12247 -26964 24414 -15005 -22561 34673 6318 -9188 31706 -12191 -33485 28594 1738
690A738l0000O8822j9027o2932M7254L506n2155N0821K5490n2876J9488Q743n0144
$$ 1738 -28262 40560 21533 -41399 5855 9361 -42794 8027 33517 -19359 129 8872 -41272
703d1272L4097K9045m5681L3411L0222p2590J0157N6161n1314m05O6822m1757
$$ -41272 -7175 21870 -23811 9600 39822 -32768 -22611 33550 -17764 -18169 48653 6896
715F896k9815M9732k8991k6696N3136j5829k4610M9092k7387m4326N3620j0622
$$ 6896 -22919 26813 -2178 -28874 24262 8433 -16177 32915 5528 -38798 14822 4200
727D200m8145O5706J7093p0442K5903K3576n6142K7690M4446m1082R808K2562
$$ 4200 -43945 21761 38854 -31588 -5685 17891 -38251 -10561 33885 -7197 2611 25173
739B5173n1531J1959L9274m3510J4655N0906n6642j8410N5791l8728k5534O4462
$$ 25173 -26358 -14399 24875 -18635 -3980 46926 -9716 -28126 27665 -11063 -36597 27865
751B7865j2907l6198L8513j7379l3677M4557o091k8482N2014p682n3185M4406
$$ 27865 14958 -21240 17273 -106 -33783 10774 4683 -23799 28215 20533 -32652 11754
763A1754O168n9295M6877L9588n9434J2224L1586n6028M986M5909l2192O566L4082
$$ 11754 17922 -41373 5504 45092 -14342 -2118 29468 -26560 -21574 24335 -7857 -1291 32791
776C2791n2181p441M8457l9822q812O5106l1731l7513N4151j8059m6017N1959
$$ 32791 -19390 -26831 21626 -18196 -27008 38098 6367 -31146 23005 4946 -41071 10888
788A0888J0944l7068L4996q26m5839L1322P883l9177M2646J8202n7893K2328K6512
$$ 10888 21832 -15236 19760 18934 -26905 4417 12300 -26877 15769 33971 -23922 -1594 24918
801B4918n8548J4289N0702m0285j816L9587m3029j4548M0968k3901Q12M7266l7596
$$ 24918 -33630 -19341 31361 -8924 -10740 28847 -14182 -28730 12238 -11663 -10851 36415 -1181
814a181k4553M7690k7006k7989O1424q624m5113M5812l02n3434L3311J6584l7454
$$ -1181 -25734 21956 -5050 -33039 28385 19761 -25352 20460 20158 -33276 35 16619 -20835
827b0835L4095J5254n0812J9249J7020m7144L0318M1253n2868M032M1328n0018
$$ -20835 13260 28514 -22298 -3049 13971 -33173 -2855 38398 -14470 -10438 30890 -19128
839a9128q105N3017k8736j4126M8829k6608k9871L5874j9015j7821N3461j3310
$$ -19128 -27233 25784 -2952 -17078 31751 5143 -24728 11146 -7869 -25690 27771 14461
851A4461l8691L9914j0721m5564M7619J6616m6774K9847J8907m9842J6528K4941
$$ 14461 -24230 15684 4963 -40601 7018 23634 -23140 6707 25614 -24228 -7700 17241
863A7241l8790K0274L3216l9861O095K4459m7739P830N1560l6075j0616M5145
$$ 17241 -21549 -1275 31941 -7920 -1825 22634 -25105 -17275 34285 -1790 -12406 32739
875C2739l5921k6653M6316j5614k2898M5869j2041l3988L4732j2947l4603M7220
$$ 32739 -3182 -29835 16481 867 -22031 23838 11797 -22191 12541 -406 -35009 12211
887A2211M796m0454L7784M914n7099K9840L0414m4133J9914L2959m5880K832L0847
$$ 12211 17007 -23447 14337 19251 -37848 -8008 22406 -21727 -1813 31146 -14734 -11902 18945
900A8945l9674P099M4652l3617o518L9225l9672j8350N1726j9000k3886M8902
$$ 18945 -20729 -13630 31022 -2595 -9113 30112 -9560 -27910 23816 4816 -19070 29832
912B9832j4685m1288L5293k168l2917L9261O789l7332K6830J960m5136L0214K3354
$$ 29832 15147 -26141 9152 6984 -25933 13328 20117 -17215 9615 11575 -33561 -3347 20007
925B0007l9509K1989K4236m8693P061L3024l6531N393M1125l1431p746L1368l4960
$$ 20007 -19502 2487 26723 -21970 -14909 18115 -18416 -13023 28102 -3329 -11075 20293 -14667
938a4667q934M5821k2108j5140M3812k5960l3596M3787o957l1325M4979J450m2715
$$ -14667 -23601 22220 112 -15028 28784 2824 -30772 13015 6058 -25267 19712 21162 -21553
951b1553L0674N494m2858L1535K1930l9291K3367J8732n1605J2312L4498l8860
$$ -21553 9121 14615 -28243 3292 25222 -14069 9298 28030 -23575 -11263 23235 -15625
963a5625Q009M0496m0342j1991L6555l1179j2206M6195j9182k0690L7829k0232
$$ -15625 -7616 32880 -7462 -19453 17102 -14077 -26283 19912 730 -19960 17869 -2363
975b363k9916L9902m440k5835M2105j478m1589K8894P557l6427L1262J9407l8041
$$ -2363 -32279 7623 3183 -22652 19453 17975 -23614 5280 12837 -23590 7672 27079 -10962
988a0962J8019J6138m3544J3227K9448l3865J0299L0582m0554n159L3873l2285
$$ -10962 7057 23195 -20349 -7122 22326 -11539 -1240 29342 -11212 -16371 17502 -14783
1000a4783l867M4570k4581j8660L6637k4271k3742M4360q207k6295M0366q132
$$ -14783 -18650 25920 1339 -17321 19316 -4955 -28697 15663 7456 -18839 21527 13395
1012A3395m1081L2751M535l5938L5577J4352m3927J9799J5897m4582J8570L2670
$$ 13395 -27686 5065 9600 -26338 9239 23591 -20336 -537 15360 -29222 -10652 22018
1024B2018l6735J0102L1524m2300m029L9174k7887m568M3848k4857k0803L5350
$$ 22018 -14717 -4615 26909 -15391 -19420 19754 -8133 -12701 31147 6290 -14513 20837
1036B0837k0337k1752M2267p508k6830L4202r692l8462L1612N943l3098L0743
$$ 20837 500 -21252 21015 13507 -13323 20879 11187 -27275 4337 10280 -22818 7925
1048G925J1327m1339J6172J4638l5541J9772K6753l3085J0103K3792l9101L437
$$ 7925 19252 -22087 -5915 8723 -26818 -7046 19707 -13378 -3275 20517 -18584 -15147
1060a5147L5304k8571Q53L8935l1369j7821L6005k1797j7038M2987j2075k6501
$$ -15147 20157 -8414 -7561 31374 5 -17816 18189 -3608 -20646 22341 10266 -16235
1072a6235L3342j3839l3124L8155L040l3047L5124O903m4714K3343J7371l9691
$$ -16235 17107 3268 -29856 8299 11339 -21708 13416 20319 -24395 -1052 16319 -23372
1084b3372K2695L0667l8030L813K5057l7214L039L5545k8174k403L3946l2595
$$ -23372 -677 29990 -8040 -4227 20830 -16384 -13345 22200 -5974 -8377 25569 -7026
1096g026j6449L6868k0056j6380M2386j2454k8579L1443p751k9404L3910O498
$$ -7026 -23475 13393 -6663 -23043 19343 6889 -21690 9753 2002 -27402 6508 13006
1108A3006k5909K7463K97l7297K5888J2956l4020K5098K1615m1062Q178K3143
$$ 13006 -12903 14560 14857 -22440 3448 16404 -17616 7482 29097 -11965 -3787 19356
1120A9356l7254N611L5320k8351l652K9228l1213j0647L4633k0775q751M1512
$$ 19356 -17898 -12287 23033 -5318 -8970 20258 -10955 -21602 13031 -7744 -16495 25017
1132B5017k1400k7810L7171j0214k8924L9903M323l3591K6376L857l7657K2955
$$ 25017 3617 -24193 12978 2764 -26160 13743 18066 -15525 10851 14708 -22949 6
1144FJ5152l0750K1947J5863l9793J2097K0766l8099J2469L7947l2776o783L0837
$$ 6 15158 -15592 6355 22218 -17575 -5478 15288 -22811 -10342 27605 -5171 -11954 18883
1157A8883k9668j0113L8305j5969j2665L2462j8359k0914L1611j3860k1154L9781
$$ 18883 -10785 -20898 17407 1438 -11227 21235 2876 -18038 13573 -287 -21441 18340
1169A8340l936l3409K9942j15l9767K6670J9764k9893J6420J2639l6288J1865
$$ 18340 14404 -19005 10937 10822 -28945 -2275 17489 -12404 4016 16655 -19633 -7768
1181g768K1426k8773J3121K5763l3353L394K8807l6477o094M2523j8840j4600
$$ -7768 13658 -15115 -1994 23769 -9584 -6190 22617 -13860 -19954 22569 3729 -10871
1193a0871L2755k0636k4685L1599n968j6816L2569j0166k9735L0273k165l2605
$$ -10871 21884 1248 -23437 8162 2194 -14622 17947 7781 -21954 8319 6154 -26451
1205b6451L2571J0614l6382K5053J7446m3596Q376K6922k5080J0621K4404l3041
$$ -26451 6120 16734 -19648 5405 22851 -20745 -12369 14553 -10527 94 24498 -8543
1217h543j738K4451k7583K281L5822k6208j1101L4055k4152k1506L7938p284k2536
$$ -8543 -10281 14170 -13413 -11132 24690 -1518 -12619 21436 -2716 -24222 13716 6432 -16104
1230a6104L3205m045l0219K1011q72k1249L0768M151l3401K2089P524l7271K0023
$$ -16104 17101 13056 -17163 3848 2976 -18273 12495 16646 -16755 5334 12858 -24413 -4390
1243d390K2147l3870J2706K6665l5890l614K7684k2769M94L1036k1263p818K5766
$$ -4390 17757 -16113 -3407 23258 -12632 -16246 11438 -11331 -10837 20199 -1064 -8882 16884
1256A6884k6674j1393M1081j2480k0772L3924j0871l3061K9969M001k7516K6732
$$ 16884 -9790 -21183 19898 7418 -13354 20570 9699 -23362 6607 10608 -16908 9824
1268I824Q749l2039J4107P283k7967K1146J5753l1936J6411K0688l9267K682L1317
$$ 9824 18573 -13466 641 7924 -20043 1103 16856 -15080 1331 22019 -17248 -14566 16751
1281A6751k6096r4L3610k4496j4358K5960j7856j0415L2295j1825j4676K6843
$$ 16751 -9345 -9439 24171 -325 -14683 11277 -6579 -16994 15301 3476 -11200 15643
1293A5643j8429k4108L5371j494k7310L2099N806l6722J6914J2660k6577J9612
$$ 15643 -2786 -26894 8477 6983 -20327 11772 17578 -19144 -2230 10430 -16147 3465
1305C465J8333k8131Q965J3705k9930J0273K3363k8549N547K9802l2406j1815
$$ 3465 21798 -6333 2632 16337 -13593 -3320 20043 -8506 -2959 26843 -5563 -17378
1317a7378L1212j9565j3641L4236r888j9528K2400j2560j9528L0931j546j9839
$$ -17378 13834 -5731 -19372 14864 4976 -14552 7848 -4712 -24240 6691 5145 -14694
1329a4694K8497m424l2872K5838J0498l0802K2722K0055l3546M745J7811k6976
$$ -14694 13803 9379 -23493 2345 12843 -17959 4763 24818 -8728 -3983 13828 -13148
1341a3148P205K3239k2474K838K0117k9475l310K9589k1189o822L5040j7560k0787
$$ -13148 -5943 17296 -5178 -2340 17777 -11698 -15008 14581 -6608 -13430 21610 4050 -16737
1354a6737K8790r302k1647K9319J986j9411J9795n622k6317K2935M811k4051K4511
$$ -16737 12053 2751 -18896 10423 12409 -7002 12793 7171 -19146 3789 8600 -15451 9060
1367I060P699l6586J2860J6914l0204J0678K6258k5334r25K1802k3456l124K6490
$$ 9060 16759 -19827 -6967 9947 -20257 -9579 16679 -8655 -9580 12222 -11234 -14358 12132
1380A2132j6212q07K8210k2371j5117L0395j2755j7644L3799m585k7334K2601
$$ 12132 -4080 -4887 23323 952 -14165 16230 3475 -14169 19630 15045 -12289 10312
1392A0312L38k8617J9007R043k1704J7422O683l0218J1445J2527k4767J6466K2794
$$ 10312 10650 -17967 1040 10083 -11621 5801 12484 -17734 -6289 6238 -18529 -2063 20731
1405B0731l0410m86K3219k3460k064K9112j6005q365K3579j6359j2347K2480j3120
$$ 20731 -9679 -10165 13054 -10406 -12470 16642 637 -7728 15851 -508 -12855 9625 -3495
1418c495r605K9847j0598k2447K3897o047k4587K8661Q521k7234J6832Q719k6848
$$ -3495 -13100 16747 6149 -16298 7599 1552 -23035 5626 14147 -13087 3745 12464 -14384
1431a4384J3000J3779k1692J3897J6564k7083M484J7176k7909L950L0488k2141
$$ -14384 -1384 12395 -9297 4600 21164 -5919 -1435 15741 -12168 -8218 22270 129
1443A29r990K4227j9652j4713K7479p470j4139K2898p731j8435K0799m845j7989
$$ 129 -9861 14366 -5286 -19999 7480 10 -14129 8769 1038 -17397 3402 -1443 -19432
1456a9432K6964M137k4445J8862N952k8708J5105J7935k2150Q955J4926k5138
$$ -19432 7532 11669 -12776 6086 12038 -16670 -1565 16370 -5780 3175 18101 -7037
1468g037J985J6103k0255N106K1848k1771l850K1044k1843q547L0062j0358j3887
$$ -7037 -5052 11051 -9204 -4098 17750 -4021 -7871 13173 -8670 -17217 12845 2487 -11400
1481a1400K4477q702k0596K1948j586j6339K2671J003k2379J6657J007k5190J9493
$$ -11400 13077 4375 -16221 5727 4141 -12198 10473 11476 -10903 5754 6761 -18429 1064
1494A064J3155k5366J0947J3605k7667L454K0561j9423K899K1330j8533m476J8690
$$ 1064 14219 -11147 -200 13405 -14262 -10808 9753 -9670 -6771 14559 -3974 -8450 10240
1507A0240j7922l792K6838j2115j0265K3360j3205j8963K5224j371j7976K1070
$$ 10240 -7682 -11474 15364 3249 -7016 16344 3139 -15824 9400 8029 -9947 11123
1519A1123M7k3565J4833L446k0958J6024J0395k1561J0789R656k6751Q376J9985
$$ 11123 11170 -12395 2438 5884 -15074 950 11345 -10216 573 10229 -16522 -8146 11839
1532A1839j9754L798K0511k1303n843K0734j4244m900K3579j1799j0767J9378
$$ 11839 -7915 -4117 16394 -4909 -10752 9982 -4262 -9162 14417 2618 -8149 11229
1544A1229j1903j4621K3280l439j5435K1856l178k4049J7167N443j9175J6459
$$ 11229 -674 -15295 7985 4546 -10889 10967 7789 -16260 907 6350 -12825 3634
1556C634R577k1627R000R154k2077Q978J6860j9091N092J6177k2866k583K0343
$$ 3634 13211 -8416 584 9738 -12339 -3361 13499 -5592 -500 15677 -7189 -9772 10571
1569A0571j5918l463K3767j3903j2723J9262r987j1940K2359l465j4756J9717
$$ 10571 -5347 -8810 14957 1054 -11669 7593 -2394 -14334 8025 4560 -10196 9521
1581I521m300k0679J8237M103j7956J7646P296k3687Q945J0295k0990Q788J6617
$$ 9521 5221 -15458 2779 6882 -11074 6572 13868 -9819 -874 9421 -11569 -2781 13836
1594A3836j8609K556J3864k0489q14J9935j5031k238K1478j4947j0611J9036j0007
$$ 13836 -4773 -2217 11647 -8842 -9656 10279 -4752 -6990 14488 -459 -11070 7966 -2041
1607b041j0354K3246m641j5318J7155m018j8160J7586L484j6773J6254M159k2751
$$ -2041 -12395 10851 6210 -9108 8047 4029 -14131 3455 6939 -9834 6420 10579 -12172
1620a2172J0296R433j9634J0713J4754j9418K896J3468j9878J362K0073j4164
$$ -12172 -1876 7557 -12077 -1364 13390 -6028 -3132 10336 -9542 -8180 11893 -2271
1632b271k144J8694j5584r315J9286r913r167K2450o799j5826J6766n051j6465
$$ -2271 -4415 14279 -1305 -10620 8666 -1247 -10414 12036 5237 -10589 6177 1126 -15339
1645a5339J8970K935j6903J4942L388k1423J1135R639j7234J0503J3163j9332
$$ -15339 3631 6566 -10337 4605 7993 -13430 -2295 7344 -9890 613 13776 -5556
1657e556K813J3025j7971K282J8439j3796k467J6051j6186p651J9123q993q024
$$ -5556 -2743 10282 -7689 -5407 13032 -764 -3231 12820 -3366 -11017 8106 -887 -8911
1670h911J9839p629j4734J5766l926j3981J8822K241j5924J3495J665j9700J2856
$$ -8911 10928 3299 -11435 4331 405 -13576 5246 7487 -8437 5058 6723 -12977 -121
1683a21Q885j6978J1241J0371k1126L402J2885j7173L394J7178j4969k545J4894
$$ -121 8764 -8214 3027 13398 -7728 -4326 8559 -8614 -5220 11958 -3011 -5556 9338
1696I338j5401n410J9280q962o172J9226r334j3789J7147l374j2690J9068J639
$$ 9338 -6063 -11473 7807 -1155 -7327 11899 2565 -11224 5923 2549 -10141 8927 10566
1709A0566j7243J1956J571j7502J2473P354j6258R606P829k0535M267J2248j6591
$$ 10566 -6677 5279 6850 -10652 1821 9175 -7083 2523 10352 -10183 -5916 6332 -10259
1722a0259M646J7277j5930m102J4785j3091m295J9400p276o363J5380r481j0836
$$ -10259 -5613 11664 -4266 -8368 6417 -6674 -10969 8431 1155 -5208 10172 691 -10145
1735a0145J7091l733j1536J8379j146j7106J2234P86j7142J3388Q717j5644P306
$$ -10145 6946 3213 -8323 10056 8910 -8196 4038 4824 -12318 1070 9787 -5857 1449
1748A449N458j8068O712J1694j4256O158J3280j7550o18J5275j4523k856J9304
$$ 1449 6907 -11161 -4449 7245 -7011 -853 12427 -5123 -5741 9534 -4989 -7845 11459
1761A1459r290p658J5419j0178j1771J6317k354r577J5710m991j6094J4176Q17
$$ 11459 2169 -5489 9930 -248 -12019 4298 1944 -7633 8077 3086 -13008 1168 1985
1774A985j5190J5169O993j7556Q783P899j7396N604J2860j1834M638J1306j6210
$$ 1985 -13205 1964 8957 -8599 184 8083 -9313 -3709 9151 -2683 1955 13261 -2949
1787b949r69J2509j2098Q59J6462j2913q150J5424j0064r970J7043k952j0505
$$ -2949 -3918 8591 -3507 -2648 13814 901 -7249 8175 -1889 -11859 5184 2232 -8273
1800h273J3840l298j4010J1797P65j1092J5238L452j6878R639N060j7186R603
$$ -8273 5567 2269 -11741 56 821 -10271 4967 8419 -8459 1180 6240 -10946 -1343
1813a343J3111j5405K724J1584j6014j357J3679j0509JJ4161j1929n807J3683
$$ -1343 11768 -3637 -913 10671 -5343 -6700 6979 -3530 -3529 10632 -1297 -7104 6579
1826F579j0690n738J8968n411j0574J4568l964j4643J4002L369j1904J1653K385
$$ 6579 -4111 -9849 9119 3708 -6866 7702 3738 -10905 3097 6466 -5438 6215 8600
1839H600j5472P754L430j3615J0051Q851j6379M980R312j7733J145J5762j0871
$$ 8600 -6872 882 4312 -9303 748 9599 -6780 -1800 7512 -10221 -9076 6686 -4185
1852d185j075J4089j1713o843J3678o714l640J6077o518q932J3483n861j1383
$$ -4185 -5260 8829 -2884 -9727 3951 -2763 -6403 9674 3156 -5776 7707 1846 -9537
1865i537J6057J297j3492J1923K468j6492P117N985j2141Q003P648j3391L386
$$ -9537 6520 7817 -5675 6248 8716 -7776 -659 5326 -6815 1188 8836 -4555 -1169
1878a169O166j4278N050J3090j2931R96J3352j4363n379J5421p038n147J4775
$$ -1169 4997 -9281 -4231 8859 -4072 -3076 10276 -4087 -9466 5955 -1083 -6230 8545
1891H545n890r512J0861n273q126J5165j701j1512J2927j662j6170J2600O362
$$ 8545 2655 -6857 4004 -1269 -9395 5770 4069 -7443 5484 3822 -12348 252 6614
1904F614j4602R035R040j5209K400Q783j1773L740J2031j1104N49J0234j3986
$$ 6614 -7988 1047 10087 -5122 -2722 6061 -5712 -1972 10059 -1045 -496 9738 -4248
1917d248k444J4924q589m448J4977q265j1283J2368k518q988J2470r2j0017Q941
$$ -4248 -6692 8232 -357 -4805 10172 1907 -9376 2992 474 -8514 3956 3864 -6153 2788
1931B788k216j1589J1802L716j1449R884M686j6218N517R525j2552M241J1529
$$ 2788 572 -11017 785 4501 -6948 2936 7622 -8596 -3079 6446 -6106 -1865 9664
1944I664j1537o99R511j1080j048J2616q446j535J3177j1302q619J4514m305q041
$$ 9664 -1873 -2572 6939 -4141 -5189 7427 -1019 -2554 10623 -679 -9298 5216 911 -7130
1958g130J5232k487j3748J0342R59j1772J0347M201j1472Q456K712j4376O560
$$ -7130 8102 5615 -8133 2209 3168 -8604 1743 5944 -5528 2928 5640 -8736 -2176
1971b176P416j2292O608J0600j4544j302J1254j0283j042J3444p446m625J0464
$$ -2176 5240 -7052 -444 10156 -4388 -5690 5564 -4719 -5761 7683 237 -4388 6076
1984F076p671n337J1414m964m972J3968m723j1619J0725n23j1016J2538M566j2678
$$ 6076 -1595 -6932 4482 -482 -5454 8514 3791 -7828 2897 2374 -8642 3896 8462 -4216
1998d216N650L536j1883O537O603j0232N348O461j3187K164R134j2086J364J3939
$$ -4216 1434 4970 -6913 -376 6227 -4005 1343 7804 -5383 -3219 5915 -6171 -4807 9132
2012I132r735n146J0976q099n638J3093l828n768J1294m937r255J1227j900r203
$$ 9132 -603 -5749 5227 -2872 -8510 4583 755 -5013 6281 1344 -7911 3316 1416 -7787
2026g787J3571J354j3500Q160L704j3497P089R076j0926L242O380j2169J728Q963
$$ -7787 5784 7138 -6362 1798 5502 -7995 -906 8170 -2756 486 6866 -5303 -3575 5388
2040E388r776K196J0740j0677l037J0889q869m444J4272m062p825J0275l495q735
$$ 5388 -4388 -2192 8548 -2129 -5166 5723 -3146 -7590 6682 2620 -5205 5070 1575 -7160
2054g160R569l74p034J0127k05j1204P783J131j1063R517O297j1885M100O185
$$ -7160 2409 2035 -4999 5128 4923 -6281 1502 2633 -8430 1087 7384 -4501 -401 5784
2068E784j2717K613J0376q703J068Q707r960j043R606q894j599J3259o522o481
$$ 5784 -6933 -4320 6056 -2647 -1579 7128 -2832 -3875 5731 -3163 -4762 8497 1975 -4506
2082d506J1091o449q549J2433K3r262R409j60j1730P872K498r793Q579M782j1737
$$ -4506 6585 136 -8413 4020 4043 -5219 4190 4030 -7700 172 2670 -7123 1456 6238 -5499
2097e499N313N302j2536M171J0469r610R75R196j0268k912J0669n991k299J0386
$$ -5499 -186 5116 -7420 -3249 7220 -2390 -1415 7781 -2487 -5399 5270 -721 -3020 7366
2111G366o598n175Q956n676o014J1957k170q264J0124j828j0873Q154L392r063
$$ 7366 768 -4407 4549 -1127 -7141 4816 2646 -5618 4506 2678 -8195 -41 3351 -5712
2125e712P824M182j1289M456M646j0051N315P985j0319K472Q008j1772r25J1247
$$ -5712 2112 6294 -4995 -539 4107 -5944 -629 7356 -2963 -491 7517 -4255 -5180 6067
2139F067p670j891J0713p012o368R564m444n174J1354k527p881R486k243r934
$$ 6067 -1603 -3494 7219 207 -6161 3403 -1041 -6215 5139 2612 -5269 4217 1974 -7960
2153g960J0129K220r482Q255L488j2236M407N702r674M506P819r947J080O731
$$ -7960 2169 4389 -5093 3162 6650 -5586 -1179 4523 -5151 -645 7174 -2773 -1693 5038
2167E038j0321O47J0195p749j233J0274q306n133J0146m095n008J1315k597p844
$$ 5038 -5283 -4636 5559 -2190 -3423 6851 -1455 -6588 3558 -537 -5545 5770 3173 -4671
2181d671P998j821q007R630J456q608P513J611j1214N670M956r369M815O934j0640
$$ -4671 3327 1506 -6501 3129 4585 -4023 3490 5101 -6113 -443 4513 -4856 -41 6893 -3747
2196c747J123O775r173J257R674p302j512Q807q492l687J0691m880m467J1164
$$ -3747 -2624 4151 -5022 -3765 5909 -1393 -2905 5902 -2590 -6277 4414 -466 -4933 6231
2210F231l832q342R158j836q072R943J272q852O769J275j0551O362N151q893N013
$$ 6231 2399 -5943 3215 1379 -6693 3250 4522 -4330 2439 3714 -6837 -475 4676 -4217 796
2225G96N895j0964J759P121q612J602R539p938j658P919p781l177R939m256l881
$$ 796 6691 -4273 -2514 4607 -4005 -2403 7136 -802 -2460 5459 -2322 -5499 4440 184 -3697
2240c697R456n206o957Q633j886o357R446P4r002P177R07r985P228M722q669N258
$$ -3697 5759 553 -6404 2229 343 -6014 3432 3506 -5496 1681 2588 -7397 -169 4553 -4116 1142
2256A142M334j0746K802P243q676K332Q967q906j386P936p380k325J0494m996
$$ 1142 5476 -5270 -2468 4775 -3901 -1569 7398 -1508 -2894 5042 -2338 -4663 5831 835
2270H35m147R298n124p183R393j577o384R315p53r186O601Q68q406P129M074r151
$$ 835 -3312 5986 862 -6321 3072 1495 -4889 4426 3673 -5513 1088 1956 -6450 679 4753 -4398
2286d398M659M020j0184L142O965q150K867P441q951j039P822p220n77J0041n657
$$ -4398 261 4281 -5903 -2761 4204 -3946 -1079 6362 -2589 -3628 4194 -3026 -3603 6438 781
2301G81m096Q085m936n693R631k035o084R069j462q937P112J015q191P140L856
$$ 781 -3315 4770 -166 -5859 3772 1737 -4347 4722 3260 -5677 1435 2450 -5741 1399 5255
2316E255q898M212L331r587M160O712p962K443O479r639P7P790o775j155R462
$$ 5255 -3643 569 3900 -5687 -1527 5185 -2777 -334 6145 -3494 -3417 4373 -2402 -3557 5905
2331E905n985l964P933n387m620R566k118n795Q721k638q502Q339J022p427Q159
$$ 5905 -80 -4044 3889 -1498 -6118 3448 1330 -4465 4256 1618 -6884 1455 2477 -4950 3209
2346C209K306r625M507M163q956M031O584q068J949O065r247l17P723o403m29
$$ 3209 5515 -4110 397 4560 -4396 -365 6219 -1849 100 6165 -3082 -3399 4324 -2079 -2508
2361b508Q463o891m213Q184m708m029R255k262n731P459k372o779P749L20o139
$$ -2508 5955 -936 -5149 3035 -1673 -5702 3553 1291 -4440 3019 647 -6132 1617 1937 -4202
2376d202P764P66r264N595K781q552N399N863q865K208N003q724R96P883o685
$$ -4202 3562 4328 -4936 659 3440 -5112 287 6150 -2715 -507 4496 -4228 -3232 4651 -2034
2391b034L89P498p328k980Q594n380l331J0318l266o623Q200k497p111Q209O84
$$ -2034 -1645 5853 -1475 -4455 4139 -1241 -4572 5746 2480 -4143 4057 1560 -5551 2658 3342
2406C342o885N993J265q974M963K618p233N437M083q910K339N341q109J608P627
$$ 3342 -3543 2450 3715 -5259 -296 2322 -4911 526 4609 -4301 -1962 3379 -4730 -3122 4505
2421D505o008l38P014o687k314P927m479k075Q519m713n207Q058l502o107R024
$$ 4505 -1503 -1841 5173 -1514 -3828 4099 -380 -2455 6064 1351 -3856 4202 700 -5407 3617
2436C617j94p575O577M16q731N608K998p135N301L622q664K829M819q085L166
$$ 3617 3423 -4152 2425 2841 -5890 -282 2716 -4419 882 4504 -4160 -1331 3488 -4597 -1431
2451a431P423p730O7P099p497k207Q384m201k443P434m644m825P095l081m607
$$ -1431 5992 -1738 -1671 5428 -2069 -4276 4108 -93 -2536 4898 254 -4571 2524 -557 -5164
2466e164Q434j054o600O658n49p926O945L192p610N269L325q327K333M427o555
$$ -5164 3270 2216 -4384 2274 1725 -6201 744 3936 -3674 1595 4920 -3407 -1074 3353 -3202
2481c202L102N958p428l10O351p745o61Q545n103k750P503m840n235P749j595
$$ -3202 -100 5858 -1570 -1880 4471 -3274 -3935 4610 -493 -3243 4260 -580 -5815 1934 339
2496C39m538P478j111o089O052q57o505P116K152p148N245K121q808L322N016
$$ 339 -4199 3279 2168 -3921 2131 1274 -5231 1885 4037 -3111 2134 4255 -4553 -1231 3785
2511C785o754K345N879p488M8N194o325N39P209n619j321P234o029m187Q690k354
$$ 3785 -2969 -624 5255 -2233 -2185 3009 -3316 -2777 4432 -1187 -2508 4726 -1303 -5490 3200 846
2527H46m479P986j915p161O423L52o230O410J426o935M544J977q106L799M662
$$ 846 -3633 4353 2438 -4723 1700 2052 -4178 2232 3658 -3277 1267 3244 -4862 -1063 3599
2542C599o945L112N561q113o37O194n015J18P297n172k389N634m520k423P358
$$ 3599 -3346 -234 5327 -2786 -3423 2771 -2244 -2126 5171 -1 -2390 3244 -1276 -3699 3659
2557C659l071l748P394k928o269O565l70n669O681J343p257L949J555o430M759
$$ 3659 588 -3160 4234 1306 -4963 1602 1232 -4437 2244 3587 -3670 279 1834 -4596 163
2572A63L521o807L414M330q236J402O329o496O60P572n920k938O275m624k443
$$ 163 3684 -3123 291 4621 -3615 -2213 4116 -2380 -1720 5852 -68 -3006 3269 -1355 -3798
2587c798P658k784l756N999l247m878O880n41n701O669Q43p590M248K582o622
$$ -3798 3860 1076 -2680 3319 72 -4806 2074 1533 -4168 2501 3344 -4246 2 2584 -4038
2602d038M050M273o328J968L101o529J901N010n866J260N776o286j557O405m749
$$ -4038 12 4285 -2043 -75 3026 -3503 -1602 3408 -2458 -1198 4578 -1708 -3265 3140 -1609
2617a609j969P852k926m388N684k438m320O321j97m705N759m88o553N044J166
$$ -1609 -3578 4274 1348 -3040 2644 206 -4114 2207 2010 -2695 3064 2576 -3977 1067 2233
2632B233o575N419L158p074J988L604o560J943N552n354M64M856n582j019O089
$$ 2233 -4342 1077 4235 -2839 -851 2753 -3807 -1864 3688 -1666 -1202 3654 -1928 -2947 3142
2647C142m623j187P157l774l918O305l079m145O776j78m927M590p70n759N186
$$ 3142 -1481 -2668 4489 715 -3203 3102 23 -4122 2654 2476 -2451 2139 1369 -4390 796
2662G96J223m974M254K125o834L220L103o623K688N232n450K72M900o016o18O185
$$ 796 2019 -2955 1299 3424 -3410 -190 2913 -3710 -1022 4210 -1240 -968 3932 -2084 -2702 3483
2678C483l876j383N850m391l127N911l105l670O825r60n334N359m49o203N323
$$ 3483 -393 -1776 4074 -317 -3444 2467 -638 -4308 2517 1557 -3777 1582 1133 -5070 253
2693B53K017n100L875J928o160K961K867n309L059M230n988N88M742o105m43O124
$$ 253 2270 -2830 1045 2973 -3187 -226 2641 -2668 391 4621 -1367 -779 3963 -2142 -2585 3539
2709C539l790j598N319m048k781N428k777k473O311j979m551N108j004n119N940
$$ 3539 -251 -1849 3470 -578 -3359 2069 -708 -3181 3130 1151 -3400 1708 704 -4415 1525
2724A525J371n571M006J755o411K785L251n041K622L280n438K32M077n454O77
$$ 1525 2896 -2675 1331 3086 -3325 -540 2711 -2330 292 3572 -1866 -1634 2443 -3011 -2334
2739b334N945m497j292N482m268k604N878j919k805N669j476m366M383p65m218
$$ -2334 3611 -886 -2178 3304 -964 -3568 2310 391 -2414 3255 1779 -2587 1796 1031 -3187
2754c187N520M30n291M202N71o064L483L148n351K217L479n777N81M053m753Q90
$$ -3187 2333 2763 -2528 1674 2245 -3819 -336 2812 -2539 -322 3157 -2620 -2039 2014 -2739 -1849
2770a849N371m369j030M631l997j674O170k793k663N730k161m671N102q94l962
$$ -1849 3522 -847 -1877 2754 -1243 -2917 3253 460 -2203 3527 1366 -3305 1797 903 -3059
2785c059N057N53n093L220O12m955L691K791n117K619K828n992J285M455m593
$$ -3059 1998 2551 -2542 678 1290 -3665 26 2817 -2300 319 3147 -2845 -1560 2895 -1698
2800a698O46M899m315j103M179l990j306N577k568k489M886k604m328N428m92
$$ -1698 -1052 3847 -468 -1571 2608 -1382 -2688 2889 321 -2168 2718 114 -4214 1214 722
2815G22l757M791K32n256L463J319n170L983K622m784K220K515n494J583L950
$$ 722 -3035 1756 1988 -3268 195 1514 -3656 327 2949 -1835 385 2900 -2594 -1011 2939
2830B939m085P89M154m634j184M466l676j322N131k444k618M635k692l157N173
$$ 2939 -1146 -357 3797 -837 -2021 2445 -1231 -2553 2578 134 -2484 2151 -541 -3698 1475
2845A475n93l489M730l76n011L962Q56m375L853J719m791K328K258n065J395L816
$$ 1475 882 -2607 2123 1747 -3264 698 1554 -2821 1032 2751 -2040 288 2546 -2519 -1124 2692
2861B692m321R43L788m757o10M006k953r59N263k863k602M494k323k781M870n50
$$ 2692 -1629 -686 3102 -1655 -2265 1741 -1212 -2171 3092 229 -2373 2121 -202 -2983 1887 1337
2877A337l113M023q48m098L627O20m315L747J524m858K145K154m891K053L576
$$ 1337 -1776 2247 1399 -2699 928 1548 -2767 980 2504 -2354 -209 1945 -2946 -893 2683
2892B683m358J005L249m302m19M333l130o88M806l194k190M325k091k700M891
$$ 2683 -1675 -670 2579 -1723 -2142 2191 -939 -1627 3179 -15 -2205 2120 29 -2671 2220
2907B220q46l521L888q05m389M286M80l726L580J290n035K151K189m309K186L368
$$ 2220 1374 -2147 1741 936 -3453 833 1313 -2413 1167 2457 -2578 -427 1762 -2547 -361 3007
2923C007m362J041K712m155J01M156l003p93M265l150k298M176k051j835M074
$$ 3007 -1355 -314 2398 -1757 -1656 2500 -503 -1296 2969 -181 -2479 1697 -354 -2189 1885
2938A885r95l123L751j075l500M288M94l838L291R67m575K131K164l964K287K838
$$ 1885 890 -2233 1518 443 -3057 1231 1725 -2113 1178 2145 -2430 -299 1865 -2099 188 3026
2954C026m268O32K682m040K96M186l057o03L610l373j799M406k062j693M422j371
$$ 3026 -1242 -610 2072 -1968 -1672 2514 -543 -1146 2464 -909 -2708 1698 -364 -2057 2365 994
2970I94l258L696o79l302L949N05l490L065J45m040K486J709l882K416K633m785
$$ 994 -2264 1432 753 -2549 1400 1905 -1585 1480 1625 -2415 71 1780 -2102 314 2947 -1838
2986a838P39K864l646O22L715k887p69L359k994j231L874k120j108M053k258k738
$$ -1838 -1099 1765 -1881 -1259 2456 -431 -1200 2159 -835 -2066 1808 -312 -1420 2633 375 -2363
3002b363L969j145k855M122O3l893K725N84m045K750J611l460K247K059m459J244
$$ -2363 1606 461 -2394 1728 1791 -2102 623 1207 -2838 -88 1523 -1937 310 2369 -2090 -846
3018h46K689l589J073L655l623m41L170k701j182M048j804j744L477j779k688
$$ -846 1843 -1746 -673 2982 -641 -1082 2088 -613 -1795 2253 449 -1295 2182 403 -2285
3033b285L422q98k691L936j83l592K767K86l574L088J806l695J847J857m046J080
$$ -2285 1137 239 -2452 1484 1301 -2291 476 762 -2812 276 2082 -1613 234 2091 -1955 -875
3049h75K952l356J062L201l914j49K944l048n83M070k283j322L008j839k696L994
$$ -875 2077 -1279 -217 2984 -930 -1079 1865 -1183 -1766 2304 21 -1301 1707 -132 -2828 1166
3065A166p00k206L307n12l386L192M1l166L111J329l670K126J213m004J462K917
$$ 1166 466 -1740 1567 1055 -2331 861 902 -2264 847 2176 -1494 632 1845 -2159 -697 2220
3081B220l401R31K377l559l09K797k322j60L405k462j103L388k340j861L894o80
$$ 2220 -1181 -250 2127 -1432 -1741 1056 -1266 -1426 1979 -483 -1586 1802 -538 -2399 1495 815
3097H15k114L296p12l217K438O85k835K754Q78l566K005R20l740J921K358l023
$$ 815 -1299 1997 1285 -1932 506 1191 -1644 1110 1988 -1578 427 1347 -2393 -472 1886 -1137
3113a137N17K772l460m90L013k158j49L397k267j706L110j759j396L751j380k325
$$ -1137 -620 2152 -1308 -1798 1215 -943 -1092 2305 38 -1668 1442 -317 -1713 2038 658 -1667
3129a667L493j005l265L237J50k849K868O52l174J389J093l019J928K336l141
$$ -1667 1826 821 -2444 793 943 -1906 962 1614 -1560 -171 922 -2097 -169 2167 -974
3144i74P48K200l395K8L552k432o51L482k702j324L054j849r54K958j331k147
$$ -974 -226 1974 -1421 -1393 2159 -273 -924 2558 -144 -1468 1586 -263 -1217 1741 410 -1737
3160a737K993j166k363K842L77l100L279K56l702K213J346l020J922J995l043
$$ -1737 1256 90 -2273 569 946 -2154 1125 1381 -2321 -108 1238 -1782 140 2135 -908
3175i08P40J761l076R27K898k524m44K866k806j211L324j644j233L432j672k289
$$ -908 -168 1593 -1483 -556 2342 -182 -626 2240 -566 -1777 1547 -97 -1330 2102 430 -1859
3191a859K512o89k021L081p1k603K704K17k959J839J335k965J887J581l216N85
$$ -1859 653 -36 -2057 1024 953 -1650 1054 1271 -1688 151 1486 -1479 408 1989 -1227 -642
3207f42J913k858P30K568k328j86K376k670p03L197j835j079L456j598j985K705
$$ -642 1271 -1587 -857 1711 -617 -803 1573 -1097 -1800 1397 -438 -1517 1939 341 -1644 1061
3223A061q54j845L007K1k767K388j59k772K283J136k737J782J060l352J074K218
$$ 1061 207 -1638 1369 1390 -1377 1011 852 -1920 363 1499 -1238 544 1604 -1748 -674 1544
3239A544k696L83K581k624j14K321k474m07K871j651o17K602j812j690K784r25
$$ 1544 -1152 -769 1812 -812 -926 1395 -1079 -1486 1385 -266 -883 1719 -93 -1783 1001 76
3255G6j891L295k39k825K051L97k925K392J108k667J647J115l293J301J820k488
$$ 76 -1815 1480 1241 -1584 467 864 -2061 331 1439 -1228 419 1534 -1759 -458 1362 -1126
3271a126R09K287k991O2K592k757m37L176j753q87K439j727j545K699r35j529
$$ -1126 -217 2070 -921 -859 1733 -1024 -1461 1715 -38 -925 1514 -213 -1758 941 6 -1523
3287a523K752n88k478K478K9k714K408J077k791J394J281k867Q51J992k368J097
$$ -1523 1229 641 -1837 641 670 -2044 364 1441 -1350 44 1325 -1542 -691 1301 -1067 30
3303C0J930k814M8K262k449k42L113j983r00K579j929j333K778p27j457K482q10
$$ 30 1960 -854 -806 1456 -993 -1235 1878 -105 -1005 1574 -355 -1688 1090 363 -1094 1388 578
3320E78j868K013k03k196K643M66k708J561O04k601J466J723k741J130J603k441
$$ 578 -1290 723 520 -1676 967 1433 -1275 286 890 -1711 -245 1478 -1263 -133 1470 -971
3336i71K25J739j877P7K428j907r05K586j817j037K941r35j502K259p86k354K386
$$ -971 -746 993 -884 -807 1621 -286 -1191 1395 -422 -1459 1482 547 -955 1304 518 -1836 550
3353E50J7j843K045N85k801J389P16k437J863J711l013R45J882k790K38K527k220
$$ 550 567 -1276 769 1354 -1447 -58 658 -1779 84 1795 -1218 -273 1609 -1181 -943 1584 -636
3370f36N3K561k465l73K180j821o22K631j128j432K265j227j687K650p9k208K075
$$ -636 -583 1978 -487 -860 1320 -501 -1123 1508 380 -1052 1213 -14 -1701 949 870 -1338 737
3387G37J73k376J582O66k383J795J106k187R44J134k616Q14K061k122J69K314
$$ 737 910 -1466 116 782 -1601 194 1300 -887 57 1191 -1425 -611 1450 -672 -503 1811
3403A811k416q18K578j607o99K634j093j528K100j139j674K620j97j907K346N7
$$ 1811 -605 -1423 1155 -452 -1151 1483 390 -1138 962 -177 -1851 769 572 -1335 1011 1068
3419A068k719K083N22k048J578J230k758R20J222k352R24J747k023J3K041k256
$$ 1068 -1651 432 954 -1094 484 1714 -1044 -124 1098 -1254 -330 1417 -606 -593 1448 -808
3435h08o87K603j425p07K551j404j522K274r55j415K539l11j788K153m19k288
$$ -808 -1495 1108 -317 -1024 1527 123 -1399 875 -80 -1495 1044 733 -1055 1098 679 -1609
3451a609K022M80j975J703P51k560P23J588k733J007K081k063L5J835j953l29
$$ -1609 413 893 -1082 621 1372 -1188 -465 1123 -1610 -603 1478 -585 -550 1285 -668 -997
3467i97K401j764l08K405j814j351K565j023j309K410l67k111K066l84k103K242
$$ -997 1404 -360 -668 1737 -77 -1428 1137 114 -1195 1215 848 -1263 803 419 -1684 558
3483E58K01k014J397J004k364R73J231k289J039J529j911K71J514j793j63K395
$$ 558 759 -1255 142 1146 -1218 -245 986 -1303 -264 1265 -646 -375 1139 -654 -817 1578
3499A578j648n74K413j846j168K277q78j472K245k20k064K140n41j858J878O02
$$ 1578 -70 -644 1769 -77 -1245 1032 154 -1318 927 707 -1357 783 242 -1616 262 864
3515H64k089J726M67k189J030R77j611Q84J502k367L22J595j955K04K251j758
$$ 864 -1225 501 968 -1221 -191 786 -825 59 1561 -806 -484 1111 -844 -640 1611 -147
3531a47m87J936j621j199K642j123j099K087m27k087J992j09j952K615Nk011J428
$$ -147 -634 1302 -319 -1518 1124 1 -1098 989 562 -1525 467 358 -1594 1021 1026 -985 443
3548D43M16k298J492R98j877J030J053k085J69J694j823J18K058j720o49J942
$$ 443 859 -1439 53 1051 -826 204 1257 -828 -659 1035 -788 -670 1388 -332 -981 961
3564I61j725p25K876j206j102K028q35j315J782m65j320J831J50k058J658K39
$$ 961 -764 -1489 1387 181 -921 1107 272 -1043 739 274 -1046 785 935 -1123 535 774
3580G74j978J181J329k217J125J036k400O81J626j700L75J626j875n63K066j687
$$ 774 -1204 -23 1306 -911 214 1250 -1150 -469 1157 -543 -168 1458 -417 -980 1086 -601
3596f01o35K241p23j219K111j150j445J970l62j144J782k45j979J626K95j751
$$ -601 -1236 1005 282 -937 1174 24 -1421 549 187 -957 825 580 -1399 227 522 -1229
3612a229J608R34j955P18R52k044M75J430j485M23J516j905k10J776j492l24J987
$$ -1229 379 1313 -642 76 1028 -1016 -541 889 -596 -173 1343 -562 -772 1004 -488 -812 1175
3629A175j013r74J876j102j183J887j98j414J545j24j720J836m6j552J356P92
$$ 1175 162 -812 1064 -38 -1221 666 468 -946 599 475 -1245 591 545 -1007 349 1141
3645A141k110Q56Q76k016O69J651j652L07J471j938q7J727j111n09K050j324j189
$$ 1141 -969 -113 763 -1253 -584 1067 -585 -278 1193 -745 -832 895 -216 -725 1325 1 -1188
3662a188K208j055j044J993k27j468J737m22j772J648M48j870J585L18j827R41
$$ -1188 1020 -35 -1079 914 687 -781 956 534 -1238 410 858 -1012 573 891 -936 5
3678EP90j969J062R74j625L59J441j654k42J857j228j91J470j294p20J681p79
$$ 5 795 -1174 -112 862 -763 -404 1037 -617 -859 998 -230 -421 1049 -245 -965 716 -63
3695f3r43J822k97j509J704l17j566J486K52j016N27P51j700R52K71j521J408
$$ -63 -1006 816 519 -990 714 397 -1169 317 569 -447 80 831 -869 83 354 -1167 241
3712B41J028k182O05J389j656mJ681j582N1J612j321p82J466o53p84J847q00j179
$$ 241 1269 -913 -308 1081 -575 -579 1102 -480 -429 1183 -138 -920 546 -107 -891 956 156 -1023
3730a023J382l11j340J805J46j722J552K63j941J187P81j445O29J094j528K07
$$ -1023 359 48 -1292 513 659 -1063 489 752 -1189 -2 779 -666 -37 1057 -471 -264
3746b64R60j493N29J176j316j91J638j312j009K062q56n82J606n04j638J542r9
$$ -264 696 -797 -268 908 -408 -599 1039 -273 -1282 780 -76 -658 948 444 -1194 348 249
3763B49j440J579L73j848J421J20j354J109L91j450O85J172j689M53P71j141K79
$$ 249 -1191 388 761 -1087 334 454 -900 209 600 -850 -165 1007 -682 -229 542 -599 -320
3780c20J295j283j8J066j399k55J874j141m44J483o93j349J615j21j093J352J55
$$ -320 975 -308 -326 740 -659 -914 960 -181 -625 858 165 -1184 431 310 -783 569 724
3797G24j224P34J16j532J197O20j332R68O84j854O83J062j361J42J214j364K06
$$ 724 -500 234 350 -1182 15 635 -697 271 955 -899 -216 846 -515 -373 841 -523 -317
3814c17J205j422k98J705o12p02J317o70j020J385l89j130J560j09j329J078J46
$$ -317 888 -534 -832 873 261 -441 876 206 -814 571 182 -948 612 503 -826 252 398
3831C98j364J061N12j349R29L17j240O88R98j571N47J306j734P2J155j196j60
$$ 398 -966 95 607 -742 187 504 -736 -48 950 -621 -74 1232 -502 -430 725 -471 -631
3848f31J656r74m50J108r14q30J478n32o32J458n90r88J139J1j150J131N70j462
$$ -631 1025 51 -399 709 -205 -1035 443 -89 -721 737 147 -841 298 309 -841 290 860 -602
3866f02P31M12j200K57J049j374O65Q36j124k37J205q86k15J376r27r35J327l34
$$ -602 129 541 -659 -402 647 -727 -62 774 -350 -587 618 -268 -483 893 -34 -969 358 24
3884B4o99J422n75j053J368l50j126J192j44j097J463K34j398N36R14j177M13
$$ 24 -675 747 172 -881 487 137 -989 203 59 -1038 425 659 -739 -203 711 -466 -53
3901e3Q82j374L12Q93j291M57P29p74q6R79n73o67J095p02m97J452m61r67J334
$$ -53 829 -545 -233 660 -631 -174 555 -219 -305 674 101 -566 529 -173 -670 782 321 -646 688
3920F88l15j104J064O0j019J057K18j082N07L82j325P27Q42j223N31M80j159K63
$$ 688 373 -731 333 393 -626 431 649 -433 74 456 -869 -142 700 -523 8 488 -671 -408
3938d08J264r14j73J004j014j50J099r71j10J056m84p66R69k87q66J112r9o21
$$ -408 856 -58 -231 773 -241 -391 708 -263 -373 683 199 -567 402 115 -751 361 262 -359
3956c59N64L83j208O54L01j067P66P66r46J11O15j201N16P77o20k30P77r05k41
$$ -359 205 588 -620 34 335 -732 34 800 -146 -35 580 -621 -105 672 52 -178 599 -306 -547
3975e47J040p27l25J241n38o73P40k30p64J377j78j041J052j1j101P25O73j297
$$ -547 493 -234 -559 682 144 -529 211 -19 -783 594 416 -625 427 416 -685 40 713 -584
3993e84P38M06j051M07N97j281N88J001j332L22Q28r02j64J000o10l82J003o90
$$ -584 154 560 -491 -84 513 -768 -180 821 -511 -189 639 -263 -427 573 -37 -419 584 -106
4011a06m13R29m02o75J197j98o68P46n33l03O90K62q41L24N74r98J65O93j069
$$ -106 -519 410 8 -667 530 332 -336 410 -123 -426 264 526 -315 9 583 -415 -250 443 -626
4030f26L42J000j008N0N16p42J97Q00o46k2N12m36m39R40l76o78J253l57p79P47
$$ -626 -284 716 -292 -242 274 -468 -271 529 -117 -139 373 -63 -502 438 62 -616 637 280 -499 248
4050B48m1r64J005J90r70O35K44r70L63P23q00N34L85j043J88P96o99o2J016q07
$$ 248 207 -757 248 438 -532 103 347 -623 -260 463 -337 197 582 -461 -273 523 -176 -238 778 -29
4070b9j98P29n54l28Q98m32o90R84k93p57P29k16n62P01K82p19M74M90j205P19
$$ -29 -227 502 -52 -380 518 86 -604 380 87 -670 59 -157 -719 -18 264 -455 19 509 -696 23
4090B3L46n25OO17p63q8Q86p84J61O17o62j76O58n29n38J249l88m54Q31l39p14
$$ 23 369 -156 -150 467 -296 -384 502 -282 -121 496 -166 -342 316 -213 -751 498 110 -344 487 148 -566
4111e66J037k18n57O95J36r11L02M07p36M38N41r08J55P63j172M79L97n56K1Q49
$$ -566 471 253 -304 391 527 -384 -82 325 -411 27 568 -340 -185 578 -594 -115 282 -274 -253 596
4131E96r79j74R80m35n17J022l39n90Q22m13p05Q37J27n76P54j98p85O04J40o43
$$ 596 -383 -557 423 -12 -529 493 154 -436 386 -27 -732 105 232 -344 410 212 -573 31 171 -472
4151d72N78L83p44Q3K90o68J45R93q32K18M67p01p1P18m63j35P27p38k49R19k34
$$ -472 106 489 -255 -172 118 -550 -405 588 -244 -26 441 -260 -331 387 -76 -211 516 -222 -471 448 214
4172B14o68P35J2p48P71L0q72N44R9o25N44L14o60K09K64n91M41M81q42K44M89
$$ 214 -454 281 293 -455 316 346 -526 18 117 -508 36 350 -310 -101 163 -428 13 494 -348 -104 385
4193C85p02K55L83j98l93O35m22k87O33l13k88N81j90l61L08Mo92P27K7l27J68
$$ 385 -317 -62 321 123 -270 365 -57 -344 289 -24 -312 269 79 -282 26 30 -662 65 92 -235 -67
4214f7K38n28J72N79p36K05N66m64J61J91o98J75N40o45J04N37m28k07M63j87
$$ -67 171 -357 -185 394 -342 -137 429 -35 126 317 -381 -206 334 -311 -207 330 -98 -305 158 -29
4234b9l86Q27j82m52N91k71l63L07K74n43L76o4m95L54K65m78L90J08l73k35P70
$$ -29 -415 412 230 -222 369 98 -265 42 316 -227 149 85 -410 -56 209 -269 121 229 -144 -379 391
4255C91m64l8M89n78K71L25j75q12P45l73j2O35k70l57L80N5o62N93J65n73M39
$$ 391 -73 -111 378 -200 71 396 221 -591 154 -219 -231 404 134 -223 157 212 -450 143 308 -265 174
4276A74k1l50J70K46n04L24K36l89N8K70n20K58J36j94k75N47k92j10K30J85l72
$$ 174 153 -197 -27 219 -285 39 275 -114 -56 214 -306 -48 88 -106 -381 166 -126 -236 -6 179 -193
4297a93N46k69l11L93L5q32N49L30m29Q4K74q25R21j36m51J68O27n19J17J42n95
$$ -193 353 84 -227 166 201 -631 -82 248 -181 -97 177 -648 273 137 -314 -146 481 -38 79 221 -374
4318c74M56P5k58r6O05m07k91L28J4k74O08l84l91L92j7l08N09l7l84M93k69l35
$$ -374 82 157 -101 -197 408 1 -290 38 52 -222 386 2 -389 3 -14 -322 187 150 -234 259 -10 -345
4340c45M25J64n53M09J81n26J47K14k21J33K41k64k40N67l97k00M04r5k59L58
$$ -345 80 244 -309 100 281 -245 -98 116 -105 28 269 5 -235 332 -65 -265 139 44 -215 143
4360A43k12k79N64l59j99O27P0n29L98J2n39L63J48m89K71K98p29K76L20l59K09
$$ 143 -69 -348 216 -143 -342 285 355 -174 224 236 -303 60 208 -281 -10 288 -441 -165 155 -204 5
4381EK27l50K5J13n0j32N82k46l05L50k14k96M85n9m96N13j97J9MR9m12L14J41
$$ 5 232 -118 -93 20 -30 -162 420 174 -131 219 5 -291 194 135 -361 152 -45 -26 -22 77 -335 -21 120
4404A20k61N9K44l09J32j13J10L6K84n26L4K94p0j89M03j95J3K97k86k90K56j31
$$ 120 -141 -82 162 -147 -15 -128 -18 18 302 -224 -190 104 34 -155 248 53 66 363 77 -213 43 -88
4426h8k08M78j36k87L30Q9l84J51L10o30L40K29m87K24Q5J67l88K86j4k32L16
$$ -88 -296 182 46 -241 89 178 -206 -55 255 -375 -35 194 -293 -69 16 183 -205 81 67 -165 151
4447A51l35M6J74o3j42L58o4j41pK54l30n5Q6j2k1M49o03L11J0m18L25J85k65
$$ 151 -184 -138 36 -27 -169 189 125 -16 -23 231 -99 -154 -68 -80 -101 348 -255 56 66 -352 -27 158 -107
4470a07J9K31l76L53n2m41K81K90j59l18M35j08k78M68l87K3Q5N3j63K69Q2n00
$$ -107 -88 143 -233 120 68 -373 -92 198 39 -279 156 48 -230 238 -149 -126 -41 12 -151 118 200 -300
4492c00N23n5j4m9J73j13j08Q4j73k34P22n27J45Q8l26P1J65k25J43L93l90P4
$$ -300 223 168 154 105 278 165 57 141 -32 -266 456 -71 74 162 -164 -93 72 -153 -10 383 -7 67
4514F7J36j22j03L02K7l80K45m07k3J67P8j48K09K29o39M86J72m51K02J29k46
$$ 67 203 81 -22 280 307 -73 172 -235 -258 -91 -13 -161 48 277 -362 124 296 -155 47 176 -70
4535g0j09K48O2j06K59l86O3J36j90JK14k41J18J88j48j61K26l41j0L15J30n53
$$ -70 -179 69 131 25 284 -102 -39 97 -93 -92 122 -119 -1 187 39 -122 104 -237 -247 68 198 -355
4557c55N06q4k32K86O0m41K38J33j53j65L28j18p7L82m43Q1L66m06K4K21l47M5
$$ -355 151 67 -165 121 181 -260 -22 111 -42 -207 121 3 -74 308 -135 -54 312 -94 -70 151 -196 -151
4579a51K33qk42K45j41j59M35j68p9K85l19r1J90J48k76K80j9k53K16L7j04pK
$$ -151 82 74 -168 77 -64 -223 212 44 -35 250 -69 -160 30 178 -98 182 163 -90 126 163 59 52 54
4602E4o3m4J97j66j06K40j4k39M77l41j17J88j84o2J33J14J6j65J72j68J87j67
$$ 54 -9 -53 144 -22 -128 112 98 -141 336 -5 -122 66 -118 -180 -47 67 83 -82 90 -78 109 -58
4624e8O3L9J22l66K81Ok06J82J34l57K93J27l34M8J48j76j7nl0l3K51j06j23L88
$$ -58 5 44 166 -200 81 87 -119 63 197 -160 133 260 -74 -26 122 -54 -71 -76 -106 -139 112 6 -117 271
4648B71m12K86j22O1k06K81j05k73L00j99o0K37kk10J93L7k63N0K43j16q2K02
$$ 271 -141 145 23 84 -122 159 54 -219 81 -118 -178 59 57 -153 40 77 -186 -136 107 -9 -91 111
4670A11l11J26J01p0n4J96k24J25R2J20k1nj57l17O46l27l6l3J36j63K17j04j47
$$ 111 -200 -74 27 -43 -97 99 -125 0 92 212 191 186 29 -288 358 31 -5 -38 98 -65 152 48 -99
4693i9J27Q1r0R6K03l23k3R0k85K34J5J3k93L88j83j06J94j52j7J2K82k74J52
$$ -99 28 109 19 115 318 -5 -28 62 -223 11 26 39 -254 134 -49 -155 39 -113 -130 -118 164 -110 42
4716D2R6k12K49L8l41L92k35r7L12o9k60L8R0r6K49r8M8k80J63k49n2N49n35J93
$$ 42 138 -74 175 213 -128 264 29 -68 244 175 -85 -47 43 -53 196 98 146 -134 29 -220 -272 277 -258 -65
4740f5L06l59j3J68k52J35L66j97j12m8L73k75j82L10k23P9P9j57R8J36k02on4
$$ -65 241 -118 -131 37 -215 -80 286 89 -23 -71 302 27 -155 155 -68 11 90 -67 31 167 -35 -41 -95
4763i5L19k74M5M2K82k25j42o8R5N6Pj8L2R3J00k00j04n3K16o7J34j22K57Q9n10
$$ -95 224 -50 -5 37 319 94 -48 -116 -21 35 42 24 56 149 249 49 -55 -108 108 41 175 53 310 399 -111
4788a11%K26K4k08L71k59k07J7J94j34J7K0O9o9J84j87L4N2K5j02J19j55j70L65
$$ -111 -111 115 139 -69 302 43 -164 -147 47 -87 -70 -50 19 -50 134 -53 -19 33 58 -44 75 -80 -250 115
4812A15j03j37J61k06j04L26o7J05J08m3k50R4j60K07j30J88j66O4K3j35K79k78
$$ 115 12 -125 36 -170 -274 52 -15 90 198 155 -95 -1 -161 46 -84 104 -62 2 25 -110 169 -109
4834a09P2m1J42j26M3J07J19j36n4n5J44k12j5k1P7Kj01K61o1m9K08k09J43j15
$$ -109 -37 -78 64 -62 -19 88 207 71 17 -38 106 -106 -121 -142 -65 -63 -164 97 36 -13 195 -14 129 14
4858A4j17n2Q8J06j21K64l41L7J18j25L3QJ92j05M5O4k17O3J33rj52J71Or7p3
$$ 14 -103 -155 -67 39 -82 182 -159 -122 -4 -129 -96 -88 104 -1 44 108 -109 -46 87 78 -74 97 103 6 -67
4883f7L49l87M7l9M0J76j69L8K95l27k02J50K02l33K86J9j63K94k89O5q9L29l17
$$ -67 282 -105 -58 -97 -57 119 -50 -12 283 -44 -246 -96 106 -227 59 78 -85 209 -80 -15 -104 225 -92
4906i2j68M69k71n3J91k57M55q9N5l14J71l45J53K87o8k58K37k00Q7J06q3L5j60
$$ -92 -260 209 -62 -115 76 -181 274 185 240 -74 97 -248 -95 192 124 -134 103 -97 -10 96 13 48 -112
4929a12K9J02k27J74K0j1R7j23J22qj36J93L1l03M42m01K39p8J76m35K21P5j20
$$ -112 -83 19 -208 -34 -14 -25 72 -51 71 63 -73 120 151 -152 290 -111 128 50 226 -209 12 87 -33
4952c3M0M0K05k39j85L31j12j09J01K2k32Q4L11k06J24l19J77R4k1Kp8r8j46K17
$$ -33 7 47 252 13 -172 159 47 -62 39 61 -171 -87 224 18 142 -177 0 94 73 75 -3 -101 -247 -30
4976c0j04K01R6j03j01j00R8R1N5k11J68R6l41J37J13r3o0M21l29nK69j20k96
$$ -30 -134 67 163 60 -41 -141 -43 48 103 -108 60 156 -185 -48 65 -28 -88 333 4 -1 268 148 -148
4999a48qJ12J05J0j47J24k3o1J23q9p7m2L4K07l48J56J70O4m48L33J13n6j54j70
$$ -148 -156 -44 61 71 -76 48 25 -36 87 -2 -79 -121 -87 120 -228 -72 98 162 -286 47 160 104 -50 -220
5023b20J72K85k87j86K04l7R6n7L8l23N00k3j28j98K72j06K8l0k72J25M08m06
$$ -220 -48 237 -50 -236 -32 -69 27 -30 8 -315 185 162 34 -164 108 2 30 0 -272 -147 261 -145
5045a45m9J44M7r7P0J34j21M7j67J95p1k5J12J3r5M9r6N5m9J91j98j4Q3J8j46
$$ -145 -194 -50 -3 -100 -30 104 -17 30 -137 58 -13 -38 74 87 -8 41 -55 0 -49 142 -56 -70 13 31 -115
5070a15K35j80K60L0J33n48K93P0l80L40R5k27Pr6K65j56R4j57J5M2l78M33j84
$$ -115 120 -60 200 230 363 -185 108 178 -202 138 233 6 13 -83 182 26 120 -37 -22 20 -358 75 -109
5093a09J6K2J66R6l38MJ49m5K17m4k57lJ35q6M6j87J70K03k44L21p9%p8l01K13
$$ -109 -93 -71 95 191 -147 -143 6 -39 178 134 -123 -126 9 -77 -31 -218 -48 155 -89 232 153 153 75 -226 -13
5118a3j3O9j6r2J25J29j19j41o3K55l73J69J96j64J82J3j56k34J53j92J94J61
$$ -13 -26 43 27 -65 60 189 70 -71 -134 121 -252 -83 113 -51 131 144 -12 -246 -93 -285 -91 70
5140G0k51K3J93QJ69j40o0M7k0j4k3j41R9J92k01J50j49J45j2q0j12L3P2K27k12
$$ 70 -181 -158 35 43 212 72 12 59 39 25 2 -139 -40 152 -49 101 -48 97 85 5 -107 -74 -2 225 13
5165A3K7n2mo5J53M4j74R7lj87J17J53p7k71K16qk7J83m01J91Q3K64m16K05L1
$$ 13 40 -12 -16 -81 72 116 -58 39 36 -151 -34 119 42 -229 -13 -21 -48 135 -266 -75 8 272 -144 61 92
5190I2j67K61j00j63K77m4k32NJ59O6q8j81Q2R4J81l34J90O2qk59K44r4Jr3J59
$$ 92 -75 186 86 -77 200 156 -76 -71 88 154 66 -115 -33 61 242 -92 98 160 152 -107 137 43 44 -49 110
5215A10Or1l5J87Rm5o0j06J4L7J12N6l2q1J19j52j5r7K1J17q0j43J95K5l7k54
$$ 110 116 25 -10 177 186 141 81 -25 -11 26 138 194 162 81 200 48 33 -64 -43 74 -6 -149 46 71 34 -220
5241b20L51j87p5J88J69n65N07k20k30J63K33r0L4K55j33k99P3J3p2j04K76j75
$$ -220 131 -56 -131 57 226 -339 168 -52 -282 -119 114 24 58 313 180 -119 -46 -33 -105 -209 67 -108
5263a08l1J1q3J07K6K18k54m5m6K21j69J67j31K17n7o5O0k20L37k03j17J33P2
$$ -108 -139 -128 -211 -104 -78 140 -114 -159 -205 16 -153 14 -117 100 43 -22 38 -182 155 -48 -165 -32 40
5286D0J6k14K1M5J64j01J20j17j0J35j21j07q4J31L00k49J03L5l16L5l2J34n1
$$ 40 56 -158 -137 -92 72 -29 91 -26 -36 99 -22 -129 -213 -82 218 -31 72 107 -209 -174 -206 -72 -123
5309a23L36l2k20Q4k27L09l58J08J18K40l22j1J80j26j41J35K21l31J78p8J43
$$ -123 213 181 -39 45 -182 127 -231 -123 -5 235 -87 -98 82 -44 -185 -50 171 -160 18 -60 83
5330H3k67L52m40K30n3K17r3J45m29M32k34l3O5j3J23k13P3Kq0J12K30j59k30
$$ 83 -184 168 -272 -42 -95 122 29 174 -255 177 -57 -90 -25 -38 85 -128 -55 -53 -133 -21 209 50 -180
5353a80K9R3L21k74r8K55P6k21J3J06r5j13J14k3p5K95k52j15J46J4j70K87k95
$$ -180 -151 -58 263 -11 -109 146 222 1 14 120 25 -88 26 3 -72 223 -29 -144 2 16 -154 133 -162
5376a62K39k1K1J02k37K53j04n0J01j59j18J34k20J46J78J6k96M8L4L7J69n4o4
$$ -162 77 56 77 179 -58 195 91 41 142 -17 -135 -1 -221 -75 103 119 -177 -129 -95 -58 111 57 -7
5399gO1J62m24L33J3l80K74Mo3K50l06J11j3J37j51J15O6j71L7p6k7L57k83j53
$$ -7 54 216 -208 125 138 -242 32 36 -27 223 -83 28 15 152 1 116 182 11 48 -28 -55 302 19 -134
5423a34J46J7j15n8K78k06N4J0K22m52J93J63k27K46q5nL10l45kK26l30j15J38
$$ -134 12 29 -86 -144 134 -72 -18 -8 214 -238 -45 118 -109 137 52 47 357 12 10 236 -94 -209 -71
5446g1R1j67L80k53k21K89rk54K83j3m4L2n9Nk7K84j23k77L94k66j62L46k59R0
$$ -71 20 -147 233 -20 -241 48 39 -215 68 55 11 43 -16 -11 -38 246 123 -154 240 -26 -188 158 -101 -11
5470a1J69k25j03K87J9j43Q9j59J7L30m9k47o5K77k05L1K79m80K37k66R6mM78
$$ -11 158 -67 -170 117 136 -7 82 -77 -60 270 221 -26 -91 186 -19 12 291 -189 48 -218 -122 -126 352
5493C52n75L77K17k51q0K12j46p7QM0j64J40m6r7J26m8On8J62q8K00k5l03K56
$$ 352 -223 154 371 120 40 252 106 29 37 77 -87 53 7 -90 36 -12 -6 -64 98 10 210 185 -118 138
5517A38j07J68l70M17m14J7L10j81n2L73j55k52J14O7k44J38K68k54J07k8j50
$$ 138 31 199 -171 246 -168 -151 159 -22 -74 299 144 -108 6 73 -171 -33 235 -19 88 60 -90
5538i0O9J11l08K99L7m1j41M67n81P4j6M5L04k22k44J22J98j53o8M59m54J47J25
$$ -90 -21 90 -218 81 118 77 -64 403 -178 -104 -120 -75 229 7 -237 -115 83 -70 -138 321 -133 14 139
5561A39k20j36J10J50j96L76k13q8J31K01l73J98q4l2Q9J96m50L16j19j86J41
$$ 139 -81 -217 -107 43 -153 223 10 -78 53 254 -119 79 -5 -37 52 248 -202 114 -5 -191 -50
5582e0n2%j69L83j36J1l6K18l92K46n0j40L24k51k0J05K49m16J58J46k74L06k33
$$ -50 -102 -102 -271 112 -24 -13 -49 169 -223 23 -27 -167 157 -94 -114 -9 240 -176 -18 128 -146 160 -73
5605g3j3J95Q7q2m14L30k99K71M7k08l5K80k12j8L37j27k29K50J85k75L1j69K28
$$ -73 -86 109 196 114 -300 30 -269 2 49 -159 -194 86 -126 -144 193 66 -163 87 272 -3 28 -141 87
5628H7J55j65j78K84r6M6j51K84m07J83o9j44J73j16jJ62J43k44L07q3k67J84
$$ 87 242 77 -101 183 87 133 -18 266 -141 42 -27 -171 2 -114 -115 47 190 -54 253 170 -97 87
5650H7J10k67L8l8p8J50J91j71N6l5J9k30R6Q9j55K16k84N39l08P1l42M00q7j43
$$ 87 197 -70 -32 -70 -148 2 193 22 78 43 62 -168 -72 17 -138 78 -206 333 25 96 -246 154 67 -76
5674g6J7K18k62J23J7p5q7J59k2J23j64j92J82L6J58j37K70l58r0L39k82J8J41
$$ -76 -59 159 -103 20 37 -38 -125 34 12 135 -29 -221 -39 -3 155 18 288 -70 -160 179 -103 -85 56
5697E6J87k42Q8O5j59k50L87n93N71J94n25L09q3J80k08J42Kk92M02m6k19M1j47
$$ 56 243 1 89 154 -5 -255 132 -461 110 304 -221 88 5 185 -23 119 121 -171 231 185 -34 7 -140
5720a40J30Q5L2j21L18k87j03M35l52k75K60K18m37J88K60l11J36k2q3P2j14L
$$ -140 -10 75 107 -14 304 17 -86 349 -3 -278 -18 200 -237 -49 211 -100 36 14 -69 3 -111 -108
5742a08K66j37l29K34K18M4j02q5k00J27K57j90l6k0k02P3L19M6j74l0J66n03
$$ -108 158 21 -308 -74 144 188 86 1 -199 -72 185 -5 -41 -61 -263 -190 129 175 1 -29 137 -366
5764c66K59J29M2Q0j52K3p2L02l50J50j26q7K75O4n04K85J34l52J88J93r3k00
$$ -366 -107 22 64 144 -8 15 -57 245 -105 45 -81 -168 107 171 -333 -48 86 -266 -78 115 22 -178
5786a78L13n3k37K33J4l22K90o8o7m8R8j32L0K16k22J45J23k98J89j31j6J0J16
$$ -178 135 82 -155 78 92 -230 60 -8 -75 -123 -25 -157 -127 89 -133 12 135 -163 26 -105 -121 -111 5
5809Ej23K26Q0j64l5L07m58P2L20j72l4op3k00K79O3k15K45K24n08K95J38j8k29
$$ 5 -118 108 188 24 -11 296 -162 -90 230 58 24 18 -55 -255 24 87 -128 117 341 -167 128 266 248 19
5833A9J84j2j45L34n81J41J9j88K59J90k17N0j01J01l0Nm5k59M32j09j73J3K36
$$ 19 203 191 46 380 -201 -60 -41 -229 30 220 3 53 -48 53 23 28 -17 -276 156 47 -126 -113 123
5856A23l09M14l45n6q1K21l8J74m8j71K33J31j85k29K80k09k6K71k94J49L0j17
$$ 123 -186 228 -117 -173 -254 -33 -71 103 55 -116 117 248 63 -166 114 -95 -121 150 -144 5 35 -82
5878h2j84K63l04J32M01j5k14M5Q2p8Q3j30jp5K37n97N29j23Qj87L28k70K39j0
$$ -82 -266 -3 -307 -175 226 211 -3 42 124 46 129 -1 -2 -77 160 -437 92 -31 -23 -210 118 -152 87 77
5902G7k29Q3LR9n4K8K0M0K29l94k6L44k83l7L25j34j43J36l01N0J51J29m9j4O
$$ 77 -152 -69 -66 33 -21 7 27 67 296 -98 -124 220 -63 -100 225 91 -52 84 -217 -167 -16 113 64 50 56
5927E6k39K31j5j13J03j10J52j71J40Jk1K64k62k00M30j16r0M1j16J22l23M98
$$ 56 -183 48 33 -80 23 -87 65 -106 34 35 14 278 16 -184 246 130 40 81 -35 87 -236 262
5949B62k70K9K85k37k10M22o04K27L80k99l39N67n09N45P3n46J55L01l32rK86
$$ 262 -8 21 306 69 -141 281 -323 -96 284 -15 -354 213 -296 249 322 -224 -69 232 -100 -109 177
5970A77m48J32K47j82k20K69P7j30L27o1m17O06k69j24P8l5k89M15k2M7J25j1
$$ 177 -271 -139 108 -74 -294 -25 52 -78 249 188 -229 377 108 -16 62 27 -262 153 131 178 303 292
5992B92m06J72n9q3RJ27R0q1J84k97P9K1J5k53K81J1k69K94r5q7K50m4n60M09
$$ 292 -114 58 -1 -84 -75 52 142 61 245 -52 27 48 63 -190 91 102 -167 127 32 -55 195 151 -409 0
6016@J67j93K35r1l19M0N99o95J49L30l59P7J22l25O8M12k87kN68l90l92L65M6
$$ 0 167 -26 209 118 -201 -161 438 -257 -108 222 -137 -60 62 -263 -195 217 -70 -72 496 106 -286 79 125
6039A25k45J32K35l05K63p5m35L09J30j97K07r3j81K64m8j87K08J50k59j15J5
$$ 125 -120 12 247 -58 205 130 -305 4 134 -63 144 51 -130 134 86 -101 107 257 -2 -117 -102
6060a02N7j63L93j80k03L94j62o9J88q3j45J29qJ51l35J5LK98p1l41P0J17n4J89
$$ -102 -45 -208 185 5 -198 196 34 -35 153 70 -75 54 46 197 -138 -123 -120 178 107 -234 -164 -47 -101 88
6084H8p6L4L9K08j70k66L13k83k8M38m14N1J65k87j15M81l2j56K33j74l45N37
$$ 88 12 46 85 293 123 -143 170 -113 -141 297 -117 -66 99 -188 -303 178 146 -10 223 49 -296 241
6106B41l05M9R7M2j75Q7K6m37N24K01n38K97N7j81M0P8l34N37j68l50J58J02k75
$$ 241 -64 -15 82 124 -51 36 62 -375 149 350 -188 109 166 -15 25 103 -231 306 138 -212 -54 48 -227
6129b27J84J62m6j46K19k73j42K58K71l97Q4O7l94M33k8L3L5J37m76M20j94j41
$$ -227 -43 119 73 -73 146 -127 -269 -11 260 -137 -53 14 -380 53 25 58 93 230 -246 174 -20 -161
6151a61J82J61j96R0L11m18k24L70j93q8K11j62J11J68k54q4J81n8j43L49l2k78
$$ -161 21 182 -14 76 387 -31 -255 115 -78 -166 45 -117 -6 162 -92 -176 5 -53 -196 153 121 -157
6173a57K11J11l24J31L61l47n4J0j86N6L43m36J62J11N0j3K02l55PK17q9r8L86
$$ -157 54 165 -159 -28 333 -14 -68 -58 -244 -188 155 -281 -119 -8 42 29 231 -124 -117 100 11 -87 299
6196B99m38j53M59j84k74M16j17r9K43J94l71J47J0l15P4N1m8J10J01k2j99L05
$$ 299 -139 -292 167 -17 -291 125 8 -91 152 346 -25 122 132 -183 -109 -58 -106 4 105 83 -116 189
6218A89n58L52J12l35jL31Lm3K34n91J20L60j80k19K40m8m41Q32o2m07K29J03
$$ 189 -369 -17 95 -240 -241 90 93 50 284 -307 -187 173 -7 -226 14 -34 -475 357 295 -112 117 220
6240B20m89K14R4k51J45M30m26K10l72K2L9L03k00j53M14k00j25L75j80k12L36
$$ 220 -269 -55 39 -212 -67 363 -63 147 -225 -203 -164 139 -61 -214 200 0 -125 250 70 -142 194
6261A94k96J25K42k82q6K28l63J32K38J07k55O4P1m10O5M63l12K27nm76M05J27
$$ 194 -102 23 265 -17 -103 125 -238 -106 132 239 -16 48 119 -291 -226 237 -75 152 147 -329 76 203
6283B03k86J3M22n66L58L63l66k29L04l79k6M19j52l25K55J30l47L90j22k72M31
$$ 203 -83 -70 352 -214 144 507 141 -88 216 -163 -189 230 78 -247 8 138 -209 181 59 -213 218
6304B18j60j68K74j05j37R3J46l40L32K72m80n7M44m63l7M37k32j73K24r0k35
$$ 218 58 -110 164 59 -78 15 161 -179 153 425 -55 -112 332 -131 -168 269 37 -136 88 -2 -237
6325b37L10j30k28L56j28P0k3M39l56K25j68m06K75N4j23J26Q1l53K15L78l72
$$ -237 73 -57 -285 71 -57 13 -10 429 73 298 130 -276 -1 53 -70 56 137 -216 -1 377 5
6346Er9J28k21q3L13k62L90r3j24j64K06k6J03N6L3j39O5o4k65M51j94j24J61
$$ 5 -94 34 -187 -270 43 -219 171 78 -46 -210 -4 -30 73 129 162 23 88 24 -241 210 16 -108 53
6369E3J62l05J75j9l68K80M72o70J44L06n10J46L17l21%L77l52k99N65k49J64
$$ 53 215 -90 85 66 -302 -22 450 -220 -76 230 -280 -134 183 -138 -138 239 -113 -412 153 -96 68
6390F8P9L8o36L77L66m57K36j00j50L39j12m10M50j20k5o2J10k20L06J12k61j57
$$ 68 147 185 -451 -74 292 -165 71 -29 -179 160 48 -362 88 -32 -57 -119 -9 -229 77 189 -72 -229
6412b29K64O8K4J32l58P3J77Mj68K16R9n47J89m4j55L90k29m1J91K58m19L81l55
$$ -229 35 103 127 259 -99 -26 151 155 -13 203 302 -245 -56 -100 -255 135 -94 -135 56 314 -105 276 -79
6435g9k2k9N02m71J38J8r8N7k6J02l92N07l53L1K49O5n68L52J6j31Q4J04j13L37
$$ -79 -101 -130 372 -99 39 57 -41 16 -10 92 -300 207 -146 -115 134 199 -369 -17 -1 -132 -48 56 -57 280
6459B80q6m82O03q7k85J22J30l57J82rl24K75J01m05K79L71l02l72O82m68j78
$$ 280 194 -288 315 228 -57 65 195 -162 20 11 -313 -38 63 -342 -63 308 6 -366 316 -152 -330
6480c30L62R8k52L88l28j24M66j43l62N32j5n56M1N59n64j34N27n11M20Lm31L04
$$ -330 32 130 -122 266 -62 -186 280 137 -225 307 292 -264 -223 336 -228 -362 165 -346 74 77 -354 -50
6502e0M6j31L11j98j13j20M32k22k42M17K0k40M20j79m75M54J03n41O20k19m46
$$ -50 -4 -135 176 -22 -135 -255 177 -45 -287 130 150 -90 330 151 -324 130 233 -308 312 93 -353
6523c53K67M28n97K70J85j57j54j6pK35J33m85K90J43j89j80K64N2l35N08l52
$$ -353 -86 342 -255 15 200 43 -111 -127 -134 101 234 -251 39 182 -7 -187 77 129 -206 302 -50
6544e0j86L71m20K1M17j13k61L56l3k84J70L15n05K07J51m44L82J54k22q6N10
$$ -50 -236 135 -285 -264 153 40 -221 135 102 -182 -12 303 -202 5 156 -288 94 248 26 -60 450
6565D50n49j46N02l04k65O47m98P9M17m56r3K86j57l8L72j10l23K33J30m29L30
$$ 450 -99 -245 257 -47 -312 335 -163 -84 333 -123 -216 70 -87 -125 247 137 -186 47 177 -252 78
6586G8J4l26L61l1l35L24L18q06K92K91o69N60L1j58p9M13l49j56O02m24j57M50
$$ 78 92 -234 127 96 -239 85 403 -403 -111 180 -489 71 102 -56 -135 278 -71 -227 375 -49 -206 244
6608B44m3k84L64j34m18L99l4k64J56K25k20K22q3l89J07L22l62K35M34o92J29
$$ 244 201 -83 281 147 -271 128 94 -170 -14 211 -9 213 130 -259 -152 170 -192 43 477 -215 -86
6629h6L61l81J0K78l12J38K41j03m30K16L17n47N24n3l06p8M41m81L22J10m10
$$ -86 275 -106 -96 182 -130 8 249 146 -284 -68 249 -298 226 173 -133 -211 230 -251 71 181 -229
6650b29L56J94o13K76K9k90L82P4l50m9M62q5k67K97l37L3K83l67J72L15k72k1
$$ -229 127 321 -292 -16 13 -277 105 179 -171 -220 242 157 -110 187 -150 -117 166 -201 -29 286 14 -7
6672gJ13k77p7L12n5k03L11K47o82L68J04k71J82M30o69J17J51j43j31K89k70
$$ -7 106 -171 -248 64 9 -194 117 364 -318 50 154 -117 65 495 -174 -57 94 -49 -180 109 -161
6693a61M7L54k84k24J36Q1k05N04l71k47N19J47n07L42P0n61M38R5l12J06P1l05
$$ -161 -114 240 -44 -268 -132 -51 -256 248 -123 -370 149 296 -211 131 201 -360 78 173 -139 -33 38 -267
6715b67K35J23j40o6L40l58J10K41m43L17J69m58M1M42l57j38K69k60K4N00k39
$$ -267 -32 91 -49 -115 225 -133 -23 218 -225 92 261 -197 -156 286 -71 -209 60 -200 -176 324 85
6736H5k74M06j09l62L46j03m79N38J42k02N8j07j11L27k38l99K97O73n00q0N04
$$ 85 -189 217 108 -254 92 -11 -490 48 190 -12 46 -61 -172 155 -83 -482 -185 488 -12 -92 412
6757D12m62L0J6%j73N86m04j30M17k42j95L13m2k51M59j09m44K16j9n0K42J59
$$ 412 -50 -20 -4 -4 -177 409 5 -125 292 50 -145 168 126 -125 334 225 -219 -3 -22 -72 170 329
6779C29m10J53J41m22K14K74m19j54N44l26o4Q6q2R2J66k85P0K59k85k00M71P1
$$ 329 -81 72 213 -209 5 279 -140 -294 250 -76 -140 -54 -136 -44 122 -163 -93 166 -119 -319 152 223
6801B23l85N18l21l38L14L02l75J13K02m59L11J03k83n0L16k69l03N07j78o2M84
$$ 223 -162 356 35 -303 11 313 -62 51 253 -206 105 208 -75 -125 191 -78 -381 126 -52 -114 370
6822C70l66Q5K1j79Q4K58k45k54N06k91l70M75q9o1KK48m81K75J79n25M60o2j95
$$ 370 4 89 110 -69 15 273 28 -226 280 -11 -381 94 5 -56 -54 194 -287 -12 167 -358 102 40 -155
6845a55J1K46l63P4M44m53J92L58o64P4M90j37n10P69k61j53L35k06m5o9J57l54
$$ -155 -144 102 -261 -187 257 -196 -4 354 -310 -236 254 117 -393 376 115 -38 297 91 46 -23 134 -220
6867b20L01N4j61o5J81l46J54K96k94r4L60l62K71P5l99L23J01k92o7M21k84j58
$$ -220 81 135 -26 -91 90 -256 -102 194 -100 -194 166 -196 75 150 -249 74 175 -117 -184 237 -47 -205
6889b05L68k9n28O21j97k29K38Q6j26K99q4m68M14j51k25J65L50m79L31K32o13
$$ -205 163 134 -394 227 30 -199 39 125 -1 298 214 -254 160 9 -216 -51 299 -180 151 383 -230
6910b30J24L21n79J72K63R3l86L91k32QL01m41k18O22m4m68N03k12L1j24J82k79
$$ -230 -106 215 -364 -192 71 164 -222 169 -63 -55 246 -195 -413 209 165 -303 200 -12 19 -105 77 -202
6932b02L20n9j38J78K35n80J44L46o24K81K21l03p6M43l17m6L06k38j56L42J34
$$ -202 118 59 -79 99 334 -246 -102 244 -380 -99 122 -181 -257 186 -131 -177 129 -109 -265 77 211
6953B11l42L54k11l66N32K0m24L66O2m84M11j89k99N79n7m58K11N52n56K73J00
$$ 211 -131 223 12 -354 178 198 -226 140 202 -282 129 -60 -359 220 163 -295 -84 468 -88 185 285
6974B85p72M92K83m49K07L45m10k41O94k96m27P81m37k43N19k48k56R8J43k30
$$ 285 -487 5 288 -161 46 391 -19 -260 434 138 -289 492 55 -188 331 83 -173 -75 68 -162
6994a62L7L79o29K60J88l11L44K34o86L46K80l11k45N75n48M7M47k39n8K86m24
$$ -162 -125 254 -375 -115 73 -238 106 340 -346 0 280 -31 -276 299 -249 -202 245 6 -52 234 -190
7015a90n4M78m17j00M70l00r7L40J59n84M31k0m16L36L24n57P9K18k55K21K95
$$ -190 -244 234 -183 -283 187 -113 -210 130 289 -295 136 116 -300 36 360 -197 -118 100 -155 66 361
7036C61o17Q6L66m19L10Q5j23k49N03n18k04P71k46j77K59l0n94O20N7l58N38
$$ 361 -256 -170 196 -223 87 172 49 -200 303 -215 -419 352 106 -71 188 158 -436 184 241 -117 421
7057D21j21m29Q4M28m88K84J37n58K84K92n34L02R1k79K3L98m08k36M03k64J28
$$ 421 300 -129 -45 383 -105 179 316 -242 42 334 -200 102 193 -86 -63 335 -73 -309 94 -170 -42
7078d2J40q3m8K60Q0o61O00j55l02K26Mk89M98r6k25QK47m38L88J92m98J38K31
$$ -42 98 15 -33 227 307 -354 246 91 -211 15 19 -270 228 132 -93 -85 162 -276 112 304 -194 -56 175
7101A75l45K17J74k89J3L13n04r9Q54l72j24M21k48o17M47R4l74O40m45k35M54
$$ 175 -170 47 221 -68 -55 258 -246 -345 509 137 13 434 186 -431 16 110 -264 376 -69 -304 150
7122A50K76o15J48J76l16J64L28p48M08K62m71J79M30m87N4L08m19K5M62l46j08
$$ 150 426 -189 -41 135 -181 -17 311 -437 -29 233 -238 -59 371 -116 -62 246 -173 -148 314 -32 -140
7143a40K07p5k22M60k59j53M22j55m29L31J85m28L95J53n49L45J01l03J41J25
$$ -140 67 -8 -230 230 -29 -182 240 85 -344 -13 172 -256 139 292 -257 88 189 -114 27 152
7163A52j95K6K87k82k7L33m27J07K36k64l61N50j95J3L18k65j36L46j98j83M24
$$ 152 -43 -17 270 -12 -39 294 -133 -26 210 -54 -415 135 -60 -47 271 6 -130 216 18 -165 259
7184B59k51m55M71P1k67K10J92m25L62K87p19K42O7k43p2N81l33j48M86l44k20
$$ 259 8 -447 24 95 -172 38 230 -195 167 454 -265 -23 44 -199 -271 310 -23 -171 315 -29 -249
7205b49M47k69j18M17l47J6K57j48l49N24j87j57M19j4p02O22j59m23P60n9o06
$$ -249 198 -71 -189 228 -119 -103 154 6 -343 181 -6 -163 256 242 -460 162 3 -420 340 281 -325
7226c25L12J6j94K5L64k50l6M20k16l27N22m82j44O65l72k14M06j41m53L16K63
$$ -325 -13 3 -191 -166 198 -52 -88 332 116 -211 311 -171 -315 350 -22 -236 170 29 -424 -108 155
7247A55k97K40J69m68M59k2p06O64J23m44L3N81o25K15J74o51L49O46o52m5O24
$$ 155 -142 98 267 -201 258 236 -470 194 317 -127 -94 487 -138 77 251 -400 -51 595 -57 -102 522
7268E22n35k36O23m62m15O28J2l85N80n4n77M24Q4n93L97K94o18N49k09k21J07
$$ 522 -13 -249 374 -88 -503 125 137 -248 332 278 -299 125 209 -384 13 307 -311 238 29 -192 -85
7289h5K04m25P2O83q36J44O14n26K0M50k74l55Q29p43R3L64j05l90N20j38l70
$$ -85 119 -306 -234 449 -387 -243 371 -155 -135 315 41 -314 515 -228 -135 229 124 -266 254 116 -254
7310b54N47k43k24M08n5j84J21J88p26L57M38p09J87M69n79J14N44p50qN83j03
$$ -254 293 50 -174 234 179 -5 116 304 -422 -65 373 -336 -149 320 -259 -145 399 -351 -359 224 121
7331A21j47L81j95m76O69m37j74Q39m34k14L2p1j69M93O5n21L13J29m60L09J31
$$ 121 -26 355 160 -316 353 -84 -258 581 147 -67 -35 -106 -275 218 283 -238 75 204 -256 53 184
7352A84l90p1L00k88J97J23n2k16N66n75K7M80m90O8M14k84r7K68o9m99O22o4
$$ 184 -206 -277 23 -265 -68 55 3 -213 353 -222 -195 285 -205 -137 277 -7 -104 164 95 -404 218 154
7374A54n40K89K89o03O65j69m37L82L40n14K76J71m59L0K64k18j99O12m73k21
$$ 154 -386 -97 192 -411 254 85 -352 30 370 -144 132 303 -156 -126 138 -80 -279 333 -140 -361
7394c61O88n22l8M16k64J25L36m49j75N15j50k85K70J04n13M55mm47M18J91o49
$$ -361 327 -195 -233 183 -81 44 380 -69 -244 271 121 -164 106 210 -303 152 148 -299 119 310 -339
7415c39J77M74m13o0M85o38K82K52k48k28L17j75j50N41k95j82M83l72k73P34
$$ -339 -162 312 -101 -161 324 -314 -32 220 -28 -256 61 -114 -264 277 -18 -200 283 -89 -362 372
7435C72m59k3K56J44l75J99J26n34J39L29m61K01N08p01J48K88j84m9M62m33q0
$$ 372 -87 -110 146 290 -85 114 240 -294 -155 174 -287 -86 422 -279 -131 157 -27 -76 386 -47 -127
7456a27K63k78M8M48n42K58j76K81l61L58k4k74M81j28o12L52J58m88L06N6j86
$$ -127 136 -142 -94 354 -188 70 -106 175 -186 172 148 -126 355 227 -385 -33 125 -363 -57 -1 -187
7477a87K56J96n29K96J71l56l3P21n78o9M15l31j35L43j15k43O60k75l75L29j58
$$ -187 69 265 -264 32 203 -153 -186 535 -43 -112 303 -28 -163 180 65 -178 482 207 -168 161 3
7498Cn59Q54q3n73M45J53l72N7M21m16o0J98m19M22J58l89j29L94l29p0M38k13
$$ 3 -556 298 215 -358 87 240 -132 -75 346 -70 -130 68 -351 71 229 -160 -289 105 -224 -294 144 -69
7520f9p3M72j68l44L73n2k62K61l8k73L26l57j16M76%m59M17K09n86J16L81n72
$$ -69 -142 330 162 -182 191 139 -123 138 100 -173 153 -204 -320 156 156 -303 114 323 -263 -147 234 -338
7542c38L05M47o44N2L29m08m2P00l85l46O15l72j40N69k82l52O84l14l40M22q0
$$ -338 -33 414 -230 -178 151 -257 -299 401 16 -330 285 -87 -227 342 60 -292 392 78 -262 160 80
7563H0n78O22o1l48K72L32n33L14J37o04L56K93k49k65L93l68N5L04k23k31O54
$$ 80 -498 124 63 -285 -13 319 -214 100 237 -367 -11 282 33 -232 161 -207 -152 152 -71 -302 352
7584C52k34l90N98m13k13M23k79k34P41j04o35N78J2l61K23J33m65L72L25o84
$$ 352 118 -272 326 -87 -300 123 -156 -390 351 247 -388 190 202 -159 64 197 -268 104 429 -255
7604b55K93J52n69K79K41l19N8N71o24q4N57n06p4M56j81k84M61j72j37K65k69
$$ -255 38 190 -379 -100 141 -178 -120 451 -173 -257 300 -206 -280 176 -5 -289 172 0 -137 128 -141
7625a41nL61j1m41K20K12l62N12k76j11J05K81o21K31L38n82O4M37k58l25M97
$$ -141 -146 215 204 -237 -17 195 -167 345 69 -42 63 344 -277 -46 292 -290 -226 211 -47 -372 125
7646A25l74J47L34j58l23N02k62l19N57J3k83j00L93n23L13p3j95J00L18l63J12
$$ 125 -249 -102 232 74 -249 253 -9 -328 229 242 -41 -141 252 -271 42 -31 -226 -126 192 -171 -59
7667e9L62n03K87K36n15J44L56m47R0M15m72j38P22o59O2N15n90M9L22On50O35
$$ -59 303 -200 87 323 -192 -48 308 -139 -49 366 -106 -244 478 -181 -119 396 -194 -145 177 183 -367 268
7689B68k4m66J80J45m71L18J24m79L67L32l71J28K00m70O9M98l80j23O25n16j73
$$ 268 244 -222 -42 103 -368 -50 74 -405 -38 294 -77 51 251 -219 -150 348 -32 -155 470 -46 -219
7710b19L46m69R3M42k69l52Q69n14l99O73n5m35K52L42m27J97R7m37L11K37m69
$$ -219 127 -342 -249 193 -76 -428 441 -73 -472 201 146 -289 -37 305 -122 75 172 -265 46 283 -186
7731a86K67L69o91K2M78l09j03M73l90nL48n88K6L23p5j48L57j98k40L54k2l02
$$ -186 81 450 -241 -219 259 -50 -153 320 -70 -75 273 -315 -289 34 -41 -189 168 -30 -270 84 62 -240
7753b40M35n3m97L40K38m22K02L15p72P04J64m38j44N19o14L20K56k22k45J43
$$ -240 195 142 -355 -15 223 -199 3 318 -454 250 414 -24 -168 351 -263 57 313 91 -154 -11
7773a1Jk12O00k83l98N62l9l93K63q5l94O13ql62K61J98m40j8K88o51O11P6j93
$$ -11 -10 -222 378 95 -303 259 220 -173 90 5 -389 224 216 -146 115 313 -127 -145 143 -508 103 179 -14
7796a4o2J75j17k91L30m0k06K09J66l98L26N5l99N74J6m93K19j05j08M4N40m23
$$ -14 -76 99 -18 -309 21 -19 -225 -16 150 -248 78 133 -266 308 324 -169 50 -55 -163 -119 421 -2
7818bo7L61o29L39J78l61K98p0l63K77L92m07l35O60k81ML22n46KM29k95l37M84
$$ -2 -69 292 -337 2 180 -181 117 47 -316 -39 353 -54 -389 271 -10 -6 316 -230 -228 201 -94 -431 53
7841E3k3l30L61j04m11Q58m64k23L69J65n62L36Q2l07J75J90m52J81M40p34K49
$$ 53 30 -300 61 -43 -454 404 -60 -283 86 251 -311 25 107 -200 -25 165 -287 -106 334 -400 -151
7862a51L11l61j35P88q04J29L81Ll04M42k36l69M00J46n52M65O9l00J53N0m40
$$ -151 160 -201 -336 452 -352 -223 158 161 -143 299 63 -306 94 240 -312 153 222 -78 75 125 -315
7883c15N73j24m58K81K34n17L48J03k85J33J27M1k73K10k83P9M35n65j22M27q8
$$ -315 258 134 -324 -43 191 -326 22 125 -160 -27 100 141 -132 78 -205 -126 309 -256 -378 49 -39
7904c9j82M50n6k98L82k49m30P93m87l17M66n7l3J18P6m73L64K1j55n0M87m58
$$ -39 -221 229 173 -125 257 8 -422 371 -116 -433 33 -24 -57 61 137 -336 28 49 -106 -156 331 -127
7926a27O3N43n76J00L17o53K16L90j83l57M02l9k72M59j96l83K92K51m83M46O8
$$ -127 -64 479 -97 3 320 -333 -117 273 90 -267 135 96 -176 283 87 -296 -4 247 -236 210 278
7947B78l61l6K04k13L9M45m66J73L16o43n7P84n09j2O24p49J10K39o0n34P77m38
$$ 278 -83 -119 85 -128 -89 356 -110 63 379 -264 -321 463 -46 -58 566 -183 -73 166 106 -428 349 -89
7969h9j0L80l49j22L66k65r2M73n7m94L65J3k50n1K64o2j27K17j17OJ35m91L76
$$ -89 -99 281 -68 -190 176 -89 -181 292 235 -259 106 119 -131 -182 82 20 -107 110 -7 -1 134 -357 19
7992A9K81n43j32Q51m72j55O65n08l29L96k20j99O96l45n06O50r8l49K81L86n26
$$ 19 300 -243 -375 476 4 -151 514 6 -323 73 -147 -346 350 5 -501 149 51 -298 -17 369 -157
8013a57K47K4l28k6M39m28o0M57l82K22L10k96j55L56j92l30L24p5k92M72k23
$$ -157 90 114 -214 -240 199 -229 -289 168 -214 8 318 22 -133 223 31 -299 25 -50 -342 130 -93
8034i3j96N00l13k78M77m5l51K42J02k39J71L59o41PP50o76K52L51m21J96K13
$$ -93 -289 211 -102 -380 97 52 -299 -57 45 -194 -23 336 -305 -298 452 -224 28 379 -42 154 367
8055C67k62l09L20k85K7L30L2l47K50k30k55O60k17n06N89K0o45O61K3n59M81
$$ 367 105 -204 116 -169 -142 188 220 -127 123 -107 -362 298 81 -425 164 184 -461 200 223 -336 145
8076A45j54k45L97m6l76J93L59k50j06K24k72LL66m22J26N32m73l44O76l86r7
$$ 145 -9 -254 143 97 -279 -86 273 23 -83 141 -131 -128 238 -184 -58 474 1 -343 333 -53 -150
8097a50K63J50q23N12L13m37M00K5n61L40K24n21K94J19l63K01J12k45K21M0J91
$$ -150 113 263 -560 -48 265 -172 228 253 -308 32 256 -265 29 148 -215 -14 98 -147 74 114 305
8118C05p43O26j82l48O09rl68J80j98K3Q2K03m24N61l46l8O6L61m89K75j17l26
$$ 305 -438 188 6 -342 267 258 -110 70 -128 -105 -23 180 -244 317 -29 -67 -1 360 -129 146 29 -297
8140b97L62L73o65K64K09m57m9L97j87p2M05l47k09M43j51l04L33R0m96M13q1
$$ -297 65 438 -227 37 246 -211 -260 137 -50 -122 283 -64 -273 170 19 -285 48 138 -358 55 -26
8161b6k44M22k2l71L57j5j91L73j75k09K2J05j94J47p8j32J38N31o87O6J96k44
$$ -26 -270 152 130 -241 116 101 -90 283 108 -101 -79 26 -168 -21 -99 -231 -93 438 -249 -183 13 -231
8183b31p3K38R6r9R5p3k41M38
$$ -231 -304 -66 30 -69 26 -47 -288 150
8191A50
$$ Imaginary data points
##PAGE= N=2
##DATA TABLE= (X++(I..I)), XYDATA
0@%%%%%%%%%%%qJ6j6J6j6K4l2L2m0M8n6P2q7R8j13J34j54J77k02K29k61K96l36
$$ 0 0 0 0 0 0 0 0 0 0 0 0 -8 8 -8 8 -8 16 -16 16 -24 24 -32 40 -47 51 -62 72 -82 95 -107 122 -139 157 -179
34a79L81m29M80n38O02o72P50q31R19j017J125j244J373j513J667j835K021k227
$$ -179 202 -227 253 -285 317 -355 395 -436 483 -534 591 -653 720 -793 874 -961 1060 -1167
52a167K455k712K996l315L682m102M589n165N857o705P773r167J1067j3817J8162
$$ -1167 1288 -1424 1572 -1743 1939 -2163 2426 -2739 3118 -3587 4186 -4981 6086 -7731 10431
67A0431k6048M4674j64769j06495L68062j14716p4070K04503r0865j48667J84623
$$ 10431 -15617 29057 -135712 -242207 125855 11139 -62931 141572 50707 -97960 86663
78H6663l4419j03668J58214j2469j25813J36029m0640j73338J34736N2633j63665
$$ 86663 52244 -51424 106790 94321 -31492 104537 63897 -109441 25295 77928 -85737
89h5737J07297R2893j78456k0894Q7521n0647M4572M1833p7943N9698K7256j38773
$$ -85737 21560 114453 -64003 -84897 2624 -48023 -3451 38382 -39561 20137 47393 -91380
101i1380O3378R0740j23600P4413J38379j94148o3656J55772q9194l6459J71829
$$ -91380 -28002 62738 -60862 13551 151930 -42218 -105874 49898 -39296 -75755 96074
112I6074p7296r7354J10508r1595p2132K04464m2903j43770J88499K972k06716
$$ 96074 18778 -78576 31932 -59663 -131795 72669 29766 -114004 74495 77467 -129249
123a29249J43534Q3460j89765J15601J53795j85725q060J18549j33791R82J33654
$$ -129249 14285 97745 -92020 23581 177376 -8349 -16409 102140 -31651 -30669 102985
134A02985r8679p93J07699j62546o0441J61483q0317o0719J71900o7418j40173
$$ 102985 4306 3513 111212 -51334 -111775 49708 -30609 -91328 80572 13154 -127019
145a27019J21483q670j02145J30390L7137r4309P1402j4605j00312J14176K5563
$$ -127019 -5536 -14206 -116351 14039 51176 -43133 28269 13664 -86648 27528 53091
156E3091j14166J21889N5858j78017M3378R1359j36473L8488J31447j15266k3403
$$ 53091 -61075 60814 116672 -61345 -17967 73392 -63081 -24593 106854 -8412 -31815
167c1815R4189j05288k3476J10237p1897O925J32790j20154p9948J47668o2933
$$ -31815 62374 -42914 -66390 43847 -28050 -21125 111665 -8489 -88437 59231 -3702
178c702q6257J78682n574j46329R2899L153j28644J02528N2384j08577P2902K1641
$$ -3702 -89959 88723 83149 -63180 29719 32872 -95772 6756 59140 -49437 23465 45106
190D5106j40795P5314O0227j46854Q4546J33552j61095j4538J34862j19068l3015
$$ 45106 -95689 -20375 39852 -107002 -22456 111096 -49999 -64537 70325 -48743 -81758
201h1758J62063n6211n3917J12914p2804p3788J18175m1776n8143J44236m1755
$$ -81758 80305 24094 -29823 83091 10287 -63501 54674 12898 -45245 98991 57236
212E7236j29971J15543l614j44775J11697P9170j23069L5211M2288j14468L7231
$$ 57236 -72735 42808 39194 -105581 6116 85286 -37783 -2572 39716 -74752 -37521
223c7521O9244p8501N0397O1617j16611K2115Q0471j16837J6591J38743q8895
$$ -37521 31723 -46778 3619 65236 -51375 -29260 51211 -65626 -49035 89708 813
234H13m2962J10009p8534o7717J11423k4944l8095J04417o1129q6718J10499k9293
$$ 813 -42149 67860 -10674 -78391 33032 8088 -30007 74410 13281 -73437 37062 7769
246G769r0713J37483J1827j33534R7293L5833j56512O6556J01368j07656L3993
$$ 7769 -82944 54539 66366 -67168 30125 65958 -90554 -23998 77370 -30286 3707
257C707Q0366j25781k488R1833r2736J4878J21601j03889m5972J17684q0145o6472
$$ 3707 84073 -41708 -44196 47637 -45099 -30221 91380 -12509 -58481 59203 -20942 -87414
269h7414J35747k6737q0164J10101j5746j09894P2856J5841o2898R1047J0890
$$ -87414 48333 21596 -58568 51533 35787 -74107 -1251 14590 -48308 42739 53629
280E3629j02240N9606J6793j01103P6874O3769j04370L7844O4158j12287Q208
$$ 53629 -48611 10995 27788 -73315 3559 67328 -37042 802 64960 -47327 -39119
291c9119Q3008p6633J5335R4287q3924k6833P5293q0318j2486J26317o0788o0803
$$ -39119 43889 -32744 -17409 76878 -7046 -33879 41414 -38904 -51390 74927 14139 -46664
303d6664J07620n3575r1810J11771k27q8461R8799J4254j13172O0508K6089r7944
$$ -46664 60956 7381 -84429 27342 27115 -61346 37453 51707 -61465 -957 25132 -72812
315g2812P6113O3772j02806L8204N6000j19298K4077J05882q5740l545J00715
$$ -72812 3301 67073 -35733 2471 58471 -60827 -36750 69132 -16608 -20153 80562
326H0562q5294m5179R1353n3851l4873J04809l8879o1905P9490m2769p2185R9839
$$ 80562 -4732 -49911 41442 -12409 -47282 57527 18648 -43257 36233 -6536 -78721 21118
338B1118Q59p3312Q5858J540j05454O2763L4935q0217O5046N1081r0707K9454
$$ 21118 21977 -51335 34523 36063 -69391 -6628 28307 -51910 13136 64217 -26490 2964
350B964M0520r3979L4938P9687p9845J1397P3357r5699k1171R0019o2769k0761
$$ 2964 43484 -50495 -15557 64130 -15715 -4318 69039 -26660 -47831 42188 -20581 -41342
362d1342J03819n3607n8905Q1568m2036n8810J04121o149p0738Q2432r859r8710
$$ -41342 62477 8870 -50035 31533 -10503 -69313 34808 28659 -42079 40353 30494 -68216
374f8216P5020L1951q4847O6095M3922j03959K8531N0492r3747K9434Q3986p9585
$$ -68216 6804 38755 -46092 20003 63925 -40034 -11503 38989 -54758 -25324 58662 -20923
386b0923k443P1721q5296k1370R4071m7488k2595R4132m9262n9547P9476k5969
$$ -20923 -23366 48355 -36941 -58311 35760 -11728 -34323 59809 10547 -49000 30476 4507
398D507m9477R4377o205p0635O7560q119q6642O6945K8045p3787N5618K8204r6616
$$ 4507 -44970 49407 43202 -27433 40127 32008 -54634 12311 40356 -33431 22187 50391 -46225
411d6225K6120M0293p6029L9073O5676q0533O511N9069q2329K43R2098n5680j6273
$$ -46225 -20105 20188 -55841 -16768 48908 -31625 -25114 33955 -48374 -48131 43967 -11713 -27986
424b7986Q8016n8486n0900Q2805k9013m4339R1570j6035p0170O5215j6143p7935
$$ -27986 60030 1544 -49356 33449 4436 -39903 51667 35632 -34538 30677 14534 -63401
436f3401Q0797K5582q1327N5561K7471r9329L4608N7074p3891K9115O8875p4125
$$ -63401 17396 42978 -38349 17212 44683 -54646 -20038 37036 -36855 -7740 61135 -12990
448a2990n387N5274o7536J027Q2781n1784j8641P2056o4331m9134Q4624k3443
$$ -12990 -18377 36897 -30639 -29612 53169 1385 -17256 54800 -9531 -58665 25959 2516
460B516m6642Q0343j6545p2321N6721m493o0989O9476J9677o3110N2778J0487
$$ 2516 -44126 36217 19672 -52649 4072 -421 -61410 8066 27743 -35367 17411 27898
472B7898q5727N1381M9572p2582M0718O0308q7354k583O3586o1942O26P6112n2682
$$ 27898 -57829 -6448 43124 -29458 11260 71568 -15786 -18369 45217 -16725 -16099 60013 7331
485G331k1216N8967o1206l2058P9833l3394l4548Q2500l5341p5908P1166J623
$$ 7331 -13885 45082 -16124 -48182 31651 -1743 -36291 46209 10868 -65040 6126 7749
497G749o4402P0717K4760p1937L6286J5613o8501M5017L9205o1849L8954M0316
$$ 7749 -56653 14064 38824 -33113 3173 18786 -49715 -4698 34507 -27342 11612 51928
509E1928q8483J0530O1360o6923Q505Q4040n8736l5502O1450m1924k8146P4340
$$ 51928 -36555 -26025 35335 -31588 -23083 60957 2221 -33281 28169 -13755 -41901 32439
521C2439k0653l0043O3294l7184n4241P2086r757n5040P9677R851q5840M1483
$$ 32439 11786 -18257 45037 7853 -46388 25698 15941 -39099 40578 50429 -35411 6072
533F072K1589p4233M1856M8869o2095J6194K9514p0831J6114M9594n9505K0395
$$ 6072 27661 -46572 -4716 44153 -17942 -1748 27766 -43065 -26951 22643 -36862 -16467
545a6467O6657p1857k0027O9320n1615k5073Q8816k0875m3643N6334k6106m9275
$$ -16467 50190 -21667 -41694 27626 -23989 -49062 39754 18879 -24764 31570 5464 -43811
557d3811O2357n55l5971O2942j3746p0528N4052Q832o9948O0886M2078q0110J7798
$$ -43811 18546 17991 -17980 44962 31216 -39312 14740 23572 -46376 14510 56588 -23522 -5724
570e724M0686p0189R435N7661m5456P451M7203o0911r425N2422n1853k534Q5007
$$ -5724 34962 -35227 -25792 31869 -13587 -6136 41067 -19844 -29269 23153 -28700 -31234 53773
583E3773m5818m7237O7170k9713n5390P3738R689n2445M5551q46n8363M0058Q134
$$ 53773 7955 -39282 27888 -1825 -57215 16523 26212 -26233 19318 18472 -39891 167 8301
596H301m6737O0099K2036p4161L1342K8573p6732L2092P2274n9627q765N0328
$$ 8301 -38436 21663 43699 -30462 880 29453 -47279 -15187 57087 -2540 -11305 39023
608C9023n2497j2321N5973l5674q094N6400m2223k2009N6193m9970l9092Q6611
$$ 39023 -13474 -25795 30178 -5496 -13590 42810 587 -21422 34771 -15199 -54291 32320
620C2320o098n7185N4416j0283p3422N0287L2911m5488L3394J1944n8678L0717
$$ 32320 26222 -30963 23453 13170 -60252 -9965 22946 -22542 10852 22796 -35882 -5165
632e165K1473n8199L9508M6800o4355J5612N0148p4775j0834P7644k8666j9918
$$ -5165 16308 -41891 -2383 44417 -19938 -4326 45822 -28953 -39787 37857 9191 -10727
644a0727N1644l8095l3037M9693k1322k0339N7843k6876l8035O2244k2659o6760
$$ -10727 40917 2822 -30215 19478 -1844 -22183 35660 8784 -29251 32993 10334 -56426
656e6426O2399J9942n6695M8035K1986p7157J4198L7605l6999L0889L1493o0531
$$ -56426 5973 25915 -30780 17255 39241 -37916 -23718 13887 -23112 7777 39270 -21261
668b1261J1113L4983o0303J5631O4231n4423j1727O5144m9178l9989O3539j3960
$$ -21261 -10148 24835 -35468 -19837 44394 -10029 -21756 43388 -5790 -45779 17760 3800
680C800l0622N6103j2533m2213L8847j5555l4602O0772N8m9864N2022N106p3862
$$ 3800 -26822 29281 16748 -25465 13382 -2173 -36775 23997 24055 -25809 26213 31319 -42543
693d2543L6479L7292n3699K8244M1210o0357m408L2326m0575J4400M5855m4700
$$ -42543 -6064 31228 -22471 5773 46983 -13374 -17782 14544 -26031 -11631 34224 -10476
705a0476k57M0382n9425j2220P2179l1785k9316O5907k4094n2883N1435N79m0578
$$ -10476 -10733 29649 -29776 -41996 30183 -1602 -30918 34989 10895 -41988 9447 10026 -30552
718c0552M9130P007m3672L6302k213n3193M4548K0474n5364M1282L4020p7196
$$ -30552 18578 25585 -18087 18215 16002 -37191 7357 27831 -27533 13749 47769 -29427
730b9427L278N0297m5228M773N6236l9885j9913L5105l5136n729N3562k8697j3377
$$ -29427 -26149 24148 -21080 -16307 39929 44 -19869 15236 -19900 -25629 27933 -764 -14141
743a4141N2187l9507l9505O1691r901m3244N7715N706n7201K7987Q409m2072L6300
$$ -14141 38046 -1461 -40966 20725 10824 -32420 25295 31001 -26200 1787 10196 -31876 4424
756D424J6710m1392L1448J1264o0361K7863L4691n5071K4034N5019n8344j5385
$$ 4424 21134 -20258 11190 22454 -37907 -10044 24647 -30424 -6390 48629 -9715 -25100
768b5100M9463l7835j2249N8526k0239k2520L6559l4701k5128N5799j6540l1703
$$ -25100 24363 -13472 -25721 32805 12566 -9954 26605 -8096 -33224 22575 6035 -25668
780b5668N6978j3389n8613M5530J0154n4448M0625L1896m9552J3986J9621m6295
$$ -25668 31310 17921 -40692 4838 14992 -39456 1169 33065 -16487 -2501 17120 -29175
792b9175J9151L2790l7511J9865L2714n6466Q87M6314m4204n399O0957l0985k9641
$$ -29175 -10024 22766 -14745 5120 37834 -18632 -17745 28569 -15635 -21034 39923 8938 -20703
805b0703M2263k5963l0223M8070m722k2973L9594k2128m2245M7162J7m0549N0274
$$ -20703 21560 -4403 -34626 13444 8722 -14251 25343 3215 -39030 8132 8149 -32400 17874
818A7874J1180n8579K9510K3896n4844K0866M0017l9118J0463K8598m9268J520
$$ 17874 29054 -29525 -15 23881 -30963 -10097 29920 -9198 1265 29863 -19405 -17885
830a7885L8377l6174P763M9424m6467k2124N0627l0151k6356N8435j1067l6597
$$ -17885 20492 -15682 -7919 41505 -4962 -27086 23541 -6610 -32966 25469 14402 -22195
842b2195M2660q089m4719L5462P379k9756M1295K839n2727K7694J5318m7079L2576
$$ -22195 20465 12376 -32343 3119 10498 -19258 22037 24876 -27851 -157 15161 -31918 658
855F58L4890n2129O660L4657m5707r48M2234l0142j362M0651l4735j6375L6464
$$ 658 35548 -16581 -9921 24736 -20971 -21919 20315 -9827 -11189 29462 -5273 -21648 14816
868A4816k8972q468N6561k2873l4512M3875j4741l9404M6703O961l7711L4847
$$ 14816 -14156 -22624 33937 11064 -23448 20427 5686 -33718 12985 19946 -17765 17082
880A7082M843m6087K5487J1387l8002L3788K2994m9409J6290K3903n2850J3893
$$ 17082 21925 -24162 1325 12712 -25290 8498 31492 -17917 -1627 22276 -30574 -16681
892a6681M8905m0460n463M1725l8477j7183M2692k3217j2242M7699k2637k9117
$$ -16681 32224 -8236 -13699 28026 -10451 -27634 15058 -8159 -20401 27298 4661 -24456
904b4456L9770j8554l0884N1940O51m0816L7832M153n0353K8140K2715l6603K3934
$$ -24456 15314 -3240 -34124 17816 18467 -22349 15483 19636 -30717 -2577 20138 -16465 7469
917G469K2313m3687J0236K1153m0041J5990L8614l8520j528L4254m0830j0039
$$ 7469 29782 -13905 -3669 17484 -22557 -6567 32047 -6473 -8001 26253 -14577 -24616
929b4616M5640k3919j4581M3625k1648k8210L4699j5594k1690M6035o236l4339
$$ -24616 21024 -2895 -17476 26149 4501 -23709 10990 -4604 -26294 19741 13505 -20834
941b0834L5632o450m3903L8835J5949m1171K9118J7739m9846J5875K6603m0335
$$ -20834 14798 8348 -35555 3280 19229 -21942 7176 24915 -24931 -9056 17547 -22788
953b2788J5877L7234l9002P80L1973m1381l340M9414k6716j3877M3728k7705k9895
$$ -22788 -6911 30323 -8679 -7899 24074 -17307 -20647 28767 2051 -11826 31902 4197 -25698
966b5698M2631j0908k6675M3495n157l8398L0375j820l9025L3316J4632l7011
$$ -25698 16933 6025 -20650 22845 17688 -20710 9665 7845 -31180 2136 16768 -20243
978b0243K5032J2619m7087J6313K7787l4947J5151L2006l8081o94L0174l3726
$$ -20243 4789 17408 -29679 -13366 14421 -20526 -5375 26631 -11450 -12144 18030 -15696
990a5696j39M2515k5087j0659L5623k9274k0673M1135j4479k0756M2703j2327
$$ -15696 -15835 26680 1593 -9066 26557 -2717 -23390 17745 3266 -17490 25213 12886
1002A2886l6649L2646l518l3535L9156R586l9363K6947R257m5348K3367K5821
$$ 12886 -23763 8883 5365 -28170 10986 20572 -18791 8156 17413 -27935 -4568 21253
1014B1253l7075J8256K7952m5064J922L2320l6136K064M2564l0821j3720L6331
$$ 21253 -15822 2434 30386 -14678 -12756 19564 -16572 -14508 28056 -2765 -16485 19846
1026A9846l0347k0169M5046j2900k2933M0254j1819l5895L4158R65l0044L7261
$$ 19846 -10501 -30670 14376 1476 -21457 18797 6978 -28917 5241 6206 -23838 13423
1038A3423R209l8025K3414R854l9885K3433K5288l5493J3368K3611m1670R82L0177
$$ 13423 22632 -15393 8021 17875 -22010 1423 26711 -8782 4586 28197 -13473 -12491 17686
1051A7686k9566K783L4515l0975j1047L0830k7975j1396M2390j6309j8719L8045
$$ 17686 -11880 -9097 25418 -5557 -16604 14226 -13749 -25145 17245 936 -17783 20262
1063B0262j8100l1777L8071m03k8288L7304K993l9326K4575O688l7091K8867K0410
$$ 20262 2162 -29615 8456 8053 -20235 17069 20062 -19264 5311 11999 -25092 3775 24185
1076B4185l9729J7196K0852m5617Q539L4730l3901L732L9455l4363j4612L5247
$$ 24185 -15544 1652 22504 -23113 -14574 20156 -13745 -10013 29442 -4921 -19533 15714
1088A5714k2559j0648M1968j6923k0709L4313j7639k8538L8507j702k9534L3868
$$ 15714 -6845 -17493 24475 7552 -13157 21156 3517 -25021 13486 11784 -17750 16118
1100A6118J216m1013K2806J0320l3981K4199J9935l4049J1373J4434l6197J4846
$$ 16118 17334 -23679 -873 9447 -24534 -335 19600 -14449 -3076 11358 -24839 -9993
1112i993K9611l1846Q110L1484l7051p383L6362k4478q613M1216j9284k2533L1239
$$ -9993 19618 -12228 -4118 27366 -9685 -17068 19294 -5184 -13797 27419 8135 -14398 16841
1125A6841j6809k2873L7071n941k4278L4052q398l9328L1246J0192l5794K8856
$$ 16841 32 -22841 14230 8289 -15989 18063 9665 -29663 1583 11775 -24019 4837
1137D837J8747m1170J2634K0590l5684J1928L0843k9439M149K5733l5226l025
$$ 4837 23584 -17586 -4952 15638 -20046 -8118 22725 -6714 -2565 23168 -12058 -15083
1149a5083L3686k7053m592M2053k5950k5617L4173j3456k2113L8794l198k8113
$$ -15083 18603 -8450 -13042 29011 3061 -22556 11617 -1839 -23952 14842 11644 -16469
1161a6469K7282l918l0318K8445N131k8495L0403R905m0977J8068J7639l8258
$$ -16469 10813 6895 -23423 5022 10153 -18342 12061 21966 -19011 -943 16696 -21562
1173b1562J5608L3144l1679j956K2450l0925p50L2770k2500m406L0727k6270j3361
$$ -21562 -5954 27190 -4489 -6445 16005 -14920 -15670 17100 -5400 -9806 20921 -5349 -18710
1186a8710L4283k1261j7888M4195o367l1467K8193l730l2086L0336J1190k7125
$$ -18710 15573 -5688 -23576 20619 14252 -17215 10978 7248 -24838 5498 16688 -10437
1198a0437K1752K912l6044K1543J5476l4607J9441K4186l8172O735K8331l8020
$$ -10437 11315 14227 -21817 -274 15202 -19405 36 24222 -13950 -7215 21116 -16904
1210a6904m237L9918j8643q109K7384k5330j5081L2655j3984j1612L5896j5678
$$ -16904 -21141 18777 134 -7975 19409 -5921 -21002 11653 -2331 -13943 21953 6275
1222F275k6956L2281p010l0569L5251Q160l3146K2598R222l6027J4467J7240k2939
$$ 6275 -20681 11600 4590 -25979 9272 17432 -15714 6884 16106 -19921 -5454 11786 -11153
1235a1153J8328J5079l6561R229K2476l2482O989L3350k9559n729L2165k8000
$$ -11153 7175 22254 -14307 -5078 17398 -15084 -8095 25255 -4304 -10033 22132 -5868
1247e868j7079L5162j0900j4763L0077j2852k3268K5708r842k0246L8709J72l3914
$$ -5868 -22947 12215 1315 -13448 16629 3777 -19491 6217 -3625 -23871 14838 15010 -18904
1260a8904K5209N296l6901K3772K1457l1313J3690J9486l3398K925K1772k3683
$$ -18904 6305 11601 -25300 -1528 19929 -11384 2306 21792 -11606 -8681 13091 -10592
1272a0592Q304K4751k9488j279K8415l1045r776L9157j5274j6680L3014j4470
$$ -10592 -2288 22463 -7025 -8304 20111 -10934 -20710 18447 3173 -13507 19507 5037
1284E037k6876K8342j626j9762K8909l09k7524K0699k208k8977K9667J3047l4809
$$ 5037 -21839 6503 4877 -14885 14024 13715 -13809 6890 4682 -24295 5372 18419 -16390
1297a6390J7830J6759l9077N832K7453k3720M811K5443k6626n353K3822k1016
$$ -16390 1440 18199 -20878 -15046 12407 -11313 -6502 18941 -7685 -13038 10784 -10232
1309a0232j015L1742k0236r360L2168k1047k2638L5588m125k4558K9956P88l1180
$$ -10232 -11247 20495 259 -9101 23067 2020 -20618 14970 10845 -13713 16243 17031 -14149
1322a4149J7075K495k4063K3975J0017k8845J5447P698l4289J6256K4991l0390
$$ -14149 2926 5421 -18642 5333 15350 -13495 1952 9650 -24639 -8383 16608 -13782
1334a3782P737K8510l1359q377K9056j6932n125K9407j6699j2091K3569j8372
$$ -13782 -6045 22465 -8894 -17271 11785 -5147 -10272 19135 2436 -9655 13914 -4458
1346d458j4010L3121r595k0037L0308o983l1391K5042O576k6947K2696J3680k7439
$$ -4458 -18468 14653 5058 -14979 15329 8346 -23045 1997 8573 -18374 4322 18002 -9437
1359i437J0482P806k5529J6945J9077k5228J0276J7429l4267J871K9092k4151
$$ -9437 1045 8851 -16678 267 19344 -5884 4392 21821 -12446 -10575 18517 -5634
$$ [...]
8191C28
##END NTUPLES=NMR FID
##END=
