##TITLE=1H_Pr 95-H
 CDCl3, 8 sc, 
 13.2.2019
##JCAMPDX= 6.0         $$ Bruker NMR JCAMP-DX V2.0
##DATA TYPE= NMR FID
##DATA CLASS= NTUPLES
##ORIGIN= UXNMR, Bruker Analytische Messtechnik GmbH
##OWNER= root
$$ XWIN-NMR		Version 3.5
$$ Wed Feb 13 15:41:04 2019 Russian Standard Time (UT+4h)  she@DPX200
##.OBSERVE FREQUENCY= 200.1313
##.OBSERVE NUCLEUS= ^1H
##.DELAY= (6, 6)
##.ACQUISITION MODE= SIMULTANEOUS
##.ACQUISITION SCHEME= undefined
##.AVERAGES= 8
##.DIGITISER RES= 18
##SPECTROMETER/DATA SYSTEM= spect
##.PULSE SEQUENCE= zg30
##.SOLVENT NAME= D2O
##.SHIFT REFERENCE= (INTERNAL, D2O, 0, 15.7039)
##AUDIT TRAIL= $$ (NUMBER, WHEN, WHO, WHERE, WHAT)
$$ ##TITLE= Audit trail, XWIN-NMR		Version 3.5
$$ ##JCAMPDX= 5.01
$$ ##ORIGIN= Bruker BioSpin GmbH
$$ ##OWNER= she
$$ F:/spectra/data/she/nmr/H-F/1/audita.txt
$$ ##AUDIT TRAIL=  $$ (NUMBER, WHEN, WHO, WHERE, WHAT)
(   1,<2019-02-13 15:39:43.12 +0400>,<she>,<DPX200>,
      <created by zg, POWCHK disabled, PULCHK disabled
       configuration hash MD5:
       00 E9 B6 7A A2 85 ED C7 34 08 36 98 17 FE 4E 26
       data hash MD5: 16K
       F2 FB 8F 15 16 01 E0 D0 5E C0 B9 F7 2D 18 D1 05>)
$$ ##END=
$$ 
$$ hash MD5
$$ 85 27 01 6E DB 3D BF 66 BA 8C 7D 0F BC 54 2E 48
##$RELAX= 
##$RELAX= 
##$RELAX= 
##$RELAX= 
##$RELAX= 
##$RELAX= 
$$ Bruker specific parameters
$$ --------------------------
##$DU= <F:/spectra>
##$EXPNO= 1
##$NAME= <H-F>
##$PROCNO= 1
##$TYPE= <nmr>
##$USER= <she>
##$AMP= (0..31)
100 100 100 100 100 100 100 100 100 100 100 100 100 100 100 100 100 100 
100 100 100 100 100 100 100 100 100 100 100 100 100 100 
##$AQSEQ= 0
##$AQ_mod= 1
##$AUNM= <au_zg>
##$AUTOPOS= <>
##$BF1= 200.13
##$BF2= 200.13
##$BF3= 200.13
##$BF4= 200.13
##$BF5= 200.13
##$BF6= 200.13
##$BF7= 200.13
##$BF8= 200.13
##$BYTORDA= 1
##$CFDGTYP= 0
##$CFRGTYP= 5
##$CHEMSTR= <none>
##$CNST= (0..31)
1 1 145 1 1 1 1 1 1 1 1 1 1 1 1 1 1 1 1 1 1 1 1 1 1 1 1 1 1 1 1 1 
##$CPDPRG= <>
##$CPDPRG1= <>
##$CPDPRG2= <>
##$CPDPRG3= <>
##$CPDPRG4= <mlev>
##$CPDPRG5= <mlev>
##$CPDPRG6= <mlev>
##$CPDPRG7= <mlev>
##$CPDPRG8= <mlev>
##$CPDPRGB= <>
##$CPDPRGT= <>
##$D= (0..31)
0 1.2 0 0 0 0 0 0 0 0 0 0.03 0 0 0 0 0 0 0 0 0 0 0 0 0 0 0 0 0 0 0 0 
##$DATE= 1550057982
##$DBL= (0..7)
120 120 120 120 120 120 120 120 
##$DBP= (0..7)
150 150 150 150 150 150 150 150 
##$DBP07= 0
##$DBPNAM0= <>
##$DBPNAM1= <>
##$DBPNAM2= <>
##$DBPNAM3= <>
##$DBPNAM4= <>
##$DBPNAM5= <>
##$DBPNAM6= <>
##$DBPNAM7= <>
##$DBPOAL= (0..7)
0.5 0.5 0.5 0.5 0.5 0.5 0.5 0.5 
##$DBPOFFS= (0..7)
0 0 0 0 0 0 0 0 
##$DE= 6
##$DECBNUC= <off>
##$DECIM= 32
##$DECNUC= <off>
##$DECSTAT= 4
##$DIGMOD= 1
##$DIGTYP= 9
##$DL= (0..7)
0 120 120 120 120 120 120 120 
##$DP= (0..7)
150 150 150 150 150 150 150 150 
##$DP07= 0
##$DPNAME0= <>
##$DPNAME1= <>
##$DPNAME2= <>
##$DPNAME3= <>
##$DPNAME4= <>
##$DPNAME5= <>
##$DPNAME6= <>
##$DPNAME7= <>
##$DPOAL= (0..7)
0.5 0.5 0.5 0.5 0.5 0.5 0.5 0.5 
##$DPOFFS= (0..7)
0 0 0 0 0 0 0 0 
##$DQDMODE= 0
##$DR= 18
##$DS= 0
##$DSLIST= <SSSSSSSSSSSSSSS>
##$DSPFIRM= 0
$$ [...]
##$SUBNAM2= <"">
##$SUBNAM3= <"">
##$SUBNAM4= <"">
##$SUBNAM5= <"">
##$SUBNAM6= <"">
##$SUBNAM7= <"">
##$SUBNAM8= <"">
##$SUBNAM9= <"">
##$SW= 20.0189088683792
##$SWIBOX= (0..15)
0 0 2 0 0 0 0 0 0 0 0 0 0 0 0 0 
##$SW_h= 4006.41025641026
##$TD= 16384
##$TD0= 1
##$TE= 0
##$TE2= 300
##$TE3= 300
##$TEG= 300
##$TL= (0..7)
0 120 120 120 120 120 120 120 
##$TP= (0..7)
150 150 150 150 150 150 150 150 
##$TP07= 0
##$TPNAME0= <>
##$TPNAME1= <>
##$TPNAME2= <>
##$TPNAME3= <>
##$TPNAME4= <>
##$TPNAME5= <>
##$TPNAME6= <>
##$TPNAME7= <>
##$TPOAL= (0..7)
0.5 0.5 0.5 0.5 0.5 0.5 0.5 0.5 
##$TPOFFS= (0..7)
0 0 0 0 0 0 0 0 
##$TUNHIN= 0
##$TUNHOUT= 0
##$TUNXOUT= 0
##$USERA1= <user>
##$USERA2= <user>
##$USERA3= <user>
##$USERA4= <user>
##$USERA5= <user>
##$V9= 5
##$VALIST= <valist>
##$VCLIST= <CCCCCCCCCCCCCCC>
##$VD= 0
##$VDLIST= <DDDDDDDDDDDDDDD>
##$VPLIST= <PPPPPPPPPPPPPPP>
##$VTLIST= <TTTTTTTTTTTTTTT>
##$WBST= 1024
##$WBSW= 4
##$XGAIN= (0..3)
0 0 0 0 
##$XL= 0
##$YL= 0
##$YMAX_a= 189150
##$YMIN_a= -222279
##$ZGOPTNS= <>
##$ZL1= 120
##$ZL2= 120
##$ZL3= 120
##$ZL4= 120
##$ABSF1= 10
##$ABSF2= 0
##$ABSG= 5
##$ABSL= 3
##$ALPHA= 0
##$AQORDER= 0
##$ASSFAC= 0
##$ASSFACI= 0
##$ASSFACX= 0
##$ASSWID= 0
##$AUNMP= <proc_1d>
##$AZFE= 0.1
##$AZFW= 0.1
##$BCFW= 1
##$BC_mod= 2
##$BYTORDP= 1
##$COROFFS= 0
##$CY= 11.3945322036743
##$DATMOD= 1
##$DC= 2
##$DFILT= <>
##$DTYPP= 0
##$F1P= 18.9103706918063
##$F2P= -1.10871071338519
##$FCOR= 0.5
##$FTSIZE= 0
##$FT_mod= 4
##$GAMMA= 1
##$GB= 0.15
##$INTBC= 1
##$INTSCL= 1
##$ISEN= 128
##$LB= 0.24
##$LEV0= 0
##$LPBIN= 0
##$MAXI= 10000
##$MC2= 0
##$MEAN= 0
##$ME_mod= 0
##$MI= 1.114404
##$NCOEF= 0
##$NC_proc= 0
##$NLEV= 6
##$NOISF1= 3.799351
##$NOISF2= 2.8
##$NSP= 1
##$NTH_PI= 0
##$NZP= 0
##$OFFSET= 15.70392
##$PC= 1
##$PHC0= -9050.48
##$PHC1= 14.20014
##$PH_mod= 1
##$PKNL= yes
##$PPARMOD= 0
##$PSCAL= 0
##$PSIGN= 0
##$REVERSE= no
##$SF= 200.130013532006
##$SI= 16384
##$SIGF1= 3
##$SIGF2= 2
##$SINO= 400
##$SIOLD= 16384
##$SREGLST= <1H.CDCl3>
##$SSB= 0
##$STSI= 0
##$STSR= 0
##$SW_p= 3612.71676300578
##$SYMM= 0
##$S_DEV= 0
##$TDeff= 0
##$TDoff= 0
##$TI= <>
##$TILT= no
##$TM1= 0
##$TM2= 0
##$TOPLEV= 0
##$USERP1= <user>
##$USERP2= <user>
##$USERP3= <user>
##$USERP4= <user>
##$USERP5= <user>
##$WDW= 1
##$XDIM= 8192
##$YMAX_p= 0
##$YMIN_p= 0
$$ End of Bruker specific parameters
$$ ---------------------------------
##NTUPLES= NMR FID
##VAR_NAME=  TIME,          FID/REAL,        FID/IMAG
##SYMBOL=    X,             R,               I
##VAR_TYPE=  INDEPENDENT,   DEPENDENT,       DEPENDENT
##VAR_FORM=  AFFN,          ASDF,            ASDF
##VAR_DIM=   8192,          8192,            8192
##UNITS=     SECONDS,       ARBITRARY UNITS, ARBITRARY UNITS
##FACTOR=    0.0002496,     1,               1
##FIRST=     0,             0,               0
##LAST=      2.0444736,     0,               0
##MIN=       0,             -222279,         0
##MAX=       2.0444736,     189150,          0
$$ Real data points
##PAGE= N=1
##DATA TABLE= (X++(R..R)), XYDATA
$$ [...]
2576D779p903J367P379p940j349Q873n192l515P040l787l520P908l487n405Q211
2591C459j983o891P729M00p335O149J727q306N426M084p928K815M593p121K870
2606c12M576p597J894O773p601j040Q373o127k721Q005m867l403P919l203n129
2621d460P544j424n706O679p18o461P124R29q643N856L596p941L091M651p524
2636c407K613M998p141J010O407o708k33O438n812j118P550n595l490Q528l097
2651I43n151P158j537m937O274j240o062P086L63p635N829K350p719M447L865
2666D034p947K866N868p635N48O477n983M4N634n935n59P618n732l316Q068l213
2682H37m790O937j739n398O934o06o634N717J124o070M863J107o575N189L019
$$ plain form
2576 4779 -3124 -1757 5622 -2318 -3667 5206 14 -3501 3539 -248 -3768 4140 653 -4752 3459
2591 3459 1476 -5415 2314 2714 -4621 1528 3255 -5051 375 4459 -3469 -654 3939 -3182 -312
2606 -312 4264 -3333 -1439 5334 -2267 -3307 5066 -1061 -3782 4223 -644 -4047 3872 669 -4460
2621 -4460 3084 1660 -4046 2633 1915 -4546 2578 3507 -5136 720 4316 -3625 -534 4117 -3407
2636 -3407 -794 4204 -2937 -1927 4480 -2228 -2461 3977 -1835 -2953 4597 -998 -4488 4040 943
2651 943 -4208 2950 1413 -3524 2750 1510 -4552 2534 2897 -4738 1091 3441 -4278 169 4034
2666 4034 -3913 -1047 4821 -2814 -2266 4211 -1772 -1728 3906 -2029 -2588 5030 -702 -4018 4050 837
2682 837 -3953 2984 1245 -4153 2781 2175 -4459 1258 2382 -3688 1175 2282 -4293 896 3915
2697C915q097L159N892p068O19N522o052M85O024o237q91O765m819k298O981m402
2713e02l304P625k786o006P661m20o586N483Q43n708N171J146o808N181K980p572
2729c602L463M087o814J689N375o595K86O175n582j213N876m453j192N953m407
2744i54k509P319l259n098O895o45n642N685K81n775N272R38o006M092K519o574
2760c461L461L424o920K590M990o729K66O385n260r98N575m471j143O070m260
2775d81k965O961k847m144O481j569n073N938n09n432N289J099o025L824K029
2790B576n976L766K613o709K839M938o349N35N607n353k70N711n132j304O171
2805C663m193k605O282k881l841O251j871m522N997l29n866M762J079n017M006
$$ plain form
2697 3915 -4182 -1023 4869 -2199 -1580 3942 -2110 -1625 4399 -1838 -2729 4036 -783 -3081 3900 -502
2713 -502 -3806 3819 1033 -4973 2688 2268 -4318 1165 2008 -3700 1471 2617 -4191 990 3970 -3602
2729 -3602 -139 3948 -2866 -1177 4198 -2397 -2111 4064 -1518 -2731 3145 -1308 -2500 3453 -954
2744 -954 -3463 3856 597 -4501 2394 1749 -3893 1792 2073 -3702 1570 2508 -3498 594 3113 -3461
2760 -3461 0 3424 -3496 -906 4084 -2645 -2379 4006 -1254 -2252 3323 -1148 -2291 3779 -481
2775 -481 -3446 3515 668 -3476 3005 1436 -3637 2301 1792 -3640 1649 2748 -3277 547 2576
2790 2576 -3400 366 2979 -3730 -891 4047 -2302 -1767 3840 -1513 -1783 3928 -1204 -2508 3663
2805 3663 -530 -3135 3147 266 -3575 2676 805 -3717 2280 1951 -3915 847 1926 -3091 915
2820I15J479n694L676L185o748K234M581n891Q67M989n117j14M966m914j033O073
2836C454l999k222N747l240k960O080k186m894N887L57n122M441N07n060M313
2851A103J262n890L918L071o225K449L831n878R33M515n336K80N510m350j535
2866b342N047l738j322N462l657k895O406j891m476N270m05m282M269K59m512
2881b807M362O56n374L713J921n605K820L289n961J959M783n734n2M915l867n47
2897a529M543m033j036N349l663k790O162k243l872N288p42m337M593M5n273L999
2913D61J754m883L177J705n122K957K925n989K058M267n008N98M068l897n29M387
2929B929m033j147N345l300k286N138k422l092N063j468m237N416K8m891L949
$$ plain form
2820 915 2394 -3300 376 3561 -3187 -953 3628 -2263 -1396 3593 -1524 -1638 3328 -1586 -2619 3454
2836 3454 -545 -2767 2980 -260 -3220 2860 674 -4220 1667 2024 -3098 1343 1850 -3210 1103
2851 1103 2365 -3525 393 3464 -2761 -312 3519 -2359 -1426 3089 -2247 -1967 3543 -807 -2342
2866 -2342 2705 -1033 -2355 3107 -550 -3445 2961 1070 -3406 1864 1459 -2823 1446 1705 -2807
2881 -2807 1555 2211 -3163 550 2471 -3134 -314 2975 -2986 -1027 3756 -1978 -2030 2885 -982 -1529
2897 -1529 3014 -1019 -2055 3294 -369 -3159 3003 760 -3112 2176 1434 -2903 1690 1735 -3538 461
2913 461 2215 -2668 509 2214 -2908 49 2974 -3015 -957 3310 -1698 -1100 2968 -929 -1458 2929
2929 2929 -1104 -2251 3094 -206 -2492 2646 224 -2868 2195 727 -3510 1906 1934 -2957 992
2944I92O23m696L979J379n398L410L037n922J786L892m777M61L876m202Q6M729
2960C255m331j291M865l029j886M763k211k875N181j514m195M746j11m037L907
2975A237M26m110L886P60n507L554K737n471J972L388n031J341L527m592K53M288
2991B658l682q98M630l466j256M898l060k838N625j395m035M282j64l848L961
3006A412l10m012L964Q81m922L293K158n203K390K895m907J499L995m548OL951
3022B542l379l89L547l091j013M745l100k729N099j558l419M522n95l940M264
3037A506j28m411L910R49m390L087J215m279K532K757n090J568L818m457K29L746
3053B562l865J26L696l477j141M606l082j742M654k241k597M387j082l779M538
$$ plain form
2944 992 1615 -3081 898 2277 -3121 289 3326 -2596 -810 3082 -1695 -1234 2642 -1560 -1474 3255
2960 3255 -1076 -2367 2498 -531 -2417 2346 135 -2740 2441 927 -3268 1478 1367 -2670 1237
2975 1237 1663 -2447 1439 2199 -3308 246 2983 -2488 -516 2872 -2159 -818 2709 -1883 -1630 2658
2991 2658 -1024 -1922 2708 -758 -2014 2884 -176 -3014 2611 1216 -2819 1463 1299 -2549 1412
3006 1412 1102 -2910 1054 1935 -2987 306 2464 -2739 -349 2546 -2361 -862 3133 -1415 -1409 2542
3022 2542 -837 -1226 2321 -770 -1783 2962 -138 -2867 2232 674 -2745 1777 1182 -2758 1506
3037 1506 1378 -3033 877 1826 -2564 523 1738 -2541 -9 2748 -2342 -774 3044 -1413 -1184 2562
3053 2562 -1303 -1177 2519 -958 -2099 2507 -575 -2317 2337 96 -2501 1886 804 -2975 1563
3068A563k5m272L341Q73l550K910J110m354K741K175m455J548L055m257L54L669
3084B426l623l10M163l436j286M419k775j441L938k298k427M882j364l573M557
3099A852n01l986L730O91m243K978J568m613K603K216m393J837K367l987J026
3114h55L687m528J84M188l210j318M074k357j627L924k119k175M353j454l230
3129b463L993l03l544L637R6m209L303J646m289J909J912l704J894K194l934J455
3145d07L202m159J00L910l477n06L790k983j545M653k182k933M063j119k276L560
3161A691j061l217M103K3m282L175J323m066K505J717l957K016K410m042Q16L155
3177B309l441K51L245l764J82L787l192j533M245j995k221L797j487k438L984
$$ plain form
3068 1563 1538 -2734 607 1480 -2070 840 1950 -2404 337 2512 -1943 -395 2660 -1597 -1243 2426
3084 2426 -1197 -1507 2656 -780 -2066 2353 -422 -1863 2075 -223 -2650 2232 868 -2705 1852
3099 1852 1351 -2635 1095 1786 -2457 521 2089 -2524 79 2295 -2098 -261 2106 -1881 -855
3114 -855 2832 -1696 -1512 2676 -534 -1852 2222 -135 -1762 2162 43 -2132 2221 767 -2463
3129 -2463 1530 1227 -2317 1320 1416 -2793 510 2156 -2133 -224 1688 -2016 -122 2072 -1862 -407
3145 -407 2795 -1364 -1264 2646 -831 -1337 2453 -530 -2075 2578 396 -2537 1526 407 -1869 1691
3161 1691 630 -2587 1516 1539 -2743 432 1755 -2311 194 1911 -2046 -30 2380 -1662 -846 2309
3177 2309 -1132 -881 2364 -1400 -1218 2569 -623 -2156 2089 94 -2127 1670 183 -2255 1729
3192A729j015l114L758j03l389L137O22l980L038J521m579J995K828l893Q34K656
3208B045l458M65K958l392n0L879l117j255L909k433j530M111j535l087L996l99
3224A107l441L794j76l135K868L37l596K907J481m605K368K274l768J217K483
3239B115l736M63L532l667j44L497k732p52L822l001j367M268k271k389M302r62
3255I78l258L342m5l096L091N0l324K877J179l939K396J867m186J744K653m189
3271a860R26L439l158p33L492k858k87L103k701j090M034k311k358M015j303k725
3287b375L727n33l277L495K19l458K728R70l472K559J099l828K369K011l872P86
3303h52L338l578oK894k657m77L519k887j308L805j965j915L988j812k348L874
$$ plain form
3192 1729 714 -2400 1358 1255 -2134 1003 1625 -2355 683 2204 -2375 -380 2448 -1445 -611 2045
3208 2045 -1413 -948 2010 -1382 -1432 2447 -670 -1925 1984 -449 -1979 2132 597 -2490 1506 1107
3224 1107 -2334 1460 1284 -1851 1017 1354 -2242 665 2146 -2459 -91 2183 -1585 -368 2115
3239 2115 -1621 -1158 2374 -1293 -1437 2060 -672 -1424 2398 -603 -1970 2298 27 -2362 1940 978
3255 978 -2280 1062 1017 -2079 1012 1062 -2262 615 1794 -2145 251 2118 -2068 -324 2329 -1860
3271 -1860 -934 2505 -653 -1386 2106 -752 -1039 2064 -637 -1727 2307 -4 -2362 1653 350 -2375
3287 -2375 1352 819 -2458 1037 1256 -2202 526 1496 -1976 583 1682 -2146 223 2234 -1638 -852
3303 -852 2486 -1092 -1098 1796 -861 -1338 2181 -706 -2014 1791 -174 -2089 1899 87 -2261 1613
3319A613r17l199L567N29l289K121Q97l086K451R86l964K186K426l850J099K609
3335B179l708M84L167l181l73L565k781r04L297k098j218L553j708k438L962m53
3351A345l484L325j79l136L029K42l380K551J491l789J644K227l876J518K540
3366B068l625P25L063l191m30L351k327q87L445k587j363L876j896k453L911j201
3382D79k729L529m92l004K928O14l427K759P40l596K387J761l975J800K231l595
3398a590N52L354l089l33K991k609n33L294k561j402L808j448k254L006m73k921
3414b208L124N6k979L086L19l450K643O87l036K109J473l730J927K332l797O93
3430g51K611k764k11L061k868k68L019k485j175L682j947j763L328r46k434L248
$$ plain form
3319 1613 696 -2503 1064 1593 -1696 425 1322 -1764 687 1673 -2291 -105 2321 -1529 -430 2179
3335 2179 -1529 -1045 2122 -1059 -1432 2133 -648 -1552 1745 -353 -1571 1982 274 -2164 1798 1345
3351 1345 -2139 1186 1007 -2129 900 1142 -2238 313 1804 -1985 -341 1886 -1990 -472 2068
3366 2068 -1557 -832 2231 -960 -1390 1961 -366 -1253 2192 -395 -1758 2118 222 -2231 1680 479
3382 479 -2250 1279 787 -2217 711 1325 -2102 657 1397 -2199 188 1949 -2026 -226 2005 -1590
3398 -1590 -1038 2316 -773 -1106 1885 -724 -1257 2037 -524 -1926 1882 434 -1820 1186 713 -2208
3414 -2208 916 972 -2007 1079 1398 -2052 591 1278 -1758 351 1824 -1906 21 2353 -1444 -751
3430 -751 1860 -904 -1115 1946 -922 -1190 1829 -656 -1831 1851 -96 -1859 1469 523 -1911 1337
3446A337n15k789K895K06k680K404K97k760K092J027l583J652K478l467O27K867
3462B088l081J0K837k719l54L056j969j039K969k031j445L658j743k478L646n53
3478H52k791K768m6k465K378L15l105K376J320l533J816J857l398J152K523l085
3494a066J17K909k694m15K770k114o37L040k311j195L454j486k323L072p43k362
3510a984K902k96k469K671K67k978K350J163l187J692J571l394J510K241l303
3525a244O5K857k509j80K728k266n45K936k155j469L544j689j530K679q16k325
3541a919L187n18k621K736L87k692J936O80k743J818J267l136J382K059l213N70
3557h20K386k504J50K267k374k42K588j799j234L379j560j898L112j070k250L059
$$ plain form
3446 1337 822 -1967 928 1134 -1546 858 1155 -1605 487 1514 -2069 -417 2061 -1406 -779 2088
3462 2088 -993 -983 1854 -865 -1219 1837 -132 -1171 1798 -233 -1678 1980 237 -2241 1405 852
3478 852 -1939 829 783 -1682 696 1011 -2094 282 1602 -1931 -115 1742 -1656 -504 2019 -1066
3494 -1066 -949 1960 -734 -1149 1621 -493 -1130 1910 -401 -1596 1858 372 -1951 1121 378 -1984
3510 -1984 918 622 -1847 824 1091 -1887 463 1626 -1561 131 1702 -1692 -182 2059 -1244
3525 -1244 -1179 1678 -831 -1011 1717 -549 -1094 1842 -313 -1782 1762 73 -1457 1222 406 -1919
3541 -1919 1268 750 -1871 865 1252 -1440 496 1176 -1567 251 1518 -1618 -236 1823 -1390 -820
3557 -820 1566 -938 -788 1479 -895 -1137 1451 -348 -1582 1797 237 -1661 1451 381 -1869 1190
3573A190j95k629K433K42k635K209O15l019K126J368l409J531J950k913M77K015
3589A356k687L74K431k032p79L006j911r04K866j635j279K776j239k025K670j85
3605H03k691K388M45k702K218O46k522J527J329k956J229J879k798Q42K208l009
3621a164J63K887k436n11K353j655n83K285j618j195K998j156j912K556o16k095
3637a699K482k50k178K183O38k893K003J013k464J287J374k640P23K167k785J74
3653h65K479k626J43K502k292l96K530j468j735L022j024j778K665p78j848K635
3669A166j59k819K438O33k600J893M36k194J310J266k874J352J900k909L75K252
3685A466k541K59K563k107q22K605j479j085K209q46j427K348o17j875K496k29
$$ plain form
3573 1190 995 -1634 799 1041 -1594 615 1230 -1789 337 1705 -1704 -173 1777 -1136 -659 1356
3589 1356 -1331 -957 1474 -558 -1337 1669 -242 -1146 1720 85 -1194 1582 343 -1682 988 803
3605 803 -1888 500 945 -1757 461 1107 -1415 112 1441 -1515 -286 1593 -1205 -363 1845 -1164
3621 -1164 -1001 1886 -550 -1061 1292 -363 -946 1339 -279 -1474 1524 368 -1544 1012 396 -1699
3637 -1699 783 533 -1645 538 1176 -1717 286 1299 -1165 122 1496 -1144 -421 1746 -1039 -865
3653 -865 1614 -1012 -869 1633 -659 -1055 1475 7 -1728 1294 270 -1508 1157 379 -1469 1166
3669 1166 1007 -1812 626 1259 -1341 552 988 -1206 104 1370 -1504 -152 1748 -1161 -786 1466
3685 1466 -1075 -816 1747 -360 -1182 1423 -56 -1141 1068 222 -1205 1143 526 -1349 1147 918
3701I18k501K169M84k485J836N40k321J272J709k818Q80J445k055M60J927k208
3717g48L11K064k098m71K445j768r68K608j119j809K571p52k040K723l26k014
3733a391K050j0k104J981L35k187J434J132k392Q92J671k403N96J730k333L82
3749f17K035j873m65K377j727p85K490j461j460K446q50j657K258k68j632J858
3765F69j40j945K003M90k374J324J184k255R02J500k578N95K343k540J34K047
3781A359k034pJ929j939n19K756j767j111K418q23j592K339l98j936K249k08j902
3798a186J688M02k030J338N75k082J345J354k646Q58J808k097n8J908j773k47
3814h43K030j689k75K092j659r64K500j249r63K149o59j923K333j65k199J900
$$ plain form
3701 918 -1583 586 1070 -1415 421 961 -1360 -88 1621 -1197 -317 1128 -927 -467 1460 -748
3717 -748 -437 1627 -471 -942 1503 -265 -1233 1375 256 -1553 1018 266 -1774 949 623 -1391
3733 -1391 659 649 -1455 526 861 -1326 108 1240 -1152 -260 1411 -992 -396 1334 -999 -617
3749 -617 1418 -455 -920 1457 -270 -1055 1435 -26 -1486 960 110 -1547 711 443 -1189 669
3765 669 529 -1416 587 1077 -1297 27 1211 -1044 -142 1358 -1220 -625 1718 -822 -688 1359
3781 1359 -675 -682 1247 -692 -1211 1545 -222 -1333 1085 262 -1330 1009 611 -1325 924 716 -1186
3798 -1186 502 904 -1126 212 787 -1295 50 1404 -1242 -384 1424 -673 -731 1177 -596 -843
3814 -843 1187 -502 -777 1315 -344 -1308 1192 -57 -1020 1129 470 -1453 880 715 -1484 416
3830D16L57j990J601J98j977J552J039k217P20J509k250N90J889j999O1J565j397
3847c33p15K133j279n43J852j080j075K086r20j397J932j42j609J648o6j736J623
3864C79N46k024J301P78j923J011R96k125N36J922k109p5K091j671m80J821j236
3881b62o26J861j188p06J787l70j471J483R2j657J385N68j974J362M78j664J035
3898A33Q00j817Q97Q92j795M70J592j783o2J527j149n13J766j282m18J864j133
3915a1r74J968q98r80J778o19j199J654j43j788J571N46j591R27P06j959J069
3932E7P85j759O79J246j711K29J501j605p0J740j576k64J900j262q50J892j017
3949h5q88J934o97j551J901pj448J095K56j625J559J05j810J374J077k073N38
$$ plain form
3830 416 773 -1217 384 582 -1395 157 1196 -1021 -301 1208 -1042 -452 1437 -562 -501 1064 -333
3847 -333 -1048 1085 -194 -737 1115 35 -1040 1046 126 -1271 661 519 -1090 558 492 -1244 379
3864 379 925 -1099 202 980 -943 68 1064 -1061 -525 1397 -712 -787 1304 -367 -847 974 -262
3881 -262 -888 973 -215 -921 866 496 -975 508 600 -1057 328 896 -1078 284 762 -902 133
3898 133 933 -884 13 905 -890 -420 1172 -611 -673 854 -295 -808 958 -324 -742 1122 -11
3915 -11 -985 983 85 -895 883 264 -935 719 576 -1212 359 905 -686 241 947 -1012 57
3932 57 842 -917 -238 1008 -703 -474 1027 -578 -648 1092 -484 -748 1152 -110 -960 932 -85
3949 -85 -973 961 264 -1287 614 607 -841 254 510 -1115 444 549 -1261 113 1190 -883 -345
3966c45J207j376J1J690j543j27J783j730m43J757j098m81J677p82j169J813m84
3983C60j448J493m1j316J400oj382J261K48j279P42J004j851Q01R72j676K93J432
4001A007j522k72J513p92n52J489j096m94J591r46q64J800n18j303J523r1j377
4018i04J210K30j255R53N70j445M76J317j902P89P51j553L28J212j226k01J523
4035H73j235r7J388j212l11J703j080r31J757o57j132J490k35j371J601R4j448
4052h03J010L87j202Q51L48j368Q53P42j511K49J342j138m33J332j021R1R93r81
4070b59n96J486q44n55J568p95p72J563o75j006J340j82j153R41N35j444J133
4087B85K98j405Q79R07j633N24Q38j092J16J212j407Q4J391j213j18J158j133
$$ plain form
3966 -345 862 -514 -503 1187 -356 -483 1300 -430 -873 884 -214 -695 982 200 -969 844 360
3983 360 -1088 405 364 -952 448 442 -940 321 569 -710 32 1036 -815 -14 958 -718 -425 1007
4001 1007 -515 -787 726 -66 -618 871 -225 -719 872 -74 -938 862 344 -959 564 473 -904
4018 -904 306 536 -719 234 804 -641 -165 1152 -750 39 790 -763 -435 777 -449 -650 873
4035 873 -362 -459 929 -283 -594 1109 29 -902 855 198 -934 556 321 -1050 551 645 -803
4052 -803 207 594 -608 243 591 -777 76 818 -693 -444 898 -240 -673 659 -362 -271 722 -259
4070 -259 -855 631 -213 -768 800 5 -767 796 121 -885 455 273 -880 61 596 -848 285
4087 285 583 -822 57 964 -669 -145 693 -399 -283 929 -478 -394 997 -216 -334 824 -309
4104c09m29J458p64p68J375k95j324J395K70j538J277K09j141P13N85j420N70
4121a36Q75j424P37Q10j226J05Q87j116N2J030p94p08J705j140j30J488j081m87
4139e53R21J9j240J411j66j153J238k98r88R26O49j373O57M68j120M76R50j335
4157e11O4J303j449K0J206r67j70J297q93n18J344o87q77J278j19j104J295j70
4175C42j197J194K53j433R65N95j487Q33N57j321P03O56j217K02J146j094J90
4192a13Q13q36k45J046q19m67J263q02l41R31k73q07J292m07r53J277j38r84R03
4211C40q9q68Q69K31j020N10O09j135O21P65j208n6J283j147j55J412r31o44J046
4230D33m48n82J113m86p24J337k88j056J027J24j140J078P1j210Q44O06j338O16
$$ plain form
4104 -309 -738 720 -44 -812 563 268 -1056 339 609 -929 348 557 -584 129 714 -706 -136
4121 -136 739 -685 52 862 -364 -259 628 -488 -436 594 -200 -908 797 -343 -473 1015 -66 -553
4139 -553 368 387 -853 558 392 -761 477 179 -809 117 766 -607 50 518 -602 -126 824 -511
4157 -511 -447 856 -593 -573 633 -334 -504 793 -100 -618 726 39 -838 440 321 -783 512 342
4175 342 -855 339 592 -841 124 719 -768 65 622 -699 4 660 -557 -355 791 -303 -113
4192 -113 700 -136 -381 665 -154 -621 642 -160 -501 430 157 -650 642 235 -718 559 421 -563 340
4211 340 251 -617 252 483 -537 -27 582 -553 68 833 -375 -431 852 -295 -450 962 31 -613 433
4230 433 -15 -597 516 30 -694 643 355 -701 326 450 -690 388 459 -751 93 699 -639 -23
4248b3P03j300N24Q95j325K40J162j088j84J077q04n30J360n50q30J340m69q64
4266f66J285k83r91R00j14p25R55M70j506P74M27j256N41P98j174M05P79q60j09
4285c50J081j083k21J125r84P0J082p31p63J189l88o18J008j64j109J075j7p48
4303e46P44R6j011J005L53j238N26P59j267M85Q08j094K07R75j070r0P04o85p7
4322d16J133q76m88J367p48m80J183o32r20J427q1j308J171K62j044P32J19q98
4340d97P23J63j136M31J060q96l3O50p93j3R73q04k92J044q31o4P10m42o29J131
4360D55m06q26J282j39r77P74K92q90P06R4r41O60L39j115P09N54j074L97J090
4379I84j386K10P69q97o8J110p74j91Q73p52o34J514o91r38J169J57r06P69J36
$$ plain form
4248 -23 680 -620 -96 799 -526 -286 876 -212 -396 681 -123 -653 707 157 -673 667 198 -666
4266 -666 619 336 -655 245 131 -594 361 831 -675 99 526 -730 -189 609 -565 -160 619 -241 -350
4285 -350 731 -352 -573 552 -432 -362 720 -11 -774 415 27 -591 417 253 -856 219 202 -546
4303 -546 198 294 -717 288 641 -597 -71 688 -579 -94 714 -380 -173 802 -268 -358 346 -339 -416
4322 -416 717 -159 -647 720 -28 -508 675 43 -877 550 469 -839 332 594 -450 282 401 -497
4340 -497 226 389 -747 -316 744 -152 -185 465 -328 -341 632 -172 -464 580 -251 -315 395 -47 -676 455
4360 455 49 -777 505 366 -611 163 455 -435 271 365 -576 84 423 -692 17 571 -503 -106 984
4379 984 -402 -192 577 -320 -388 722 -52 -243 630 -122 -756 758 67 -871 298 455 -451 318 454
4398D54j030O33M97j227Q57M51j106N82K92j057M61Q70j143K4R77o66k75J178
4416G72r26k66J031n29n83R42m44o84J142l06q22R89J36j245J065K48j103O44
4434F1L25q28O08L21j010K80J032j303Q0R56n56m24J110o14n69J022o25k52Q51
4453D65l63p69J053n00m37J134k86r17Q69pj026J005L04r82N90L68r35M84P34
4472G84j296M70O34r21N2Q85p15k98J014p87j82R45p53o56J472n73o76J031Lj059
4492f26P98K77j028Q88L39j139N09N87r02R0P05r11M3P99p48J4R23p64j22P35
4512D67n94j26P81n06p73J242m40o61R86k23r19R09J28o34M29M72r77M62M73r69
4532d73M75O17j020L3Q71q55K10Q52q97L4N11n71o9P82k62o94Q28k24q39Q29J94
$$ plain form
4398 454 -576 57 554 -673 184 635 -471 111 403 -654 -193 677 -466 -442 535 -131 -406 772
4416 772 -154 -420 611 82 -501 441 -3 -687 455 149 -673 316 452 -793 272 520 -583 61
4434 61 386 -442 166 487 -523 -243 789 -514 -434 522 -34 -458 652 38 -531 491 -134 -386 465
4453 465 102 -667 386 -114 -551 583 297 -620 249 242 -784 221 525 -457 133 501 -434 50 784
4472 784 -512 -42 592 -329 -277 608 -107 -405 609 -178 -360 585 -168 -824 648 75 -601 430 433 -626
4492 -626 172 449 -579 309 648 -491 18 605 -297 -207 498 -413 -370 429 -319 -305 618 -146 -268 467
4512 467 -127 -253 528 22 -751 491 51 -610 376 153 -766 143 271 -363 66 538 -439 23 496 -473
4532 -473 2 619 -401 -368 503 -352 -142 710 -187 -153 358 -213 -282 500 238 -456 372 148 -691 138 332
4553C32q14O75K6q06P36R8n49N68J12p54M69L93q82L06P13p42O8M18l65k23O16
4574C95m17m29R12o23m83J195o11m98J005k33p56R46R0j041O19K12p37N06K15
4593B67n92J91P61r34m5P74q27J91R22p68q6O76n43l51O48k46o03J166m75o59
4613e33R88j83q60J118k14p20N02K18n62J94N88q74J21O84j001K35Q07o59o6P95
4633E78p08k43P78m88l79J075o58l92R31k88p07O47K4p20P84J07r12P93K14p38
4653c02L33M04j163M42N99p68M78N44r28J63P12o81k94Q13l59l49Q28l94m87Q88
4673D79o45k67Q70j98n27P39j29q53P11L13j023N43P30j159L56N30p60K65N23
4692D98q23K93O82n11l19P52r32N4P35o02k81Q24l33o87J022l06p33Q28L26j072
$$ plain form
4553 332 -482 193 219 -587 149 247 -302 266 378 -376 93 486 -396 -90 623 -119 -51 367 2 -221 395
4574 395 -22 -451 461 -162 -645 550 -61 -559 446 213 -543 403 493 -548 71 283 -454 52 267
4593 267 -325 -134 627 -307 -352 422 -405 -214 708 -60 -146 530 -13 -364 284 38 -565 601 126 -533
4613 -533 455 272 -588 530 316 -404 98 316 -246 -52 536 -338 -217 467 -534 -299 508 -151 -217 578
4633 578 -130 -373 405 -83 -462 613 -45 -437 494 206 -501 146 170 -550 234 341 -571 222 436 -302
4653 -302 31 435 -728 -286 313 -455 23 567 -361 -198 514 -167 -461 352 -7 -356 472 78 -409 479
4673 479 -166 -433 437 239 -288 451 322 -531 180 493 -530 13 743 -416 -60 470 -290 -25 498
4692 498 -325 -32 650 139 -180 572 -360 -306 429 -173 -454 370 37 -650 372 66 -667 161 487 -585
4712e85P70K04r35N58L46p54M26O84j070K82N85q19J28N76m76k77N31l34k72J095
4732F63q35o4N37k58n51Q08j51p57Q33k7p28P86J6q24M13L29n58L11N29q54J57
4753b25N47p34L37M29o51o8Q94n74l92P65l51p27R24l59k34P81j95n42O36m6q69
4774f54R31k2r35Q52O3r22O57M41q78L46O22p58R0N82o16j84R47o80m11R70m21
4795B0k51P84m92p16R88M7r62P21m7m31O25k35p27Q48J47o74K07M99n94M15J20
4816B92p75K50Q06o92k31Q34n18k48N75l24n52J076n88k53N80P4q00P72j33p22
4836e77Q84j68n50K80M68q44N95K19p27L15M35r39L89N31m91j95J012p89M2N90
4856D80o09k69Q25l66n22P43m10l55P37j68m89O89q5m98N86P7p69M10L29r53M35
$$ plain form
4712 -585 185 389 -546 12 358 -396 30 714 -356 -74 511 -308 -180 396 -80 -357 174 -160 -432 663
4732 663 -172 -236 301 43 -508 300 149 -608 225 198 -530 256 272 -552 -139 190 -368 -57 472 -382 -225
4753 -225 322 -412 -75 354 -297 -365 529 -45 -437 328 -23 -750 174 -185 -419 362 167 -375 261 215 -654
4774 -654 277 255 -680 172 235 -687 -30 411 -467 -121 501 -257 -167 415 -201 -385 562 -118 -529 441 20
4795 20 -231 553 61 -655 333 380 -582 139 92 -339 286 51 -676 172 319 -355 -148 351 -243 172 292
4816 292 -483 -233 573 -119 -350 484 -34 -282 293 -31 -583 493 -95 -348 232 306 -494 278 145 -577
4836 -577 307 139 -411 -131 337 -507 88 307 -420 -105 330 -609 -220 311 -180 -375 637 -152 -110 480
4856 480 -129 -398 427 61 -461 282 -128 -483 254 86 -403 286 201 -297 289 366 -403 7 336 -617 -182
4877a82O47o28k9N58l87k73O13n10p1N94l25l82P50k46k56N20n77m67R73M8p39
4898c69O76l4q80J009r0q41N42L35q84L56P33p75K86M82p53j7P52l93o79P74l24
4919i4k82O84k28n14M95Q3n97P54j47n54N29K77q60M33M05o61K87R7n79L79N20
4940D27q39L04M86o45J61L34l31j32Q30o40k50O13m50l03P20k11n87R04k14m48
4960b71M07J15p86O28K26p19O09J31p88M08N74r19mQ64q57M55L91n89o2P79p09
4981a17k23N72n00k80P11j46k83O04l23m43O34Q0p13P94k51o38N51L27r06Q29
5001B79J50q46N66K71p77J94O44o99l0Q58o96k59P30k68l99O08o7n14P25l75l74
5022b79M46j35l75N82P5o22M85J02p72L36M03n36L11L47l68k69P71o49n9N49l76
$$ plain form
4877 -182 465 -163 -192 366 -21 -294 319 -191 -262 332 7 -375 375 129 -127 393 -184 -651 322 370 -369
4898 -369 307 273 -607 402 312 -529 13 348 -536 -180 553 -222 64 546 -207 -224 528 135 -544 230 -94
4919 -94 -376 308 80 -434 61 144 -453 301 154 -400 129 406 -454 -21 384 -277 10 107 -472 -93 427
4940 427 -412 -108 378 -267 -106 228 -103 -235 595 -45 -295 318 -132 -435 285 74 -513 391 177 -271
4960 -271 136 251 -535 93 319 -400 209 340 -448 -40 534 -385 -389 475 -382 73 464 -125 -187 592 -117
4981 -117 -340 232 -268 -548 163 17 -266 338 15 -428 206 286 -427 367 116 -522 29 356 -550 279
5001 279 429 -417 149 420 -357 -163 481 -218 -248 610 -86 -345 385 117 -282 326 259 -255 470 95 -279
5022 -279 167 32 -343 239 314 -308 177 279 -493 -157 246 -290 21 368 0 -269 502 -147 -206 343 -33
5043c3k67N01k28l16P61l69j61K63q1o19R76j46o32O10q1n89M96M61j097N68M84
5064E01p49J52N65o05jL45o74K10N72m25k34P95j53n46Q42o72j84M14r1k98P91
5085E55m36p22O35R8n37M15K37m01k4L75n05K72K86o74K99N01o62J92N68n56l44
5106d28P12k21k53O08l77k84M95q0l96K26K41q43N33L05o22K79M85n33J19J13
5126G9n49M16K44l13nM39l47L1M49m71m61Q07n88K24O13n30k73M41P4o68O78j69
5148A21m50M95k41l40O46R3o78L57L23n17K49J71l29K36J47l76J75L13n13j90
5168c08O26l29k07N23j70n32O70l12j55K89K1n02M87L57m47J93J0n92L43N73p77
5189b39M7L50m02K11L03k79j81N68o14K60K65l57k00P39n69k19O47k88m08N93
$$ plain form
5043 -33 -300 201 -27 -343 418 49 -112 151 70 -549 427 281 -351 259 178 -411 85 546 -551 17 501
5064 501 -248 -96 469 -136 -137 208 -466 -256 316 -109 -343 452 299 -247 595 -77 -261 153 62 -236 555
5085 555 119 -603 32 130 -407 8 245 -156 -180 195 -310 -38 248 -426 -127 374 -288 -96 472 -84 -428
5106 -428 284 63 -190 418 41 -243 252 172 -224 2 243 -600 -67 238 -384 -105 380 -153 -34 79
5126 79 -470 -54 190 -123 -128 311 -36 -5 444 -27 -488 319 -269 -45 568 38 -235 206 280 -388 290 121
5148 121 -329 166 -75 -415 231 324 -354 3 326 -191 58 229 -100 136 283 -93 82 395 -118 -308
5168 -308 318 -11 -218 305 135 -397 273 -39 -194 95 116 -386 101 458 11 204 214 -378 -35 538 -239
5189 -239 -192 158 -244 -33 270 -9 -190 378 -236 24 289 -68 -268 471 -98 -317 330 42 -366 227
5209B27P6p22O49j27n05L76J46l12L59M5l90P3K93l37J36M01o71j6N17l28j07
5230b17O01m35k13O41n42o8N37o0o39O44k30l57M08J40m54O21j67n83M14L12n36
5251a83J28J67j48j38N13n10O1N66p17L6O91o83r8O27j82o24N40o1l82O57k11
5272D9m98N96kn26N57K36l44MK29m42L62O7n75K15L12m86P9M33n18N4M85n12j16
5295c41Q50o74k66O97k54l31N36Po80O84J19r64P31N7n77O26J69p84O31k6n06
5316b96L27L7l12L76K33n57Q8O30n17k08P36l32n31M99k93k73N79j99j25J82K82
5337C26o13L04R8j84K09Q9o70M95K77p23L49L06m77K63Q2l80J37M17m15q8N10
5358C12l36L8K78l44l51O65j28n78Q38n55l29M64Q5l03J84L18n42M05M31p95L26
$$ plain form
5209 227 303 -419 230 103 -402 -26 120 -192 167 212 -178 -105 188 -149 -13 388 -283 -299 218 -110 -217
5230 -217 384 -51 -264 377 -165 -233 304 244 -395 249 19 -338 70 210 -244 377 210 -373 41 353 -183
5251 -183 -55 112 -36 -174 339 -171 -110 456 -261 -225 466 -217 -315 312 130 -494 46 -15 -397 260 49
5272 49 -449 147 145 -381 176 412 68 72 301 -141 221 288 -287 -72 240 -246 -167 266 -252 -198 287 -225 -341
5295 -341 509 -165 -431 266 12 -319 217 224 -456 228 347 -617 114 171 -406 220 389 -395 236 210 -296
5316 -296 31 68 -244 132 365 -192 -104 526 9 -199 537 205 -326 173 -120 -393 186 -13 -138 44 326
5337 326 -287 17 115 -69 140 229 -441 54 331 -392 -43 263 -214 49 131 -249 -112 305 -110 -198 312
5358 312 -24 14 292 -52 -403 262 134 -444 394 -161 -490 -26 59 -244 -60 258 -284 121 552 -243 83
5379H3R6l61K36L36m54j05M90m79p7N58l96j35O22l76m21N94j34n04N55K3m33
5400b82M19K4o48M84J62m08L96n4j57l7K80l14m0M02n77J95M54j02l62M94o04
5421b75J74N67l19n18N19K07o79M81P3m66M29Nn55K84J93m74M03J42k83K04K13
5442C25q37N17K99l52NJ51o25K98L68l4m81N60j98q4L10k64j14L13j35l75M69
5463A16K59p85N77j3l06L49r2o35L86L32m32R1M62m98J17K21m96J21M56j94m04
5484c68M44Q1m30O87n65j6M78j84m91O34q5m95O03m02k32N04J91n05J25L27n66
5505b65K71J88m59K20L15n03P7M47m74k04O46j95k33O09o31j62N61j73k71K68
5525C2L5l93N24q8k16K06K38p06L01K60o38M11L04l56J35J45l99J14M50m09r9
$$ plain form
5379 83 179 -182 54 390 -64 -169 321 -158 -235 323 -73 -208 414 38 -383 211 77 -427 128 151 -282
5400 -282 137 161 -487 -3 159 -249 147 93 -64 -101 179 -135 -175 227 -350 -155 299 197 -165 329 -275
5421 -275 -101 466 147 -371 148 355 -324 157 230 -236 193 198 -357 -73 120 -354 49 191 -92 112 325
5442 325 -512 5 304 -48 -43 108 -517 -219 149 115 -366 194 -4 -88 222 -42 -156 157 22 -353 116
5463 116 375 -410 167 154 -152 197 105 -530 -144 188 -244 -153 309 -189 -72 149 -347 -226 230 36 -368
5484 -368 76 157 -273 414 -151 -167 311 127 -364 270 185 -310 293 -109 -341 163 354 -151 -26 301 -265
5505 -265 6 194 -265 -45 270 -233 -156 291 -183 -387 259 64 -169 440 -191 -353 208 35 -236 32
5525 32 67 -326 198 110 -106 100 338 -368 -67 193 -445 -34 270 -86 49 194 -205 -91 359 -50 -149
5546a49N66n55j79M91j68j89M29l39l44O09r1j89L36l40k27M87Lm12K76P2k63
5567a76L8L39n40K79L82l30m8M37m24l47N54r6k72N01k83l38N04j26k57M83j99
5588H1l34L08O1m10N19r3l49L00J64n72L16J36k46J45L94p48N11ql99J70L04o03
5610c53L01K84m88O5M04m25k49N74O1m23M19j27j82M72m06j77L38K64n98M17P7
5631B48m21j54N62l23k4N05n77o3N66l41J23P0l49%L62j66j91K38J61m62M92K8
5653B84m18L08j2k66J89J12m73L11K39l49j31K86l81K51L23k64k39L89k48M1M6
5674br0K2M55m51l31O69j32o01P81r4o43M43L79p22M25p1k53j2N94o17J62O26
5696E37o68K00J12l18J49J90j97l34O49n58m1M95l79k72Q44k88m03N32kp63N20
$$ plain form
5546 -149 417 -138 -317 174 6 -183 246 -93 -437 172 81 -108 228 -112 -339 148 151 -261 15 87 -176
5567 -176 -138 201 -339 -60 322 -8 -56 381 -43 -390 164 68 -204 297 14 -324 180 54 -203 280 81
5588 81 -253 55 116 -294 225 132 -217 83 247 -325 -9 127 -119 26 420 -328 183 175 -224 -54 250 -353
5610 -353 -52 232 -256 -191 213 -212 -461 113 174 -249 170 43 -139 333 -73 -250 88 352 -246 171 248
5631 248 -173 -327 235 -88 -112 393 -184 -247 319 -22 101 171 -178 -178 184 18 -173 65 226 -236 256 284
5653 284 -134 174 162 -104 85 197 -276 35 274 -75 -206 80 -301 -50 273 9 -230 159 -89 -48 -2
5674 -2 -92 -70 385 -66 -397 272 140 -461 320 226 -417 26 405 -317 108 37 -216 -228 366 -251 -89 537
5696 537 -131 69 181 -137 12 202 5 -329 320 -238 -279 216 -163 -435 409 121 -282 250 248 -515 5
5717EQk02J32K06m74K42J53q7j84L70l71j19N96n42K71K21j98j88N92m12m44N97
5739A72m39J21L82j87ML12k87j67L05N9m72K72K28o67L92K01k27K6qm7n0L14l05
5762f8R7k2j97Q5L73m65L10L51n81K4L88k56k65L54q5l88K22L71m18K51O6k67
5784a20LO87p20L17J77k69l24N44m75j04L77j29j31N90j99o21N03k73O7K71l53
5805a82k2L54j69l51O29m01r6L72n6l66J29N27n45%N51m41k8N07n40J52O5j43
5827e4mK82m40O8L79p7l99N15r0m91M69N0m35K60L97p06L51J06o22L35L24n20
5849c02M24k6k26K16K85l20l07O12m03j00L29k03k96N50l35j02O10l47n84P03
5869A78k30k35M73Q7l64K38J63n78L88J27o07L00J84j52N5J71l53J74L65p64J98
$$ plain form
5717 5 13 -189 -57 149 -325 -83 70 -17 -201 169 -202 -321 275 -267 4 225 27 -161 431 19 -425 172
5739 172 -267 -146 236 49 53 365 78 -89 216 275 -197 75 303 -364 28 229 2 28 20 -27 -77 237 -68
5762 -68 29 7 -190 -105 268 -197 113 464 -117 -93 295 39 -226 128 43 -345 -123 248 -170 81 147 -120
5784 -120 -117 570 -150 167 344 75 -249 295 -180 -284 93 -36 -167 423 224 -397 106 -167 -100 171 -182
5805 -182 -204 150 -19 -370 259 -142 -238 134 78 -288 -159 368 -177 -177 374 -67 -95 412 -128 24 89 -54
5827 -54 -58 224 -216 -148 231 154 -245 270 180 -311 158 208 -227 33 430 -276 75 181 -441 -106 218 -302
5849 -302 122 96 -130 86 371 51 -256 356 -47 -147 182 -21 -317 233 -102 -204 406 59 -525 178
5869 178 -52 -287 186 273 -91 147 310 -268 120 247 -360 -60 124 -28 27 198 -155 19 384 -380 -182
5890a82M22k86l05M45n9k22O06k95k72J65J25n62O87j89k66K19K17m83K21L34
5910C20o48L62K67o39K79N26o96K01K90k66j99L96k34k38M93j33k24P32o77l6
5930a24L43l71pL44Jk84M08k08m49L27J71l91L13M02n79J36n1l87J85M90j56l23
5952b10O17n57l5O07l62k46N84m19j60N14j97m45K98R8l9J27j28l75L23L25n74
5973b54K78K65n57J01L46m41L32J37l28mN18l94l30N70k80k60N81l77R3K05j60
5994D1k64L98K00o56L67M9k52K80R9n15K28J63l86K33L02m46l9K97k50q0L47j03
6016A3k21N40l69r3K00J57n44M55o1l35N26j41k84K09Q1l84M13j16l13N17j09
6037A41l50L82l08j47K31J07k13m6M06k25k34N70m14n8L86Mm55L34k43l34P80
$$ plain form
5890 -182 240 -46 -351 94 35 -187 419 124 -148 17 142 -420 267 78 -188 31 248 -235 -14 320
5910 320 -328 34 301 -338 -59 467 -229 -28 262 -4 -203 193 -41 -279 214 81 -143 589 -88 -124
5930 -124 219 -152 -159 185 186 -98 310 102 -347 -20 151 -240 73 475 -104 32 -19 -406 -221 269 113 -210
5952 -210 407 -150 -185 422 60 -186 398 -21 -181 333 136 -309 -11 87 48 175 47 -328 -5 320 -254
5973 -254 24 289 -268 -167 179 -262 70 207 -121 -125 393 -1 -331 239 -41 -301 280 -97 -4 201 41
5994 41 -223 175 375 -281 86 135 -117 163 262 -253 -25 138 -248 -15 287 -159 -198 99 -151 -231 116 13
6016 13 -208 332 -37 -130 70 227 -317 138 77 -258 268 127 -157 52 133 -251 162 46 -267 250 141
6037 141 -209 173 -135 -282 -51 56 -157 -203 203 -22 -256 314 -100 -158 228 232 -223 111 -132 -466 314
6058C14m16L3J69j14l30L83J70k41k8J12l33J83J26j82O8K90k15j48L22l25PM36
6080B81k57l77O54l16k87N55l6l64L86k71l75L85J04k12K45J54m44K14J62m69
6100b68M62J9k08O9K78k90m0K84n43K7N85m74k47M49k75P1J78j75k42M13o3l19
6122c09M62J58n94L24N6l79M43p4k31J51J54l60K45K76m97J7O04n20o1K50j40
6143b5k16L32m6j42K92ql66L11J39m45K79j61j36L12J03l92K93j13l61M28P5j50
6165Cq1M42p47L80L2j26j58M75l87K32L04j88k48K14j09m50O75j96m68M65k31
6186a67n1L80J09k51j72L29l94J49P1k31J64K93m05J90J75l46J3K70o9k76P7J37
6208em6R2r1k24L90q5j52K28p9j09J78J50n46K63K58n12K73J22k49L87K03n28
$$ plain form
6058 314 -102 -69 100 -14 -344 39 209 -32 -60 52 -281 -98 28 -154 -86 204 -11 -159 163 -162 -155 281
6080 281 24 -353 301 -15 -302 253 217 -147 239 -32 -407 -22 82 -130 115 269 -175 39 201 -268
6100 -268 194 213 5 74 352 62 22 306 -237 -210 375 -99 -346 103 -172 -101 77 -98 -340 73 10 -309
6122 -309 153 311 -283 41 97 -282 161 87 -144 7 161 -199 46 322 -175 -158 446 -74 -135 115 -25
6143 -25 -241 91 45 -97 195 187 -179 132 271 -174 105 -56 -192 120 223 -169 124 11 -350 78 153 3
6165 3 -78 364 -383 -3 29 -97 -255 220 -167 65 369 181 -67 147 38 -412 263 67 -401 64 -167
6186 -167 -218 162 271 20 -152 177 -217 -68 3 -228 -64 229 -176 14 189 -157 -144 126 57 -219 -142 -5
6208 -5 -51 41 -50 -274 116 31 -121 107 28 -81 97 247 -299 -36 222 -290 -17 105 -144 243 446 -82
6230h2k56N88m35R7M65k00k89M51o2l58J87J8k33L37n6m05M03o3l38K81K61o96
6252c85M59K15l88J37L7k78J08L43n14L9O02m00r5M61m26k13O05k72j72K45K0
6273A28j41j67L20l97N58j09l20J28N7l04J91J03j25J4K32p63O34M5r3k09K75
6294E7n6n6K67j96j24K80l11P2K95k45k07K49J9k30L37j17l88L88Q9l41M81j0
6316B53l59OM84m89kN32o99K49K80m29R8M62m61O9J83l66J49J87r7j89K04k14
6338a49J06R1N6l62L90J58q06Q62m13o8J44J40k67J22J46l08K60k02j43K87M03
6359D47m38k66K5K51l95O90j66k14J13j14k73M41p9l43L08j95J5L26m8l66M21
6380A40k51J89K3O8l66K36M2m47J68N28m09M1R6j42K2K04j80j11K58j10q3J84
$$ plain form
6230 -82 -338 250 -185 -88 377 177 -112 339 277 -81 106 124 -109 228 172 -233 170 107 -231 50 311 -385
6252 -385 74 289 -99 38 75 -203 -95 248 -266 -227 375 -25 -120 341 -85 -298 307 35 -137 108 128
6273 128 -13 -180 140 -257 301 192 -128 0 57 -247 -56 47 -78 -64 168 -595 39 84 -9 -218 57
6294 57 1 -55 212 16 -108 172 -139 -67 228 -17 -224 25 44 -186 151 34 -354 34 123 -218 263 253
6316 253 -106 -100 384 -105 -107 425 -274 -25 255 -174 -76 386 -75 -6 177 -189 -40 147 50 -139 65 -149
6338 -149 -43 48 104 -258 132 290 -516 346 -67 -135 9 149 -118 4 150 -158 102 -100 -243 44 447
6359 447 9 -257 -232 19 -376 314 148 -66 47 -67 -340 101 22 -321 -13 -208 -193 133 85 -281 140
6380 140 -111 78 101 169 -197 39 81 -366 -198 330 -79 -38 58 -84 -62 142 -38 -149 109 -1 -84 100
6402A00k76m7K42K47o92L38K28m43M27j03l31L13Lj2j77N21l55k1k1j62J67P1
6424A7M8j58K59k03NJ66r4l4Q7q1k69L27Lk47J62J93l41L00k05j94K54J28m07
6447b84K75K73n85L51J79l25J39K08l97Q3K93k65M1O1j39j0J82p0j36K47j01j01
6469h1J74j25j87J13J64j18O2L9m00L73J89j5m07M05l00r6M05k97K00L00n52o4
6491b18L62r9j09L87k83m6K55k91m5L19j74l59K68K43n01J36M36n59J60K32k40
6512a26J25J67k28r6L33j89j95K33L2k08K58m0k29M74m46P3L3n5k29K85mn6L14
6535B26k16j80L58l4m19K53m0J05j0J43j56q7J70q3l33L59q1k77N17l35j41O14
6557C53n40N3J98J01k93K22L5j33K58l20J16k58L77m38J1L78k84l2M69m49J61
$$ plain form
6402 100 -176 -223 19 266 -426 -88 140 -303 124 21 -310 3 6 -6 -183 338 -17 -38 -59 -221 -54 17
6424 17 65 -93 166 -37 -32 134 40 6 93 12 -257 70 73 -174 -12 181 -160 140 -65 -259 -5 123 -284
6447 -284 -9 264 -321 30 209 -116 23 231 -166 -83 210 -55 -14 47 -92 -102 80 10 -126 121 20 -81
6469 -81 93 -32 -219 -106 58 -60 2 41 -359 14 203 188 -219 186 -114 -210 195 -102 98 398 -154 -218
6491 -218 144 45 -64 323 40 -6 249 -42 -87 232 58 -301 -33 210 -291 -155 281 -278 -118 114 -126
6512 -126 -1 166 -62 -158 175 -14 -209 24 56 -152 106 66 -163 311 -135 -62 -29 -84 -313 -28 -32 -88 226
6535 226 10 -170 188 154 -265 -12 -52 53 43 186 30 -57 113 30 -303 56 -25 -302 215 -120 -261 353
6557 353 -187 -134 64 165 -128 94 129 -4 254 -66 50 -208 169 -269 -258 120 -164 -196 273 -176 -15
6578a5L14o02K34j35J83LK45l13R2j0J55l71L31l2l38L40m5j63K97j91j0P7J30
6601A76j19o6L56m74K21q6K7k00J54r7O7K61k01o6Q2J5k30K89l93K83J95l80J52
6624c4J62o4l2L10l96j41K92P0l31L64j2m11J69K50k28J16J28j79m7J37o8k72
6646b17K85k12J56L26k32k69K39j32n6J89k5o2K75j24k76K25k49N0M19l93K4K17
6668A58N1k80J32j6j66J91K2k27j35N79n15j82M48O2j02R3j41l1K28l40J46R4
6690F9m4p8L70m42R7J62r4j63K27J71m26K78j12q9J41K14l63O9K55j22l00J18
6712f2K38l33L26j64l9J48q7l94L06P4k21J74J34m01L66k7j24k19M00j82k00L75
6734H8k51l4L10l49P4L47j75jpJ92l16J75k0k45L06k68o0L78k25L6J56R4m18J9
$$ plain form
6578 -15 299 -303 -69 -204 -21 -18 227 -86 6 -4 151 -220 111 79 -259 81 36 -127 170 -21 -31 46 176
6601 176 57 -9 347 -127 94 8 35 -165 -11 -108 -41 220 19 -47 35 50 -180 109 -284 -1 194 -186 -34
6624 -34 128 64 32 342 -54 -195 97 167 -164 200 188 -223 -54 196 -32 84 212 33 -14 123 55 -217
6646 -217 68 -144 12 338 106 -163 76 -56 -112 77 52 -10 265 141 -135 90 -159 -109 310 -83 -59 158
6668 158 209 -71 61 45 -121 70 92 -135 -270 309 -206 -388 60 122 20 113 -28 -59 169 -171 -25 69
6690 69 25 -53 317 -125 -28 134 40 -123 104 275 -151 127 15 -74 67 281 -82 -13 242 120 -180 -62
6712 -62 176 -157 169 5 -34 114 27 -367 -61 13 -208 -34 100 -301 65 38 -86 -305 95 -87 -287 88
6734 88 -163 -197 113 -236 -162 185 10 9 2 194 -122 53 33 -212 94 -174 -234 144 -81 -45 111 205 -213 -194
6758a94P9n7J04J69k76L58K18n65K45J6l49M55l8m05N60k26j90K35j26m1j97J78
6780d7O2k15K12N7m7O2j72n1J80P4j4j68M71k87r7K30o05J54M42m33K49n5J24
6803A26j18J64r5j11mJ07j80K59k46l1J12J18l43K27J99j43j53L78m54Q5M61o75
6825c17L69K7l03K34L4j95J38L37l72j83N78l18k01M13l30k25L06M7j63K56j66
6846c4NL7O3k28K82%j89m0L60l35K10J89l22k3J94j74l18K88k04j7J58J40l6Q2
6870H8j86J3R6j09L6K97j16k09R6l7q4J08mJ3j21JJ08k04L00r4k69J36Q3J1J38
6895I1l24l8M81l61M29k49j20q8K08o5j30J27K78l44J75n4L4l3J11k05K4K29P5
6918B51l05L02k39KK64m96j5L28l03M72p4j99k05L36k75P6J27j76k31K42K33k72
$$ plain form
6758 -194 -115 -172 -68 101 -175 183 401 -164 81 97 -252 203 165 -240 320 94 -96 139 13 -28 -225 -47
6780 -47 15 -200 12 69 22 84 -88 -139 41 115 101 -67 404 117 20 250 -355 -201 241 -192 57 2 126
6803 126 8 172 77 -34 -38 69 -111 148 -98 -129 -17 101 -242 -15 184 41 -112 266 -188 -103 358 -317
6825 -317 52 79 -224 10 44 -151 -13 324 -48 -231 347 29 -172 241 -89 -314 -8 39 -124 132 -34
6846 -34 -29 8 71 -157 125 125 -64 -104 256 -79 131 320 -2 -25 169 -5 -323 -35 -239 -256 -98 42 6 88
6870 88 -98 -85 11 -98 -62 235 119 -90 6 -31 -115 -7 -11 2 -119 -118 -10 -214 86 -8 -277 -141 -58 -47 91
6895 91 -233 -271 210 -151 278 29 -91 -179 29 -36 -166 -39 239 -105 70 16 50 17 128 -77 -53 176 251
6918 251 -54 248 9 11 275 -221 -236 92 -211 261 187 -12 -217 119 -156 -80 47 -129 -360 -118 115 -157
6940a57K27j45J02n1N2j92J54J19k61M35k68j57J62n1l9R9K28l62J59K01k66k18
6962b29L49k20pJ88l74K63K82l38j12L08k53J3J97J7j32O5r6n2l0Q9l2K93k4k99
6986a34L5n8r5P1M59l59L1J70l25K55l1K09m06K32j45j61J97N9j58K31L3k63L66
7009B13j85k65K14j31j77M1M49j71j23M79m86PJ60j69Q6J32j19k6K48r8j39Q7
7031B7o9O8J98q5l14K01Rk01M15j26l44L40j07k77L98j2j09j34J97k94P9N0QO5
7055a7J09k52j77M33l53P3K02j44n5J54K53k21J47r8l96L56J24r2j62J03l04J06
7077b11O36m83R6L2l26L14K59j96k87J48k1J74q6k22L13j22J07p0Q7k12j8M34
7099C46l54p0l4n2J38K34l16O6M12k37m66M31j94q6M20j96j75K66k72k4o5M38
$$ plain form
6940 -157 70 -75 27 -24 28 -164 -10 109 -152 283 15 -142 20 -31 -70 29 257 -105 54 255 -11 -229
6962 -229 120 -100 -107 81 -293 -30 252 -86 -198 110 -143 -130 67 84 -48 17 -79 -131 -161 -72 -104 189 165 -134
6986 -134 -99 -157 -252 -181 278 -81 -50 120 -205 50 19 228 -178 54 -91 -252 -55 4 -154 77 110 -153 213
7009 213 28 -237 -23 -154 -331 -290 159 -12 -135 344 -142 -135 25 -144 -58 74 -45 -71 177 79 -60 27
7031 27 -42 26 224 139 -175 26 35 -166 249 123 -221 119 12 -265 133 121 12 -122 75 -219 -140 -90 -82 -17
7055 -17 92 -160 -337 96 -257 -184 18 -126 -181 -27 226 5 152 54 -342 14 138 46 -116 -13 -317 -211
7077 -211 425 -58 38 70 -256 58 317 121 -166 -18 -39 135 49 -173 140 18 125 55 142 -70 -88 346
7099 346 -8 -78 -112 -164 -26 208 -108 -42 370 133 -333 98 -96 -182 238 42 -133 133 -139 -163 -228 210
7121B10m72N28j36L6k18K31l83KN14m20J18N9j34k28L69j59R3J79Pk35Q5k3j21
7144i8L16j07l95K37K04k77J59Rj73n9R9J4l6J94j54l51M35j64k9L07j75j55K81
7167H2j39r0K89j75j48K18L0j82OJ88o1J11j65j59J87j44k0p2L73l85K61J24l63
7190b34K42J2k40O0L66k40j23K42k72j7K81j15j33J40R8k13L76j09m42M68j86
7211c9j85J40J81k30J75O5k29O0K50k50J41M4M3k79K04k31o9J41j1j6q1O7M8q9
7235a50K64l13M73j72l5J61j19j61J07N5j11j40P7j79L40j41j13K38J24k75l6
7256a06J67J04k22k6O0L1R4n2o9J42j85P7k71L42j62J10K8nj53M51l83J46j64
7279d6o8P2K73l11l1K12l8k60L03l43K39Q6o8q5J4L60n89L74P8j72J44p4j42K08
$$ plain form
7121 210 -262 266 130 166 -52 179 -204 -202 312 -108 10 69 -65 -293 76 -83 10 189 196 -39 46 23 -98
7144 -98 218 111 -284 -47 157 -120 39 48 -125 -184 -85 -71 -107 87 -67 -418 17 -147 -176 131 -44 -199 82
7167 82 -57 -147 142 -33 -181 37 67 -115 -109 79 18 129 -36 -195 -8 -152 -172 -244 129 -256 5 129 -234
7190 -234 8 20 -220 -160 206 -34 -157 85 -187 -204 77 -38 -171 -31 67 -146 230 121 -321 147 -39
7211 -39 -224 -84 97 -133 42 107 -122 -62 188 -62 79 123 166 -113 91 -140 -209 -68 -79 -95 -176 -109 -61 -150
7235 -150 114 -199 274 102 67 228 109 -52 55 110 -1 -141 -64 -243 97 -44 -157 81 205 -70 -106
7256 -106 61 165 -57 -83 -23 8 102 50 -19 123 -62 15 -256 86 -76 34 62 57 -96 355 -28 118 -46
7279 -46 -114 -42 231 -80 -111 101 63 -197 106 -237 2 88 20 -65 -51 309 -280 94 172 0 144 70 -72 136
7303A36p6p0o6J41r9r7J52l5j54K59j04n5l1k06J31M1K00j55J6J92k15K56l75
7326b14R7O3J34l42L18J58l12J18Q1k50O5K81k80K40j58P6J22m11K35j23K44k3
7348A19j40M8j25k21L22k81J31L06j34j08K56j39k53L32k3oMr7K5m2K3j72K32
7371E7J9k26K18j42q9J86Q0l46L03J46k80%L44l19j12P8K09l80L33O5k12L46m27
7394a49M4L55k5m77o3M62l05N2J33p2P0J89j69j14J73l33N4K92k23J27o6l9R7
7417A3R4j23j46K12J24k07K76rk03k81M55j43l9K77m39J26J22j38O7J43j69J96
7439B08j73j13K43K3k73P9K53j58j20J59j17p3P2k59J51K78k90P1J10Q7k81K74
7461A51j40k13K43Q4l05K03J81k67p0J47M6J23j95k17j7L24k14L55j76j02K55
$$ plain form
7303 136 60 -10 -76 65 -34 -131 21 -14 -168 91 -13 -68 -99 -305 -174 -133 67 -88 -72 120 -95 161 -214
7326 -214 -117 -54 80 -262 56 214 -98 20 101 -149 -84 197 -83 157 -1 75 197 -214 21 -102 142 119
7348 119 -21 27 -98 -319 3 -278 -147 159 25 -83 173 34 -219 113 90 84 88 -9 16 -26 -3 -175 57
7371 57 76 -150 68 -74 -163 23 103 -243 60 206 -74 -74 270 -49 -161 -83 126 -254 79 144 -68 278 -149
7394 -149 -105 250 225 -252 -315 147 -158 -106 27 -45 25 214 45 -69 104 -229 -175 117 -106 21 -45 -84 13
7417 13 107 -16 -162 50 174 -33 243 234 31 -250 205 62 23 300 -139 -13 109 -29 38 181 12 208
7439 208 35 -78 165 188 -85 -6 247 89 -31 128 11 -62 10 -249 -98 180 -110 -39 71 158 -123 151
7461 151 11 -202 41 125 -180 23 204 -63 -133 14 60 183 -12 -229 -246 78 -136 219 43 -59 196
7482A96k11M3J11p1J13p5M3m3j76n5J92j16Q3J02j70O7p1J34k50J31n1m3K28k59
7506a48k0R3K36l86L89j03n8J91k69J09k06J63rk25N4J74M8q0J43q6k26J76J3
7529b7Q0J2J08j46l41J12J74k7Q3l7K53l59J35R1J64k31Kj93R4K2l83M10J67P
7553A70k27J60k18J71P1m25L84j52j06K09j8j48J97k45q5J23N2j7K33l6k28N4
7575h1J28j96J13J72n9j17J45q8k82L62r4j40K63j35p9K70p9k60J80J63l24K60
7597A22j39OJ66Q9k24RO1k19K50J04l89K37k58J03J28R8j09j00n1L93l37K6J44
7620A10j62J20j95R6J03L7k92N28l32L1P5o2n0ON9j16P5j40j56K27K27k72r9L73
7644A91k52L6k5J12L8K29k03k38K54j62r5o5N28n77J90mo0L26j5k56k0Q4q8n4
$$ plain form
7482 196 -15 28 139 68 181 106 149 106 -70 -125 67 -49 34 136 -34 33 -38 96 -154 -23 -74 -117 111 -148
7506 -148 -168 -75 161 -225 164 61 3 194 -75 34 -172 -9 -18 -243 -189 -15 33 -47 96 10 -216 -40 -27
7529 -27 53 65 173 27 -314 -202 -28 -55 28 -9 244 -115 20 111 275 44 46 -147 -53 -31 -414 -4 163 170
7553 170 -57 103 -115 56 127 -298 86 -66 -172 37 19 -129 68 -177 -262 -139 -87 -104 129 93 -135 -81
7575 -81 47 -149 -36 136 77 -40 105 17 -265 97 3 -137 126 -9 -88 182 103 -157 23 186 -138 122
7597 122 -17 -11 155 244 20 29 90 -129 121 225 -164 73 -185 -82 46 144 35 -65 -116 277 -60 -34 110
7620 110 -52 68 -127 -31 72 109 -183 345 13 44 119 57 7 13 72 -44 31 -109 -265 -38 189 -83 -182 191
7644 191 -61 -25 -50 62 100 329 126 -112 142 -20 -115 -180 348 -229 -39 -43 -103 223 208 -48 -68 16 -72 -126
7668a26k7o8K72J6l74N48l25j55K41l1P7n9J45k64k5J54L0p6nJ42m2K1R3m63K66
7693c5J51l96N7R4N0M6J12j12j55J62q0j18J80J2N9l0j60j6K31j68J63j10L4J2
7717a7N5k04J47K80L2n34L62n1l21N09m97J84qJ31j66j05J19j14L8K52q9j76K75
7740A02n1p3K1k30J51O7k1j64N52m01M7J42k51j74K78n4p6R8K7q5M7Q7l32K88
7764eq3J90k13J16k16K73R3j2m9Q6O9j01j77j4K49n8J03j88O8q0m4q6J43j61J24
7789B7M8k19J56K02j99k2Q0j75K75k61J48m9L9j96L1R4J9R0N9k08O1N9r5p8J89
7814G5j30k00L73r1p3J87k15j81K75k29k9L06r3j30P1N6OK2J17k14M7O4k80L78
7838A12J67j71PJ8j75j18M69l46k8J25j4r7J01o0l05M54k15o2L3K63O0r2j57P1
$$ plain form
7668 -126 -153 -221 51 67 -307 241 -84 -239 2 -29 48 -11 134 -130 -155 -1 29 -47 -52 90 48 69 162 -301 -35
7693 -35 116 -280 -223 -129 -79 -33 79 -33 -188 -26 -106 -224 -44 -32 27 -3 -163 -179 52 -116 47 -63 -29 -17
7717 -17 38 -166 -19 261 293 -241 121 70 -251 258 -239 -55 -63 68 -98 -203 -84 -198 -160 92 3 -173 102
7740 102 51 -22 -1 -231 -80 -13 -34 -198 354 -47 0 142 -109 -283 -5 -59 -135 -37 -10 -95 -48 39 -293 -5
7764 -5 -88 102 -111 5 -211 62 155 143 94 180 249 148 -29 -43 206 148 251 63 131 51 7 -79 64 -97 27
7789 27 75 -144 12 214 15 -7 73 -102 173 -88 60 11 50 -146 -115 -21 -2 88 147 -61 0 59 -36 -114 75
7814 75 -55 -255 118 27 -46 141 -74 -255 20 -209 -238 68 -25 -155 -84 -28 -22 0 117 -97 -50 14 -266 112
7838 112 279 108 115 133 -42 -160 309 -37 -65 60 46 -51 50 -10 -315 139 -76 -138 -105 158 218 126 -31 40
7862D0j47J23r3J26j71J04M9r0KJ3L45k80j1QN1j37o8L10k79R2R4p1j42J49j22
7887a05N8L3n1J72r6k12J65J39p0L4o1K0j5q0j39L63k57M41n54K64k81J89Q2j53
7911a14J04J15k94J87K22k12j37R5J17j37m4jj19O9K72k38K62k00J33k14J99j01
7933c6j07R6Q7k14K20m8K9k15R2P9j00J67n7K16j43r2j4J95j59L02m53K74l56
7956b37K89j03m7J97l22R0J08j71K72m5k62L56J8j66j25J91l3j9J5j99J70O9N7
7979A03k21K47l3j10l72O39n12K94J16j45J71P6k80J22n0k56J75J10k55K24P8
8000A21j21Jj24K48l8k31nJ63Ol16O1K98j60PL48l58K32l9k20Q3J72j49N4k33
8024b00L57j22k00K47j99J45L5j98J99JJ7k22J27j42J97j0P6j67J07L7j02M4j49
$$ plain form
7862 40 -107 16 -77 49 -122 -18 31 -59 -57 -44 301 21 10 18 69 -68 -136 174 -105 -13 81 10 -132 17 -105
7887 -105 -47 -14 -65 107 11 -201 -36 103 33 67 6 26 11 -69 -208 155 -102 339 -215 49 -232 -43 39 -114
7911 -114 -10 105 -189 -2 220 8 -129 -34 83 -54 -98 -99 -218 -149 123 -115 147 -53 80 -134 65 -36
7933 -36 -143 -47 40 -174 46 -2 27 -188 -96 -17 -117 50 -7 209 66 -26 -40 155 -4 298 -155 119 -237
7956 -237 52 -51 -98 99 -223 -133 -25 -196 76 31 -231 125 143 -23 -148 43 10 -9 6 -193 -23 46 103
7979 103 -118 129 96 -14 -386 253 -259 35 151 6 177 253 -27 95 45 -211 -36 74 -181 43 121
8000 121 0 1 -123 125 87 -144 -149 14 20 -296 -235 63 -97 -90 258 -100 132 93 -127 -44 128 -21 33 -200
8024 -200 157 35 -165 82 -117 28 63 -135 64 65 82 -140 -13 -155 42 32 108 -59 48 85 -17 27 -122
8047a22j68M20j36k76L12R4k55o0K78j1j43Lr0K2L94k7k30O5l54J9K94oQ3j43
8071c7r9j4M26j98k13K7Q9j32K30l04P5K74Lk25J21jm2K0p8J60m4j48k1j3J84
8096D0P5j67L73m18J53N7lk16m1J96k50K8J88k88L88l23K07p9J28m9L4L00k72
8119F1l4q0m1N9K48m71L85j25k3l9J05j01Q0N9j13R9N8j68J56r4r5k21M08q1j46
8144a14L43o2m85M37j09j09j46K50P0j00J51k44N3J48j78J5J15k39J88P5k17J70
8166A2J66j79J5l5j7J09k00Q9j80L43j59p9J00l7j73L01J92k88K07p7K6k70L47
8189B13j74j50
$$ plain form
8047 -122 -290 130 -6 -282 30 124 -131 -191 87 76 -67 -64 -154 -132 262 235 5 70 -284 -265 29 23 106 -37
8071 -37 -136 -150 276 78 -135 -108 -19 -151 79 -225 -150 124 127 -98 23 22 -20 0 -78 82 38 -110 -131 -144 40
8096 40 115 -52 321 -97 56 113 110 -106 -147 49 -201 -173 15 -273 115 -208 -1 -80 48 -1 33 333 61
8119 61 27 -53 -94 -35 213 -258 127 2 -21 -60 45 -56 24 83 -30 69 127 -41 115 21 -74 -295 113 32 -114
8144 -114 229 167 -318 119 10 -99 -245 5 75 -25 126 -118 -65 83 -95 -80 35 -204 -16 59 -158 12
8166 12 178 -1 14 -21 -38 71 -129 -40 -220 123 -36 -115 -15 -52 -225 76 268 -20 187 110 136 -134 213
8189 213 39 -111
8191a11
$$ Imaginary data points
##PAGE= N=2
##DATA TABLE= (X++(I..I)), XYDATA
0@%%%%%%%%%%%lJ1j6J6j6J9k7L2m0M8n6P1q1R2j08J25j46J69j94K23k54K88l24
34a71L65m12M63n21N84o48P20q02Q88r81J086j201J324j459J609j771J951k152
52a128K372k618K893l202L554l960M431m985N654o476P509q857J0693j3352J7557
67A0085k5185M3192j59317r1054L75397j22007j00821J94077o6327j23798J76106
78A10348n1359j15125J28420n1694j33783J53806j7021j48890J41060L1794j89537
89a41981J03954J34857j09652o790M9359l9434O8827j8460j28174J11788O5352
100H9646j62342P4471R8726j92591K8095J82057j42521m3930J62686j05135o6477
111g7315J47820q5614n9306J60533j21471j20444K48683r479k12248J59447O5678
$$ plain form
0 0 0 0 0 0 0 0 0 0 0 0 0 -3 8 -8 8 -8 11 -16 16 -24 24 -32 39 -42 50 -58 67 -79 90 -104 119 -135 153 -171
34 -171 194 -218 245 -276 308 -340 380 -422 466 -515 571 -630 694 -765 844 -927 1024 -1128
52 -1128 1244 -1374 1519 -1683 1871 -2089 2342 -2643 3011 -3465 4044 -4813 5880 -7472 10085
67 10085 -15100 28092 -131225 -222279 153118 31111 -69710 124367 58040 -65758 110348
78 110348 58989 -56136 72284 20590 -113193 40613 23592 -125298 15762 47556 -141981
89 -141981 -38027 96830 -12822 -19612 29747 -9687 59140 40680 -87494 24294 89646
100 89646 -72696 1775 100501 -92090 -63995 118062 -24459 -68389 94297 -10838 -77315
111 -77315 70505 -15109 -74415 86118 -35353 -155797 92886 83407 -128841 30606 96284
122I6284j96460J13198J23825j72513K6388J01321j34877J6414Q7331j29937K2249
133d6777J05941j41804O207J61719j16128n6427J62988n3748p1473J25075l9035
144C6538o5327J05923n9895q1103J19579n3720j01536J49868j7147j52885J29687
155I982M2874j53425J04100Q7613j49207N1561R3591j27265L6382Q8129j41046
166e6711K4476J22941j42261j1288J59897j15769o9128J57188o8388q3668J54175
177G1464l7151j14180J22518r906j09244J09220k006j12610J22785J9589j55360
188i4881J05521Q4347j55059M3089R8885j26614K2196J04880j19425j0572J06214
199E8581r5714j8435J05359q6295j2870J32199r5340o6316J56230l6355j01841
$$ plain form
122 96284 -100176 13022 136847 -35666 -9278 92043 -42834 -26420 60911 -69026 -46777
133 -46777 59164 -82640 -76433 85286 -30842 -87269 75719 21971 -49502 75573 36538
144 36538 -28789 77134 17239 -63864 55715 1995 -99541 50327 33180 -119705 9982
155 9982 52856 -100569 3531 91144 -58063 -6502 87089 -40176 -3794 84335 -56711
166 -56711 -32235 90706 -51555 -62843 97054 -18715 -87843 69345 957 -82711 71464
177 71464 34313 -79867 42651 32745 -76499 32721 30715 -81895 40890 60479 -94881
188 -94881 10640 94987 -60072 -16983 81902 -44712 -22516 82364 -37061 -47633 58581
199 58581 -37133 -55568 49791 -36504 -49374 82825 -12515 -78831 77399 41044 -60797
210f0797J11709r894r0634R4058j5928j03151R9102N593j15617R3674K8604j24471
222h7752R8767O5951j57506N6534J25061j30475o071J17428r3847j8063J01723
233G1750j00126k7543J31972q6874o9972J37900m8818r1731J33911j6775j21900
244h8206J13836L4928j20761O2275M4130q8689N5623K7494r9777P0777N5798j24957
256e7529M0262R0716j08880O826R3661r5037j0212J02203q0280l1549R4667o5416
268b0568k4716J06373p7977n1952J40700n0386j01760J32528l17j21832R6270
279B6363K7849j14340P6883L7451j23255O1327O6320j15985M0641P8444j19718
290e8020K4163J14761j08842k6134J21357o7207m9420J02306m4273n1095Q7732
$$ plain form
210 -60797 50912 41018 -49616 44442 28514 -74637 24465 30058 -85559 8115 36719 -87752
222 -87752 11015 76966 -80540 -24006 101055 -29420 -35491 81937 -11910 -29973 71750
233 71750 -28376 -55919 76053 -10821 -80793 57107 8289 -83442 50469 33694 -88206
244 -88206 25630 60558 -60203 2072 46202 -42487 13136 40630 -59147 11630 67428 -57529
256 -57529 -17267 73449 -35431 -28605 65056 -29981 -40193 62010 -18270 -49819 44848 -20568
268 -20568 -45284 61089 -16888 -68840 71860 21474 -80286 52242 51925 -69907 26363
279 26363 54212 -60128 16755 54206 -69049 -7722 58598 -57387 -16746 61698 -58020
290 -58020 -33857 80904 -27938 -54072 67285 78 -49342 52964 8691 -42404 45328
301D5328m3836n4902J01286l0812q0543R3096n275q4395Q8769R536j04118P3813
313G947M3066r6386M7878M2909r2158M6248N3798j04003L7218Q1272j12965L391
325d1785J10068q5406k7873J04180p1049m1542J17372n0252p3487J03936k3147
336B1015p6105R5266j5859r4550R6594J4334j12729P5094N0109j06789M2356N9141
348D7877q9202L7181O5881r8421J5256Q6797q1540j0064P9241p4182j5991R2783
360E5616o9040m3282J00991m0157n9678Q7250k3183n6978Q8058k1133p8518R3288
372C3234R894r6481O6229K7884q8292N9743L5772j02875M9887O7902j01999J5185
384b3917P8687q4004K722Q2372q6206j5187J04198o7869m9563R9130l6269n2509
$$ plain form
301 45328 1492 -53410 47876 17064 -63479 29617 24342 -60053 28716 38252 -65866 7947
313 7947 51013 -45373 2505 45414 -46744 -496 53302 -50701 -13483 67789 -45176 -41785
325 -41785 68283 -17123 -44996 59184 -11865 -53407 63965 13713 -59774 44162 21015
336 21015 -55090 40176 24317 -70233 26361 40695 -72034 3060 53169 -53620 -11264 47877
348 47877 -41325 -4144 61737 -36684 -21428 65369 -16171 -26235 53006 -21176 -37167 55616
360 55616 -13424 -56706 44285 4128 -55550 31700 8517 -48461 39597 18464 -60054 33234
372 33234 43128 -53353 12876 40760 -47532 12211 47983 -54892 -5005 62897 -39102 -23917
384 -23917 54770 -29234 -26512 55860 -30346 -45533 58665 -9204 -58767 40363 4094 -48415
396d8415R1088l1166o3411R9178j0552r0737Q0681J9025q9311N6318K2418q8853
408e3737N3891M0598r5581L2853O1138p8078K2148O1081p7928J8825Q0495q2268
420a6563j3786R3056n9738l8354P9217m6932l9138Q3836m4812n8353R3832j6880
432A5385p3336Q1795R88p9191P9724J9377r8299N9442M9735r4070K6913N5548
444D4011p6978K2741N6686q3933J4274Q2610p8765j8501Q7730n5770l2621Q3203
456D4687m6421m7564Q5404k6665o0990P3544r310n5066P1911q619o7604P9701
468C3008J1224r3669N7939M0727q6807L3512M2868q2118K7436N5817q2295J2209
480c0149P3471o8237Q7P7718o5551j4531Q9798n9956m7058R3368k8862o5445P0041
$$ plain form
396 -48415 42673 11507 -51904 47274 36722 -54015 26666 45691 -43620 12698 35116 -53737
408 -53737 154 40752 -54829 -21976 39162 -38916 -16768 44313 -33615 -14790 65705 -16563
420 -16563 -30349 62707 2969 -35385 43832 -3100 -42238 41598 -3214 -61567 32265 15385
432 15385 -57951 23844 24832 -54359 25365 44742 -53557 5885 55620 -38450 -11537 44011
444 44011 -32967 -10226 46460 -37473 -23199 59411 -19354 -37855 49875 -5895 -38516 44687
456 44687 -1734 -49298 36106 9441 -51549 21995 12685 -42381 29530 20911 -46693 33008
468 33008 44232 -49437 8502 49229 -37578 -4066 38802 -43316 -15880 39937 -42358 -30149
480 -30149 43322 -24915 -24828 52890 -12661 -27192 62606 2650 -44408 48960 20098 -45347 24694
493B4694j4510n9942O8249q867o9142P3141J7084p6849N6348K9708p7000M6739
505I653M0865q5780K8978O3342p9195j724O2306o0033l500O0235o1855p077Q1991
518D8206n5508l5329Q1965l5769m6488Q0145k3633o1410P8137k325p5507N9025
530A1509J7726o4465M8611J5329o7721N5940L0519r0859L2676N5832p9462J1370
542b2995O3927o9717m018P0079n6665j7409P1957l8465j9281O8095m2161k7426
554b4079P9375m3880o1760Q6037n418p9257N6184J2088o8380M7254J9670o5013
566d7179M3799L0666o0500M3826L7048p9276K8641N8266q0275N230Q1066o4612
578c300l6429O5179l0006k2897N1760m0177k1451P1678l3342l8983P5782k6695
$$ plain form
493 24694 10184 -49758 18491 9624 -59518 13623 30707 -46142 10206 39914 -37086 9653
505 9653 50518 -35262 -6284 57058 -22137 -23861 38445 -21588 -25088 35147 -26708 -33785 48206
518 48206 -7302 -42631 39334 3565 -42923 37222 13589 -47821 30316 27991 -47516 11509
530 11509 29235 -35230 13381 28710 -39011 16929 47448 -43411 -10735 45097 -34365 -22995
542 -22995 40932 -28785 -32803 37276 -19389 -36798 35159 -3306 -22587 45508 3347 -24079
554 -24079 55296 11416 -50344 35693 30275 -48982 7202 19290 -49090 -1836 17834 -47179
566 -47179 -3380 27286 -33214 10612 47660 -31616 -2975 55291 -24984 -19754 61312 -3300
578 -3300 -39729 25450 -4556 -27453 24307 -15870 -37321 34357 1015 -37968 37814 11119
590A1119o5962P8102J0658p5084N1790K6738p0403K9116L1802n0559K8932J8513
602B4762o0616M7089M3179r1033R814P2177o6979j3499P5556m7847l4593O5383
614B3393k3268k6814N3759l1373k6298O9731k5775m2355P6196k3162q4906P0444
626I572L5229p6368K4619K8889n6297K6446L0556n3218K6651L1753o2091L1056
638c203N6744p2852k139O9526n9866k6523P8948k8253m6068M8675j3386k4630
650b3027M6251l1305l1158P3018j4378n9584O2275L909p1457N1512L1300o7721
662c0365K5400L5108n5816J8085L6119m9761J7640L1375o1466K4915O5548p0614
674a3832k1538P0644m0285k9946O5999k4863l8065N4761j8923l8158N7082j1029
$$ plain form
590 11119 -54843 23259 33917 -41167 10623 37361 -33042 -3926 27876 -22683 6249 24762
602 24762 -35854 11235 54414 -36619 -26805 45372 -21607 -35106 40450 -7397 -41990 23393
614 23393 125 -26689 27070 -4303 -30601 39130 13355 -29000 47196 24034 -60872 9572
626 9572 44801 -31567 -6948 21941 -34356 -7910 22646 -30572 -3921 27832 -34259 -3203
638 -3203 53541 -19311 -21450 48076 -11790 -38313 40635 12382 -33686 14989 1603 -23027
650 -23027 23224 -8081 -39239 33779 19401 -40183 22092 26001 -45456 6056 37356 -30365
662 -30365 -4965 30143 -25673 -7588 28531 -21230 -3590 27785 -33681 -8766 56782 -13832
674 -13832 -35370 35274 -5011 -34957 31042 6179 -31886 22875 3952 -34206 22876 11847
686A1847m4329N6435o188n6990O0630J3929p7410L6799M0659o2914J4850M0398
698B7716m7182J2730L6036n4863Q610N1890m6704k230N3937m8364j8671O2255
710C5160l6732l5035O3421j5512m6074M6568l732l4865M5136r707m5949N4343
722A7022Q298n7211M4378K0637o4718L0680L3849o2945K0503N0378n7230m887
734b1246M6964m0751j109M5935m5889p244O0981m3691k9176O8068k2428m5631
746c5217N5239p553m5632N2679M872n3787L5191J2232m3457L4877J0632n0509
758c0433L8710K2900o7065K2853M9818n4547j160M5670l9560k616M4664l8935
770i701r065M8529l5370j5782N1898l2961k4837O2201k7104n1526O1627O112n5926
$$ plain form
686 11847 -32482 23953 17765 -39225 21405 35334 -42076 -5277 35382 -27532 -12682 27716
698 27716 -19466 -6736 29300 -25563 -16953 34937 -11767 -13997 39940 -8424 -27095 35160
710 35160 -1572 -36607 26814 11302 -34772 11796 8064 -26801 18335 8628 -37321 17022
722 17022 25320 -31891 12487 33124 -31594 -914 32935 -30010 -9507 40871 -16359 -21246
734 -21246 25718 -15033 -16142 29793 -16096 -23340 37641 -6050 -35226 32842 10414 -35217
746 -35217 20022 12469 -33163 19516 24388 -29399 5792 18024 -25433 9444 20076 -30433
758 -30433 8277 31177 -35888 -13035 36783 -17764 -18924 26746 -12814 -15430 29234 -9701
770 -9701 -18766 29763 -5607 -21389 30509 -2452 -27289 34912 7808 -43718 17909 24021 -31905
783c1905L6475J3597m4169L1880J0139m6849L8011K2774n9817K4331L8878n5500
795b2155J2220M7754n5016o457N7756l5462k2561M5196k3007j6299M0304l0161
807g888j7498N7299k7099m2066N7617k721m9607M3021Q415m8159L6459J5189m9721
820b6759K6154K2004m2640K5196J9426n3305K6835M1504n9574K142N5833m5136
832h320j6721N1142k7176j8825M3849l0219k2905N3139j9285l3687M8542j3126
844F408l9436N5366O95n7443M1032K2306n2317K3394K5212m4218J6972K2814m4947
857b4162J9800L3863n2463N035M7129m1316n661M7292l8826j7135N4516k2672
869E400k9018M1918j5611k4589M4182j6380l3404M8822q827m6614M8729J1132
$$ plain form
783 -31905 4570 18167 -26002 5878 16017 -30832 7179 29953 -29864 -5533 33345 -22155
795 -22155 -9935 37819 -17197 -23654 34102 -1360 -23921 21275 -1732 -18031 22273 -7888
807 -7888 -25386 31913 4814 -37252 20365 17644 -31963 11058 19473 -28686 7773 22962 -26759
820 -26759 -605 21399 -21241 3955 23381 -29924 -3089 38415 -21159 -19017 36816 -8320
832 -8320 -25041 26101 -1075 -19900 23949 -6270 -29175 23964 4679 -29008 19534 6408
844 6408 -33028 22338 23033 -34410 6622 28928 -23389 5 25217 -19001 -2029 20785 -24162
857 -24162 -4362 29501 -22962 -17927 29202 -12114 -17775 29517 -9309 -26444 28072 5400
869 5400 -23618 18300 2689 -21900 22282 5902 -27502 21320 12493 -34121 14608 25740
881B5740n4415L0454J9406m7825K7315K6590n3109J3903L5927m2060J0081L6145
893B8152m7557L494N1384m2647j4964N5851l0337l0133M9756j4836l1838M1227
905A7552j3633l5541M5816j045m2499L6256O175m1407L7953J5216n1523K6108
917e72L0301m6266J1924L1029m0558O678L0894m0237N415M0120m2580q599M8527
930B6076l0584j7340M7041k7593k5911N2784j4979l8494M4076l566l7707M0843
942A4646m84m3672M1765J1766n3357L1719K7424n1522J6068L1757m6020J0753
954i157L7749m6104k239M5667l3960j0611M1238k9766j2357M8038k6599k7347
966b5448M8383j2253l3824L8967o508l3978L8153j946m1089L6877J1068m3865
$$ plain form
881 25740 -28675 1779 21185 -26640 675 27265 -25844 -11941 23986 -18074 -7993 28152
893 28152 -19405 -15911 35473 -7174 -22138 33713 3376 -26757 22999 8163 -23675 17552
905 17552 3919 -31622 14194 13149 -29350 6906 13081 -28326 9627 24843 -26680 -572
917 -572 29729 -16537 -4613 26416 -14142 -7464 23430 -16807 -11392 28728 -13852 -22451 26076
930 26076 -4508 -21848 25193 -2400 -28311 24473 9494 -29000 15076 11510 -26197 14646
942 14646 14162 -29510 12255 24021 -29336 2383 29807 -21715 -5647 26110 -19910 -9157
954 -9157 28592 -17512 -19751 25916 -8044 -18655 22583 -7183 -19540 28498 1899 -25448
966 -25448 22935 10682 -23142 15825 9317 -24661 13492 11546 -29543 7334 18402 -25463
978b5463K6981J7141m0922K6180K2295m9287J7430L7077m5504J089L8187l8587
990a3383k125M2457l7589j3500N0473k7039k5456M7363j5921k8870M5021j1861
1002I570l7834M5921J781m7827L3298J3882m2334K6965J6146m5251K3837K7430
1014B5584m5599J1503L2795l8826N925L4429l9350o94M2084l5884j3595M4211
1026B2583k3063j8592M0400k1273k2142M5262j5564l5327M3025k493l8206L6761
1038A1371K718m2762L4235J3470m7456K6498K6572m4146J5305K9573m1376J0767
1050e231L5291m3254j323M4378l4613j4804M1233k7190j8059M3738k2097k6105
1062b8036M5923r887l4488L9418m07l4755L4737L749l9414L3115J3143m5145K1843
$$ plain form
978 -25463 1518 18659 -22263 3917 26212 -23075 -5645 31432 -14072 -12983 25204 -13383
990 -13383 -15508 26949 -10640 -24140 26333 -706 -26162 21201 5280 -23590 21431 9570
1002 9570 -28264 17657 19438 -28389 4909 18791 -23543 3422 19568 -25683 -1846 25584
1014 25584 -20015 -8512 24283 -14543 -8618 25811 -13539 -14233 27851 -8033 -21628 22583
1026 22583 -480 -19072 21328 55 -22087 23175 7611 -27716 15309 12816 -25390 11371
1038 11371 14089 -28673 5562 19032 -28424 -1926 24646 -19500 -4195 25378 -15998 -5231
1050 -5231 30060 -13194 -14517 29861 -4752 -19556 21677 -5513 -23572 20166 -1931 -28036
1062 -28036 17887 8000 -26488 12930 12523 -22232 12505 16254 -23160 9955 23098 -22047 -204
1075b04K0453l9836J7841K3442m2795J3414L4744m2345q80L9153l1618o603L7375
1088B2141k9640r206M2730k9018k3159M7289j4460l0026M1895q257l5497M1245
1100A6037J335m4637L1883J5127m0385K2821J5011m0505K2828K2018m7655J4739
1112a1383M0882m0715m092L8831k9470p165L7315k8680j4178M0643j8747j9917
1124a6676L4827j9102k2658M1955j3588l4781M3922M479m3201K6882J3676l3185
1136a7450K2250Q890l6110K7411J9952m4363J4977K7229m2828J0003L9465m1421
1148a1995o054M5120k8932j8894L8051j7793j5810L3869k0554j7153M4855j8267
1160F443l8491M3679L343l9690L2577J1026m0653K3414J8549l6140J4459J7419
$$ plain form
1075 -204 20249 -19587 -1746 21696 -21099 -7685 27059 -15286 -16166 22987 -8631 -15234 22141
1088 22141 -7499 -16705 26025 -2993 -26152 21137 6677 -23349 18546 10289 -25208 16037
1100 16037 17372 -27265 4618 19745 -20640 2181 17192 -23313 -485 21533 -26122 -11383
1112 -11383 29499 -11216 -15308 23523 -5947 -13112 24203 -4477 -18655 21988 3241 -16676
1124 -16676 18151 -951 -23609 18346 4758 -30023 13899 18378 -24823 2059 15735 -17450
1136 -17450 4800 13690 -22420 4991 24943 -19420 -4443 22786 -20042 -10039 29426 -11995
1148 -11995 -18049 27071 -1861 -20755 17296 -497 -16307 17562 -2992 -20145 24710 6443
1160 6443 -32048 11631 14974 -24716 7861 18887 -21766 1648 20197 -15943 -1484 15935
1172A5935l2941J7623K1653l9749J2125L1487m4263j900M6805k7242j8726L5475
1184A6282j6888j5146L2752j7921j8187L6041j4333k3821M1194q936l8515L7489
1196A0011O305m1401K9817J8548m0837J3990K0313l0584J3331J6058l6434J7505
1208c378L0431m2536J324L9186l4546j1343M3080k2126j8732L7485j5877k1952
1220a8984L4782j0460k3807L2415q963k6366L9260k032m4130L0321J7403l9398
1232a9959J7259K0362l2664J2414J9581l4084J1487K6549l3421L975L0300l0938
1244i139q92L5884l2648j5114M2323j6652k3402L3310q678k1837L0701j1388k7030
1257b4562L7490O40l5610K9225Q576l6309K4190J4917l9974J8127K7436l7021
$$ plain form
1172 15935 -17006 617 22270 -17479 -5354 26133 -18130 -20030 26775 -467 -19193 16282
1184 16282 -606 -15752 17000 -921 -19108 16933 2600 -21221 19973 11037 -27478 10011
1196 10011 16316 -25085 4732 23280 -17557 -3567 16746 -13838 -507 15551 -20883 -3378
1208 -3378 27053 -15483 -14159 25027 -9519 -20862 22218 92 -18640 18845 2968 -18984
1220 -18984 15798 5338 -18469 13946 4983 -21383 17877 15845 -28285 2036 19439 -19959
1232 -19959 -2700 17662 -15002 -2588 16993 -17091 -5604 20945 -12476 -8501 21799 -9139
1244 -9139 -10031 25853 -6795 -21909 20414 3762 -19640 13670 4992 -16845 13856 2468 -24562
1257 -24562 12928 13568 -22042 7183 15759 -20550 3640 18557 -21417 -3290 24146 -12875
1269a2875L928K7557k7478K006K5021l0771M91L5769k8097j2211L5883k0200j8151
1282a9128L4729j4468k2027L7124o093l1603K7956L083k5894K5901Q04l1148K8904
1295H140J0463l9327K0394K1644l7783R484K6193l2475M874L0956l0932o383L1100
1308A6348k0879o824L0166k3312j1539L6988j9810k4819L8435m790l0654K8512
1320G822K469k8165K4973N741l0239K1562J0149l0644J9273J3843l3983J6135
1332a064K1896l8516N141L4244k8398o939K9081k0940o817K8350j9404r219L1961
1345A9376j9356j7733L5211j1458k5680L3315l966l2802K8973Q961l2279J8406
1357I68J0341k6969J7665J0704k9940J8697J8577l6899R593K9253l1976j941L1714
$$ plain form
1269 -12875 -8947 18610 -8868 -6862 18159 -12612 -12121 23648 -4449 -16660 19223 -977 -19128
1282 -19128 15601 1133 -20894 16230 10137 -21466 6490 9573 -16321 9580 10384 -20764 8140
1295 8140 18603 -20724 -330 21314 -16469 -6985 19208 -13267 -8393 22563 -8369 -14752 16348
1308 16348 -4531 -11355 18811 -4501 -16040 20948 1138 -23681 14754 9964 -20690 7822
1320 7822 10291 -17874 7099 12840 -17399 4163 14312 -16332 2941 16784 -17199 -1064
1332 -1064 20832 -17684 -12543 21701 -6697 -13636 15445 -5495 -12312 16038 -3366 -12585 19376
1345 19376 20 -17713 17498 6040 -19640 13675 9709 -23093 5880 14841 -17438 968
1357 968 11309 -15660 2005 12709 -17231 1466 20043 -16856 -7263 21990 -9986 -11927 19787
1370A9787k4261q621L0429j8675j3084K9511j3679j4977K7856j4327j9135L4569
1382A5393p009l1746K9881N807l2446K1440J3428k8207J3777J2311k6511J5130
1394A248J7560k9956P569K0842k9051N699K7620l0592p663L3284j8581j4030K8322
1407A2271j2590j3995K6304j1699j5268L0571r812k5320L1045J156l0260K4214
1419F617O295l2003K1356J6587l3057Q685J8767k4083Q984J7622k8998N825K5764
1432A8361k8520j994L1986k2556j3637K9493j2321j3675K7893j1506k0464K6658
1444I718k001j8973K1341n378k2678K7350L117l1591K0335J3357k9929J1605J7800
1457A4073k5152Q040J6970k5362O525K3741k5789j751K4413k1787l922K9087k2432
$$ plain form
1370 19787 -4474 -13095 17334 -1341 -14425 15086 1407 -13570 14286 -41 -19176 15393
1382 15393 8384 -23362 6519 12326 -20120 1320 14748 -13459 318 12629 -13882 1248
1394 1248 18808 -11148 -3579 17263 -11788 -6089 21531 -9061 -16724 16560 -2021 -16051 12271
1407 12271 -319 -14314 11990 291 -14977 15594 5782 -19538 11507 12663 -17597 6617
1419 6617 12912 -19091 2265 18852 -14205 -5520 13247 -10836 -1852 15770 -13228 -7403 18361
1432 18361 -10159 -12153 19833 -2723 -16360 13133 812 -12863 15030 3524 -16940 9718
1444 9718 7717 -11256 10085 4707 -17971 9379 12496 -19095 1240 14597 -15332 -3727 14073
1457 14073 -11079 -3039 13931 -11431 -4906 18835 -6954 -8705 15708 -6079 -10001 19086 -3346
1470c346j5708L3132q823k1391K4624l656j9638K4225k804k2179K4095K329k8387
1483a7527K0395J1006k7722J3995J3452k8370J0782K1702k6201K36K1344j8867
1495e775R37J9517k2317j729K7154k0653j1645K8506j2358j6819K5740p705j8313
1508a5460K5446l159k3342K2423M218k3116J7687M725k4736J9238J1677l0644
1520a5043J0968K0629k5506K584K0544k1771J16K2772k0989m825K5147j6349j0430
1533a2153K3948j2379j2575K5707j0685j8928K6909j096k3336J9288L840k0439
1545a1899J7843M345k3976J6636J0534k6015J0761J4876k4358O939J8128k4427
1557a0613K713K3654k1845n490K4247j4042p888K1871j4218r960K5899j1327j7676
$$ plain form
1470 -3346 -19054 14078 5255 -16136 8488 4832 -14806 9419 6615 -15564 8531 10860 -17527
1483 -17527 2868 13874 -13848 147 13599 -14771 -3989 17713 -8488 -8252 13092 -5775
1495 -5775 -4838 14679 -7638 -9367 17787 -2866 -14511 13995 1637 -15182 10558 2853 -15460
1508 -15460 9986 6827 -16515 5908 10126 -12990 4697 9422 -15314 3924 15601 -15043
1520 -15043 -4075 16554 -8952 -6368 14176 -7595 -7479 15293 -5696 -10521 14626 -1723 -12153
1533 -12153 11795 -584 -13159 12548 1863 -17065 9844 8748 -14588 4700 8540 -11899
1545 -11899 5944 10289 -13687 2949 13483 -12532 -1771 13105 -11253 -4314 13814 -10613
1557 -10613 -7900 15754 -6091 -11581 12666 -1376 -9264 12607 -1611 -11571 14328 3001 -14675
1570a4675K4787l532k0605K1290Q3k1514J8841N177k4255J4717J1316k2458R674
1583a154J1911k1882R516J5902k4935L133K3018j9706m541K1802j5550o839K2086
1596A2761j3887j0484K3251r008j5178K1106n017j7150K1504k298k1764K0790
1608D626O529k4062J3126R797k0128J0985J0429k2170R514J6112k3397K871J9220
1621A3452j9299j915K0623j7342n565K2921j3934j1543K1400p731j1784K0008
1633I291p724j4644K2912l038k1551J9137M881k0549J3926P165k0406J2100R518
1646A1018k2245Q807J5286k0933M042J6194j9481R11J9838j8557o296K2738j0862
1659D60j0002J8845r625r869K0042q322j4297K1911j994j9506J7297L468j9569
$$ plain form
1570 -14675 10112 6580 -14025 7265 7348 -14166 4675 9852 -14403 314 11630 -10828 -1154
1583 -1154 10757 -11125 -1609 14293 -10642 -7509 15509 -4197 -8738 13064 -2486 -9325 12761
1596 12761 -1126 -11610 11641 2633 -12545 8561 3544 -13606 7898 5600 -16164 4626
1608 4626 11155 -12907 219 10016 -10112 873 11302 -10868 -1354 14758 -8639 -5768 13452
1621 13452 -5847 -7762 12861 -4481 -10046 12875 -1059 -12602 8798 1067 -10717 9291
1633 9291 1567 -13077 9835 6797 -14754 4383 9264 -11285 2641 9806 -10600 1500 11018
1646 11018 -11227 -2420 12866 -8067 -4025 12169 -7312 -6401 13437 -5120 -11416 11322 460
1659 460 -9542 9303 -322 -10191 9851 1529 -12768 9143 7149 -12357 4940 8408 -11161
1672a1161J3962N755j9899J1735J0618j9442O573J0987j9375P455J4811k1058
1684i039K417K0885j7293o538K0454j1464p805J7756r971p852J9825r122j4193
1697a1940J9633l765j6639J9442K46k0007J6242O972k1053R364R942j6820Q047
1710c36R119j7568Q463J3053k1809K059K0263j6302m889J9434j2134p925J8111
1723I539r397j0149J7206o084j0573J7380n884j4053J9034j512j9998J7346Q236
1736A1091k0167Q630R242j5838P539P861j7292P715J2436j8355L661J5111j8316
1749f682j494J9247j4349o667K0329q530j1469J5741n007q946J5490o857j1925
1762a1119K0154k082j8783J5261M639j8769J1597Q538j7550P932R902j6925M341
$$ plain form
1672 -11161 2801 8556 -11343 392 11010 -8432 -1859 9128 -10247 -2792 12019 -9039
1684 -9039 -6622 14263 -3030 -9568 10886 -578 -8383 9373 -598 -8450 11375 2253 -11940
1697 -11940 7693 3928 -12711 6731 6977 -13030 3212 10184 -10869 -1505 8437 -8383 -336
1710 -336 8783 -8785 -322 12731 -9078 -7019 13244 -3058 -7947 11487 -647 -8572 9539
1723 9539 142 -10007 7199 1115 -9458 7922 2038 -12015 7019 5507 -14491 2855 11091
1736 11091 -9076 -446 8796 -7042 497 8358 -8934 -1219 11217 -7138 -3477 11634 -6682
1749 -6682 -8176 11071 -3278 -9945 10384 1854 -9615 6126 1119 -7827 7663 806 -11119
1762 -11119 9035 6953 -11830 3431 8070 -10699 898 9436 -8114 -182 9720 -7205 -2864
1775b864J1312j5047L718J2262j6517K004J7876j6175p322J9637q125q896J6172
1788H035o558r411J5976n646j2429J6301j669j4608J4680J440j6388J3480N108
1801H311j9600R444J1697j6065M038J0703j4810L753J2484j6589N66J6746j3352
1814b674m499J6608j0611o842J6451q239j0213J8111l817j3406J3954j075j2693
1827h945J3556m6j5250J3555N148j7119R275P697j6300P362R942j6011M952J3488
1841A1304j5950j034J5137j1612l128J3949j1398m019J6393r930r483J6982n395
1854A816j1904J5639j652j3092J4169R56j5826J1620N437j4370Q523N472j4446
1867g658Q601Q184j7887N590J4081j5690p23J4579j1926k709J3620j0958m352
$$ plain form
1775 -2864 8448 -6599 -2881 9381 -7136 -5132 12744 -3431 -10753 8884 759 -8137 8035
1788 8035 1477 -7934 8042 2396 -10033 6268 4599 -10009 4671 6111 -10277 3203 8311
1801 8311 -11289 -1845 9852 -6213 -2175 8528 -6282 -2529 9955 -6634 -6068 10678 -2674
1814 -2674 -7173 9435 -1176 -8018 8433 194 -10019 8092 4275 -9131 4823 3748 -8945
1827 -8945 4611 4565 -10685 2870 8018 -9101 174 7871 -8429 -1067 8875 -7136 -2184 11304
1841 11304 -4646 -5680 9457 -2155 -5283 8666 -2732 -6751 9642 -288 -9771 7211 1816
1854 1816 -10088 5551 3899 -9193 4976 5932 -9894 1726 7163 -7207 1316 6788 -7658
1867 -7658 943 9127 -8760 -3170 10911 -4779 -5502 9077 -2849 -5558 8062 -2896 -7248
1880g248J4911q490p123J5239o539q950J5544m927j3419J7086J909j6681J0115
1893A427N409j3053P573M350j3452Q725O791j6240N917J1596j5339K067J3077
1906H848j4116n10J5956j1178o455J4306o289n869J1929p296o203J5781o979j2691
1920a0766J6419o3j5059J1689L782j4147R392N634j4824O842Q536j3316M236Q032
1934F387j3176N365J2446j6410j637J6971j0298o398J4008o752o507J1830o069
1947b40o833J3644m727j0418J2880j865j0962J4058k89j5848J1726P312j5070
1960f632N784P203j1640N310P041j3549N026J0605j4858J321J3852j2758l081
1973f376J4525r945o154J6173o571j0375J2951k006q231J1544l673j0920J4026
$$ plain form
1880 -7248 7663 -827 -7950 7289 750 -8200 7344 2417 -11002 6084 7993 -8688 1427
1893 1427 6836 -6217 1356 5706 -7746 979 7770 -8470 -2553 9043 -6296 -4229 8848
1906 8848 -5268 -5778 10178 -1000 -7455 6851 562 -5307 6622 -674 -6877 8904 1925 -10766
1920 -10766 5653 5590 -9469 2220 6002 -8145 1247 6881 -7943 -1101 7435 -5881 -1645 6387
1934 6387 -6789 -1424 11022 -5388 -7025 9946 -352 -6750 7258 506 -6001 5829 -240
1947 -240 -7073 6571 1844 -8574 4306 2441 -8521 5537 5248 -10600 1126 8438 -6632
1960 -6632 -848 6355 -5285 25 7066 -6483 -1457 9148 -5710 -4389 9463 -3295 -6376
1973 -6376 8149 -1796 -7950 8223 1652 -8723 4228 2222 -6009 5535 1862 -9058 4968
1986D968P02j4344J1130M914j5213P125Q404j3008M504Q016j2859K261J0374j0662
2000c688P95R521j1697K53J3780j1093n383J4787o728p992J3333l689q968J1616
2014D847k649r163J2085q85j2577J1085K885j3532R910M878j5847P650J0357j4464
2028e420K029J0302j1431J197J0779j1108l29J2042j0864l483J4632p653p760
2041g067J3457n150q794J3457k118j1822J0560J444j0289Q776J203j1458R911
2054B110L726j4080P579Q245j3376L526R507j1390J287J0390j1087p24J1952r251
2068a586l155J1200q120m056J3455p872q756J4859k574j1496J1244N13j0875J0192
2082B973J586j2114R244M757j2975O656O226j2397N651Q496j3947K633J1907j1646
$$ plain form
1986 4968 5670 -8674 2456 7370 -7843 -718 7686 -5322 -818 7198 -5661 -3400 6974 -3688
2000 -3688 -2893 6628 -5069 -4816 8964 -2129 -7512 7275 547 -7445 5888 2199 -6769 4847
2014 4847 2198 -6965 5120 4235 -8342 2743 5628 -7904 2006 6884 -8963 -1313 9044 -5420
2028 -5420 -3391 6911 -4520 -3323 7456 -3652 -3981 8061 -2803 -6286 8346 693 -7067
2041 -7067 6390 1240 -7554 5903 3785 -8037 2523 3967 -6322 2454 3657 -7801 2110
2054 2110 5836 -8244 -665 7580 -5796 -2270 7237 -4153 -2866 7524 -3563 -4287 7665 -1586
2068 -1586 -4741 6459 -1661 -5717 7738 -134 -8890 5969 3395 -8101 3143 3656 -7219 2973
2082 2973 4559 -7555 1689 6446 -6529 127 6353 -6044 -393 8103 -5844 -3211 8696 -2950
2096b950k473J1602p943k592J0380q022m304J2784o171p626J2562l702q408J1873
2110E010j812j1168J1726J526j2509Q308M507j0793N984M377j1648O649P196j3540
2124f187L275J0607j1791j30J1565j0331k340J2599q021n793J2640n241o578J1267
2138E541m450p853J2724k791j1799J2212K003j2562P952M263j1552O527N403j1685
2152f067M964P203j1234L134Q550j1113J713J0488j1042j754J2949q049n635J1375
2166E482n172n409J0827n344o917J2206l375j0064J1467m6j1049J0110K242j2117
2180g159Q032N469j2493M980P137j0243L534P031j1178K866J0315j1844j799J2487
2194G135p926m783J1387o171n395J1164n113p314J1519k104q920J0257n82r936
$$ plain form
2096 -2950 -5423 6179 -1764 -4356 6024 -1998 -6302 6482 311 -7315 5247 1545 -6863 5010
2110 5010 3198 -7970 3756 5282 -7227 1081 5588 -5205 779 5156 -6492 157 7353 -6187
2124 -6187 -2912 7695 -4096 -4226 7339 -2992 -5332 7267 -754 -6547 6093 852 -5726 5541
2138 5541 1091 -6762 5962 3171 -8628 3584 5587 -6975 977 5240 -6312 215 5618 -6067
2152 -6067 -1103 6100 -5134 -2000 6550 -4563 -2850 7638 -3404 -5158 7791 -258 -5893 5482
2166 5482 310 -5099 5728 384 -6533 5673 2298 -7766 3701 3655 -7394 2716 4958 -7159
2180 -7159 873 6342 -6151 -1171 5966 -4277 -743 6288 -4890 -2024 8291 -3553 -5352 7135
2194 7135 -791 -5574 5813 -358 -5753 5411 298 -7016 4503 2399 -6521 3736 3154 -6782
2208f782J0192J364j2458Q379O117j1474L875O237j0233M436O575j1807K950J0040
2222G411j0684j174J0949q782k901J0991p090m745J2149m853p298J0373l041o956
2236e651J0573k710r648J1351J964j2754P367M632j0694N589N099j0693M969P187
2250F581j1582K026R536j0268R6J0345r130k402J2011p673n869J1041l597n845
2264d730R617m028o540J0915l023r927J0458J847j0835P632L425j0456O110M470
2278D935j0927M903P237j0290L048P320j0602J913R892j0901j857J2670p032n496
2292e187J0116m779n467R840m326o713J1471k408r231R802K26j0025Q234L087
2306D640j0674O629N663j0863L418N987q612L445N900j0199K587R816j0531j737
$$ plain form
2208 -6782 3410 4774 -7684 695 6812 -4662 -787 5450 -4783 -347 6228 -5579 -2629 7411
2222 7411 -3273 -4447 6502 -2280 -5181 5810 -1280 -6025 6124 1271 -6027 4346 1305 -5651
2236 -5651 4922 2212 -7436 3915 5879 -6875 492 5124 -5570 19 5118 -5575 -606 6581
2250 6581 -5001 -2975 6561 -3707 -3611 6734 -2396 -4798 7213 -460 -6329 4712 1115 -4730
2264 -4730 4887 859 -5681 5234 2211 -7716 2742 4589 -6246 1386 4811 -5645 465 4935
2278 4935 -5992 -1089 6148 -4142 -1094 6226 -4376 -2463 7429 -3472 -5329 7341 309 -5187
2292 -5187 4929 150 -5317 4523 197 -6516 4955 2547 -6684 3118 3344 -6681 1553 4640
2306 4640 -6034 595 6258 -4605 -1187 4800 -3812 -367 5533 -4666 -2079 7737 -2794 -4531
2320d531J0615p372l898J0414n415m875J0238m684o672J0070k070p765R521m69
2334C107r591R720K221j2196O633N581r821L805O069r607L018O528j0026J671
2348b888R066q968j349J0128p650k729R676o381m678J0799l457o589Q950k751
2362A179o550R358j194r228R279J712j0274O889L730j0110M940N007j0285M646
2376i01P281j0477J421Q307q559n28R350q081k044J0512o149n036R704m139n801
2391e140R263k913o852R775j460r179Q347J925r216O142K738q665O109M163j0097
2406e060L974O794r608K068P750q691J68Q722q157k372J0103n915m286Q893m486
2421a03m494R586m466p041J0234o60r125Q088J683q880O753K302r091N815M379
$$ plain form
2320 -4531 6084 -1288 -5186 5228 -187 -5062 5176 492 -6180 3890 1820 -5945 3576 3107
2334 3107 -6484 3236 5457 -6739 -106 5475 -4346 -541 5528 -4079 -1061 5467 -4559 -2888
2348 -2888 6178 -2790 -4139 5989 -1661 -4390 5286 -1095 -5773 5026 1569 -5020 3930 1179
2362 1179 -5371 3987 2793 -6435 2844 4556 -5718 1171 4901 -5209 -269 4738 -5547 -901
2376 -901 6380 -4097 -2676 5631 -2928 -3456 5894 -2187 -4231 6281 132 -4904 4800 661 -5140
2391 -5140 4123 1210 -5642 4133 2673 -6506 1841 3766 -5450 692 3430 -5235 874 5037 -5060
2406 -5060 -1086 5708 -3900 -1832 5918 -2773 -2605 6117 -2040 -4412 5691 -224 -4510 4383 -103
2421 -103 -4597 4989 523 -6518 3716 3056 -6069 2019 3702 -5178 1575 3877 -5214 601 4980
2436D980r248M120M963q815L164O507r840J506R257q413k827R496n780l051Q522
2451D541n207m292R845m341o191R651j717q110Q884N21r411P574L437r974M720
2466g0M561q180L323M529q524L509O452r532R19Q634p743j834Q857n989l000Q630
2482D542m638m151Q235l076n251P932k440o300R423j726r263Q706K843r878N095
2497E3M110q713M141M694q708L174O532q624R16P854p652l01Q262p786k522J0165
2513E595n053n319Q261k591n045P739k939n949Q828j109q091P713J442q792O339
2528A029K884q542M837M842r187K562O423p436J538N593q112J004Q681p994k491
2543d369R576n835m074Q663l506n353Q580k497o665Q282M2p284O367L30p348P298
$$ plain form
2436 4980 -4268 -148 4815 -4000 -836 5671 -4169 -2663 6594 -1819 -4646 4850 -930 -3981 4541
2451 4541 -666 -4958 4887 546 -5645 4006 2289 -5821 3063 3584 -5827 1747 5184 -4790 -70
2466 -70 4491 -3689 -366 4163 -4361 -852 5600 -3932 -3013 5621 -2122 -3956 4901 -1088 -4088 4542
2482 4542 -96 -4247 3988 912 -4339 3593 1153 -5147 4276 2550 -6713 1993 4836 -5042 53
2497 53 4163 -4550 -409 4285 -4423 -1249 5283 -3341 -2425 5429 -2223 -2524 5738 -2048 -4570 5595
2513 5595 542 -4777 3484 893 -4152 3587 648 -5301 3527 2418 -5673 2040 3482 -5310 1029
2528 1029 3913 -4629 208 5050 -4137 -1575 4848 -2588 -1050 4543 -3569 -2565 6116 -1878 -4369
2543 -4369 5207 -628 -4702 3961 455 -4898 3682 1185 -5480 2802 2844 -4440 1927 2257 -5091 2207
2559B207K194r786N288N258q906K578N649p332J392N994p438N09P272o892j667
2574c680Q156n554k726Q476m918m971R462k169p000P097N4o328O701j87p149O666
2590A930J671q303N302L669q329L221N168p961K086O760p788l55P264n770j094
2605b529O694n708j739Q296n218m156Q607k909n728P453j191o436O996J40p320
2620d748N783K153p441M985K653p759M490M197q541K886O529p519k23P065n993
2635a483j183P055n253k370P614m384m055P516k943m532P565k504o384P706K20
2650B585p186N663J881o720M621K019o829M875L429q204K779N633p118R87O319
2665D734p064n82P738o033k724P685l621l709O648l335l727P561k447o050P646
$$ plain form
2559 2207 4401 -5385 -97 5161 -3745 -1167 4482 -2850 -1458 4536 -2902 -2393 4879 -2013 -3680
2574 -3680 4476 -1078 -3804 4672 -246 -5217 4245 2076 -4924 2173 2227 -4101 2600 2413 -4736 1930
2590 1930 3601 -4702 600 4269 -4060 -839 4329 -3632 -1546 5214 -2574 -2929 4335 -1435 -2529
2605 -2529 4165 -1543 -3282 5014 -204 -4360 4247 1338 -4390 3063 1872 -4564 2432 2572 -4748
2620 -4748 1035 3188 -4253 732 3385 -4374 116 4313 -4228 -1342 5187 -2332 -2555 4510 -1483
2635 -1483 -2666 4389 -864 -3234 4380 -4 -4059 3457 514 -4018 3547 1043 -5341 2365 2585
2650 2585 -4601 1062 2943 -3777 844 2863 -3966 909 4338 -3866 -1087 4546 -2572 -1585 4734
2665 4734 -2330 -2912 4826 -1207 -3931 3754 133 -3576 3072 -263 -3990 3571 1124 -4926 2720
2680B720J4o982N837J344o705M805K592p587L809L781o527K415L795o692K370
2695a011N271p378M08P247n603k499P370m021k903O788l480m082P386k002n314
2710c823O846j357o052O583N09p702N968K950p712L212L921o216K374L921o590
2725c168K072N202o621M1O664n676j130O777m929k369O973l535l815N904j370
2740A020m236O022j731n119O337kp044N532K385o529L531L058o727L153M139o795
2756c006J850N196o138N23N578n916j96O185n161k474P244l344l903O058k308
2771A88l618O119k014m732O301r1n939N148J217o584M382K780o143K770L950o246
2787b512J542M364n559Q50M843n852n8O824n419k156O220l401k878O314k702l697
$$ plain form
2680 2720 2734 -4248 1589 2933 -3772 1033 3625 -3962 -153 3628 -2899 -484 3311 -3381 -1011
2695 -1011 4260 -3118 -2710 4537 -1066 -3565 3805 -216 -3119 3669 189 -3893 3493 1491 -3823
2710 -3823 3023 1666 -4386 2197 2706 -4996 972 3922 -3790 -578 3343 -2873 -499 3422 -3168
2725 -3168 -1096 4106 -2515 -2474 4190 -1486 -2616 4161 -768 -3137 3836 301 -3514 2390 1020
2740 1020 -3216 2806 1075 -4044 2293 2291 -4753 779 3164 -3365 166 3224 -3503 -350 3789 -3006
2756 -3006 -1156 4040 -2098 -1575 4003 -1913 -2109 4076 -1085 -3559 3685 341 -3562 2496 188
2771 188 -3430 2689 675 -4057 2244 2153 -3786 1362 2579 -4005 377 3157 -2986 -216 3734 -2512
2787 -2512 -970 3394 -2165 -1315 3528 -2324 -2382 4442 -977 -3133 3087 -314 -3192 3122 420 -3277
2803c277O277j594n303N998m9n473M956J020n903M141K349o540K756L762n563
2818b443J893L556n499J459M628n786k54N982m204j966N747l237k718N548k514
2833A92l468O019j536m347N288p35m801M905L92o078M764K713o209K723K860n453
2849b771K486L153n714J677M963n672j32N502m472j555N687l628k127N785k649
2864E33l604M899j208l505N243j416m703N571P52o464M350J892n274L096K606
2879B768n247K493K972n599J545M564n334O92M554m835o97N797m272k669N756
2894B488j906l284N171k250l061N343j470m756N354M82n385L879J866n094K843
2909B20K592n746K416L851m860N66L632m736P52M603n143k02N279l649k223N184
$$ plain form
2803 -3277 3000 1406 -3897 2101 2052 -3421 1535 2555 -3348 793 3142 -3398 -642 3120 -2443
2818 -2443 -550 3006 -2493 -1034 3594 -2192 -2446 3536 -668 -2634 3113 -124 -2842 2706 192
2833 192 -3276 2743 1207 -3140 2148 1413 -3388 1517 1909 -4169 595 3308 -2901 -178 2682 -2771
2849 -2771 -285 2868 -2846 -1169 3794 -1878 -2010 3492 -980 -2535 3152 -476 -2603 3182 533
2864 533 -3071 1828 620 -2885 2358 942 -3761 1810 2562 -3902 448 2340 -2934 162 2768
2879 2768 -2479 14 2986 -2613 -1068 3496 -1838 -1146 3408 -1427 -2124 3673 -599 -3268 2488
2894 2488 582 -2702 2469 219 -2842 2501 1031 -3725 1629 2111 -3274 605 2471 -2623 220
2909 220 2812 -2934 -518 3333 -1527 -961 2671 -2065 -1313 3290 -1853 -2055 3224 -425 -2648 2536
2925B536k688k470M845k146k954N189j079m371M854L5m795M312P05n042L872K246
2941C049n730K369K932m939J571L521n023J221M294m861o88N432l539k029M918
2956B498k524k263N023k179l545N308j040m089M292j1m413M083R00n394L592K213
2972B451m710J839K536m028J862K521m988J313M715m846l58M648l599j292M705
2987B769l224k080N079k444k804M440j293l341M641m53m684M865Q88n300L279
3002C38J845m427K251K189m728K434L249n247J189L815m325m7M283m008q68M873
3018B816l117k243M804j826k986M210j415k525M598j281m158M283Q49m729L328
3033F08J363m387K592K094m718J900K934m115Q64L224m125N86M069m392n10M752
$$ plain form
2925 2536 -152 -2622 2223 77 -2877 2312 1233 -3138 1716 1751 -3044 1268 1973 -3069 803 3049
2941 3049 -2681 -312 2620 -2319 -748 2773 -2250 -1029 3265 -1596 -2284 3148 -391 -2420 2498
2956 2498 -26 -2289 2734 555 -2990 2318 1278 -2811 1481 1470 -2943 1140 2040 -3354 238 2451
2972 2451 -2259 -420 2116 -1912 -50 2471 -2517 -1204 3511 -1335 -1693 2955 -644 -1936 2769
2987 2769 -455 -2535 2544 100 -2704 1736 443 -2898 1743 1290 -3394 1471 2359 -2941 338
3002 338 2183 -2244 7 2196 -2532 -98 3151 -2096 -907 2908 -1417 -1464 2819 -1189 -2057 2816
3018 2816 -301 -2544 2260 434 -2552 1658 243 -2282 2316 1035 -3123 1160 2009 -2720 608
3033 608 1971 -2416 176 2270 -2448 -548 2386 -1729 -865 2359 -1766 -1180 2889 -1503 -2013 2739
3049B739k904k054M559k482j942M229j768k895M336o21l749M098km274L780R85
3065B035m975L244K186m777J586K995l883J315K396l927Q56L748l722o74M572
3080B975l574j476M551k497k145M532j947l116M149m79l101L268m23l365L846
3095A198P40m889L219K166m894K493K468l978J281K743m273P46L605l860j93L918
3111B490l287p78M301l073k279N155j863l352M065m13l404L646j7l710L744O36
3127A861m474L060J425l868K199J772m328K207L067m404J53L564l292k6K952k720
3143h52o92M221l398j643M827k219k408M152j336l091M392o69l892L411J148m184
3159b233K788Q65l879K995J643m601J860L122m161O56L256l611N2L709l440q78
$$ plain form
3049 2739 -165 -2219 2340 -142 -2084 2145 377 -2518 1818 1197 -2552 1546 1544 -2730 1050 2035
3065 2035 -2940 304 2490 -2287 -701 2294 -1589 -274 2122 -1805 -949 2799 -923 -1597 2975
3080 2975 -599 -2075 2476 -21 -2166 2366 419 -2697 1452 973 -2128 1140 717 -2648 1198
3095 1198 1938 -2951 268 2434 -2460 33 2501 -1477 -196 2547 -1726 -980 2625 -1235 -1428 2490
3111 2490 -797 -1575 2726 -347 -2626 2529 666 -2686 1379 966 -2438 1208 1191 -2519 1225 1861
3127 1861 -2613 447 1872 -1996 203 1975 -2353 -146 2921 -1483 -1330 2234 -1058 -1084 1868 -852
3143 -852 -1544 2677 -721 -2364 2463 244 -2164 1988 652 -2439 1953 1284 -2608 803 1951 -2233
3159 -2233 555 1420 -2459 536 2179 -2422 -562 2560 -1601 -945 2311 -1300 -1248 2461 -979 -1857
3175a857M132k484j604L829k444j802M589j939l131M264l12l743L311N26l572
3190b237K919Q53l904K491J613l938J943K265l982J696K733m201L43L997l279
3205f88r37L956k864j008L857k299j968M053j629k845L740l42l481L699k21l546
3221b523L069J176l954K220J987l637J832J602l359J373K685m231O96L578l411
3236h97n30L691k753j028L692k329j826L784j609k171L695j417k765M018p21l618
3252b784L841P73m073K455J687l635J855J867l653J133K864l768N08L008l580
3267a502L90L416l080j254M340k355k116L570j250j914L301j393j927L670j027
3282H69l194L442L61l620K611J189l782K302J985l871J144K462l175N14K705l362
$$ plain form
3175 -1857 2275 -209 -1813 2016 -428 -2230 2359 420 -2711 1553 1241 -2502 809 1335 -2237
3190 -2237 682 1535 -2369 122 1735 -2203 -260 2005 -1977 -281 2452 -1749 -1406 2591 -688
3205 -688 -1625 2331 -533 -1541 2316 17 -1951 2102 473 -2372 1368 1026 -2455 1244 1023 -2523
3221 -2523 546 1722 -2232 -12 1975 -1662 170 1772 -1587 -214 2471 -1760 -1064 2514 -897
3236 -897 -1427 2264 -489 -1517 2175 -154 -1980 1804 195 -1976 1719 302 -2463 1555 834 -2784
3252 -2784 1057 1830 -2243 212 1899 -1736 119 1986 -1667 -534 2330 -1438 -930 2078 -1502
3267 -1502 -1112 2304 -776 -2030 2310 -45 -2161 1409 159 -1755 1546 153 -1774 1896 869
3282 869 -2325 1117 1478 -2142 469 1658 -2124 178 2163 -1708 -564 1898 -1277 -763 1942 -1420
3298a420M13L781l892r13M675k705j791L667j589k025L561j253k744L579l27l176
3314b159L220k54l228K775J082m196K831J872l963J536K219l021Q37K451l459
3329a457N92L267l332m01L666k810r85L416k158j705L812j160k941L447m50k777
3345a976K976j34l235L215Q41m055K101K096l423J872J766l605J161K623l606
3360a383L16L241k767q77L332k515p94L347k400j607L784j425k267L365q97k384
3376a931L549m05l575L222O77l449K335J242l422J636J784l645J417K501l139
3391a203J97K934l078O9L125k907q73L741j944j695L210j480j801L285j200k432
3407b052L843q39l145L067N73l599K473J240l230J546J829l474R57K422k997O25
$$ plain form
3298 -1420 -1007 2774 -1118 -2031 2644 -61 -1852 1815 226 -1799 1762 509 -2235 1344 1017 -2159
3314 -2159 1061 807 -2421 354 1436 -2760 71 1943 -2020 -484 1735 -1286 -449 2002 -1457
3329 -1457 -865 2402 -930 -1331 2335 -475 -1460 1956 -202 -1907 1905 745 -2196 1251 801 -1976
3345 -1976 1000 866 -2369 846 1687 -2368 -267 1829 -1594 278 2044 -1561 -400 2223 -1383
3360 -1383 -1067 2174 -593 -1470 1862 -653 -1447 1900 -500 -2107 1677 252 -2015 1350 453 -1931
3376 -1931 1618 1213 -2362 860 1537 -1912 423 1665 -1757 -121 1663 -1982 -565 1936 -1203
3391 -1203 -1006 1928 -1150 -1081 2044 -863 -1736 2005 61 -1634 1576 96 -1705 1580 380 -2052
3407 -2052 1791 952 -2193 874 1447 -2152 321 1561 -1669 -123 1706 -1768 -811 1611 -1386 -761
3423g61K664l106M23L327l130j103L699k266j198L080j288k118L234j114k691
3438b348L717p35k914L009P10l591K675J149l765J991K114l606J470J790l007
3453a341J041K370l387K69L516l155q58L520k079j519L069j555j802L482j007
3468E64k482K736l48k335L176k73l238K942J018l462J778J796l272J181J859l010
3484a370J030K200l108L17K860k902m76L248k530o90L182j657j781K959r07j987
3500a612K985q61k112K778n1l243K699Q69l206K013J242l081J604J389l201J358
3516d30K197k877M20K336k568k4K800k531j071L492j775j459K701o15k107K968
3532A457r47k325L126j88l111K702M64k940K017Q62k842J741J855l376J039J947
$$ plain form
3423 -761 1903 -1203 -780 2547 -583 -1686 2013 -253 -1451 1629 341 -1777 1457 343 -2348
3438 -2348 1369 634 -2280 729 1439 -2152 523 1672 -2093 -102 2012 -1594 -124 1666 -1341
3453 -1341 -300 2070 -1317 -1048 2468 -687 -1545 1975 -104 -1623 1446 -109 -1911 1571 564
3468 564 -1918 818 470 -1865 1311 1038 -2200 742 1760 -1702 76 1872 -1400 -219 1640 -1370
3484 -1370 -340 1860 -1248 -931 1929 -973 -1449 1799 -731 -1421 1761 104 -1677 1282 375 -1612
3500 -1612 1373 512 -1600 1178 1127 -2116 583 1452 -1754 259 1501 -1580 24 1413 -1788 -430
3516 -430 1767 -1110 -690 1646 -922 -946 1854 -677 -1748 1744 -31 -1490 1211 596 -1511 1457
3532 1457 510 -1815 1311 1123 -1988 714 1178 -1762 255 1117 -1725 16 1871 -1505 -466 1481
3548A481k639N38K623k982j35L284k828q17L065j536j496K779j337j643L091q73
3564E75k316K740K6k721K347N32l135K263J074l045J714J553k822J056J678k589
3580a070O19K421k984o2K963k201o85K591j741j408L326j670j656K946r22j929
3596a462K246l8k451K667J35l202K653J123l146J480J593k828J020J843k867Q05
3612d29K023k674K38K395k197p60K957j904r38K701j249j839K949p60k043K613
3628A083o82j776K382n4k854K388P68k821J775J080k743J355J889l053M99K299
3644A535k311j08K647k681q8K868k130r62K891j674j338K608r58j826K548m93
3660E28k265K331K46k538K181J86k128K072O54k691J120K128l234R96K107k650
$$ plain form
3548 1481 -1158 -620 2003 -979 -1114 2170 -658 -1475 1590 54 -1442 1337 0 -1643 1448 575
3564 575 -1741 999 1025 -1696 651 1183 -1952 311 1385 -1660 54 1607 -1215 -159 1519 -1070
3580 -1070 -451 1970 -1014 -1076 1887 -314 -999 1592 -149 -1557 1769 99 -1557 1389 467 -1462
3596 -1462 784 746 -1705 962 1097 -2105 548 1671 -1475 5 1598 -1230 -210 1633 -1234 -429
3612 -429 1594 -1080 -842 1553 -644 -1404 1553 -351 -1289 1412 163 -1676 1273 513 -1530 1083
3628 1083 401 -1375 1007 953 -1901 487 1255 -1566 209 1289 -1454 -99 1790 -1263 -764 1535
3644 1535 -776 -884 1763 -918 -1006 1862 -268 -1230 1661 -13 -1351 1257 299 -1527 1021 528
3660 528 -1737 594 840 -1698 483 669 -1459 613 1267 -1424 -304 1824 -1410 -414 1693 -957
3676i57M09K182k566Q0K244j855p98K719j609j216K495j243j472K791o37k314
3692a747K651j28k120J964M96k558J808R40k859J481J401k391O94J662k130K88
3708e48K129k243l49K219j863m33K370j584q56K487j342j427K527l84k330K449
3724H22j41k020K269k22k026J607R70k548J336J302k592Q86J767k552L45K631
3740A834k511j2K129j969l79K189j373j087K525j041j604K362p87j203K128p35
3756D66k082K368Q8k257J622Q44k317J370Q96k456J388J318k122L67J892j919
3772e34j19K080k247Q1J944j372j028K236q99j309K247p91j368K322q38j896K274
3789G83L03k548J573J054k460J594O19k200J088J445j967J78J686k134L94K256
$$ plain form
3676 -957 -548 1634 -932 -852 1392 -463 -1261 1458 -151 -1367 1128 -115 -1587 1204 567 -1747
3692 -1747 904 776 -1344 620 1116 -1442 366 1306 -1553 -72 1329 -1062 -368 1294 -836 -548
3708 -548 1581 -662 -1011 1208 -655 -1088 1282 -302 -1158 1329 -13 -1440 1087 703 -1627 822
3724 822 681 -1339 930 708 -1318 289 1259 -1289 47 1349 -1243 -357 1410 -1142 -797 1834
3740 1834 -677 -689 1440 -529 -908 1281 -92 -1179 1346 305 -1299 1063 276 -927 1201 466
3756 466 -1616 752 840 -1417 205 1049 -1268 102 998 -1458 -70 1248 -874 -507 1385 -534
3772 -534 -653 1427 -820 -739 1205 -167 -1195 1041 142 -1167 1080 289 -1079 1243 405 -1491 783
3789 783 1086 -1462 111 1165 -1295 299 918 -1282 -194 1251 -716 -538 1148 -986 -592 1664
3805A664k475O5K384k030o22K074j184r37J978q31j261K272p83j457J966j80j937
3822a294J738N65k650J954R46k228Q78J426k247P04J416j805J21J871j931l34
3838h70J902j288q16K138j145r09J895q43j255J741k35j474K107m64j676K074
3854H82l85j792J753M58k159J365R95k168Q61R63j928R80J507j799QJ669j756
3871e46j20J957j421j099K404q42j331J785n86j155J558k98j496J782M0j783J361
3888B10N59j939J191J165k264J004J213j932J72J574j556j61K015j814Q0J898
3904A415j715q55K096p20j049J548m71j353J771k62j270J456Q0j816J421O56j980
3921a048J353N99j786P85J248j758K51J620j832O4J644j431l82J726j161n82J587
$$ plain form
3805 1664 -811 -746 1638 -392 -1014 1060 -124 -1061 917 86 -1175 1097 314 -1143 823 643 -1294
3822 -1294 444 1009 -1641 313 1259 -969 -91 1335 -912 -208 1208 -597 -476 1395 -536 -870
3838 -870 1032 -256 -1072 1066 -79 -988 907 64 -1191 550 315 -1159 948 484 -1192 882
3854 882 497 -1295 458 916 -1243 122 1117 -1051 -190 773 -1155 -175 1332 -467 -459 1210 -546
3871 -546 -666 1291 -130 -1229 1175 333 -998 787 201 -954 604 306 -1190 592 632 -1151 210
3888 210 769 -1170 21 1186 -1078 -74 1139 -793 -621 953 -603 -764 1251 -563 -483 1415
3904 1415 -300 -1155 941 221 -828 720 249 -1104 667 405 -865 591 671 -1145 276 932 -1048
3921 -1048 305 904 -882 -97 1151 -607 -356 1264 -568 -504 1140 -291 -673 1053 -108 -690 897
3938H97r91q34J846o71j332J779l18j365J689J10j987J649M83j964J264Q38j848
3955g55P27R07j476K74J300j729M06J345j577k61J839j366m15J704q77r42J769
3972H73p51r06J374m26j046J486k28j301J461J87j640J007N97j373P34Q42j567
3989f77K38J240j496L28J359j650O3J577j231l54J544j000o32J446o12q96J433
4006F80n44r34J502k29j539J699K9j828J348O28j605Q29O90j231M01J221j798
4023f81M90J121j567J72J680j574k02J585q72j105J809p67p93J388o12r05J335
4040E02l00j429J690Q6j568J155N73j545R34N32j352M87R63j440O60R37j391j9
4058e25J502j565j58J495j014j39J148p41p35J574n73j335J654m76q58J080J55
$$ plain form
3938 897 -94 -928 918 247 -1085 694 376 -989 700 810 -1177 472 955 -1009 255 1093 -755
3955 -755 -28 879 -597 -323 977 -752 -346 999 -578 -839 1000 -366 -781 923 46 -896 873
3972 873 122 -784 590 164 -882 604 376 -925 536 723 -917 90 687 -686 48 890 -677
3989 -677 -439 801 -695 -367 992 -658 -595 982 -249 -603 941 -59 -691 755 143 -753 680
4006 680 136 -798 704 475 -1064 635 664 -1164 184 812 -793 36 726 -505 -104 1117 -681
4023 -681 -191 930 -637 -465 1215 -359 -561 1024 152 -953 856 89 -704 684 72 -833 502
4040 502 202 -1227 463 549 -1019 136 709 -836 98 630 -722 -235 728 -712 -52 885 -506 -525
4058 -525 977 -588 -746 749 -265 -404 744 3 -732 842 269 -1066 588 112 -746 334 489
4075D89j320J201K18j210P43O54j416N64O23j177M28P27j171M02R32j296K11J024
4093F26p31l99J110p38n05J327n98r62J372l95q98J422j5j854J456O19j681R35
4111I1Q37j461L80R61j577Q97M98j240J10J252j076j85J306r59l39J356p96q23
4129g68J512o09o01Q82j8j162J178j02j092R69K41j162Q67M56j252O53P87j269
4147d90R6J059r93K08J013j469J0J398j191l23J463p26n75J096m94r81J497n18
4165H0q59J204M0j165J096J79j284J029N53j545P50N85j313N24J041j297J64J139
$$ plain form
4075 489 -831 370 588 -622 121 775 -641 -77 546 -631 -203 524 -647 -245 687 -609 -398 626
4093 626 -105 -504 606 -132 -637 690 92 -870 502 107 -791 631 616 -1238 218 837 -844 91
4111 91 928 -533 -153 808 -769 128 626 -614 -504 748 -328 -513 793 -166 -505 851 55 -768
4129 -768 744 135 -466 416 398 -764 414 312 -780 189 430 -732 135 591 -661 -8 779 -490
4147 -490 -394 665 -328 -120 893 -576 -566 832 -359 -682 781 55 -520 576 82 -899 598 80
4165 80 -779 425 465 -700 396 575 -709 320 873 -672 78 663 -650 -126 915 -382 -218 921
$$ [...]
8191c1
##END NTUPLES=NMR FID
##END=
