##TITLE=1H_Pr 93-I
 200.13MHz, CDCl3,
 8 sc
 
 31.1.2025
##JCAMPDX= 6.0         $$ Bruker NMR JCAMP-DX V2.0
##DATA TYPE= NMR FID
##DATA CLASS= NTUPLES
##ORIGIN= UXNMR, Bruker Analytische Messtechnik GmbH
##OWNER= pz
$$ XWIN-NMR		Version 3.5
$$ Fri Jan 31 16:45:30 2025 Russian Standard Time (UT+4h)  she@DPX200
##.OBSERVE FREQUENCY= 200.1313
##.OBSERVE NUCLEUS= ^1H
##.DELAY= (6, 6)
##.ACQUISITION MODE= SIMULTANEOUS
##.ACQUISITION SCHEME= undefined
##.AVERAGES= 8
##.DIGITISER RES= 18
##SPECTROMETER/DATA SYSTEM= spect
##.PULSE SEQUENCE= zg30
##.SOLVENT NAME= D2O
##.SHIFT REFERENCE= (INTERNAL, D2O, 0, 14.3821)
##AUDIT TRAIL= $$ (NUMBER, WHEN, WHO, WHERE, WHAT)
$$ ##TITLE= Audit trail, XWIN-NMR		Version 3.5
$$ ##JCAMPDX= 5.01
$$ ##ORIGIN= Bruker BioSpin GmbH
$$ ##OWNER= she
$$ F:/spectra/data/she/nmr/H-C/1/audita.txt
$$ ##AUDIT TRAIL=  $$ (NUMBER, WHEN, WHO, WHERE, WHAT)
(   1,<2025-01-31 16:44:33.20 +0400>,<she>,<DPX200>,
      <created by zg, POWCHK disabled, PULCHK disabled
       configuration hash MD5:
       00 E9 B6 7A A2 85 ED C7 34 08 36 98 17 FE 4E 26
       data hash MD5: 16K
       FC B9 63 C7 9C F7 34 BA 71 56 91 B8 89 C7 E5 A4>)
$$ ##END=
$$ 
$$ hash MD5
$$ 3F 91 C8 5C A0 AA 08 B7 E1 6F 0C 3C 6A AD 7E B7
##$RELAX= 
##$RELAX= 
##$RELAX= 
##$RELAX= 
##$RELAX= 
##$RELAX= 
$$ Bruker specific parameters
$$ --------------------------
##$DU= <F:/spectra>
##$EXPNO= 1
##$NAME= <H-C>
##$PROCNO= 1
##$TYPE= <nmr>
##$USER= <she>
##$AMP= (0..31)
100 100 100 100 100 100 100 100 100 100 100 100 100 100 100 100 100 100 
100 100 100 100 100 100 100 100 100 100 100 100 100 100 
##$AQSEQ= 0
##$AQ_mod= 1
##$AUNM= <au_zg>
##$AUTOPOS= <>
##$BF1= 200.13
##$BF2= 200.13
##$BF3= 200.13
##$BF4= 200.13
##$BF5= 200.13
##$BF6= 200.13
##$BF7= 200.13
##$BF8= 200.13
##$BYTORDA= 1
##$CFDGTYP= 0
##$CFRGTYP= 5
##$CHEMSTR= <none>
##$CNST= (0..31)
1 1 145 1 1 1 1 1 1 1 1 1 1 1 1 1 1 1 1 1 1 1 1 1 1 1 1 1 1 1 1 1 
##$CPDPRG= <>
##$CPDPRG1= <>
##$CPDPRG2= <>
##$CPDPRG3= <>
##$CPDPRG4= <mlev>
##$CPDPRG5= <mlev>
##$CPDPRG6= <mlev>
##$CPDPRG7= <mlev>
##$CPDPRG8= <mlev>
##$CPDPRGB= <>
##$CPDPRGT= <>
##$D= (0..31)
0 0.7 0 0 0 0 0 0 0 0 0 0.03 0 0 0 0 0 0 0 0 0 0 0 0 0 0 0 0 0 0 0 0 
##$DATE= 1738327472
##$DBL= (0..7)
120 120 120 120 120 120 120 120 
##$DBP= (0..7)
150 150 150 150 150 150 150 150 
##$DBP07= 0
##$DBPNAM0= <>
##$DBPNAM1= <>
##$DBPNAM2= <>
##$DBPNAM3= <>
##$DBPNAM4= <>
##$DBPNAM5= <>
##$DBPNAM6= <>
##$DBPNAM7= <>
##$DBPOAL= (0..7)
0.5 0.5 0.5 0.5 0.5 0.5 0.5 0.5 
##$DBPOFFS= (0..7)
0 0 0 0 0 0 0 0 
##$DE= 6
##$DECBNUC= <off>
##$DECIM= 32
##$DECNUC= <off>
##$DECSTAT= 4
##$DIGMOD= 1
##$DIGTYP= 9
##$DL= (0..7)
0 120 120 120 120 120 120 120 
##$DP= (0..7)
150 150 150 150 150 150 150 150 
##$DP07= 0
##$DPNAME0= <>
##$DPNAME1= <>
##$DPNAME2= <>
##$DPNAME3= <>
##$DPNAME4= <>
##$DPNAME5= <>
##$DPNAME6= <>
##$DPNAME7= <>
##$DPOAL= (0..7)
0.5 0.5 0.5 0.5 0.5 0.5 0.5 0.5 
##$DPOFFS= (0..7)
0 0 0 0 0 0 0 0 
##$DQDMODE= 0
##$DR= 18
##$DS= 0
##$DSLIST= <SSSSSSSSSSSSSSS>
##$DSPFIRM= 0
$$ [...]
##$SUBNAM0= <"">
##$SUBNAM1= <"">
##$SUBNAM2= <"">
##$SUBNAM3= <"">
##$SUBNAM4= <"">
##$SUBNAM5= <"">
##$SUBNAM6= <"">
##$SUBNAM7= <"">
##$SUBNAM8= <"">
##$SUBNAM9= <"">
##$SW= 18.0517328524113
##$SWIBOX= (0..15)
0 0 2 0 0 0 0 0 0 0 0 0 0 0 0 0 
##$SW_h= 3612.71676300578
##$TD= 16384
##$TD0= 1
##$TE= 0
##$TE2= 300
##$TE3= 300
##$TEG= 300
##$TL= (0..7)
0 120 120 120 120 120 120 120 
##$TP= (0..7)
150 150 150 150 150 150 150 150 
##$TP07= 0
##$TPNAME0= <>
##$TPNAME1= <>
##$TPNAME2= <>
##$TPNAME3= <>
##$TPNAME4= <>
##$TPNAME5= <>
##$TPNAME6= <>
##$TPNAME7= <>
##$TPOAL= (0..7)
0.5 0.5 0.5 0.5 0.5 0.5 0.5 0.5 
##$TPOFFS= (0..7)
0 0 0 0 0 0 0 0 
##$TUNHIN= 0
##$TUNHOUT= 0
##$TUNXOUT= 0
##$USERA1= <user>
##$USERA2= <user>
##$USERA3= <user>
##$USERA4= <user>
##$USERA5= <user>
##$V9= 5
##$VALIST= <valist>
##$VCLIST= <CCCCCCCCCCCCCCC>
##$VD= 0
##$VDLIST= <DDDDDDDDDDDDDDD>
##$VPLIST= <PPPPPPPPPPPPPPP>
##$VTLIST= <TTTTTTTTTTTTTTT>
##$WBST= 1024
##$WBSW= 4
##$XGAIN= (0..3)
0 0 0 0 
##$XL= 0
##$YL= 0
##$YMAX_a= 388859
##$YMIN_a= -380992
##$ZGOPTNS= <>
##$ZL1= 120
##$ZL2= 120
##$ZL3= 120
##$ZL4= 120
##$ABSF1= 10
##$ABSF2= 0
##$ABSG= 5
##$ABSL= 3
##$ALPHA= 0
##$AQORDER= 0
##$ASSFAC= 0
##$ASSFACI= 0
##$ASSFACX= 0
##$ASSWID= 0
##$AUNMP= <proc_1d>
##$AZFE= 0.1
##$AZFW= 0.1
##$BCFW= 1
##$BC_mod= 2
##$BYTORDP= 1
##$COROFFS= 0
##$CY= -3
##$DATMOD= 1
##$DC= 2
##$DFILT= <>
##$DTYPP= 0
##$F1P= 0
##$F2P= 0
##$FCOR= 0.5
##$FTSIZE= 0
##$FT_mod= 4
##$GAMMA= 1
##$GB= 0.15
##$INTBC= 1
##$INTSCL= 1
##$ISEN= 128
##$LB= 0.25
##$LEV0= 0
##$LPBIN= 0
##$MAXI= 10000
##$MC2= 0
##$MEAN= 0
##$ME_mod= 0
##$MI= 1.114404
##$NCOEF= 0
##$NC_proc= 0
##$NLEV= 6
##$NOISF1= 3.799351
##$NOISF2= 2.8
##$NSP= 1
##$NTH_PI= 0
##$NZP= 0
##$OFFSET= 14.38212
##$PC= 1
##$PHC0= 90.71405
##$PHC1= 15.19223
##$PH_mod= 1
##$PKNL= yes
##$PPARMOD= 0
##$PSCAL= 0
##$PSIGN= 0
##$REVERSE= no
##$SF= 200.129724274929
##$SI= 16384
##$SIGF1= 3
##$SIGF2= 2
##$SINO= 400
##$SIOLD= 16384
##$SREGLST= <1H.CDCl3>
##$SSB= 0
##$STSI= 0
##$STSR= 0
##$SW_p= 3205.1282051282
##$SYMM= 0
##$S_DEV= 0
##$TDeff= 0
##$TDoff= 0
##$TI= <>
##$TILT= no
##$TM1= 0
##$TM2= 0
##$TOPLEV= 0
##$USERP1= <user>
##$USERP2= <user>
##$USERP3= <user>
##$USERP4= <user>
##$USERP5= <user>
##$WDW= 1
##$XDIM= 8192
##$YMAX_p= 0
##$YMIN_p= 0
$$ End of Bruker specific parameters
$$ ---------------------------------
##NTUPLES= NMR FID
##VAR_NAME=  TIME,          FID/REAL,        FID/IMAG
##SYMBOL=    X,             R,               I
##VAR_TYPE=  INDEPENDENT,   DEPENDENT,       DEPENDENT
##VAR_FORM=  AFFN,          ASDF,            ASDF
##VAR_DIM=   8192,          8192,            8192
##UNITS=     SECONDS,       ARBITRARY UNITS, ARBITRARY UNITS
##FACTOR=    0.0002768,     1,               1
##FIRST=     0,             0,               0
##LAST=      2.2672688,     0,               0
##MIN=       0,             -380992,         0
##MAX=       2.2672688,     388859,          0
$$ Real data points
##PAGE= N=1
##DATA TABLE= (X++(R..R)), XYDATA
0 0 0 0 0 0 0 0 0 0 0 0 0 0 0 0 0 0 4 -8 8 -8 8 -13 16 -16 20 -24 29 -33 40 -44 52 -60 68 -76 88 -100 114 -126
38 -126 142 -159 178 -198 221 -245 272 -301 333 -367 406 -448 492 -542 596 -655 723 -798 879
57 879 -972 1079 -1197 1335 -1496 1682 -1905 2168 -2469 2775 -2869 1324 21082 388859 105800
72 105800 -303751 21966 169418 -109505 -44949 185042 -85650 -233452 143964 213523
82 213523 -166648 -110869 191292 38137 -150134 48773 78043 -125142 -14688 165452
92 165452 -43848 -153005 111309 135041 -127584 -61439 126722 -33213 -132439 89532 110099
103 110099 -110905 -56291 124589 8672 -95730 61225 59259 -133074 -43270 149497 10208
114 10208 -135868 31603 112535 -59930 -70081 86100 16288 -120109 7696 105573 -47377
125 -47377 -79933 83663 58947 -93639 -28820 90270 -8999 -90215 24543 59971 -41507
136 -41507 -17724 56409 -12685 -45196 44510 22154 -80954 -16087 87204 -1796 -79336 26901
148 26901 66179 -32330 -19876 44416 -29597 -58550 59882 57196 -78794 -42570 94086 32419
160 32419 -77872 1936 54941 -42610 -34397 64123 4028 -75353 25881 80563 -40274 -60800
172 -60800 58854 31244 -76145 -4060 75207 -23499 -57514 50130 38626 -58540 -8824
183 -8824 58435 -28603 -60814 50703 43229 -68573 -16470 75229 -9132 -62785 33521 37736
195 37736 -55698 -11928 64911 -20118 -65428 50673 56275 -67862 -31445 71185 -2923 -64535
207 -64535 32788 45011 -59534 -22966 73598 -3125 -71708 32308 54700 -58555 -28214
218 -28214 72980 -530 -71204 28076 59262 -44964 -31870 58417 -400 -62903 30316 51530
230 51530 -56128 -31203 68610 7014 -64886 19241 52201 -40328 -31440 53885 3706 -58732
242 -58732 25371 54177 -44754 -35646 55803 12478 -55835 10789 46387 -33548 -32169 50073
254 50073 12801 -56624 8855 49480 -30961 -35795 44220 16361 -49470 5044 49914 -21835
266 -21835 -39481 37044 21805 -46555 -1438 44761 -19434 -35659 34596 21026 -43465 -4965
278 -4965 44105 -13919 -38769 30265 24993 -40779 -4994 44256 -13963 -38829 29430 27859 -39330
291 -39330 -12424 44259 -4559 -40690 22318 29408 -36035 -14155 39963 -4454 -38148 19577
303 19577 30158 -30821 -16988 38536 1615 -38088 15958 31412 -28677 -18018 35695 3180
315 3180 -36360 10225 30949 -22658 -21628 31318 7415 -34697 8072 30465 -21644 -21195 29666
328 29666 8934 -32407 4321 31072 -16442 -23721 27658 12212 -32930 2489 32278 -15579
340 -15579 -25702 24464 14687 -30781 -3597 30949 -10253 -27051 22309 17780 -29161 -3828
352 -3828 31132 -8734 -26606 19695 18929 -27220 -8198 31036 -4502 -29659 16611 21738 -25852
365 -25852 -10572 28707 -2102 -27027 13367 21359 -22811 -12688 28414 905 -28528 12119
377 12119 23400 -21175 -12329 27266 1275 -27727 9586 23739 -20211 -16772 26799 4885
389 4885 -29414 7222 25201 -17568 -16551 23866 6150 -25488 5490 24208 -15331 -17533 23273
402 23273 6946 -26511 4868 23989 -15025 -17508 21291 8710 -24019 674 22426 -11411
414 -11411 -18028 19686 9701 -23798 -150 22889 -7887 -17291 15018 11099 -18650 -2411 20841
427 20841 -6247 -18962 13573 12039 -19745 -4668 21107 -2958 -19758 9356 15677 -14918
439 -14918 -8810 19190 112 -20171 8938 17653 -14468 -10620 17597 1599 -18953 7338 18018
452 18018 -15743 -14098 21194 6236 -22207 3689 18118 -13998 -12546 20371 5123 -22873
464 -22873 3922 22403 -11968 -16246 19633 8009 -21717 1830 17690 -11875 -10905 19246 2612
477 2612 -24341 4431 24197 -10792 -18361 15341 7181 -17957 4554 18233 -12320 -14962 16597
490 16597 9673 -17411 -2047 16168 -6647 -13067 13109 8167 -14596 -1541 12517 -5890 -10567
503 -10567 10675 7320 -14560 -3520 15867 -1326 -13340 8214 10508 -12315 -6651 14186 3207
516 3207 -13250 1248 9965 -8420 -6352 14933 2126 -18107 1399 15547 -5568 -9733 10082
529 10082 2875 -14337 4162 17146 -9519 -14413 13704 6916 -16587 2192 17554 -8906 -15288
542 -15288 13052 10142 -14967 -2453 13716 -8182 -12190 15133 7824 -16589 -561 14907 -6251
555 -6251 -10593 12566 6273 -15647 -1105 15054 -5025 -10298 10901 3325 -15697 1296 16016
568 16016 -4114 -12899 5855 7090 -8649 -851 10921 -3962 -10553 6683 7317 -7208 -1855
581 -1855 8322 -2654 -9969 5604 11487 -6115 -9533 5518 3168 -6005 3134 6367 -8492 -7651
595 -7651 10995 7799 -10815 -3655 10824 -2134 -9382 7921 6972 -10479 -2577 10362 -3447
608 -3447 -9605 9182 7795 -13803 -5068 14481 -286 -11367 6739 5641 -12884 -776 15649
621 15649 -2504 -13604 6453 8635 -10573 -1256 14446 -4991 -14766 8610 10894 -9638 -4266
634 -4266 8827 -3747 -9323 8964 8159 -11670 -4522 11890 -336 -9112 6016 6368 -8805 -3492
648 -3492 8947 78 -7732 3824 6176 -7974 -4418 10104 2253 -9411 2 6433 -3315 -4302
662 -4302 6104 2712 -8103 -803 8542 -1544 -5964 5268 2596 -8466 308 10618 -1583
675 -1583 -10158 3350 7008 -6613 -2869 8628 -3006 -9911 7143 8619 -8849 -4416 10139
688 10139 117 -9957 4382 8229 -8156 -4230 10037 -1313 -9322 7018 7297 -10475 -4577
701 -4577 10931 224 -10340 4080 7569 -8380 -3647 10875 -497 -9965 4511 7078 -7184
714 -7184 -3269 9135 261 -9082 3069 7488 -5763 -4144 6881 -994 -7895 3989 6835 -5640
728 -5640 -4670 6930 2541 -7085 700 6607 -4020 -5186 5854 2894 -5993 85 5920 -2365 -5158
743 -5158 4451 3549 -6661 -1613 7117 -1647 -6400 4435 4568 -6038 -2328 6788 -283 -6747 3609
758 3609 6219 -6143 -3529 8287 747 -7991 2052 5752 -5052 -3699 6592 648 -7623 2776
772 2776 7374 -5750 -5022 7734 1346 -8184 2035 6996 -4641 -4825 7096 2420 -8039 1152
786 1152 7616 -4781 -5784 6839 2282 -7593 856 6849 -3910 -5430 6310 2885 -7869 522
800 522 8190 -3688 -6110 6687 3626 -7471 -434 7283 -2643 -6656 4964 4187 -7172 -1202
814 -1202 7660 -2227 -6326 5002 3896 -6592 -1372 7093 -1480 -6553 4438 5285 -6455 -2151
828 -2151 7647 -954 -6981 3668 5128 -5605 -3060 6463 291 -6867 2518 5640 -5347 -3239
842 -3239 6818 420 -6537 2729 5801 -4476 -3778 6284 1381 -7244 1455 6589 -4521 -4895 6276
857 6276 1985 -6795 693 6284 -3223 -5071 5381 2807 -6813 312 6902 -3325 -5143 5769
871 5769 2880 -6641 -114 6889 -2466 -6116 4900 3996 -6959 -1264 7061 -2170 -6104 4513 3907
886 3907 -5909 -1352 6773 -974 -6065 3986 4707 -5930 -1825 6763 -1484 -6360 3859 4809 -5691
901 -5691 -2839 6566 232 -6770 2651 5565 -5312 -3309 6453 403 -6262 2461 5368 -4375 -3430
916 -3430 6257 1239 -6772 1852 6050 -4782 -4100 6391 1140 -7191 1199 6297 -3661 -4684 5851
931 5851 2384 -7092 933 7013 -3527 -4956 5518 2203 -6193 793 6150 -3545 -5273 5637
945 5637 2956 -6940 182 6598 -3451 -5313 5336 3041 -6229 -627 6081 -1942 -5004 4702 3494
960 3494 -5922 -901 6015 -1545 -4518 3580 2552 -5243 -1175 5684 -822 -5602 2575 3894 -4399
975 -4399 -1468 5630 -502 -5538 2055 4744 -3114 -3071 4429 925 -5372 1455 5186 -3423 -3757 4488
991 4488 1306 -5209 1103 5462 -3437 -5355 4905 3360 -5764 25 5866 -3338 -4671 5967 3442
1006 3442 -6625 -1055 6338 -2019 -5176 5112 2913 -7470 -531 7161 -2531 -5235 5232 2543
1020 2543 -6911 187 7620 -2418 -6334 4695 3351 -6166 424 6761 -3240 -5699 4636 3233
1034 3233 -5119 -226 5074 -2960 -4929 5049 3397 -5773 -1267 4689 -1486 -3189 3996 2512 -4870
1049 -4870 -1598 4927 262 -3955 1850 2598 -3752 -1489 4364 569 -4200 148 2981 -1863 -1817 4042
1065 4042 910 -5411 194 5224 -1440 -3573 3132 1809 -4692 -141 5867 -1296 -5375 2863 3141
1080 3141 -4721 -134 5824 -2680 -6001 3856 4214 -4660 -1150 5331 -2283 -5069 5666 4163 -6942
1095 -6942 -1517 6421 -1810 -4845 4798 3139 -6682 -1427 6468 -1219 -4966 3971 2255 -6147 393
1110 393 6591 -2217 -5104 3439 2562 -4506 244 5482 -2166 -5003 3558 3187 -3997 -466 3926 -1994
1126 -1994 -3909 3004 3326 -3220 -2199 2916 12 -2494 2470 2395 -3506 -1740 3582 1031 -2995 410
1142 410 2575 -2267 -2371 3597 1921 -4135 -767 3408 -1141 -2409 2926 1816 -4219 -991 4640
1157 4640 -429 -3917 2434 2414 -4117 -364 5101 -1130 -4437 2583 2751 -4145 -807 5263 -1565 -5507
1173 -5507 3026 3945 -4093 -1227 4428 -1489 -3931 3651 3430 -4569 -1600 4735 -849 -4051 3367
1188 3367 2713 -4833 -1086 4687 -724 -3787 2389 2419 -3942 -1027 4618 -467 -4196 1901 2721 -3009
1204 -3009 -911 3621 -379 -3360 1639 2745 -2470 -1518 3227 -237 -3744 1520 3169 -2362 -2285 2620
1220 2620 824 -2834 635 3173 -1826 -2616 2942 1671 -3152 -57 2993 -1549 -2558 2637 1654
1235 1654 -3341 -564 3414 -1242 -3046 2771 1789 -3805 -493 3803 -928 -3217 2252 2299 -3133 -780
1251 -780 3842 -675 -3372 2301 2161 -3328 -618 3498 -1005 -3357 2069 2435 -3046 -1083 3548 -556
1267 -556 -3329 2261 2622 -2971 -1179 3275 -125 -3064 1404 2470 -2551 -1529 3089 90 -3067
1282 -3067 1354 2324 -2456 -1334 2903 231 -3099 821 2796 -2021 -1856 2907 759 -3073 689
1297 689 2765 -1731 -1968 2316 846 -2916 148 2799 -1515 -2243 2510 999 -2959 354 2792 -1319
1313 -1319 -2196 2335 1479 -2883 -269 3113 -1068 -2572 2225 1565 -2738 -299 2743 -901 -2378 1781
1329 1781 1569 -2628 -573 2854 -820 -2536 2014 1692 -2528 -519 2784 -406 -2512 1452 2015 -2282
1345 -2282 -1097 2617 -223 -2577 1188 1807 -2041 -1001 2393 20 -2342 955 2055 -1854 -1283
1360 -1283 2536 184 -2515 923 2112 -1656 -1473 2139 600 -2338 243 2253 -1387 -1736 1958
1375 1958 599 -2241 362 2034 -1148 -1549 1887 1013 -2169 -20 2376 -989 -2018 1813 1055 -2265
1391 -2265 -284 2246 -633 -2033 1357 1492 -2064 -629 2330 -364 -2053 1430 1361 -1925 -500 2221
1407 2221 -332 -2135 1251 1763 -2005 -983 2485 -172 -2469 1096 1752 -1879 -1068 2087 43 -2214
1423 -2214 940 1952 -1666 -982 2315 19 -2138 1024 1706 -1730 -971 1989 143 -2158 662 1887
1439 1887 -1629 -1190 2029 322 -2016 524 1551 -1146 -1028 1645 500 -1780 278 1646 -993
1454 -993 -1078 1566 404 -1798 155 1621 -696 -1437 959 806 -1565 -276 1751 -349 -1589 963
1470 963 1212 -1147 -432 1494 -177 -1652 784 1496 -1313 -862 1675 -144 -1771 970 1449 -1573
1486 -1573 -1099 1878 370 -1974 556 1736 -1584 -1144 2134 374 -1957 564 1533 -1329 -788 1976
1502 1976 119 -2337 511 1755 -1400 -1002 1875 -86 -2163 818 1847 -1115 -1026 1473 232 -1532
1518 -1532 737 1605 -1272 -1126 1335 299 -1146 487 954 -1147 -826 1275 522 -1253 -77 983
1534 983 -683 -770 1070 552 -1237 -419 1068 284 -713 376 633 -1039 -632 1279 272 -1174 -18
1551 -18 784 -636 -550 1290 352 -1724 47 1653 -499 -930 1306 201 -1819 356 1933 -668 -1459
1568 -1459 1057 539 -1477 466 1653 -1268 -1558 1521 689 -1412 515 1297 -1434 -1228 1859 804
1584 804 -1725 120 1413 -1031 -646 1717 94 -1829 52 1170 -569 -572 1044 -94 -1464 485
1600 485 1356 -592 -633 718 -116 -822 587 975 -646 -1061 472 626 -324 -47 380 -422 -698 398
1618 398 707 -233 -687 102 247 -466 211 841 -608 -1002 702 800 -554 -147 777 -459 -1073 991 1084
1637 1084 -1310 -632 1144 -266 -953 1081 663 -1519 -438 1412 -26 -967 957 522 -1632 30
1653 30 1856 -482 -1367 983 574 -1255 233 1431 -765 -1406 929 756 -1091 71 1085 -944
1669 -944 -853 1233 548 -977 23 782 -524 -527 1080 327 -1180 -93 875 -282 -433 588 62 -750
1687 -750 -38 788 156 -510 52 256 -309 15 625 -49 -576 -37 567 -42 -338 270 202 -688 -108 887
1707 887 -134 -874 294 447 -519 -121 820 -60 -952 326 920 -517 -310 900 -210 -905 612 752
1725 752 -871 -435 864 -113 -918 642 782 -1077 -427 1109 -32 -867 538 576 -859 -216 993
1742 993 -24 -878 459 567 -740 -158 874 -381 -868 469 452 -710 -298 673 -110 -795 389 726
1760 726 -514 -282 612 -11 -488 315 449 -392 -354 456 172 -502 95 450 -364 -372 480 215 -555 -76 558
1781 558 -108 -472 400 383 -595 -203 661 -70 -545 283 405 -426 -245 548 -64 -663 235 533 -645 -287
1801 -287 711 -41 -639 237 622 -486 -352 556 133 -701 168 622 -532 -381 524 66 -610 174 507
1820 507 -373 -456 605 120 -719 203 626 -474 -380 649 158 -625 65 581 -251 -510 425 256 -652 -44
1840 -44 529 -301 -444 370 218 -535 60 520 -136 -458 533 366 -547 -88 618 -199 -506 401 315 -471 -228
1861 -228 501 -53 -503 276 324 -521 -75 505 -81 -510 243 353 -380 -237 524 57 -564 210 468 -395
1881 -395 -206 444 40 -505 95 389 -278 -335 437 166 -441 99 442 -283 -298 432 186 -465 77 450 -208
1902 -208 -435 427 241 -537 0 485 -150 -446 293 198 -426 -87 399 -64 -406 258 337 -376 4 500 -123
1923 -123 -375 268 315 -402 -227 403 -28 -581 167 390 -342 -183 421 50 -370 142 304 -248 -317 379 70
1944 70 -481 146 416 -315 -288 485 142 -502 21 463 -263 -452 435 262 -611 9 555 -227 -331 461 180
1965 180 -498 -16 505 -236 -403 376 202 -562 80 566 -365 -463 379 225 -414 21 504 -178 -416 414
1985 414 266 -467 20 329 -251 -289 376 129 -358 -44 357 -122 -295 279 126 -447 -66 433 -4 -212
2005 -212 45 143 -127 -105 308 123 -313 -2 262 -19 -148 155 90 -285 -57 406 -35 -369 190 287 -332
2026 -332 33 487 -108 -499 117 386 -283 -188 390 -76 -570 347 456 -483 -193 455 -195 -443 389 339 -642
2047 -642 -230 635 -17 -523 359 312 -664 -61 689 -60 -471 316 166 -458 58 579 -271 -446 390 289
2067 289 -363 145 344 -368 -319 398 275 -254 -109 273 -148 -187 294 217 -289 -163 95 61 21 49 -21 -199
2089 -199 -110 257 147 -180 -86 35 -23 -77 221 228 -259 -237 277 188 -238 96 200 -282 -160 466 254 -382 -77
2112 -77 240 -168 -133 443 21 -612 150 490 -234 -147 478 -91 -621 269 620 -400 -366 468 -44 -517 366
2133 366 379 -530 -240 526 15 -345 314 188 -523 -82 612 19 -421 262 106 -385 59 430 -139 -413
2153 -413 131 198 -187 -12 238 -233 -267 217 277 -74 -114 69 -53 -108 152 254 -162 -265 103 133 -38 -47 107
2176 107 -117 -238 90 271 -35 -199 117 154 -196 128 236 -235 -268 255 112 -204 79 231 -302 -269 428
2197 428 106 -473 9 266 -198 -139 403 16 -463 19 417 -155 -213 347 41 -415 237 376 -261 -191 283
2218 283 -78 -345 220 288 -320 -284 352 115 -210 112 207 -223 -168 256 67 -199 29 116 -165 -82 265 19
2240 19 -280 4 165 -115 -131 186 97 -197 -42 250 -13 -204 93 143 -124 -75 237 28 -189 40 180 -144
2262 -144 -137 161 -61 -298 122 233 -159 -131 247 3 -248 92 346 -160 -221 282 51 -262 31 240 -219
2283 -219 -161 218 24 -319 53 210 -215 -165 326 1 -308 47 216 -222 -75 283 77 -247 75 275 -151
2304 -151 -126 155 -7 -206 58 207 -108 -193 94 35 -150 41 209 -90 -160 185 125 -152 -73 167 -39 -151
2326 -151 142 180 -169 -86 246 6 -177 99 98 -168 -93 159 25 -250 52 225 -91 -174 268 51 -217 52
2348 52 193 -158 -148 130 76 -250 53 181 -133 -146 197 71 -194 130 185 -163 -150 269 51 -234 15 227
2370 227 -95 -226 142 100 -184 -15 182 -95 -168 148 77 -216 -9 225 -137 -121 143 49 -214 14 277 -86
2392 -86 -209 130 126 -187 -72 178 -60 -165 116 105 -133 23 169 -4 -123 72 97 -131 -36 188 -26 -206
2414 -206 38 118 -165 -76 131 2 -185 31 178 -108 -125 188 62 -121 31 137 -67 -22 129 85 -171 66
2436 66 215 -105 -171 155 94 -172 27 126 -67 -110 76 106 -193 10 201 -76 -195 194 61 -215 18 172
2458 172 -89 -127 172 62 -202 33 195 -118 -151 108 138 -192 16 136 -70 -127 95 132 -73 5 156 -43
2480 -43 -102 151 57 -114 -43 143 -48 -99 103 56 -117 -93 182 50 -82 -35 45 -40 -84 110 53 -165 16 79
2504 79 -52 -45 114 41 -176 -25 137 -70 -190 143 78 -178 -55 254 -75 -217 96 78 -83 23 118 -67
2526 -67 -96 152 123 -160 -4 215 -126 -129 184 135 -199 -63 210 -63 -83 88 87 -167 3 178 -10 -100 98
2549 98 -8 -123 28 137 -18 -68 90 55 -43 106 116 -117 -155 31 89 -34 -22 6 34 -15 -6 152 -17 -64 17
2574 17 86 11 16 44 -1 -155 19 122 -48 -115 27 7 -103 122 146 -145 -202 140 55 -172 46 116 -169 -139 208
2599 208 21 -141 78 38 -129 19 280 16 -251 103 141 -166 22 238 -69 -238 136 132 -97 -48 150 -137
2621 -137 -115 229 112 -143 -40 102 -51 -15 167 -31 -183 38 139 2 -70 50 11 -106 19 162 -11
2642 -11 -37 -2 -43 8 14 -9 16 -9 -37 67 64 43 -37 41 -50 -36 84 18 -138 -64 155 -16 -91 33 37 -173 -53 188
2670 188 -24 -165 85 17 -150 35 216 -143 -107 178 10 -149 102 130 -214 -139 244 37 -173 28 113 -162
2692 -162 -10 237 -2 -211 48 157 -95 77 150 -86 -190 129 185 -127 3 80 -96 -73 170 58 -96
2713 -96 -52 -32 -3 -52 102 70 -116 -7 130 40 6 -21 -36 23 23 42 78 -17 -72 20 39 -24 -36 71 -40 -68 136
2740 136 57 -53 -35 77 47 -55 110 52 -120 33 93 -54 -109 81 -10 -203 -24 208 -51 -122 114 25 -148
2763 -148 43 134 -9 -114 125 20 -116 50 91 -117 -115 94 17 -162 44 94 -99 -69 149 58 -121 11 92
2786 92 -80 -76 89 31 -71 1 72 -20 -45 44 -17 -97 68 39 -101 4 22 -44 10 -24 27 -55 -142 35 39 -63 3
2813 3 38 8 -62 -19 22 37 -78 35 -20 -25 -7 93 -88 -40 26 6 -70 -23 53 -19 -49 99 61 -80 -69 102 -52
2840 -52 -19 62 -28 -75 -1 82 -81 -99 60 80 -92 20 137 -25 -61 72 119 -94 16 113 8 -73 67 116 -63
2865 -63 5 83 -16 -74 28 27 -46 -4 71 -24 -81 49 89 -15 -46 143 -6 -61 44 36 -53 -54 67 27 -120 21 78
2892 78 -85 -15 62 55 -89 39 92 -69 -56 109 22 -93 91 45 -62 -49 68 46 -15 -70 53 -7 -33 54 26 -62
2918 -62 -5 67 -87 -28 10 37 -35 -18 99 -12 -60 34 75 -93 -59 105 -37 -112 63 91 -111 -47 58 -37 35 71
2944 71 33 -45 -22 82 15 -77 20 43 -39 -2 54 -23 -93 -7 59 -45 -26 3 8 -18 9 24 -18 -39 0 33 -35 -8 53 -14
2974 -14 -89 21 14 -77 -21 72 -23 -63 26 67 -26 32 122 13 -94 40 52 -88 -42 139 33 -87 105 95 -89 -35
3000 -35 85 -40 -136 47 44 -124 16 143 -30 -167 80 75 -60 21 105 -91 -55 133 47 -43 8 58 -91 -111 87
3025 87 56 -98 -62 40 -28 14 40 66 -28 -21 11 17 43 18 -10 -28 10 43 4 3 -76 -30 61 -46 5 -2 -106 -71 84 95
3055 95 -73 -69 62 -5 -90 76 66 -157 6 71 -19 -75 63 25 -180 19 147 -47 -105 159 -21 -137 79 124
3079 124 -124 -171 121 -4 -105 76 84 -91 -147 129 -31 -96 49 9 -124 41 175 -62 -98 53 71 -94 85
3102 85 163 -100 -74 86 82 10 20 8 -112 -54 81 27 -93 -58 -18 18 90 128 -17 -43 10 -15 131 34 18 -44 21
3129 21 -18 -15 77 -21 -196 -59 49 -4 -35 52 -11 -68 50 74 -80 -38 97 -3 -47 130 151 -123 -81 152 37
3154 37 -83 113 25 -160 9 133 -72 -64 92 -53 -134 106 158 -100 -122 51 -73 -36 133 88 -220 -30 128
3177 128 15 -120 37 18 -114 60 154 -10 -28 80 19 -35 106 42 -17 -44 33 83 -26 -27 -4 -86 -6 46 59 52
3203 52 -55 -40 68 14 42 28 -15 -99 -65 44 11 1 5 46 -55 -19 121 -65 -147 46 111 -103 -20 100 -107 -124
3229 -124 70 126 -76 -75 144 -63 -5 184 64 -106 18 105 1 -11 102 0 -110 -9 141 -82 -73 42 -20
3252 -20 -70 20 80 -41 -37 57 -5 -35 8 88 -93 -59 92 -61 -45 29 -40 -49 -19 -3 28 -70 31 77 -25 5 30 42
3280 42 23 -1 29 6 -60 29 -22 -6 -3 105 19 -42 -17 55 44 -22 68 81 -83 -13 93 19 -58 33 87 -55 -26 89
3308 89 -23 -90 28 9 -68 25 100 1 -84 94 30 -131 -8 132 -39 -53 91 16 -148 -16 76 -83 -65 67
3332 67 10 -124 60 41 -64 -67 0 39 -108 1 58 -66 -24 9 9 -15 -8 56 46 -37 13 50 -44 -39 18 -16 -52 -21 93
3361 93 -17 -37 28 30 -8 23 78 -32 -21 21 68 -47 -17 58 -10 -27 10 68 -89 -84 77 -15 -2 38 -15 -117 5 119
3389 119 -29 -72 44 44 -72 18 100 -42 -91 76 59 -64 0 109 21 -29 25 80 -68 -41 72 -17 -65 42 50 -45
3415 -45 -23 93 -42 -72 94 102 -50 -51 102 3 -40 27 -10 -59 -6 112 -7 -44 86 92 -65 -37 108 -14 -55 56
3441 56 39 -45 -40 28 34 -116 -47 23 -6 -9 0 43 -16 -16 48 33 -31 88 33 -79 54 63 -31 -53 54 -17 -54 16 47 -3 -59
3472 -59 -37 35 -32 32 27 10 -85 47 21 -22 -74 78 -67 -109 42 50 -108 -61 97 14 -63 41 81 -28 -10 125 57
3499 57 -83 29 33 -70 -36 68 -85 -47 -41 8 -26 -23 23 25 -33 -31 39 -41 -59 16 51 33 48 22 6 -45 16 -5 -22 -27 66
3530 66 -28 -53 69 82 -4 55 66 32 -53 21 108 -24 -30 67 72 -42 33 56 -61 16 56 28 -57 -36 55 -19 -25 58 -38 -76
3560 -76 55 45 -55 -21 131 -9 -139 73 107 -80 -17 82 11 -35 14 22 -26 -74 13 30 -17 47 4 -42 35 50 -19
3587 -19 -84 15 8 7 81 57 -3 -133 -39 27 85 -21 -51 -43 9 -10 5 2 -38 -51 -5 -18 -3 50 19 -30 13 80 5 -52 62
3618 62 61 -70 23 154 -19 -102 33 91 -2 89 123 -82 -92 19 57 -141 60 68 -135 -78 181 59 -75 25 48
3643 48 -98 -88 87 6 -132 49 -11 1 -24 74 -71 -85 143 88 -47 24 53 -20 -50 105 18 -66 -62 -32 2 -25 53
3670 53 -84 -73 49 35 -41 -23 -8 -34 6 28 -24 57 -45 -47 0 112 -1 -90 17 -28 -121 60 78 -48 -152 31
3696 31 40 16 71 33 -74 -70 134 15 19 69 26 -89 8 96 30 -133 70 94 -55 29 129 -71 -141 57 92 -101
3722 -101 16 51 -139 -94 78 46 -82 -15 54 -105 -6 121 -19 -83 -24 87 -67 31 47 -75 -65 74 90 9
3746 9 -12 -27 -19 -54 53 30 27 24 4 -11 -18 -8 -8 -95 16 -37 28 -10 -86 1 23 4 6 -10 -31 -8 -31 49 19 -70 12 -62 -106
3779 -106 14 59 -38 -1 85 15 -56 82 55 -60 -6 45 55 -48 76 57 -41 -24 79 29 -78 11 -28 -16 18 65
3805 65 -38 -94 67 0 -101 -55 11 -26 1 34 18 -68 25 86 7 -22 51 -1 -81 77 6 -45 36 52 -2 -38 18 67
3833 67 16 -21 3 -9 24 12 6 -16 3 16 51 5 -57 14 17 -32 14 -10 -46 -29 -47 17 -4 -45 42 -21 -42 2 5 -33 -30 23
3865 23 -6 -72 -6 30 -53 -4 70 -7 -20 15 45 -71 33 53 -11 -40 10 -16 -39 16 61 3 -42 -19 -48 -20 -7 -21 -42
3894 -42 39 0 58 -34 -19 52 -37 -46 53 33 -51 -63 62 15 -75 -16 7 -11 -20 76 -17 -69 10 56 -7 28 -55 -19 -12 52 0
3925 0 -9 -26 -35 58 -35 45 122 -46 9 48 -19 -18 -81 9 -31 -84 41 44 -38 -3 62 29 -57 25 41 -13 35 38 8 -77 36 27
3957 27 -50 -1 12 -13 -59 -27 78 20 36 -32 -56 -19 -33 31 -35 29 -12 -78 -35 63 35 -89 -9 -33 -63 -14 -50 -32 -62
3986 -62 19 24 5 -3 -34 -12 6 8 34 -18 -36 -8 -20 41 5 46 12 -84 -50 26 30 -24 -13 90 13 -7 -1 29 -44 2 37 -27
4018 -27 -110 12 9 15 12 -10 -7 49 37 -58 -58 -16 -27 -22 -49 19 20 -69 -26 73 -54 -5 68 51 5 3 9 -46 -10 113 -9 30 5
4051 5 9 -10 -21 47 -70 -50 -10 65 -70 17 17 -69 -10 26 -33 23 31 -20 -51 -5 -14 -54 15 39 48 -13 -39 25 -31 51 35 -41
4083 -41 6 40 9 -21 94 -44 -45 9 38 -56 -36 75 -22 -80 29 -22 -37 39 55 -53 1 91 -23 -29 51 70 -79 7
4111 7 54 16 -94 48 -26 -61 40 55 -55 -61 55 6 -45 36 65 -81 -35 56 -11 -33 -3 -14 -44 15 48 9 -27 32
4139 32 19 -34 7 112 -99 24 25 -93 -4 -3 -54 43 15 60 8 23 -33 -19 -17 54 -1 22 34 56 3 -13 74 -51 -2
4168 -2 26 70 35 7 39 -96 0 84 -34 -25 49 -10 -63 20 33 -2 -66 -2 -28 -35 31 65 -62 -58 64 33 13 79 22 -52
4198 -52 28 26 23 -56 50 4 13 43 23 -31 -19 43 -56 -10 37 -55 -115 -13 -6 4 42 -16 28 -64 -8 9 18 -1 -35 -14 74 20
4230 20 -30 -9 -20 -70 -18 8 77 -38 -114 -6 18 -5 -18 -25 -95 -11 44 12 -60 -40 11 9 59 15 -48 -27 12 -15 6 63
4260 63 -20 4 -25 -32 -65 13 -10 -19 -39 -12 26 -60 -13 58 -29 -30 14 23 1 -58 22 -4 -13 25 1 -45 13 -31 -56 2 -32 39 -21
4293 -21 18 31 17 -21 15 0 4 12 13 -32 -44 -29 -47 -35 2 -28 -6 25 17 28 40 -52 -63 -5 18 27 2 47 9 1 -25 -16 -18 -4
4327 -4 76 67 -11 103 11 -18 64 12 -67 30 76 -34 64 35 15 -14 6 -25 -44 -13 25 11 -67 -40 49 -81 -2 1 -31 -24 3
4358 3 0 -20 -36 4 -41 -22 -19 -24 -56 18 110 31 -20 23 20 4 7 15 -28 -14 13 20 7 35 5 1 -5 29 10 -9 -6 -10 -3 -10 -3 36 -16 -53
4396 -53 -2 -9 -27 2 -49 11 -55 -78 47 -36 -39 31 -36 37 5 58 1 3 32 -23 -4 -22 16 -39 -35 55 1 -23 25 -24 22 -31
4428 -31 -18 10 -63 -24 -63 -37 -14 19 -57 -39 7 65 -6 -42 68 18 -8 39 14 21 -42 70 7 -29 -46 -4 5 -11 9 25
4458 25 -24 -11 20 13 65 97 16 -7 -2 -7 -28 -17 64 17 -12 -29 -28 30 -9 12 -30 -39 -41 -3 -12 -3 -66 24 -7 -32 14 -17 -35 10
4492 10 46 -14 -20 28 32 10 -16 -11 -13 31 23 3 -18 -25 29 -12 -1 61 63 -8 -62 67 12 -19 -1 -18 8 68 82 -34 -14 29 20
4525 20 -29 -14 30 -2 -13 14 -35 16 -11 28 28 -9 39 4 -14 -6 36 14 11 -2 29 -1 -17 30 10 -21 6 1 45 -30 45 5
4557 5 3 -29 -8 -13 -60 1 2 0 15 89 -3 -83 0 43 -4 -2 80 -12 -92 -49 -5 14 28 5 50 -84 30 41 -34 -11 8 -45
4589 -45 -44 20 -2 -19 -36 39 -8 -19 40 -28 -60 29 -9 -39 15 24 -87 -15 -13 45 -26 -30 19 -17 -33 37 3 -8 -34 20 -2 -25
4621 -25 -34 -121 -16 -11 -5 -8 46 -50 -62 -39 13 29 -17 -6 14 -29 24 16 -4 35 -46 -1 -24 16 -4 31 -71 -5 -11 -46 13 -36
4653 -36 -78 14 3 -95 -6 35 -38 16 59 7 -30 -21 2 -8 14 23 14 -53 -16 85 -14 -48 25 -22 -34 -13 15 -17 -22 -3 4 -30
4685 -30 89 40 -49 6 20 -56 3 -43 -19 -60 52 11 -52 -41 -33 -34 26 14 -50 -2 3 34 16 79 12 7 -16 -41 7 -31 21
4716 21 55 -61 -54 66 7 -9 66 -10 -23 16 4 -23 9 10 -27 10 20 57 -20 86 7 -9 49 31 -46 -76 9 30 -40 -30
4746 -30 26 13 -14 127 28 -71 3 33 -82 3 44 -69 -31 24 -8 -17 -20 -12 -7 -87 33 6 -79 -29 58 -39 11 71 -7 -33
4776 -33 -54 18 -49 -8 45 -36 -35 26 3 -45 7 -21 -52 11 27 -2 35 10 47 18 35 58 39 -4 31 6 -10 29 -10 -12 -17 -32
4808 -32 -38 -3 -8 -50 -12 57 -26 -27 15 65 -20 -16 39 50 19 32 18 27 13 40 47 -60 36 60 8 88 42 -24 10 53 6 -11 29
4841 29 82 15 -6 18 2 -3 19 -2 13 44 2 -1 7 21 15 -42 -64 -6 4 -27 0 -1 8 -18 1 64 -21 -54 -8 -22 32 -14 2
4874 2 0 2 7 24 8 23 -21 33 -23 6 -12 -35 33 -30 33 -48 2 -3 -28 -15 32 30 -27 -29 16 0 -8 -17 -41 25 30 -41 -28 -7 55
4909 55 28 -40 27 3 15 -36 4 20 -7 -22 17 -18 14 14 71 54 15 -2 34 -11 15 46 -3 46 16 32 2 77 49 -53
4939 -53 -16 16 -41 -66 -18 -4 -60 -29 15 -11 -8 12 -8 -19 9 52 -28 11 -27 47 20 -37 47 -9 -3 -11 -11 -19 -43 19 -21 31 28
4972 28 -19 6 17 23 17 -65 41 9 11 -16 57 -33 -13 7 -11 -19 -66 -17 -8 19 -3 30 -1 16 -32 -27 -2 83 19 0 6 106 -28
5005 -28 3 24 19 -55 17 54 -12 -23 -25 45 -3 2 -3 45 12 -25 8 -8 18 39 -43 -28 18 9 -41 -8 -86 16 -33 -1 -26 1
5037 1 47 -62 -36 -44 -61 7 -2 4 -55 74 42 -32 60 9 24 -7 28 -49 -12 -1 -23 -8 36 -58 -51 -22 -25 -35 -34 48 -1 -54 -29
5070 -29 65 -32 -25 22 19 -52 24 70 -34 -57 78 -5 -29 10 13 -39 -4 37 -45 14 24 -13 -7 37 -19 38 -44 17 -4 -58 -1
5101 -1 -5 -45 -29 -3 2 -24 -6 19 22 -2 -22 -72 -12 62 10 -68 36 -9 -47 24 -56 4 -75 62 30 -17 75 6 -18 -13 -57 -40
5133 -40 62 -14 19 -30 -15 -2 -6 -32 25 -17 -62 47 -28 -20 34 62 -50 12 53 -40 -45 31 23 -27 60 21 -20 -7 -30 27 -35
5164 -35 46 -11 -26 -5 72 18 5 -15 5 -28 32 -4 -44 -59 -12 23 -47 2 -24 20 -4 48 -5 -4 13 -11 -13 -14 -37 1 -27 70
5196 70 -39 47 9 -11 -33 -5 42 -20 20 50 -11 2 -35 56 -31 -3 16 -67 3 7 46 -30 27 6 -41 4 36 22 -45 4
5226 4 27 -24 30 71 -15 -61 5 -14 28 7 8 -31 -12 52 -46 -61 46 -16 -13 22 40 35 18 47 -45 -25 36 -23 -1 -17 69 41
5258 41 -19 3 0 19 79 31 12 5 38 25 -5 77 1 -10 -5 -6 -63 -2 -25 -20 -62 -1 -70 -46 56 27 -4 -10 -1 15 28 51 28
5291 28 -61 -7 51 -33 -69 35 8 -38 31 -11 -113 7 49 -10 -57 60 -22 -61 0 65 -17 -24 33 -10 41 30 -3 -48 5
5320 5 51 -12 -14 -1 -13 -13 6 42 -45 15 -3 29 -29 47 24 -16 -36 -4 -31 -44 55 -38 -32 13 63 11 -14 74 2 -3 19 -12 7
5353 7 5 21 -4 22 81 3 13 17 50 -18 12 -46 14 -31 24 -24 9 6 62 -4 -37 105 -23 25 41 -9 -55 33 16 34 3
5384 3 62 -9 -3 38 15 -3 0 69 -1 -15 75 4 -13 28 -12 -50 -53 6 9 64 -7 -27 49 -34 10 37 3 -5 2 -45 -14 22 -27 -4
5418 -4 7 52 -44 27 56 -20 71 -24 5 22 -9 -25 39 -24 -10 3 -21 8 56 -73 -34 -11 -15 -12 7 33 1 -25 -18 -4 -33 -7
5450 -7 -77 -45 -9 6 -67 11 -10 0 10 -22 -21 -19 -22 46 -11 -5 22 26 55 5 -3 71 32 34 -21 -18 32 -15 -47 7 -10 18 -13 7 35
5485 35 -38 38 33 0 15 22 -23 1 42 -36 1 -10 -27 23 -31 -40 -5 29 17 -3 52 -37 -8 13 4 65 31 -6 0 2 38 -23 22
5518 22 -46 17 15 38 44 -29 -21 24 -40 -7 -32 -50 34 27 -84 8 15 3 -10 -7 51 -66 -60 -20 8 32 60 -9 17 63 -11 -5 2 22
5552 22 9 31 -3 33 1 -6 46 58 -18 -31 -16 16 16 -37 -14 40 8 -2 -7 37 29 15 -32 -20 -57 -16 43 -18 -24 -47 6 42 2
5585 2 -42 76 -53 -21 8 19 39 29 26 -9 -36 0 8 4 23 51 -42 23 -2 8 -14 29 6 -8 -12 29 -1 -17 -8 23 -64 -22
5617 -22 20 11 -16 46 19 -28 33 46 65 -1 34 -54 -2 39 17 -64 2 4 -10 13 12 -3 -46 15 20 -3 1 11 -20 -13 3 29 43
5650 43 -11 -38 -35 39 3 -12 -89 11 48 19 -48 -9 -41 -13 13 24 -49 -37 -7 -16 33 23 -12 -30 57 14 -12 -27 9 -14 -15
5681 -15 -12 -45 -45 9 3 -32 36 52 -48 38 3 -50 -59 52 -24 9 34 -46 -31 -103 59 7 -53 22 8 7 -25 34 11 -61 42
5712 42 -8 -41 28 26 -21 25 67 8 2 44 39 -19 12 11 -10 -27 19 21 5 41 53 3 -21 26 23 -71 7 58 -51 1 -9 20 14
5745 14 28 -34 -13 25 20 -13 11 11 24 -32 12 7 5 45 45 13 -10 -19 6 -48 66 13 -22 38 18 -16 19 -3 0 27 32 48 1 31
5779 31 51 -29 -35 10 -24 -70 -46 0 -55 -49 -30 7 -70 -41 12 -9 19 71 87 3 -1 48 10 33 -21 -35 -36 -24 -10 -23 41 11
5811 11 -6 18 11 12 7 17 -28 -53 -5 0 -12 -34 31 -48 -68 -19 -69 41 16 -23 15 -12 -28 -7 37 3 -7 -53 -11 96 -5
5842 -5 6 -12 -37 13 34 -8 -3 56 -28 38 -26 34 -30 -23 34 13 -29 45 6 15 -24 12 37 -52 24 -14 10 33 13 -28 -66 -6
5874 -6 0 -48 -16 -66 -28 26 30 -25 -56 35 2 -4 7 18 12 13 -14 30 27 15 38 19 45 37 -67 3 20 4 -36 -24 -8 -30 15 37
5908 37 23 -3 -41 -43 40 6 14 -51 -30 44 8 -43 -12 19 38 13 -1 2 -35 45 39 -9 11 59 1 6 7 -21 2 -44 28 7 -7
5941 -7 38 26 4 -19 18 -44 -10 20 61 23 -1 26 -20 23 21 -39 -9 37 2 8 -4 21 6 20 25 -10 35 29 14 28 -51 -15 -30
5974 -30 -25 -13 -41 -3 54 9 -7 14 80 37 64 -42 -23 -4 55 8 -37 -81 30 -31 -9 7 17 -2 -54 20 46 -39 46 -11
6004 -11 7 74 35 23 -15 15 -24 12 52 6 -53 41 -9 15 8 -26 -75 -60 -2 -49 21 -12 9 -28 -42 16 -46 -2 -3 50 30
6035 30 -51 46 -26 56 -18 -40 -27 3 -16 -3 17 -51 -59 -6 17 -4 -30 24 35 -20 -32 15 -43 -46 -20 -52 -32 66 -6 1 29 -16
6067 -16 -17 -11 9 61 -28 10 34 12 24 -29 -41 -3 32 -37 -27 -60 7 -20 -30 45 20 9 -9 24 -53 -78 22 -6 -14 -22 0 2
6099 2 56 30 57 14 -64 -78 -33 -38 -51 47 20 14 -55 10 26 -3 8 -35 -33 23 -3 4 -1 -34 -2 -9 8 -60 -41 -35 -30 4 23 9 27
6134 27 -4 -19 -15 -10 -2 -31 36 53 -9 19 28 -4 -42 69 58 33 75 17 -49 -13 -9 35 24 9 -3 -60 10 66 -17 -23 24 3 -2
6167 -2 13 17 -56 1 -39 -49 52 -39 -26 14 9 9 1 19 47 -19 6 3 38 -5 -17 23 22 15 68 14 18 44 0 56 35 -5 -14 -38 5
6202 5 -45 3 52 41 -30 1 -42 -39 34 -11 -34 -22 15 -27 8 -68 21 3 33 17 -2 -29 -3 25 11 -13 9 -8 -4 17 -20 2
6234 2 -41 8 6 43 -129 -14 -44 -41 19 -19 17 14 16 30 -24 -23 9 -16 -7 -18 9 -29 -53 28 -78 -14 28 22 -38 -32 -13 16 14 -26
6268 -26 -13 7 -27 27 30 -27 -16 12 -25 -48 46 -7 -27 -57 6 26 13 -8 20 -17 21 3 35 14 -36 6 -23 30 33 4 -21
6299 -21 13 -35 -20 -3 -72 5 -18 -49 -23 31 -6 -32 24 17 -36 57 48 51 5 -14 4 -24 56 -45 -21 -19 0 -32 -63 -11 10 -26
6331 -26 -13 -29 23 -15 11 27 13 14 13 8 -18 -49 -35 -31 -29 35 -54 0 25 12 -31 -41 -65 -49 -17 -8 41 1 40 -62 -11 1 60
6364 60 55 18 46 -5 -26 -16 58 -15 -23 8 -60 -85 -29 36 6 14 47 -34 -26 -67 -9 -4 -21 -46 -16 16 44 45 32 -34 23 11 33
6397 33 28 16 2 -15 31 -17 10 21 -23 -10 -16 -14 -36 -37 0 20 7 15 -28 -34 43 -50 -33 -2 -24 -37 -27 3 -30 -11 27 56 -42
6430 -42 -9 -36 -54 7 -35 -33 48 8 14 -38 13 1 -18 -42 0 1 0 -16 29 -4 -15 23 13 -21 10 -22 4 42 17 1 79 -50
6462 -50 -2 -75 8 17 -29 11 14 -7 -22 -52 24 7 5 37 -10 -8 -31 45 -1 -24 -6 -37 5 -22 15 36 37 18 -41 -15 19 -70 7
6495 7 -25 12 34 -66 -13 -12 38 65 35 -56 19 5 -3 -9 45 83 -1 -6 0 -1 6 43 2 1 15 23 6 -28 -21 1 -18 9 0 -20 2 -6
6531 -6 8 35 31 -42 -16 64 -20 -34 11 -73 -54 -11 -1 -34 -51 4 10 26 -52 12 13 -10 -23 -5 54 -19 -9 -1 18 -47 67 -29
6563 -29 -25 13 -52 -19 -35 -12 2 -24 -15 39 6 -50 -63 -12 22 11 -4 -29 -14 -23 -30 0 -27 -8 -28 -29 21 6 4 20 -46 0 -12
6596 -12 4 -3 -14 3 -40 0 25 37 -5 -7 3 52 22 -4 -14 -60 -31 19 5 8 -9 67 58 -35 -4 8 -23 -116 -4 -20 29 16
6628 16 -14 4 10 -6 29 9 -14 13 -2 7 36 5 -24 11 42 49 28 14 14 -60 -4 32 -10 -15 24 11 -13 -58 34 -29 -23 -31 1 12
6662 12 -37 -47 -1 -32 -37 -60 -65 60 -7 6 50 -65 -19 1 -23 -21 -108 -7 15 -73 -26 4 -7 -12 63 50 -19 -17 46 -7 -62
6693 -62 56 -30 47 37 25 -66 11 76 -8 15 29 -2 -25 -26 62 -62 -60 -12 -48 49 -61 1 9 19 2 19 42 13 13 -33 -15
6724 -15 29 -32 -9 36 -3 11 23 42 -21 -9 -64 6 10 69 17 -2 35 4 1 46 46 -5 42 43 -16 3 24 15 22 -29 -43 -10 -50
6757 -50 32 10 -38 -37 -30 -24 -32 55 -13 14 4 -22 10 -40 65 -24 36 14 20 -25 17 26 -1 86 12 -28 -54 3 22 -48 -33 19 -6
6790 -6 89 -9 -34 20 30 -5 -26 -10 -33 -25 -20 -15 46 -35 -7 -2 -18 6 17 7 19 33 -55 9 5 -1 -19 -45 -45 3 12 -13 15 -34 6
6825 6 -11 -25 25 50 4 3 11 -42 10 -14 -1 -38 29 0 -52 3 42 -19 12 31 33 -23 -44 -49 6 43 -19 -12 -1 -30 34 -20 -7
6858 -7 -17 26 14 14 7 -17 43 9 13 27 -27 32 -95 3 5 8 22 -71 -56 -20 32 -29 -41 -19 -19 -65 -44 -47 -36 -4 4 -19 17 -2
6892 -2 -13 44 6 55 4 4 11 -28 -23 -18 -19 -5 3 -26 26 24 -20 -21 12 18 21 -3 7 -24 -17 21 -51 30 -22 -2 -5 9 -1 -13 3 -4 -22
6929 -22 -3 -9 45 55 -14 0 20 -10 9 33 33 -3 -31 25 45 63 -28 -30 23 14 49 14 13 -51 8 -9 0 45 -4 60 -38 -10 14
6962 14 -22 20 -57 -5 24 13 52 7 4 -26 5 -38 37 -10 -39 81 -4 -26 25 43 34 7 24 42 -54 -32 -4 56 7 6 23
6993 23 -42 27 -3 -29 48 43 -6 -17 -1 -45 -4 -12 -46 -39 -32 1 12 -11 -32 21 -2 -31 1 13 4 33 -37 76 -2 -4 50 50 10
7026 10 36 7 -21 4 56 39 -4 87 6 -20 49 31 28 -11 16 30 -53 19 15 -14 -18 -23 -5 -7 -16 10 0 -23 8 -12 3 0 27 39
7060 39 -79 49 6 9 40 11 34 -70 3 -28 -1 -14 -17 16 13 13 15 24 11 29 -29 38 29 16 -47 17 -19 23 -61 -28 17 -32
7092 -32 53 -2 -12 -6 -72 -36 50 15 0 14 1 27 -30 9 38 -18 -23 -20 47 56 10 40 9 66 3 9 -27 -14 28 28 12 8 13 23
7126 23 -20 -44 -42 -9 -3 -32 21 -9 20 22 -94 69 38 4 -8 21 -13 -24 29 -17 -29 -27 -20 -17 -15 49 35 25 32 23 21 -20 12 -1
7160 -1 -1 24 -30 -9 16 5 5 7 13 14 -6 -45 -4 -28 -7 5 32 -29 28 -4 18 -7 -2 -19 5 -21 51 21 -33 37 61 -37 -19 -41
7194 -41 -2 8 39 -2 56 1 12 -8 -44 37 -20 1 6 -26 -32 10 -3 27 -19 -19 -32 20 5 12 3 -8 -35 10 32 -2 -6 -30 2
7227 2 50 42 -3 -1 54 -72 7 26 -5 27 14 9 15 -1 12 -2 2 35 22 51 -38 -25 72 -15 34 2 31 15 12 -20 2 -9 16
7260 16 -40 -7 -15 2 -34 -4 -45 16 40 -10 -4 39 62 51 36 9 -78 46 -17 9 48 60 28 -7 -30 6 27 19 47 -13 77
7291 77 -37 69 23 57 -52 10 22 -39 -43 22 -8 -39 -33 28 37 9 14 11 -21 -26 5 9 32 19 36 25 -58 -33 4 91 -26 -3
7323 -3 58 14 75 8 -19 7 21 -7 -1 25 38 -41 5 -8 8 -52 -17 37 -49 10 -30 8 1 61 4 39 14 -23 9 29 -3 -15
7355 -15 52 24 28 22 32 -35 33 10 31 -15 -17 23 2 26 -57 -3 12 -31 4 21 -36 23 -18 -29 -1 5 12 18 5 -26 7 -38 40
7388 40 -67 -20 22 24 -19 19 -47 -6 -21 -74 -8 5 -10 3 -16 72 37 86 49 15 -53 -18 -25 11 -8 -28 -14 -13 6 5 -31 18
7420 18 -17 -2 -22 -46 -9 -10 -20 32 43 22 -24 -17 -42 -23 9 30 -14 26 10 26 -23 40 27 15 12 -19 0 4 1 42 21 53 82
7453 82 -10 -11 -37 64 -71 0 43 10 -15 -66 -41 -34 1 -7 -32 -3 37 -8 10 -23 -70 -49 -37 -28 -1 9 23 20 -25 13 -60 17
7485 17 5 28 26 44 -2 20 3 49 43 19 -4 28 -17 -19 6 -3 52 -56 -21 -48 -37 -36 23 35 -13 51 77 -9 10 9 -49 1 17
7518 17 -2 3 -75 27 -33 7 -17 74 -18 14 11 26 35 6 35 53 5 -20 8 -2 27 -35 47 35 18 8 52 34 -54 48 21
7549 21 -16 -33 10 29 -4 46 -3 -21 10 -21 6 0 -63 -25 9 20 -31 9 -19 30 41 -23 -4 9 75 -34 5 36 47 24
7579 24 -5 6 8 33 -19 9 15 20 -42 -46 -27 0 -17 -13 8 -29 51 -15 34 -18 -82 -24 -35 -30 23 -12 14 -12 -26 26 -24 36 -12
7612 -12 -48 0 64 34 88 -30 51 -1 -7 3 1 48 28 16 30 48 41 -35 -14 24 13 -61 7 -27 -22 -21 25 -21 5 17 -33 44
7644 44 -7 -7 -18 -2 20 7 47 13 19 12 -10 -10 -8 43 -44 19 23 -14 14 -53 19 24 36 -66 11 26 34 -47 -35 -17 -62 -59 -23 80
7678 80 24 20 -26 -38 10 18 -12 11 15 -10 -25 -49 39 21 -13 6 27 62 9 10 -24 27 -74 9 -34 9 -27 20 -1 28 1 -37
7710 -37 -8 4 14 16 22 19 60 21 -19 63 21 18 9 -21 23 -5 -4 21 9 3 -25 4 -26 -13 35 20 14 -35 36 41 38 23 23 -6 39 36
7746 36 -33 8 -17 27 85 -13 -34 -35 18 -48 -9 1 34 -15 0 40 8 -16 37 10 -4 -18 6 -9 -91 17 12 -12 -2 -18 -11
7777 -11 3 16 -6 37 55 -28 91 30 -2 -5 -13 48 -2 -20 -43 -37 -40 38 34 33 -18 35 38 -2 -25 3 -16 4 -24 24 -8 6 3 13
7811 13 -2 4 -14 14 11 11 8 22 -76 -20 10 -7 -38 42 33 7 -5 47 12 -15 -17 14 -39 -23 27 58 40 -34 41 -5 12 -21 22
7844 22 -14 -21 3 13 69 -29 69 -43 -15 50 -34 14 0 -8 -26 67 71 38 1 10 81 14 71 15 32 41 -11 52 41 19 12 -21 3
7877 3 46 -18 15 -3 68 54 -14 62 20 30 0 -1 1 20 -26 7 -48 -17 -16 17 31 -57 -24 28 -19 7 7 2 40 41 34 40 4 59 84
7912 84 -9 -39 -29 29 27 -33 7 44 -16 18 -16 2 10 -11 -45 -10 -29 1 21 -12 -15 -20 -71 -59 -60 18 -14 -14 15 20 -30 -14 -11 -53
7946 -53 -30 53 28 -6 44 -25 -9 3 20 57 11 -16 13 24 1 1 38 16 -36 0 13 16 37 -1 -10 -32 39 -31 -27 14 19 15 14 -59
7980 -59 -8 -57 -42 -22 -70 8 -14 11 -30 -22 32 -39 -15 -20 3 21 30 61 -10 25 -20 31 -2 -32 69 88 11 24 54 26 15
8011 15 44 -15 22 -7 12 -11 -34 13 7 24 -33 -7 -17 -11 11 12 61 8 64 27 29 -10 0 40 14 28 -4 41 -2 6 69 27 45
8044 45 41 28 4 3 18 -23 60 13 -57 3 28 -58 -9 -33 24 -35 0 64 -1 -6 21 25 12 57 9 6 3 -32 49 -45 -22 2 -12
8077 -12 2 -26 -10 35 94 26 35 14 13 20 -25 -52 -10 40 -11 20 30 63 -39 15 -26 -42 22 49 -4 18 -45 -49 48 13 30 -16
8109 -16 0 -70 -6 9 12 20 13 -12 20 -4 21 -3 -48 -33 -48 17 48 61 27 43 12 36 -60 13 5 11 33 89 -61 -12 -4 -22 -29
8142 -29 -12 44 1 -9 -12 27 10 -6 -26 -35 60 34 -47 17 33 26 -26 -16 -27 -32 -32 46 42 -28 58 32 70 1 -23 -23 -9 1 -1 -9 64
8177 64 -11 17 15 -31 -1 5 31 -10 -13 9 55 -27 22 11
8191A1
$$ Imaginary data points
##PAGE= N=2
##DATA TABLE= (X++(I..I)), XYDATA
0 0 0 0 0 0 0 0 0 0 0 0 -8 8 -8 16 -16 16 -24 32 -32 40 -56 64 -72 88 -104 120 -139 160 -184 211 -243 277
32 277 -312 355 -400 451 -507 568 -635 707 -787 875 -971 1075 -1187 1312 -1447 1597 -1758
49 -1758 1939 -2134 2351 -2592 2862 -3162 3501 -3888 4333 -4851 5462 -6198 7102 -8244
63 -8244 9738 -11790 14783 -19578 28477 -50490 218436 172027 -380992 -21037 222031 -57137
75 -57137 -118994 157552 -32021 -207131 119719 242723 -157947 -159582 179808 75157 -182156
86 -182156 6303 112523 -86595 -44869 155993 -12674 -159181 79763 148204 -127742
96 -127742 -106066 123222 11006 -133097 66472 124350 -103079 -86488 119113 30122 -117039
107 -117039 20146 73339 -103098 -51275 147764 30072 -143940 11906 125649 -47873
117 -47873 -95326 70128 39743 -107181 -3938 117270 -25918 -92511 67499 68847 -92544
128 -92544 -46424 91424 8822 -91066 20005 80693 -29984 -36159 52876 2776 -53041 28089
140 28089 33245 -63877 -17613 88586 10138 -83080 16034 75345 -31297 -46798 36418 -6827
152 -6827 -52301 47777 61367 -68225 -48471 90142 39610 -88451 -17826 66105 -23655
163 -23655 -45262 55521 19995 -70708 11574 78869 -35399 -74928 47184 44949 -69722
174 -69722 -17797 78359 -9161 -66893 38531 48782 -56383 -25391 58179 -10656 -60791 41049
186 41049 54304 -60451 -30698 73223 2443 -72313 20304 50006 -46288 -25520 61876 -3105
198 -3105 -65630 37093 63376 -60479 -44950 71694 15048 -68753 18909 56213 -46733
209 -46733 -34180 68373 10216 -75104 17112 64347 -46839 -42420 67542 13998 -73418 15630
221 15630 67384 -36875 -46467 52817 16389 -61831 16294 59461 -43894 -41873 64524 19183
233 19183 -68926 5636 58668 -31495 -43577 47477 17826 -57614 11329 58146 -36177 -45980
245 -45980 51803 24652 -56802 -388 52372 -22331 -39726 42850 22788 -55371 -2788 53793
257 53793 -21074 -43938 38349 26182 -47890 -5673 50391 -14009 -45994 29890 31627 -42449
269 -42449 -11218 47610 -8699 -40438 28211 28866 -39946 -13498 44357 -4808 -42832 22141
281 22141 32407 -36781 -15698 43300 -5054 -42388 22585 34396 -34499 -19989 43149 4606
293 4606 -43153 13951 35990 -30108 -22273 38907 4535 -40077 12203 34414 -25996 -24358 35045
306 35045 9299 -39449 7138 35629 -22892 -24964 33285 10920 -36375 4074 34715 -16328
318 -16328 -26597 27721 14939 -34079 8 33027 -15888 -26865 25905 14853 -31901 -2546
330 -2546 32301 -10450 -27861 22775 18746 -30704 -4639 33777 -9136 -29355 20710 20512 -28186
343 -28186 -9353 31372 -3400 -29851 16390 22748 -26864 -11291 30579 -2922 -29506 14669
355 14669 23324 -23572 -13559 30087 2401 -30639 11186 26704 -21706 -16426 27973 3988
367 3988 -28727 7557 24203 -18936 -17901 25844 6937 -29302 5806 26840 -16939 -17989 25056
380 25056 7099 -27824 4383 26528 -14902 -20654 24173 11235 -28970 1141 27835 -13152
392 -13152 -21627 20928 11182 -25409 -592 25194 -10667 -21412 19876 12872 -25226 -560 26349
405 26349 -9930 -20799 18834 13348 -23129 -4325 23405 -6372 -21067 15594 13831 -22735
417 -22735 -5091 23844 -4191 -20419 11786 14579 -16830 -6704 20283 -1745 -20259 10304
429 10304 16052 -16894 -8211 20982 718 -20949 6002 17648 -12622 -12854 17022 4361 -20386
442 -20386 4641 19487 -12100 -14423 16508 6510 -18116 3265 19193 -11475 -16314 18967 10464
455 10464 -22640 -1739 20242 -9465 -15833 17394 8848 -22185 -794 23148 -7988 -19804
467 -19804 16241 12475 -21294 -2897 20595 -6692 -14257 16112 6892 -22209 1043 24879 -7937
480 -7937 -22348 12902 12797 -17227 -1339 18227 -9109 -17026 14912 12683 -17210 -5843 17375
493 17375 -1988 -14454 10693 11098 -14372 -5096 13703 -2519 -11758 8302 8849 -13047 -5810
506 -5810 15477 1177 -15047 4715 11913 -10624 -8497 13741 5116 -13760 -925 12135 -4374
519 -4374 -8025 12048 4194 -17232 -486 17223 -3688 -13281 7494 6132 -12508 508 16021
532 16021 -7059 -16552 11881 11378 -15124 -1926 17728 -5661 -16564 11415 13067 -14369 -6825
545 -6825 14360 -2998 -13216 12122 10234 -16708 -4554 15945 -3064 -12989 9557 8561 -14431
558 -14431 -3609 16193 -1578 -12826 8301 7033 -13539 -575 16456 -2972 -15054 4767
570 4767 9943 -7479 -4152 9780 -2074 -11363 5539 9361 -6984 -4538 7888 -306 -8774 4654
584 4654 11233 -5945 -10923 5878 6655 -5752 -32 5970 -6265 -7178 9948 7866 -11278 -6272
598 -6272 10684 803 -10262 5339 8542 -9476 -4796 10859 -44 -9747 6608 8949 -11748
611 -11748 -6719 14597 2482 -13637 3189 8317 -10348 -3169 14669 -1052 -15274 4371 11523
624 11523 -8304 -4778 12938 -1873 -14921 7398 13507 -9360 -7869 9178 157 -9128 6634
637 6634 8861 -10848 -6805 11939 2046 -10846 3199 7613 -7916 -4866 9326 2164 -8211
650 -8211 2082 7263 -5844 -5206 9496 3396 -10228 -1357 7737 -1816 -5392 4563 3225 -7408
664 -7408 -1936 8488 -274 -7554 3353 4385 -6732 -802 10039 -856 -10659 2401 8834 -4890
678 -4890 -5164 7656 -117 -9539 5287 9419 -8348 -6926 9307 2086 -10376 2070 9341 -6291
692 -6291 -6213 9634 1813 -9740 4530 8584 -8970 -6000 10952 2454 -10877 1781 8987 -6490
706 -6490 -5895 9884 1416 -10959 2508 8739 -5898 -5096 8479 1900 -9136 1552 8640 -4410
720 -4410 -5979 6545 1606 -7500 2728 7557 -5083 -5957 6209 3493 -7364 -1241 6730 -2496
734 -2496 -6069 5268 4313 -5816 -1154 6204 -1173 -5459 3542 4521 -5618 -2793 7076 -39 -7012
749 -7012 2951 5459 -5531 -3690 6421 1025 -6907 1902 6763 -4806 -4875 7466 2201 -8315
763 -8315 751 7166 -3473 -4600 6001 2327 -7138 1078 7639 -4606 -6660 6711 2986 -8264
777 -8264 319 7745 -3310 -5884 6079 3829 -7544 -562 8169 -2907 -6842 6057 4106 -7454
791 -7454 -708 7257 -2633 -6429 4992 4131 -7331 -1381 8216 -2138 -7303 5440 4989 -7196
805 -7196 -1984 7644 -943 -6960 3944 5727 -6062 -2709 7598 -648 -7318 3594 5030 -6191
819 -6191 -2862 6836 -120 -6990 2940 6186 -5471 -3757 7396 709 -7280 2522 6212 -4687
833 -4687 -4058 6173 1651 -6890 966 6340 -4107 -4726 6185 1798 -6958 1181 6237 -3651 -4852
848 -4852 5465 2708 -6837 46 7308 -2904 -5768 5697 3552 -6685 -724 6566 -2137 -5937
862 -5937 4142 3901 -6358 -1460 7024 -1838 -6156 4743 4162 -6217 -1349 7022 -1143 -6455 3819
877 3819 5229 -6031 -2742 7195 -531 -6817 3369 4964 -5414 -2710 6343 43 -6670 2427
891 2427 5525 -5055 -3255 6611 262 -6566 2925 5816 -4719 -3830 6283 1556 -6922 1111 6219
906 6219 -4173 -4719 5827 1695 -6546 1083 5928 -3416 -4443 5508 2587 -6579 335 6706 -3374
921 -3374 -5158 5833 2627 -7030 21 6821 -2457 -5705 4741 3542 -6715 -916 7183 -2370
935 -2370 -6232 4680 3652 -5937 -617 6391 -2049 -5703 4840 4382 -6390 -1546 6944 -1954 -6252
950 -6252 4412 4084 -6025 -1931 6175 -682 -5635 3362 4374 -5528 -2185 6281 -250 -5282 2736
965 2736 3602 -4517 -1749 5604 191 -5820 1661 4824 -3695 -2744 5026 260 -5797 1274 5115 -2632
981 -2632 -3995 3843 2176 -4874 466 5557 -2407 -4482 4150 2639 -4894 -138 5296 -2525 -5621
996 -5621 4144 4410 -5558 -1853 5874 -1746 -5315 4788 4167 -6396 -2295 6679 -288 -5761 3689
1011 3689 4183 -6529 -1785 7584 -979 -6415 3844 3830 -6264 -1310 7385 -1401 -7267 3544 5008
1026 5008 -5472 -1250 6745 -1909 -6218 4271 4740 -4905 -1727 5129 -1502 -5164 4107 4247 -5714
1041 -5714 -2570 5261 -160 -3926 2821 2717 -4605 -2086 5118 1154 -4458 763 3391 -2796 -1950
1056 -1950 4287 1008 -4435 -201 3671 -960 -2496 2821 1203 -5016 -445 5434 -828 -4483 2298
1071 2298 2700 -3852 -849 5542 -441 -5781 2136 4444 -3851 -1639 5337 -1459 -6153 3250 5214
1086 5214 -4427 -2839 4937 -613 -5361 4117 4781 -6539 -2955 6932 -4 -5570 3528 4044 -5968
1101 -5968 -2335 6874 261 -5895 2598 3586 -5363 -1011 6451 -1518 -6147 2769 3887 -3952 -1039
1116 -1039 5144 -1232 -5318 3111 4357 -3759 -1810 3989 -899 -3992 2633 3557 -3221 -2955 3001
1131 3001 1135 -2701 1209 2409 -3138 -2124 3668 1462 -3290 -266 2872 -1193 -2425 3062 2223
1146 2223 -3978 -1404 3902 -84 -2968 1923 1961 -3785 -1558 4445 296 -4457 1357 3219 -3320
1161 -3320 -1263 4842 -392 -4824 1945 3743 -3321 -1774 4830 -408 -5681 2358 4911 -3661 -2684
1176 -2684 4262 -228 -4333 2605 3735 -4290 -2591 4733 556 -4412 2229 3487 -4192 -1854 4911
1191 4911 170 -4356 1488 3158 -3254 -1819 4352 147 -4705 1132 3576 -2546 -1727 3395 221
1206 221 -3463 1056 3172 -1960 -2198 2939 706 -3531 976 3581 -2031 -2827 2489 1569 -2758 -183
1222 -183 2983 -1376 -3003 2479 2246 -3232 -855 3218 -769 -2661 2193 2198 -2983 -1134 3514 -296
1238 -296 -3312 1994 2407 -3477 -1272 3855 -238 -3612 1578 2761 -2707 -1543 3629 68 -3717
1253 -3717 1600 2850 -2830 -1254 3603 -215 -3484 1603 3003 -2621 -1855 3341 186 -3649 1422
1268 1422 2966 -2760 -1904 3257 517 -3117 884 2847 -1920 -1965 2951 860 -3156 696 2682 -2044
1284 -2044 -1903 2675 694 -3130 252 2970 -1484 -2418 2575 1355 -3065 -47 3029 -1222 -2354
1299 -2354 2083 1463 -2645 -403 2974 -821 -2658 2062 1689 -2875 -428 2874 -1035 -2719 1865
1314 1865 1857 -2676 -862 3082 -360 -2852 1745 2188 -2555 -797 2876 -279 -2589 1309 1997 -2295
1330 -2295 -1152 2730 -205 -2769 1406 2109 -2342 -1143 2725 49 -2693 960 2301 -1815 -1520
1345 -1520 2579 504 -2658 770 2258 -1639 -1371 2176 459 -2414 357 2204 -1492 -1750 2226
1360 2226 721 -2561 469 2424 -1215 -1733 2036 1150 -2290 -163 2344 -801 -2071 1638 1140 -2278
1376 -2278 -202 2156 -828 -1831 1488 1281 -2017 -524 2423 -512 -2171 1527 1635 -2073 -648
1391 -648 2333 -112 -2107 1032 1740 -1770 -1194 2200 59 -2354 855 1751 -1774 -973 2187 135
1407 135 -2111 806 2059 -1574 -1283 2344 417 -2543 691 2162 -1497 -1438 1999 520 -2197 442
1423 442 2124 -1334 -1583 1999 488 -2283 580 2074 -1403 -1349 1971 708 -2113 303 2121 -1228
1439 -1228 -1556 1896 786 -2174 -19 1824 -924 -1394 1394 745 -1741 -122 1879 -532 -1339 1300
1455 1300 773 -1619 -59 1704 -435 -1554 791 1187 -1300 -632 1629 -129 -1766 643 1446 -1116
1471 -1116 -818 1325 156 -1548 519 1676 -1031 -1226 1534 482 -1774 628 1702 -1342 -1416 1685
1487 1685 763 -2009 14 1817 -1199 -1502 1965 771 -2084 132 1865 -936 -1116 1698 507 -2161
1503 -2161 221 2140 -957 -1454 1634 404 -2109 479 2044 -1072 -1536 1275 624 -1490 246 1625
1519 1625 -1011 -1390 1381 798 -1241 195 1022 -892 -808 1268 703 -1370 -416 1036 -331 -908 904
1536 904 627 -1230 -510 1173 453 -843 34 689 -724 -533 1219 456 -1271 -136 1038 -311 -609
1553 -609 963 406 -1637 -192 1717 -311 -1409 884 596 -1548 73 2009 -509 -1663 844 1084
1569 1084 -1212 -62 1694 -897 -1725 1410 1105 -1584 -89 1321 -1019 -1266 1732 1079 -1803 -360
1585 -360 1624 -515 -1037 1512 439 -1825 13 1615 -269 -853 821 166 -1369 318 1445 -583
1601 -583 -1109 593 257 -738 385 798 -670 -1038 604 976 -306 -346 469 -161 -498 461 697 -378
1619 -378 -803 69 479 -286 -19 597 -500 -931 652 967 -597 -433 678 -184 -860 827 1084 -1149
1637 -1149 -838 1266 207 -1002 687 783 -1379 -628 1530 234 -1216 410 658 -1352 -235 1858
1653 1858 -241 -1643 744 1033 -1040 -87 1403 -559 -1520 882 1131 -1050 -380 1073 -553 -1006
1669 -1006 1155 724 -1159 -321 863 -297 -568 858 420 -1194 -229 1192 -78 -643 440 203 -691
1686 -691 -145 769 75 -672 -53 385 -196 -145 462 -56 -647 29 562 43 -428 164 335 -509 -139 854
1706 854 -31 -922 132 669 -356 -405 702 21 -917 254 1017 -493 -633 725 49 -804 486 873
1724 873 -771 -598 934 169 -919 461 862 -910 -657 1138 172 -1059 283 738 -730 -395 991
1741 991 111 -982 268 858 -526 -390 873 -135 -966 444 658 -576 -423 621 118 -807 298
1758 298 711 -541 -519 588 133 -569 169 440 -310 -379 492 322 -459 2 488 -283 -439 444 191 -528
1778 -528 -205 523 -45 -499 240 509 -420 -343 603 130 -535 173 453 -361 -285 493 164 -655 147 566 -462
1799 -462 -362 606 21 -747 195 650 -375 -496 552 249 -683 30 707 -315 -480 588 237 -587 100
1818 100 526 -288 -463 436 291 -730 -37 668 -327 -534 556 318 -657 -2 623 -185 -467 408 425 -508
1838 -508 -134 617 -117 -516 393 324 -529 -127 510 -120 -606 320 372 -563 -259 637 -86 -549 268 462 -401
1859 -401 -258 474 38 -535 163 527 -435 -328 498 -11 -507 193 428 -330 -246 454 114 -515 104 557
1879 557 -310 -369 487 141 -529 7 476 -138 -426 351 223 -444 -37 444 -279 -434 350 141 -471 -67
1899 -67 506 -81 -441 357 401 -513 -128 504 -114 -475 217 285 -350 -186 380 19 -416 243 399 -396 -126
1920 -126 553 -16 -472 274 369 -307 -239 397 99 -565 88 480 -287 -368 347 107 -421 -31 393 -186 -327
1941 -327 357 199 -465 22 491 -265 -357 422 215 -471 -80 496 -169 -453 358 334 -517 -170 572 -105 -423
1962 -423 302 247 -475 -79 558 -107 -475 273 331 -533 -17 624 -243 -469 332 258 -441 -147 458 -168 -525
1983 -525 289 361 -412 -112 401 -119 -275 305 209 -347 -112 383 -12 -265 182 164 -380 -117 447 35 -307
2004 -307 25 190 -102 -138 237 66 -320 -15 337 -27 -204 168 78 -236 13 398 -79 -395 39 326 -280
2025 -280 -153 403 -127 -525 69 384 -240 -282 414 111 -497 227 560 -452 -375 458 -33 -478 314 372 -560
2046 -560 -328 683 99 -563 276 431 -578 -163 696 18 -571 181 333 -367 -61 510 -109 -557 308
2065 308 390 -405 -70 339 -280 -375 399 264 -315 -170 267 8 -180 297 156 -316 -163 223 107 -34 29
2086 29 -58 -106 -45 208 137 -284 -105 85 -25 -50 120 140 -258 -216 233 283 -318 -45 226 -169 -198 372 254
2109 254 -473 -128 415 -85 -311 366 144 -609 0 632 -228 -358 386 37 -543 210 647 -304 -495 420
2129 420 158 -420 222 448 -477 -275 589 167 -417 157 320 -410 -153 632 32 -519 117 256 -308 -56
2149 -56 449 -141 -427 113 327 -106 -157 218 -97 -268 222 237 -206 -154 38 13 -80 172 126 -164 -205 145 230
2172 230 -62 -57 39 -35 -183 153 300 -80 -310 87 237 -153 8 181 -211 -265 257 270 -273 -27 253 -86
2194 -86 -284 432 173 -445 -57 360 -169 -264 370 102 -460 -13 463 -156 -301 320 52 -410 147 420 -296
2215 -296 -269 270 45 -318 164 335 -219 -281 337 178 -343 44 255 -231 -205 308 103 -223 -1 246 -58
2236 -58 -133 204 63 -309 3 282 -47 -124 30 48 -195 -107 253 39 -273 67 223 -68 -23 182 59 -192
2258 -192 34 231 -39 -196 264 36 -242 66 304 -177 -201 221 97 -305 -6 231 -195 -225 227 139 -281
2279 -281 26 278 -114 -136 248 110 -238 2 273 -173 -195 261 66 -316 26 341 -185 -197 262 123 -231
2300 -231 -3 279 -86 -203 160 129 -183 50 282 -176 -164 140 92 -195 -65 207 -75 -236 148 184 -192
2321 -192 -66 170 -13 -160 66 167 -122 -85 156 45 -179 66 148 -171 -100 197 41 -166 22 227 -52
2342 -52 -167 164 66 -236 -6 220 -112 -141 96 95 -196 8 224 -104 -171 230 2 -264 -22 181 -120 -166
2364 -166 163 87 -190 -31 182 -48 -186 163 96 -187 -9 219 -88 -188 70 168 -223 -100 180 -74 -199
2385 -199 143 89 -217 -73 189 -102 -182 110 158 -129 -55 257 16 -178 139 128 -148 -49 164 -35 -201 26
2407 26 154 -160 -103 184 -4 -174 56 179 -120 -41 121 70 -145 -10 166 -39 -168 52 128 -199 -12 100
2429 100 -82 -72 132 61 -128 -101 242 -66 -212 132 165 -229 -34 219 -52 -164 67 103 -250 -109 180 -44
2451 -44 -198 99 156 -169 -33 218 -34 -129 157 111 -150 -8 210 -47 -170 113 130 -178 -44 147 -44 -117
2473 -117 152 145 -107 -75 145 -17 -135 113 125 -131 -72 94 20 -80 17 57 -59 -85 138 100 -183 5 115
2496 115 -5 -71 112 71 -91 -32 91 52 -97 93 10 -125 -26 192 -1 -136 68 104 -65 -55 177 -12 -235
2519 -235 111 125 -96 -95 133 -68 -216 75 210 -106 -79 162 -36 -159 224 185 -240 -81 200 1 -192 113
2541 113 38 -164 6 140 -13 -113 66 124 -81 59 140 -82 -148 54 74 -59 36 104 -91 -120 89 127 -19
2564 -19 -99 -44 10 -12 21 80 -15 -74 11 73 16 -49 82 7 -124 15 176 -79 -139 66 2 -65 95 108 -89 -179
2590 -179 171 130 -127 -35 132 -131 -102 178 79 -202 -5 131 -104 41 167 -101 -279 12 131 -106 -82 224
2612 224 -79 -169 174 214 -105 -93 118 -2 -67 148 111 -169 -46 101 -42 -24 119 20 -188 -9 90 1 -64
2635 -64 -47 1 -92 63 87 -12 -161 -38 51 70 59 -87 9 -68 12 77 39 -84 -90 -12 -17 7 86 90 -219 -48 141 45
2663 45 -160 38 40 -141 -14 199 -46 -225 45 158 -171 119 188 -168 -160 222 118 -116 5 134 -139 -145 241
2686 241 87 -181 17 124 -95 -30 235 -3 -275 40 125 -84 -64 143 -44 -140 150 169 -135 -58 97 -69
2708 -69 -103 126 96 -101 -25 22 27 -60 83 21 -87 54 114 -61 -40 -35 -47 -13 -40 81 20 -72 -18 80 119 -35 -1
2735 -1 -21 -33 -54 25 70 -116 -130 80 23 -49 16 48 -122 -1 121 29 -151 64 -16 -102 -31 187 -48 -183 105
2760 105 109 -151 47 137 -67 -170 57 69 -80 63 139 -104 -129 188 59 -130 19 127 -53 -81 117 25 -149
2783 -149 -32 131 -86 -67 71 49 -89 58 127 -27 -63 9 47 -76 81 49 -47 -132 29 42 9 -1 58 -10 -81
2808 -81 -7 88 -20 -92 13 -9 -41 16 40 -58 -96 1 0 -69 5 75 5 -56 93 61 -100 5 25 -126 -71 93 87 -102
2836 -102 -6 90 3 -133 49 27 -64 16 31 -13 -68 74 48 -98 -8 104 -54 -65 62 100 -41 -27 105 7 -122
2861 -122 35 108 6 -54 99 24 -76 23 79 -3 -48 44 -22 -107 38 17 -102 -87 65 -1 -134 47 127 -26 -100
2886 -100 100 18 -96 22 76 -75 -26 44 52 -115 41 68 -92 15 32 53 -105 -48 98 -28 -63 70 14 -102
2910 -102 -57 136 -42 -94 20 22 -110 -42 22 -48 -88 28 20 -48 -19 59 -43 -68 7 65 -74 -13 137 0 -84 -4
2936 -4 45 -30 -87 57 -20 -52 -42 85 -9 -71 25 -18 -79 20 79 -74 -80 56 58 -57 1 106 31 -73 39 21 13 2
2964 2 62 17 -42 72 44 -28 -6 150 -7 -51 1 13 -53 -7 82 15 -112 18 62 -43 -60 30 2 -123 26 33 -72
2991 -72 -61 75 17 -108 4 95 -140 -83 163 -6 -120 41 17 -85 -81 108 19 -68 60 58 -80 -25 88 -30
3015 -30 -79 85 61 -52 -29 66 -1 -92 112 48 -79 -16 84 24 22 44 21 -42 -54 -28 45 -18 19 -7 -55 74 56 -21
3043 -21 -24 -37 7 3 -24 -16 28 -59 -76 56 55 -42 -30 40 -6 -74 116 138 -139 -24 84 32 -73 111 53 -116 -30 129
3071 129 -11 -154 46 84 -77 19 178 -123 -163 114 155 -93 27 133 -166 -109 181 65 -157 3 80 -121
3093 -121 63 200 -11 -106 53 65 -124 -40 135 -84 -97 114 10 -49 35 10 -88 -15 97 47 -43 -16 -67 -13 -17
3118 -17 62 2 -50 4 0 31 -29 -94 -25 -23 18 68 35 12 -148 -11 72 47 -110 37 34 -106 26 130 -71 -80 21 -13
3146 -13 -40 71 102 -91 -88 176 24 -53 111 66 -155 -1 238 16 -127 43 82 -99 87 136 -123 -131 9 69
3170 69 -67 81 79 -132 -61 162 51 -110 17 9 -24 -22 101 13 -50 64 -13 -25 25 62 -119 -58 47 111 -19 -56
3196 -56 -34 -30 18 102 35 5 -73 -32 14 121 -6 -76 -8 -29 1 141 40 -36 27 50 3 38 107 -1 -93 43 129 -72
3224 -72 -23 90 -30 -100 92 79 -64 -87 42 -17 -17 95 22 -154 9 142 -19 -51 127 17 -118 27 135
3247 135 -1 -110 55 10 -131 -5 50 -57 -98 81 81 -59 25 80 -46 -6 133 -29 -71 13 36 -36 20 52 23
3272 23 -81 -21 38 35 -35 -5 10 6 -39 3 43 19 20 1 -19 -49 68 39 -84 -7 61 -11 -22 48 63 -100 -43 124 33
3301 33 -103 -4 35 2 41 89 14 -35 28 73 -112 31 173 -12 -77 35 122 -67 -31 76 -63 -36 77 56 -90
3326 -90 27 106 6 -60 86 63 -39 -26 72 -49 -57 58 40 -52 17 51 59 -86 83 43 -63 -24 90 -43 -101 3
3352 3 32 -28 -3 53 19 -6 35 -7 12 -17 3 62 -21 -23 45 -42 -38 45 -47 -6 -80 13 22 -12 56 112 -41 -45 39 -8 -56 49
3384 49 -1 -41 29 56 5 -73 42 87 -71 23 93 36 -98 66 108 -17 -16 116 2 -70 26 147 -128 -69 137 31
3410 31 -59 46 90 -76 -18 68 21 -42 24 110 -54 -39 63 -21 -44 44 22 -52 -55 -37 22 -12 -13 -28 -22 -67 42 31 -31
3439 -31 63 69 -40 -105 39 37 7 1 97 -45 -79 15 10 -21 -37 46 2 -11 5 29 -22 -75 60 -8 -66 38 25 -65 -140 76
3469 76 -23 -108 -12 112 -4 -54 49 58 -40 23 13 -34 -19 -11 25 -36 32 47 -56 -108 102 20 -63 67 74 -47 -50 43 -28
3498 -28 -113 14 52 13 -25 76 -21 -53 64 43 -46 -52 37 1 -24 -14 60 10 -84 20 -27 -64 -53 80 12 -35 -2 47
3526 47 -3 -21 -8 -2 -15 40 66 -24 -5 1 -13 -48 -3 40 -42 -136 77 28 -64 -32 55 -50 -6 65 119 -71 -40 97 -39
3555 -39 -37 111 14 -78 -4 75 -69 -30 54 -34 -159 11 76 -34 -99 42 49 -37 89 61 -35 -36 51 6 -24 -6 25 -135
3583 -135 -72 115 -40 -13 -27 -1 -7 5 18 61 -8 -41 -32 24 33 -28 46 -11 22 -2 6 -7 -86 64 7 -6 46 -34 -73 -17
3613 -17 90 36 -66 22 78 -17 -10 135 -52 -87 29 121 -42 14 63 -80 -137 56 84 -112 -48 62 -74 -38 162
3638 162 69 -99 4 86 -57 -53 140 18 -146 45 90 -40 -34 66 -39 -107 112 88 -112 -30 5 -51 -51 104 19
3663 19 -68 -9 75 28 49 52 -95 -33 59 4 20 -53 -51 19 44 8 -57 26 -24 -49 27 73 21 -114 32 88 11 2 96 -25
3693 -25 -83 86 57 -78 -59 84 -56 -54 68 69 -57 -8 33 -58 31 101 -41 -133 26 70 -31 55 66 -44 -103 94
3719 94 85 -77 -48 42 -93 -38 117 41 -101 -18 137 -34 4 151 4 -93 92 137 -1 -13 18 -25 -9 44 127 -97
3745 -97 36 11 -25 41 -7 -35 -5 38 56 11 -17 19 -18 -51 24 -11 13 -13 -51 -18 2 64 17 0 21 33 -3 26 -25 -58
3775 -58 18 51 -33 37 62 -42 -56 20 24 16 -12 28 -89 3 57 -3 -81 30 -11 -53 -4 70 1 -68 -13 33 -11 -21 4 -83
3805 -83 -60 41 72 -58 1 60 -9 -23 57 74 -97 34 25 4 -7 89 -2 -66 -3 5 -22 3 48 -33 -8 62 12 -25 -83
3834 -83 -52 76 -55 -12 74 -40 -14 6 32 57 -3 -9 67 -62 30 69 -14 13 58 -55 -10 -8 28 42 -24 63 40 5 12
3863 12 54 28 -39 -15 3 2 -24 78 21 -34 36 7 -72 4 48 -3 -41 32 47 -23 -29 52 34 -11 -2 23 -24 -31 24 -24 8 15
3895 15 25 -10 -17 21 -15 7 28 5 -37 -30 41 10 -44 48 69 -50 -19 -7 26 -23 -41 42 -42 -9 -51 11 -42 10 -5 -14 -1
3926 -1 24 55 -14 13 23 -38 -49 7 53 -58 -50 91 5 -67 1 3 -51 -36 38 -36 -13 34 31 0 -14 62 21 1 37 15 36
3957 36 57 101 0 25 39 -14 -24 -43 4 -9 -11 7 23 4 0 5 -56 -10 -2 0 -13 -27 47 2 -8 35 16 -26 34 24 19 -25 -38
3990 -38 -17 27 23 -13 14 -38 68 44 -51 -39 9 -25 -13 -42 9 19 -59 5 48 0 -49 49 0 15 -30 24 52 -78 14 66
4020 66 -39 -33 90 30 -42 41 11 2 20 104 6 -50 26 47 -39 -10 33 -2 -31 71 36 8 9 69 -44 -35 53 -3 -75 27
4050 27 63 -92 -67 64 -34 -70 26 11 -16 -37 66 40 -15 59 2 -6 -54 21 44 20 16 13 14 25 4 1 14 -16 -63 11 -13
4081 -13 -9 36 6 -91 -1 64 84 -9 -11 24 15 20 39 -39 -97 20 21 -48 30 12 -88 23 46 16 -36 -22 -2 -71 6 76 64
4112 64 -32 95 19 -2 41 34 -78 -65 71 11 -27 -32 37 -9 -53 107 52 -78 -45 -3 -49 19 111 25 -78 4 12 -46 66
4141 66 60 -74 37 21 38 18 -17 -24 16 31 72 -25 -56 25 -31 16 79 14 -20 -3 9 -29 35 50 -77 -18 23 24 -25 0
4171 0 -27 -17 -19 37 38 -15 26 -23 -16 39 64 -43 -36 -18 16 -6 17 35 -12 -31 106 7 -5 10 26 -41 -18 84 26 -11 -20 79
4203 79 -81 11 57 -82 -8 11 38 -16 4 -1 -68 5 36 6 -43 48 -28 -29 -6 68 8 -16 -14 -29 -6 71 2 -28 -24 48 59
4234 59 37 33 -15 5 21 54 13 26 28 -23 64 31 38 -13 5 6 7 70 30 -4 -35 83 44 -18 -12 -31 -91 -12 57 -6 -12 80 -47
4267 -47 -44 13 46 -52 19 69 -29 -38 45 21 -66 -28 89 6 -18 33 -30 -25 28 132 3 -55 48 0 15 -14 47 -68 12
4296 12 12 15 -18 -28 32 -13 -35 42 -9 0 36 14 17 44 30 -19 2 15 8 9 -31 10 35 -35 19 18 15 4 -56 95 24 -6 -23 21
4330 21 -4 12 -47 22 -9 -26 3 -11 -11 31 17 -64 -3 60 -56 -47 84 25 -35 6 57 -36 -40 33 53 -84 36 60 -1 -63
4360 -63 2 -21 82 33 -33 -41 -9 78 -19 -5 8 -5 -11 -28 10 22 -12 46 26 -19 -97 -23 -1 20 29 -21 -11 61 11 -5 1 10
4392 10 30 -32 -84 25 -4 -5 40 -5 23 19 -19 25 1 -7 -20 20 -3 17 -19 -5 -34 -28 -42 -14 -62 35 7 3 22 37 21 -80
4424 -80 54 -7 8 11 21 -3 18 -5 -25 29 -25 -1 -52 40 52 -74 -39 -85 29 20 8 53 19 -7 21 26 -21 1 -3 -35 -31
4455 -31 18 22 -16 -39 8 11 26 47 -11 -2 33 15 -24 -62 -14 -6 -40 3 18 -30 -82 27 -44 -24 0 -16 14 40 68 50 -14 -40
4487 -40 20 -4 2 -29 15 -4 -11 5 -21 -62 23 14 28 8 29 -33 0 39 -37 2 -23 6 18 -6 -47 -38 -51 -29 5 9 -6 -2 -24
4520 -24 -26 -63 -38 30 24 -49 -15 16 -91 11 -2 0 23 24 -10 10 6 34 -14 -61 -28 -21 -25 9 -11 -27 36 -14 2 -1 -56 -8 28
4553 28 6 -70 -21 -7 -12 -32 10 -20 8 52 -34 25 96 25 -23 9 -13 0 -9 31 43 -30 26 49 34 -24 36 -5 -69 20 68
4584 68 21 -5 51 7 -31 60 26 -65 2 7 -13 -43 55 -7 -121 -27 9 55 -35 25 -24 -24 45 -23 -29 23 25 4 2 35 16 -3
4616 -3 -86 -7 -9 16 -35 53 -29 3 16 -22 -44 40 10 2 17 -59 -11 -18 -29 -48 -43 39 -2 -9 8 -3 4 6 -6 -95 29 19 -1 -11
4650 -11 50 -23 -24 9 5 -10 -16 45 33 -8 11 54 -46 6 16 26 -22 61 3 -71 54 83 -18 -79 -2 -18 -51 51 -8 -21
4680 -21 -58 -27 6 -69 29 -17 -91 84 54 -50 -29 78 -24 -25 -13 15 25 1 -20 11 18 1 -32 -39 -8 83 -33 14 23 -79
4710 -79 -36 32 48 -9 55 -28 -49 -11 73 -32 -3 -9 -41 -15 65 45 -30 -39 51 22 -30 78 5 -47 -32 50 53 -32 16 12 -2
4741 -2 33 74 -49 -29 95 18 7 -9 57 -55 -18 57 13 20 47 -20 -41 57 19 -35 5 0 -65 -51 30 69 -13 -57 6 -8
4771 -8 -31 4 -23 -21 9 104 -11 0 41 -25 -37 -46 66 -17 -36 -30 -12 43 -28 -39 28 -11 -23 -41 -28 30 -29 -29 -3 -46 -43 49
4803 49 -19 -18 92 -12 35 -21 42 19 -31 16 -14 -32 15 13 -34 -26 59 9 -45 9 5 -3 6 6 -25 5 -27 -35 -52 23 37 17 0
4836 0 25 -20 -92 25 -12 10 -28 7 -11 -15 27 -9 -38 -7 -16 13 -48 32 13 -31 -28 -49 32 -29 -29 -33 -16 -22 17 63 35 36 -12 14
4870 14 -46 24 11 7 8 18 -16 -1 -29 -21 -39 8 -5 19 -39 -31 123 30 10 10 98 15 -37 56 -37 -58 6 15 30 -28 31 -28 -24
4903 -24 23 -18 -30 -27 -11 15 -26 13 9 -10 12 16 -44 32 33 32 40 -44 48 0 -8 9 26 20 -79 -7 -19 -3 -48 14 -10 -19 -7 -44 28
4938 28 71 68 24 20 0 -23 -8 -44 -8 10 -4 67 0 -9 45 -1 -25 -23 34 6 23 -14 -32 36 -25 -4 -5 -52 12 -23 -16 -28 18
4971 18 -56 13 24 27 41 -28 -38 5 -8 -4 26 -36 -10 60 29 36 -8 46 28 -38 7 22 -9 -35 -11 -24 27 18 45 -70 21 -35
5003 -35 38 -12 -7 -67 -12 17 8 22 41 -46 -3 -1 25 -63 -51 40 25 -3 37 -39 38 6 -27 1 7 11 17 39 -18 24 -35 27 -24
5036 -24 14 94 34 -29 -37 -36 33 -5 -6 -2 48 -49 46 11 -7 -14 41 4 58 17 -43 -38 35 49 -51 49 21 -12 -39 -7 -19 29
5068 29 -16 25 2 -6 18 10 12 16 30 -31 -68 31 -2 -26 -38 42 4 9 -23 0 26 42 -41 2 61 -28 -47 -57 45 -25 -20 5 -24
5101 -24 0 5 76 10 24 -16 10 -34 16 7 -17 -21 21 59 -19 35 -14 -46 -21 -9 13 -27 17 -64 34 33 3 -24 -3 30 -6 19
5133 19 39 21 -31 48 42 0 6 63 -9 -11 45 -14 -41 -19 -44 -22 -46 64 -37 -45 18 77 -15 40 45 -32 -19 15 38 60 -7 19
5165 19 -24 -29 59 40 11 3 48 36 41 85 -7 -16 11 -25 -26 12 83 -5 -18 -6 -78 -52 -38 47 -37 24 40 -16 -33 11 13 -20 42
5198 42 23 -36 4 28 13 18 0 5 -40 8 -7 -35 -47 23 -28 -52 44 38 -5 -58 13 2 5 80 -13 -30 60 41 2 29 59 11
5230 11 -82 10 43 -39 35 29 -51 30 2 -24 9 24 14 3 -16 -7 -8 -13 -16 2 11 48 1 5 -4 56 -18 46 45 -18 6 39 25 -30 -42
5265 -42 -36 -37 49 12 -8 24 6 6 -43 43 -29 -98 -32 32 29 -42 -25 -11 -45 13 73 52 -54 34 12 -7 -19 14 -24 -40 73
5296 73 -49 -1 25 30 -1 1 73 1 -46 -2 65 -21 -33 42 -36 -1 48 -13 -20 26 -53 -9 -66 6 20 -30 -50 33 -24 30 40
5327 40 11 -41 10 15 -14 65 27 19 -33 52 24 -5 -46 -20 42 21 -1 2 -29 -22 6 -34 51 -55 -15 -5 4 40 -20 72 -39 -51
5359 -51 33 -24 -8 9 26 -40 -27 30 -22 -7 23 69 4 10 21 -34 -71 17 20 -57 7 -14 -67 -45 51 3 -17 71 31 -39 -10
5390 -10 18 -40 -8 40 -15 8 22 64 18 -17 33 76 15 -18 52 34 25 34 1 15 37 15 -14 -17 -12 43 -25 37 62 -3 -7 -29 36
5423 36 18 -13 -46 -17 -39 -18 18 -19 -38 11 -12 -5 -13 12 -29 -18 -32 -8 33 23 -16 13 -2 28 -11 6 -1 -13 -13 7 -26 18
5455 18 -19 -23 12 32 -10 -42 10 -10 -1 10 35 52 -8 -50 -6 10 22 20 -4 -19 45 -40 -21 -27 -31 20 -55 32 -23 -59 28 -11 -29
5488 -29 28 66 -32 21 58 -15 -7 -2 -18 13 6 6 39 -42 -21 -22 21 14 -16 -17 -36 -10 -9 21 -14 38 38 -23 14 17 3 -25 5 52 -8
5523 -8 40 41 28 14 -4 5 45 -29 8 -20 4 18 65 53 22 -16 6 -16 31 36 42 -40 29 10 -44 -29 49 -2 6 36 -45 35 0
5556 0 6 50 43 0 -17 -47 -9 17 -8 40 -9 -17 -15 -14 9 -52 28 -29 -25 52 -13 -10 -20 -3 4 3 12 8 -5 16 -8 59 -12 9 -28 16
5592 16 -8 -11 -50 5 26 -12 49 -3 -14 53 25 8 -5 7 72 -26 8 1 14 3 19 6 23 2 50 16 -31 53 -18 -62 10
5623 10 -2 -16 -31 -28 52 -30 22 10 -21 42 6 -30 22 1 -5 -77 -20 13 -6 -60 -5 14 12 -9 15 20 23 -21 -15 33 47 15 -11
5656 -11 -12 64 5 36 -12 -30 0 13 71 -23 7 46 -8 -11 50 -9 0 27 -8 -54 55 51 -16 -52 21 -29 -46 38 -16 -59 40 1
5688 1 34 -10 21 15 -38 -8 36 -51 -13 30 -3 -36 5 -20 -30 -20 8 -17 -31 12 -82 -60 1 47 10 -34 50 24 51 -18 39
5719 39 -20 -103 -2 -19 -42 6 -53 -68 35 51 0 -64 2 26 -11 30 -19 8 -9 5 -15 38 16 15 15 55 -30 -21 14 -10 -57
5750 -57 -12 37 -1 -37 5 33 -40 19 35 8 -30 4 4 17 23 3 -42 -19 41 -18 16 -1 -3 10 16 -34 -36 -52 13 -39 -7 14 -18
5783 -18 -17 -10 -11 10 -70 -26 -18 -79 -27 10 6 -15 24 -18 2 28 14 -42 6 12 -21 0 -25 14 25 17 26 -11 -5 -11 15 -59 4 -4 47 5
5819 5 -27 -13 -44 -2 -11 -51 -30 -6 24 -13 -7 9 -22 57 32 20 2 -3 -19 17 10 -18 10 15 18 31 36 -20 -11 6 6 -16 -2 49 -2
5854 -2 -3 17 -8 11 -5 29 -15 -3 61 -41 5 3 33 -36 -2 -49 -9 36 30 5 46 -27 -21 33 31 -12 -51 -13 40 33 15 18 -38 -29
5888 -29 -9 -5 21 -5 -23 -9 -36 -52 3 -20 23 -26 27 -96 -20 -14 18 -7 12 -18 11 11 -15 -42 -14 -31 12 -5 -17 14 9 16
5920 16 -7 20 51 41 36 47 -28 43 16 -8 2 36 -24 -38 -65 -14 -39 -16 -87 13 -53 2 -33 -12 12 31 21 -41 -17 -7
5950 -7 39 55 14 -7 6 5 -18 -15 0 -8 -17 -8 53 34 12 -6 11 -16 16 1 17 -24 31 -17 -9 -34 -70 1 -23 -18 26 21 13 -4 -2 28
5986 28 25 17 56 44 -5 -56 66 1 -35 0 2 6 19 18 31 -44 -19 66 -20 1 0 62 36 -12 15 43 -13 -12 1 40 2 25 -40
6019 -40 16 -4 -27 42 14 -5 26 61 -18 -26 19 2 14 -13 -19 -10 26 20 -35 6 -11 59 -31 -30 38 5 54 -58 -62 50 -67 5
6051 5 -24 33 70 19 -28 3 -19 -52 5 7 -28 43 -4 34 55 -25 -45 -4 -16 43 20 4 -48 39 20 48 -44 17 -58 -28 28
6082 28 -3 -41 -15 15 48 42 -86 42 58 -15 -45 -5 -44 -29 -29 15 -18 -20 -19 18 -7 1 -55 42 -34 -62 -8 24 -16 -18 87 60
6114 60 -44 -18 8 8 -16 8 33 -36 0 -16 -15 -17 -13 -59 19 32 4 -7 10 -40 -14 14 58 29 -32 3 23 6 53 -49 38
6145 38 16 7 -16 1 9 36 35 -23 -55 21 60 -35 4 21 12 -22 -1 -11 44 -29 -17 9 43 -5 -11 4 29 -20 -10 -35 0 60 -17
6178 -17 4 31 -39 9 -10 18 64 2 -82 24 -1 -53 -19 -6 -31 6 30 21 19 10 -66 -61 40 -2 -11 -12 26 -35 2 26 10 -3
6210 -3 -5 34 -36 21 -26 -5 57 -24 -17 35 31 12 5 20 44 -9 29 -9 -25 -3 13 -24 -45 21 38 17 -7 17 -50 48 10 -27 -25
6243 -25 48 13 -11 -10 58 -12 -52 4 46 -38 75 29 -47 -45 24 -58 -3 13 23 14 8 29 3 -39 20 29 26 26 10 25 10 46 24
6276 24 -21 -30 115 0 -19 32 -13 17 7 37 -36 -13 7 -4 -32 38 -16 -28 17 24 -15 3 90 40 -6 -4 -8 -13 42 -2 -47 37
6308 37 -51 -2 -49 38 -24 -31 -22 -11 -36 -25 -11 -45 2 -4 -6 -26 19 9 -52 -26 0 20 7 -18 56 29 67 3 -25 -15 -23 -26 24
6341 24 36 -48 -77 -30 60 -44 34 -38 -16 -13 37 41 -11 10 -44 -27 29 85 5 -42 -1 19 23 21 40 -17 -22 2 -14 -30 -18 36
6373 36 45 1 12 -25 8 17 -51 4 28 -10 41 -14 -42 -10 23 -21 9 33 -55 33 16 28 35 -48 30 -24 2 -1 7 9 -36 -11 12
6406 12 -9 -45 24 -11 11 -31 -3 -36 5 31 -10 -14 -13 27 -34 19 52 3 -22 2 -6 -34 -23 10 -4 -38 -13 47 27 25 -16 -4
6438 -4 -16 -25 -43 -55 3 56 -12 -27 13 16 35 16 -55 7 -28 24 -12 -21 1 37 -47 -26 38 1 6 9 9 7 18 16 -21 -43 33 23 -42
6473 -42 18 32 63 45 20 -32 -70 -11 55 -8 -27 17 -14 46 50 52 16 -34 -22 11 56 -56 -29 4 19 17 2 -4 -8 -58 17 -9
6505 -9 -40 -1 -40 7 -15 -7 -36 26 -62 -22 52 -48 -3 21 -26 -56 -32 -53 26 -42 39 7 -36 -43 0 -63 -12 12 9 28 -25 25
6537 25 -37 16 -11 -34 -10 35 -1 -18 29 43 34 33 -26 17 5 -25 -20 -58 28 -1 30 18 -5 20 -45 61 -23 -38 3 22 16 -17
6569 -17 -93 9 -34 39 -8 -49 -6 -3 38 26 -42 -34 -34 -50 -1 -17 7 5 26 -4 13 -7 -72 7 -45 -6 64 25 10 9 -11 26
6601 26 -3 -10 19 -25 6 21 -54 -6 -30 -33 26 32 -54 6 -20 21 -33 45 -12 -10 2 3 31 18 29 -43 -26 -16 -17 8 -7 -54 -31
6634 -31 13 49 61 -30 19 46 -28 -17 37 -4 22 -57 -37 -9 48 -1 -26 2 -25 -1 52 11 6 -39 -14 18 -6 37 5 7 -37
6665 -37 -17 9 45 3 42 13 -20 3 16 49 -47 0 -13 -36 7 14 34 -61 -23 43 -20 -33 31 13 24 44 -11 12 -58 5 -23
6696 -23 -6 29 4 -34 -11 -44 12 21 41 -8 24 45 6 -5 5 -37 -23 47 21 0 -1 -1 26 19 48 30 -13 -22 11 -10 2 13 -20
6729 -20 20 13 25 13 -15 -5 -34 -4 38 30 -27 14 -22 -5 15 -68 -1 0 12 12 18 21 23 -52 11 -34 -13 66 5 46 37 18 21 -1 36
6764 36 -8 -10 -11 42 27 10 4 12 58 25 20 -10 47 25 11 -33 -11 7 -24 32 5 -4 -19 -8 31 -1 -3 -42 -3 19 109 -16 -29
6797 -29 -51 54 57 -57 22 -10 -29 19 9 -41 20 32 38 -8 -10 -8 -30 10 -17 10 -17 -30 -7 36 -9 6 16 0 -1 9 14 -25
6829 -25 15 -36 -8 -25 22 3 1 9 -28 -17 -38 -15 -25 24 -31 12 -26 -50 -6 -23 14 -6 30 9 -4 -19 5 -29 49 12 -44
6860 -44 -31 -56 3 -69 -9 -11 12 40 10 -28 -4 -43 -89 -44 11 19 -38 -13 4 -2 3 9 -32 55 -4 12 3 38 -24 -49 -17 -16 79 -45
6894 -45 -25 36 29 28 10 30 -57 27 -2 15 32 5 -17 15 -18 55 49 -18 -16 -19 -72 4 20 11 42 46 -28 29 -3 -12 -45 22 34 33 -4
6929 -4 -22 9 -39 -24 16 25 -17 55 24 -19 -3 -62 32 -9 0 -2 -38 22 27 -26 42 -9 0 61 3 10 17 -17 -4 30 66 -61 5 -8
6963 -8 -11 16 -4 -45 6 13 -10 11 29 4 -42 -45 33 56 -6 -6 -24 16 3 11 10 19 4 -2 -66 6 -26 -18 43 31 53 29 -33 -32 17 10
6999 10 -7 -13 31 42 17 21 11 25 43 -19 -20 39 1 -29 -31 39 -14 4 32 -23 -2 35 -21 16 -11 -9 56 34 -42 -35 -11 -17 43 14
7033 14 61 4 -79 -42 55 -43 -43 -14 -38 18 36 -53 33 1 20 -11 46 1 20 8 -24 -17 -9 35 -21 -55 -4 0 -23 44 16 -50
7065 -50 -20 -29 -14 23 18 33 -27 37 -52 28 -43 -2 6 -11 23 -5 -15 23 -41 -18 -8 27 -27 4 5 -8 -10 36 40 -3 -27 -49 33
7098 33 34 31 -62 7 21 -54 35 10 -21 -23 -16 -32 -25 39 -30 4 -18 39 23 14 3 26 2 -8 -22 5 -2 6 1 12 -24 -1 8 -4 1 40
7134 40 -66 34 -11 -17 19 8 -26 15 -2 20 69 -49 8 -3 -8 0 -26 3 -22 -4 -16 19 -62 -28 20 40 -3 30 46 -36
7164 -36 -29 -5 -17 18 -25 -48 3 3 5 -36 86 -102 -17 29 -39 -7 -21 -3 -7 -25 26 10 -45 -21 38 -24 -23 -34 -31 -36 -25 59 23
7197 23 -25 14 -35 -56 32 -45 -64 -30 2 -29 15 8 -8 -40 -27 -28 -38 33 25 -28 5 36 -12 51 -7 -21 -10 19 -33 -6 25 40
7229 40 -40 16 -4 55 15 9 -22 -16 -52 -48 -17 -58 38 28 -31 47 -8 -38 36 -9 -12 46 -8 -49 21 -3 -21 0 29 -22 7 36
7261 36 -19 -19 20 31 3 -8 3 29 -2 -5 7 25 51 -53 19 -80 12 28 9 39 23 19 45 7 -33 20 32 -4 -6 -53 2 -15
7293 -15 7 28 -14 -40 -11 -20 -39 -1 1 -2 9 16 -9 -23 -11 0 66 19 36 -54 18 -5 -34 20 -29 5 -9 -19 37 12 43 -12
7325 -12 -1 -55 -39 52 59 -31 -26 51 12 15 -10 -24 -14 0 30 -29 14 -19 0 66 24 -26 -57 3 1 19 -50 -4 42 0 -3 7 2
7358 2 22 13 32 -11 -11 26 56 2 -32 -2 -4 13 -19 18 -18 49 37 -21 28 11 4 -17 -17 -29 -22 40 -57 -24 23 -1 6 3 -49 29 -54
7393 -54 108 -22 -8 48 18 41 15 29 -17 -19 21 36 -22 86 -15 2 35 -45 -26 4 23 -29 -28 -3 -37 -19 -3 33 -13
7422 -13 49 -72 -23 -25 3 -4 29 22 -31 -21 0 76 49 13 52 77 4 -1 51 22 0 19 27 -29 15 -5 7 -9 52 10 -5 -30
7454 -30 29 -4 24 13 51 42 39 13 -23 -11 -11 -9 0 -2 42 -3 -13 42 -29 -43 -76 -71 -1 42 8 27 44 34 -40 -22 58 54 42 19
7488 19 2 -46 -53 40 -29 -11 32 -4 -2 -66 -10 -1 -24 -2 3 -12 -35 22 -24 -35 18 -25 4 44 -18 28 43 5 -2 75 -9 74 -17
7521 -17 43 -16 -18 -21 25 22 44 -28 -44 49 -5 -7 -89 10 -13 -5 10 -7 -22 1 -13 22 -12 2 68 -15 -51 20 10 -18 59 32 -10
7554 -10 -36 30 0 32 22 -25 50 19 9 -9 7 -3 37 -33 -25 -40 28 -14 -3 -48 -27 -21 -4 -9 12 2 6 2 -8 43 -29 -1 19
7587 19 -44 -36 6 53 6 -3 -9 2 8 30 27 -24 27 -20 -16 32 24 -28 11 2 41 43 13 -11 19 38 1 9 -32 -47 16 22 7 20 -3 44
7623 44 12 -33 -2 13 47 2 -28 30 -72 27 24 12 49 -32 -28 32 -7 -34 68 -70 -23 -22 -9 -7 4 -3 -16 -29 -8 -42 -24
7654 -24 11 32 27 23 57 -42 -64 -1 -28 -6 27 30 -5 -29 58 -96 -52 11 3 -18 2 10 -30 31 -48 5 4 -1 -11 -34 38 30 15 -11
7688 -11 22 4 -15 -1 49 20 -8 62 41 43 28 5 -29 -18 19 56 -11 28 -1 -25 9 -43 -17 -1 -10 -35 -26 56 8 3 61 5
7720 5 -57 -22 24 56 -41 2 -6 16 19 -38 -35 28 24 8 16 29 37 -18 15 15 -10 2 -2 -72 31 -51 -49 -18 14 -7 -1 54 -22 24 -24
7755 -24 -15 -1 -30 -22 46 -24 -2 23 28 7 1 -17 -11 38 -10 4 50 29 -51 31 -35 50 -16 4 -84 -27 -38 73 -20 -63 35 -14
7787 -14 39 -8 -15 0 -10 -1 -38 18 52 18 -6 -43 -14 30 -40 -39 37 -14 5 -47 -3 -65 1 -22 16 -46 -22 16 -26 -50 -18 6
7819 6 -22 -20 -20 5 10 29 -47 4 23 -8 -36 -16 63 -19 -18 4 -15 79 11 -14 26 12 62 -14 17 -6 -34 29 -20 42 -30 2 26
7852 26 0 -53 13 50 14 -3 -5 -39 23 19 -23 31 3 -14 30 -16 5 1 -29 13 -32 -26 27 25 68 10 -3 -26 7 12 11 7 -39 40
7886 40 -25 -27 -13 -33 -13 -5 28 75 78 -1 25 33 22 19 5 -34 -3 -63 38 -38 28 43 21 -38 4 35 -55 18 -29 5 10 -15 50
7919 50 -13 47 -14 -11 -63 1 -30 -19 -32 0 0 -45 -28 -47 -41 44 24 -23 25 35 -24 -22 -30 -71 44 -46 1 43 29 73 -34 41
7951 41 14 -2 -30 9 -10 -25 -7 -49 -2 -28 -35 -24 -39 -31 37 13 9 30 15 35 43 -21 -1 9 -58 55 -10 -70 -5 37 -47 -24
7983 -24 15 11 26 18 -36 -57 31 -5 4 34 29 2 -14 33 -30 35 9 -15 4 19 -33 -15 -24 31 26 -19 13 -32 14 -37 14 -36 30
8016 30 11 -7 -20 -22 -37 19 -3 -31 10 6 26 58 -3 -1 31 9 -29 -36 11 -29 52 -11 2 23 -15 -12 1 33 16 -17 -29 -27 -25 -20
8050 -20 -7 -22 30 -3 42 -24 -2 -25 36 -54 21 23 -2 -58 67 -11 48 29 -11 18 -42 -10 13 22 22 75 5 30 12 47 -50
8081 -50 13 17 -15 -30 43 -55 -17 30 51 5 -57 23 -36 30 5 16 50 -21 -31 -1 -32 -39 -17 -4 24 22 -9 -25 2 21 4 -18
8113 -18 75 -31 -28 12 -7 48 35 22 37 23 -9 36 -29 -18 -27 -20 23 -6 -14 8 22 13 -20 -53 -39 58 -22 -8 13 -14 -21 -23 -6
8146 -6 -62 -14 56 74 -4 8 15 13 -50 4 -56 48 -2 -36 -40 -34 0 -40 41 -20 -9 22 -15 3 1 -9 -3 -24 -6 -5 5 -16 9 -52
8180 -52 -7 -22 -32 46 27 20 4 -1 -16 -25 -6
8191f
##END NTUPLES=NMR FID
##END=
