##TITLE=1H_Pr 92-H
 200.13MHz, CDCl3,
 8 sc
 
 29.4.2025
##JCAMPDX= 6.0         $$ Bruker NMR JCAMP-DX V2.0
##DATA TYPE= NMR FID
##DATA CLASS= NTUPLES
##ORIGIN= UXNMR, Bruker Analytische Messtechnik GmbH
##OWNER= pz
$$ XWIN-NMR		Version 3.5
$$ Tue Apr 29 16:37:12 2025 Russian Standard Time (UT+4h)  she@DPX200
##.OBSERVE FREQUENCY= 200.1315
##.OBSERVE NUCLEUS= ^1H
##.DELAY= (6, 6)
##.ACQUISITION MODE= SIMULTANEOUS
##.ACQUISITION SCHEME= undefined
##.AVERAGES= 8
##.DIGITISER RES= 18
##SPECTROMETER/DATA SYSTEM= spect
##.PULSE SEQUENCE= zg30
##.SOLVENT NAME= CDCl3
##.SHIFT REFERENCE= (INTERNAL, CDCl3, 0, 14.3821)
##AUDIT TRAIL= $$ (NUMBER, WHEN, WHO, WHERE, WHAT)
$$ ##TITLE= Audit trail, XWIN-NMR		Version 3.5
$$ ##JCAMPDX= 5.01
$$ ##ORIGIN= Bruker BioSpin GmbH
$$ ##OWNER= she
$$ F:/spectra/data/she/nmr/H-C/1/audita.txt
$$ ##AUDIT TRAIL=  $$ (NUMBER, WHEN, WHO, WHERE, WHAT)
(   1,<2025-04-29 16:35:34.85 +0400>,<she>,<DPX200>,
      <created by zg, POWCHK disabled, PULCHK disabled
       configuration hash MD5:
       00 E9 B6 7A A2 85 ED C7 34 08 36 98 17 FE 4E 26
       data hash MD5: 16K
       C4 AE 43 0C 4C 26 F7 72 99 44 36 71 77 56 8F 27>)
$$ ##END=
$$ 
$$ hash MD5
$$ B3 FA 15 C5 28 0B DE 77 30 C9 2A 69 99 C5 63 05
##$RELAX= 
##$RELAX= 
##$RELAX= 
##$RELAX= 
##$RELAX= 
##$RELAX= 
$$ Bruker specific parameters
$$ --------------------------
##$DU= <F:/spectra>
##$EXPNO= 1
##$NAME= <H-C>
##$PROCNO= 1
##$TYPE= <nmr>
##$USER= <she>
##$AMP= (0..31)
100 100 100 100 100 100 100 100 100 100 100 100 100 100 100 100 100 100 
100 100 100 100 100 100 100 100 100 100 100 100 100 100 
##$AQSEQ= 0
##$AQ_mod= 1
##$AUNM= <au_zg>
##$AUTOPOS= <>
##$BF1= 200.13
##$BF2= 200.13
##$BF3= 200.13
##$BF4= 200.13
##$BF5= 200.13
##$BF6= 200.13
##$BF7= 200.13
##$BF8= 200.13
##$BYTORDA= 1
##$CFDGTYP= 0
##$CFRGTYP= 5
##$CHEMSTR= <none>
##$CNST= (0..31)
1 1 145 1 1 1 1 1 1 1 1 1 1 1 1 1 1 1 1 1 1 1 1 1 1 1 1 1 1 1 1 1 
##$CPDPRG= <>
##$CPDPRG1= <>
##$CPDPRG2= <>
##$CPDPRG3= <>
##$CPDPRG4= <mlev>
##$CPDPRG5= <mlev>
##$CPDPRG6= <mlev>
##$CPDPRG7= <mlev>
##$CPDPRG8= <mlev>
##$CPDPRGB= <>
##$CPDPRGT= <>
##$D= (0..31)
0 0.7 0 0 0 0 0 0 0 0 0 0.03 0 0 0 0 0 0 0 0 0 0 0 0 0 0 0 0 0 0 0 0 
##$DATE= 1745930134
##$DBL= (0..7)
120 120 120 120 120 120 120 120 
##$DBP= (0..7)
150 150 150 150 150 150 150 150 
##$DBP07= 0
##$DBPNAM0= <>
##$DBPNAM1= <>
##$DBPNAM2= <>
##$DBPNAM3= <>
##$DBPNAM4= <>
##$DBPNAM5= <>
##$DBPNAM6= <>
##$DBPNAM7= <>
##$DBPOAL= (0..7)
0.5 0.5 0.5 0.5 0.5 0.5 0.5 0.5 
##$DBPOFFS= (0..7)
0 0 0 0 0 0 0 0 
##$DE= 6
##$DECBNUC= <off>
##$DECIM= 32
##$DECNUC= <off>
##$DECSTAT= 4
##$DIGMOD= 1
##$DIGTYP= 9
##$DL= (0..7)
0 120 120 120 120 120 120 120 
##$DP= (0..7)
150 150 150 150 150 150 150 150 
##$DP07= 0
##$DPNAME0= <>
##$DPNAME1= <>
##$DPNAME2= <>
##$DPNAME3= <>
##$DPNAME4= <>
##$DPNAME5= <>
##$DPNAME6= <>
##$DPNAME7= <>
##$DPOAL= (0..7)
0.5 0.5 0.5 0.5 0.5 0.5 0.5 0.5 
##$DPOFFS= (0..7)
0 0 0 0 0 0 0 0 
##$DQDMODE= 0
##$DR= 18
##$DS= 0
##$DSLIST= <SSSSSSSSSSSSSSS>
$$ [...]
##$SUBNAM0= <"">
##$SUBNAM1= <"">
##$SUBNAM2= <"">
##$SUBNAM3= <"">
##$SUBNAM4= <"">
##$SUBNAM5= <"">
##$SUBNAM6= <"">
##$SUBNAM7= <"">
##$SUBNAM8= <"">
##$SUBNAM9= <"">
##$SW= 18.0517148125397
##$SWIBOX= (0..15)
0 0 2 0 0 0 0 0 0 0 0 0 0 0 0 0 
##$SW_h= 3612.71676300578
##$TD= 16384
##$TD0= 1
##$TE= 0
##$TE2= 300
##$TE3= 300
##$TEG= 300
##$TL= (0..7)
0 120 120 120 120 120 120 120 
##$TP= (0..7)
150 150 150 150 150 150 150 150 
##$TP07= 0
##$TPNAME0= <>
##$TPNAME1= <>
##$TPNAME2= <>
##$TPNAME3= <>
##$TPNAME4= <>
##$TPNAME5= <>
##$TPNAME6= <>
##$TPNAME7= <>
##$TPOAL= (0..7)
0.5 0.5 0.5 0.5 0.5 0.5 0.5 0.5 
##$TPOFFS= (0..7)
0 0 0 0 0 0 0 0 
##$TUNHIN= 0
##$TUNHOUT= 0
##$TUNXOUT= 0
##$USERA1= <user>
##$USERA2= <user>
##$USERA3= <user>
##$USERA4= <user>
##$USERA5= <user>
##$V9= 5
##$VALIST= <valist>
##$VCLIST= <CCCCCCCCCCCCCCC>
##$VD= 0
##$VDLIST= <DDDDDDDDDDDDDDD>
##$VPLIST= <PPPPPPPPPPPPPPP>
##$VTLIST= <TTTTTTTTTTTTTTT>
##$WBST= 1024
##$WBSW= 4
##$XGAIN= (0..3)
0 0 0 0 
##$XL= 0
##$YL= 0
##$YMAX_a= 48270
##$YMIN_a= -71068
##$ZGOPTNS= <>
##$ZL1= 120
##$ZL2= 120
##$ZL3= 120
##$ZL4= 120
##$ABSF1= 10
##$ABSF2= 0
##$ABSG= 5
##$ABSL= 3
##$ALPHA= 0
##$AQORDER= 0
##$ASSFAC= 0
##$ASSFACI= 0
##$ASSFACX= 0
##$ASSWID= 0
##$AUNMP= <proc_1d>
##$AZFE= 0.1
##$AZFW= 0.1
##$BCFW= 1
##$BC_mod= 2
##$BYTORDP= 1
##$COROFFS= 0
##$CY= -3
##$DATMOD= 1
##$DC= 2
##$DFILT= <>
##$DTYPP= 0
##$F1P= 0
##$F2P= 0
##$FCOR= 0.5
##$FTSIZE= 0
##$FT_mod= 4
##$GAMMA= 1
##$GB= 0.15
##$INTBC= 1
##$INTSCL= 1
##$ISEN= 128
##$LB= 0.25
##$LEV0= 0
##$LPBIN= 0
##$MAXI= 10000
##$MC2= 0
##$MEAN= 0
##$ME_mod= 0
##$MI= 1.114404
##$NCOEF= 0
##$NC_proc= 0
##$NLEV= 6
##$NOISF1= 3.799351
##$NOISF2= 2.8
##$NSP= 1
##$NTH_PI= 0
##$NZP= 0
##$OFFSET= 14.38212
##$PC= 1
##$PHC0= -1547.341
##$PHC1= 7.392209
##$PH_mod= 1
##$PKNL= yes
##$PPARMOD= 0
##$PSCAL= 0
##$PSIGN= 0
##$REVERSE= no
##$SF= 200.129724274929
##$SI= 16384
##$SIGF1= 3
##$SIGF2= 2
##$SINO= 400
##$SIOLD= 16384
##$SREGLST= <1H.CDCl3>
##$SSB= 0
##$STSI= 0
##$STSR= 0
##$SW_p= 3205.1282051282
##$SYMM= 0
##$S_DEV= 0
##$TDeff= 0
##$TDoff= 0
##$TI= <>
##$TILT= no
##$TM1= 0
##$TM2= 0
##$TOPLEV= 0
##$USERP1= <user>
##$USERP2= <user>
##$USERP3= <user>
##$USERP4= <user>
##$USERP5= <user>
##$WDW= 1
##$XDIM= 8192
##$YMAX_p= 0
##$YMIN_p= 0
$$ End of Bruker specific parameters
$$ ---------------------------------
##NTUPLES= NMR FID
##VAR_NAME=  TIME,          FID/REAL,        FID/IMAG
##SYMBOL=    X,             R,               I
##VAR_TYPE=  INDEPENDENT,   DEPENDENT,       DEPENDENT
##VAR_FORM=  AFFN,          ASDF,            ASDF
##VAR_DIM=   8192,          8192,            8192
##UNITS=     SECONDS,       ARBITRARY UNITS, ARBITRARY UNITS
##FACTOR=    0.0002768,     1,               1
##FIRST=     0,             0,               0
##LAST=      2.2672688,     0,               0
##MIN=       0,             -71068,          0
##MAX=       2.2672688,     48270,           0
$$ Real data points
##PAGE= N=1
##DATA TABLE= (X++(R..R)), XYDATA
$$ [...]
1650I9r0j10N0L27l42l00Q09m98k18M59l74j9K05K1n76O84J33p94N23j46m76J004
1672C71k64o00K76M79r37M04M80q94O75K22o97L85J07l14J88J62l36j5N86n26
1692b48K37P9l74K81K34l14k40L65L2k25J72n8l83L50O51q39K93L70n66o0Q30
1713E87p85o5Q75q38L22L83o26K52L68m49j72Q73p78p2O83n77j28N15k49k22M24
1734C21j41l23N38j09n78N50r1l50K51P1n7j77J75k87J80M27m81m3L08k57n9K76
1756A44j78k73N33k31o02Q18l45l82Q88m01l11J30N99q93L09J41l42O00q8o86
1776e70M04J45j36j35N64q28K01O40o66J40N25p35J92L11r4j03J53J41m70N26
1796B05k16l91P07k56k45J72L56m90K29M49p93N25J05n53L91J50n89K16M00m14
$$ y = [99, 9, -101, -51, 276, -66, -366, 443, -55, -273, 186, -188, -207, -2, 19, -557, 127, 260, -534, -11, -157, -633, 371, 107, -493, -217, 262, -675, -271, 209, -685, -10, 212, -485, -100, 7, -307, -119, 43, -293, -308, 278, -248, -11, 68, -306, -25, 209, -105, -345, 20, 52, -173, -1, -59, -442, -92, 559, -280, 13, 383, -183, -243, 587, -198, -263, 612, -226, 96, 479, -147, 105, 473, 24, -148, 725, -53, -125, 558, -19, -147, 368, 119, -103, 321, 180, -143, 395, 286, -292, 258, 167, -183, 68, 139, 82, -95, 80, -207, -27, 400, -81, -124, 184, -73, -132, 144, -34, -307, 226, -5, -607, 211, -134, -516, 372, -29, -340, -210, 389, -504, -195, -54, -396, 204, 116, -570, -166, -21, -157, -292, 272, -556, -355, 285, -381, -241, 284, -451, -259, 52, -42, -145, 8, 149, -321, 205, -11, -402, 305, 49, -196, -24, 332, -158, 71, 520, -273, 252, 357, -196, 195, 345, -244, -28, 372, -42]
1816d2J78K91m09k9M24o87K51L49j60k50M09k11n04O86q3n71O53J9l21J31l0k67
1838a73Q8M52o52L27J37n57M49J72n12O7L32m7n77Q51k97j35M99l52l99M92j05
1859F0k56M44l8o09M28J06o51O22r4m76K35M08o74J23M25n96K91N58r18M16M01
1880B05l74K0L45k18l12N00j87j10L11m04J23K39J5k81K71K7j47o0L24p95N89
1901H1J7l04K86K17m08k1L90j64J73K58n20l96P16m62J09N93n41l00P66l36m09
1922b55P88n94Q8M34n37o8L53J77o91L88K14l68L70k41m97P69j91j91K2J14k71
1943a87O3J87l84J77M06j98k31K03K60n58K64R7p77N96K95p13M72L85o77K35K11
1964A26m61K48L01o54M03J67o61O19J5m45K60K38l09P9J37j20j64M64l50J62J23
$$ y = [-42, 136, 427, 18, -11, 413, -274, -23, 326, 166, -84, 325, 114, -390, 296, 213, -358, 295, 314, -7, 124, 94, -173, -85, 367, -285, 42, 179, -378, 71, 243, -269, -202, 130, 83, -494, 357, 60, -75, 424, 72, -327, 165, 60, -196, 248, 210, -399, 29, 135, -516, 106, 12, -464, -229, 179, -495, -372, 53, -543, -252, 306, -612, -196, 205, -169, -149, 196, -22, -334, 166, -21, -131, 180, -224, -101, 138, 153, -128, 143, 170, 23, -37, 287, -508, 81, 98, -206, 80, 297, -111, -132, 258, 94, 267, 525, 5, -391, 325, -137, -28, 565, 24, -276, 490, 154, -255, 533, -61, 27, 461, -76, -144, 209, 386, -305, 83, 297, -71, 299, 58, -439, 330, 139, -52, -30, 84, -187, -124, 63, -321, -144, 262, 64, -167, 36, 296, -262, 2, 99, -678, -82, 213, -500, -28, 357, -320, -85, 126, -335, -87, 214, -440, -37, 130, -531, 88, 103, -342, -82, 156, -153, -74, 63, -57, -221, 243, -107, 55, 178]
1985A78k97lN55l24l56N65r6l52O09l49j40J73J04l09R5K72l95J54K33m73P2N28
2007D44m78J6M57l31k89N56l18l99N63n73L10M12l55K6K01n7m85K79K19k62K37
2028A73J14o86M14R0j62l6L00l04o7L65l26P2Q6k78K62K07m50nL84j36l06N12
2050B23m35J0K02m2l19M30J88o15K72K59n97N69N0n59L55M6Rk80J79n6J11J22
2072A22m48K17L89k86mK22k59P0J80r8k57L54k26N5J07l52J90J96o1k54K03L60
2094D20o23N07j89m7j37L2k5j00L09j61Q5J96n43K49L26k92J3J37k37n5N01m00
2116c4j69K13j96J35K50k80j15M91l52q2K96l0k78L63k45k66K68J21l49K19J44
2137A04j77l9Lk53K5M39j07m42M89k25l3M01j50l08L41Q1m92L74m4l83M01J03
$$ y = [178, -119, -122, 433, 109, -247, 318, 222, -130, 479, 130, -10, 163, 267, -42, 53, 325, -70, 84, 317, -156, -84, 444, -34, -18, 439, 108, -181, 375, 57, -342, 221, -352, -42, 370, 15, 41, 242, 185, -300, -21, 198, -64, 173, 287, -399, 15, 105, -57, -93, 207, -97, -164, 201, -125, -53, 33, -245, 17, 224, -226, -231, 153, 17, -289, 223, -212, -202, 0, -42, -361, 69, 257, -358, -86, 173, -424, 145, 195, -364, -9, 37, 46, -234, -55, -111, 0, 122, -326, -109, 280, -6, -10, 212, -47, 23, 203, 105, -152, 202, -24, 31, 138, -214, -24, 172, 111, -143, 60, 420, -203, 304, 115, 68, -69, -37, -62, -162, 147, -14, 71, 267, -276, -27, 299, 7, 20, 157, -80, -135, 366, -34, -203, 10, -186, -51, 199, -81, -196, 295, -57, -139, 157, 127, -151, 212, -33, -299, -31, 90, -259, -40, 104, -73, -112, -109, -362, -337, 102, -5, -447, 42, -183, -216, 185, 35, -273, 68, 149, -343, 31, -13, -396, 5, 108]
2159A08l28K23L32n78J97L32o16K90J47k75j3M36l48o1L25k98n5N20j93k38O0
2180c3j01J0L16j18K2J36J04n16P3N5K9K58j12k18K38m1p2j21L84k19l73N60m41
2203a80J83K52l75j3J66q6o1L96l01k54M13J3k15K10q6k01j2K96l42L71L3m74
2225b67K95J0N5mO2r8p0J65J8k15J21k04q4L39mm66L31l3k22M27j98l63N57j54
2249bp7L04j27k82J89K1l04L02N8j85K89m6l13L93j32j86J38L00k09k41K20j77
2271f7Q1J4j03j4K11m1j09K46n2l24L01j03j52L13k68J14L4L18n46K30K21l21
2293a7J22J29k37Q2J36k18j30K96k54N3K29j68J11j60j02J26J09k80J71J1n3J5
2315b9J37k0k37J57J92m6n4l40J51K70M7m54J46J15k04j5K07j54J22L0k11j16
$$ y = [108, -220, 3, 335, -243, -46, 286, -330, -40, 107, -168, -181, 255, -93, -154, 171, -127, -182, 338, 145, -93, -33, -134, -124, 192, 74, 96, 232, 336, -180, -107, -52, -23, 235, 123, -95, 143, 102, 30, -91, 293, 74, -299, 261, -180, 3, 255, -120, -133, 33, -53, -114, 282, -19, -273, 140, 153, -62, 148, 62, -139, -151, 145, -197, 174, 207, -267, 28, 38, 93, 89, 151, 53, -17, 148, 166, -49, 72, -132, -216, 123, 119, -347, -16, -49, -271, 156, -42, -405, 152, -2, -79, 225, 98, -184, 5, 26, -278, 24, 82, -103, 186, 140, -173, 220, 88, -98, 40, 340, 131, -110, 110, -67, 14, 28, -75, -89, 122, 81, -28, 218, 166, -158, 143, 40, -112, 201, -67, 47, 81, 399, -147, 83, 304, -17, 105, 234, -3, 79, 215, -3, -133, 163, -91, -38, 191, 23, 134, -26, -128, -2, 107, -173, -2, 9, -44, -29, 108, 88, -149, 8, 200, 154, 100, -240, -89, 181, 228, -226, -80, 35, -169, -184, 23, -131, -9, 21, -190, -306]
2337c06M49l18Q9K66l30J36K19k13j97K27l6N1lJ74m24M68l46K3J49p5l5J13M
2360H5j29J38K30l18m7K2o7J0J43n0j90N04k52j10J96Ol12K98k88J18j35L43m03
2383b08L52k9r5Q5Q3k30m0K58k12K76j32k64J90J65o0k31P4j3K2K3K64l62K00
2406A16j87OL96l56j26K01k31J63O1q3K42j78N8m21L20J07k61J24J26l22n8L29
2428B6j85j09L81j47m8L47n27J97J04k04PJ98o5p5L71k71p0n5K12k40K45N0j61
2451a9N8J12k82K90l44j9M58k03o4%K56l85L57l9j13j30J83J44l02J18k4j55L80
2474B77k24J1J96k67l1J10M3k25K77pj64J3J09l41J92K10j30K72k72k08J57q1
2496h3m9k2M14l32k2K18l06K10j41J63k39J94K3j47J28n8m2J35j0j86J73l0j07
$$ y = [-306, 143, -175, -86, 180, -150, -14, 205, -8, -205, 22, -14, 37, 34, 208, -216, 252, -94, -71, 78, 3, -32, 81, 85, -44, 94, 324, 6, -41, -19, -86, -76, 67, 17, -173, 331, 79, -31, 165, 171, -141, 157, -131, -13, -148, 195, -208, 144, 115, 20, 105, 188, -42, -82, 176, -36, 240, 108, -156, 34, 199, 139, -92, -18, -31, -9, 14, 278, -84, 116, -71, -65, 331, -25, -151, 50, -181, -18, 43, -40, 202, 24, 82, -339, -19, 88, -173, -49, 77, -245, -303, 26, -159, -268, 113, -34, -82, 265, -262, -65, 39, -165, -158, 40, -25, -100, 271, 0, -70, -125, 87, -153, 92, 142, -19, 39, 151, -131, 159, -185, -204, 254, 51, -13, -13, 243, -142, 215, 176, 63, -67, 116, 260, -42, 76, 52, -103, 277, 53, 64, 260, -7, -38, 72, 115, -110, 167, 160, -4, 9, 118, -223, -31, 179, 49, 321, 49, -159, -2, -83, -132, -154, 260, -72, -94, 124, -182, 28, -113, 50, -189, 5, 28, -119, 9, -49, -91, 44, 34, -152, 21, -9, -116]
2519a16J10J16j73o1K96j32l38L54p3p2M49l15j74J19r0M8N4P1r0j5l7q5K43M
2543I3l72L53j13N9n4P5l1J05l08L3J23R9l2j72J52o1m3K37k21n4J33j3r7Q5J14
2568I0J7NJ40j62N8j24k40L22j04j65Q5L28k80L48l11m18N67qk78J49J80l44J81
2591C6O4p7o8M79n13M5J8o8J34P8k70J31o5L7M4N7j97QK45Q5l21P1J25k42RJ43
2617a2k1qJ73k57n3K02J7j37L12m92J15K11J7L5j36M8k08J57J21j26M05n67J96
2640hK0j18K8L10k46l2J06j26k9J55K2l58Q8K06k8n8q1L05j63K69l39m0L01j15
2664F9k42K19J53l82J32P3j67K63N4j97K87n8m04J20R9K8K01j84l44K38L06m32
2686a68P0J44k7r2K87j27L2q5j28pM6K17o5Oj39j88K58o7P4M5Q3j48j56O9n0J87
$$ y = [-116, -6, 110, -63, -124, 172, 40, -298, 56, -17, -89, 360, 45, -129, -10, -100, -52, 2, 73, -17, -32, -69, -154, 89, 93, -279, 74, -39, 20, -34, 41, 10, 115, -193, -160, -37, 62, 30, -142, 10, -51, -94, 143, -78, -132, 1, -12, -109, -24, 90, 107, 112, 252, 90, 148, 24, -216, 106, 2, -163, -78, 250, -30, 318, 7, -411, 156, 148, -130, 19, 199, -145, 36, 100, 23, -45, 434, -79, -34, -16, -84, 50, 128, -142, -11, -76, -39, 5, 62, -135, -127, 118, 203, -118, -47, 78, -164, -155, -12, -33, -41, 132, -125, -178, 24, 41, -96, 216, -276, -161, 50, 67, 102, -34, 14, -194, -37, 84, -42, 363, -204, -8, 12, -106, -78, 232, -14, -46, 60, -66, -95, 60, 82, -276, -188, 18, -10, -68, -149, 156, -7, 262, -77, -117, 184, 69, -173, 46, 199, -183, -51, 22, -145, 118, 172, -25, 262, 204, -200, -80, 19, 47, 248, 64, -280, -42, 264, -168, -98, 46, 19, -73, 214, 87, 119, 34, -94, -101, -55, 162, 97, 103, -36, -224, 34, -33, 41, 86, 169, 21, -135, -66, -116, 71]
2712G1J45q0l22J82R6k87J92j82J25K09k83O1k4J30l44K06J27m4J22Mk54K19M5
2735A14l09M18k69n1j77M08q8k8K80l45J82p3j4jJ89k64k05L94j68O9K15l19N9
2758A7J48j07j09P7K12l60L00p6l18K24Q0j48J32J0j79K75K2M7k72M8n6L5rj10
2782a17J39N0Nj31K09j92k6J03mk6J22N9l83K78qk02J7l8P2J48j02r1J96N3m80
2807c49M77j46r4L47k90o5J04P1r4Nk3%k2J52j87M3m3j23J21K00K7j09l7J81o2
2832H4P6q0pn1j06N3J23M4l09J50J38k30J11J85k23J39K7rk84L25J03r0k12J2
2856c1m8K5J10j28J30k19K8L09k55k5L31j15nj58j41J53p3K29j21l8K81k58O9
2879E0Q2j58l3P2J32o5J7j46K3K82n1j94n5L25m45K51J0l47K72K7k02K0K01j54
$$ y = [71, 216, 136, -186, -4, 92, -195, -3, -185, -60, 149, -134, -73, -97, 33, -311, -105, 22, -22, 100, 104, -150, 69, 114, -195, 223, -46, -97, -274, 134, 46, 18, 298, -47, 135, 62, 48, 47, 236, -28, -233, 161, -7, 62, 277, -42, 17, 165, 58, -51, 26, 238, -122, 178, 102, -216, 8, 88, -60, 72, 82, -97, 178, 200, 247, -25, 23, -33, 2, -7, -117, 22, 72, 77, -54, 155, -37, -63, 40, 36, 10, 132, 191, -192, 86, 78, -124, -107, -145, -73, 75, -27, -118, 78, 131, -349, 128, -18, -112, 235, -55, -120, -16, 55, -39, -34, -57, -57, -79, 73, -114, -71, -114, -237, -116, 84, 111, 2, -35, 146, 84, 160, 80, 73, 22, -84, -31, 92, 136, -173, -23, 115, -115, -4, 181, -42, 97, 124, 115, -169, 156, 259, 169, -43, -31, -79, -54, 56, -72, 58, -161, -133, 176, -79, -104, 227, 112, 107, -51, -192, -39, -112, 117, -4, -42, 239, -19, 50, 132, -26, -59, 13, 145, 80, 97, -49, -26, 256, 205, 11, -44, 281, -164, 87, 97, -250, 22, 49, -153, -133, 68, -86]
2903h6J08r2j33L24K9l54J54j43K25R5r7j48J48J81k24M7N9k22J32q7J46j15J29
2926G6m7o2l4J06j68K40n7r3J76j32K0p3k17K72Q0l6j32o2J04q4M6J0K18j16j22
2951h7J95k60L77l98Q1J5J89l7j06J44l79L54J15l36K61n0j21J72k64J65j79J63
2973A4J27l2k33k0M22j70n1P8j4q3pj9O6j40k15M01m12K51J03p0K51o3l35J28
2997b3k20K88l8K1j68J77j1J8k47LP5J62Q8j80k2K22k10k2K19k96L18m5k26J30
3021A3k7J22K30m17m6K31j24nJ8J5j02oJ80O2k33K1KP1Q1j11J04k69K48j93j08
3046b43M12j33r3M03l85l8K08J84k20J10k26M0j05K05m4J48o9k07L1J02r8k8L6
3069a0k11P3J20M4rl0J6R5O1j33k0n3K07k75O5P5o5k06M46l49Q7K28j15p9K10
$$ y = [-86, 22, -70, -203, 121, 150, -204, -50, -193, 32, 127, 30, -118, 30, 211, -13, 34, 93, -129, 3, -84, 62, -53, 76, 29, -33, -67, 39, -129, 111, 54, -39, 137, 5, 25, -48, -265, 7, 87, 51, -81, -143, -39, -123, -77, -67, 151, 35, -87, 108, -152, 225, -173, -92, -77, 112, 75, -31, 113, -266, 88, 203, -133, 128, 78, -43, 129, -135, 30, -149, 14, 141, 109, -124, -144, 278, 108, 57, 135, 121, 38, 31, 12, 78, -62, -277, 124, -288, -37, 66, -4, 247, 184, -151, -23, -243, 45, 7, 28, -140, 37, 26, 44, -203, -200, -125, 37, 125, -55, -77, 145, -65, -87, 132, -164, 154, 109, -117, 13, -14, 108, 338, -79, -125, 106, -18, -23, -5, 10, -92, -98, 82, 144, -89, -68, -66, 5, 86, -25, 79, -190, 58, -135, -243, 169, 36, -57, 346, -39, -77, 131, 315, 95, 205, -21, 19, -86, 119, 75, 223, 154, -53, -22, 80, -18, -46, -10, -221, -148, -28, 16, 7, -23, -7, 88, 149, 16, -4, -57, 150, -125, -60, 15, -50, -256, 190, -159, -72, 156, 41, -38, 172]
3094A72l47K3J64P3j55J83j09p3Jo0q2J77nj30L03r8k55L91j63j94K20j0J96n0
3118A72q8k26R0R6r6k5R3N8l4O9j06o6j78K42K4J55j97m2J38j20R4Q9j9j29R3
3143H7q0p1J08k1J53J08k85l8J26j08j11L57k07q2O1K8r0O8J85l43K36J12k51
3166e8J07R6l6o5J9j83M7K2Q6J13r2R0l27M50m40K09K0l3N5o0j14j85L35r2n3
3191h9J93J49k90l6K25j37m3j28l4m5K79j76N6k29K68J21k54J67j49J46j06l8
3213a50M04k15j28j7K64k58K3J10j20J37r4k12J93J68j27j02L13k34n1R0n8J04
3235D0j12K52l79K15R0K63m07j4M8J70l8j85J08p0O3J17pk71R6J69j74j07J59
3258B6n2J81j50p3p2Q3J9K15n8l04ML30j02p7j22n7L4J86R8k43O7L5N3O8J42k85
$$ y = [172, -175, -152, 12, 85, -70, 113, 4, -69, -68, -128, -210, -33, -38, -168, 135, 37, -218, 173, 10, -184, 36, 26, 222, 172, 84, -142, -52, 44, -52, -77, 16, 74, 40, 109, 3, -63, -241, 1, 25, 180, -17, -59, 79, -41, 53, 142, 123, -6, 87, 7, -64, 44, 23, 176, 284, -1, -39, 87, -21, -132, 225, 18, -64, -3, 25, -65, 3, 188, -155, 81, 193, -58, 49, 145, 109, 44, 63, -120, -73, -51, 35, 148, 56, 146, -181, 269, -171, 38, 58, 25, 80, 20, -94, -279, 56, -36, -89, 104, 253, -37, -73, 152, 15, -28, -156, -190, -235, 44, -132, -76, -305, -37, 84, -170, -3, -152, -6, -112, -150, 254, 39, -89, -106, 158, -100, -77, 33, -87, 50, -44, -256, -63, 105, -22, -124, 189, -45, -96, -6, -64, 40, -72, 180, -199, 16, 106, 369, -38, -52, -4, 166, 128, -57, 51, -19, 44, 161, 154, -117, -21, 148, -26, -133, 26, -26, 155, 5, -68, -140, -57, -38, 177, 119, -185, -181, 149, 47, -30, -152, -209, -175, 11, 109, -134, -67, -32, 21, 89, 231, -54]
3284e4J52m7j73J17K0j5J45j40J36j33k7P2m4L5J2l64M28k83J40L3k95J70K03
3307H8j60j04K30J22m29L90n9j02J97k01O9p1K77l41j7J53l6J23j52K30j94J9
3329C2p7K6Q7Jn9P7o1O2L2Pk32l0K39j85J42O5l40m2J14r3K96k80K37J13J9k06
3355e6r6O0J52l2J17l5P3k28L60l11J59l07J82r0J11k2k3P2Jn3j65J23j7l1j85
3380b41M47l05M7N8k13J25J55j74J06k4M4r9j03K18m8r2P2l5k0K12k35m4P3R2
3404A6k83L03K5nn0J19j98J51M8k17j1J53k00J70J05r8r2J6J54k45K72j11k38
3427b16K22j9J17P7j43R1j95P4J01O0j21k34K94o7r9L9k03K66N0K8j33O0q8O1
3451B2p7J80l64L01K1j41k20M16o3j00N4O0m4L0j09r8N5M5pL6j3j30o2K03O2n3
$$ y = [-54, 98, 51, -122, -5, 15, 0, 145, 5, 141, 8, -19, 53, 9, 44, 56, -308, 120, -163, -23, 10, -285, -115, 88, -72, -176, 54, 176, -253, 137, 78, -24, 173, -28, 41, -30, 247, -94, -111, 42, 6, 129, -23, 207, 13, 32, -45, -19, 68, 69, 10, 87, 26, 88, 120, 127, -105, -135, 104, -81, 61, 126, -214, -256, -142, -235, 61, -219, 18, 131, 150, -56, -152, -92, 60, 28, 145, 110, 183, -45, 315, 4, 163, -144, 38, -52, 59, 37, 14, 86, 87, 34, -131, -8, -25, -56, -241, 206, -99, -52, 6, -207, -82, 73, -101, 5, -19, 25, -74, -177, 41, -7, -99, -27, -62, -82, 130, -105, -149, -76, 16, -267, 36, 61, 56, 6, 125, -73, 78, 126, -91, -102, 51, -149, 21, 126, 28, -64, -48, 106, -139, 133, 22, -216, 6, -13, 104, 181, 38, 129, -66, 8, 109, 169, 48, -186, 108, 41, -58, -19, -222, 44, 94, 122, -11, 49, -39, 22, -55, 125, -239, 62, 83, -58, -278, 138, 75, -25, 29, 89, 45, 75, -34, -132, -77, -32, -39, -3, -16, -146, -208, -5, 57, 4]
3477DJ0k3K2k4o5R6J9l7J9Q4l74M66n1l1n7Q6j22j8M1M8p8L01k33J30k11j00Q5
3504a3j64L13k41M2O6j08L4J19n4j02L10k33K27j5j00p1P6Q4j90J31o3n6k11J32
3528h7L1K1K4j17J83P5l48J31J59n9J56N3k74K26Lk57jJ05j29pL1O2k49M58j19
3553G1j41J92j5j28K12k21p3K54j50R0J7l5k85K12L4k3J86l76J22MQ1l8j74J17
3577f7K4J46k68J75l8Oj21O2O5k3k01L17k68J86j12L20j59j9K6j21K09j73J45
3600A11ml0ok49K61q2O1J19k34M5L75l18k28L47l34J66O6j73P9l8m4L0L6Q9j08
3625f3J15K26l02j08J36j49K96j20j40L02j00l6j9J03k77K33j50J8J87j02j56
3646a06l9J17o4K82k28K65l44l8K79K5j96Kr6J98L5K2j14J65l44J77Q6j14J74
$$ y = [4, 14, -9, 13, -11, -76, 20, 39, 2, 21, 105, -269, 197, 146, 115, 58, 144, 22, 4, 45, 93, 15, 316, 83, 213, 2, -98, -13, -177, 136, -105, -63, 3, -105, -71, 48, -6, -108, 202, -31, 196, 181, 81, 10, 86, 170, -20, 111, 48, -8, -219, -87, -56, -35, -11, -128, 55, 130, -218, -87, 72, 13, 169, 222, -52, 174, 177, -80, -81, 24, -105, -112, -81, -19, -268, 190, 71, -70, 122, 107, -21, 191, -30, -103, 151, 1, 91, 108, 73, -212, 0, 34, 11, 197, -179, -57, -53, 28, -10, -184, -67, -43, 103, -165, 10, -28, -22, -143, -81, -16, -39, -240, 77, -191, -5, -117, 203, 44, 25, 51, -70, 139, -34, 111, 107, 77, 71, -178, 83, 1, 62, 181, -53, -8, 367, 49, -179, 168, -166, 0, 66, -107, -28, -66, -110, -80, -44, 45, -63, 52, 278, -24, -132, 4, -145, 151, 31, -109, 193, 93, 57, 38, 141, -136, 97, -53, -35, 152, 50, -106, -145, -28, -92, 190, -38, 227, -117, -155, 124, 149, -47, -45, -141, 57, 92, 114, 0, 165, -179, -2, 84, -30, 144]
3669A44m61K02k0J46j60K00rj85O0P9l8j5L3M4m2Rj99K57k9j94K31K76k67j32
3693g0K26o0j34N6m0R6k84K80KLl25K96j47K56k55K56j99%L9J11j18K19J5l92
3717a69J46J71j13j52K55l17J25K60k56l0J55l45J60K19j48J1J66j88n2m4J82
3738C6o5p4N8o4J53j46K22j17J9J0j51J56J1l49L19N5J5J9j44q1k1Q2KR9p4j03
3764a33J48J59l57K20j04k91L23j21O1L40j59m75L26P8k25J44K07k11m6K10j80
3785h6K24J36l52J23J13m5j99L4N4n2p6J75o0j1qJ39l02K65L9k34Q3o5n6L29j87
3810a9N7j19j35J42J71Jj16o3L32k26L6o6Q1P1q6j61P3J4r0k3P3r9J71J73k61
3835f9J92l7j37R8q7M4k7j63K18j00j0J5j39J84qj54L15k85J0K53n7K3m7lq2q2
$$ y = [144, -317, -115, -135, 11, -149, 51, 42, -143, -83, -4, -42, -57, -24, 20, -22, -13, -212, 45, 16, -178, 53, 329, 62, -70, 156, 96, -38, 18, -22, 74, -210, 70, 72, 75, -250, 46, -101, 155, -100, 156, -43, -43, -4, 107, -11, 208, 223, -169, -23, 148, 35, -117, 138, -179, -54, 206, -50, -80, 75, -270, -110, 109, -39, -28, 138, -50, -102, -146, 36, -29, -103, -45, -109, 44, -102, 120, 3, 22, 32, -119, 37, 48, -301, 18, 73, 88, 107, -37, -118, -139, -57, -55, 44, -30, -133, 15, 174, -183, 37, -67, -358, -35, -156, -95, 245, 86, -389, -63, 15, -210, -66, 141, -70, -116, 94, -86, 138, 274, -78, 45, 158, 113, -86, -52, 2, -50, -126, 49, -11, -22, -30, 109, -193, 72, 111, -123, -40, -105, -161, 168, -19, 38, -81, -216, -74, 97, 98, -18, -81, 251, 25, 61, -5, 76, 147, 61, -100, -27, -13, -103, -126, -53, -152, 19, 192, -69, 123, 86, -51, 47, -40, 4, -23, -186, 32, -68, -78, -63, -202, -18, -26, -180, 135, -150, -140, 113, 56, 79, 32, 29, -53, -135]
3861a35K08j34j9J61k40J37q2J59J5J50m10J36L07l37P6l6J38j80J53j6j08J67
3883A10jl4j01j64L70m1k75M4L40j29k18J54R3j27j27J50l6k6O4qJ87j52jQ9j02
3908E9J15k09P3J1n1K0P8J6j13Pk03L63j14k39K5K72k3j58n0k1K02N2j15JKk44
3934b44K80%M0pk4k80K70j43K48k77K00j63J10J30k19R4o9J56k76K61l8k90R2
3957a49L24k57K76l2k38J27J09k82R5J22m1j51n7J78%J12m04L53k7J61k0q0J0
3980A29l02L67j10mJ3Mo1P8K4j87J42r9n2lJ26n3J13j43j40J73K8j08N4K29l89
4005a71L16k48O9r9O6n4K47o1j82J20J97j03j32k4R3k04M2J14k02L20k61p2J73
4028e6L4q2J00J28l16K01J91j07j57O4r5J98q8o3L6K4j21l5L41m33P2J81M2l8
$$ y = [-135, 73, -61, -80, 81, -159, -22, -104, 55, 70, 220, -190, -54, 253, -84, -8, -44, 94, -86, 67, 51, -57, 110, 109, 75, -26, -190, 180, 139, -136, -92, 248, 119, -99, 55, 148, 21, -106, 44, 8, -18, 46, 38, 225, 73, 72, 161, 59, 174, -35, 38, 49, -2, 18, 96, 112, -1, 6, -197, 166, 52, -187, -162, 110, 87, -71, -121, -142, 60, 112, -3, -2, 0, -244, 36, 36, 76, 69, 45, -235, 35, -108, 140, -137, 63, -100, 10, 140, -79, 15, -54, 102, -174, 87, 49, -241, -149, 175, -82, 194, 162, -76, 51, 160, -122, -27, 95, 54, -97, -154, 24, 24, 136, -268, 85, 58, 219, 199, 119, 129, -173, 194, 84, 80, 93, 97, 36, 114, 138, -49, 93, -6, -58, -61, 65, 12, 125, -18, -158, 15, 43, -65, -11, 218, -171, 145, -103, -34, -133, -67, -121, 126, 65, -117, 3, 200, 97, -35, -59, 34, -170, -128, -14, -216, 104, -157, -229, -56, -22, -104, -4, 124, -192, 9, 200, 93, -64, 0, -95, 103, 15, -48, -12, 12, -109, -144, 197, -236, -164, 17, 59, 21]
4052B1j0k3l2J46p1j78K50L7k02J1Q4n8j4R2p6k11K00m8P6J37j67rJ14n9J7N6
4078H3J8j02m7j40J90K1J84k18J10O4j63K31k55O8j13N2n6K38p6m1k47K13n5L9
4102bJ62j4ql1j47K6Q9j66J36p2L3J28j83j7O2m2o0P8j57K98nq6M3k24L65K0j72
4129E4j18R4n2o7J17r0j24J87K5l31K92R6j65L6J24k8p8j5j01K68j62l0J79o0
4153E1q6J79po8l0J68l01J8J50j07N9M5j29J43m5j21j49L06M2j05r5J45j52K47
4177A58N7k97K29k42MoJ54K00l17L0lj13J81j50J49J36j81n0L31k41j09J60l23
4200b43M3L76n4n5o0M4o5P4o5l0P7j09J15j77J54n2k2J08J39l43J36n9J57p6j9
4225fK32l38R4J06o5M4j20J25l9j78J07k5r4M15k32LR0j60O7J33k32J37Oj31J34
$$ y = [21, 11, -12, -44, 102, 31, -147, 103, 140, -62, -51, 33, -25, -39, 53, -23, -234, -34, -82, -6, 131, -36, -45, 69, 10, 27, 83, 101, -1, -48, -188, 2, 23, 207, -11, 99, 163, 0, 231, -24, 44, -69, -17, -73, 165, 89, 48, -199, 14, -41, -2, 160, 146, 138, 107, -40, -14, 75, -91, 45, -27, 6, 134, -49, -66, -4, -46, -106, -28, -185, 113, 108, 22, 65, -159, 206, 226, 54, -64, 30, -22, -89, 28, -62, -186, 1, 26, -305, -13, 83, -82, -46, 78, 50, -28, -43, -144, 124, -38, -68, 111, 51, -35, 144, 137, 69, 39, 207, -94, -76, 74, -33, 26, 71, -58, 85, 40, -81, -230, 76, 118, 13, -82, 63, -89, 158, 215, -82, 147, -95, -91, -97, 57, 257, -60, -30, -33, -146, 35, -115, 34, 170, -11, -61, 270, 29, -80, 80, -243, -200, 176, 122, 67, 7, 51, -14, 60, -5, -35, 42, -67, 48, -129, 25, -27, -49, 59, 198, -145, -9, -68, 89, 13, -6, 226, -112, -18, 88, 23, 67, -53, 72, 33, -145, -38, -63, -157, 258, 26, 29, 119, -41, 26, 159, -73, 64, 70, -61, 73]
4250G3l0O9j48J60k40J39P1j24K22k71P8j29N3J93l2k49L15k86J06p4Q3J9K6k9
4274en8LJ23Lm5J60o2j66K28j92K04k39j67J72r6J78j83K63k76rJ14Qp1j20K20
4299a3k8K62Qk57k8J0n1j16L96l2j90q7K33n7n1R0j58J26L3k74K48l40K43%m2
4324g5j15j1r8L92j21l8r0K51N8k27J78j99K5O1m5J25o9J55j56k7O7L3k08K33
4348I9l5j62K23j43M2J2j78n3KR8J34J69l45j00L08r6J14R8k50k9N6J47J37k09
4372C9K6r0Q1M4k38K50P9k83K20j39p1N3K66k41J14J25l72J33j2lm9oj21r3K89
4397AK7j58L08r9k60L21j71L2K36n2j62Q6j46K5N2J55j87P0j95J66j12J14j04
4420e3m4J77j06M4M7j92J4J77k90L45N0j96j48K99j34K32k97k1K24j39j37N6K85
$$ y = [73, 43, 112, -36, 124, -116, 23, 94, -30, 192, -79, -1, -130, -77, 116, 84, -165, 150, -136, -30, -104, -21, -2, 24, -5, -63, -60, 63, 66, 21, 181, 119, -47, 181, -11, 193, -46, -213, -41, -137, 41, -142, 121, -155, -164, -50, -42, -113, -233, -13, -41, 221, 229, -28, -56, -46, -97, -213, 183, 151, -39, -126, 107, 50, -1, 89, -69, 57, 90, -184, 64, -276, -33, -33, -75, -190, -201, -299, 93, -28, -66, -156, 95, 153, -74, 104, -95, -70, -9, -54, 71, 2, 157, 1, -26, 41, 74, -134, 99, 64, -98, 125, -18, 24, 36, -142, -195, -193, -95, 39, 208, -137, -237, 71, -25, 89, 187, -63, -92, -36, 111, 248, 39, 65, -25, 56, 100, -138, 112, 191, -92, 128, -11, -82, -29, 237, -4, 110, 235, -137, -4, -16, -19, -68, -74, -195, -288, 1, 28, -130, 178, 79, -181, 140, -31, 1, 237, 185, 23, 109, -37, -12, 40, 195, 8, 78, -117, 49, -63, 51, -53, -97, 80, -26, 18, 65, -127, -113, 64, -226, 119, 169, -27, -175, 124, -10, 222, -75, -96, 128, -11, -148, -92, 193]
4443A93j27k60l3L28j38kO0n0j2P0j28J63K03k34j24J67k32J26K04k47J16k7K06
4466B22j61m6J25k25J41J46j54J06j99KJ05P0k06K35l6l7j41l5k06K24J69q8M8
4489E9P1n6j28J14q6J7q9J42J63k38P4k16J91k00L6L06j65j82R8K69j56P1j20
4512b5n2O9r0J14k3J20j59nK19k67J21j51O1p3J97o1J7j24L30j4j72k31K77j0
4536F8n0O1J91j82k32K43j35p9R8L00l86Jp2J45m5J72j90J76m8Kj0%Qq5J60j41
4562c0OM12m67J49j2j24L4O6j43p6K87j80m6R5Mo6K33m9j87K16r2n23O26L0l03
4587a40j31M56j82P5J07k46n2J78j74o8K18j85K5J06k1j36K53k55J14J01K5J23
4609A91k03K17l16r1L8M8J33k7p8oL0O6J00k54m3N8L24o4j92j0L6n5J43n5o8n8
$$ y = [193, 66, -194, -227, 101, -37, -39, 21, -29, -41, 29, -99, 64, 267, 33, -91, 76, -156, -30, 174, -73, 43, 16, 222, 61, 15, 140, -85, 56, 202, 48, 154, -45, -43, 62, 132, -74, 161, 125, 88, -53, -88, -294, -70, 99, 11, 59, 130, 74, -54, 60, -26, -9, -98, 44, 207, -31, 43, -173, 18, -182, -146, 160, -5, -187, -89, 180, 24, 95, -25, -77, -8, -98, 16, -7, 113, -46, -51, 168, -99, 22, -129, -68, -141, 56, -5, 12, -112, 218, 204, 32, -199, 78, 68, 18, 79, 270, 88, -144, 99, -36, -115, -17, 283, -103, -102, -174, -29, -74, 98, -92, 84, 36, 38, 28, 28, 36, -49, 111, -30, -24, 388, -79, 70, 58, -66, -32, 34, -109, -185, 102, -78, -124, -29, -25, -91, 142, 93, -94, 122, 30, -493, 133, 163, -140, -271, 185, 3, 78, 185, -61, -113, 65, -109, -177, 41, -144, -119, -13, -34, -170, 83, -172, -58, 43, 68, 191, -12, 205, -111, -202, -164, -116, 17, -10, -88, -94, -64, 2, 102, -152, -195, -137, 187, 123, -69, -79, -43, -98, 45, -10, -78, -136]
4635a36m0Q8oJ8r1J73L9j37K09j27m8P1J36j16j11J54l1j34L05k19k2J59j03r8
4659f7K39j83N2J0K2j38N2Q4J37J1k46m3l0R3J22j47k5lP2R3j61K96j17j48J18
4684I3j69j32J49J40K3l53K49K36k56kJ16k00J09j02Q1J08Q4l11K75M8l13L6J08
4707A7j0l3J65J5j35m0R6J83n6m81L12J36j35p5J30k71R1P6J04M5l4j82J13J04
4731A35l1N3p9k3OK1p2Jp3L58j63j67j0K16j29P8k0j67n6o3K05r4Q6q0o1R3K4
4758a2lO9l3k9o7N5L1m7J97j12l4j30N0k4R7M1M0j43K02j80j68K66J11k27Q2j04
4784g2R5j18J98r5J8N3q3p0P7p4p8k4k7K62L6J49k07j98J24l3J50L8m9J2K22k73
4810C3J97k21k04K92L8j56j2J6K0J44j61K72j94N3n8n7p0K21k95K20p4K5L8J4
$$ y = [-136, -176, -88, -94, -76, -167, 6, 45, -92, 117, -10, -58, 13, 149, 33, -78, 76, 45, -89, 216, -3, -25, 134, 31, -67, 172, -11, 41, 51, 73, -65, -13, 71, 208, 219, -27, -70, -100, -7, 115, -32, -57, -60, 12, 105, -56, 240, 123, -25, 93, -76, -208, -59, 81, 104, -249, 0, 236, -20, -22, 94, -106, 3, -99, -18, 90, 174, -137, 138, 186, -127, -91, 17, 7, -26, 139, 154, 19, -21, 75, 258, 202, -279, 33, 169, 34, -41, 89, -182, -91, -15, 89, 134, 100, -82, 31, 135, 104, 157, 78, 55, 61, 82, 10, 11, -62, 296, 133, -34, -44, 172, 43, 121, 101, -66, -122, -185, 20, -74, 12, -68, -129, -36, -12, -15, 54, 21, -8, -75, -20, 11, -36, 161, 49, 15, -115, -65, -89, 8, 49, 89, -54, 148, -32, -200, 66, 177, -50, 32, -72, 23, -95, 103, 8, 26, 79, -4, -74, 3, -71, -149, -173, -200, 62, 98, 247, 40, -158, -34, -67, 83, 121, 72, 84, 306, 33, 230, 9, -195, 97, 135, -21, -33, -17, 3, 147, -14, 258, 64, 117, 59, 2, -68, 153, -142, 78, 4, 29, 67, 81]
4834H1q6J1p0J28J3q7o4J31pQ2p4o3p9O5n5Q6j94J27o8L27K03l67l64M31r5j15
4860a03J27m4j26J36J82q6q6n9N7lpj69M55l05l3L5L4j37J90n8K7K30n84L93J35
4885B01k46k5n6l0J87j38K1R3K3P1m2j85N4j6J4O2J17j41J92j49k43K94J79k72
4909c5J37n6M0l60M04j73R6o3n2J67J32k94n4L12j98J24n8l4j58K16k25p2J30
4932g4P2q5J18M3j39RJ22J2l04L21n7o5j6J4J26Q7l79K09J30j99L1J78k22oJ73
4957I9m44K94J97j76j19J03pP9N7jj45Nqj71K20j74M49k82P0j81M1N5O9J0K6l51
4983b85k9K25q5L35nk42K4j65L50j58J56jk07K60J3j03p2R8r1Q3j97R1J73n9j73
5008f4J12q0J34l35K30N3j31N7j2J34l7p8P0J44j86j08O6j11M8j15J55M0j76L31
$$ y = [81, -5, 6, -64, 64, 77, -10, -74, 57, 50, 132, 58, -5, -84, -19, -74, 12, -182, -55, -123, 204, 407, 40, -324, 107, 12, -103, 24, -20, -146, -10, 172, 86, 0, -59, -2, -5, -12, -181, 274, -31, -64, -29, 5, -132, 58, 0, 27, 257, -327, 66, 201, -45, -70, -126, -156, 31, -107, -86, 7, 30, 101, 59, -126, -72, -88, -74, -12, 105, -36, 156, 7, -236, 58, 237, -35, 102, 46, 86, -274, 130, -43, 53, -10, -62, 105, 237, -57, -111, 201, 3, 127, 69, 35, -123, 93, -132, -204, -74, -2, -87, 31, 74, -65, -56, 66, 78, -226, 95, 38, -27, -43, -29, 97, 184, -195, 14, 144, -55, -24, 154, -68, -74, 99, -345, -51, 146, -30, -149, -46, -53, 26, 83, 82, -63, -58, -66, -237, -17, -191, 258, -24, 46, -135, -94, -39, 30, 40, 66, -285, -314, -89, -174, 161, 156, -86, -62, -227, 123, -35, 121, 120, -87, 173, 186, 83, 11, 109, 18, 101, -96, -5, 168, 109, -64, 48, -32, 102, -233, -3, 50, -81, -24, -36, 98, 61, -17, 53, 197, 11, -97, -31, -142, -94, -209, -54, -14, -190, 141]
5032A41l95K64o3r4R2J27k59J35J31r5k3J17j72R8J40k49J6j02J42k8K7P4j74
5055a50J45j94K03J72o6n2J96k20j39K38j80M2m3L08k43j68J25L20m46J49J18
5076A15j98P4q6R5q9K92j41l2j29J8K88l56R3K34Q2l98kJ26k9R5J08j87J6j4J22
5101I7q4n0j36J05L63o16K11J72o5Pj87J23j58K09J5O9m3n5R0k34J40J73j73n3
5125h0J0L14r1k47L6J42N7m2J4j91J00j3n6j2R9n0o0K5K29k02j74K11k39K21o8
5150f7J19N1p5k42L17j1j45J44j82J5J67J09k56R7%j5j39m3J6J20J46l26J42j23
5174a81L08k22nj2L9J00J24l72L14O3j01Q8Rk25Q4q8j05J52n2O8R1l20L88j88
5198d3J2J63m8MN2j62l0P2O3Q2j80j30Q7L55l22K5J1L7l1j1p6J45j24J86j28j89
$$ y = [141, -254, 10, -53, -147, -55, 72, -187, -52, 79, -16, -39, 78, -94, 4, 144, -105, -89, -191, -49, -77, -50, 24, -150, -5, -199, 4, 176, 110, 58, 254, 34, -105, 133, -47, -5, -48, 260, 17, -151, -26, 294, -152, -3, 115, -83, -9, -95, 0, -89, 203, 62, 30, -99, -81, 207, -149, -56, 178, 260, -138, -140, -14, -43, 52, 160, -27, -11, -25, 97, 13, -37, -173, -68, 295, -321, -110, 62, -3, 4, -183, -60, -218, -9, 6, 75, 32, -23, 67, -167, -27, 146, -27, -80, -70, 244, 153, -94, -58, 84, 141, 99, 113, -78, 22, 9, -47, -59, 40, -10, -70, -45, 184, -18, -192, 19, -220, 1, -67, 52, 103, 28, -214, 103, 92, -53, 91, -91, -76, 91, 200, -56, 41, 41, 26, -113, -156, -140, -20, 126, -200, -58, -181, 127, -95, -100, -112, -73, 27, 151, -221, 93, 156, 55, 143, 152, -73, 11, -77, -182, -30, -82, -14, 77, -243, 145, -43, -31, 132, 84, 88, 140, -22, -52, 20, 83, 165, -15, -145, -58, 297, -25, 0, 11, 48, 17, 6, -70, 75, -49, 137, 9, -180]
5224a80J99J66j53q3O1J17j7j63nj78L17j31K89l64L15k01J8j2p1k4P1m0k39L74
5248F6j3j04J40K9k99J92m3P8j02O5j04ok7J90q9j28K19k09O2l6K29o6R2j22K2
5273C6k19K57J63j11n2j35Kk9J54k33K26Pq9K5K9l5n8K35j69N6P8l1j69m8J73
5298F3R6k12J64k21K18r6p7J23j33M8J47r5q0J12j39L01m95J68J44L8k42L23q6
5321F9r6N7j71L1pJ69k8j43J20o8O0P5k75K1L09q3O1o6J51j11j2j09j3K8j4O0
5347A5M1J99l91J81j33K03N1j40k91K18j10K28j56P9K7j35K51j06j70N3J35r0
5369d1Q6nqj31J42J73l60K12J17K6j9j83Q9j17J54l53L12j21P4j27J58J05k21
5392c8J95k99q7J62K53l94L8K58J2q5J33k86j3K22J79l59P6Q0k1l01L43o9o5q4
$$ y = [-180, 19, 185, 32, -51, 10, 127, 110, -53, -58, -236, 81, -50, 239, -125, 190, -11, 7, -5, -76, -100, -29, -69, -308, 66, 53, -51, 89, 118, -181, 11, -32, 46, -56, 9, -95, -101, -128, 62, -27, -155, 64, -145, -83, -119, 110, 44, 136, 14, 36, -183, 74, 237, 126, 74, -61, -59, -88, 66, -167, 59, 66, -23, 2, 31, -4, -62, 173, 4, 60, 138, 107, -62, -110, 63, 159, -53, 111, -110, 108, 12, -65, 58, -75, -27, 120, 25, -55, 57, -82, 219, -276, -108, 36, 74, -168, 155, 69, -27, 30, -141, -110, -117, 52, 24, -119, 1, -67, -7, 68, -207, -186, 123, 40, 101, 35, 186, 75, 63, -46, -59, -31, -45, 15, 56, 255, -136, 45, -88, 115, 166, 26, -265, -47, -157, 71, -85, -6, 21, -114, 137, 31, -139, -86, 49, -41, 45, 40, 32, -99, 43, 216, -144, 68, 185, 211, 192, 9, 98, -19, 135, -218, 94, -27, 47, -80, 78, 183, -38, 157, -142, -229, -67, 186, -208, -170, 88, 100, 15, 148, -138, -151, 71, 250, -109, -33, 47, 26, -275, 68, -1, -66, -150]
5416a50K69j8j18q4Q6K3o8N7K1j02K05N5j68J05j16O5j79J91k3j18Qk04N5P4R8
5441c6qJ47o0r1j29OK35l8j57J38p7Q9j23J11L6m2J29l6o9m9k11J91o8J41j83
5466a54L23j60p3J03K45Jk35N9Rk5p0k24Q6L08l11J46k9m1j10K74l08J85Q2j31
5490e0J73j84n7N1o4K16j88J30Q1j79J13J09k20Qj31R5L3O2o5l1K44k62O1k8Q9
5515Fk3j25K53J01j61Rj19r4k1m5L96l48J10J12p5k1pp6N0J9J38M5j26J78l83
5540b07J10O3j70J38J3J22Q8o0o4J43j65l8j8J36n8J29j38m6n7K66k50M7J10j76
5564h2J39j83J94p2j7J20j07k6R9j65J26q5K43l37J12P4l7j92J76j45J87k4k76
5587b78J77Q8J08p4n5Q1j64K87j49j6J35k43L8lJ19j01j36J85N4R5M6p4l61M11
$$ y = [-150, 119, 101, -17, -101, -15, 8, -60, -3, 18, -84, 121, 176, 8, 113, -3, 62, -117, 74, 51, -67, -59, -263, -208, -134, -36, -44, 103, 43, -48, -177, -171, 64, 26, -131, 7, -70, 19, -104, 7, 43, 1, 130, 94, 25, -24, -235, -44, -112, 29, -154, 169, 9, -64, 39, 284, 285, 50, 109, 118, 93, 23, -201, -115, 193, -118, 28, -1, -42, -152, 122, -186, -1, 81, -50, 123, -61, -118, -67, -131, 85, -103, 27, 108, -71, 42, 151, -69, -61, -192, -97, -64, -2, -67, -98, 146, -116, -55, -83, 6, -17, -142, 111, 212, 51, 60, -59, -153, -174, -219, 177, -171, -61, 51, -24, -45, -52, -128, -78, -59, 79, 124, -2, 176, -207, -97, -34, -204, -66, -53, 69, 157, 97, 33, 176, 11, -27, -45, 91, 33, 162, 24, -22, -79, 187, -63, -16, 94, -82, 57, -126, 68, -4, -21, 99, -8, -34, 65, -100, 26, -59, 184, -153, -41, 33, -4, -196, -20, -165, 22, -2, -278, -101, -13, 95, 21, -34, 47, -117, 170, 21, 5, 140, -103, -65, -68, 51, -50, -186, -1, 53, 148, 194, 120, -241, 170]
5611A70n4Lj70M2O6k12l3L11k71J83Q3o6j22L25j48k52P7J09j35LJ87k5K6j65
5635f8M36l38L3j27J15r8q3j24L77j04j16K01P3j66J01J08k41j09M05l15K2o6
5657h4K0J95p4j03P8j0j77R6k05J85L6r8J48j1J17k30j52L54jJ42j33KL7k84J61
5682Ir5P4J01L5l4p2K01l00K92k34r3R7J02j59n7J7R8Q9j79J13J70j41l21K56
5706c1J3K26k27K29n85L26O4j5j1j94J76l8R2q1K37k00L4k7J6m3J92l5k28J37
5730B7l8O5j50K23j28j20L3L00k14l3N6j13J08J45l80J14J22Pq4K72j61o8J24
5753A07o7J2J60l44O6P7O8L3j61K25j98j6O7j42J36L0J12p7m9o2r9K76j18j35
5777i9o5Q2O9n4J34N4K3k27J58p9k14L22oLk33O1P0o9J48j49P1P0k73J18P6K57
$$ y = [170, 116, 119, -51, -9, 57, -155, -188, 123, -148, 35, 118, 52, -70, 255, 107, -145, -68, 41, -94, -91, 96, 71, 97, -68, 368, 30, 63, -64, 51, -47, -130, -254, 123, 19, -97, 104, 177, 11, 112, 220, -21, -130, 275, -40, -18, -84, -64, 131, 57, -46, 32, 22, -155, -59, -264, -79, -43, -141, 7, -4, 113, -117, -269, 85, 84, 226, 93, 95, 132, -152, 9, -86, -12, 89, 124, 90, 18, 219, -81, 211, -23, -116, -19, 83, -76, -133, -116, -18, 71, -108, 5, 175, 34, -287, -31, -18, 208, -19, 210, -375, -49, 15, 0, -11, -205, -29, -67, 25, -56, 181, -19, 15, -12, 4, -39, 153, 118, -110, 27, -11, 54, -96, 127, -1, -121, -88, 212, -2, -35, 21, -92, 16, 161, -219, -105, 17, 24, -60, 212, 51, -17, 107, 40, 52, 212, -132, -66, 11, 79, 112, -49, 176, -22, -38, 29, -113, 23, 53, 165, 88, 39, -23, -122, 154, 36, -99, -164, -82, -13, -67, 67, 121, 144, -83, 75, -4, -218, 104, 98, 101, -132, -71, -1, -70, 78, -71, 0, 70, -203, -85, -9, 248]
5803B48l39M17m59J85R5N0l1r9l6j96K04k5M6N5r1p9K16k05OK43j87r3l3J48j66
5828a26J02j0n1P7j25J30R2Ql1Oj20P9j94J22R0Q3Q2q5j89K23k77N4J07r2J68
5853A23j80N9ol9K69j01j94K71k76j42K62mm1J1J3Q5o6p4k27K28K8J73o6J3n1
5878F8q5r8O5K47m59M53k12k09K56j1J33R4k81Q3M5o7K06k54L3j42J73J01n2k89
5902b02k3K40m4K4p6q0L14l83L18q2J06M0j74k6J30k37L03j38j14J98j71K61k35
5925e1J68l36L82j26k13K96k73J09l9J53J13k48J12j73Q3K05J30m0m57J14PK9
5947e5K00k54K94k3kn4ml19K41J02p3K4j49J37l8m2j96O6K19j11K08j90K81j34
5971A28k10O2jJ06n8j63K96k27K80k70N0j31R3j3o5M0K11j4Rj11J07r3q0j03P9
$$ y = [248, -91, 326, -133, 52, 147, 197, 166, 67, 31, -165, 39, 14, 60, 115, 24, -55, 161, -44, -38, 205, 18, -75, -108, 40, -126, -24, -34, -85, -8, -133, -3, 89, 97, 66, 72, -48, 31, -163, -41, 49, 132, 214, 129, -60, 163, -114, -60, 47, -45, 123, -57, 2, -4, -43, 226, 125, -69, 202, -74, -216, 46, 42, 1, 12, 25, 110, 44, -30, -257, -29, -1, 172, 106, 119, 68, -17, -115, -50, 197, -262, 191, -21, -230, 26, 15, 148, 242, -39, 44, 89, 22, 228, -26, 7, -135, 38, 139, 87, -202, -225, 15, -29, -5, -81, -161, 153, -230, 88, 6, 112, 152, -22, -48, 82, -155, 148, 10, -104, 94, -77, 184, -51, 117, -219, 163, 37, -176, 120, -153, -44, -83, 70, 183, -65, 47, -126, -43, 162, 292, 252, -205, -91, -84, -55, 145, -109, 185, 162, 160, 106, 102, -217, 24, 126, 53, 77, -72, 65, 27, -15, -211, -145, 74, -37, 171, -19, 262, 128, -82, -20, -21, 85, 27, -136, 160, -67, 213, -57, -7, -138, -45, -58, -123, -83, 128, 114, 123, 12, 119, 26, -54, -157, -78]
5996g8O0M7o2R0r5J34j10r0J0K85k53L1J17j60M5R8j00j21J77j6o2K7L7j05K61
6021A67o7J17n1j15rJ80r2K9k73l5J03j59K51j45J49O9j31K3O0n1p4Q4oN8j01
6046a9k08J52J84j96k4R7j08J68j6jq2l3n4L35j48j58J28K4j4l7R6k27J21m5K72
6071B07j49j40Q2k42R0K38j3K4Km1l72L65L1k4r2J93l45P3J13J8l3p5J42n5r0
6096i3L24l73J21K2k1Q2J89j84K2p2j6P8k00J6m6J53q9M3J52p7m1L95n20K00O5
6121A30j33j56J82jj4j17J8J67k35J85J62k41q7Q2K16q8l9p4Q6M7L8m57N19N8
6145B48%l89L23j00K5o0j6j3J04K77n23J27q3J87k43Q0k9J39mk63L2k8O0n3L15
6170A13k25K38p0j67J16M2k19O0Q7N9j42n3K62n7M0L2k23J65O7j16kl1o9M2r1
$$ y = [-78, -18, 29, -33, 57, -38, 96, -14, -104, -94, 191, -62, -31, 86, -74, -29, 69, -31, -152, 25, 9, -53, -26, 11, -94, 167, 100, 217, 166, 51, 42, 222, 130, 159, -114, -149, -46, -205, 46, -99, 50, 119, -12, 11, 71, 20, -54, 30, 24, 82, -19, -227, -75, 109, -87, -111, -14, -122, 46, 30, 29, -53, -86, -140, 195, 47, -111, 17, 41, 27, -10, 86, -141, -20, -65, 207, 58, -82, 0, -242, -152, 86, 73, 97, 99, 58, -314, 51, 82, 58, -34, 159, -186, -113, 0, 18, -15, -90, 52, -3, -93, 231, -142, -21, 1, -20, 62, 251, 67, 89, 17, 1, 79, -121, -105, -151, 2, -87, -44, 108, 31, -10, 385, -135, 65, 130, -3, -159, 23, 22, 8, -109, -91, 76, -159, 26, 188, -53, -140, -58, 158, 70, 31, -43, 43, 90, 128, -329, 190, 248, 248, -141, 182, 82, 107, 47, 31, 18, 122, 399, -124, 3, -80, 107, -136, -56, -85, 54, 50, -213, -181, -209, -149, -202, 113, -112, 126, 56, -111, 5, 47, -172, -112, -25, 34, -108, -161, 101, 44, 84, 116, -107, 58, 125, 9, 7, -24, -93, -51, -142]
6195a42J07p5L90l29J57j49K30k80k3nL0L7N5j32O5L3N1j25J40j46KJ5J63j01
6219c2J79k10k4N7q1J76k26R1K9J39k56K90j6k27J56o5p6M9R3N3L2k02K30k69
6243a10K37j9k76J87k80K44O4r5l6J17jN7j22J08n4J2J15Q5j98j00J9K21j94R
6267a0J46j72J33m9K17j7l58L25j90m7J64k71J18m6j8K6K21o4o9o3J82k65M9P7
6291A9J1m3j29L56r8j54L7k57L04k8j08k8J60j16M8k7l1K06m0k52p0L29j29K2
6315a8j65M32l19J52r4jj38l5Q9J19j34L2J53J11j78J55j89K73j85m4p7J00k54
6338b15l1L26j35j86J22R9j69J23m4K26m2j31L3K40l80L37k58K30j06j73J31k52
6360b55M39j23p7J36j00k3j59pR6J19O9k38J84j36j38K61j18K44j07r7J58l00
$$ y = [-142, -35, -110, 280, -49, 108, -41, 189, -91, -114, -119, -89, -52, 3, -129, -64, -31, 20, -105, 35, -111, -109, -94, 69, -32, 147, -63, -87, -30, -111, 65, -161, -70, -41, 98, -158, 132, 116, -111, 45, -20, -96, -47, 46, 99, 131, -71, 159, -110, 127, 108, -168, 19, -261, -17, 47, -48, -84, 33, 32, 89, -33, 75, 21, 33, 148, 233, 35, -65, -46, 175, -19, -10, 136, -36, 97, 48, 265, 248, -110, 215, 25, -22, 142, -129, -11, -57, -75, -49, 172, 108, 39, -24, 158, -107, -58, 19, 30, -13, -142, 214, 116, -38, -1, -258, 46, 18, -90, -118, 42, -74, -26, -53, -84, 122, 82, -170, -240, 89, -40, -18, -183, 249, -70, 82, -12, -13, -151, -186, -97, 22, -112, -80, 73, 184, 6, 161, -28, 245, 60, 16, -61, 39, -215, -246, 80, -55, -241, -119, -20, -189, -66, -110, 116, 74, -57, -24, 216, -164, 173, -85, 145, 39, -134, -3, -255, 184, 61, -16, 120, 20, -3, -162, -169, -73, 46, 115, -123, 61, -75, -213, 48, -70, 174, 67, -30, 128, -172]
6382a72K47k3J49j68j20p0L62k68R1j08J82q0JM9j62n1R7k8J53oj41J16j21J54
6406H3j23K22j02o1K96j13k09K31m24k8M3K68j71J11j88J78J1o2m7J26j19j53
6428b31K20K5O9j43K49k66K84k36K3k08J94O0k2p5p1K09r5P8rj04J23J91k42K4
6452D7k0R9j65r0J99j15L4J67j24j13M6J32N4r8N4j66K23j49Lj14J24R9k23j27
6476b23L76k3l60L28q0m8M4J16o3r7J08L1k30K07j75J29Q6j87O0j09K7j16L42
6499A43j12j8p5K19j82L8j4m5K36j70M9j55L8J30m7K4N4k11L81k42j03KN0M2r3
6524f1P0n3l6J37On1p4J70J51k54k7j41M12l52K6Q3o9j46K27j9J83m78K64l6j11
6549a79O7r1K06oL7N5j70r0Q8q7PK22K9J09k00K8p5j7J15O5j66Q0Q7k16L61k63
$$ y = [-172, 75, 52, 201, 33, -87, -157, 205, -63, 28, -80, 102, 22, 23, 72, -90, -141, -44, -72, 81, 75, -66, 50, -71, 83, -40, 182, 80, 19, 315, 202, -7, 224, -200, -228, -185, 83, -88, 23, -165, 13, 24, -38, -85, 41, -78, -231, -11, 14, 83, -60, 189, -77, 207, -29, -6, -214, -20, 40, 18, -57, -128, 81, -14, 64, 55, -49, 74, 265, 23, 47, 27, 126, -39, -129, 70, -45, -11, 156, 32, -81, -35, 97, 151, 53, 107, -59, 164, 15, 18, -96, 28, 127, -96, -223, 153, 130, -230, 98, 18, -30, 14, 130, 67, -30, 78, 109, -121, 86, -89, 40, 126, -61, -1, -110, -83, -199, 143, 31, 13, -62, 157, -25, 13, -1, -46, 190, 20, 69, -86, -48, 82, 35, 59, 113, -98, 283, 41, -62, -60, -10, 32, -61, 9, -44, -80, 57, 63, 12, -62, 108, 259, 5, -22, -163, 249, -103, -77, 6, -63, -209, 18, -1, 182, -296, -32, -68, -179, -112, -203, 3, -3, 34, 89, -81, -171, -83, -170, -163, 59, 88, 197, -3, 25, -50, -67, 48, 113, -53, 27, 114, -102, 259, -4]
6575dJ67L2k17O1r5p4P2P5O2k73J61J40j51M6k9N6o8r0K95j29m7P7j17Q3q1Q5
6601C7l9R6j51J3%r3N3J11R2J15j56j45n4l6J57k3J04O0j18m7j18J21L2o2n9J19
6627IJ27o0k63J99k9r9J08OJ78j02j0N5j51N1q5j44M37l46Q0L2n0o9J92k7r6N8
6653ANN7N4jo4k90O3K03j06O5J67n8k60K27q9r0L99k37j27K43l32L78j71J9Q4
6678A40k31R6O0q4J8P3k13j31p4O71m95J21j30J6K1K31j71J2J36k8j36K50l13
6701a61J48j25k7K47O5k01k55P6O3P0K64n5l13K15j21K0p0L61k32J14k99K48K0
6724E2j38J02Qk10J42J36k07J40l8J89l37L45k69m8%LL0K5k12R7K14j68K33L0
6748A19k23O0n0J13j40M24j10k32L9O6q1L9r7L4J58m22K89J58k52J41lJ30j6q5
$$ y = [-4, 163, 195, -22, 39, -56, -130, -58, 17, 79, -194, -33, 107, -44, 2, -27, 29, -39, -129, 166, 37, -10, 67, -50, 33, -48, 37, -2, 94, -57, -44, -44, -137, -84, 27, 119, 234, 78, -67, -121, -157, 0, -23, 81, 141, 23, -24, -142, -21, 11, -51, -110, 9, 136, 76, -187, 12, -17, -116, -8, -2, 176, 74, 64, 119, -32, 19, -66, -210, 227, -119, -39, -7, -57, -126, 66, 39, -57, 1, 6, 63, 117, 116, 52, -238, -175, 28, -78, -13, 154, 96, -164, 63, -26, -116, 283, 46, -81, 162, -170, 208, 37, 56, 140, -91, 5, 65, -19, -1, 72, -141, -272, -346, 325, -170, -49, -179, -163, -142, 89, -82, -70, 66, 38, -98, 152, -161, -13, -138, -165, 82, 147, -54, -309, -233, -170, -100, 164, 109, -204, 11, -110, -90, -160, 201, -31, 83, -216, 32, 52, -86, 16, 24, -186, -44, 92, -115, 25, -13, 176, -161, 184, -85, -133, -133, -130, -100, -75, -287, -190, 24, -144, 89, 119, -104, -44, -94, 19, -121, 303, 193, -39, 0, 66, -15, 24, -73, -39, 119, -303, -14, 144, -108, 33, 30, 160, 144, 59]
6772E9j84K71k13J69j43k0m1q6J89rl7L2OL1l7j0n0k5L8Q7k36K54k50J46J36J3
6798I0k29J63J93J38n52M9K92k56R0K9k0K12k86P6O6M8j61K1q8L2J02L4P3k10
6822i4p1L42p5N3l20L6oP0o9N7o2M8P0P8k01PP9l7J94J21m18J50j33K82r4l0J6
6849gJ30k79J74J80j87n2L56j92q3lJ12j50R0q2p2k0L1K18j80O8j07J90j51j66
6873a82K08n4M5J59j25k89L86k3k60J74r2J05r6o8O3K48j11l0Ol7m2J55k28J6
6897g2k56K54L5K27k07j1k4p1j57M04J00k40k3J31n2P5q2l14K17J7rj49J03K5
6921g9J59j1m5M5J67j07L4j62r5J28j16n0lO7no5J80L7j13m4K16k16J62M3o3J25
6947A89k35N6J35k35J98k8N0r4j10J53qj00m1o0K11o8P3j51OJ30j03J95k26K3
$$ y = [59, -125, 146, -67, 102, -41, -61, -102, -188, 1, -8, -45, -13, -7, 24, -13, -23, -73, -98, -60, 27, -209, 45, -205, -59, 77, 90, -139, 24, 217, 355, -197, -148, 144, -112, -22, 7, -13, 199, -87, -11, 55, 103, -58, -37, -125, -93, 9, 43, 116, -94, -165, 177, 102, 155, -165, -129, -135, -65, -134, -77, -139, -91, -21, 57, -144, -137, -58, -95, 99, 220, -198, -48, -181, 101, 7, -23, -7, 123, -156, 18, 198, 11, -41, 315, 123, 40, 37, 149, -1, 89, 7, -65, -85, -54, 164, -16, 52, -55, 135, -16, -182, 26, -28, 17, 176, 51, -238, 148, 125, -135, 39, -53, 52, -44, -112, -49, 199, 88, 58, 64, 27, -15, 140, -88, -72, -328, -74, -39, 188, -19, -30, -54, -125, -282, 122, 222, -18, -41, 90, 38, 113, 31, -283, -66, -49, -58, -207, -104, -79, 80, 69, 24, 69, 236, 129, 163, 1, -94, 34, -82, -132, -135, -68, -73, -138, 42, 79, -34, -78, 138, -78, 84, 127, 64, 189, -46, 10, 145, -90, 108, 80, 130, 36, -74, 79, 71, -29, -70, -130, 81, 13, 86, -65, -59, 71, -32, 163, -63, -40]
6971d0O2q9R2N6j55K05n1k09P0Q3J05j14J67J71l82J19j06P4j20K29j48p5nJ39
6995G8j87K53q5j55%J21j71J72m21N58j12j36mL5J8K2N3k81J16j2J72q6j06M8
7019a10j5OK34j23J38q6o5n4J91k10J2J19nr1J58o9l8J32j18O5k20J35p9N3j30
7044a70R2L8K4J93J0J1j68n7p6R2k1q8M6J08k27M80l06J12kj31l6qP2K2J15r4
7070C1j39J83K7q1K29m7k67M7K24k07rO6L7l9n7K02k29j46K52p2K06j65j16M1
7094b9q7O3Q9K6j98K36l13L36j23n7J2M9q3L8K27J5j86l7J42j28J10l2j92O6N4
7119bL7P8N0j40K46n88M27j41k6JJ9M2j26K63o0p9J19j5J3p0j55J91M7l88J01
7144a56J79j63Q5k06L58K3p1P7j56N7%k25J10J08j07n2R8K73k23R0r4j29J03O8
$$ y = [-40, 22, -67, 25, 81, -74, 131, 80, -129, -59, 24, 129, 15, 182, 353, -29, 90, -16, 58, -62, 167, 19, -56, -61, 78, -109, 144, 59, -96, -96, 25, -146, 26, -395, 163, 51, -85, -89, -54, -36, -14, 39, -242, -126, -138, 34, -52, -158, -110, -125, -119, 115, -8, 130, 44, -21, -75, 116, -94, -82, 37, 32, -59, 99, 30, -8, 124, 6, 71, -149, -14, -93, -40, -170, -78, -40, -16, 177, 187, 198, 30, -27, -103, -11, -32, -120, -74, 34, -193, 287, -19, 93, 91, -40, -76, -84, -12, 10, 125, 31, -108, 75, 102, 21, 250, 203, -64, -17, 207, 0, -9, 57, 94, 55, -2, 200, -29, -175, 77, 5, 211, 46, -70, -29, -116, -53, 36, 62, -136, 100, -213, 123, 0, -57, -45, 4, -79, -41, 186, 201, 15, -22, 120, -8, 102, 70, -122, -56, -2, 35, 113, 163, 23, 269, -319, 108, -33, -59, -58, -39, 3, -123, 140, 80, 1, 120, 105, 118, 48, -107, 84, 131, -257, -156, 23, -140, -55, -261, 97, 120, 49, 126, -30, 27, 27, -198, -88, 20, -87, -139, -41, 232, 9, 99, 5, -124, -21, 47]
7168D7k97K55K2O8m14L73P0j26q1o5J14j7rj32J15K00j15j59O3L4p9k9R5J42k12
7193a37J76O1j9l6K0j50Q2L9j4J89k47p2Q9J67k12J80k62l3J81J20m18N67j93
7216G8Q0k39k41K04M1L28k61j43N4J2J32O6m9k48K45o2M4R2k30o6J11jJ01lj65
7241a20K28j04J79r3l62J37L6J81ko1K1j75M18l56r1K25m9J4k23J19n0PJ49J51
7265A79k55m9j9JK13k12K25k27R0K13ok21q2K44L5j68P0J0J39j59J3k52L99j58
7289B3k88K05jJ41n4k6l4K01k95J02j33L67r5r4l0K14j48K0P0k21R9J77j73r9
7313g2K10k04K18j07j4k60L89j33Q9Q6j38j62j17K20n5J00j60j06K43K29q1m43
7335b68L12k3k15K38l0M6p3K12k04n6J50p9O8k11K52j96j87K83M0rJk82J74K23
$$ y = [47, -250, 5, 27, 95, -319, 54, 124, -2, -83, -148, -34, -51, -60, -192, -77, 123, 8, -151, -88, -54, -133, -162, -67, 75, -137, 39, 100, 81, 45, 65, -85, -3, 36, 22, 211, -36, -108, -19, 148, -64, 116, -146, -179, 2, 122, -296, 271, 78, 158, -81, -322, -118, -77, 251, -10, -153, -99, -87, 45, 111, 62, -186, 59, -3, 41, 133, -97, -163, -52, -53, 48, 45, -120, 108, 4, 183, 90, -272, -135, -99, 82, 80, 19, 40, -135, 283, -73, -164, 61, 12, 26, -197, -78, -128, -121, 28, 179, -76, -125, -144, -143, 70, -142, 83, -144, -54, 159, 153, -68, -150, 94, 129, -39, 31, 41, 180, 21, 34, -218, 181, 23, -265, -60, -61, 80, 26, 0, -34, 167, -128, -26, -159, 208, 113, 19, -11, 203, 55, 75, 145, -76, 23, 200, 27, -72, 138, -66, 152, 45, 31, -229, 160, 27, 116, 202, 64, -98, -215, 5, -50, 50, -110, -216, 27, 256, 175, -268, 44, 21, -194, 44, 14, 60, -13, 199, -5, -61, 89, 10, 78, -133, 119, -77, -264, 19, 59, 50, 51, -231, -57, 166]
7359A66m5p0p9O8j85P0J83j69LN4n0K10p1k8K31m53K4N9L2J63K11k12j55K03k20
7384f0K07l43L04O5k3j51K00j18j71M8J57l4n1K8m29M83j74j34L62j84o2rJ08
7407A9k10L22j03Nn9P2k2j66K26J6L8j31j4QqJ39k53J02P8J55j70O0l8k40J45
7432b9o6jo3m7J10Q3K06j91L0J03k65K65n2n8J03j19N4j54M8n0m5L65l67L50l85
7457a75J60r9J94k10n6J64p0L3j69J39o8J81N8j54K28r0N1l27Q5j13K69OO2r7
7481Bk56N68n2j76P1o9R9k11o6K12j85N5N7J06k65J44j3J36k50op7K71j0l4rr2
7507e0j62L70j07j99K12J03k77JK79k51J28j74J90j75K06o7j79K48r5L8J5k75
7529b21K94j86j06P3J59K2m7p3np0K45J9o4J18j99J86k59M3J10o5q3J75Q7j99
$$ y = [166, 121, 51, -28, 40, -145, -75, 108, -61, -58, -4, -54, 156, 85, 57, 288, -165, -141, -82, -50, 113, 324, 112, -43, 160, -60, 147, -196, 108, 173, 150, -1, 199, 81, -90, -42, 115, 81, 30, 58, -371, 112, -62, -196, 166, -18, -80, -89, 19, -191, 131, 28, 33, -26, 46, 24, -142, 84, 100, 138, 7, -7, 1, -7, 132, -121, -19, 59, 214, 44, 104, 66, -174, -29, -95, -96, -159, -206, -96, -13, 193, 2, 32, 135, -130, 135, 83, 25, 128, 9, 63, -91, -43, -93, -138, 227, -140, 210, -175, -15, -114, 80, -130, -186, -22, -92, -59, -228, -89, -157, 24, 82, -72, 156, 66, 117, -210, -125, -238, 31, 37, 99, 2, -254, 314, 262, 86, 157, 88, 187, -24, -90, 122, -63, -8, 49, 155, -110, 34, 21, 157, -93, -99, -176, 95, 85, 51, 42, -50, -212, 158, 51, -148, 64, 167, -110, -109, 170, -81, 47, -127, 63, -112, 94, 27, -152, 96, 1, 39, 54, -221, 73, -113, -219, -146, 13, 35, -12, -85, -90, -160, 85, 104, 40, 158, -41, 145, -114, -71, 39, -26, -109, 66, 153, -46]
7553d6l1K3M1k08M5N4K17J5j09J06j15J92n9l50L20j48pQ7K20k92OJ17k12L3l7
7578a38R9N0j58O3J63k89J77j04J73K0j15j49M81j36l8q2MK72k53l9j06J75j03
7601c3J11o4J07q3J04Ml5J04l65K99l76K05j4P8J7qj7K1p4n0J10J02j22k33K41
7626B9q4J57jR9l59J66j52K31n6q2K15k80np0O2j49M14l42J61j43J90N8m0q3J60
7651I6l72K44Q9j54K31j94l0P2J14l39K63M5o7J02j20M1M6j58O1L6k3J6J37j14
7675B2oJ36k07R4Q7M8l2j59L3K70k66K03k88J02o4J64J5m90J86K71n7%n1j08J04
7700Gj3J03j91J70q1r2J38j24K06k71m5J47L6J46p3J6j11j4J68N9k55K32k48P9
7724a1K1P0k29K83j08n7j74J82j67K15LJ1P8K6l3j93J84n7n1j17J01L6J21j22
$$ y = [-46, -77, -54, -13, -221, -176, -122, 95, 110, 1, 107, -8, 184, 125, -225, 95, -53, -60, 27, 247, -45, -39, 78, -134, -101, -138, -39, 11, -147, -84, 79, -210, -33, -137, 36, 56, -59, -208, 273, 137, 99, 17, 21, 293, 40, 1, -105, 70, -33, 78, 14, 121, 38, 142, 146, 111, 215, -150, 149, -227, -22, -36, 42, 59, 51, 34, 55, -19, -69, 41, 143, 21, -212, 29, -55, 102, 101, 200, -159, 7, -145, 86, 30, -52, 163, -117, -122, -192, -130, -279, 135, -207, -46, -189, 1, 59, 19, -64, 96, -276, -32, 57, -97, 134, -60, -90, -18, 96, -243, 20, 65, -2, 100, -20, 21, 67, -91, -30, 6, -17, -1, 136, 22, 16, 152, -55, 39, 126, 174, 142, -17, 16, 286, 20, 223, -65, 37, -27, 137, 152, -338, -152, 119, 62, 62, 11, -97, 7, -6, 97, -94, 76, -5, -97, 41, -83, 123, -148, -193, -46, -10, 136, 63, 79, -32, -46, 122, 181, -74, 158, -90, -11, 10, 80, -149, 134, 26, -31, -205, -23, -190, 25, 28, 39, 117, 143, 110, -83, 101, 44, -7, -124, -23, 13, 134, 12]
7748A2n3k56L44o4k6M4J65j7j30P5k51K35j81K54q2m0K0J68j28m8k0r0K12k14
7772g1K38j35j14L8j0O8j59J16q5J39K52k68n0k5K02k85K45J09m01P0K0K05J6
7795A15k61J68j33n6K36p7j4J08j8k30K00j61K32k07O3K51j3l39J17J08j34O2
7817A7j4J05r6j08j02K71l6j05M7J93k36J18p3L1j05N8Q8j02J46k29K07j33m5
7840a03J46r0J51p5l1O7q1R2m9j03K32j9l7k34J53LJ89l65K18m0j1j07J1M4J09
7865G0j38J04J52q4k2K23k76J11p7j42N8o2J02m3kRR9o6j49K36j22J49j24j31
7889a25j10J67K2n9J09k69N73k66L0j83K20j78M2k39J15J74K08k91J59j38QN2
7911B1j08J61r9J65l39J48r2r6K61%J71j31q1p3O1J54J9k97K21q7J71j12n9P2
$$ y = [12, -41, -297, 47, -17, -43, 1, 166, 149, 19, 94, -157, 78, -103, 151, 69, 29, 49, 217, 89, 41, 21, -69, 143, -71, 167, 32, -82, -44, -54, 14, -145, -29, -114, 25, 277, 9, -41, -66, 136, -149, 96, 205, -196, -126, -106, 99, 115, -146, 22, -111, -167, 69, -8, -22, 86, 68, -162, 38, -123, 109, -98, -35, 216, 203, -136, -19, 89, -45, 17, 3, 108, 12, -96, -198, 73, 37, -68, -21, 172, -64, 54, -19, 12, -93, -35, 53, -49, 97, -132, 75, -58, -103, 43, -47, 104, 29, -2, 65, -16, 76, 27, -76, 156, 137, 100, -134, 19, 22, 211, -154, 64, 24, 13, -94, -83, -39, 70, -68, 36, 188, 104, 82, 305, 29, 140, 63, -79, -21, -83, 19, -24, -26, -17, 82, 16, -133, 103, -19, 130, 6, -125, -235, -68, -46, -105, 4, -265, 308, 42, 72, -111, 109, -69, -27, -266, -151, 23, 231, -60, 99, -39, -31, 21, -87, 74, -25, 140, -199, -51, -143, -239, 22, 22, 193, 62, -19, -92, -31, 123, 142, -155, 66, -21, 150, 38, -21, 51]
7935E1ok45K04pr1Q5p5J39pj02J29j54K65j93M0p3r0l9J4K72k72J07J6Q2R9J68
7961C17k29Qj17mK35l74J58q5p4M9k3OM19l38o8J71Q7j86nJ07j34K27l62l8J56
7986i7O5k56M25k42q6K58j34J95M0j91n2K78j34J7j14j92OK07k6n1Q6j30R7j0
8010d1J40j94O7k26K99m6k69K78K4j3P0n5k4m6J64J14k86M4L4k02p7J10L73k40
8034bK39l24j7M1K25l68M6L4J73J94k16J06l10P6M4Q9k25J75j20Q5J13k1j73J46
8058A0o3j91J22L80k62j59J94L3k8j51K7n4K27j02J7j02N7J3j68J13J66Ro6J24
8082A46j35J13k08O6L8J67j02o9P8k46J69K1j74l8K4j7J69K17o4K0j67j07P4n3
8106g8J21r9k9J51j02P2Q6j12N3R3k27J45l1J8j65K10Q6p2j47OJ21j82K01j35
$$ y = [51, 45, -200, 4, -3, -94, -9, -84, 55, 48, -54, 75, -79, 186, -7, 33, -40, -130, -169, -155, 117, -155, -48, -32, 50, 149, 317, 88, 96, -21, -25, 210, -164, -6, -91, -165, -116, -139, -133, 286, -52, -120, 51, 138, -48, -53, 54, -80, 147, -215, -253, -97, -32, -288, 137, -105, -191, 67, -67, 128, 168, -23, -75, 203, 69, 86, -28, -220, -214, -7, -33, -84, 2, -128, -31, -41, 99, -95, -28, -254, 45, -1, -270, 8, 32, 19, 89, 34, 10, -36, 128, 242, -44, 0, 34, -168, -245, -135, 238, -2, 237, -87, -104, -63, 162, -206, -160, -126, 47, 241, 25, 131, -179, -103, -59, 30, -195, -20, -140, -55, 58, 37, -136, 10, -53, -244, -122, 258, -4, -163, 31, 64, 36, -115, -88, -142, 85, -17, 0, -102, -45, -32, -200, -87, 79, 88, 22, 146, 11, 124, -84, -18, 20, 187, 85, 16, 94, -152, 17, 38, -136, -174, -150, -167, 2, 219, 155, 175, 8, -99, -25, -78, 43, -56, -85, 66, -36, 36, 122, 10, 63, 156, -71, 74, 43, 61, -104, 106, 192, 120, -27, -21, 100, -82, 119, -16]
8130a6L9P3J21k81J7R6J54j12J88l56J60j70J56j42K0J05P1p0j26L12k24p8m4
8153a07J14P8n3p5K89l47K01l14K39K03m05J60q8J13n3J3k58O04l44n7J00o1j06
8176a54J42J48p8k15R3L5j22M06k78J8j5J54j30M2J27
$$ y = [-16, 23, 96, 217, -64, -47, 49, 203, 91, 279, -77, 83, -87, 69, -73, -53, 52, 123, 53, -73, 239, 15, -63, -107, 7, 85, 32, -43, 246, -101, 100, -214, 25, 228, -177, -17, -105, 8, -45, -32, -290, 314, -30, -87, 13, -48, -154, -12, 136, 58, -157, -64, -29, -151, 255, -23, -5, -20, 134, 4, 46, 173]
8191A73
$$ Imaginary data points
##PAGE= N=2
##DATA TABLE= (X++(I..I)), XYDATA
0@%%%%%%%%%%%%%%Qj6J6j6J6j8K6l2L7m5N2o0P2q5R4j06J22j42J64j84K08k36
36a25K66k98L33l72M13m60N12n67O28o94P67q48R35j030J134j248J373j514J672
55H77j848K049k278K540k847L211l651M196m888N805p086R015j2282J9286o4955
70e2856N9841M1285r9817N8759K565l6463L9857L840n6506N4977J0813n6967L0374
83b98J6321l4136K2417K149j7714J3205L911j8176J6519O750k0536O896J1295
96H603q679N16l104M092M213l557k40n312N682Q597j0801l687P981J937q050M538
112B729j065l755J1001q967j610Q406q043L724K524k926j015J120n54j110M203
127D662p085J191P537n336m105M35Q117l159o864Q859n653j774Q619q758r18J0593
$$ y = [0, 0, 0, 0, 0, 0, 0, 0, 0, 0, 0, 0, 0, 0, 0, 8, -8, 8, -8, 8, -10, 16, -16, 21, -24, 28, -32, 40, -45, 49, -57, 65, -77, 87, -97, 111, -125, 141, -157, 176, -196, 217, -243, 269, -298, 330, -364, 403, -445, 490, -540, 594, -654, 719, -795, 877, -971, 1078, -1200, 1340, -1507, 1704, -1947, 2249, -2639, 3166, -3920, 5095, -7187, 12099, -52856, 6985, 48270, -51547, 7212, 9777, -26686, 13171, 17011, -39495, 15482, 26295, -30672, -298, 16023, -18113, 4304, 6453, -11261, 1944, 5855, -12321, 4198, 10948, -9588, -2692, 8603, -76, 440, -2664, 1428, 5641, 2084, 1844, -3468, 2214, 10811, 10, -3677, 4304, 6241, -1809, 2729, 1664, -2091, 8910, -57, -1667, 6739, -1304, 2420, 4944, 2018, 1003, 2123, 1569, 459, 4662, -2423, -1232, 6305, 969, -3136, -2701, 5416, 2257, -4607, 4252, -1401, -3175, 5444, -3314, -4232, 6361]
143F361p473q227J5326m314j3997J9496n778j2870J8744j0198q237K0193r405
156c79j4217K1508k611k0632K2792k997j8806K4715p854j6669K2234m019j6437
169a3372J7579J403j9280J6354K102j6438J6781j693j4023J4657k02j1002Q004
182H70L638r650P009K786j2740J0566L394j0873O191J465l736K501N96k862J857
197A012M100o474J434L711l962K422o86K38J61k099K812j490Q21l53q47J562j214
214A148R56k610K556J691n530L821k19k812L253o43k681J253L326n594J720M353
230C988p972M366L734q821L842M021n655J32N905o374r77R251r924l89J0374r218
246c717l96P678n701l859R894m531p262J2842o120p227J3644o350o274J1116l091
$$ y = [6361, -1112, -9339, 5987, 1673, -12324, 7172, 1394, -11476, 7268, -2930, -11167, 9026, -379, -14596, 6912, 4301, -16331, 6461, 3464, -15342, 9373, 1519, -15150, 7084, 3065, -13372, 4207, 5610, -13670, 2684, 4786, -11652, 5129, 3436, -10587, 4070, 3868, -7134, 870, 4508, -5142, 1867, 4653, -8087, 2479, 5873, -5000, 1191, 2656, -1080, 1421, 2017, -845, 1012, 5112, -1362, 72, 3783, -179, 2243, 1557, 1795, 1956, -143, 2669, 1179, 2000, 1647, 800, 2362, 1148, 2104, -506, 2050, 3741, -1789, 2032, 1813, -999, 2254, 1611, -1070, 183, 3509, -2085, -365, 3988, -3984, 382, 4116, -4705, -863, 3158, -2497, -2365, 3540, -2834, -3811, 5440, -4484, -4873, 5501, -3717, -4113, 3565, -2136, -5995, 3899, -632, -7894, 4948, -1172, -8399, 5245, -1105, -7379, 3737, 646]
261F46q303R670L90j1133J1975l5j2191J2195q26r612R648O94r090O975L490j1055
277f562P701M247j1286Q046J441q358P071Q31n868M086K455o252L037L363o184
292b232M438N40m436M519j909j063K324j016j27L08J48q82J671j831Q2L143m930
309a253K450J755m714L981l42l279K818M27l494K157K644n981L566K285o895N199
325A324P08n456M089J047m616J963L674n891J614M942p440K639L970o236J903
340a766L843m392q43N669m326k787Q031n840j747P687n669k151O503l132l939
355d859P355k003o343R375l537n755R421l587m752P337j582n676O606L34p068
370d734P185k60p039P903j174n454O115n84m386L451J810m964L465J964n688M178
$$ y = [646, -7657, 2013, 2403, -8730, 3245, 3210, -8981, 3214, 2388, -7224, 2424, 3118, -5972, 1003, 4493, -6562, 1139, 5386, -5900, 2146, 3587, -4771, 2300, 3131, -2737, 1349, 3804, -2448, 589, 3952, -2232, 2206, 2746, -1690, 2829, 920, -143, 2181, 1165, 1038, 1346, 1494, 612, 2283, 452, 534, 3677, -1253, 1197, 2952, -1762, 2219, 1877, -1402, 1416, 1843, -1651, 506, 3150, -2831, 735, 3020, -3875, 1324, 2032, -3424, 665, 1712, -2904, -941, 2733, -3158, -1544, 3398, -4042, -1403, 2567, -3669, -1766, 2077, -2315, -3158, 2511, -1815, -4602, 3429, -2411, -4158, 3529, -2140, -4291, 2212, -920, -4859, 2496, 493, -5850, 3525, -12, -5767, 3654, 67, -4685, 2652, 1070, -4606, 2000, 2334, -4734, 2451, 2191, -4848, 3055, 1881, -3573, 2542, 1958, -2428, 1023, 2833, -2131, 1334, 3298, -2390, 1788]
386A788L99l248K585O4j319J04J428j066n77K318k187M92O14q56L84n54J559j430
404D98m03J775k153N31J451j312r64J522K83k953L198m93l274L890q56k742K409
421D07O07k802J333K592n332K165L939o252K326L280n370J646L817m997m84O426
437C301n746j193P591p373L11O780o780K5N975m553k116O948m811k769Q429n505
453a486k520P320m971r31N169l227k517N455j944l658N663k084k756N116k705
468g6j578K968k03j519J025R13k668J839J430k799J339Q61q68m67R23l85j102
485c67L068j507k482L502j596m76J498r05j200J807N92k993J936L43j934K639
501A925j305j133J113J28p5j035P40l51k57J158j229m16L05J639k009o70K714
$$ y = [1788, 2187, -1061, 1524, 1588, 269, 373, 1801, 735, 158, 2476, 289, 781, 1395, 539, 923, 369, 1928, 498, 95, 1870, -283, 248, 1699, 387, -577, 945, 1228, -1725, 1473, 980, -2294, 1596, 740, -2002, 407, 1014, -1788, -455, 2137, -3195, -1030, 2909, -3343, -1017, 2263, -3107, -1461, 2356, -2641, -3125, 3301, -2445, -3638, 3953, -3420, -3109, 3671, -3109, -3084, 2891, -1662, -3778, 3170, -1641, -4410, 4019, -1486, -4006, 3314, -1657, -2588, 2581, -646, -3163, 2292, 348, -3310, 2353, 269, -2487, 2629, -76, -1654, 1314, 1111, -408, 617, 1530, -1138, 701, 2131, -668, 671, 1532, 664, 197, 1120, 735, -367, 2701, 1194, -1288, 2214, 618, 142, 1640, 735, -465, 1342, 1934, -1059, 877, 1220, -714, 1925, 620, -513, 600, 728, 653, -382, 358, 7, -250, 908, -321, -737, -432, 1207, -802, -1472, 1242]
518A242k645J218K023n011J809L400l853L51K980l969P72N014o597N76N959o312
534c043J530M009o471K431M812n784m47N842n490N95N768p154J422N620n965O54
550a671L592l754N51M079l959j326N098l284k24L069l357L67K520j288j134J013
566B92O37j453J734m12j788J748O43q82r75J661k47j177K335k366n09L478j657
583A062j649J902m90j006K050o76k959L395l27k104K290j399o01K015l67k020
599h84O51J606j701K92P05j817J250N13p80r09J037R30k363J504M3k036K454Q8
617E83k481J035J667k313O86K175m222K058L182n071J828J899l383J510K666m045
633b226L6M797m218j42L935m840J472L560m254O5L857k783r23L687l580l82M904
$$ y = [1242, -1403, -185, 1838, -3173, -1364, 2036, -1817, -1466, 1514, -2455, -1683, 3331, -3266, -2690, 3269, -3043, -1513, 2496, -3975, -1544, 3268, -2516, -2963, 2879, -2611, -2016, 3752, -3402, -1980, 3640, -2325, -1671, 1921, -1833, -1282, 2797, -1162, -2488, 2610, -674, -898, 2171, -1186, -819, 1701, 413, -721, 292, 929, -524, 1210, 798, -990, 758, 1401, 519, -456, 1205, 958, -219, 2116, -250, -759, 2719, 1062, -587, 1315, 825, -181, 1869, 1193, -1766, 1629, 1302, -802, 1488, 89, -512, 1503, 1136, -884, -233, 1373, -328, -36, 669, -1148, 102, 615, -165, -1074, -37, 893, -1470, 34, 77, -1959, 495, 583, -1898, -863, 804, -1509, -823, 1352, -2870, -812, 2370, -2701, -873, 1026, -2357, -847, 1819, -2226, -2190, 2607, -1611, -1753, 2182, -2658, -1186, 2374, -1880, -1815, 2042, -741, -1664, 2023, -1557, -1939, 2965]
650B965l804n25L209k398J21K038j798q82K766o90j976K183j128m82J995j262
666C32j74L60O42q06m55J333j151M35Q60j154j32O24N53j570J201j36j565K379
684A576l18k097J561Q6j386J301K74k052J404J233l268K035O45k414K160k84j541
701a085R35Q50j173j47J077j453M83P20j270N11J62L23q55J45R79j730J304P68
719E44k407J488R19j754M87J670k591M89K964l816Q48K730l331J218K180l276
735a638N86K936k823o95M012l817K28L672l918M33K967k762kK403k000o97L071
752A956j854j140L010k147j57J692j424j14J022k00o74O33K78r98O86j9m37K51
770C64K44j36q33J175j64j379K062j007r03J596n56j011J091N12k180J693M15
$$ y = [2965, -839, -1364, 1845, -553, -432, 1606, -192, -1074, 1692, 1002, -974, 1209, 81, -401, 1594, 332, 158, 518, 1160, 354, -101, 1232, 81, 516, 1376, 222, 90, 714, 1267, -303, 898, 762, -803, 1576, 1258, -839, 722, 808, -578, 723, 997, -1055, 349, 1582, -1686, 349, 994, -1420, 740, 456, -1085, -150, 700, -473, -620, 457, -996, -513, 207, -1063, -552, -390, -67, -922, -777, 202, -1528, -224, 544, -1863, -375, 544, -1210, -723, 947, -1644, -1155, 1809, -2007, -1159, 1571, -1760, -542, 1638, -1638, -1052, 1884, -939, -1634, 2378, -1439, -1211, 2461, -1457, -1024, 1943, -819, -821, 1582, -418, -1115, 1956, 102, -1038, 1972, -175, -332, 1360, -64, -178, 844, 644, -30, 603, 881, -117, 569, 550, 113, 364, 608, 472, -361, 814, 650, -729, 1333, 326, -577, 1019, 463, -548, 543, 1055, -1125, 568, 983]
787I83k331K077k8j648J323J73j424N89J296k033L69J659k288J120P26j511M57
804d91O69n59m34R79l04j421J846l61j398J420m8r44P50Q03j987P77J727k868
822a844J753J046k722J417R60j835Q05J749k262J64K451k948P01K011k512M54
838f12J621j429m9J831j559r28K786j686o38K377j930k17J646j014l42Q25J10
855G92j477J419J68j456J576l38p50N19K67o23Q1Q38j350M21J118j556N76M65
873F90n86j10N63n1j088J357m82r49J327n70p11J011k00j001N03R42j496N61J047
892G57j734P67P91j454K79R45q49m54J531j149o91K077j664k57J564r29m09R77
910I8j31j429K043l61j838K122n18j014J184J17j357J104O24j645P70J146k144
$$ y = [983, -1348, 729, 701, -947, 376, 549, -875, -286, 1010, -1023, -654, 1005, -1283, -163, 563, -948, -491, 178, -381, -815, 164, -140, -1561, 285, -76, -1474, -54, -102, -1046, -296, 507, -1480, -703, 1024, -1844, -91, 955, -1767, -350, 610, -1225, -420, 1329, -933, -769, 1682, -1266, -565, 1446, -1066, -612, 1009, -420, -469, 1362, -197, -1125, 1661, -25, -663, 1714, -216, -433, 1213, 199, -143, 682, 792, -685, 734, 902, -554, 1022, 684, -66, 453, 720, 97, 178, 1016, -334, 87, 1205, -351, 225, 690, 104, -6, 557, 506, -582, 775, 293, -656, 671, 101, -610, 401, 201, -800, -297, 645, -851, -290, 757, -977, -210, 581, -873, -594, 351, -498, -952, 579, -570, -1261, 816, -848, -1105, 459, -470, -879, 98, -33, -1462, 581, 220, -1618, 504, -14, -1028, 156, 273, -1084, 20, 644, -1001, -231, 915, -1229]
927a229J257Q54j732P33R27j067m31J659j129o11K142j464n44J895j253l77J394
944A024r23n17J289j09j614J895l64j346J755p71o61Q12L81r48L62O97j506J107
962E63N61j452O62N1m58J91L68l20o44J229n80o69J141o29j11K37l37m68M58Q12
982F05j722J053N87j363J052O3j144O41P19j005m62J532j109k55J486j792J97
999i17J116o74l34R14m25r31J872o27j284J730m24q74R98j49r39J202K21j543
1017a068Q86J087j738J107M3j417J251O92j191J82Q56j122J87J454j778M26J282
1034A139j250P5O25o16j32J282p49j075J629k83q59Q67o32m1Q10N9j131K67J059
1053A044j523J137J57j523R89O11j089J68Q86r56j81J263j535K77J490j309k33
$$ y = [-1229, 28, 882, -850, -117, 810, -257, -688, 971, -158, -769, 1373, -91, -635, 1260, 7, -370, 1024, 101, -416, 873, 764, -850, 1045, 681, -665, 1090, 319, -342, 470, 851, -97, 265, 962, -544, 563, 1124, -328, 334, 385, -73, 118, 486, 166, -478, 751, 171, -498, 643, 14, -97, 140, -197, -665, -207, 605, -1117, -64, 523, -840, 212, 275, -869, -228, 491, -514, -976, 556, -553, -808, 678, -1114, -917, 199, -475, -809, 105, -320, -1251, 621, -6, -1290, 440, 16, -858, 140, -9, -948, 254, 475, -1068, -182, 905, -833, 274, 317, -1100, 151, 843, -348, -166, 690, -432, -245, 1209, -569, -143, 1139, -111, -36, 589, -27, -159, 1123, 374, -701, 928, 645, -214, 653, 21, -20, 790, 849, -282, -15, 1044, -479, 658, 815, -708, 281, 892, -197, -29, 857, -99, -280, 983, -552, -275, 1215, -94, -327]
1070c27N14n56J37Q94o74q65J279l13p55R72o10j63N79J9n64j04N54n09J72L35
1090A5r74P30M63n37m86Q65J97j053R67n39o84J895q39r08J089j28r05J346m83
1109C1j327J730K2j578J542j18j114J404r0j436J021P04j419J048J71j474J310
1126D27M62j403P82l9m7J07N81j008J18Q26o85q4M31l32J83j72M62j052O16J077
1146A250j597N57M96q44O35L32j431O49J135j438OJ181j652O39J066j856O88Q62
1164F78r59J53N72r66n0J358j272j1O63o86M31J48o78K61M48N7n82K88j7j48J76
1185a36m0j76l57J002k95r68J241n56m86J211q10o18J465m73j054J481k74j412
1203a255J950l77j765K099p50q46J300j73j142J440J12j430J309j41r32J432n49
$$ y = [-327, 187, -369, -232, 662, -12, -877, 402, 89, -666, 306, -304, -467, 112, 131, -433, -537, 17, -492, -320, 15, -959, -229, 234, -303, -789, 76, 273, -780, 187, -352, -1036, 859, 20, -888, 201, 73, -832, 514, 31, -1296, 434, 456, -1122, 420, 302, -812, 592, 502, -934, 87, 791, -628, 420, 591, -883, 427, 889, -514, 268, 229, 182, 289, 870, -138, -20, 806, 121, 37, 468, 136, 319, 147, 609, -443, 173, 1250, -347, 210, 706, -138, 497, 829, -602, 47, 1182, -256, -250, 931, -721, -82, 984, -872, -184, 678, -281, -128, 444, -522, -572, 786, -486, -497, 166, -520, -89, 59, -619, -358, 90, 147, -435, -147, -164, -312, -136, -176, -352, -709, 293, -2, -970, 271, -285, -771, 440, -370, -988, 477, 4, -1050, 431, 157, -1255, 695, 318, -1447, 652, -98, -944, 356, 183, -959, 481, 593, -837, 472, 331, -601, 831, 282]
1220B82o56Q38j81m71L17M85o83J58P76q62Q6M23k68l91N16P9p53R81R2j312J135
1241E91j21p11Q86m0r03N98O27j538O05P96j379Q50L40j459R61L89r76M76M26
1260D18r65J05J219j232J69P27j022L51L77m41j06M83L2o64N65j44n67P95j40
1279d0l48J5M84n65L5P77q85nQ84r24j1Q29n97k41J189o06p78J591j025m57J294
1300F16n57o40P60K3n05N76K15j156J192j50j082J190j91o77P40K91r19N02N31
1319G59j107K72P73j028M27M68n66O4P05o07m69J248q92l07Q47p10k23R12n11
1338E5k16L00M19p89N11L40j105P35J25p64L63L90p03J15O57o41j96R24r77R2
1358c65P53p43r4P19k82n59Q77j46p75Q48l96n40R40l40l81M38nn87N46R0q09
$$ y = [282, -374, 464, 283, -188, 129, 614, -69, 89, 865, 3, 89, 512, 244, -147, 369, 448, -305, 676, 768, -544, 591, 470, -241, 645, 605, -298, 300, 927, -611, -6, 790, -589, 261, 601, -858, 103, 492, -484, -8, 418, -547, -442, 777, -455, -286, 441, -581, -230, 147, -294, -400, 83, 115, -549, 16, -128, -695, 100, -40, -388, -373, 111, -454, -419, 358, -527, -532, 352, -572, -583, 246, -351, -592, 597, -9, -787, 804, -221, -678, 616, 59, -581, 179, 202, -303, 273, 488, -668, 524, 374, -708, 482, 291, -386, 354, 645, -274, 228, 759, -348, -76, 697, -331, 96, 564, -2, 62, 767, 160, -309, 939, 47, -260, 587, -123, -346, 566, 55, -161, 139, 558, -231, 280, 620, -485, 250, 375, -389, -26, 364, -339, -224, 433, -208, -404, 520, -457, -365, 388, -355, -449, 270, -12, -571, 306, 160, -615, 233, -163, -703, 237, -103, -484, -46, -51, -638, -92, -2, -811]
1379h11R42j51l70L25L2j17m7M66n20l43Q93m73j35M80o4l04L86ro45O61J50j110
1401g64R79J63j016J034N0q74P02L60r28L82M02q63N46O65j378P90L40q11L90
1420A69M84r41K24O52q76L02N75p31J79N58l48m00M04L1o79N42J39o69P90k71
1440A34l29O9N82o82J8Q04j033J59R61j164M20M48p09j09O83o62j50J061n67l36
1460d02O53l86m66R70n98l16O79l04l84N57j14m08O33j97l72M16r0p7j50L88k71
1481b39k08P27o31l2O46k23m29O33k12p24J134l86q22J362m52n83J022o49k42
1500c08P83mr71N66M52q19O77j3o58P82O7o82J58L24k84K5L54m18lM78m89R0R5
1523B02l3k21L77j47p51R08r8m11O08k31n20O02K80j145O26M35r05O96J34r67
$$ y = [-811, 131, -20, -390, -65, -33, -150, -197, 269, -251, -594, 299, -174, -309, 171, 107, -197, 189, 180, -465, 196, 346, -764, 215, 378, -638, 396, 446, -428, 274, 634, -294, 88, 490, -373, 173, 838, -540, 250, 590, -221, 169, 653, -288, -64, 588, -288, 14, 589, -142, 37, 595, 247, -153, 251, 282, -397, 145, 284, -385, 405, 134, -195, -126, 456, -226, -208, 596, -437, -278, 683, -481, -61, 387, -322, -431, 252, -410, -560, 501, -66, -402, 251, -135, -601, 369, -229, -545, 134, -170, -554, 3, -111, -519, 114, -83, -455, -39, -129, -206, -356, 32, -239, -447, 280, -351, -383, 263, 40, -389, 244, 32, -692, 442, 56, -766, 596, 144, -439, 583, -66, -308, 475, 471, -500, 66, 518, -301, 376, 363, -295, 487, 554, -128, 30, 354, 70, 95, 449, 31, 28, 506, 17, 107, 202, 169, -52, 325, 178, -573, 335, 237, -174, 434, 203, -317, 285, 565, -580, 46, 481, -424, 272, 406, -561]
1543e61O20L62q33L55K21p76L53N39p24J2Q10q20L54j05m2L9M80l61o98P14M8
1564a3l97L94M7o25M47K35l87mM28m98O6N87r78N44O34n92l32Q91o02k86N71m17
1586b87k76J158n53k13M35l18l51J127n54o53R08k56m91Q09l08k58N40k68l51
1605a60K64K79l77n0M48l94K5M42l01k13M53k11n6K69l18m56J052o35l33O41k66
1626A03l33M69j10o90P45K58q88R33l21m64P46m78m20L13L96n09K72l9m24L74
1646f7K51l70r4K20M4k05J02P9l92M60M6m06J65R9j59Q8L28o74M39L24o43K27
1668a38L30n96M04K00m41n6P19q21K63M27p76L60O26o93Q4L47m74J00L53k94l5
1689a11N03k13l85N24l63l1J56J08k18J15M21n05r3O52p58L10K93n86p5O54l51
$$ y = [-561, 59, 421, -412, -57, 164, -612, -259, 280, -444, -432, 378, -442, -88, -193, -235, -196, 284, -77, -775, -61, -13, -410, -16, 31, -594, -147, 88, -299, -303, 125, -373, -307, 280, -698, -154, 480, -112, -444, 447, -155, -441, 130, -287, -563, 595, 42, -171, 264, -54, -405, 722, 168, -485, 423, 167, -324, 485, 177, -81, 459, 191, -160, 104, 383, 6, -44, 404, 10, 35, 477, 176, -37, 416, 205, 149, 418, 100, -356, 696, 61, -272, 369, 103, -230, 239, 129, -561, 184, 442, -446, 487, 166, -298, 448, -30, -450, -137, 259, -250, 22, -17, -441, -67, 184, -186, -280, -60, -16, -221, -119, -40, -432, 28, 74, -332, -167, -68, -227, -139, 189, -485, -46, 278, -365, -138, 192, -404, 0, 200, -241, -297, 422, -399, -136, 291, -485, -125, 501, -192, -108, 239, -235, -135, 218, -76, -111, 392, 179, -206, 318, -45, -76, 80, 188, -30, 85, 506, 1, -92, 560, -198, 112, 405, -181, -256, 398, 47]
1710D7j22P24m18k99O36n46k82P51m83n00Q60k47m84P70j98n90M81n2m79N91l98
1731b38l7K55J23k46J56J15n47M77L09q10M21J13o3k84M78l40l04M23r8k65N29
1752A67k57l50N94r5l40K66J74n27M61On17N89N7p09M29L25k64j84O74q51K30
1773a22N30o92J86M05n87J09L69k52q9M72k45l53P05k31k54M49k23j42J05L77
1793E17p42N10j2l58K93J93n43J71M44l47j46L13j44k44N49n38J35K80l84r2L00
1814A55j98m04N76mo21O09Q2m84L73n2k76K46P0m42L93J78p72N88Q2m36N65j93
1836C5m08K29J51l15J4L14j66J12R8k74j28L87j52k5J47J27m42M03l5l30L03r2
1858d7m4RM66p24K16L82m86K70K48m81m0M82l74Q8M21n32k2O74n68j59M81l88
$$ y = [47, -75, 649, 231, -68, 568, 22, -260, 491, 8, -492, 368, 121, -363, 407, 209, -381, 100, 48, -431, 160, -238, -275, -20, 103, -143, 13, 128, -419, 58, 367, -443, -22, 91, 28, -256, 222, -118, -422, 1, -97, -362, 167, -90, -440, 154, 59, -281, -15, 159, -368, 93, 99, -418, 171, 228, -481, -52, 273, 9, -175, 499, -352, -122, 408, -284, -98, 307, -280, -171, 198, -54, -143, 329, 84, -269, 436, 205, -49, 400, 177, 35, 140, 517, -225, 285, 273, -85, 208, 401, -142, 29, 473, 126, -20, 293, 149, -95, 454, -84, 51, 331, -53, -145, 155, -43, -447, 129, 125, -496, 113, 195, -289, 84, 32, -244, 2, 72, -370, 23, 201, -571, 17, 99, -337, 228, 35, -373, -144, 7, -308, -294, 20, -146, -34, 64, -210, -338, 49, -103, -128, 19, 146, -296, 107, 72, -258, 45, -47, -91, -82, 384, -340, -124, 258, -228, 42, 290, -191, -231, 251, -123, -35, 386, -146, -168, 506, -62, -221, 260, -128]
1880a28r6O61o11K51J28j38l33P20k85j61M57m71J19o7J30k76J91K33k24o2J00
1901A38k1k94L79k37j2J48N8j54K93m29k51M63p3k11L84k8l40K43P0m62M77n4
1923H7n43O31k99j27L38N7m48L48j77m29M54J90n66M61J40l27LK88m32J28L50
1944A27k04j4J16l5J15LJ40m30J01L02l76J77K51o31L29K94m16J34L36m16j11
1965b08O45m12N7K81m22n7N14m48r9L60l29n7N80n04m0N84m13k61O38m04q7L29
1987B47L9l74K05J15m67M32M9l31J47J60j5l01K60k01O2L86n00r8M32k04j87N31
2009C87o08J99P8k3n07N03q7j00J59q1J34J73j00n06K88K08m15L53j4l19K23J85
2031A30m01M27k36q9k5K25k27j7K86P1j88p3k9j28M50k46k48M12o4l72K19K75
$$ y = [-128, -224, 437, -174, 77, 205, 67, -266, 454, 169, 8, 465, -6, 113, 46, 176, -100, 91, 324, 100, 38, 138, 117, -177, 202, -35, -47, 101, 159, 5, 298, -131, -382, 81, 8, -203, 181, 153, -187, 56, 126, -336, 141, 87, -456, 175, -124, -251, 87, 144, -304, 44, -133, -562, -108, 82, -484, -23, 117, -210, -207, 81, -351, -223, 127, -77, -91, 25, -10, 105, 108, 248, -182, -81, 221, -155, 22, 273, -358, -29, 265, -151, -17, 319, -97, -208, 437, 25, 82, 363, -59, -116, 398, -50, -149, 211, -118, -175, 405, -99, -139, 445, 32, -229, 409, 5, -82, 247, 286, -88, 117, 232, -235, 197, 246, -85, 62, 222, 207, -94, 166, -35, 27, 413, -87, -185, 247, 43, -144, 387, -221, -22, 56, 33, -474, 29, -58, -158, 1, -80, 54, 227, 127, -379, -91, 117, -298, 55, 41, -278, -55, 130, -271, 156, -80, -169, -194, 31, -196, -213, 73, 144, -44, -117, -146, -274, 176, -70, -318, 94, 30, -342, -123, 152]
2053A52l75K76M71p00J37K04j43l0Rj3P5J92j67j75N15n56K57K43m53Q7M00k68
2075A38j25R6j70P7K78j10q3L3M3l52M59m02l5K95q2k0J27O5l24J61K11m62J82
2098@L29l56j81K79J28m75M69l36j57N31k14l15M00j92l7L12k37j95L10P0o35
2119e02M85K4l24L68q9k94K09K87n24M11k19R9J65p9k56L3K65j23o4J43M5k89
2141b29M60k88RK4k08J94J29r7o5N2J50k28Q0P0l9J15K89n84N1M82n24kL87j54
2165G4o1K86k41j05K58J3k35R7J05k52L23k31J49J6j13n4L26l16j00j36M85k94
2187fk09O26m31K94k7n57L12K65m57j02O93l08k55K82j57N2J83k28j44M52l74
2208i6L5J64Nk25K38j44k76M11j09l11L33K44m70J00K26l11J92N6l35K49P1n8
$$ y = [152, -223, 53, 524, -176, -39, 165, 22, -8, 1, -12, 63, 255, 88, -87, 428, -128, 129, 372, -81, 6, 406, 138, 13, 109, -61, 16, 294, 184, 101, 134, 177, -175, 284, -118, -153, 142, 60, 40, 167, 232, -92, 69, 280, -182, 0, 329, -27, -208, 71, 199, -276, 193, -143, -300, 231, 17, -298, 102, -90, -127, 185, -52, -247, 63, 133, -502, -17, 7, -317, 51, -38, -332, -123, 164, -360, 51, -168, -69, 96, 17, -239, -206, 59, -64, -128, 15, 60, -229, 231, -57, -48, -24, -232, -38, 91, -6, -71, -19, 131, -97, -17, 53, 14, 129, 418, -166, -115, 367, -157, -159, 228, 74, 13, 299, 58, -47, 211, 224, -11, 86, 191, -61, 262, 31, 180, 196, 83, 29, 355, 39, -61, -197, 288, -6, -215, 411, -20, 274, 247, -310, 2, 267, -190, -292, 401, 93, -162, 120, -37, 15, 198, -30, -174, 278, -96, -61, 103, 108, -117, 121, -23, -299, 112, 3, -308, 25, 269, -201, -101, 125, -186, 6, 62, -273, -24, 47, -11]
2230a1j89K32j65j0M19l48q3L57j01j19O3k3j15J02J91o18N36O1m52K62L0K7l5
2253A1J00k19J30J46k43Q9n3pk6O3j5L0L10k61j35J4J06LJ65j81p3J81j89o8m2
2278a64N87m77M3Q5j42J27K43l08j20K31k45N1K29k81J94J49m09J92J94j26k24
2299a71L91j81k5m5k2j17Q4L5r7K91k14k22L42O4k24J73kk62M2L97k71n7m3j75
2323c09J29J32M4k55L54j21M9K37p4l65L22j53r7L87k95j39L17o1k67L24j99L6
2345dJ1j11j9J90k2k11M10j73O2q5pr2o8K52k21j0N12l66J2P2Lk52q9M90k72J12
2371A24j9k28L42j53k84M61j06k39J31P2k86M8K09k13P7L16n96L57J77l88K09
2392A1j34j17K5L23k26kL07k02M2k4r3J2j13J62o9J2n1k01K84M5j39K6J27j98
$$ y = [-11, -200, 32, -133, -143, 276, -72, -155, 202, 101, -18, 45, 22, -93, 9, 200, -418, 118, 179, -273, -11, 19, 46, 11, 111, -108, 22, 168, -75, 14, -39, -46, -72, -9, -24, 6, 316, 55, -80, -66, 40, 43, 208, 27, -46, 135, -54, -122, -164, 423, -54, -11, 74, -68, 59, 302, -6, -126, 105, -140, -89, 140, -141, 53, 202, -207, -15, 179, 53, -171, 220, 39, 14, -31, -53, -170, -86, -51, -148, 143, -71, -293, 49, 113, -111, 62, 60, -202, -160, 237, -34, -91, -134, -309, -180, -48, -4, -259, 95, -26, 23, 260, 186, -179, 143, -10, -107, 280, -15, -154, 163, 102, -165, 159, -40, -4, 7, -104, -123, 67, 45, -166, 244, 71, 133, 48, 41, -51, -119, 133, -88, -98, 414, 48, 60, 132, 135, -117, -206, 284, 12, 124, 105, -123, 219, 66, -218, 243, 137, -102, 29, 101, -185, -137, 72, -141, -64, 252, -344, 13, 190, -198, 11, -123, -240, -215, 108, -118, -120, 187, -15, 27, 3, -90, -78, -191, -29, -98, -86, -137, -338, -54, -9, -148, -122, 5, -193]
2416a93J56R8j8j08R6k82p6M50r6j02J24p0j48J72j47j95K93J55k75J67j09n0
2438a58J97j66M8o2K13o3J79j48j19J66KR6j72J80p1j8K16k80K95l21p5P8mO4
2462G7L0J23j52k64M52k7k78K19j32j65qK79k77J24P8k21O8J36k07J50mq8O3J11
2486H7k7k83L69k39J77j23KM4j24R8j72Q8K35l16K11l9k8O9q9Oj48O5j94M81j22
2511B8j21K08j14k53K68P3j63R%J27j42jJ49l59K34RL0k6J45j82N4Q8j26K12Q6
2536B33l01J37q3J66j96K0J23o1J14k48N8L47p50O10K0m40K43l9L0o9J84j44J99
2559A53P2k68J84N2j57L8k01K07k39K88j32p5n1K07j00M1n3M3J37J32k65j97L75
2582A91k43k3P9l19J68K15K0l8jj92J99J37l45J38l2L8k89J99K57n8j91m6N7K
$$ y = [-193, -37, 61, 43, -65, 31, -251, -327, 123, 27, -75, 49, -21, -169, 3, -144, -339, -46, 109, -166, 1, -108, -158, 39, -127, -79, -141, 72, 9, 188, 40, -79, 87, 89, 185, 13, 193, 122, 104, 320, 40, 335, 14, -61, 17, 13, 77, 107, 230, 78, -186, 266, 239, -39, 180, 48, -117, -125, 154, -123, 1, 79, -142, -74, 62, -145, 5, 1, -87, -24, 87, 60, -223, 146, -93, 84, -39, -37, 7, -117, -19, -191, -103, 132, -184, 27, -12, -40, 29, -60, -54, -202, -137, -331, 150, 28, -93, 115, 1, -252, 16, 89, -74, -65, -65, 62, -80, -81, 68, -291, -57, -48, -18, -44, 101, -81, -27, 61, -65, 147, 233, -68, 69, -14, 152, -44, -24, 99, 38, 152, -96, -38, 309, -441, 169, 189, -251, -8, -47, -17, -86, 98, -46, 153, 225, -43, 141, 193, 36, 74, -127, 80, -159, 129, -3, -78, -129, 78, -22, 19, -34, 9, 146, 278, 13, -184, 191, -52, -75, 4, -315, -147, 68, 88, 50, 49, -143, 56, 193, -152, -14, -46, -8, -297, -98, 159, 101, -90, -136, -79, -77]
2606g7O6j84K65Qj07j46K80j76j0J00J85j10l0P4p8m4o6Q8M5m3j91J67N1k92M69
2631B44r5n45K98J68j94J06R2k13J1K55j25K5K58j62j16J63l51J04K90k04PK75
2653B91j41j80j39q7K67J41k12n1P9J87q1L9m0o2p9j06J1K81J76l64j01P4k26
2676c23K68Q4k10Q6K55j41k15J78p4j58K20J5J4J13l03J7J30n2j02L51j49j82
2698a78K66j81m4J32J26j07J45k20m4K29l27K0K09J46k40l6M3J16k98M38l23q0
2720b08K43J69j80J84L1k64j03J65n0K77p5k98P9K26k30L64j16k73J19Rj70K58
2742A57j70J20r0L0kk7K29k94K8R0n3KQ4p8p1K4n%J75j72k1P4k26K28O7j12L7
2769B4J36k81L2m1P8J3j09P6R4J8q9J3pm0Q6q2N7j22P8J20P5k31L5Q3k26J55J37
$$ y = [-77, -11, -195, 70, 78, -29, -175, 105, -71, -81, 19, 204, 94, 64, 138, 60, 16, -50, 38, 83, 40, -151, 16, 67, -225, 244, 149, -396, -98, 70, -124, -18, 74, -139, -128, 127, 2, 27, 285, 123, 7, 170, -181, -77, 213, 9, 16, 291, 150, -30, -169, -256, 11, 152, -60, -111, -32, 155, 74, 113, 73, 11, -68, -174, -163, 118, 294, -70, -171, -97, -323, -55, 29, -181, -95, 160, 19, -196, -18, -92, -250, -30, -15, -1, 112, -191, -174, -44, -96, -198, 153, 4, -178, 88, -93, -137, -5, 121, 14, 159, -61, -105, 124, -203, -183, 26, 172, -68, -104, -61, 55, -243, 195, -128, -208, 35, 204, 24, 208, 239, -25, -128, 37, -13, 264, 189, -109, -30, 196, -34, 330, 214, -59, 60, 69, -101, 157, -13, 107, 17, 47, 45, 18, 247, -47, -19, 71, 18, 20, 104, 26, -45, -21, -26, -26, 149, -23, -44, 30, -196, 32, 99, -13, 24, 160, -121, -89, -130, -52, -39, -148, -72, 22, 40, -49, -36, -43, -83, 3, -79, -22, -144, -66, 54, 129, -102, -67, 16, -210, -55, 82]
2796H2k03R8O6j72Q9M5j02j2M57m92J80M1j57P2K17k07j53K23k98L30l46J74J92
2819A24j73J52j11J06q6O0qk51M9K80J04k69N2L4k36K22L9rK64j9m61J70N1j05
2843b1j65K99l57J27K84j02j83K22r7MJ37J27m14M93k4n09M5j00R9M7K33l55M4
2866a66L01Jk51J74j79rJ2m2l0J32J15K1l6K0k35K10l2k72L78j15k28K63n5j47
2890a70J41K41k30R2J24j38o4J96j40l4J29k70l1K42k21Q6J69k42L4J43O8k51
2912a26j4qJ19o4m0j0K85K5l26O3j06J68Q1q8k8J68P0m0ok0M1p8J13j2k82%r2
2939b07J52K14j74j25K54L6k67J14M0n6R2j43o2K22j66J19l8P3j31K82J6k68n1
2962g4N9l40K95k26J26J63O4m52L72l8k7q2J17K2K2j20l1K40r3j40L37k23L4m8
$$ y = [82, -121, -23, 43, -129, -40, 5, -97, -109, 348, -144, 36, 77, -80, -8, 209, 2, -151, 72, -226, 104, -242, -68, 124, -49, 103, -8, 98, 12, 72, 64, -187, -138, 142, 246, -23, 29, 63, -173, 49, 88, 79, 343, 324, -137, 33, 84, -21, -186, 113, -244, -117, 167, 65, -118, 104, 7, 11, 148, 275, -139, 354, 330, -179, -134, -234, -135, -88, 145, -210, -166, 135, 136, -115, 59, -120, -129, -117, -159, -189, -57, 58, 79, 43, 63, -172, 38, 6, -266, 112, -3, -231, 32, -23, -170, -29, 212, -18, 74, 198, 60, -4, 192, 52, 18, 147, -123, -154, 88, -133, -47, 122, -120, -86, 57, 125, -126, -140, -148, -29, -93, -133, -143, 142, 167, -159, -96, -202, -34, 47, -41, -69, 99, 169, 129, 123, 103, 144, 66, 179, 167, -115, -115, -207, -55, 159, -15, -140, 114, 150, -117, -3, 37, -19, 73, -70, -132, 90, -76, 43, 5, 78, -53, 229, 245, -23, -74, -15, -355, -60, -286, -160, 3, 67, -385, -13, -51, -78, -160, -43, -21, 1, -119, -150, 90, -3, -143, 194, -29, 5, -43]
2986d3j95K27j44J35J43k02L06j23k29K7J85Pm1j7j70J30PJ55k97L70m23J83P4
3009F5j20K16j13n5j60L71j19L8p3Qm3L5P0kk92K07M7j20N5j53oL38k54J45J35
3034B20j15k0k7l6J07j6k06L12m2j49R5j33J97j34k94L66k29J69kM0k34J97R5
3057A61l63Q6K03k22L70k14J24k01N3O0p4J43j72J69k05N4r3l7K60j06N1j48J40
3080C9j15oPP3J9k29M48m51K85j67M4l2J31j1MK23j11k22P1j96J75M0K56j78k95
3105a98L56k23J93k81J48J47j3k20J71j86J66r8o2j04J20r9J62p2N2R6%J00q3
3128G2j79L55k88J06j6J28j12R3k86j50J62n2K11m3j08K16q5k11PJ55M3o4J59
3151A13J29k68QO0k60K01p6r8J41mo0JoL8q3J29K62k81M7q4J44j04jK9P1J3r1
$$ y = [-43, -238, -11, -155, -20, 123, -79, 227, 104, -125, -98, 87, 94, 53, 36, -134, -4, 3, 158, -139, 231, -192, -9, 65, -55, 161, 48, -7, -167, 204, 85, 123, 50, 58, 15, 50, 120, 118, -174, 33, 80, -40, 15, -138, -144, 194, -60, 85, 220, 105, 85, 58, 22, 129, 113, -93, 219, 177, 28, 123, -10, 187, 53, -241, 125, -104, 65, 63, 103, -131, 66, 161, -202, -116, 87, -135, 235, 21, 145, -56, -3, 57, -17, 126, -46, 123, -82, -28, -121, -158, 102, -4, 47, -101, 39, -76, -82, -75, -2, 17, -212, 236, -215, 70, -97, -53, -85, 46, 35, 39, 262, 151, -71, 0, -196, -21, 19, 275, 97, -198, 158, -65, 128, -153, -5, 142, 129, -91, 80, -106, 60, -38, -100, -204, -84, -183, -21, -93, -41, 55, 55, 155, 72, -107, 248, -40, 66, 50, 178, 66, 159, -127, -277, -115, -167, 44, 1, -107, 109, 24, -187, -180, -25, 18, -46, 113, 242, -26, -18, 42, -218, -17, -93, -191, -50, -54, -114, -113, -119, -81, -164, -35, 227, -54, -7, -91, 53, -51, -52, -23, 48, 61, -30]
3178c0m5O3n9K6j17J7J12p1L0j5J58l01J06J02K36j16J1pj3rq9P5j42R9O7QQ1
3205A77l04K30j72J86R3r0j74q2N6L19k82j63K90j41J15j94J24J09kj84N8J56
3227A25j50N5M8L9j17n6J12j16j2N1O8j34k6N6p1P7J4J80n3o6R9m91L8L77J04
3252A51k42o9J48j7J42j50q8P2m7PJ11o8OJK56k54M8nj35J91j50K2J85j08j58
3277a51k6J50j22J59j72L76j76r1J36k00K75k50N5J88q7k21L55j68j1J47l02j2
3299a48K60r7L7p8J36k63K19NM9K9r5k85L13P6l37J01J72j58L5K28k06p8N2M9
3323A6J9m1r0P9O4j6k1l1q1P1q7m7k6P2K25J94j11J09k81J63j18j06j67M8O4j8
3349a17K77j83m7K35j99k31L95l34K15L1j15p6J49k49K47Q1k26k5K47O1k46R5
$$ y = [-30, -75, -12, -71, -45, -162, -145, -33, -104, -74, -89, 69, -232, -126, -24, 212, 96, 107, 100, 87, 78, -11, 64, -78, 21, 88, 96, 177, -127, 103, -69, 117, 210, 120, -54, -136, -80, 239, -43, -206, 84, -57, 58, -136, -12, 97, 95, -89, -31, 125, -25, 30, 78, 117, 0, -56, 56, -60, -72, -21, 47, -87, -113, -57, -128, -51, -37, 143, 90, 24, 123, -368, -330, 47, 151, -91, -160, -12, -29, 113, -37, -125, -53, -100, -93, 18, -50, -44, -43, 213, -41, 7, 2, -133, 58, -92, -70, 115, 7, -151, -177, -27, -149, 10, -162, 214, 38, -53, 83, -117, 158, -92, -37, 151, 64, -157, 198, 30, 19, 166, -136, -148, 112, 15, 52, -26, 110, -153, 66, 71, 120, 149, 54, -231, 82, 158, -179, -78, 94, -64, -29, 199, -7, -85, -33, 16, 35, -6, -96, -17, 47, 31, 10, -21, -102, -31, -118, -165, -191, -119, 106, 300, 189, 298, 17, 180, 62, -44, -211, -163, -99, -117, 160, -23, -70, 165, -34, -265, 130, -204, 11, 42, -73, -149, 0, -249, -2, 79, -147, -172, 75, 136, -110, -15]
3371a5P7p8N1q7K1J57r7Q2r5R0j02Q7O4k33j7J6K7Q9N8Jn9j29J96j07J54j21L
3398C3J11j47k3M5PJ4p4J73j06O3j66j48L73J76k42k22K15P4j34K14m10m2K26
3421A0K4o9l1q0J31j7j67Q9K47Q9k97K5K8l3j4l3j11K13l7Q9o1P2l2nj5Q0j23
3448b8O8RN5Rl2l75L65n2k9m8J36p1m8q4n3K37j75K11j64J62p4j01J05m8J11j79
3474i3j8n1J64L4J47o0k12N9J74j69j38K07p4r0R9k06K37k2J08k19K20N1k82L31
3498A97j90j00J1nqjK36l03J94L1l9M7l3j4j20m6Q3N5O6r8%O6O6l55K17J77k69
3525a35K71m8k46K54J8j17j38J46q6n8N6Q0R3r6J17k76M8oJ2K35j87P5k6kP9K09
3551B72m96R4J86M8j82O5O0k93J97Pq5k3R0j55R3K03j97MK58j98L1O6l3j9J01
$$ y = [-15, 62, -16, 35, -52, -31, 126, 29, 111, 16, 106, 4, 91, 155, -78, -95, -79, -52, 37, 95, 96, 37, -92, 104, -3, 151, 30, 33, 144, -3, -26, 19, 26, 40, -34, 139, 33, 96, -70, -218, 155, 331, 89, -133, 82, 156, 22, 236, -174, -216, 10, 34, -35, -66, -146, -15, -32, -199, -110, 137, 226, -71, -46, -18, -51, -65, -98, -209, 4, -33, 56, -5, 67, 35, 30, 15, 95, -28, 40, 49, 104, 113, 81, -294, 71, 19, -10, -58, 78, 7, -41, -125, -178, 59, -116, 95, -69, 93, 19, -82, 23, -25, 86, -93, -111, -162, 2, 36, 183, 123, -89, -30, 144, -25, -163, 44, -30, -120, -21, -227, 10, -12, 96, -123, 97, 148, -134, 197, 7, -93, -82, -87, -95, -96, 140, -163, 31, 62, 23, 70, 37, 23, -97, -143, -60, -5, 61, -37, -37, 29, 95, -260, -43, 134, -135, 136, 88, -158, 96, 114, -3, -141, 5, -81, -139, -83, -3, 90, -6, 111, -165, -117, -123, -111, 124, -63, 12, -14, -16, 63, 272, -224, -130, 56, 104, -78, -13, 47, -246, -49, -42, -127, -150, -60, -215, -122, 81, -116, -112, 146, -52, -21, 45, 12, -7, 94]
3576I4j72K22M0j75J38Nj66j25l0J98j50L30l18Q5r5J55m0K1J8J42k25Q4N0n1
3600C5J76m32L48j87Q1k8J16j83q3J3J79j23J3j57K06K19l4k55J00n6M0j6r6M4
3624h0J10J30k66J92j15J9J14R7k37k4k9k4J96O7l76J45o1O2J62J47j42j56J04
3647C5k21m3K02N8%j3j61J75j3M0m0L5O4k23n7OK67k05L8L1k48L59O4j61L2q7
3673f6J5O4j04N9J66j2k35L35j77j5J03j29N5o0O6N1j7k06k9J35p1m7k10N39q
3698B02j12k2k6j13K42k37j4J75k10nK58j98J36J59l09q3K25pj24K54k6j79j56
3721a70K35r0P8j08j00K51k00j40K05k26J55J48K4l2%M0o5j46O1J07n4L49m02
3744h0j76M56j56j42K67Oj17j07j85J80j1O1k49J71L57k23j62K00k44j30L75n1
$$ y = [94, -78, 144, 184, 9, 147, 152, -14, -139, -169, 29, -121, 209, -109, -24, -119, 36, -4, 17, 35, 177, -48, 36, 86, 35, 211, -221, 127, -60, 21, -7, 109, -74, -157, -144, 35, -88, -75, -232, -26, 193, 159, -96, 4, -52, -12, -28, -124, -80, 30, 160, -106, 86, -29, -10, 104, 201, -36, -60, -89, -113, 83, 150, -226, -81, -142, -80, 82, 229, 87, -69, 35, -186, -229, -27, 31, 31, 18, -143, 32, 19, 59, 19, 54, 118, -105, -162, -156, 111, -94, -56, -25, -273, 86, 150, -11, 21, -66, -51, 13, -91, -32, 134, 122, -113, 222, 45, 30, 133, 4, 59, -1, 65, 116, 99, -107, -136, -1, -72, -119, -329, 210, 202, 90, 68, 42, -71, 171, -66, -80, 95, -115, -120, 138, -60, 76, 235, -74, -157, 68, 61, -63, 191, 165, -14, -170, 65, -25, 53, -55, -155, 96, -104, -244, -39, -265, -110, 38, 62, 30, 30, 70, 5, -141, -80, 27, -27, 322, -80, -256, 200, 44, -98, 169, 175, 58, -49, -234, -54, -65, -4, -253, -82, 275, 52, -110, 90, -154, -284, 91, 40]
3766D0j91K21j6o8K07k5k29J30j67k0K08k25j92L15J98j50J11k45J79j56P2j63
3788a66M30o3j94o2K35j49j9j86L2J73k9Mj76K37k63J99J45k36O2J70j7j81J35
3811H1j09m0J99k12kj11K90l24J68L51k81j25K2j39J44K30k86J24p9jL3J50j47
3834f4O3j07K0J23K0j15P7J3J03j84L9O2j58j0R3j12P9p4K4J93J94l84RJ49r6
3859d3q5M46j84k87K46l2j77O4J02n2K57l17MK79k76J19j3k32J01J36Kj7k9J31
3883A43k05j71K93K03j21k31J08j8J54l16M01l94O4l5J48j36K13o4j91J18K9J51
3905A43j38P2j85O5k8M2j11K59K3l18P3J20o1rK52l79Q1J34P0p2j23J25J50l2
3929A53j80K19k56j74J91J7j91K92J0j53J08J38l16K26k57J00Q4J39k95q3M55
$$ y = [40, -151, 70, 54, -14, 193, 168, -61, 69, -98, -118, 90, -135, -327, -12, 186, 36, 147, -98, 81, -75, -3, -166, 264, 201, 7, -55, 180, 31, 12, -174, -142, 31, 2, 6, -170, 67, -196, 3, 148, -88, -26, 144, 127, -54, 81, -28, -68, 131, -81, -83, -194, 96, -228, -60, 291, 10, -115, -93, -232, -88, 142, -144, -20, -99, -100, -67, 83, -64, -1, -108, -88, 35, 55, -60, 17, 30, 133, -51, -12, 50, -108, -118, -25, -137, -58, -132, -108, 85, 279, -105, -96, 53, -43, -128, 318, 134, -153, 93, 61, -116, -52, 50, -2, 255, -62, -58, 221, -55, 64, 51, -181, -80, 56, 58, 41, 12, 143, -62, -233, 60, 263, 142, -89, 19, 1, 155, -161, 240, -154, -90, -125, 23, -113, 100, 36, -155, -37, -8, 143, 5, 77, -108, -43, -71, -29, -140, 119, 142, -176, -103, 17, -44, -53, 199, -180, -99, 35, 105, 33, -90, 35, 185, 153, -27, 192, -64, -238, -47, -30, -221, 71, 81, -72, 36, 174, -142, 84, -173, -73, 11, 150, -145, -228, 227]
3950B27k19j1J2J11l58J7L50j90j11J54K0OL0k11J21J59j87K50j83K7K6R9j62
3973b3k17L70q6j01K33j42q3J90qk63L52k59o5K57j06k56M03l39R7O5N5MM6J69
3997B93m52J84j14K95k75J70p9j50J37q2j12J95M0n5M8M9l00K96r4k4RN3j38K97
4021A91O7l71mP6Lq2P9q4J23R5r9L1L9k37M3K37J11k00M3j06k5Q7J90k7O4l87
4047a43J28JJ35j59P1N8j80K16j26J5p5J25l60J66K66l4k18J19L1j39Q2K03j85
4070cm5L27k05K17l55k1K83j97k64L81N5j16L8N2j57j39J67j16Q6K54l38j16L61
4093A49k58o3M77l90J32N9j36j34L49k45KJ62r3q2J40j90J1pQ4j38L9L9l8J65
4117C4k8Pj82J65q8J19J6j75O3K65k05o3J10k0j27O7J19K6j45Q5r5J94k42j43
$$ y = [227, 8, -3, 9, 120, -238, -221, 129, -61, -172, -18, 2, 8, 38, -173, -52, 107, -80, 170, -13, 14, 40, 139, -23, -240, 130, 44, -57, 176, 34, -49, 141, 133, -130, 222, -37, -102, 155, 49, -207, 196, -143, -46, 19, 74, 78, 124, 293, -159, 25, -89, 206, -69, 101, 22, -128, 9, -73, -185, 10, 50, -5, 43, 92, -208, 88, -6, -30, -21, 32, -106, 191, 258, -113, -117, -41, -38, -120, -41, -125, -2, 93, -6, 25, 64, -173, -130, 107, 218, 18, 61, -45, -70, 17, 207, 180, 244, -143, -15, -14, 121, -38, 33, 91, -89, 127, 1, 16, -59, 66, -294, -128, 138, 104, -114, 5, 36, -103, -21, 182, -3, -48, 279, 74, 291, -64, -85, 198, 1, -263, 118, 173, 57, 95, 147, -10, -149, 18, -98, -12, 242, -96, -212, 149, -109, -172, 305, -85, 47, 106, -30, -164, 185, -60, -58, 104, 11, -71, 69, -121, -110, -117, -33, -171, -132, -93, -131, 34, 6, 13, -169, -4, -92, 27, 43, -132, -69, 196, -9, -72, 38, 18, -109, -42, 77, 103, -42, 43, -52, 142, -100, -243]
4141b43L8K60k3L4j26R6Pk06J43r6K89l85J21L37l69J3J51p0j00L68j86J6j91
4164a22J00K3K40k45k41K68j79J69k54J44J24L15l27j7J4L5k11K67K18m63J38
4185dqj32L9M91m58j20K74O7j75R6m2j41K82M9k45l7n3R0K89l83K18j15j05j68
4209b91L10r7J08k12M79m12mJ77k7L4j73J21l16L10qJ62p9P3P5k48L9j96M8J63
4233C6p0J49j54P8K9j96n9K46j42R7o4L02k41K22n4m35L07N3p2J71k34J41j74
4256f4J21j08O2j62J97P8k4j68q6L22k68J0j5L5k5k8P8O1j36K18j40J56J83m27
4280a30L4K83j94j72K33j35o9J91K2k58L25o8l10j1mJ73M1j34L0L74j6k73Q1J0
4304B3n2J38j88q4K53k00O9K40l98J19r8J71K9K98l03k66K51ok3K79p4l45K17
$$ y = [-243, -205, 55, 32, 66, -60, 36, 43, -163, -20, -116, 173, -212, -91, 246, -123, -110, 41, -29, -129, 239, 53, 69, -122, -22, 1, 241, -4, -245, 23, -156, 13, -241, -97, 27, 342, 15, -2, 12, 47, -164, 103, 321, -142, -4, -12, -144, -105, 386, -72, -192, 82, 149, -26, 70, 28, -113, 169, 218, -27, -64, -117, -27, 262, -121, 97, -18, -123, -291, 19, -78, 30, -182, 297, -115, -119, 58, 31, 65, -108, 13, -303, 7, -1, 161, 82, 155, 230, -18, 21, -175, -127, 36, -34, 115, -39, 39, 68, -128, -187, 59, -83, 14, -50, 252, 11, 233, 179, -256, 51, 104, 32, 203, -31, 110, -64, 57, -51, 11, -151, 46, 124, 100, -68, -154, 168, -100, -90, -105, -70, -95, -123, -45, 16, -120, 98, -42, 114, 297, -130, -96, 187, -7, -179, 54, -81, -150, 41, 63, -195, 130, 62, -248, -259, -263, -90, -49, -183, -153, 221, 205, -68, 13, 23, -29, 109, -79, -163, 90, -110, -41, 199, -199, -80, -178, -7, 22, 320, 17, -249, 2, -4, -27, 252, 178, -167, 50]
4327E0j80k1K46P9m9k25M9Q7J39r8l7j30K49j34QP3k13L9J98q1O0j57N8J40l09
4352a59L60j32q0J53j55M4j52O3J15J16j92J27r4N4j19J7K27q1r3j10j16K42m9
4375a4k12Q8P6j68K66j73o1M8J1M9J09Lj4l22L38k19K49k98J26K02k5J39j45j7
4399C6K5l07K35R8j44K8k8n7Q1l8L7pJ4j18K64k18R3j27K85q1q1n4J34qk4J69
4425B07m14K96j72q7K14m4j16J50L5j60K88p1k37L12l05M8K74p1j63q6J75o1J4
4448B6q3j70K04R4N3l52K28j96J75K34j75j12ML1K21l21J15P9k14J84l2K7L5j83
4472a28J18O7j55l8M61p20L30L95m62PJ60O5Q4q1k21O8j0r0K39j9j15m1J42k6
4496C0o8J25o9PK25l87J20Q1n9k35K78m0p1N3J87k01k7o8K5N2J03J20j07j17k2
$$ y = [50, -130, -151, 95, 174, 125, -100, -51, 36, 175, 77, 40, -90, 159, 25, 33, 106, -107, -68, 130, 49, 109, -48, 10, 150, -159, 201, 69, -11, 142, -13, 31, -121, -58, 57, 173, -19, 108, 14, 68, -51, -34, 193, 112, 19, -91, -207, 35, -14, -226, -138, -62, -230, 36, -137, -198, -150, -139, -90, 19, 22, 8, -314, 24, -195, 54, -244, -118, 84, 59, 198, 53, 36, 61, -246, -11, 87, -57, -29, -57, -114, -33, -71, -34, -41, -27, -145, 119, -99, -6, -133, 152, 71, -10, -64, 70, 62, 38, 207, -207, 89, -83, -170, 44, 0, -116, 34, 69, -91, 197, 126, -111, 201, -104, -56, 218, 147, -16, -102, 73, 12, 26, -57, -227, -23, 71, 124, -228, 0, -196, -21, 213, 38, -74, -70, -39, 182, -139, -24, 55, -159, 25, -7, 20, 55, -128, -10, 57, -98, -136, 325, -395, -65, 330, -132, -125, 35, 100, 184, 103, -118, -50, -60, -150, 89, 70, -45, -86, 56, 30, -38, 87, 18, 25, 250, -137, -17, 64, 5, -230, 48, 8, -63, -10, 177, -24, -51, -119, -94, -42, 61, 181, 74, -43, -65]
4521f5k2K72j00j32J64n0o6N6M9j61J25j22R7M5r9o7K76m11J75o1J09j3J29m3
4545H5k11K08Q8q4j70J80M1j97j0R1QK01k10K2J75j70K5n9J08j59J97m2J04j39
4569H2R3j34k2M6j38m9J00j20L0J87j86J8K09k19J00N9Q6m00M55ll77P4J70R7
4593A58n4q7j80J91j3J3j80L14q2j34J60j9j55K26k09L1L1M4k7J30k77J45nr4
4617g3k1L0J1q5K07q4p2J61K2K0Or2n3K57l72Q1J89Lk98J92M0j09j30L42k09k36
4643b73L62j28K7l3K6q6K11m7R5m8m1k38J82L4j95J91R6p1j72J15q1P9nJ42m8
4668I4k19J19N9Rp4j67J80M7k00O4L6r9K23p0K6j16J56p4Q1k05J06j09O9P8Ok9
4694ip2J52J30k82J15J83k48N7K49n18K57k79L13k65L00n5j0J04r6L3k05P3Q1
$$ y = [-65, -87, 185, 85, -47, 117, 67, 1, 57, 106, -55, 70, -52, 45, 90, -9, -76, 200, -211, -36, -97, 12, -1, 128, 85, -126, 82, 170, 86, -84, 96, 137, -60, -70, 21, 29, 230, 20, 42, 217, 47, 72, 13, 121, -38, 159, 117, 221, 82, 175, 41, 19, 65, -73, -122, -22, -142, -112, 75, -111, -93, 116, -103, -3, 56, 142, -258, 197, 194, -183, -109, 61, 158, 104, 17, -163, 28, 15, 28, -152, 162, 80, -54, 106, 87, -68, 158, -51, -20, 11, 55, 28, 158, -119, 26, 21, -73, -94, -64, -53, -138, 69, -15, -87, 74, 96, 116, 122, 30, -23, 234, -138, -57, 132, 135, -163, 29, 69, -40, -170, 172, -37, -273, 89, -39, -12, -45, -19, -105, 106, 59, 154, 106, 65, -173, 9, 43, -152, 39, 135, 64, -108, 7, -74, 5, 0, 142, 94, -125, -6, 53, 62, -12, -179, 1, 48, -152, -88, -52, -151, 72, 2, 28, -88, 68, -6, 75, -130, -24, -133, -64, 14, 20, -9, -81, 71, 201, -81, 34, 217, -31, 26, 275, -243, 14, -265, 48, -217, 83, 28, 18, 122, 26, 59, -146, -73, 8]
4717HJ46k36J03k8k79K59M3K57k30J64l66K30K9J40k31N7J03j42k60K44pn6J66
4740A14j91J10J27m5j00k21K87K2L8l05k2K10l9m6J57o6l19M83l37j0J39q8p5
4763a77J90no6J5p3K13k9k09K1K21n5M8lRJ9k83R4R8J72j43N5l70K09j24K49j91
4789a15J18R4J60n1l33J23Q8k55J49OJ37m6J90l26K89k51l39L34r2m4J26K15k59
4812h2M09n21K39K1J28k42K27n1j37j79L93k38Jj38J0QL03j69j28L48pk48m4J63
4836F6L9j37P0j48l0J46O7j19M8l5r1K8j6l2J85k25J37P7j28K05Ol42K90r4J26
4861I3k42N1Q1Q6K4o5j76L17l36k6K84k06n0K7K41j82J02J05k7r1J27k38R6l8
4885d3NJ75rr9J07j12Q6j96M6n4J18N7K5j73L03j80m0M4J67k18K1j14J50L5J09
$$ y = [8, 154, -82, 21, -7, -286, -27, 16, 273, 43, 207, -159, 71, 100, 240, 9, 66, 169, 27, -233, 11, 4, -52, 114, -77, 33, 160, 115, 15, -206, 81, 103, 141, -164, -186, 24, -15, -61, 96, 30, -289, 194, -143, -153, -14, -102, -177, 13, 8, -58, -43, -116, 97, 68, -141, -120, 101, 46, 94, 91, 100, 119, -164, -70, 28, 200, 57, 112, -258, -49, -173, 76, -115, 3, 97, 257, 206, -127, -4, 84, -171, -22, -16, 121, 75, 265, -61, 228, -23, -362, -28, -120, -164, -38, 177, -82, 327, -194, 45, 66, 194, -48, 179, 128, -9, -188, 205, -33, -32, -170, -160, -152, 151, -18, -146, 202, 195, -53, -97, 66, 105, -32, 38, -110, -140, 6, 73, -46, 2, -33, -124, -96, -112, -144, 41, -184, -47, 30, -98, 107, 113, -229, 61, -33, 93, -149, -98, -17, 69, 93, 28, -148, 169, -167, -193, 91, -115, -165, -138, 103, -79, 23, 128, 101, 10, 137, -101, -5, -43, -38, 137, 128, 29, 136, 24, 110, -86, -40, -94, 24, 81, 106, -67, 236, 56, 16, 60, 227, 9, 30, -84, 66, 101, 210]
4910B10l21o0M76j55l25J93J47j30k9o9pJ64jj58K63K2l20K96k83j11j4J02N6
4933e4N0j35K87q2l14M58q3j32j7o0L9J41k54K38k37J63j54J37o8OM7j51K90j89
4957g4o4K28j76N7J09k48M1L0K8m9K87l2k39J55j16n3M1m6L0J13O1q6j5m1o3J43
4983B1K07k39M8m8R1j49K53l69J84Q4K5j16n5J41k04J48J31N9j52Qk27L6J75r9
5007d7j25J83j92M0P4J06R5m9j06o6Q3j92L08j5R2k34KK7Oj68K81j6N2k45L23
5032B17k63Q1n4n1j09k7K24J25q0l9M2r0j02J70q1R8j6K9j44k5J32r9k36L80j98
5057a16J94j51n4R3k7O7k57K40k88M01J7l25p8L74q4O6O9k05J4N0O6N5jj35j96
5082b11K43K61k28N8M6o9k80L40k62J47jo5O8j85R2K36j93n3J17n3j39n7J86Q
$$ y = [210, -111, -171, 305, 150, -175, 18, 165, 35, 6, -63, -70, 94, 93, -65, 198, 220, -100, 196, -87, -198, -212, -110, -54, -4, -139, 148, 66, -248, 210, 127, -5, -22, -82, -43, 98, -156, 82, -155, 8, -146, -9, -77, -71, -24, -175, 115, -74, -138, 90, -86, -29, 80, -168, -127, -97, -69, -118, 169, 137, -102, 53, -63, -116, -75, -121, -91, 22, 83, -3, -18, -59, -122, 21, 228, -11, 37, -11, 80, -69, 184, -185, -1, 83, 108, -8, -63, 78, -126, 22, 153, 212, 60, 68, -159, -123, 52, -47, -172, 11, -181, -141, -67, 39, 134, 85, -21, -87, -4, -196, 112, 97, 189, -45, -43, -16, -10, -178, 103, 87, 139, -106, 217, -46, 35, -19, -70, -179, -206, 18, 143, 63, 24, 66, -24, -126, 44, -37, 61, 45, 74, -70, -95, 37, -62, -298, 82, -116, 78, -73, -127, -34, -61, 6, -251, -11, -299, 102, 119, -206, -284, 90, 6, 72, 141, -64, -50, 0, 66, 121, 120, -15, -211, 32, 293, 65, 123, 169, 100, -180, 160, -102, 45, 44, -21, 47, -138, -46, 190, -3, -56, 61, 8, -131, -188, -2, 6]
5106FJ58Qj67l4K57j62o9K1p7k21K02m7N0R4j09j03J14M6K34k53k07N5K32j47
5130a19K07q4K29k68K22l72L3J7K56m3k41J54j92J23q7K24m9J66j90j0J73P1k90
5153g0J0l9j31R7J37j7k6J00L1j18R0j63j64K44P6n3M5p6j24J83Pj88K40k0q0
5178iJ27o6R8j42n0N8j12Q9p7L5J0k6l7K89l89Q6J61Q9j52k7o4j4J74m1M8k30
5204a72K00J79j42lj24K63j82j85J96J07q6N3O8j33l3L4k15LQ3J28j56J51n6o3
5228h5K94j73l48K26J64j77K69j48j26K42j60P4J85k12p8J11j05O4K32l24R9K6
5250E0M8M6j93K2k80J48K87j01J51j99p6K6L2J56k82P2J32r1p0J76j08K66j83
5273B9j11R0K78k52l7J8l74M60J02l23J88l8j0n4R9k23J77j33K16J25j45j54K2
$$ y = [6, 164, 172, 5, -29, 228, 66, -3, 18, -59, -280, -78, -125, -75, 19, -90, -193, -79, -33, 201, -52, -259, -204, 28, -119, 88, 4, 233, -35, 187, -185, -152, -135, 121, 78, -163, -9, -201, -78, -165, 59, 10, 176, -14, -24, 149, 220, -70, -60, -99, -230, -133, 4, -13, -39, 61, 92, -26, 64, -99, -263, -19, 57, 4, 49, -27, -151, 32, 39, -149, 91, 71, -9, 118, 52, 150, 8, -42, 16, -96, -7, -84, -49, -39, -65, -102, 187, -202, -116, 45, 134, -18, -45, -109, -123, 51, 10, 58, -172, 28, 207, 65, 62, -62, 201, 19, -166, 30, 137, 51, 104, 172, 39, 6, 40, -175, -172, -89, 39, -117, 34, -22, -85, 209, 36, -312, -86, 78, -99, 170, 22, -104, 138, -22, 52, 237, 25, -53, 58, -47, 17, 249, -75, 24, 50, 98, 144, -49, -27, -307, -159, 128, 27, 178, -21, -97, -71, -39, 117, -165, -93, 39, -52, -122, 54, -54, 212, 29, -82, 8, 286, 34, -3, 15, -359, 101, 203, -120, 68, 30, 20, -34, 65, -158, 19, -114, 102, 227, 82, -72, -50]
5296e0K73q6j52J04OJ26j20k60J27J31k28J03m8M4o8k2K28k14M04m18M3K15j68
5319c0J57k34J13K19n4j2o3%j04Q1K5j04j00J15O4Kl76L85j46p8J95Q2l43M49
5343B43l53RL15j80l9j84K55j03k07K04r4R3n4K13j56l9j65P0J29p0R5r2J54j5
5367B9J19k17J8Q6j25j6J43r2J45l34L90rq9j90K74Jj18q4J6R0l8OP3j35j1J25
5393E7N2o6Q3p3k88K34L7r7o9J4J15l6P6m0j49J93j28K17j93lK1K05k22J18j81
5418a23Q2K48k14J15j08L9J0NM1k00Q7j10l2J85J80k27J56N2j30j90O0q2J06K3
5442b7m2L44j58N3k50J07P2k10J36j7j58pM07Q8j15k63J57j22q0nO5NN6nj37K33
5468A27k88J9K24q0j45L4l9K47n9m6Q4O4j59p2R8n3p1K03r3J7j9l3P9L1L3j40
$$ y = [-50, 223, 137, -15, 89, 95, 221, 101, -159, -32, 99, -129, -26, -74, -30, -98, -120, 108, -106, 298, -120, -77, 138, -30, 127, -107, 6, 225, 171, 159, 96, 96, -8, 73, 98, -6, -106, 9, 73, 75, -301, 84, -62, -140, 55, 137, -206, 243, -110, -101, 214, 34, -5, -189, 66, -37, -244, -40, -134, -41, -95, 118, -38, -77, -242, -172, -43, -113, -18, -110, 44, 29, 148, -69, -51, 35, -90, -106, 37, -55, 90, -244, 146, 137, 48, -142, 132, 133, 15, -69, -53, 37, -1, 5, 78, -57, -68, 57, 109, 43, 126, 53, -235, -1, 36, -61, -130, -116, -1, -37, 39, -1, -150, 43, -85, 132, -61, -64, -43, 162, -60, 58, -123, -41, 207, -7, 108, 0, 39, 49, 54, 95, -105, -18, -128, -160, 25, 205, -22, 134, 186, 56, -134, -74, -156, -50, -27, -69, 275, 117, 170, -80, 27, 99, -111, 25, 8, -150, -157, 250, 338, 223, -40, 117, -5, -85, -90, -25, -20, 36, 31, -106, 127, -161, -142, 82, 2, -143, -109, -148, 99, 40, -6, 78, 142, -17, -89, 9, -44, -115, 88, -5, 12, -7, -40, 39, 70, 103, -37]
5494c7pK74m32Q2J06j4J63K8q6j90K34l11J53K87k34k3j56J15rK69m35J85M6j99
5518a91J95K8O0p2J60l06J66j58K06K23k71o6r0K88p7r9J59j99K66k85J6j28R3
5541h2m7J42j09J91k19K8J28m4nJ03j00pr1N3J26o7M1KLj24l1K00O2k79O7J08
5567D9j35R1j25N6J2N8k0K44j01L8k8j33l6mN3l7Q0p0j21R0J32p4r2K21k29P4
5593gJ4Q5j12j23K08l5J34r8j68O4J07K6k17K50j47m0R6j44R3J42qj99Jk13K92
5618AM6j73K58j40J62j74J7j86M30j21J4k86R0J63k81K20j95J59p4N1O2j97J88
5641C4K2rl7j21K74j91R1j0MJ33l40K24j89Q5Kj32J26Pj2n5N9J84j60J80L5j86
5667A8J80j89j27Q8J07j92L1J22k01M9O6K17j68r9Q7j67K73k7j30j1M5M8J0P8
$$ y = [-37, -44, 230, -202, -120, -14, -28, 135, 163, 77, -113, 121, -190, -37, 250, 16, -7, -163, -48, -57, 212, -223, -38, 8, -191, 4, 32, 92, 20, 180, -126, 40, -118, 88, 311, 40, -26, -116, 172, 95, -4, 155, -44, 222, -63, -47, -175, -82, -129, 13, -96, 95, -124, -96, 32, -12, -17, 86, -14, -21, -112, -59, 67, 0, 41, 43, 46, -78, -109, 91, 153, -126, -59, 49, -86, 5, -120, -64, -52, 6, -14, 230, 129, 167, 139, 6, -30, -34, 19, -18, 62, -8, -129, -39, 93, 19, -73, 148, -81, -7, 7, 92, -20, -143, 65, 30, 164, 66, -102, -38, 69, 95, -122, 128, -19, -59, 37, -107, -14, 128, 120, -79, -78, -291, 1, 47, -126, 132, -8, 154, -20, -3, -189, 241, 120, 134, -152, -62, 101, -180, 40, -155, 4, -70, -19, 43, -154, 34, 56, 47, 10, -111, 163, -28, 63, 53, 57, 190, -150, 74, -115, -30, -28, -160, -34, -27, -39, -94, -35, 149, -11, 169, 204, 18, 198, 9, -118, -30, 77, -115, -84, 38, -163, -114, -48, 169, 1, -98, -11, -178, 95, 68, -62, -73, -28, 20, 30, 108]
5691A08j61J4M5p8M7P5j83K69j05j8R2J05k67k7J04m3nq9l1R0J90k2n8L4J35l22
5717a01M8m9K41j75j8J29j1J03j89P9j99J60o6P4n9K61j57j81Qo7J47J65j32j12
5741a01K76k17K4j11J71r5r3J26l6J79j23R0p6K36m13K92j1j77K93n1k60j3L1
5764e9j18J77q5J60j30J21j35J48j40Q5R8k03J66k05J83O7l9j12j07PL53j36J4
5787A10R6k79o1L09q9m5l30R4J02n6J7KJ37J93q1j38m2J1j8J44j39J52J4m8q1
5812b6j51J50R5l3m4m3J5R8N5r9J63j49r6L08p4k22JJ52j36J85j11P0N9k54J86
5837I9j63j8N3j14j5L8R2K08l02L25l43Q9J30m5j25P4KJ7P2K2j00J49k48L8n7
5862a22P9J60j36M9j04M2K08k1l2j08J19l4k1j76O7J8k6j68L23o6M2p5R4N1Qp7
$$ y = [108, -53, -39, 6, -72, -25, 50, -133, 136, 31, 13, 105, 210, -57, -84, 20, -23, -28, -117, -148, -58, 132, 110, 52, 86, 221, -101, -53, -102, 139, -36, -54, 75, 64, 167, -22, 57, -142, 18, -48, 26, -33, 228, 71, -110, -102, -169, -22, 143, 11, -101, 175, -42, -18, -129, 42, -53, -146, -20, -56, 123, 0, 90, 14, 250, -163, 129, 118, -59, 234, 183, -77, -90, -59, -177, 0, -85, 75, -55, 66, -69, 79, -61, 24, 122, -81, 85, -120, 63, 130, 91, -21, -128, -121, 232, 96, 110, 206, -73, -134, 175, 86, 41, -289, -195, -93, -149, -132, -130, 7, 200, 119, -19, -61, -50, -68, 76, -63, 89, 103, 55, -26, -177, -27, 68, 35, -9, -52, -37, 61, 116, 17, 180, 31, -65, 243, 169, -53, -52, 100, -36, 149, 38, 108, 167, -87, 99, -64, -82, -29, -143, -158, -120, -28, 180, -122, 203, -140, -51, 79, 34, -91, -17, -15, 2, 74, 96, -4, 145, -103, -65, -122, -43, 117, -19, 30, -74, -32, 176, 155, 123, 15, 134, 100, 79, -97, -30, -12, -38, -206, 117, 51, 93, 18, 112, 163, 171, 94]
5888I4Q7k32K97k55k29M57l66Q4j01J97n7J64n7m6J07n8j60Q9j35J26MJ6J05r8
5912C3n9n4O6O5L9M4j23M4J37k53l8LK2J62n9n4J27o8k4j67J25PR8j26M3j48R3
5939f5l6J35j29Q9J69r7J6K08l80O7R3j21J22j71J28o5M0j19J64m7J07j09K8l7
5963a0m2P5l5L59n58L21L3j72j17J45j82K69j20j6j71J84R7M5J68j26j41Pj7k19
5987b23N2L27p4J1k65J55J27m1k08K85k46k32K65J79k06R5m1Q5K0j61M8J36m8
6010D0M3m9m3K9j44J19j08J15j59L33j53J14j88O8mLn2P3j04j86L22j35J36O0
6034A30j31k12K86k01J54P4L7J44m52M1J76o0m2O5K62j56o3j98K9K25k5o6q4J38
6058G1k08J37P3j97M4L11l30j96L25Mk86L58jn7j10J38n5m8J67l4j32j59M37q3
$$ y = [94, 181, -51, 246, -9, -238, 219, -147, -63, -164, 33, -24, 140, 83, 37, 144, 86, -74, 15, -120, 6, 10, 26, 131, 33, -26, -80, -14, 51, 90, 134, 11, 55, 192, -61, -99, -96, -74, 88, 29, -25, 102, 34, 10, -157, -32, -25, 73, -53, -10, -158, -65, -101, 34, -95, -6, 163, 66, 82, 290, -90, -23, 70, -51, 71, -100, 28, -37, 3, -116, 48, 1, 108, -1, 27, -10, -52, 23, -12, 347, -211, 110, 143, -29, -146, -1, -183, 86, -34, -50, -221, -37, 60, 105, 273, 147, 6, 13, -4, -223, -171, 156, 82, 93, -172, -17, 110, 69, -139, 146, -100, -332, -67, 112, -94, 1, -40, 45, 65, -96, -48, 88, 40, 83, 34, -9, 20, -124, -5, -113, 2, -157, 176, 23, 137, -51, 17, 13, 16, -36, 37, -67, -253, 69, -66, 70, 130, -1, -213, 73, -128, 26, 100, 137, 281, -171, -130, 46, -14, -56, 9, 271, 115, 52, -146, -117, 108, 83, 17, -67, 71, -137, 0, 73, -124, -80, 231, -99, -295, 30, 34, -252, 106, 105, 48, -62, 76, 21, -27, 140, 106, -26, -185, 252, 169]
6082A69K6j2k09J1r1k6P6M0o4K59k68R5J00p5Pj20J01j0jJ63k29J91l56M10j22
6107F5K2J05j07p0K7k2mj10J26J66o4k2j08m3j09N8J06L7r1L07j34l6jn7L3j8
6133E6N8p2N2l17m2K50j03j12K23j20O3K12j17j88O9J68O6q0j24j67J68N8j04
6156a03K21k47J74p9J85j17K41m21K22j82J29k61J28J02n7J59Q8j80M9j9kp2l
6179d5K67m36L2J25j4J50j18r7Q6J42j59K60j14p7J07q0P4r4k16L90k21Q5J25
6202A72k43L23n51L08J17o7r2J05j48L5p4K84j24p1j81J64L3J78k71K98k37L5
6224gj27N0L5J66q1j48J3pQ2L6K14k09K9M9j00j62K47j58L36N6m08K65N4l14R3
$$ y = [169, 195, 183, -26, -15, -106, -132, -56, -16, -80, 179, -89, 6, 106, 31, 38, -82, 19, 9, 8, 171, -58, 133, -223, 187, 65, 87, 192, 85, 15, 42, 20, 16, -94, 32, 198, 134, 112, 4, -39, -148, -90, 16, 53, -38, 269, 135, 99, 98, 41, 74, 56, 114, 42, 94, -223, -265, -15, -118, -230, -7, -127, -64, 148, 31, -157, -88, 80, 146, 66, -58, -225, -57, 1, -103, 118, -129, 45, -34, 151, 34, 275, -146, 76, -106, 23, -238, -110, -8, -65, 94, 182, 2, 51, 32, 30, -42, -45, 222, -214, -182, -57, -71, 79, -39, -136, -50, 92, -67, 193, 79, 2, 109, 29, 103, 9, -207, 183, -38, 47, 172, -71, 252, -299, 9, 126, 59, -33, 72, -76, -41, -115, 169, 45, -26, -207, -43, -10, 168, -103, 195, -42, -7, -134, -84, -49, 117, 36, -112, -99, -106, -24, 12, 226, 17, 46, 95, -5, -167, 80, -78, 258, 314, -94, 171, 225, -89, 4]
$$ [...]
8191I0
##END NTUPLES=NMR FID
##END=
