##TITLE=1H_Pr 93-Am
 200.13MHz, CDCl3,
 8 sc
 
 25.4.2025
##JCAMPDX= 6.0         $$ Bruker NMR JCAMP-DX V2.0
##DATA TYPE= NMR FID
##DATA CLASS= NTUPLES
##ORIGIN= UXNMR, Bruker Analytische Messtechnik GmbH
##OWNER= pz
$$ XWIN-NMR		Version 3.5
$$ Fri Apr 25 15:52:46 2025 Russian Standard Time (UT+4h)  she@DPX200
##.OBSERVE FREQUENCY= 200.1313
##.OBSERVE NUCLEUS= ^1H
##.DELAY= (6, 6)
##.ACQUISITION MODE= SIMULTANEOUS
##.ACQUISITION SCHEME= undefined
##.AVERAGES= 8
##.DIGITISER RES= 18
##SPECTROMETER/DATA SYSTEM= spect
##.PULSE SEQUENCE= zg30
##.SOLVENT NAME= CDCl3
##.SHIFT REFERENCE= (INTERNAL, CDCl3, 0, 14.3821)
##AUDIT TRAIL= $$ (NUMBER, WHEN, WHO, WHERE, WHAT)
$$ ##TITLE= Audit trail, XWIN-NMR		Version 3.5
$$ ##JCAMPDX= 5.01
$$ ##ORIGIN= Bruker BioSpin GmbH
$$ ##OWNER= she
$$ F:/spectra/data/she/nmr/H-C/1/audita.txt
$$ ##AUDIT TRAIL=  $$ (NUMBER, WHEN, WHO, WHERE, WHAT)
(   1,<2025-04-25 15:51:29.84 +0400>,<she>,<DPX200>,
      <created by zg, POWCHK disabled, PULCHK disabled
       configuration hash MD5:
       00 E9 B6 7A A2 85 ED C7 34 08 36 98 17 FE 4E 26
       data hash MD5: 16K
       D1 F3 F5 53 F6 5A 6B 01 80 CF FC 6D 2B E0 C5 38>)
$$ ##END=
$$ 
$$ hash MD5
$$ 6B 82 17 38 FA F5 1A BE 40 A0 8F 90 5F 7C EF 76
##$RELAX= 
##$RELAX= 
##$RELAX= 
##$RELAX= 
##$RELAX= 
##$RELAX= 
$$ Bruker specific parameters
$$ --------------------------
##$DU= <F:/spectra>
##$EXPNO= 1
##$NAME= <H-C>
##$PROCNO= 1
##$TYPE= <nmr>
##$USER= <she>
##$AMP= (0..31)
100 100 100 100 100 100 100 100 100 100 100 100 100 100 100 100 100 100 
100 100 100 100 100 100 100 100 100 100 100 100 100 100 
##$AQSEQ= 0
##$AQ_mod= 1
##$AUNM= <au_zg>
##$AUTOPOS= <>
##$BF1= 200.13
##$BF2= 200.13
##$BF3= 200.13
##$BF4= 200.13
##$BF5= 200.13
##$BF6= 200.13
##$BF7= 200.13
##$BF8= 200.13
##$BYTORDA= 1
##$CFDGTYP= 0
##$CFRGTYP= 5
##$CHEMSTR= <none>
##$CNST= (0..31)
1 1 145 1 1 1 1 1 1 1 1 1 1 1 1 1 1 1 1 1 1 1 1 1 1 1 1 1 1 1 1 1 
##$CPDPRG= <>
##$CPDPRG1= <>
##$CPDPRG2= <>
##$CPDPRG3= <>
##$CPDPRG4= <mlev>
##$CPDPRG5= <mlev>
##$CPDPRG6= <mlev>
##$CPDPRG7= <mlev>
##$CPDPRG8= <mlev>
##$CPDPRGB= <>
##$CPDPRGT= <>
##$D= (0..31)
0 0.7 0 0 0 0 0 0 0 0 0 0.03 0 0 0 0 0 0 0 0 0 0 0 0 0 0 0 0 0 0 0 0 
##$DATE= 1745581889
##$DBL= (0..7)
120 120 120 120 120 120 120 120 
##$DBP= (0..7)
150 150 150 150 150 150 150 150 
##$DBP07= 0
##$DBPNAM0= <>
##$DBPNAM1= <>
##$DBPNAM2= <>
##$DBPNAM3= <>
##$DBPNAM4= <>
##$DBPNAM5= <>
##$DBPNAM6= <>
##$DBPNAM7= <>
##$DBPOAL= (0..7)
0.5 0.5 0.5 0.5 0.5 0.5 0.5 0.5 
##$DBPOFFS= (0..7)
0 0 0 0 0 0 0 0 
##$DE= 6
##$DECBNUC= <off>
##$DECIM= 32
##$DECNUC= <off>
##$DECSTAT= 4
##$DIGMOD= 1
##$DIGTYP= 9
##$DL= (0..7)
0 120 120 120 120 120 120 120 
##$DP= (0..7)
150 150 150 150 150 150 150 150 
##$DP07= 0
##$DPNAME0= <>
##$DPNAME1= <>
##$DPNAME2= <>
##$DPNAME3= <>
##$DPNAME4= <>
##$DPNAME5= <>
##$DPNAME6= <>
##$DPNAME7= <>
##$DPOAL= (0..7)
0.5 0.5 0.5 0.5 0.5 0.5 0.5 0.5 
##$DPOFFS= (0..7)
0 0 0 0 0 0 0 0 
##$DQDMODE= 0
##$DR= 18
##$DS= 0
##$DSLIST= <SSSSSSSSSSSSSSS>
$$ [...]
##$SUBNAM0= <"">
##$SUBNAM1= <"">
##$SUBNAM2= <"">
##$SUBNAM3= <"">
##$SUBNAM4= <"">
##$SUBNAM5= <"">
##$SUBNAM6= <"">
##$SUBNAM7= <"">
##$SUBNAM8= <"">
##$SUBNAM9= <"">
##$SW= 18.0517328524113
##$SWIBOX= (0..15)
0 0 2 0 0 0 0 0 0 0 0 0 0 0 0 0 
##$SW_h= 3612.71676300578
##$TD= 16384
##$TD0= 1
##$TE= 0
##$TE2= 300
##$TE3= 300
##$TEG= 300
##$TL= (0..7)
0 120 120 120 120 120 120 120 
##$TP= (0..7)
150 150 150 150 150 150 150 150 
##$TP07= 0
##$TPNAME0= <>
##$TPNAME1= <>
##$TPNAME2= <>
##$TPNAME3= <>
##$TPNAME4= <>
##$TPNAME5= <>
##$TPNAME6= <>
##$TPNAME7= <>
##$TPOAL= (0..7)
0.5 0.5 0.5 0.5 0.5 0.5 0.5 0.5 
##$TPOFFS= (0..7)
0 0 0 0 0 0 0 0 
##$TUNHIN= 0
##$TUNHOUT= 0
##$TUNXOUT= 0
##$USERA1= <user>
##$USERA2= <user>
##$USERA3= <user>
##$USERA4= <user>
##$USERA5= <user>
##$V9= 5
##$VALIST= <valist>
##$VCLIST= <CCCCCCCCCCCCCCC>
##$VD= 0
##$VDLIST= <DDDDDDDDDDDDDDD>
##$VPLIST= <PPPPPPPPPPPPPPP>
##$VTLIST= <TTTTTTTTTTTTTTT>
##$WBST= 1024
##$WBSW= 4
##$XGAIN= (0..3)
0 0 0 0 
##$XL= 0
##$YL= 0
##$YMAX_a= 455768
##$YMIN_a= -441703
##$ZGOPTNS= <>
##$ZL1= 120
##$ZL2= 120
##$ZL3= 120
##$ZL4= 120
##$ABSF1= 10
##$ABSF2= 0
##$ABSG= 5
##$ABSL= 3
##$ALPHA= 0
##$AQORDER= 0
##$ASSFAC= 0
##$ASSFACI= 0
##$ASSFACX= 0
##$ASSWID= 0
##$AUNMP= <proc_1d>
##$AZFE= 0.1
##$AZFW= 0.1
##$BCFW= 1
##$BC_mod= 2
##$BYTORDP= 1
##$COROFFS= 0
##$CY= -3
##$DATMOD= 1
##$DC= 2
##$DFILT= <>
##$DTYPP= 0
##$F1P= 0
##$F2P= 0
##$FCOR= 0.5
##$FTSIZE= 0
##$FT_mod= 4
##$GAMMA= 1
##$GB= 0.15
##$INTBC= 1
##$INTSCL= 1
##$ISEN= 128
##$LB= 0.25
##$LEV0= 0
##$LPBIN= 0
##$MAXI= 10000
##$MC2= 0
##$MEAN= 0
##$ME_mod= 0
##$MI= 1.114404
##$NCOEF= 0
##$NC_proc= 0
##$NLEV= 6
##$NOISF1= 3.799351
##$NOISF2= 2.8
##$NSP= 1
##$NTH_PI= 0
##$NZP= 0
##$OFFSET= 14.38212
##$PC= 1
##$PHC0= -989.7275
##$PHC1= 9.9922
##$PH_mod= 1
##$PKNL= yes
##$PPARMOD= 0
##$PSCAL= 0
##$PSIGN= 0
##$REVERSE= no
##$SF= 200.129724274929
##$SI= 16384
##$SIGF1= 3
##$SIGF2= 2
##$SINO= 400
##$SIOLD= 16384
##$SREGLST= <1H.CDCl3>
##$SSB= 0
##$STSI= 0
##$STSR= 0
##$SW_p= 3205.1282051282
##$SYMM= 0
##$S_DEV= 0
##$TDeff= 0
##$TDoff= 0
##$TI= <>
##$TILT= no
##$TM1= 0
##$TM2= 0
##$TOPLEV= 0
##$USERP1= <user>
##$USERP2= <user>
##$USERP3= <user>
##$USERP4= <user>
##$USERP5= <user>
##$WDW= 1
##$XDIM= 8192
##$YMAX_p= 0
##$YMIN_p= 0
$$ End of Bruker specific parameters
$$ ---------------------------------
##NTUPLES= NMR FID
##VAR_NAME=  TIME,          FID/REAL,        FID/IMAG
##SYMBOL=    X,             R,               I
##VAR_TYPE=  INDEPENDENT,   DEPENDENT,       DEPENDENT
##VAR_FORM=  AFFN,          ASDF,            ASDF
##VAR_DIM=   8192,          8192,            8192
##UNITS=     SECONDS,       ARBITRARY UNITS, ARBITRARY UNITS
##FACTOR=    0.0002768,     1,               1
##FIRST=     0,             0,               0
##LAST=      2.2672688,     0,               0
##MIN=       0,             -441703,         0
##MAX=       2.2672688,     455768,          0
$$ Real data points
##PAGE= N=1
##DATA TABLE= (X++(R..R)), XYDATA
$$ [...]
951e119K787Q432o179m484Q304O64q196K919O914o034n165Q010J464r571K511
$$ -5119 -2332 6100 -79 -4563 3741 4405 -3791 -872 6042 8 -5157 2853 4317 -5254 -2743
966b743P820o516m728Q405J033q211K453P625m944n220P781K277q712K347P568
$$ -2743 5077 -1439 -6167 2238 3271 -4940 -2487 5138 194 -5026 2755 5032 -3680 -1333 6235
981F235o144m703P635R24q217J877P018n213n494P711J968r055K616Q267n750
$$ 6235 91 -4612 3023 3947 -4270 -2393 4625 -588 -6082 1629 3597 -5458 -2842 5425 -325
996c25n022P813K125p896J464P682m774n822P566K292r316J541P806n517n276
$$ -325 -5347 2466 4591 -3305 -1841 5841 1067 -4755 2811 5103 -4213 -2672 5134 -383 -5659
1011e659P171J725p957J587P822m887n848Q372K748r162J946Q176n162n172P165
$$ -5659 1512 3237 -4720 -3133 4689 -198 -6046 2326 5074 -4088 -2142 6034 872 -4300 2865
1026B865J785q356J281Q006n149o431P518K355q790J849P403n312m502P777J901
$$ 2865 4650 -3706 -2425 5581 432 -5999 1519 3874 -4916 -3067 4336 -976 -5478 2299 4200
1041D200q215J519Q244m710n933P937K161q861J884P309n501n367P079K354q288
$$ 4200 -4015 -2496 5748 1038 -4895 3042 5203 -3658 -1774 5535 34 -5333 1746 4100 -4188
1056d188N31P760m187n743P178K355p905J960P522m435n293O433K859p357M40
$$ -4188 -3657 4103 -84 -5827 1351 3706 -4199 -2239 5283 848 -4445 1988 4847 -2510 -2070
1071b070P431m333o163P086K385q549R60P191m037n445O279L198p590K83Q166
$$ -2070 5361 1028 -5135 1951 4336 -4213 -3253 3938 -99 -5544 735 3933 -3657 -3374 4792
1086D792l752o079P166L020q207R87P446l997n978N998L201q089l1Q083m062o649
$$ 4792 1040 -5039 2127 5147 -3060 -2073 5373 1376 -4602 1396 4597 -3492 -3523 4560 498 -6151
1102f151O949L077q043Q14P759l404n975O156L867p603q2Q038l862o238O803K788
$$ -6151 798 3875 -4168 -3354 4405 1001 -4974 1182 5049 -2554 -2636 5402 1540 -4698 2105 4893
1118D893q110J53P110l518n688N825L086p791L27Q091l738n914O719K919p123
$$ 4893 -3217 -3064 4046 528 -5160 665 3751 -4040 -3713 4378 640 -5274 1445 4364 -2759
1133b759O55O998l318n618N567L275p461k53P378l659n925N840K688o877K01O685
$$ -2759 -2104 4894 1576 -4042 1525 4800 -2661 -2914 4464 805 -5120 720 3408 -3469 -3268 3417
1149C417k870n546N531L888o916l82P388k931n438N672K759o874l24O502k170
$$ 3417 547 -4999 532 4420 -2496 -2878 4510 1579 -3859 1813 4572 -2302 -2626 3876 1706
1164A706o034M366L647o724n43P100k854n780N300L552n999n79O506j604n791
$$ 1706 -4328 38 3685 -3039 -3582 3518 664 -5116 184 3736 -2263 -2842 3664 2060 -3731
1179c731M582M045o666j027P089k545n962M572L269o031j050O236j851n893M742
$$ -3731 851 4896 -1770 -2797 4292 1747 -4215 357 3626 -2405 -3455 2781 930 -4963 -221
1194b21M204o659q23P119j941n297M678L295n955r64O590j681o309M190M042o547
$$ -221 3983 -2676 -3499 3620 1679 -3618 1060 4355 -1600 -2564 4026 2345 -3964 226 4268 -2279
1210b279j084O543k365n579M485L663n682j285O582j150n822M259M214n957j020
$$ -2279 -3363 3180 815 -4764 -279 3384 -2298 -3583 2999 1849 -3973 286 4500 -1457 -2477
1225b477O498j983n441L898L584n523j742N880j238n862L889L918n910j063O362
$$ -2477 4021 2038 -3403 495 4079 -1444 -3186 2694 1456 -4406 -517 3401 -2509 -3572 2790
1240B790j391n150L789L766m957j491O186j037n946L793M052n915j424N875j583
$$ 2790 1399 -3751 38 3804 -1153 -2644 3542 2505 -3441 352 4404 -1511 -2935 2940 1357
1255A357n249L344L711n129j816O176p92n717L778M222n384j179N985j156n117
$$ 1357 -3892 -548 3163 -1966 -3782 2394 1602 -4115 -337 3885 -1499 -2678 3307 2151 -2966
1270b966L249L938n033k106N740q17n745L260L809n425j405N669r00m983K981
$$ -2966 283 4221 -812 -2918 2822 2005 -3740 -480 3329 -2096 -3501 2168 1268 -3715 -734
1285g34L970m385j784N784o19n280L376L805m967j549N187q36m997K458L733m557
$$ -734 3236 -1149 -2933 2851 2232 -3048 328 4133 -834 -2383 2804 1968 -3029 -571 3162 -1395
1301a395k143N467m82n337L072L890m495j454N222l48m693K601L965m169k245
$$ -1395 -3538 1929 1447 -3890 -818 3072 -1423 -2877 2345 1997 -2696 -95 3870 -299 -2544
1316b544N323m14n283K611L525m428j870M794k98m808K179M013l889k183N293
$$ -2544 2779 2365 -2918 -307 3218 -1210 -3080 1714 1416 -3392 -1213 2800 -1089 -3272 2021
1331B021Qm970K744L771l993j684M501j9m716J838L779l910k401M802k06m949
$$ 2021 2029 -2941 -197 3574 -419 -2103 2398 2379 -2337 -499 3280 -630 -3031 1771 1565 -3384
1347c384K315L560l691j800M496K87m387J916M024l606k209M940j12m641K178
$$ -3384 -1069 2491 -1200 -3000 1496 1783 -2604 -688 3336 -270 -2479 2461 2349 -2292 -114
1362a14L287l695k044M177K1m485J536L831l484k254M585J07m301K095L534l137
$$ -114 3173 -522 -2566 1611 1632 -2853 -1317 2514 -970 -3224 1361 1468 -2833 -738 2796 -341
1378c41j833M115M43m263J497L661l414k223M223k00m298J749L118l136j982L817
$$ -341 -2174 1941 2384 -1879 -382 3279 -135 -2358 1865 1665 -2633 -884 2234 -902 -2884 933
1394I33M59m054J500L708k935j877M166J18l841J668L083k802k021L415M10m039
$$ 933 1392 -2662 -1162 2546 -389 -2266 1900 2018 -1823 -155 2928 126 -1895 1520 1930 -2109
1410b109J084L341l047k049L727J71l645J375L144k277k008L484Q30l724J170
$$ -2109 -1025 2316 -731 -2780 947 1118 -2527 -1152 1992 -285 -2293 1191 2021 -1703 -533
1425e33L443k670k111L523K55l514Q33K797k308k209L072Q46l755Q78L404k470
$$ -533 2910 240 -1871 1652 1907 -1607 -774 2023 -285 -2494 578 1424 -2331 -1453 1951 -519
1441e19j919L539N10l230J068L040j996k181L106P95l719Q05L070k558k076L108
$$ -519 -2438 1101 1611 -1619 -551 2489 493 -1688 1418 2213 -1506 -701 2369 -189 -2265 843
1457H43L67l297Q00K856j911k173L218R79l454R50L273k216j881L155M57l125
$$ 843 1210 -2087 -1287 1569 -342 -2515 703 1682 -1772 -822 2451 235 -1646 1509 1966 -1159
1473a159O31K763k040k239K828P18l555P91K916k239j744K895N93k751P04K853
$$ -1159 -528 2235 195 -2044 784 1502 -2053 -1262 1654 -585 -2329 566 1159 -1592 -888 1965
1489A965j664j980K865Q69l192P42K714k184j762K470M53k816L32K483j564k073
$$ 1965 301 -1679 1186 2055 -1137 -395 2319 135 -1627 843 1296 -1520 -1188 1295 -269 -2342
1505b342K674Q47k910P11K783j724j612K557P28k557L43K652j504k154K360P45
$$ -2342 332 1179 -1731 -1020 1763 39 -1573 984 1712 -845 -502 2150 646 -1508 852 1597
1521A597l056M76K439j730j825K269Q44k589L68K602j263j962K603R68k769O38
$$ 1597 -1459 -983 1456 -274 -2099 170 1014 -1575 -1207 1395 132 -1830 773 1741 -1028 -390
1537c90K397j582j603K105O80k613P3K413j477k012K329O16k712O33K357j489
$$ -390 2007 425 -1178 927 1607 -1006 -933 1480 3 -2009 320 936 -1776 -1143 1214 -275
1553b75j398K208Q14k272L83K449j415j718K318M84k554M89J906j497j484J829
$$ -275 -1673 535 1349 -923 -540 1909 494 -1224 1094 1578 -976 -487 1419 -78 -1562 267
1569B67O07k191J18K108j150j523K244N89k124O46J929j131j309J692O94j976
$$ 267 874 -1317 -1199 909 -241 -1764 480 1069 -1055 -409 1520 389 -920 772 1466 -510
1585e10P8J991j252j731J809M23k160M32J776j071j329J525R47j876K05K085j052
$$ -510 -432 1559 307 -1424 385 808 -1352 -920 856 -215 -1544 -19 928 -948 -743 1342 290
1602B90j351J881O95k041L08J593j082j388J427Q09k160j44K031j072j526J813
$$ 290 -1061 820 1515 -526 -218 1375 293 -1095 332 1141 -1019 -1163 868 -204 -1730 83
1618H3O05j853M12J867q50j232J498Q13j815J55J986j218j447J642K42j784K41
$$ 83 688 -1165 -753 1114 264 -968 530 1343 -472 -317 1669 451 -996 646 888 -896 -655
1635f55J477r92j349J470P42j834K10J877j089r56J774M31j609L62J408p85j106
$$ -655 822 -170 -1519 -49 693 -1141 -931 946 -143 -1099 675 1106 -503 -141 1267 482 -624
1652f24J190N41j808K04J482j201j057J427J33j442M20J373p77r33J336O70j455
$$ -624 566 1107 -701 -497 985 -216 -1273 154 287 -1155 -735 638 -139 -1072 264 934 -521
1669e21L40J486r71r20J365K32j400P8J101p42j132J152M25j538K59J315q31p76
$$ -521 -181 1305 334 -586 779 1011 -389 -311 790 48 -1084 68 493 -1045 -786 529 -302 -1078
1687a078J329K90j161L45J337n49j083J207M81j504J48J353j060q76J060J49j224
$$ -1078 251 541 -620 -275 1062 513 -570 637 1118 -386 -238 1115 55 -821 239 388 -836
1704h36R0J183o87r13J195N32j304M18J314q97n72J232J98j137J03J076o76j009
$$ -836 -746 437 -250 -1163 32 564 -740 -322 992 95 -477 755 953 -184 -81 995 319 -690
1722f90J117J25j466L16J041r21n47J066J12r40L66J099n66p37J209K59j172M46
$$ -690 427 552 -914 -598 443 -478 -1025 41 153 -787 -421 678 112 -625 584 843 -329 117
1740A17R82r84n18Q69K2j063J56Q64p08p90R96K88j186N12R67p62l20J049J48
$$ 117 1099 115 -403 466 488 -575 -419 445 -263 -1053 -57 231 -955 -443 524 -238 -558 491 639
1759F39q33K32R85o44p49J048j5j251L53P79q62m95P31J80q57J91R82n61o57J196
$$ 639 -194 38 1023 379 -370 678 663 -588 -235 544 -318 -813 -82 98 -759 -568 414 -147 -804 392
1779C92K26j089N63R04q04l98Q30P9r69O9R05q51p10J023Rj161N17Q13p76k92
$$ 392 618 -471 92 996 192 -206 624 703 -266 -197 708 -143 -853 170 179 -982 -465 348 -428 -720
1799g20J021J19r16M28J015o94n93J128n6j106M94O87r08n13P93kr74K13R54q48
$$ -720 301 420 -496 -68 947 253 -340 788 732 -374 120 807 -101 -614 179 177 -797 -584 370 -478
1819d78m55J161K0r01O39P19o66k28Q17R8r31K71Q54q93n38J013k48j102O08N44
$$ -478 -933 228 248 -653 -14 705 39 -189 628 726 -205 66 920 27 -511 502 254 -848 -240 304
1839C04q05l36R45M1q76M71R43p91l52J200j03q90N72N25p84m38Q26M8j133L81
$$ 304 -501 -837 108 149 -727 -256 687 -104 -456 744 641 -249 323 848 64 -374 452 500 -633 -252
1859b52P55j015m11J064j01q51O16O78o19k62Q42K04r80M70Q04r13l24R82l01
$$ -252 503 -512 -923 141 40 -811 -195 483 -136 -398 444 648 -332 138 942 29 -295 687 386
1878C86q86M07M28o94l89Q32p8q97N66Q62r35j89J084j26p10N17O19o09m71Q87
$$ 386 -500 -93 335 -359 -748 84 6 -891 -325 537 -398 -587 497 371 -339 178 797 188 -283 604
1898F04l6j066M15P32r79l97R43k37p96M62N74n69l88R99K06r82N66Q88r20k50
$$ 604 568 -498 -83 649 -330 -727 216 -21 -817 -355 219 -350 -738 261 467 -515 51 939 19 -231
1918b31J001k04r28M22N87o92n31Q15q6j011M59P09q53j42R38j48o41N30P08o46
$$ -231 770 566 -362 60 647 -45 -576 239 153 -858 -399 310 -543 -685 253 105 -536 -6 702 56
1938E6l25R07M7j076N66O34r53k84Q17j97q85L37O70p06m19R37R4r47O47P47p87
$$ 56 -269 638 685 -391 175 809 -144 -428 389 192 -693 -356 314 -392 -811 126 220 -727 -80 667 -120
1959a20k01R80r9q61M47O86p39n35R32j26j107N48O42r42k37Q76j16q12N17P71
$$ -120 -321 659 560 -301 146 832 93 -442 490 364 -743 -195 447 -495 -732 144 28 -784 -267 504
1979E04o93l17J094N6j068O98O80r00l04Q64k31q91L68O49q34n37J063j37r61
$$ 504 -189 -506 588 644 -424 274 954 54 -250 614 383 -508 -140 509 -325 -862 201 64 -897
1998h97O52P02q51p8R47j04o81M27P66p90l46R59k31j022N76N14r53j90P95j23
$$ -897 -245 457 -394 -472 475 371 -310 117 883 93 -253 706 475 -547 29 543 -410 -600 195 72
2018G2p98L33P78p36k88J111j36q20O41N86o76k00P91j21q36L50O27q03n07R12
$$ 72 -726 -393 385 -351 -639 472 336 -484 157 743 67 -133 658 537 -299 51 678 -125 -632 280
2038B80k16q80N44N24p30j50Q65J07q60M92P96p81k45R83j97r09N52M84p85k67
$$ 280 64 -816 -272 252 -478 -628 237 344 -516 -24 772 -9 -254 729 532 -377 175 659 -126 -393
2058c93P06q6q96K87P30p73l77J006p5q26O28N73n14l04Q18M8q27L91P50r30l79
$$ -393 313 227 -669 -382 348 -425 -802 204 129 -697 -69 504 -10 -314 504 552 -275 116 866 -64 -443
2079d43R06k10q74M18N17o65l28P54J38r50M52Q81p11l59J066j62p13M22O32o35
$$ -443 463 253 -621 -203 314 -351 -679 75 213 -737 -285 596 -115 -474 592 430 -283 139 771 136
2099A36m09P67j25r37L51P32q52m06R09j48p55M46O52n35l95R53J63r00L90Q45
$$ 136 -273 494 369 -568 -217 515 -337 -743 166 18 -737 -291 361 -174 -569 384 547 -353 37 882
2119H82p83m77R46m2r05L35N64o64n94Q81J27j127M10R23q23l10J006L5q03M05
$$ 882 99 -378 568 526 -379 -44 520 -144 -738 143 270 -857 -447 476 -347 -657 349 384 -419 -14
2139a4P98n67n65R19P3j053L87P31q83m81R27p4q81L21P48o85m62R52J78r99N32
$$ -14 784 217 -348 571 644 -409 -22 709 -174 -655 272 198 -683 -362 386 -299 -761 191 369 -630 -98
2160i8R06q64k16Q99m6q99L71O65p18n66Q95m5j046M15P45p78l03Q49L0p77M04
$$ -98 808 -56 -272 627 581 -318 53 718 0 -566 329 284 -762 -347 398 -380 -683 166 196 -581 -177
2181a77P32n23m40R87O5j000M05O96p81k79O50mq64J74O72o31m13Q10J14q64L87
$$ -177 555 32 -408 579 644 -356 49 745 -36 -315 335 331 -533 -359 313 -318 -731 79 193 -671 -284
2202b84P30n28k78P79J38p81K37P40n50n40P66L0r58L14N36o07m28O88K09p80
$$ -284 446 -82 -360 419 557 -224 13 753 203 -337 429 459 -499 -185 351 -256 -684 4 213 -567
2222e67J80P83m69n12Q86K65r08L61O92n49m18O05J59q33R4P52n97o43Q09O2q47
$$ -567 -387 396 -73 -585 301 566 -342 19 711 162 -256 349 508 -325 -231 521 -76 -719 90 152 -695
2243f95K85P13m19m31P65J33o76J78Q52m81n29P86J18q77J98O40n73n45O17K14
$$ -695 -410 303 -116 -547 218 351 -325 -147 705 224 -305 481 599 -278 -80 560 -13 -558 59 273
2263B73q17J30P29m56m86P87J41o36K31O18l65m08N94K08o25k2P11n69n48O51
$$ 273 -544 -414 315 -141 -627 160 301 -335 -104 514 149 -259 335 543 -82 -104 607 38 -510 141
2283A41R1p56J47N45l40m06N53L59p47J58P90m38m85Q06J27p30J41O28m32n17
$$ 141 232 -524 -377 168 -172 -578 -25 334 -413 -255 535 97 -388 418 545 -185 -44 584 152 -365
2303c65N06K66q19K3O59m36n34P18J54o42R2O87k11m20N65K79o25O4P45m85m87
$$ -365 141 407 -412 -389 270 -166 -700 18 172 -470 -378 309 98 -322 243 522 -103 -39 706 221 -266
2324b66N26J13o42kN44l27n40N10K63o32R9P21m14l65O35K20n50J17N72k58n62
$$ -266 260 373 -269 -271 273 -54 -594 -84 179 -453 -354 367 -47 -412 223 443 -107 10 582 324 -238
2345b38M67K94p79j1O04l96n10O01J28n79J9O29k47m65N41L01o00J67O29k59n27
$$ -238 229 523 -256 -267 337 -59 -569 32 160 -419 -400 229 -18 -483 58 359 -241 -74 555 296 -231
2366b31N07J61n26m8N35k72o28M74K71o77QO15l87k88N06K75m62m0O46j72n15
$$ -231 276 437 -89 -137 398 126 -502 -28 243 -434 -426 189 -198 -486 20 295 -167 -207 439 267 -248
2387b48M74L36o57J7M71l37m18M19J79o20n5N85k25m85M87L52n89Q2O16k40l43
$$ -248 226 562 -95 -78 393 56 -362 57 236 -384 -439 146 -79 -564 -77 275 -314 -232 384 144 -199
2408a99M26K57m92o3N60k50n45L54K44n95m6M90k56m40M18K75m06l6N74j60l76
$$ -199 227 484 -8 -71 489 239 -306 48 292 -303 -349 141 -115 -555 -137 138 -268 -304 270 110 -266
2429b66M94K31n28N6M55k10l68K59K22n03j74N06j97m74L58K91m59K2M15j52k38
$$ -266 228 459 -69 -13 442 232 -136 123 345 -158 -332 174 -23 -497 -139 152 -307 -285 130 -22 -260
2450b60L09L31l59j64N62r3m99L95J64m88r0L99j16m41K08K23l97r6N32o1n06
$$ -260 49 380 21 -143 419 326 -173 222 386 -102 -192 207 91 -350 -142 81 -316 -412 120 59 -447
2471d47M73L27l96p9M63q6l42K17L02m54j62M80k17m41K56K23m24j04M83q4l59
$$ -447 26 353 -43 -122 341 255 -87 130 432 -22 -184 296 79 -362 -106 117 -307 -411 72 -12 -371
2492c71K93L10l22q8N01m0m31L46K65m74q1L55n6m24J39K46l63j80M44j32l92
$$ -371 -78 232 -90 -178 323 283 -148 198 463 -11 -92 263 207 -217 -78 168 -195 -375 69 -63 -455
2513d55L30K28k86K2L94jl85K35L64m16j37M11j15m22K29K24l73j67L00Ol74J04
$$ -455 -125 103 -183 -161 233 232 -153 82 446 30 -107 304 189 -233 -4 220 -153 -320 -20 -14 -388 -284
2535b84M28k97j75M77nk67K02K87k71j55L05R4m07M6L75m74r6L59j57l40J78J90
$$ -284 144 -153 -328 149 144 -123 79 366 95 -60 245 339 -68 -22 353 -121 -217 142 -15 -355 -177 13
2557A3j88j44L94O8l78J90L98l60q4L61j5l61J83K79l85j27J94rl65J05L47l59
$$ 13 -175 -319 75 143 -235 -45 353 -7 -91 270 255 -106 77 356 -29 -156 38 29 -336 -231 116 -243
2579b43r2L84j3l13K22K44j51r7L50k5l13J40K48l28j64K79k5l54J22J86k68j14
$$ -243 -335 49 36 -277 -55 189 38 -59 291 266 -47 93 341 13 -151 128 103 -251 -129 57 -211 -325
2601c25K67L8k07J74K10j78p1K63J6j81J55J20j73p3J09pl50O2K29k13q3K08q0
$$ -325 -58 -20 -227 -53 157 -21 -92 171 187 6 161 281 108 35 144 137 -213 -151 78 -135 -218 -10 -90
2624i0j68R0K20o0j49L42K7k44J21K27k03q1J41k4j99L5N9p5j63J24O6k50O9K30
$$ -90 -258 -168 52 -8 -157 185 212 -32 89 316 113 32 173 149 -50 -15 44 -31 -194 -70 -4 -254 -185 45
2648D5k36K9K41jj28O8K15r5q1J35N3k92P3J33k41p9J13Pj94N0J71j22l9K12P1
$$ 45 -191 -162 79 78 -50 18 233 138 57 192 245 -47 26 159 -82 -161 -48 -41 -235 -185 -14 -136 -175 37 108
2673A08j75R3J09m6n9J49Rq2m5J35j80j35J06N8k44R6Q5q0m6L3J06j00MK51o0
$$ 108 -67 26 135 89 30 179 188 106 61 196 16 -119 -13 45 -199 -103 -18 -98 -144 -111 -5 -105 -101 150 90
2698I0j00J50O0j66NJ35o8j10RQ3j98k0Q8n9j77K40L7j25M5J31Jq6J79M4j43M
$$ 90 -10 140 200 34 39 174 106 -4 5 88 -110 -130 -42 -101 -278 -38 -1 -126 -81 50 51 -35 144 188 45 49
2724D9K10j17j61J72l4k27K5M9p1j8l1R6j06J7K00p7o1J98j4j15J49O3j24n2P7
$$ 49 259 142 -19 153 119 -108 -83 -34 -105 -123 -154 -58 -164 -147 53 -24 -85 113 99 -16 133 196 72 20 97
2749I7L0j15l5P3j42j00J42Pj24N1N4kq7J29J17q9K8J68q5n5J36j18p6JN2j10
$$ 97 127 12 -23 50 -92 -192 -50 -43 -167 -116 -62 -64 -151 -22 95 6 34 202 117 62 198 80 4 5 57 -53
2775e3k5l5L7q9K8N3p2k2J83pm6M4J06j3k6O9K9n9n1N0j25l3N8m7m9n8Q8j2j39
$$ -53 -78 -113 -76 -165 -137 -84 -156 -178 5 -2 -48 -4 102 89 63 132 161 102 51 101 -24 -57 1 -46 -95 -153 -65 -77 -216
2804b16J61O9j06O4J49n5LOM1J5o5J4J7j15O8k0j03M3j7j19nJ35q2K1jJ23K0q8
$$ -216 -55 14 -92 -28 121 66 69 75 116 131 66 80 97 -18 50 30 -73 -30 -47 -166 -171 -36 -118 -97 -98 25 45 -43
2832d3J54Q5j55L2P2j9r3O1p1j09M6k9j6mn7J23q9QN7N9PN0l3P3j6J9j7rK3q9
$$ -43 111 196 41 73 145 126 33 94 23 -86 -40 -69 -85 -89 -146 -23 -112 -104 -47 12 19 69 36 109 93 112 95 86 109 20
2862B0k1o2P5q0Mj5l5K5k3N4Q5n2nL5L2P2N9m5l9N9p8N7j10M0q1m4JM3q7K4PM5
$$ 20 -1 -63 12 -68 -64 -79 -114 -89 -112 -58 27 -25 -30 5 37 109 168 123 84 143 65 122 12 52 -29 -73 -72 -29 -116 -92 -85 -40
2894d0K0m5L4N2J2M5O2r7N6n7L5J7o7l8L4n4n6J2l5J5j2JO7l6K9Q9J3l9P1k9L1
$$ -40 -20 -65 -31 21 33 78 140 43 99 42 77 94 27 -11 23 -31 -87 -75 -110 -95 -107 -106 -39 -75 -46 43 56 17 88 59 90
2925I0m3L3N2o4jL7j52j9R0j01j3M0p0L7J4J04l1K5J5L4J2k2M4r7M6L4j3l3n5
$$ 90 47 80 132 68 67 104 -48 -67 23 -78 -91 -51 -121 -84 -70 34 3 28 43 77 89 67 111 14 60 94 81 48 -7
2954gl7kl7J3J2p3L0J14j40P6kR9MK7O0m6k8nj0j7j1j1m6j8No0K7J0j1J1p8J13
$$ -7 -44 -46 -83 -70 -58 -131 -101 13 -127 -51 -53 46 50 77 137 91 63 58 48 31 20 9 -37 -55 -50 -110 -83 -73 -84 -73 -151 -38
2986c8K4LK9J9L5m2Q0k7o5J0L9m2q6J7O2j57l6J18k5k8R3rp1J38M5j3K3j9P4p0
$$ -38 -14 -11 18 37 72 30 110 83 18 28 67 25 -61 -44 18 -139 -175 -57 -82 -110 -17 -26 -97 41 86 73 96 77 151 81
3016H1OK6j25j8P6m0q2rL9l0q5N4N9rM0Q3Ml7L5J3k4j2Q8n6j05P8l2n9QM6r0l3
$$ 81 87 113 -12 -30 46 6 -76 -85 -46 -76 -161 -107 -48 -57 -17 66 70 33 68 81 57 45 133 77 -28 50 18 -41 -33 13 -77 -110
3048a10NO3l5M8JqM4M1NK3k3J10j02k9Q9q8J0r4N1m0n1M1qp5J06K6n4NM6M6m3
$$ -110 -105 -42 -77 -29 -28 -36 8 49 54 77 54 164 62 33 122 34 44 -50 1 -39 -90 -49 -57 -132 -26 0 -54 -49 -3 43 0
3079@L1J01m6r2R6Mj19PJ2%m1K9j3n4l9J40l3j17J31M1p2J25k1m7jR3l4l1m0R0
$$ 0 31 132 86 -6 90 94 -25 -18 -6 -6 -47 -18 -31 -85 -124 16 -17 -134 -3 38 -34 91 70 23 22 115 81 50 10 100
3109A00r6j07J13q8l1J9M1j1r2J33J6o0O9N0l2m8J56J6r9L6J9j00J4m5O4r5n7
$$ 100 4 -103 10 -78 -109 -90 -49 -60 -152 -19 -3 -63 6 56 24 -24 132 148 49 85 104 4 18 -27 37 -58 -115
3136a15J34q1k5O7j4j09Q6Q6M2n2O4K9l8j6J39j11r3K7Jo9o6M9L8j18O9R5j03
$$ -115 19 -62 -87 -20 -34 -143 -57 29 71 19 83 112 74 58 197 86 -7 20 21 -48 -114 -65 -27 -145 -76 19 -84
3163h4kJ44n4j7Q3L0k8n0Q2k7l6k1P4r9m3N0pj62J37L0p9K5L5K2m4L8J24j18K6
$$ -84 -86 58 4 -13 70 100 72 22 104 77 41 20 94 -5 -48 2 -5 -167 -30 0 -79 -54 -19 3 -41 -3 121 3 29
3192B9J05m1r4Q8k4m0o7Q6o5n5K1Q8j75O7J1j8l2J14N6j03R1M0k0rK9K7j11L4
$$ 29 134 93 -1 87 63 23 -44 42 -23 -78 -57 31 -144 -77 -66 -84 -116 -2 54 -49 42 82 62 53 82 109 -2 32
3220C2J30j74r0J20l0m8RO9l7q6R4J48j61pJ45m2jj7R4r0p0R2n6r8O2Q7k13O1
$$ 32 162 -12 -102 18 -12 -60 -51 18 -19 -105 -11 137 -24 -31 114 72 71 54 148 58 -12 80 24 -74 -12 75 -138 -77
3248g7O7p3o3P7J13j23K3J29j8j32J55O5r4J3J9k9l5k8M3p4j6L9nq9L6J11j11
$$ -77 -10 -83 -146 -69 44 -79 -56 73 55 -77 78 143 49 62 81 52 17 -11 32 -42 -58 -19 -24 -113 -77 34 -77
3275g7kJ17l1m1N9O8K4j26J52r2p4Q4K5r2m4R1j8p8J0M3l2o9R1N0r3L1J29o6M0
$$ -77 -79 38 7 -34 25 93 117 -9 143 51 -23 61 86 -6 -50 41 23 -55 -45 -2 -34 -103 -12 38 -55 -24 105 39 79
3304G9j1J3k8j0K3o3NK7l9j16M6L2k2n9J01K0o8Q2L8o1JQ5J2p8L4K5k4p0O7mj07
$$ 79 68 81 53 43 66 3 8 35 -4 -120 -74 -42 -64 -123 -22 -2 -70 12 50 -11 -10 75 87 9 43 68 44 -26 41 37 -70
3335g0M4N8n0r3J30kj45J06L2M0q9J00O6j29N0N7p7jR8n1r2k4J14p4n0O5k5j25
$$ -70 -26 32 -18 -111 19 17 -128 -22 10 50 -39 61 127 -2 48 105 28 27 125 74 -18 -42 72 -2 -52 13 -12 -137
3363a37P5Q8n9j0J09K5j40J00N0q6MJ07m1n8k5L1p5K1L7m7p3R2N5n4j2KJ7l4N4
$$ -137 -62 26 -33 -43 66 91 -49 51 101 15 19 126 85 27 2 33 -42 -21 16 -31 -104 -12 43 -11 -23 -21 -4 -38 16
3392A6J32j24m3N8K4q4kN0j03O5m5O7j08L8O8j00OJ14J4j00Q8J8J7o1J1Q7j14
$$ 16 148 24 -19 39 63 -21 -23 27 -76 -11 -56 11 -97 -59 9 -91 -85 29 43 -57 31 49 66 5 16 103 -11
3419a1O6L4q3n7L0jn7k3P7l1n9J31p8l9Q5Q7n5J3L1K0n8j9L1or4J61m6r0L9j5
$$ -11 55 89 6 -51 -21 -22 -79 -102 -25 -56 -115 16 -62 -101 -16 71 16 29 60 80 22 3 34 28 -66 95 49 -41 -2 -17
3449a7l4j10J64m1n1N7Q5Oj12R4P4j65Q4P2m1n0qN3j04j9M4J1j17J16O1j24M5
$$ -17 -51 -161 3 -38 -89 -32 53 59 -53 41 115 -50 34 106 65 15 7 60 -44 -63 -19 -8 -125 -9 52 -72 -27
3476b7J40j43j5J14n3k4M1L8j7p8R4J7j27M3k4No4j4J30j04m0J03j8o5O7N4k1
$$ -27 113 -30 -45 69 16 -8 33 71 54 -24 70 87 -40 3 -21 -16 -80 -94 36 -68 -108 -5 -23 -88 -21 33 12
3503A2k8J47o3m3L2K9r4n4N3N1j23P6M4r3M3m0N6r0Q7K7p4J9P4K9r7Q3Oj16R3
$$ 12 -16 131 68 25 57 86 -8 -62 -9 42 -81 -5 39 -54 -11 -51 5 -85 2 29 -45 -26 48 77 -20 63 69 -47 46
3532D6M6j02n6N1K8m9l4R6mk5J1K6q5K0P1pk8K3J05r5mN7n6j7l7K8k4l8Q3n4R
$$ 46 92 -10 -66 -15 13 -36 -70 26 22 -3 8 34 -51 -31 40 33 5 28 133 38 34 91 35 18 -19 9 -15 -53 30 -24 -15
3563a5l7K6K2l3P2L2q8L7Q8q6mM2J6n6o7R7o4n5Q5p4j1J7J00m3n9Q6r6Q5j9J00
$$ -15 -52 -26 -4 -37 35 67 -21 16 104 18 14 56 72 16 -51 46 -18 -73 12 -62 -73 -56 44 1 -58 28 -68 17 -2 98
3593I8j43O2O0k5o3L4Nl7nRK2p1L7k1l5O4Q9r7j9J7O6p8O7LK7j07K3J17j00mM5
$$ 98 -45 17 77 52 -11 23 28 -9 -14 -5 17 -54 -17 -38 -73 -9 80 -17 -36 -19 47 -31 36 39 66 -41 -18 99 -1 -5 40
3624D0r2L9M0l6m1J3O1l1p9R3K4q1O3Q1m3n1RQ4n1o5J02p7J0k7N2k5j4p3N5k6
$$ 40 -52 -13 27 -9 -50 -37 24 -7 -86 7 31 -50 13 94 51 0 9 93 42 -23 79 2 12 -15 37 12 -2 -75 -20 -46
3654d6rR0l7rL4K3n9L0O3p3l5P4n7oM3K2l6k2j7L0o9M7N0l7k8M0J9m9L5K6Lqj5
$$ -46 -55 35 -2 -11 23 46 -13 17 80 7 -28 46 -11 -17 26 48 12 -10 -27 3 -66 -19 31 -6 -34 6 25 -24 11 37 40 32 17
3687A7N9p8j9J03q2l0RK3Pm9N2m0J0J1k1LL3K8LPPj0o2J5J3J0rm3J0j0p7R1j8
$$ 17 76 -2 -21 82 0 -30 -21 2 9 -40 12 -28 -18 -7 -28 -25 8 36 39 46 53 43 -19 -4 9 19 10 -33 -23 -33 -110 -19 -37
3720c7N8m9j5L0M2j3m6L5j6L4J8JK0l8p0N0Pk6J1J7m4jJ4lk9O4M0n1K8pM6m7l3
$$ -37 21 -28 -43 -13 29 16 -30 5 -11 23 41 42 62 24 -46 4 11 -15 -4 13 -31 -32 -18 -21 -50 14 54 3 31 24 70 23 -10
3753a0R4p9k9K7K4rq1O2m2j4P3l7m6kJ37r7M1n6P6k2k4O9l9n8O8KM0l0j9l7l4
$$ -10 84 5 -24 3 27 18 -63 -1 -43 -57 16 -21 -67 -69 68 -29 12 -44 32 10 -14 55 16 -42 26 28 68 38 19 -18 -52
3784e2N2o1M1KO7nj03P2K0n8Q0l3K0n6P3rn0L2m6J5nnJ9rMNkm5Q9o6l4O8k1M2
$$ -52 0 -61 -20 -18 49 44 -59 13 33 -25 55 22 42 -14 59 50 0 32 -14 1 -4 -9 10 1 5 10 8 -37 52 -14 -48 20 -1 41
3818D1m1M5l3n0OJ35p5m8K1rJrk6j4L4K2K1j2J2kl3MK7mJ2m2Q7q3L9K5n3k7j6
$$ 41 0 45 12 -38 -32 103 28 -20 1 -8 -7 -16 -42 -56 -22 0 21 9 21 19 -14 -10 17 13 25 -17 70 -13 26 51 -2 -29 -45
3851d5L3j2rK2npK3M4MJ5k7Ql4J2N1o9L7j3o3ML3o4P1j8j9K2qK2J7Kp6P4J9L0
$$ -45 -12 -24 -33 -11 -16 -23 0 44 48 63 36 44 10 22 73 4 41 28 -35 -31 2 -62 9 -9 -28 -6 -14 8 25 27 -49 25 44 74
3885G4j00j6Q8l7J7ln8k9M3K7n8N2l4O1j7k0N0o0J2L2l3M4qJ3n0RL1n9M7p6P7
$$ 74 -26 -42 46 9 26 23 -35 -64 -21 6 -52 0 -34 27 10 -10 40 -20 -8 24 -9 35 27 40 -10 -1 30 -29 18 -58 19
3916A9m5L4J1kr8Q5k2j9j3M1K9NL5m7J0k9K9m1PK5O4p4j2L2n6pP9n5K5j9m4Q9
$$ 19 -26 8 19 17 -81 4 -18 -37 -50 -9 20 25 60 13 23 -6 23 -18 -11 14 78 4 -8 24 -32 -39 40 -15 10 -9 -53 36
3948C6j4J7k7n3J05n0l7O5j9l7K5n9R2n6M9l3n7K0l8O0J2k8K9K7o0L8M1l0NOk6
$$ 36 22 39 12 -41 64 14 -23 42 23 -14 11 -48 44 -12 37 4 -53 -33 -71 -11 1 -27 2 29 -31 7 48 18 23 29 3
3979CP3lp1K6k0ro8R3q6L2J6N6o7j7KP9J8p3L4K1l8K6PK3k8m8OJ0N0k7jJ9n3J8
$$ 3 76 73 2 28 8 -1 -69 24 -62 -30 -14 42 -25 -42 -40 39 57 -16 18 39 1 27 34 57 29 -19 -13 -3 47 20 19 38 -15 3
4013COp6Q7k2O4o7Q8m9k6plJ9j9L9l6k7L8k3J7j4J9l4K0L7J4n4k2N8prJ0ojm7
$$ 3 9 -67 20 -2 62 -5 83 34 8 1 -2 17 -2 37 1 -26 12 -11 6 -8 11 -23 -3 34 48 -6 -28 30 23 14 24 18 17 -30
4047c0L4N1j9k5k1J6j4o0M5kl8J11J1l0L8k4J4l0L8p3J0L3k0jl2J4j3K5J2k2j0
$$ -30 4 55 36 11 -10 6 -8 -68 -23 -25 -63 48 59 29 67 43 57 27 65 -8 2 35 15 14 -18 -4 -17 8 20 -2 -12
4078a2k7KKN0j8nJ9P5p9J3j5M3kl2L6j1k8o3K7jL9m8K8k7J6QL4P5r8J3J1j02N1
$$ -12 -39 -37 -35 15 -3 -8 11 86 7 20 5 48 46 14 50 39 11 -52 -25 -26 13 -35 -7 -34 -18 -10 24 99 1 14 25 -77 -26
4111b6Jn0J11m8QPJ7%l6K2lKjk8M0m8N3l7L3o7J13k7M1j5j26R5n0j4K8k2j9Q%
$$ -26 -25 -75 36 -12 -4 3 20 20 -16 6 3 5 4 -24 16 -32 21 -16 17 -50 63 36 77 62 -64 31 -19 -33 -5 -27 -46 -38 -38
4144c8K9J8n3L7L4p1M7O8l6l1l9J2R6n3J4k8j0K2j9L2p8J9nk2P7J5k8K8m5nM8
$$ -38 -9 9 -44 -7 27 -44 3 71 35 4 -35 -23 73 20 34 6 -4 18 -1 31 -47 -28 -33 -55 22 37 9 37 -8 -13 35
4175C5k4mpK7l4j2o%M8l9O3l0n1L7qk0J7L3Rk1ROJ7k1l3N7l9p0J2P6n3Lk7K5K2
$$ 35 11 7 0 27 -7 -19 -25 -25 23 -16 47 17 -34 3 -5 -25 -8 25 34 13 22 28 45 24 -9 48 9 -61 -49 27 -26 -23 -50 -25 -3
4210cj5OJ5Pm9M1p2J83j30K3mM5l5L7k6k0j4Oj0P3j06K4L1n3Q1m7K5l0l2M1M1
$$ -3 -18 -12 3 10 -39 2 -70 113 -17 6 2 47 12 49 23 3 -11 -5 -15 58 -48 -24 7 -46 35 -12 13 -17 -49 -8 33
4241C3qK5m4J3L2l0OONl0NPl9k0lO0m1k8M3M9p6Q0l4j4N2k4j2k1k9k8L3L1K9N
$$ 33 25 50 6 19 51 21 27 33 38 8 13 20 -19 -39 -42 18 -23 -51 -8 41 -35 45 11 -3 49 25 13 -8 -37 -65 -32 -1 28 33
4275C3J1k4k6L9p8N7l1L4K0k8j2n0J08k4ml9j3L6L3m6L3lJm9j4M6l5M9m7K6J0
$$ 33 44 20 -6 33 -45 12 -19 15 35 7 -5 -55 53 29 25 -14 -27 9 42 -4 29 26 27 -22 -36 10 -25 24 -23 3 13
4306A3k4J3k9L8j2L1m8k1K6K3Mm8O7p3qL5Q3o6nPjk0k8J09n8j3K4m2m3P6j1k0
$$ 13 -11 2 -27 11 -1 30 -18 -39 -13 10 14 -34 33 -40 -48 -13 70 4 -1 6 5 -15 -43 66 8 -5 19 -23 -66 10 -1 -21
4338b1J5Mnl8k4K1R3k0n5O6l2k1L0M3m4n6J10J0j22j0P8k7O1r5P5j0k2JJ3n7J1
$$ -21 -6 -2 -7 -45 -69 -48 45 25 -30 36 4 -17 13 56 12 -44 66 76 -46 -56 22 -5 56 -39 36 26 4 5 18 -39 -28
4369b8J7M5q8M0pr4R7m9Q4l3PL3l5J7j1l6P6m7K1j6L0Qm9N9k4k0N3o1k4RK2NN3
$$ -28 -11 34 -54 -14 -21 -115 -18 -67 17 -16 -9 24 -11 6 -5 -41 35 -12 9 -7 23 31 -18 41 17 -3 50 -11 -35 -26 -4 1 54
4402E4jp4L7K0n4L4J8J3n1J0l2Q5o4m2O7J1m3qP1n3k2N9j1o0M4J2m1pJ7k0J2M7
$$ 54 53 -21 16 36 -18 16 34 47 -4 6 -26 59 -5 -47 20 31 -12 -20 51 -2 -24 35 24 -36 8 20 -21 -28 -11 -31 -19 28
4434B8j11Q8MOj7J6j4J2LM3m5L7n4KQj9L1l7K1OMK2k7j0J4nk5Q6p7L9m4K2k3L3
$$ 28 -83 5 9 15 -2 14 0 12 15 58 13 50 -4 -2 6 -13 18 -19 2 8 12 34 7 -3 11 6 -19 67 -10 29 -15 7 -16 17
4468A7n3K7OK6j9rp6K2R9J2l0n3K0k4N7J2j7K7m9K2k0k2J9j1QLPo8R2j0Om6K6
$$ 17 -36 -9 -3 23 4 -5 -81 -59 40 52 22 -31 -11 -35 22 34 17 44 -5 17 -3 -25 -6 -17 -9 -6 1 -67 25 15 21 -25 1
4501Ak6J5j0oj0j2N4l2KL9l2rP1n9NJ6l5K0m0N9L6p0N1j2J2l4Q1j01j5K7K5oJ9
$$ 1 -25 -10 -20 -26 -36 -48 6 -26 -24 15 -17 -26 45 -14 -9 7 -28 -8 -48 11 47 -23 28 16 28 -6 75 -26 -41 -14 11 5 24
4534B4l6j2J4j4K0k2L8o3M2JN5n8K0o0J7N7j0rl8M5j1L6k9Ok1L1qm9O4l9JM1k4
$$ 24 -12 -24 -10 -24 -4 -26 12 -51 -9 -8 47 -11 9 -51 -34 23 13 4 -34 11 0 36 7 13 -8 23 15 -34 30 -9 -8 33 9
4567IL7j2n5P2q8M9k6M4o9N5o1O4jk8kJ6J7k4j8Jj6M4M3q8K5k0L7km0RK2j1OJ5
$$ 9 46 34 -21 51 -37 12 -14 30 -39 16 -45 19 18 -10 -12 4 21 -3 -21 -20 -36 8 51 -37 -12 -32 5 3 -37 -28 -6 -17 -11 4
4601Dk8MRoj2P0o9L9N8o2Pl4K0Lj3N0k5K0j4k7M7l9j1M0m5L0nml2J0L8j7k5j0
$$ 4 -24 -20 -11 -17 -29 41 -28 11 69 7 14 -20 0 3 -10 40 15 35 21 -6 41 2 -9 31 -14 16 11 7 -25 -15 23 6 -19 -29
4635b9L3k1K9k9M0k3nK6k3l5J3j7R5j7j7qj7n4N5K5l7jj3N4%p6Q5m9j6N8m1mK1
$$ -29 4 -17 12 -17 23 0 -5 21 -2 -37 -24 -41 54 37 20 12 -5 -59 -4 21 -16 -17 -30 24 24 -52 33 -16 -32 26 -15 -19 2
4668Bm1%J6L2J0m8%oP6j9j5k8L8n8P4n6N5k3j1Ql5J1j2Q1m5nL5o6K5Oom5J7N4
$$ 2 -39 -39 -23 9 19 -29 -29 -35 41 22 7 -21 17 -41 33 -23 32 9 -2 6 -29 -18 -30 51 6 1 36 -30 -5 1 -5 -50 -33 21
4702B1p2K9O5l6j8%j8j4J8J8l9L8J7l9KmO0lj17J14j4m3N7r9J27p7LmNOK6Qn8
$$ 21 -51 -22 43 7 -11 -11 -29 -43 -25 -7 -46 -8 9 -30 -28 -32 28 25 -92 22 8 -35 22 -77 50 -27 -24 -28 -23 -17 9 17 -41
4735d1N0j1oJ6P0j3r8J1J0NM6rL0j3l3n4N6K0n9L0k4p3N8kK4Qn7K7N7l0l8Q0j1
$$ -41 9 -2 -8 8 78 65 -33 -22 -12 -7 39 30 60 47 14 -40 16 36 -23 7 -17 -90 -32 -34 -10 -2 -59 -32 25 -5 -43 37 26
4768B6j7k3j2J2JJ16q1K2p4K1k6K1k2L0Jk4P7o4K6l2KJ5Pm6l8Q0K6l7oP5j01O8
$$ 26 9 -14 -26 -14 -13 103 22 44 -30 -9 -35 -14 -36 -6 -5 -29 48 -16 10 -22 -20 -5 2 -44 -82 -2 24 -13 -19 56 -45 23
4800B3np2qM3L3jJ0k6j5L0J1J6m4k9R9n5k9Pj0M8k6m3Q5p6O4m1J7pK9k2l9R0o7
$$ 23 18 -54 -62 -19 14 13 23 -3 -18 12 23 39 -5 -34 65 10 -19 -12 -22 26 0 -43 42 -34 30 -11 6 -1 28 6 -33 57 -10
4833a0J6K2J3m4K5M6m0QKp9J5M7m3L3jk4%M8l5j6J4L2o8M4L9m9K6om7O7J2n5n
$$ -10 6 28 41 -3 22 68 28 36 38 -41 -26 21 -22 11 10 -14 -14 34 -1 -17 -3 29 -39 5 44 -5 21 15 -32 35 47 -8 -13
4866a3J1O6j25N8K2n8K0N8o6L0Jn1J8N2kK8j1LJ2l2m0PK8n5M7kk5j7K8k2J7PM1
$$ -13 -2 64 -61 -3 19 -39 -19 39 -27 3 4 -47 -29 23 21 49 38 41 53 21 -19 -12 16 -39 8 6 -19 -36 -8 -30 -13 -6 35
4899C5K5o4J4jM1l1K7j16P9l7NO1p5J9J7k1l0mR8r1O1JK5r4Q9o5L3j0J1J9%m2
$$ 35 60 -4 10 9 50 19 46 -70 9 -28 -23 38 -37 -18 -1 -22 -52 -56 42 -49 12 13 38 -56 33 -32 1 -9 2 21 21 -21
4931b1Qm5Q2L8p7j6O3l6oJ9Pj2%kj1Q1m8MN1o6QJ2j23R3n7L2mo1Q5pk0J9K0j0
$$ -21 -13 -58 24 62 -15 -31 32 -4 -10 9 16 4 4 2 -9 72 24 28 79 13 21 33 -90 3 -54 -22 -26 -87 -2 -9 -29 -10 10 0
4965@j8K2L5o6K4k8J21r6L6nl5K6k2J8k8J5nlJ1j5J9k6Lj6M1L8J8p6J3k7L3k6
$$ 0 -18 4 39 -27 -3 -31 90 -6 30 25 -10 16 -6 12 -16 -1 -6 -9 2 -13 6 -20 -17 -33 8 46 64 -12 1 -26 7 -19
4997a9K9o7J0L0L7j2n5mP1Kl1L7n0P7l2pOP9j08M3K3l1l3l4J1kJ4l0M0l7P2m5
$$ -19 10 -57 -47 -17 20 8 -47 -51 20 22 -9 28 -22 55 23 16 22 101 -7 36 59 28 -5 -39 -28 -30 -16 -46 -6 -43 29 -16
5029a6K7l5rO9m8L7m9MNjL8K3l1J0m5PJ3n7N5k6mJ8k1N7lqK4j9LnK5k6J8Km8n1
$$ -16 11 -24 -33 36 -12 25 -24 -20 -15 -16 22 45 14 24 -21 -14 -1 -58 -3 -29 -33 -15 -36 21 18 10 34 15 18 13 38 12 30 32 -16 -67
5065f7R2j3LJ1J3n6Pj9qK3R2p9j2M0oj0q0R0J4k6J0q8O7O4k5l2Pl0l7O0m3PQ0
$$ -67 25 12 15 26 39 -17 -10 -29 -37 -14 78 -1 -13 27 21 11 -69 21 35 9 19 -69 -2 62 37 5 12 -18 -55 5 -38 -31 49
5098D9L7q0N6r3M3M5o7P8k8QRl5j1m8NM7o1j2J2J3O8o7L1k3R0l1k6MLK6pn9J8
$$ 49 86 6 62 -31 12 57 -10 68 40 48 57 22 11 -37 -32 15 -46 -58 -46 -33 35 -32 -1 -24 66 35 9 13 16 42 35 -24 -6
5131fR0r4J6l5K0o1P2m2N2o4J4M2J8K1JJk0n4K5N1j4K0pn3k7L1j2%j4N8L5j52
$$ -6 84 -10 6 -29 -9 -70 2 -40 12 -52 -38 4 22 43 44 45 25 -29 -4 47 33 53 46 -7 -34 -3 -15 -15 -29 29 64 -88
5163h8Q0j4O8r0O3j0J8n1M3K2K0m5L8J9q1L0n8M1L2o8j5MN0N1m2LL2Qk3m0NK6
$$ -88 -8 -22 46 -44 19 9 27 -24 19 41 61 16 54 73 -8 22 -36 5 37 -31 -46 -42 8 59 17 20 52 60 37 -3 2 28
5195B8l6K0L8p8J4K9j1j5N4p0KJ8J3j4J5nJpL5j0l9M9m0K9J8LJ2r0K9Nm0M1KL
$$ 28 -8 12 50 -28 -14 15 4 -11 43 -27 -25 -7 6 -8 7 2 3 -4 31 21 -18 31 -9 20 38 41 53 -37 -8 -3 -43 -2 0 3
5229Cl2N6l2l2R1n0j7K9RJ4m2K7k3nO4o8lk8K5n8L2J7OPQ0q5O1n1N0m1oL2J2o4
$$ 3 -29 27 -5 -37 54 4 -13 16 25 39 -3 24 1 -4 60 -8 -11 -39 -14 -72 -40 -23 -17 -10 70 -15 46 -5 45 4 -2 30 42 -22
5263b2J2J7k4M8Km5J8jl2K3J5Mj6K3K7k5Jj6J5o1L7N7l7K5q1M1k8L3k2l2M2m7
$$ -22 -10 7 -17 31 33 -12 6 5 -27 -4 11 15 -1 22 49 24 25 9 24 -37 0 57 20 45 -36 5 -23 10 -12 -44 -2 -49
5295d9N5k7L5L9k8l5M8q5O2PM6n5m9Q4m8qP3q6l6K9LO6n4K6j6MNl2l6L4oL8mM1
$$ -49 6 -21 14 53 25 -10 38 -47 15 22 68 13 -36 48 0 -8 65 -21 -57 -28 -25 41 -13 13 -3 1 6 -26 -62 -28 -34 4 0 41
5329D1k5m6N6K1r3M6nN0j54J1N6NM0PJL0q1O8nLl2J7K6l0k3m5Q1m6K5l5L0%k7
$$ 41 16 -30 26 47 -46 0 -5 45 -109 -98 -42 -37 3 10 11 41 -40 28 23 26 -6 11 37 7 -16 -61 20 -26 -1 -36 -6 -6 -33
5362c3k1Q1Jn2J7kL7k2M4rl1Oj9O5m1m7jLM4n9L6j7J7J2m0J7O7o3nK8L8l5J6k9
$$ -33 -54 27 28 -24 -7 -9 28 6 50 41 10 16 -3 62 21 -26 -27 -24 20 -39 -3 -20 -3 9 -31 -14 53 -10 -15 13 51 16 32 3
5396CK5Kn4O3k2m1l8N8k8LLRoL9op2J17m8j02J54o7QJ5m1KQ3r8NJ9pM9p7o3J10
$$ 3 28 30 -24 39 17 -24 -62 -4 -32 -29 -26 -17 -23 16 10 -62 55 7 -95 59 -8 0 15 -26 -24 59 -39 -34 -15 -22 27 -50 -113 -3
5430cl1N4k9K2k5N2lo7L1K2J1o4L2J1m4N0n3K9j7l1N4lJ8o6Q5r3N5K6J8lk8%j5
$$ -3 -34 20 -9 13 -12 40 37 -30 1 23 34 -30 2 13 -31 19 -34 -5 -22 -53 1 -2 16 -50 35 -58 -3 23 41 38 10 10 -5
5463eL1nn4M5L5o5m1O3m8L1ll3J04o2n3M0K6KqKM4k0L9m2l3PRl1J0L2k2j0Om7
$$ -5 26 21 -33 12 47 -18 -59 4 -44 -13 -16 -49 55 -7 -60 -20 6 8 0 2 46 26 65 23 -10 -3 6 -25 -15 17 -5 -15 -9 -56
5497e6O3k7Q4l0p9M3M5q2O0J3Mm0l6J5K6M9l7j4k7K3jj5M8o6K2l7L0L4Mk3l0O0
$$ -56 7 -20 64 34 -45 -2 43 -39 21 34 38 -2 -38 -23 3 52 15 1 -26 -3 -4 -19 29 -37 -15 -52 -22 12 16 -7 -37 23
5529B3oJ3qk9LKl1J1LPk4J4k2lO1j7k4kK8K9o6O9m7KlL3K0r1N5j2Qm0j0Oj1K4
$$ 23 17 30 22 -7 -4 -2 -33 -22 -19 -12 -36 -22 -44 -47 14 -3 -27 -29 -1 28 -38 31 -16 -14 -17 16 36 -55 0 -12 -4 -44 -54 -48 -59 -35
5565c5N9l2j0K6k1J8m3J00j6j8l0l4N8j8J3l8qj7l7J5L9J6N8o7N8j5lM1l5j6M4
$$ -35 24 -8 -18 8 -13 5 -38 62 46 28 -2 -36 22 4 17 -21 -29 -46 -83 -68 -29 -13 45 -22 36 21 18 59 24 8 52
5596E2m9O0q1j5O0m6J0j3j2K9K8%k5k8mL1N2k3n8J6P1o2J6j5L1k5%k2L1l3K4j9
$$ 52 3 63 -18 -33 27 -19 -9 -22 -34 -5 23 23 -2 -30 -34 -3 49 26 -32 -16 55 -7 9 -6 25 0 0 -22 9 -24 0 -19
5628a9j5j7OO0l6l9N2K5m3J04m5J6jk4r2M6k5N7l4O8p2P1r6J9K3j5J7J6R3o6k8
$$ -19 -34 -51 -45 15 -21 -60 -8 17 -26 78 33 49 48 24 -68 -22 -47 10 -24 44 -28 43 -53 -34 -11 -26 -9 7 100 34 6
5659FK6j0j9k5L0J2J2L1p4o2N0K9m3J2QJ6k5m1L0M1j5j3N5rj8L2J3m1nJ1k8m3
$$ 6 32 22 3 -22 8 20 32 63 -11 -73 -23 6 -37 -25 -17 -1 -26 -67 -37 4 -11 -24 31 22 4 36 49 8 3 14 -14 -57
5691e7K6kmM4j02M5L5K3n5K3pM5K6K2l0rl5P3m4o4O8m0j5J02j23J7J3k0n2R1K3
$$ -57 -31 -33 -37 7 -95 -50 -15 8 -47 -24 -31 14 40 62 32 23 -12 61 17 -47 21 -19 -34 68 -55 -38 -25 -45 -97 -6 17
5722A7J4m8J5K1LJ8o3K6J9K9n0jL9o8L8l5k0R7p0J5lJ5K4o6J25p3J2Kj4k0K1j0
$$ 17 31 -17 -2 19 22 40 -23 3 22 51 1 0 39 -29 9 -26 -46 51 -19 -4 -7 8 32 -34 91 18 30 32 18 -2 19 9
5754IJ0L7n0l8j0J6k9J9kL1l3P6m9mM2n5J4L9pJP5k2k1l0L5r0oL0J1pJ0J1ml3
$$ 9 19 56 6 -32 -42 -26 -55 -36 -38 -7 -40 36 -13 -17 25 -30 -16 23 16 17 92 70 49 19 54 -36 -42 -12 -1 -8 2 13 9 -24
5788b4j4N2n0O6n1K2N7m2K4l4L6m7j7nk4N1K1m8l1N3l1J3N6jj0k3QJ1K6j9j6K7
$$ -24 -38 14 -36 30 -21 1 58 16 40 6 42 -5 -22 -27 -51 0 21 -27 -58 -5 -36 -23 33 32 22 -1 7 18 44 25 9 36
5820C6q2P0M8o6oj9k7jMRqP0l5k5M8ql3L7l9O5m5L1jqj2RKj5k2J3OqP0q5jm2Q2
$$ 36 -46 24 72 6 0 -19 -46 -47 -43 -34 -42 28 -7 -32 16 8 -25 12 -27 38 -7 24 23 15 3 12 14 -1 -23 -10 -4 -12 58 -27 -28 -70 12
5857A2l0L6Rm1K7j2L1K1k5qj6K1l1K7p6J7J0NJ2j7KJ6M4k2n6N4L8m0j1J4K1j5
$$ 12 -18 18 27 -14 13 1 32 53 28 20 4 25 -6 21 -55 -38 -28 -23 -11 -28 -26 -10 34 12 -44 10 48 8 -3 11 32 17
5889A7k8NP0j13O5K9o7l7k3M1RM8mk6N9j0m7kN1L1k2nk0J7Ln2K5k5J7m8O0pj7
$$ 17 -11 -6 64 -49 16 45 -22 -59 -82 -41 -32 16 12 -14 45 35 -12 -14 37 68 46 41 21 38 41 -11 14 -11 6 -42 18 11 -6
5922fqM5l3o6J04k5P8j11L0L4J1k1o9K9pL1l9J8j3O2n8J7j4k2J6M9k6m4L4mM5
$$ -6 -14 31 -2 -68 36 11 89 -22 8 42 53 32 -37 -8 -15 16 -23 -5 -18 44 -14 3 -11 -33 -17 32 6 -38 -4 -8 37
5953C7j2l9N1J6q5mO6n8j0K1p7N7K0mK6lPOk2J6oLNJ4o5R9m1m4P5k9p7P4n9KM8
$$ 37 25 -14 37 53 -32 -36 30 -28 -38 -17 -94 -37 -17 -21 5 2 9 15 -7 9 3 6 11 25 -40 59 18 -26 49 20 -57 17 -42 -40 8
5988Hk1N0l8lj0O9o4L1jKL3j7o6N4j6Ql3jm2N2nOk9M7k7K4J9k8j2P8r0mJ16q7
$$ 8 -13 37 -1 -4 -14 55 -9 22 21 23 56 39 -27 27 11 19 -14 -15 -57 -5 -10 -4 -33 14 -13 11 30 2 -10 68 -22 -26 90 3
6022Cl2QM1l3J2j7MJ9j3m5N4Jj9k4J6K5MK4O5r4O2qK8j16L0j1m5L1J2J5l7L5l0
$$ 3 -29 -21 20 -13 -1 -18 -14 5 -8 -53 1 2 -17 -41 -25 0 4 28 93 -1 61 53 81 -35 -5 -16 -61 -30 -18 -3 -40 -5 -35
6055c5J6ON6n0N7L3q9K8L2pL4p2K7p5J3KJ3NqJ9j2kkk8P8k5J1o8P2j3j7M1j7O7
$$ -35 -19 -13 43 -7 50 83 -6 22 54 47 81 9 36 -39 -26 -24 -11 -6 -14 5 -7 -9 -11 -39 39 14 25 -43 29 16 -1 40 23 90
6089I0q3m2jR4n1p4N8l8N2lqm1L9K5m3N4ll5R1p4j7K9K3n1J4k3K7Ok2J0J1j7K5
$$ 90 7 -35 -36 58 7 -67 -9 -47 5 2 -6 -47 -8 17 -26 28 25 -10 81 7 -10 19 42 -9 5 -18 9 15 -7 3 14 -3 22
6122B2p7M6K6l1P3q0L2J0m6O0k6K6k2N4q6k3J5O8J6j38J9M0K3n4O2K0q1J19p2
$$ 22 -55 -9 17 -14 59 -21 11 21 -25 35 9 35 13 67 -19 -42 -27 41 57 -81 -62 -22 1 -53 9 29 -52 67 -5
6151ejK4P1n3k1Kj7L2l3K7j1K2q6M3MK5m3Rjl8O4l6L6j1o0Q0K4k4J2l0l4K7k1
$$ -5 -6 18 89 36 15 17 0 32 -1 26 15 37 -49 -6 -2 23 -20 -11 -12 -50 14 -22 14 3 -57 23 47 23 35 5 -29 -2 -23
6184b3j8L5j3l7M6m3M0nOlN7j9L1J9%kl9n8RJ2M3o1K1oll1k8M9L9Kl1kL0j3K4
$$ -23 -41 -6 -19 -56 -10 -53 -13 -18 -12 -15 42 23 54 73 73 71 32 -26 -17 -5 38 -23 -2 -8 -11 -42 -70 -21 18 20 -11 -13 17 4 28
6219B8j0OK2m6M2o4M5l5m4LM9l5J0MJ8mN5o2M3l7jM0l7J05r9L5n6M7L9n6l4N7
$$ 28 18 24 46 0 42 -22 23 -12 -56 -53 -4 -39 -29 -25 -7 -11 44 -18 25 -12 -13 27 -10 95 -4 31 -25 22 61 5 -29 28
6251B8Nn8Pj2k3J4L3m6l0P2Rk8N0L0k4qJ3r6O1LK5l3j2L2rj0RnM3q1J5M4Ok9J5
$$ 28 33 -25 -18 -30 -53 -39 -6 -52 -82 -10 -1 -29 21 51 27 19 32 -64 -3 0 25 -8 -20 12 3 -7 2 -3 40 -41 -26 18 24 -5 10
6286A0Oj8J3L2Nk9n7J01p0K4m0oJ9kJRl7nqP9j0N1J7r8J1j8M2pQl2N7p3M8m0l2
$$ 10 16 -2 11 43 48 19 -38 63 -7 17 -23 -29 -10 -12 -11 -2 -39 -44 -52 27 17 68 85 -13 -2 -20 22 15 23 -9 48 -25 23 -17 -49
6321d9M1JO7j16Q1n6M3L2l4j8J1M6j9m5L0kn8N4K2r2KP4o7L4lj9K6K9pJ5q9N0
$$ -49 -8 -7 60 -56 25 -31 12 44 10 -8 3 49 30 -15 15 13 -45 9 31 -61 -59 15 -52 -18 -21 -40 -14 15 8 23 -66 -16
6353a6J5K3n6K8NK5m0K7P8m2p4J9l6N5oL4mn5O5j8m3kL5j9M0n1Q2j01L5o4N7j2
$$ -16 -1 22 -34 -6 -1 24 -16 11 89 47 -27 -8 -44 11 5 39 35 -20 45 27 -16 -18 17 -2 38 -13 69 -32 3 -61 -4 -16
6385a6j02J18j0J4k1K1m8N5j9Rj5L4rK2J4m8P3l3Lo9L6j9J0j0k0j0jJM3k6N2m3
$$ -16 -118 0 -10 4 -17 4 -44 11 -8 1 -14 20 11 33 47 -1 72 39 42 -27 9 -10 0 -10 -30 -40 -41 -40 3 -23 29 -14
6417a4n0Q8j3on7M8M1pk8KM4m1m5j9K1K2m5N6m8N0K7j03K9Q3m3MlN5o9N1l4k6
$$ -14 -64 24 11 5 -52 -4 37 30 2 4 48 7 -38 -57 -36 -14 -59 -3 -51 -1 26 -77 -48 35 -8 -4 -7 48 -21 30 -4 -30
6449c0L3j9j5J7oOK2J4k2K7l7L0l0M7QnOj4nm6J6K3j5k5jnm3K1O2n1L7m5L8K8
$$ -30 3 -16 -31 -14 -20 -14 8 22 0 27 -10 20 -10 37 45 40 46 32 27 -19 -3 20 5 -20 -21 -26 -69 -48 14 -37 0 -45 -7 21
6483B1o1R0j9K1l0K9l4pqL2m6M1%k0m7mj0N3n5N7o3M2Rl1N9k9M5k6M4Km2j2M3
$$ 21 -40 50 31 52 22 51 17 10 2 34 -12 29 29 9 -38 -42 -52 1 -54 3 -60 -18 -9 -40 19 -10 35 9 53 55 13 1 44
6516D4Ko4K0o6J6J4RO2m4j3j0M9J9o7O9j8k2K8j0koL2m5Pom7N8m1kK6m7J8QL9
$$ 44 46 -18 2 -64 -48 -34 -25 37 -7 -20 -30 19 38 -29 40 22 0 28 18 16 10 42 -3 4 -2 -49 9 -32 -34 -8 -55 -37 -29 10
6550A0pk2OM0QprP4o9l2nj4k6N6m7lN9o3K3L6m6P4L4p1Q0n7M3l7l6OM3n0Qk5N2
$$ 10 3 -19 -13 27 35 28 19 93 24 -8 -13 -27 -53 3 -44 -47 12 -51 -28 8 -38 36 70 -1 79 22 65 28 -8 -2 41 -9 -1 -26 26
6585B6Mq3O3k7O7p2j8L8j1M1k2o6J28q1MmJ7k3K2L8k4N4j01K1K5k6K8k3n0N2J
$$ 26 30 -53 10 -17 50 -22 -40 -2 -13 28 6 -60 68 -13 -9 -13 4 -19 3 41 17 71 -30 -9 16 -10 18 -5 -55 -3 -2
6616bqJj1l5N3mM1lpKo8M4L0m8Rm6N9K1o3k5jN3J9n2qL1LrN1n%kPok6O7j03K4
$$ -2 -10 -9 -20 -55 -2 -6 35 32 25 27 -41 3 33 -15 -6 -52 7 28 -35 -60 -61 -8 11 -41 -49 -18 -15 -24 27 22 22 20 27 21 -5 62 -41 -17
6654a7k9%P6j9j2l4M6Lo2J02n9n6O8k0L9n4Q5n5m0P0ll8J9l1%nPN3K1j04N1K4
$$ -17 -46 -46 30 11 -1 -35 11 14 -48 54 -5 -61 7 -13 26 -28 57 2 -38 32 29 -9 10 -21 -21 -26 -19 34 55 -49 2 26
6686B6J5k4M5m6k8K5N5k9n6J0Kj1Jj4L2k8N8m0mJ9J3o4N3n5L6nm1J29qn0k6M5
$$ 26 41 17 62 16 -12 13 68 39 -17 -7 -5 -16 -15 -29 3 -25 33 -7 -11 8 21 -43 10 -45 -9 -14 -55 74 66 16 -10 35
6718C5n5J2N6k0l0m1N5n9J4J3l2J06l1lm8O4o8L2N0m7M1L5n5LLn8N1ok4l2%P7
$$ 35 -20 -8 48 28 -2 -43 12 -47 -33 -20 -52 54 23 20 -28 36 -32 0 50 3 44 79 24 27 30 -28 23 17 -7 -39 -39 38
6750C8m0J6%nJ5kj7L4m6k4LP6l1j9k9M1Nm7J1RKlkM0n3J9J4l7L4K1o2O5J3Mn2
$$ 38 -2 14 14 9 24 22 5 39 -7 -31 -28 48 17 -2 -31 10 15 -32 -21 -12 -10 -13 -15 25 -28 -9 5 -32 2 23 -39 26 39 43 -9
6785iL1M1r8N8l5L9n5l3O2j9JJrM0M4p1j5K1O0q1j6N7m6O2l8L3k6j4J3m1N3lp9
$$ -9 22 63 -35 23 -12 27 -28 -61 1 -18 -17 -16 -25 15 59 -12 -27 -6 54 -27 -43 14 -32 30 -8 25 -1 -15 -2 -43 10 7 -72
6818g2Q5l3M0l1M1kJ2l5oj0j4kK2QkmK9l7mQ2j03PM8p8M7M6On2KO2o9l4J8N7j8
$$ -72 13 -20 20 -11 30 28 40 5 -1 -11 -25 -27 -5 3 1 -3 26 -11 -15 67 -36 -29 19 -59 -12 34 40 -12 -10 52 -17 -51 -33 24 6
6853Fm1L6Pm8N2l2L4o0N3lL3l9K1N2m1MN7j27L3LRJ9o6L5OJ8k6Q%k6M8p5L9M7
$$ 6 -35 1 8 -40 12 -20 14 -46 7 4 37 -2 19 71 30 34 91 -36 -3 0 9 28 -38 -3 3 21 -5 3 3 -23 25 -50 -11 36
6887C6%l7J2j6K5n6K2L6K4M5j06P5r9N9q1J5L2%N2K6m1k3PJ9nK3l6KO1l7j1pM2
$$ 36 36 -1 11 -5 20 -36 -14 22 46 91 -15 60 -39 20 -61 -46 -14 -14 38 64 23 0 7 26 21 44 8 10 71 34 23 16 58
6920E8k5qpo1N1k9L4k6m0O1k3N7l2l6K0K9j8p8J02l6j0N4n4Ok0J2lj6J4K2k4O3
$$ 58 33 25 18 -43 8 -21 13 -13 -53 8 -15 42 10 -26 -6 23 5 -73 29 -7 -17 37 -17 -11 -31 -19 -22 -38 -24 -2 -26 37
6952C7k9jJ6Rl0%KoJ4j7J8Kk9PK7o3N0rl1L3L4n2J9j0J4Pk0j1mM7N3o5j3K1o6
$$ 37 8 7 23 32 2 2 4 -2 12 -5 13 15 -14 -7 20 -43 7 -2 -33 0 34 -18 1 -9 5 12 -8 -19 -23 24 77 12 -1 20 -46
6987d6O8o5Q6J6Ln4J5k7o7J17n7pk4N1K1o1O3J0l2j8K8Oom8l1O6rRp5P2j9L2M6
$$ -46 22 -43 43 59 62 8 23 -4 -71 46 -11 -18 -42 9 30 -31 32 42 10 -8 20 26 20 -28 -59 7 -2 7 -68 4 -15 17 63
7020F3l4n9k0J13m6Ok4K0l6L5N0q5K7KoM4l5k1J1Jnk8Pk0N5M8n2L4kp4L4MJ4p0
$$ 63 29 -30 -50 63 17 23 -1 19 -17 18 68 -17 10 12 6 50 15 -6 5 6 1 -27 -20 -40 15 63 11 45 43 -31 3 7 21 -49
7054d9L3j6L5p3Q4k0k2J1K8J1l1kJ3n3O3ll5RJ08j09kK7k4m7M2nL5l2P8o2qKJ9
$$ -49 -16 -32 3 -70 14 -6 -28 -17 11 22 -9 -11 2 -51 12 9 -26 -17 91 -18 -20 7 -17 -64 -22 -27 8 -24 54 -8 -16 -14 5
7087EMm3P4m6KP6m0m0kK5l7K9k9j8k4O1L6n5l2O8j5M5m5j1J7mm3O2K0k9k4PK7
$$ 5 9 -34 40 -6 -4 72 32 -8 -10 15 -22 7 -22 -40 -64 -3 33 -22 -54 14 -1 44 -1 -12 5 1 -42 20 40 11 -13 -6 21
7120B1Ol1J2o6O3m5KJ2o6J65j38Q7n3L2L7o7N2Ml1lL7k8m8N7J3n8kj7j2J01j4
$$ 21 27 -4 8 -58 5 -40 -38 -26 -92 73 -65 22 -31 1 38 -29 23 27 -4 -7 30 2 -46 11 24 -34 -36 -53 -65 36 22
7151B2l2kJ7KKN2m0N0p2j4L1k3J5Kk0Mql6M5J4j8M%KM1l5K7l8L2n5R6m4m8Q1l2
$$ 22 -10 -12 5 7 9 61 21 71 -1 -15 16 -7 8 10 -10 -6 -14 -50 -5 9 -9 -5 -5 -3 38 3 30 -8 24 -31 65 21 -27 54 22
7186B2l2j2JM4o4K6NqK7Pn5J8rL3K0NnK5l2k8k1N1k0k4L1l9qP9p3pN0l6Qm4N5
$$ 22 -10 -22 -21 23 -41 -15 -10 -18 9 16 -39 -21 -30 3 23 28 23 48 16 -12 -33 18 -2 -26 5 -34 -42 37 -36 -43 7 -29 -21 -65 -10
7221a0j0M4q6K6QL1m8Q1l6J1n9O3l9P0p1j1L6%MM2j7r7R7l2K4o7Q4j4o2N3J8n7
$$ -10 -20 24 -62 -36 -28 3 -45 36 0 11 -48 15 -24 46 -25 -36 0 0 4 46 29 -68 29 -3 21 -46 38 24 -38 15 33 -24
7253b4%M3m5JOpo4Q7k1J5jkK3k3N6q2QM8j3k2M8k8l7J05p0J1jOp3M5l3R2lo6j6
$$ -24 -24 19 -26 -25 -19 -26 -90 -3 -24 -9 -10 -12 11 -12 44 -38 -30 18 5 -17 31 3 -34 71 1 12 11 17 -56 -11 -44 48 45 -21 -37
7288c7P9J6l7p0P8j3n5N2n5J1rM9J2n6j4K5k8P4K7n2N4m6l3M9l4J5j7L3L0n7J1
$$ -37 42 58 21 -49 29 16 -39 13 -42 -31 -40 9 21 -35 -49 -24 -52 22 49 -3 51 5 -28 21 -13 2 -15 18 48 -9 2
7319BJK3J7j6kn8L6J7RMo3j0M2Mj6JJ6L7n3J5n5Q9p7NO1j0n5K8j5L8J8mm8n5J00
$$ 2 3 26 43 27 25 -33 3 20 29 33 -30 -40 2 6 -10 -9 7 44 -9 6 -49 40 -37 -32 29 19 -36 -8 -23 15 33 29 -19 -74 26
7354B6k7j8L9l5pM3Pm3K4j4Q4p2n1M4rOJ2Kj4nlO6m9qm1L6qL5J9l8M9n5nj8Rl3
$$ 26 -1 -19 20 -15 -22 21 28 -15 9 -5 79 7 -44 0 -9 -3 9 11 -3 -8 -11 55 6 -2 -43 -7 -15 20 39 1 50 -5 -10 -28 -19 -52
7390e2L3j2M9j5n2L8N7p1qP3m0K7l2Kj5M0j4l7l8Q5J9p4O1kj4n2Q0M9q7l8P5n2
$$ -52 -19 -31 18 3 -49 -11 46 -25 -33 40 0 27 -5 -3 -18 22 8 -29 -67 18 37 -37 24 22 8 -44 36 85 -2 -40 35 -17
7422a7O0n1K5l6J6O1n0L1j25O4J3mQqL0l8J2oL9l5L7L9r2K6k8N5k4lO4j15P2N
$$ -17 43 -8 17 -19 -3 58 8 39 -86 -22 -9 -13 -5 -13 17 -21 -9 -15 24 -11 26 65 -27 -1 -29 26 2 -1 63 -52 20 25
7454B5J0p3J1MO3m8n5J03lJ1o5lL0n1K4l0O3J9l0k0L3k6j8L3o3N6n7K5nML7K4
$$ 25 35 -38 -27 -23 40 -8 -63 40 37 48 -17 -20 10 -41 -17 -47 16 35 5 -15 18 -8 -26 7 -56 0 -57 -32 -37 -33 4 28
7486B8rk0l7K6j1L1j7Pk5J4L8o0K2M5l6OJ0j6J9nKl5jL0j5OpK2K3o0K4Oj9l4J8
$$ 28 19 -1 -38 -12 -23 8 -9 -2 -27 -13 25 -35 -13 32 -4 2 12 -4 15 10 12 -23 -24 6 -9 -3 -10 12 35 -25 -1 5 -14 -48 -30
7521c0K5j8M0l6k5M6j6J2l5P2L1m7p9R6m2J6npk0M7J2k5k1J5l6K7k3k0KO0k6k6
$$ -30 -5 -23 17 -19 -44 2 -14 -2 -37 35 66 19 -60 36 -6 10 5 -2 -22 25 37 12 -9 6 -30 -3 -26 -46 -44 16 -10 -36
7553c6M9K3m3l9O6J6k3j3rqj6R4o2mK4J2n0M0o1O3j1jRl1K4J9l7l1P4l5j1L7J6
$$ -36 13 36 -7 -46 20 36 13 0 -9 -17 -33 61 -1 -5 19 31 -19 21 -40 23 12 11 20 -11 13 32 -5 -36 38 3 -8 29 45
7586D5j22J44p9ON9j8l0J6r3J09k5j4j8k9M4Kn0N5M3p5M7q3J22p5Qmm7K9M7l9
$$ 45 -77 67 -12 -6 53 35 5 21 -72 37 12 -2 -20 -49 -5 -3 -53 2 45 -30 17 -66 56 -19 -11 -15 -62 -33 14 -25
7616b5O3k7J8j6Lj1j9M8n2Rj2N4m9m6N8Lo9K6M3J7J5k8j1O8j09L0l1qP5j2K7k
$$ -25 38 11 29 13 16 5 -14 34 -18 -9 -21 33 -16 -62 -4 -1 -70 -44 -1 16 31 3 -8 60 -49 -19 -50 -58 17 5 32 30
7648C0l0m1j1J24j3o7J5oJ9oK4k2J5pn2J9m8M5k1P7L0o0L3Nq2R3o4K1q2M7j8n
$$ 30 0 -41 -52 72 59 -8 7 1 20 14 38 16 31 24 -28 -9 -57 -12 -33 44 74 14 47 52 -30 63 -1 20 -62 -15 -33 -38
7680c8M7qL9m3KmM6j5n1O6l7m6L9nJ1J1N6p2Nk9k8N4j1K2Pj8rK6j1N6%q4J4lJ4
$$ -38 9 1 40 -3 -1 -5 41 26 -25 41 4 -42 -3 -8 3 14 70 -2 3 -26 -54 0 -11 11 18 0 -9 17 6 62 62 -22 -8 -11 3
7715CM8o4J4J1n3M9ok0P1l6oq4N2J7Qo5L1lP0q1J02l5kpM6l3lk0Lj3o1L1P2p4
$$ 3 51 -13 1 12 -41 8 2 -18 53 17 11 -73 -21 -4 4 -61 -30 -33 37 -44 58 23 21 14 60 27 24 4 7 -6 -67 -36 36 -38
7749c8L3l4j8N0j5L6j5J5m1N2l3OjOjL3L1j0p5J1J0J0k0J8l7O2p4N7L9n2Ok6K5
$$ -38 -5 -39 -57 -7 -22 14 -1 14 -27 25 -8 -2 -3 3 2 35 66 56 -19 -8 2 12 -8 10 -27 35 -39 18 57 5 11 -15 10
7782A0J3o5Q9%j0mo7P6l8j8J0N8n8m1K6L5l2K5K9k7p%j0LN3k7k3k0J0M7n6l4J04
$$ 10 23 -42 47 47 37 33 -34 42 4 -14 -4 54 -4 -45 -19 16 -16 9 38 11 4 4 -6 -3 50 23 0 -20 -10 37 -19 -53 51
7815E1m1K5l3Nm8P3l8K6Jn0J9K9J4rk3L2pM3r0J1K5mK3l2n0Q6l0l1K7pN2p8J1
$$ 51 10 35 2 7 -41 32 -6 20 21 -29 -10 19 33 24 1 33 26 69 -21 -10 15 11 34 2 -48 38 8 -23 4 -3 49 -29 -18
7848a8KJ0L7n2K2L2o7nJ9K2m0P5n9P4q8J04k4n1J2jQM6%o5M1J0p7R1k0l2K2l0
$$ -18 -16 -6 31 -21 1 33 -34 -39 -20 2 -38 37 -22 52 -36 68 44 -7 5 4 12 58 58 -7 34 44 -33 58 38 6 28 -2
7880bm1L5J5J6j4K5m0j9rJ9o9R9J6k1J9k7j2RJ2j2lM0m7J3qQK7o0P8o1L6n8MQ7
$$ -2 -43 -8 7 23 9 34 -6 -25 -34 -15 -84 15 31 10 29 2 -10 -1 11 -1 -4 36 -11 2 -6 2 29 -31 47 -14 22 -36 -32 55
7914E5m1o2O1pk2%%R7j19K6M7qm5K7KM4p8J0j1O4k4p1J00r2M3J3M0m6qQk8j8O2
$$ 55 14 -48 13 6 -16 -16 -16 81 -38 -12 35 27 -18 9 11 55 -23 -13 -24 40 16 -55 45 -47 -4 9 49 3 -5 3 -25 -43 19
7947A9L4n1oj8L0Pk4O0k5K1j9p1K8QO2q1L1RKMm7J7K0J8m7J9nMl3M7j0J0M1p0
$$ 19 53 2 -4 -22 8 15 -9 51 26 47 28 -43 -15 -7 55 -26 5 14 16 20 -27 -10 10 28 -19 0 -5 -1 -34 13 3 13 54 -16
7981a6m0O6j9p0R3Ll0m2J21p7J1KPnKL0k2PJ7l5M8o1K2j9l2K7O0k5k5j0Jj0o1
$$ -16 -56 10 -9 -79 14 17 -13 -55 66 -11 0 2 9 4 6 36 14 21 38 3 51 -10 12 -7 -39 -12 48 23 -2 -12 -11 -21 -82
8014h2P4K4j9%JM2l9plnJ2j4N0L4p0rM1j9pMj2n5N4m2P4jk2RmmNNnN7l5k8L0K
$$ -82 -8 16 -3 -3 -2 40 1 -6 -9 -14 -2 -16 34 68 -2 -11 30 11 4 8 -4 -59 -5 -47 27 26 4 13 9 5 10 15 10 67 32 4 34 36
8052C6p4K4k7RQ7l9K8j10M5M0l9Nl5J11l3o3N9o0K2N3j4o1J48j35J2L4k8K6k8
$$ 36 -38 -14 -41 -32 55 16 44 -66 -21 19 -20 -15 -50 61 28 -35 24 -36 -14 39 25 -36 112 -23 -11 23 -5 21 -7
8081gL5n3J9qL9kn5J5lL9JRp7M7OK3jm8N6m4P3j0j05O4J1ro6J7mM7j3m7P7j3%
$$ -7 28 -25 -6 -14 25 23 -32 -17 -20 19 20 29 -48 -1 5 28 27 -21 35 -9 64 54 -51 13 24 15 -51 -34 -38 9 -4 -51 26 13 13
8116A3J5l5NR0j26K2k7P2m9M1pn3O5n2L5jO8p3Pl3J1M3j0pm4M1l6rN6m5jk1M0
$$ 13 28 -7 -2 88 -38 -16 -43 29 -20 21 14 -39 26 -26 9 8 76 3 10 -23 -12 31 21 14 -30 11 -25 -34 22 -23 -24 -45 -5
8149eJ3j9j3Q5r2NK9n4N6rRL4n7QK1j1l6N7j9j4K9l5k2N6j4J5m9L5K6oKo7PNJ1
$$ -5 8 -11 -24 61 -31 -26 3 -51 5 -4 5 39 -18 -10 11 0 -36 21 2 -12 17 -18 -40 16 2 17 -32 3 29 23 25 -42 -35 -30 -19
8184a9QL9n1j9K3nj
$$ -19 -11 28 -23 -42 -19 -24 -25
8191b5
$$ Imaginary data points
##PAGE= N=2
##DATA TABLE= (X++(I..I)), XYDATA
0@%%%%%%%%%Qj6J6j8K6l2M0n6P0p8R6j20J41j65J92k27K67l12L60m16M80n52O32
$$ 0 0 0 0 0 0 0 0 0 0 8 -8 8 -10 16 -16 24 -32 38 -40 56 -64 77 -88 104 -123 144 -168 192 -224 256 -296 336
32C36p15Q10r16J032j160J302j459J628j813K014k234K478k742L030l345L688
$$ 336 -379 431 -485 547 -613 689 -770 858 -955 1059 -1175 1303 -1439 1591 -1754 1934
48A934m064M478m935N437n991O606p297Q074q952R958j1123J2490j4118J6098
$$ 1934 -2130 2348 -2587 2850 -3141 3465 -3832 4242 -4710 5248 -5875 6615 -7503 8595
62H595j8569K1750k6021L2088m1437N7838r4738L21210p0869o31550M39576K59375
$$ 8595 -9974 11776 -14245 17843 -23594 34244 -60494 260716 189847 -441703 -2127 257248
74B57248l25618n9710L11223k22964j82326L72749J19295m64854J313L86446r3323
$$ 257248 -68370 -128080 183143 -39821 -222147 150602 269897 -194957 -193644 192802 99479
85I9479k73902J73280R1799j67826Q1894J56431k42810j11037L19188N9076l23613
$$ 99479 -174423 -1143 90656 -77170 4724 161155 -81655 -192692 126496 185572 -138041
96a38041K0189K17779j19128q6457K11072l6648k41853J21301K19062j72489j37052
$$ -138041 -117852 99927 -19201 -105658 105414 68766 -173087 -51786 167276 -5213 -142265
107a42265J86612J0101j87973J25243J74420j96288j03694K30251P187k39016
$$ -142265 44347 54448 -133525 -8282 166138 -30150 -133844 96407 103594 -135422
117a35422O6459K08878j24561j48179J68506P6134j76429R945J52454r5077j28227
$$ -135422 -68963 139915 15354 -132825 35681 111815 -64614 -54669 97785 2708 -125519
128a25519J32950R6995j18389l7301J00833j5241p1404N3004K4564p1413K4921
$$ -125519 7431 104426 -13963 -51264 49569 34328 -37076 15928 40492 -30921 -6000
139f000N3719p7634k0194J20182o354j39329J9158J21549l9954p7900O6079R358
$$ -6000 47719 -29915 -50109 70073 63719 -75610 -56452 65097 25143 -52757 13322 22680
151B2680r6399N9632J18114j00356j07656J23889P8932j33334m2192J21441j0443
$$ 22680 -73719 -14087 104027 3671 -103985 19904 98836 -34498 -76690 44751 34308
162C4308r2193O7720M5697j11392J2678J32666p0554j41053R8345J18971j06647
$$ 34308 -57885 9835 55532 -55860 -43182 89484 18930 -122123 -23778 95193 -11454
173a1454o1462J15773m010j05196P1774P7452j19282l7859J32372p828j14746
$$ -11454 -72916 42857 38847 -66349 5425 82877 -36405 -74264 58108 50280 -64466
184f4466N7715Q4996r8216m7532J12094r346j04301O5726P0059j05916j7934J25062
$$ -64466 -6751 78245 -19971 -67503 44591 35245 -69056 -3330 66729 -39187 -57121 67941
196F7941l0727j14811P5207Q4045j10644l7170J29979j7744j20932P1457Q5380
$$ 67941 37214 -77597 -2390 81655 -28989 -66159 63820 46076 -74856 -3399 81981
207H1981j08322l4320J20050k2619j16856O3960Q7436r6547l8268J16708j7484
$$ 81981 -26341 -60661 59389 36770 -80086 -16126 71310 -25237 -63505 53203 35719
218C5719j10682P0113Q2422j01678l8728J07419j0151r0377O1765O3946j01597
$$ 35719 -74963 -4850 77572 -24106 -62834 44585 34434 -55943 5822 69768 -31829
229c1829k7022J17163k2330j10859O1232P5516q4802k5094R1260k4837q0359O9953
$$ -31829 -58851 58312 35982 -74877 -13645 61871 -22931 -48025 43235 18398 -61961 7992
241G992N6598j02735k0287J16777j8780r9301N6896O1074q0709j3493Q8182l3989
$$ 7992 64590 -38145 -58432 58345 39565 -59736 -2840 58234 -22475 -35968 52214 18225
253A8225q4752O9312O3490r4539k8984J00633j4267q5106N4057N3895p8707j5710
$$ 18225 -66527 2785 66275 -28264 -57248 43385 29118 -55988 -1931 51964 -26743 -42453
265d2453Q7889j9679p9554N4016O0209p6956k5675Q4581j7371p6375N0998M9718
$$ -42453 45436 25757 -53797 219 60428 -16528 -42203 42378 25007 -51368 -370 49348
277D9348p3181j8557P9049j4375p2095M5213N0770p0039j7488Q2007j7969p1910
$$ 49348 -23833 -42390 36659 22284 -49811 -4598 46172 -23867 -41355 40652 22683 -49227
289d9227N0703N0199o8493j9847P3761j3121o8445M3736M8679o9492j9433P8562
$$ -49227 1476 51675 -16818 -36665 37096 23975 -44470 -734 47945 -21547 -40980 37582
301C7582j6230p1637M4430N0243o1848k1975O9227p248o3904L8626M8990o0807
$$ 37582 21352 -50285 -5855 44388 -17460 -39435 29792 22544 -41360 -2734 46256 -14551
313a4551k0521P1079j0729o4868L6138M5487n3876k2346O0286n676n9197L2493
$$ -14551 -35072 36007 25278 -39590 -3452 42035 -11841 -34187 26099 20423 -38774 -6281
325f281M4317n4843j9575O3920p996n6897L3281M2358m8327j9960N7593m594n6621
$$ -6281 38036 -16807 -36382 27538 19542 -37355 -4074 38284 -10043 -30003 27590 22996 -33625
338c3625L0406M3536n1539k0793N9172p589n5905K9483M1262m6604k2357N6057
$$ -33625 -3219 40317 -11222 -32015 27157 19568 -36337 -6854 34408 -12196 -34553 21504
350B1504q54n5331K6897M4170m6010k0673N5976l537n2338K5516M1040m1643k4560
$$ 21504 20650 -34681 -7784 36386 -9624 -30297 25679 22142 -30196 -4680 36360 -5283 -29843
363b9843N0445J408n2091K1794M0246m2272k1306N0747j145m8327K0957L9173
$$ -29843 20602 22010 -30081 -8287 31959 -10313 -31619 19128 17983 -30344 -9387 29786
375B9786l5119k2080M6506J929m7706K1689L9152l9313k1401M6665K15m5417J7372
$$ 29786 -5333 -27413 19093 21022 -26684 -4995 34157 -5156 -26557 20108 20323 -25094 -7722
388g722L5226l4372k1399M4795J339m7914K0065L9783l5540k1626M3231K451m0682
$$ -7722 27504 -6868 -28267 16528 17867 -30047 -9982 29801 -5739 -27365 15866 18317 -22365
401b2365J7651L4033l3381k1149M4631K826m6916J5994L6267l2357j9555L8512
$$ -22365 -4714 29319 -4062 -25211 19420 22246 -24670 -8676 27591 -4766 -24321 14191
413A4191p73l9091J8205L3605l2448k1820M2444N517m1439J4283L2414k8295j5663
$$ 14191 13418 -25673 -7468 26137 -6311 -28131 14313 19830 -21609 -7326 25088 -3207 -18870
426a8870L6144q13l7053J4979L1557k8201k1548L4867L618l5504J4239K6723k8150
$$ -18870 17274 16461 -20592 -5613 25944 -2257 -23805 11062 14680 -20824 -6585 20138 -8012
439h012j3348L5287M81l5236J2752L1299k3066j9286L1807L606l2423J2609K5319
$$ -8012 -21360 13927 14408 -20828 -8076 23223 157 -19129 12678 16284 -16139 -3530 21789
452B1789k4978j5257K9168K427l0025R003K4884k1173j5224K9685Q81l0534J4379
$$ 21789 -3189 -18446 10722 13149 -16876 -7873 17011 -4162 -19386 10299 11180 -19354 -4975
465d975K5488k3617j4598K9281M133k9310Q373K5968k1006j8331K8529N084l0197
$$ -4975 20513 -3104 -17702 11579 15712 -13598 -5225 20743 -263 -18594 9935 15019 -15178
478a5178O734K3124j6370j3790K1560K685k3944Q738K2963j8511j4544K6463L482
$$ -15178 -8444 14680 -1690 -15480 6080 8765 -15179 -6441 16522 -1989 -16533 9930 13412
491A3412k5836R472K0183j8793j2178K4297K242k7816P077K5558j7411j7969K2440
$$ 13412 -12424 -2952 17231 -1562 -13740 10557 12799 -15017 -7940 17618 207 -17762 4678
504D678M138k2405R353J8044j8406j0818K4677L863k4774O801K1054j6971j1129
$$ 4678 8816 -13589 -4236 13808 -4598 -15416 9261 13124 -11650 -4849 16205 -766 -11895
517a1895K4322k132k6783J2569K3080j9805j7734K2056Q216k2683K735J8497j4264
$$ -11895 12427 10295 -16488 -3919 19161 -644 -18378 3678 11894 -10789 -8054 10443 -3821
530c821r530K3382R79k4019O674K0184j0263j1553J2997O03j4761J1590J3425
$$ -3821 -13351 10031 11010 -13009 -6335 13849 3586 -7967 5030 5633 -9128 2462 15887
543A5887k2862r480K6671J489k4891M537J7598j0195q564J5888l55j8988J0792
$$ 15887 -6975 -16455 10216 11705 -13186 -8649 8949 -1246 -9810 6078 5723 -13265 -2473
556b473J9883j7341j4243J9268N945j5480L058R699j1505m896J7481j627k1918
$$ -2473 17410 69 -14174 5094 11039 -4441 -1383 8316 -3189 -8085 9396 7769 -14149
569a4149P176J8980j3311j1008J6335K096j5117O559J3052j1930r036J6357M169
$$ -14149 -6973 12007 -1304 -12312 4023 6119 -8998 -2439 10613 -1317 -10353 6004 10173
582A0173j6552L443J2876r885n660J2157l390j3217Q347J0596j1991o607J3564
$$ 10173 -6379 -2936 9940 55 -5605 6552 3162 -10055 -1708 8888 -3103 -9710 3854
595C854O6j3410Q725J0873j4619m806J7231m74j4675N700J1436r726p026J2927
$$ 3854 3920 -9490 -765 10108 -4511 -9317 7914 7440 -7235 -1535 9901 175 -6851 6076
609F076P27j4653M814J0249j0676m419J2640j520j1606N958R512r382n634J2923
$$ 6076 6803 -7850 -3036 7213 -3463 -7882 4758 3238 -8368 -2410 7102 -2280 -7914 5009
623E009R87j2634N949R912j0120l634J1621k690j2332O022J0568r230p947J0357
$$ 5009 5996 -6638 -689 9223 -897 -4531 7090 4400 -7932 -1910 8658 -572 -8519 1838
637A838J387r833O201O437j1820j714J4102j638j2011N698R899q598n272J1738
$$ 1838 3225 -6608 -407 6030 -5790 -7504 6598 4960 -7051 -1353 8546 -52 -5324 6414
651F414r96j2029O931P825j1963l606J2632q85j1922L976R136p478m717J0457
$$ 6414 5418 -6611 320 8145 -3818 -7424 5208 4323 -7599 -3623 5513 -1965 -6682 3775
665C775j121r981P652P754r803k363J0287k154r476N660P191r135m065J0259k102
$$ 3775 2654 -7327 325 8079 -1724 -4087 6200 4046 -5430 230 7421 -1714 -5779 4480 2378
680B378r485P254N303j0668j244J0648j825q431N434O487p876j632J0233l320
$$ 2378 -7107 147 5450 -5218 -6462 4186 2361 -6070 -636 5851 -2025 -3657 6576 3256
694C256r076P669N221r656j304Q672k526p746N082M844q791j347J0319l238q903
$$ 3256 -5820 1849 7070 -2586 -3890 4782 2256 -5490 -408 4436 -4355 -5702 4617 1379 -7524
709g524O992N846p239p46P250k869n993O526M916r497k358J0245k140q337N031
$$ -7524 -532 5314 -1925 -2671 4579 1710 -4283 2243 7159 -2338 -4696 5549 3409 -4928 103
724A03L248p288K60P450l640p184O642O282q485k425R460j754o689O055L127p852
$$ 103 3351 -3937 -3677 3773 133 -7051 -409 5873 -2612 -5037 4423 2669 -4020 2035 5162 -2690
740b690M36Q350l351q390N604N746q709j917Q632l658o759P494L373q570K95Q904
$$ -2690 -2254 6096 2745 -5645 -41 5705 -3004 -4921 3711 53 -6706 788 4161 -4409 -4114 4790
756D790k718p386O495N302q924m78R556m526p312P256L148q772l34Q022l524p377
$$ 4790 2072 -5314 1181 6483 -2441 -2919 6637 2111 -5201 2055 5203 -3569 -3903 4119 595 -6782
772f782O887M523r257K54R582m421o588P740L270q081N98Q282l768p019P006L737
$$ -6782 105 4628 -4629 -4375 5207 786 -5802 1938 5208 -2873 -2275 6007 2239 -4780 2226 5963
788E963r810L43Q900n453o422P675K472q379Q01Q174l843o512P741L732r409J510
$$ 5963 -3847 -3504 5396 -57 -6479 1196 3668 -4711 -3910 4264 421 -6091 1650 5382 -4027 -2517
804b517R335n301o169P465K427q248N21P554m621o648P528L155r795J273Q820
$$ -2517 6818 1517 -4652 2813 5240 -3008 -2487 5067 446 -6202 1326 4481 -5314 -4041 4779
819D779n168n651P405K774p616J093Q040m128o325P772L117r553R83Q229n126
$$ 4779 -389 -6040 1365 4139 -3477 -2384 5656 1528 -4797 2975 6092 -3461 -2478 5751 625
834F25n867O717K249q053N75P840m059o658P777L359q888J460Q560m531n423O788
$$ 625 -5242 1475 3724 -4329 -3754 4086 27 -6631 1146 4505 -4383 -2923 5637 1106 -4317 2471
850B471K804p902L84Q120m447p141P491L124r373P79Q030m765n653O917K982p968
$$ 2471 5275 -2627 -2243 5877 1430 -5711 1780 4904 -4469 -3690 4340 -425 -6078 839 3821 -4147
866d147M94Q887l841o923P889L549r055J213P961m899n955O950K895q952j56Q890
$$ -4147 -3653 5234 1393 -5530 2359 5908 -3147 -1934 6027 1128 -4827 2123 5018 -3934 -4090 4800
882D800m308p302P664L244r014J590Q481m790n960P524L859q532n8Q898m114p072
$$ 4800 492 -6810 854 4098 -4916 -3326 5155 365 -5595 1929 5788 -2744 -2802 6096 1982 -5090
898e090P669K695r554J378Q168n062o581O922L722q609J56Q981m554o498Q657
$$ -5090 2579 5274 -4280 -2902 5266 204 -6377 545 4267 -4342 -4186 4795 241 -6257 2400
913B400K989r508J610Q826m517o540O862L476q813K07Q695n210p126Q195K773
$$ 2400 5389 -4119 -2509 6317 1800 -4740 2122 5598 -3215 -3008 5687 477 -6649 1546 4319
928D319r295J102Q197m255n891P208L323q625J047R352n053o862Q370K882r205
$$ 4319 -4976 -3874 4323 68 -5823 1385 4708 -3917 -2870 6482 1429 -5433 2937 5819 -3386
943c386R29P864m576o358O769L292r169K53R149m643o537P712K826q194J475P956
$$ -3386 -2457 5407 831 -5527 1242 4534 -4635 -4382 4767 124 -6413 1299 4125 -4069 -2594 5362
959E362m249n921P225L520r065L83Q876n023o588P321K584q656N66P803l796o476
$$ 5362 1113 -4808 2417 5937 -3128 -2745 6131 1108 -5480 1841 4425 -4231 -3665 4138 342 -6134
975f134O561M036q347L48Q639m127o018P344K938p989N32P611l601o682O280L661
$$ -6134 427 4463 -3884 -3536 5103 976 -5042 2302 5240 -2749 -2217 5394 1793 -4889 1391 5052
991E052q904J03Q610m499o880P065L568p907q2Q089k784o644O442M494q527k04
$$ 5052 -3852 -3749 4861 362 -6518 547 4115 -3792 -3874 4215 1431 -5213 1229 5723 -2804 -3008
1007c008Q849l768o765O344L272p885m30P719l397p202O598M421q975l62R171
$$ -3008 5841 2073 -4692 1652 4924 -2961 -3391 4328 931 -6271 327 4748 -4227 -4589 4582
1022D582l491o595O566L795p629m4Q444l233p432O425M453q710m97Q098l988o265
$$ 4582 1091 -5504 1062 4857 -2772 -2816 5628 2395 -5037 1388 5841 -2869 -3366 4732 744 -5521
1038e521O516L029q180k25Q489k975p094O732M457q410J53Q409l727o302O470
$$ -5521 995 4024 -4156 -4381 4108 1133 -5961 771 5228 -3182 -3029 5380 1653 -4649 1821
1053A821L860p852j280Q017k632p297N630M131q107j84P881l416o243N611M428
$$ 1821 5681 -2171 -3451 4566 1934 -5363 267 4398 -3709 -3893 3988 572 -5671 -60 4368
1068D368o782j051P785k103o818O074M371q139p97P850k790o691N020M153p278
$$ 4368 -2414 -3465 4320 2217 -4601 1473 5844 -2295 -3092 4758 1968 -4723 297 4450 -2828
1083b828j685P980k071p359N827M727p696p15Q183k347o631N205M936p117j809
$$ -2828 -4513 3467 1396 -5963 -136 4591 -3105 -3820 4363 2016 -4615 590 5526 -1591 -3400
1098c400Q343k169p861N494M789q051j358P965k385p035M912N105o920j932Q279
$$ -3400 4943 2774 -5087 407 5196 -2855 -4213 3752 1367 -5668 -756 4349 -2571 -4503 3776
1113C776j634p148N844M718p579j200P743j943o552M584M212p092j760P917k277
$$ 3776 2142 -5006 838 5556 -2023 -3223 4520 2577 -3975 609 4821 -2271 -4031 3886 1609
1128A609p413N377M577p109j032P392j866o211M796M861o572j700P799j741o953
$$ 1609 -5804 -427 4150 -2959 -3991 3401 1535 -4676 120 4981 -1591 -3291 4508 2767 -4186
1143d186M900M160o730j425O700j831o340M069M753o397k285P492j199o387M742
$$ -4186 714 4874 -1856 -3281 3419 1588 -4752 -683 4070 -2327 -4612 2880 1681 -4706 36
1158C6M355o266j271O926q47o327L322M907n805k421O975j444o820M005M557n797
$$ 36 4391 -1875 -3146 3780 2933 -3394 -72 4835 -970 -3391 3584 2140 -4680 -675 3882 -1915
1174a915k195O278m34o129L308N347n639k367P267o35o552L834M614n489k265
$$ -1915 -4110 2168 1734 -4395 -1087 4260 -1379 -3746 3521 2886 -3666 168 4782 -707 -2972
1189b972O079n85o437L105N021n992k776P033o04o339L530M548n309j956O616
$$ -2972 3107 2522 -3915 -810 4211 -1781 -4557 2476 1872 -4467 -937 3611 -1698 -3654 2962
1204B962j01o492L162N416n457k665O632q21o376L397M364n382k628O069J7o408
$$ 2962 2861 -3631 -469 4947 -510 -3175 3457 2636 -3740 -343 4021 -1361 -3989 2080 2097 -4311
1220d311K776N224n114k529O634l58n843L211M698m642k667N753J93o082K456
$$ -4311 -1535 3689 -1425 -3954 2680 2322 -3521 -310 4388 -254 -2921 2832 3025 -3057 -601
1235f01M894n383k743O229m73n902K558M469m317k575N814M28o071K686N397m743
$$ -601 4293 -1090 -3833 2396 1923 -3979 -1421 3048 -1269 -3844 1970 2398 -3673 -987 4410 -333
1251c33k812O104j1n772K368M482m473l062N588M34o346K231N108m799k731N896
$$ -333 -3145 2959 2948 -2824 -456 4026 -447 -3509 2079 2513 -3833 -1602 3506 -1293 -4024 1872
1267A872Q4n421K404M841l962k997N591Q14n932K146M788m595k759N393O2n552
$$ 1872 1956 -3465 -1061 3780 -182 -3179 2412 3226 -2706 -560 4228 -367 -3126 2267 2329 -3223
1283c223J752M426l764l066N215P42n676K240M936m131k557N389M30n035J720
$$ -3223 -1471 2955 -809 -3875 1340 2082 -3594 -1354 3582 -549 -3106 2283 2713 -2322 -602
1298f02M454l544l217N004O59n787J704M600m082k850M940N73m956J406M633l173
$$ -602 3852 308 -2909 2095 2754 -3033 -1329 3271 -811 -3661 1279 1852 -3104 -1698 2935 -238
1314b38l102N098J104n319J727M623l693k752M650N84n011R94M335l251l442M675
$$ -238 -3340 1758 2862 -2457 -730 3893 200 -2552 2098 2682 -2329 -1335 3000 -251 -3693 982
1330I82J093n352J521M517l278k633M496J050m517J112M447k839l200M530R95
$$ 982 2075 -3277 -1756 2761 -517 -3150 1346 2396 -2121 -1009 3438 599 -2601 1929 2924
1345B924n079J138M168l368k859M064Q30m537Q40M285k686l194M526J272m769
$$ 2924 -2155 -1017 3151 -217 -3076 988 1818 -2719 -1879 2406 -280 -3474 1052 2324 -2445
1360b445J363M305k854k641L935J082m448N87M181k734l349M119R97m749J048
$$ -2445 -1082 3223 369 -2272 1663 2745 -1703 -1116 3065 331 -3018 1101 2098 -2651 -1603
1375a603L882k739k688L789J374m167O63M304k344k925M057J150m431J025L654
$$ -1603 2279 -460 -3148 641 2015 -2152 -1489 2815 471 -2454 1603 2753 -1678 -653 3001
1390C001k675k667L367J038m080K02L924k337k946L854R97l986R77L631k112k333
$$ 3001 326 -2341 1026 2064 -2016 -1814 2110 -227 -3173 681 1678 -2308 -1331 2300 188 -2145
1406b145L244J382l734L33L820k228k965L453J033m089N01L284k006k656K905
$$ -2145 1099 2481 -1253 -920 2900 672 -2293 1160 2193 -1896 -1395 1889 -117 -2773 132
1421A32J511l601J12L952j862k668L340J340l496M46L302j652k607K610J500l718
$$ 132 1643 -1958 -1846 2106 244 -2424 916 2256 -1240 -794 2508 856 -1751 859 2359 -1359
1437a359o8L541j920k891K952J207l423L00L281j414k495K703J758l325N6L689
$$ -1359 -1427 2114 194 -2697 255 1462 -1961 -1661 1620 206 -2289 414 2172 -1153 -1097 2592
1453B592j766k680K934J178l414Q6K949j503k755K417J595l392j37L611j695k465
$$ 2592 826 -1854 1080 2258 -1156 -1070 1879 376 -2379 38 1633 -1759 -1896 1715 20 -2445
1469b445K850J383k980J24L149j179k427K365J582l365q9L161j720k496K565R73
$$ -2445 405 1788 -1192 -1068 2081 902 -1525 840 2422 -943 -1032 2129 409 -2087 478 1451
1485A451l022mK779j138k405K312J713k977J27L068j350k039K394J136k652j65
$$ 1451 -1571 -1575 1204 66 -2339 -27 1686 -1291 -1164 1904 554 -1485 909 2045 -607 -772
1501g72K682j210k436K031J429l139j87K909j402k145K192J197k408l2K755o99
$$ -772 1910 700 -1736 295 1724 -1415 -1602 1307 -95 -2240 -48 1149 -1259 -1291 1464 765
1517G65k350K045J685k805l8K718j215k255J913J078k526m04K593r85k424K030
$$ 765 -1585 460 2145 -660 -698 2020 805 -1450 463 1541 -985 -1389 1204 219 -2205 -175
1533a75J501k669p2K773j082j860K054J302k277k70K477o48k371J854J240k732
$$ -175 1326 -1343 -1415 1358 276 -1584 470 1772 -505 -775 1702 1054 -1317 537 1777 -955
1549i55q6K408j278j983J780J104k236j69K510p52k043J990J365k412J54K302
$$ -955 -1041 1367 89 -1894 -114 990 -1246 -1415 1095 343 -1700 290 1655 -757 -603 1699
1565A699r81j651J543R92k071m53K056q23j936J615R71k260J11J975p77j535J537
$$ 1699 718 -933 610 1602 -469 -922 1134 311 -1625 -10 961 -1299 -1188 787 10 -1525 12
1582A2J157j681k37K194o35j888J511J165j988k10J907q42j745J160J054j779
$$ 12 1169 -512 -749 1445 810 -1078 433 1598 -390 -600 1307 465 -1280 -120 934 -845
1598h45n62K044m70j882J746J071j890q2J995m98j396J266J092j803m77K061n96
$$ -845 -1407 637 167 -1715 31 1102 -788 -870 1125 627 -769 497 1589 -214 -691 1370 774
1615G74j976J291R24j972j89J783n98j608J230J058j510j99K126o36j607J591
$$ 774 -1202 89 1013 -959 -1148 635 37 -1571 -341 717 -793 -992 1134 498 -1109 482
1631D82Q91j719N4J641p60j471J101Q98j794m40J828p47j462J416P32j720J38
$$ 482 1373 -346 -292 1349 589 -882 219 1117 -677 -1117 711 -36 -1498 -82 650 -1070 -932
1648i32J639m91j138J186J021j513j57J788p79j388J240M91j515oJ229n94j328
$$ -932 707 216 -922 264 1285 -228 -385 1403 624 -764 476 967 -548 -554 675 81 -1247
1665a247R63Q11j364j47J610o44j071J347P00j237PJ283m27j080R45P86j555k78
$$ -1247 -284 527 -837 -984 626 -18 -1089 258 958 -279 -272 1011 584 -496 449 1235 -320 -598
1683e98J448o95j207J065L98j331Q8J208l80j014R33R05j207l2J621p38r74J089
$$ -598 850 155 -1052 13 411 -920 -832 376 -4 -1018 -85 820 -387 -419 1202 464 -510 579
1701E79M50j220j10J113n78j113P72O62j450NJ338p46q88J250M85j086J30J144
$$ 579 1029 -191 -301 812 234 -879 -107 555 -895 -890 448 -298 -1186 64 549 -537 -407 737
1719G37k88r60R88O56j403M2J278q26q75Q92J68j140M2R84n05q80R26P11j292
$$ 737 449 -511 477 1133 -270 -228 1050 224 -651 241 409 -731 -689 295 -210 -1090 -164 547 -745
1738g45K51J272o54o43J044L74r50qR50m68j021Q88M06j335M5J007p21o42Q02
$$ -745 -494 778 124 -519 525 899 -51 -59 891 423 -598 290 696 -639 -594 413 -308 -950 -148
1757a48L08q35P5J072l24p33R46N46j189K68J067o87p17P21K35r78p6Q81m68r85
$$ -148 160 -675 -600 472 148 -585 361 907 -282 -14 1053 366 -351 370 605 -373 -449 432 -36 -1021
1777a021Q86M47j135J60J150o10n25R01M08q81P9J048m98q64J019K84j301J99
$$ -1021 -135 312 -823 -663 487 -123 -648 253 661 -220 -141 907 409 -455 564 848 -453 -254
1795b54Q65p51o93Q28K34r62O2R84m42p76J135K85r96M28R15o06n57R00J71r82
$$ -254 611 -140 -833 -5 229 -733 -671 313 -129 -905 230 515 -481 -53 862 256 -301 599 770 -212
1815b12K6R09o52r79J045J34j108L46P77o62m18Q46K85p78J95J032n80o46J106
$$ -212 -186 723 71 -908 137 271 -837 -491 286 -376 -794 52 337 -441 -246 786 206 -440 666
1834F66J86j117L25P52p45n45O84J42j011J20R30p22o56J116J32r46N19Q31o13
$$ 666 852 -265 60 812 67 -478 206 348 -663 -543 387 -335 -991 125 257 -689 -170 661 48
1853D8l80Q52K05q63J72R13p53o94R70m5j065L06O62p30l74O78K64q31K41R66
$$ 48 -332 520 725 -138 34 947 194 -500 470 425 -640 -334 328 -402 -776 -98 166 -665 -424 542
1873E42n54n26J081Q6q98M04P62o84m72O60J47j021J18R39q67n61Q85N0q65L75
$$ 542 -12 -538 543 629 -269 135 897 213 -259 401 548 -473 -355 584 -283 -844 41 91 -774 -399
1893c99P85m99m02Q12L49r48K99R55o75n71R11o5r18K08N92o56n39P50J99r55
$$ -399 386 -113 -515 297 646 -302 -3 952 277 -294 617 552 -366 -158 434 -222 -761 -11 188 -767
1913g67K09R67o42m80R72J59p85L73P11m84n31P83K85j092J67Q64q25n49Q34m9
$$ -767 -558 409 -233 -713 259 418 -367 6 717 233 -298 485 770 -322 -155 709 -116 -665 169 120
1933A20q62K81P08n21m78Q86K69r17L77R40o70m26Q89P4r00K45O39n78o36P76
$$ 120 -742 -461 247 -274 -752 134 403 -514 -137 803 133 -293 596 670 -230 15 654 76 -560 216
1953B16J44j145K81Q64p14n08R58J80q45M01P99m79n57R64K61j082L23Q40q57
$$ 216 360 -785 -504 360 -354 -862 96 276 -569 -168 631 152 -405 559 820 -262 61 901 44
1972D4n19Q80n4r35J57P58o27n73R72J68j063M40R95p40l75R22J72q39K34Q53
$$ 44 -475 405 351 -584 -427 331 -296 -869 103 271 -792 -352 643 -97 -472 450 622 -217 17 870
1992H70p07n84Q85M3j109L79P55q99m17Q36Np83L46Q37n60n04J038K26j054N17
$$ 870 163 -421 464 507 -602 -223 532 -367 -784 52 57 -726 -380 457 -103 -607 431 657 -397 120
2012A20P66p92l80Q22J4r04J46O80n71o14P63J06j010N01P48o70k61Q69Q7p45
$$ 120 886 94 -286 536 550 -354 -208 472 -99 -713 50 156 -854 -353 395 -275 -536 333 420 -325
2032c25K93R00o89n24R18P3r60K70O49p62m52O62J33q35J20Q20n23n75J024J85
$$ -325 -32 868 179 -345 573 646 -314 -44 605 -157 -609 53 186 -649 -529 291 -232 -807 217 402
2052D02r02M61Q20o97l14P80J38r12J70Q41p06p14Q71P1j017L22P30o54m01P22
$$ 402 -500 -39 781 84 -230 550 688 -224 -54 787 81 -633 238 309 -708 -386 344 -310 -711 11
2072A1L11p92J66R55n89m93J025J26r93L08P01o79n31P19J15r43J53Q22o14n97
$$ 11 322 -470 -304 651 62 -431 594 720 -273 35 736 57 -474 245 360 -583 -430 392 -222 -819
2092h19R41M9q76M25P89n01l88Q20K05q28J94Q79o50o80Q76%q75J69O13n59n51
$$ -819 122 171 -705 -280 509 8 -380 440 645 -183 11 890 240 -440 436 436 -439 -270 343 -216 -767
2113g67P42L07q50O8R56n59n16J013K45q99K30Q13n29n77O99K96j079P0R26o99
$$ -767 -25 282 -568 -500 456 -103 -619 394 639 -260 -30 783 254 -323 376 672 -407 -337 589 -110
2133a10o76Q13J78r05K20Q27l97n94Q01M46r56K51R52n95o51R50J55j005J47O82
$$ -110 -786 27 205 -700 -480 347 -50 -644 157 603 -353 -102 850 255 -396 554 709 -296 -149 533
2153E33n77o05P18L15j101J62R74o11n51R28K18q49L11Q38m52o35Q16K03r17J74
$$ 533 -44 -649 69 384 -717 -555 419 -192 -743 185 403 -446 -135 703 251 -384 432 635 -282 -108
2173a08P95o82n93P98J21r23J74P19m85o13Q73L82r97K84Q58m62m20P87J00q02
$$ -108 687 5 -588 210 331 -592 -418 301 -184 -797 76 458 -539 -255 603 141 -279 508 608 -194
2193a94J00P04m19o75P19K33r48RP90n40m60N96K39o45P1Q63k88o24O97M23q43
$$ -194 -94 610 191 -484 235 468 -480 -471 319 -221 -681 -85 154 -491 -420 443 155 -469 228 651 -192
2214a92J06P94m70o20O10K32p60j31P07k64p24O78L24q33P5Q69l37m71O37L65
$$ -192 -86 708 238 -382 228 460 -300 -431 276 12 -712 -34 290 -543 -468 401 64 -407 230 595
2234E95p16PQ17l55o75O07K60q99O1O83n06n32N95K47o85J4P67k61o57P53M33
$$ 595 -121 -114 703 348 -327 280 540 -359 -298 385 -121 -653 -58 189 -496 -482 285 24 -633 120 553
2255E53p81Q8P62k57o38N57L97q03j79P40l25p27O02L02q23J01O58l11n20O24
$$ 553 -228 -140 622 365 -273 284 681 -122 -301 439 114 -613 -11 291 -532 -431 227 -84 -604 20
2275B0M30p11K3Q04k70o18O31L19q12M6O42m09n44M37L05o96j28P21k52o32P35
$$ 20 450 -261 -238 566 296 -322 309 628 -184 -138 504 95 -449 -12 293 -403 -531 190 -62 -694 41
2296D1K61o56P1P81k81m97M62M62o60j26O82l08o37N34K55p33MN08k18m77M12
$$ 41 302 -354 -283 498 217 -280 182 644 -16 -142 540 232 -405 129 384 -349 -345 163 -55 -532 -120
2317a20M43o73j07Q50k13n23N89K93o10L3N79k84n23L53L97p01k24O85l14n52
$$ -120 323 -350 -457 393 180 -343 246 539 -71 -38 541 257 -266 87 484 -217 -441 244 -70 -622
2337f22M71L01n38J9O34j78m57M71M04m94j81P86l01n52M25K56n11j92N37j55
$$ -622 -151 150 -388 -369 265 87 -370 101 505 11 -170 616 315 -237 188 444 -67 -259 278 123
2357A23o54L56L99n94r5P34j96n11M77L24m43q8O80j13o05L08M32o09k01O20k06
$$ 123 -531 -175 224 -370 -465 269 73 -438 39 363 -80 -168 512 399 -206 102 534 -75 -276 344 138
2378A38o58M43K76n49j33O27j15n13M00M98n56q2O91j93m83L73L91n51k03N09
$$ 138 -520 -77 199 -350 -483 144 29 -484 -84 414 -142 -224 467 274 -209 164 555 4 -199 310
2398C10m5n81K20L60n46j35N85k74m00M11L62l80j72N81K7n27L66M18n90j10N79
$$ 310 265 -316 -96 264 -282 -417 168 -106 -506 -95 267 -113 -285 296 323 -204 162 580 -10 -120 459
2419D59k08n28K72K37m39k41M68Kn29L31M67n27r8O09o5l92K81L36l73j90N18
$$ 459 251 -277 -5 232 -207 -448 20 22 -507 -176 291 -236 -334 275 210 -182 99 435 62 -128 390
2440C90ro02K73L24n51j39M43j37m82K75L42l24j72N58j9m41L48L50l44k52N59
$$ 390 381 -221 52 376 -175 -314 129 -8 -490 -215 127 -197 -369 189 170 -271 77 427 83 -169 390
2461C90q9m75K21L23m03k51M50p1n64K31L97m44q1M41M9l71J97M36k83k68N56
$$ 390 301 -174 47 370 -33 -284 166 95 -469 -238 159 -285 -366 75 124 -247 -50 386 103 -165 391
2482C91n8n31L62K76m51j59L94l9n01Q4L75l30k55L93J22m35K65M55m45o9M71
$$ 391 333 -198 164 440 -11 -170 224 185 -316 -232 143 -187 -442 -49 73 -362 -97 358 -87 -156 315
2503C15l4l51J51L67l82k76M30j5n29J98K97l02j89L09pk87J33L86k83j55M60
$$ 315 281 -70 81 448 66 -210 220 205 -324 -126 171 -131 -320 -11 -18 -305 -172 214 -69 -224 236
2524B36N9l93J45L35k52k00K91K1l90P5L08k99l15M07ol73J46L03k63o4K83J59
$$ 236 295 -98 47 382 130 -70 221 242 -148 -73 235 -64 -379 28 22 -351 -205 98 -165 -229 54 213
2546B13l06J19L31k32k03L49J2l68R5J86k19k63K60J37l97M7L93k96j75M41L5
$$ 213 -93 26 357 125 -78 271 283 -85 10 196 -23 -286 -26 111 -286 -239 154 -142 -317 124 159
2567A59l01J52L11j71k12L11P1k90m7K93k83k12K76m0k77M1K64j98j31K05J22
$$ 159 -142 10 321 150 -62 249 320 30 -17 276 -7 -219 57 17 -260 -219 45 -153 -284 -79 43
2588D3k94J63K99j36j03K52N9k77P1J70k19j30J88N1l10j2K60k40j44K40Q2k03
$$ 43 -251 -88 211 75 -28 224 283 6 77 247 28 -102 86 137 -173 -185 75 -165 -309 -69 13 -190
2610a90J23J90p0p4J48R7k44J04K64k12j73J61m1k28L7J44j52j38J48J21k47M9
$$ -190 -67 123 53 -21 127 224 -20 84 348 136 -37 124 83 -145 -108 36 -116 -254 -106 15 -232 -183
2632a83K82j20r5K71O8k32R7J82j37j18J34L8k48NJ93k46q1J63n4j28K0J78Kj25
$$ -183 99 -21 -116 155 223 -9 88 270 133 15 149 187 -61 -56 137 -109 -190 -27 -81 -209 -189 -11 -9 -134
2656a34J58J14j96O8K74k23KJ01Mj64o8K34j53k79J81R1k27J3K10j59qJ35J14
$$ -134 24 138 -58 10 284 61 63 164 168 4 -64 170 17 -262 -81 10 -217 -204 6 -153 -161 -26 88
2679H8j04l8J92jj13J21M5j53LJ88k29n1L3Lj12r5K06k7j26J20M5j00Q3J39p3
$$ 88 -16 -54 138 137 24 145 190 37 40 228 -1 -52 -19 -16 -128 -223 -17 -44 -170 -50 -5 -105 -22 117 44
2704D4j5R5R4q4r8J39q6j59R9N3j85m7Q3K2j86J62O9j33m8K33M2j35K04N1k50
$$ 44 29 124 218 134 36 175 89 -70 29 82 -103 -150 -67 -45 -231 -69 0 -133 -181 52 94 -41 163 214 -36
2729c6J53J28j67m1M8nj84PJ26q0k23J44R0j50M7J70k1lR5M9l1q5K08j48j10J18
$$ -36 117 245 78 37 85 80 -104 -97 29 -51 -274 -130 -40 -190 -143 27 6 3 98 147 116 31 239 91 -19 99
2755I9Jj30j2Q2j64J8npk4J8J13n6l1K31k8j06R6N0o2j8P1Qr3p8Q7l6j59J52j07
$$ 99 100 -30 -42 40 -124 -106 -111 -118 -142 -124 -11 -67 -98 133 105 -1 95 145 83 65 136 144 51 -27 60 24 -135 17 -90
2784i0k3jO6j4l7M7J06j47J18Q8p5NQ7j6j9o6j2K7j44O5M2p3r3J16l1l1N7L9j5
$$ -90 -113 -114 -48 -62 -99 -52 54 -93 25 113 38 43 130 114 95 29 17 44 -100 -35 7 -66 -159 -43 -74 -105 -48 -9 -24
2813b4K2P4L1n7j2J35o2L5m8m2k0K2o9l5l2k8Kl1N5O3q6L6Q1p3N3Q6Q1p2j6L6
$$ -24 -2 72 103 46 34 169 107 142 94 52 32 54 -15 -50 -82 -110 -108 -139 -84 -21 -107 -71 10 -63 -10 76 157 85 69 105
2843A05M8r5k8K1j13MN2k8r0N8p2L2J05pMM1j0J16r1N5O3j17M0L7o8n9J6j1l6
$$ 105 153 58 30 51 -62 -58 -6 -34 -124 -66 -138 -106 -1 -8 -4 37 27 143 52 107 170 53 93 130 62 3 19 8 -28
2872b8j09K8K9r0nP1NJ13j8kQ3pL5Rj7K9k1m9o9R2j08K0m3No2L0oJ5K5pO8m7Q7
$$ -28 -137 -109 -80 -170 -175 -104 -99 14 -4 -6 77 70 105 114 97 126 105 56 -13 79 -29 -9 -52 -47 -109 -79 -85 -70 -45 -52 16 -31 56
2905E6O3l4k4O7kQl9o8n4oj0m3n2R5J2j19P4Q5o4J9N0l5J09m9J28q9J5Q4j16o8
$$ 56 119 85 61 128 126 134 95 27 -27 -33 -43 -86 -138 -43 -31 -150 -76 9 -55 -36 14 -21 88 39 167 78 93 177 61 -7
2935gN2j1o5j4n3O7o6J5rO2n1R4lj6P1M1k5k3M3k5o6J9O3j19QJ6p7q5J23o6l5
$$ -7 45 34 -31 -45 -98 -31 -97 -82 -91 -29 -80 14 11 -5 66 107 82 59 102 77 11 30 93 -26 -18 -2 -79 -164 -41 -107 -142
2966a42N2Q1kn8R7N4n9J8O6Ln1Q4p4n9J6j1q5NqK9o7j0Q9l6j7J11K6m1o0J72o8
$$ -142 -90 -9 -11 -69 28 82 23 41 107 110 59 143 69 10 26 15 -70 -65 -73 -44 -111 -121 -32 -68 -85 26 52 11 -49 123 55
2997E5j2L8J0n2jj7o6M9n3l2k2J8K5K6r0K9R0k6J7J33o3n2M3P6k7o4P5k5j57O1
$$ 55 43 81 91 39 38 21 -45 4 -49 -81 -103 -85 -60 -34 -124 -95 -5 -31 -14 119 56 4 47 123 96 32 107 82 -75 -14
3027a4M5j26M5P2o6p8R9J7m5O0K4K0q4Q6O6j01J07Mn9rn5K0q5j3K6k6j25J38O2
$$ -14 31 -95 -50 22 -44 -122 -23 -6 -51 9 33 53 -31 55 121 20 127 131 72 63 8 28 -57 -70 -44 -70 -195 -57 5
3056Ep3M1kJ9l2R2O3o1j0Q9q4p5J32l6r5j9L8n8K1k9Pl6L8J26m7j05J33K2m6J5
$$ 5 -68 -27 -29 -10 -42 50 113 52 42 131 47 -28 104 68 -27 -46 -8 -66 -45 -74 -67 -103 -65 61 14 -91 42 64 18 33
3086C3J7Q4j44J05j7r7M5k9L5j18P9j8j00P3R8j17K4K8R0j7m3J34oj10N3O1q1
$$ 33 50 134 -10 95 78 -19 26 -3 32 -86 -7 -25 -125 -52 46 -71 -47 -19 71 54 11 145 139 29 82 143 62
3113F2mJ2rj34N7L8o4p5J11o5o8J07M0k9L3P2n2k4M6J19j03j2mm2m4R3l6j62M8
$$ 62 58 70 61 -73 -16 22 -42 -117 -6 -71 -139 -32 8 -21 12 84 32 8 54 173 70 58 54 12 -32 61 25 -137 -89
3142h9O8j8o3J5N4P5m6Q1K6j01P5J04j39M5N5q9o8N8or7n0J07n5n0M0Q3j04kR4
$$ -89 -21 -39 -102 -87 -33 42 -4 77 103 2 77 181 42 87 142 53 -15 43 37 -60 -110 -3 -58 -108 -68 15 -89 -91 3
3171CKKL8Q7o9q9R9K0j11L2N6j38J6Q3p0j25R4Q2q4j7J19k1l9R5N7j04pQ2N8j83
$$ 3 5 7 45 132 63 -26 73 93 -18 14 70 -68 -52 31 -39 -164 -70 12 -72 -89 30 9 -30 65 122 18 11 93 151 -32
3201c2R2M9r8o9J43j04j38J54m3n5J7lP2q7J09P3k5j00J58pj04J16j4p3k4Q3o0
$$ -32 60 109 11 -58 85 -19 -157 -3 -46 -101 -84 -87 -15 -102 7 80 55 -45 113 106 2 118 104 31 7 90 30
3228C0r8nJ24j09k4Q4m6m5N6J32j13QO0j4m1L7R3k0j32P4J2j47j4J73j50p3J35
$$ 30 -68 -73 51 -58 -82 2 -44 -89 -33 99 -14 -6 54 40 -1 36 129 109 -23 51 63 -84 -98 75 -75 -148 -13
3255a3k7j05J15K6p8L9J18j2j17J16L6n8m1P7K0j09K9K3j21kQ0k6r4J30k0q4N1
$$ -13 -40 -145 -30 -4 -82 -43 75 63 -54 62 98 40 -1 76 96 -13 16 39 -82 -84 -4 -30 -124 6 -14 -98 -47
3282d7M8J8o3J14N6j48P4J01j01l8j9R5p8p1%K6j19R9M5n9j5P9K8p9J7J39j35
$$ -47 1 19 -44 70 126 -22 52 153 52 14 -5 90 12 -59 -59 -33 -152 -53 -8 -67 -82 -3 25 -54 -37 102 -33
3309c3K3J22qr6J3K8p3K0R4q7j5K5k5l0k5L0P3q0O4M2m2pN5K9j00j4R5n8r6J02
$$ -33 -10 112 104 8 21 49 -24 -4 90 3 -12 13 -12 -42 -67 -37 36 -44 20 62 20 13 68 97 -3 -17 78 20 -76 26
3339B6k6r1K1J25j17j4R0mj26O7J26p1m0J66l0j42J10j2l0o5R8k3r1J6J32j17
$$ 26 0 -91 -70 55 -62 -76 14 10 -116 -49 77 6 -34 132 102 -40 70 58 28 -37 61 38 -53 -37 95 -22
3365b2j25J20M0j09O2P2k3l1L9N9q7M1R8p0j04J29qj38O2qn2KK2P0j09l1J27k6
$$ -22 -147 -27 13 -96 -34 38 15 -16 23 82 -5 36 134 64 -40 89 81 -57 5 -3 -55 -53 -31 39 -70 -101 26 0
3393@m1P7K3r9K8J12k7r6P3P0j20J8L6o6r2J32m9q5K2O1j7j6N7K8j06O7P6j8n4
$$ 0 -41 36 59 -40 -12 100 73 -23 50 120 0 18 54 -12 -104 28 -21 -106 -84 -23 -40 -56 1 29 -77 -10 66 48 -6
3422fO2N0j06j6M7k6n8M6J8r9Lj4M3n4R5qj2NJ10k6l1O5L0r8m3J41p9o0P8qq9
$$ -6 56 106 0 -16 31 5 -53 -7 11 -88 -85 -99 -56 -110 -15 -23 -35 -30 80 54 23 88 118 20 -23 118 39 -21 57 49 -40
3453d0k8O3j7n8M5L9r0O9P9q4NN9ln1QR1j7p6k5J15j22j7N4J2j9k5M2k5l4O9J1
$$ -40 -68 -5 -22 -80 -35 4 -86 -17 62 -22 -17 42 39 -12 -4 87 70 -6 -31 84 -38 -55 -1 11 -8 -33 9 -16 -50 19 30
3484C0r4R1R5r7j4R4n2m0M0j5qn9j2P9j42J03K0k4k2kjk5N5Lj5JK6L6q6J06k5
$$ 30 -64 27 122 25 11 105 53 13 53 38 30 -29 -41 38 -104 -1 19 -5 -27 -29 -30 -55 0 3 -12 -11 15 51 -35 71 46
3515D6k7M6K4j31pJ5L1Pq9J01ln4j1P1o0M7K3L7q4R6lm9k0L5K3m3k4Qj01k5J70
$$ 46 19 65 89 -42 -49 -34 -3 4 -85 16 13 -41 -52 19 -41 6 29 66 -18 78 75 26 6 41 64 21 -3 5 -96 -121 49
3546D9o6p1M1P4o2L2K8N3r6J08j3o3k5J27k1j16QO6r0n3J22mq6ON2K7Oo9PM1J3
$$ 49 -17 -88 -47 27 -35 -3 25 78 -18 90 77 14 -11 116 95 -21 -13 53 -37 -90 32 28 -58 -52 0 27 33 -36 -29 12 25
3577B5R2q9l0P1k8m9%N9o2L7l2k4m5LO5K0p7M4R9j41J16k6l9L7L1kJ0m0L7j0j00
$$ 25 117 28 -2 69 41 -8 -8 51 -11 26 -6 -30 -75 -72 -7 13 -64 -20 79 -62 54 28 -11 26 57 55 65 25 62 52 -48
3608d8J01j2r6J8Q9r6j6M7M4o8P3j1j3j8N7Lp8M3R6o3o7M9r6pK5N1n0J1M2o0l
$$ -48 53 41 -55 -37 52 -44 -60 -13 31 -37 36 25 12 -6 51 54 -24 19 115 52 -15 34 -62 -69 -44 7 -43 -32 10 -50 -53
3639e3O2rK1JL3j9l8K2K0L9r9K7k6N8q4R4o7k2M4k6J7m3O2ql5M1pJ0J3Jk6rM5
$$ -53 9 0 21 22 55 36 -2 20 40 79 -20 7 -19 39 -45 49 -18 -40 4 -22 -5 -48 14 6 -29 12 5 15 28 29 3 -6 39
3672C9j1j6mJ2n0K1K1m4qrO2pl3RP4l1j8K4J4o5J1R1q0K3j6L7r2M6O3q9J7KM9
$$ 39 28 12 8 20 -30 -9 12 -32 -40 -49 13 6 -27 -18 56 25 7 31 45 -20 -9 82 2 25 9 46 -46 0 63 -26 -9 -7 42
3705D2m7k7J03j15N8P0m9p5L7jL3m9J8o0M8K2J7k8j1K8o2L4k4N9l2MO1n3PK9K4
$$ 42 -5 -32 71 -44 14 84 35 -40 -3 -4 29 -20 -2 -62 -14 8 25 -3 -14 14 -48 -14 -38 21 -11 -7 54 1 8 37 61
3736F1J5ppm7Ok9K9l2MQ0q0j0J3P5r4J8L8K9j06J1J08o6n0P8k2o6J00m2j4K5k0
$$ 61 76 69 62 15 21 -8 21 -11 -7 73 -7 -17 -4 71 -23 -5 33 62 -44 -33 75 9 -41 37 15 -51 49 7 -7 18 -2
3767bj6K0J7K8j03K9J6L3m3N2K3k3PM7j2o2nK1J3k6mk5L0o1M3n0J8J2M0n9N1k
$$ -2 -18 2 19 47 -56 -27 -11 22 -21 31 54 31 38 85 73 11 6 27 40 14 10 -15 15 -46 -3 -53 -35 -23 17 -42 9 7
3799GOrJ0N3p8K7K1l7M4k2k1k1L0m1nJ0k6K3J7l9Q2r7J04M2m7J0J1j4K0m9N4n2
$$ 7 13 4 14 67 -11 16 37 0 44 22 1 -20 10 -31 -36 -26 -52 -29 -12 -51 31 -66 38 80 33 43 54 40 60 11 65 13
3831A3Nk2J1J7m8j4P6r0L4M0n6M7K8j3m6J3Q7r8k7O0j6ok8P5m7o1M9qM6JrL1p4
$$ 13 18 -4 7 24 -24 -38 38 -52 -18 22 -34 13 41 28 -18 -5 82 -16 -43 17 1 -5 -33 42 -5 -66 -17 -25 21 22 13 44 -30
3864c0O0J5o3lL4J7PJ8m9MJ2Lk9nPNo3R4rm7k8P5J1q8J05no1K0P5p8J4K1k8j6
$$ -30 30 45 -18 -21 13 30 37 55 6 10 22 25 -4 -9 -2 3 -60 34 25 -22 -50 25 36 -52 53 48 -13 7 82 4 18 39 11 -5
3898eqL0n2j7K2l9L6N3J8l0K1Pn8k7N8L7j00N7Oj6JOl4M6l1j4JN3p8L4l3J3LK9
$$ -5 -13 17 -35 -52 -30 -69 -33 20 38 8 29 36 -22 -49 9 46 -54 3 9 -7 -6 0 -34 12 -19 -33 -32 21 -57 -23 -56 -43 -40 -11
3932a1L5k0K8l8J6J4J9l3k1J3K7o1OK6L1j9l2j5m0J17n6O2j14N2P9k4o5O5J7o7
$$ -11 24 4 32 -6 10 24 43 10 -11 2 29 -32 -26 0 31 12 -20 -35 -75 42 -14 48 -66 -14 65 41 -24 41 58 -9
3962iL9K7k8k3Nl8k3J3K1J6j7K9kl6L1m5Q5M9o7j0O7m8l2Q0q4mj4mrk7J39j18
$$ -9 30 57 29 6 11 -27 -50 -37 -16 0 -17 12 10 -26 5 -40 45 94 27 17 84 36 4 84 0 -4 -18 -22 -31 -58 81 -37
3994c7NK8j0nN7m5k0MM9K8r2Q1r2P6l4J2m3O8Oo6PN3r3L4m5J06k1o6J65j18J5
$$ -37 -32 -4 -14 -19 38 -7 -27 -23 26 54 -38 43 -49 27 -7 5 -38 30 36 -30 -23 30 -63 -29 -74 32 11 -55 110 -8 7
4025GK1O0o6j1J4k8L8Pq7L5K5K7j1k8k3M8l2j7K2M1j6n3M8l4QK0o5K5k3M2jj4
$$ 7 28 88 22 11 25 -3 35 42 -45 -10 15 42 31 3 -20 28 -4 -21 1 42 26 -27 21 -13 -5 15 -50 -25 -48 -6 -7 -21
4057b1pK6m8n8P1P1o0LM4m1K6j0L8j3M6k5M4r7jM2m2J0pRl6j5R6l1n1O1k0k3M4
$$ -21 -28 -2 -50 -108 -37 34 -26 -23 21 -20 6 -4 34 21 67 42 86 -11 -12 30 -12 -2 -9 0 -36 -51 45 14 -37 24 4 -19 25
4090B5jm9K8J0k5N3lnn5J9j0Lo4J14lk8L8k8n0L9m0M6L3l3K8p3L9O1k7p4M0n3
$$ 25 24 -25 3 13 -12 41 38 33 -22 -3 -13 -10 -74 40 37 9 47 19 -31 8 -32 14 47 14 42 -31 8 69 42 -32 8 -45
4122d5M8O5j2m4K0k5M4m0n8JN1KqL2n7J4PJ6J3n8K5M2n8M4k2J5k5J7k7L0J8rO1
$$ -45 3 68 56 12 32 7 51 11 -47 -46 5 7 -1 31 -26 -12 -5 11 24 -34 -9 33 -25 19 -3 12 -13 4 -23 7 25 16 77
4155G7l2J8%p4M8k5RJmorK4m5J0m0J11k0o9L3Jl6O9K1q8%N6l2j0M7m3o0J12o9
$$ 77 45 63 63 -11 37 12 21 22 18 12 3 27 -18 -8 -48 63 43 -26 7 8 -28 41 62 -26 -26 30 -2 -12 35 -8 -68 44 -25
4188b5P4l3L2j12N2Ol8P3n7jK7k9N6o1N0Qp7Q6rL4q7K6N1m9o5O0m0K5M9n0pK1
$$ -25 49 16 48 -64 -12 -6 -44 29 -28 -29 -2 -31 25 -36 14 22 -55 31 22 56 -31 -5 46 -3 -68 -8 -48 -23 26 -24 -31 -10
4220a0j6ML2K0L1j39M9j4J2J4K7L6o3L1Nl5K4O1m6kk9j6QN8o6O9p3O2m1m5L6K9
$$ -10 -26 -22 10 30 61 -78 -29 -43 -31 -17 10 46 -17 14 19 -16 8 69 23 21 -8 -24 -16 42 -24 45 -28 34 -7 -52 -16 13
4252A3K3p7N1k7J7mk8J3J4k7L0Rmj6K9l7LpL5L1K4j5m4M9n2j3jK5n2O1nK4kj3
$$ 13 36 -41 10 -17 0 -4 -32 -19 -5 -32 -2 7 3 -13 16 -21 -18 -25 10 41 65 50 6 55 3 -10 -11 14 -38 23 18 42 40 27
4286B7o5P3m2N8m2PK6o4N1j6J5k3j0K8k0k5K6lL5m9J2J5j7j8J2mP0m8j0rj5J6
$$ 27 -38 35 -7 51 9 16 42 -22 29 13 28 5 -5 23 3 -22 4 1 36 -13 -1 14 -3 -21 -9 -13 57 9 -1 -10 -25 -9
4318iL9l4k2%rP8l3k1k4J8M2j7L4m4jjnR0n0k2jK1Oo8K4L2n2NQK8k1noMO2r3J6
$$ -9 30 -4 -26 -26 -35 43 10 -11 -35 -17 25 8 42 -2 -3 -4 -9 81 31 9 8 29 35 -33 -9 23 -29 -24 -16 12 -9 -14 -20 -16 46 -47 -31
4355c1J8j9N2j3L5m7L7m2O%Qm0L1N6p0qO7k4q4R9j2K9m2QJk0l6M3oK9k9J9l6k
$$ -31 -13 -32 20 7 42 -5 32 -10 -4 -4 4 -36 -5 51 -19 -27 40 16 -68 31 19 48 6 14 15 -5 -41 2 -4 25 -4 15 -21 -23
4389b3M4p3K9N1j3p0O2Km2QK8pL3q4J14l3Pk8jK3J3m7Q2p2R5p6l7l5L5k7M3O2
$$ -23 21 -52 -23 28 15 -55 7 9 -33 -25 3 -4 29 -55 59 26 33 5 4 27 40 -7 75 3 98 22 -15 -50 -15 -42 1 63
4421F3k1m3Kj3J6J6K9n2L5k4l0M0J7n3j2J4j4N1r4O2O8r4K6N2q4M4J4p8P7L4k8
$$ 63 42 -1 1 -12 4 20 49 -3 32 8 -22 18 35 -18 -30 -16 -30 21 -73 -11 57 -37 -11 41 -43 1 15 -63 14 48 20
4452B0p2R4Kn7M0j2J7l2L4qm7M2j7K3o8k4P3m1M2oL2j0k3nk0O0n4lR7q5l1M8J8
$$ 20 -52 42 44 -13 27 15 32 0 34 26 -21 21 4 27 -41 -65 8 -33 9 3 35 25 2 -3 -23 37 -17 -20 77 -8 -39 9 27
4485B7m7n8J39o0n5R6K3m8K4n7O7j1l8K2j23J00L7l3l7M9k0qk2M7L4po4j6kLM5
$$ 27 -20 -78 61 1 -54 42 65 17 41 -16 51 40 2 24 -99 1 38 5 -32 17 -3 -11 -33 14 48 41 -23 -39 -41 -38 7
4516Gl8pO1ol5j0L9n2l4J12p7M7k9R4p4M4o4KL0rqL9J6r4M2%K6O7j20j7M6k9k7
$$ 7 -31 -38 23 17 -18 -28 11 -41 -75 37 -40 7 -22 72 -2 42 -22 -20 10 1 -7 32 48 -46 -4 -4 22 89 -31 -48 -2 -31 -58
4549e8K5M0Qk1J4k1k0K5poL3j3J1k6q0R4Jj4K7Jj7J3J5L4n0LL2l4M2n9m1N7n8
$$ -58 -33 7 15 -6 8 -13 -33 -8 -15 -21 12 -1 10 -16 -96 -2 -1 -15 12 13 -4 9 24 58 8 11 43 9 51 -8 -49 8 -50
4582e0J04l3m7M8k9kkk2pj6N6L0n7O0q0J9J9k3N9j5Qm3jj9O0l4K1qJ2l5M6j6j1
$$ -50 54 21 -26 22 -7 -9 -11 -33 -40 -56 0 30 -27 33 -47 -28 -9 -32 27 12 20 -23 -24 -43 17 -17 4 -4 8 -27 19 3 -8
4615hP6j15P7Pl3kk2J0l3R7q7O8l3p1P7n2Q2k5k6m%J8J6k9k5L4k5O0n2K7m7k4
$$ -8 68 -47 30 37 4 2 -20 -10 -43 54 -33 35 2 -69 8 -44 38 13 -13 -17 -17 1 17 -12 -37 -3 -28 32 -20 7 -40 -64
4647f4P2Qm4M3lk5j4J3nO1J7j3km4LJ2L7m6Kn1O2Jro2M4%Qo3L9K7J0l9L1Kn6M4
$$ -64 8 16 -28 15 12 -13 -27 -14 -19 42 59 46 44 0 3 15 52 6 8 -43 19 20 11 -51 -7 -7 1 -62 -23 4 14 -25 6 8 -48 -4
4683dN3j09L6Q2k8m7L0J9q9R5l2j8m0Q4rm1M3m4L1o7O1L0n0Q2l2m7k3J2j9L8k5
$$ -4 49 -60 -24 58 30 -17 13 32 -57 38 6 -12 -52 32 23 -18 25 -19 12 -55 6 36 -14 68 36 -11 -34 -22 -41 -3 -28
4714b8O5l1k5K3%J3n2nQ2m1kk5j2N2N5j13JK3N6nm7J3k4M3j9O4p9pK1K6KJ0j0
$$ -28 37 6 -19 4 4 17 -35 -40 42 1 -1 -26 -38 14 69 -44 -43 -20 36 31 -16 -3 -27 16 -3 61 -18 -25 -4 22 24 34 24
4747B4j3J3J7J1m1k4k2J3L8r1P3K4m9k2J6l3N6J5l8K2O1p7j0L2m6M3J0j1M0mm9
$$ 24 11 24 41 52 11 -13 -35 -22 16 -75 -2 22 -27 -49 -33 -66 -10 5 -33 -11 50 -27 -37 -5 -51 -8 2 -9 31 27 -22
4778b2K7P0o8n0J04r9N1nj5PLl4J0N9l7%M3j0p8K8RPnM2n3L9%l7K1j09L2J08l9
$$ -22 5 75 7 -43 61 -38 13 8 -7 0 3 -31 -21 38 1 1 44 34 -44 -16 -7 0 -5 37 -16 23 23 -14 7 -102 -70 38 -1
4811al0M6qK6l8Lll1Q4m9j6L0PKl9PL0k7J8L0j7N2q4J1l3P2q4P4o2J0K6l6K0J9
$$ -1 -31 15 7 33 -5 -2 -5 -36 48 -1 -17 13 20 22 -17 -10 20 -7 11 41 24 76 -8 3 -30 42 -42 32 -30 -20 6 -30 -10 9
4845IJ7J7Rp6j1M2l6m9O0K5k1PnlJ8RMk9J6K9M0j9q8J7K9L6qo1L9k3J2k1M1j03
$$ 9 26 43 52 -24 -35 7 -29 -78 -18 7 -14 -7 -12 -15 3 12 16 -13 3 32 72 53 -35 -18 11 47 39 -22 17 -6 6 -15 26 -77
4879g7L8P8K0l7k0O5m3l4P2r4L1L1j7m2k1J4j6L3L3q2P0m0j9N7LJ9l6N0k8j8l4
$$ -77 -39 39 59 22 2 67 24 -10 62 -32 -1 30 13 -29 -50 -36 -52 -19 14 -68 2 -38 -57 0 3 22 -14 36 8 -10 -44
4910d4P3j1k8MM1n1j5P7o7k9K8pN9K1p0J1l3N1kj3K1n0J5J9k5N0o4N1rnqLK1p4
$$ -44 29 18 -10 -6 35 -16 -31 46 -21 -50 -22 -29 30 51 -19 -8 -41 10 8 -5 16 -34 -19 0 -25 25 -39 12 3 -2 -10 -7 14 -60
4944f0O1J2j7K1N3q7O7l9M5J5l2j1n7O9l8Lj2J3k8Q5q2K7j3j2P2m3Kj0pMm7M2
$$ -60 1 13 -4 17 70 -17 50 11 56 71 39 28 -29 40 2 5 -7 6 -22 63 -19 8 -5 -17 55 12 14 4 -3 1 -46 -4
4976dj3k5N2k3Q7j09OOJ7j6m7O6J8Rl1J8j0j2J8J2J8L3o4K6nk3M0k4lm1N6n0k7
$$ -4 -17 -42 10 -13 74 -35 -29 -23 -6 -22 -69 -3 15 24 -7 11 1 -11 7 19 37 70 6 32 27 4 44 20 17 -24 32 -18 -45
5009d5N1m9K1j2K7J6j2k8k0R6j3qj8oj1%K8K4r2L9O6o7o6M0L6K5L2k3n4M5j2k1
$$ -45 6 -43 -22 -34 -7 9 -3 -31 -51 45 32 24 6 0 -11 -11 17 41 -51 -12 54 -13 -79 -39 -3 22 54 31 -23 22 10 -11
5041a1P5k9ok8L9n4M3o0Q0j6o6Pj5j0%L8nRl9R5n0nm0N9L3l5J9J1l1k5J3Qkn5
$$ -11 64 35 29 1 40 -14 29 -31 49 33 -33 -26 -41 -51 -51 -13 -18 -9 -48 47 -3 -8 -48 11 44 9 28 39 8 -17 -4 4 2 -53
5075e3oN8J7r7J01nM6n0LJ8l6O9k9jL2m2j8J5Kp7O4m1J8J2l4k8O0m4Pk3O5oL2
$$ -53 -59 -1 16 -81 20 15 61 11 14 32 -4 65 36 35 67 25 7 22 24 -53 11 -30 -12 0 -34 -62 -2 -46 -39 -62 3 -3 29
5108B9j2MK6Mpk5M5o7l7J5O3n4N2m5m6N0M5Om0nk3N7L0k4l5Jl6Q1j8o8j4l5Q6
$$ 29 17 21 47 51 44 19 64 -3 -40 -25 38 -16 36 -9 -55 -5 40 46 6 1 -22 35 65 41 6 7 -29 52 34 -34 -48 -83 3
5141C%k8%l3O5m0RLoK0M5P3j18K8N0p8K4%n2J14p7L3n4L4%kjRj1j0L5n8M7%o1
$$ 3 3 -25 -25 -58 7 -33 -24 -21 -27 -7 38 111 -7 21 71 -7 17 17 -35 79 2 35 -19 15 15 13 12 21 10 0 35 -23 24 24 -37
5176c7O9l6OJ8K9o7L8q0M8J7k1L5l5j2K1l7M4l4M5M9j08Q1NJ6k3j4Nn1M0N0m1
$$ -37 32 -4 2 20 49 -18 20 -60 -12 5 -16 19 -16 -28 -7 -44 0 -34 11 60 -48 33 38 54 31 17 22 -29 11 61 20
5207B0roK4k7m4K9j1L7l7RMK0J3L8k9LPk7Jl0m9M2M6n7k4O4o2O6L3n4Jl7P3n1
$$ 20 11 5 29 2 -42 -13 -24 13 -24 -15 -11 9 22 60 31 34 41 14 15 -15 -64 -22 24 -33 -57 7 -55 11 44 -10 -9 -46 27 -24
5241b4%K2J4m4L5qK6L2Mp0J0n6N0Lk5K4j0M0l5M7o1Q9r8K0K4mqMMMl0J1j5j9j4
$$ -24 -24 -2 12 -32 3 -5 21 53 57 -13 -3 -59 -9 -6 -31 -7 -17 23 -12 35 -26 63 -35 -15 9 5 -3 1 5 9 -21 -10 -25 -44 -58
5276e8nM2m1M8j8J0j1Q4j0q7Q3O0n4m4lM7m8L8n5j5rL9j4J4p9N5J01m7jm6JK1
$$ -58 -63 -21 -62 -14 -32 -22 -33 51 41 -46 37 97 43 -1 -4 43 -5 33 -22 -37 -46 -7 -21 -7 -86 -31 70 23 22 -24 -23 -2
5308bJ8m2N1m1j2R0p3M0l3K5rr0O2k1k5R8n8J6L3l8L0m0M1K3K2o9J7M6p5N7j8
$$ -2 16 -26 25 -16 -28 62 -11 29 -4 21 12 -78 -16 -37 -62 36 -22 -6 27 -11 19 -21 20 43 65 -4 13 59 -16 41 23
5339B3L6m4j7j3n5J6N0l1j0O6l3L8k2l3M8K0KnJl0j6O2j16O9m6L4m7O2Kn0M2l1
$$ 23 59 15 -2 -15 -70 -54 -4 -35 -45 21 -12 26 4 -29 19 39 41 36 37 7 -9 53 -63 6 -40 -6 -53 9 11 -39 3 -28
5371b8M5J2rj5lP3m8j2L7j9%m4K0j2M5p7JRJ8l7K0M7o8LOJN8j3LJ6k6MjJ4j0J0
$$ -28 17 29 20 5 2 75 27 15 52 33 33 -11 9 -3 42 -35 -34 -25 -7 -44 -24 23 -45 -42 -36 -35 23 10 13 29 3 7 6 20 10 20
5407B0L2r8L6J5m1O2J3m6ON5j20P7N4j11P8K8Qo9k7O8m9k0K6j2k4K6m5K6rK3k5
$$ 20 52 -46 -10 5 -36 26 39 -7 -1 54 -66 11 65 -46 32 60 68 -1 -28 40 -9 -29 -3 -15 -39 -13 -58 -32 -41 -18 -43
5438d3K3oM2K5q%J7o0PM5j8l3M4k1ROo5OJ4K2o3R2j3k3J2J3k6kL0Rq6Q8l9K6j2
$$ -43 -20 -26 16 41 33 33 50 -10 -3 42 24 -9 35 14 23 29 -36 -30 -16 6 -57 35 22 -1 11 24 -2 -4 26 35 -51 37 -2 24 12
5473A2K3k2n2M2l3K2j9m2R7omM2n5M4l2Njl5M3J6m1J2J3p2R7o4k5KK0J2lM5m2
$$ 12 35 13 -39 3 -30 -8 -27 -69 28 22 18 60 5 49 17 22 21 -14 29 45 4 16 29 -43 54 -10 -35 -33 -13 -1 -4 41 -1
5506aOPkoJ0k0L7n9J1N0l2J1j1rol0M0J9k6j2L6l1N1o7M7k5K1P9r5lN8Km2L2m
$$ -1 5 12 10 4 14 -6 31 -28 -17 33 1 12 1 -8 -14 -44 -4 15 -11 -23 13 -18 33 -34 13 -12 9 88 -7 -10 48 50 8 40 36
5541C6l6l2L4rL2n5rJ9l0M6j9N4n8N0lK0k6j0J1j4lKo1N7mo5J02j6pJNQq1M5L2
$$ 36 0 -32 2 -7 25 -30 -39 -20 -50 -4 -23 31 -27 23 20 40 14 4 15 1 -2 0 -61 -4 -8 -73 29 13 6 7 12 20 -61 -16 16
5576A6LN0n3KJ7J2k1J8mm9j2j4%J1kKL2J7l8J9j2Kj7O2j9q4J36l8p0L2P3j09N2
$$ 16 19 69 16 18 35 47 26 44 40 -9 -21 -35 -35 -24 -26 -24 8 25 -13 6 -6 -4 -21 41 22 -62 74 36 -34 -2 71 -38 14
5609A4k6JJ6K2n3N2p4J3M4J9L7o2J06j54P1Ol9L0J9po3L0K1n7K7lm0M2M1n3nJ6
$$ 14 -12 -11 5 27 -26 26 -48 -35 9 28 65 3 109 -45 26 32 -7 23 42 35 -28 2 23 -34 -7 -10 -50 -8 33 -20 -25 -9
5641iJ2K3q0P4kP8l1n1J8k4Ljk1Mj1l7OrM6KK1Nj3J0n1Q2ln9R0m3P2j02oM4o3
$$ -9 3 26 -54 20 18 96 65 14 32 8 11 10 -11 -7 -18 -55 -49 -58 -12 -10 11 16 3 13 -38 44 41 -18 72 29 101 -1 -7 37 -26
5676b6K6j9LjpL2m1Q2q5j1N0RK1o7Q0kJ4k0ok2J8k2o0P2m0oM5J4LJ7m1K7j4J5
$$ -26 0 -19 -16 -17 -24 8 -33 49 -36 -47 3 12 33 -34 46 44 58 38 32 10 28 6 -54 18 -22 -28 17 31 34 51 10 37 23 38
5710C8j1J5k4M4o4kO9r8qRmN2j8o2P4m0mN1K2k0o2P6Kl4Lk7N0j9J8j4m2qN5m8
$$ 38 27 42 18 62 -2 -4 65 -33 -41 -32 -36 16 -2 -64 10 -30 -34 17 39 19 -43 33 35 1 4 -23 27 8 26 12 -30 -38 17 -31
5744c1K4p2K9M6J3n0J6K7j6L0OJ0J7j3j4k5l3P8k5Pl2l7M2l3j1J9N0j11N1N5l1
$$ -31 -7 -79 -50 -4 9 -41 -25 2 -14 16 22 32 49 36 22 -3 -36 42 17 24 -8 -45 -3 -36 -47 -28 22 -89 -38 17 -14
5775a4m4N0J9Kj9K2J9j9j2J8K1q4Q8o9k3NJ1ON0k5L2RK3k1n1O8l5j6JK1Jj5pJ1
$$ -14 -58 -8 11 13 -6 16 35 16 4 22 43 -41 47 -22 -45 -40 -29 -23 27 2 34 43 66 45 -6 62 27 11 12 33 34 19 12 23
5809B3Kp9K0K2Rll6kM9m7K2n1Q1mJ2j3O9r7N7o5%Q0r1M7j2K5l5O0o8J9l1n6R4
$$ 23 25 -54 -34 -12 -3 -6 -42 -44 5 -42 -20 -71 10 6 18 5 74 -23 34 -31 -31 49 -42 5 -7 18 -17 43 -25 -6 -37 -93 1
5842AJ2M5l4l4L8kQj03J1N9l2L4k0J2j9k1J8oKl3N7J4J4K3l0P2l7n6L0M4j1k6
$$ 1 13 58 24 -10 28 26 34 -69 -58 1 -31 3 -17 -5 -24 -45 -27 -33 -31 -64 -7 7 21 44 14 86 49 -7 23 67 56 30
5874C0pk1j0l0J6qK6j15J38k9nPk1N0J7j5pL6q8N8m8j1L5O4m1K3nn4J5o1K4PJ9
$$ 30 23 2 -8 -38 -22 -30 -4 -119 19 -10 -15 -8 -29 21 38 23 16 52 -36 22 -26 -37 -2 62 21 44 39 -15 0 -61 -37 -30 -11
5907a1J1k5P4m3L3P6j10j6N0j4L5l6o0J2O8l4Rp9J3O3kk8J4K7m9O2n4J2L1j8K5
$$ -11 0 -25 49 6 39 115 5 -11 39 25 60 24 -36 -24 44 10 19 -60 -47 16 14 -14 0 27 -22 40 -14 -2 29 11 36
5938C6m8N3j9K1j04L0M4m7j9O7N0j11k8J11q3R1oJ8Kr6N8oP3o0J1l2j3l6M8J0
$$ 36 -12 41 22 43 -61 -31 13 -34 -53 14 64 -47 -75 36 -47 44 38 56 58 -38 20 14 87 27 38 6 -7 -43 5 15
5968A5o1L3k5k1K3J3M6k9J3J4J9o3O0k0J3n8N2Jk1J7l4j8K1J4J2o9O9k4j5M6l8
$$ 15 -46 -13 -38 -59 -36 -23 23 -6 7 21 40 -23 37 17 30 -28 24 25 4 21 -13 -31 -10 4 16 -53 16 -8 -23 23 -15
5999a5M0j5K2K5J7k4l7L0Nm3M4r5qM0j2J1mj0K4m0O6rk8J7j4kO8j5OK8j29O6j0
$$ -15 25 10 32 57 74 50 13 43 48 5 49 -46 -54 -14 -26 -15 -19 -29 -5 -45 21 12 -16 1 -13 -15 53 38 44 72 -57 9 -1
6032aqk0J9j6J6L2k0j1K6j1Om4Q8n0J1J4L8n8j9jK9p1N5l3L5l9oM0nM0m8N0q7
$$ -1 -9 -29 -10 -26 -10 22 2 -9 17 6 12 -32 56 6 17 31 69 11 -8 -9 20 -51 4 -29 6 -33 -39 1 -4 36 -12 38 -49
6065d9M7l5O2oLK3k0n3M9oJj2m8NL6j4J2k4K0J2nO6l0l3L3k4P9r7J2P0j00J21
$$ -49 -2 -37 25 19 22 45 25 -28 21 15 16 4 -44 -39 -3 -17 -5 -29 -9 3 -2 64 34 1 34 10 89 -8 4 74 -26 95
6097I5o5lp2J3J1OL5p6O5Kp9L8j7L0J8P3m3k1J6l5j1J5J4KlJ9r2M2k2nL7oK2J4
$$ 95 30 27 -45 -32 -21 -15 20 -56 9 11 -68 -30 -47 -17 1 74 31 10 26 -9 -20 -5 9 11 8 27 -65 -23 -45 -50 -13 -19 3 17
6131A7p5M6M8j7M5jn6J8%l2Lj1L4J0m1Lm6P8onp3pM0N7o1J0L1k5J7jJ6kL2p0N9
$$ 17 -58 -12 36 19 64 63 7 25 25 -7 -4 -15 19 29 -12 -9 -55 23 17 12 -61 -68 -28 29 -32 -22 9 -16 1 0 16 14 46 -24 35
6166C5m2P0o0l3Q2j4j7o3J3Q3l7rQ5r2l4P7m6J0kQ0p8l7J0Kk4%%O3n3K3pj9j1
$$ 35 -7 63 3 -30 52 38 21 -42 -29 54 17 8 93 1 -33 44 -2 8 6 86 8 -29 -19 -17 -41 -41 -41 22 -31 -8 -15 -34 -45
6199d5N5J9m0O5o4M6P4j60Q2j6K2j7K0Lo6l9L9J6j9LN1q0M3K2k6M5l9K4l2K6j1
$$ -45 10 29 -11 54 -10 36 110 -50 32 16 38 21 41 44 -22 -61 -22 -6 -25 -22 29 -51 -8 14 -12 33 -6 18 -14 12 1
6230AK6oj0l1N2j06N1kJ9JON3j01N4kk0K6rM0n0P1K1m0OJ3n2M8p2L7m6L4K1l6
$$ 1 27 21 11 -20 32 -74 -23 -25 -6 -5 1 54 -47 7 5 -15 11 2 42 -8 63 84 44 50 63 11 59 -13 24 -22 12 33 -3
6263c%j3j3M3K8o9J5jK8J4k5M1p1M1o5lK0L8n0L4k6OM3j6M0l3J0pK7k1N0m2l7
$$ -3 -3 -16 -29 14 42 -27 -12 -13 15 29 4 45 -26 15 -50 -53 -33 5 -45 -11 -37 -31 12 -4 36 3 13 6 33 12 62 20 -17
$$ [...]
8191D2
##END NTUPLES=NMR FID
##END=
