##TITLE=1H_Pr 92-A
 200.13MHz, CDCl3,
 8 sc
 
 30.1.2025
##JCAMPDX= 6.0         $$ Bruker NMR JCAMP-DX V2.0
##DATA TYPE= NMR FID
##DATA CLASS= NTUPLES
##ORIGIN= UXNMR, Bruker Analytische Messtechnik GmbH
##OWNER= pz
$$ XWIN-NMR		Version 3.5
$$ Thu Jan 30 14:20:11 2025 Russian Standard Time (UT+4h)  she@DPX200
##.OBSERVE FREQUENCY= 200.1313
##.OBSERVE NUCLEUS= ^1H
##.DELAY= (6, 6)
##.ACQUISITION MODE= SIMULTANEOUS
##.ACQUISITION SCHEME= undefined
##.AVERAGES= 8
##.DIGITISER RES= 18
##SPECTROMETER/DATA SYSTEM= spect
##.PULSE SEQUENCE= zg30
##.SOLVENT NAME= CDCl3
##.SHIFT REFERENCE= (INTERNAL, CDCl3, 0, 14.3821)
##AUDIT TRAIL= $$ (NUMBER, WHEN, WHO, WHERE, WHAT)
$$ ##TITLE= Audit trail, XWIN-NMR		Version 3.5
$$ ##JCAMPDX= 5.01
$$ ##ORIGIN= Bruker BioSpin GmbH
$$ ##OWNER= she
$$ F:/spectra/data/she/nmr/H-C/1/audita.txt
$$ ##AUDIT TRAIL=  $$ (NUMBER, WHEN, WHO, WHERE, WHAT)
(   1,<2025-01-30 14:18:47.75 +0400>,<she>,<DPX200>,
      <created by zg, POWCHK disabled, PULCHK disabled
       configuration hash MD5:
       00 E9 B6 7A A2 85 ED C7 34 08 36 98 17 FE 4E 26
       data hash MD5: 16K
       92 72 DA BC 4D 92 B1 5A 9B 5C 2E 2D 1E 40 BA 29>)
$$ ##END=
$$ 
$$ hash MD5
$$ C2 A8 34 24 9F C3 0D 07 A6 AF B4 69 A6 4D 33 64
##$RELAX= 
##$RELAX= 
##$RELAX= 
##$RELAX= 
##$RELAX= 
##$RELAX= 
$$ Bruker specific parameters
$$ --------------------------
##$DU= <F:/spectra>
##$EXPNO= 1
##$NAME= <H-C>
##$PROCNO= 1
##$TYPE= <nmr>
##$USER= <she>
##$AMP= (0..31)
100 100 100 100 100 100 100 100 100 100 100 100 100 100 100 100 100 100 
100 100 100 100 100 100 100 100 100 100 100 100 100 100 
##$AQSEQ= 0
##$AQ_mod= 1
##$AUNM= <au_zg>
##$AUTOPOS= <>
##$BF1= 200.13
##$BF2= 200.13
##$BF3= 200.13
##$BF4= 200.13
##$BF5= 200.13
##$BF6= 200.13
##$BF7= 200.13
##$BF8= 200.13
##$BYTORDA= 1
##$CFDGTYP= 0
##$CFRGTYP= 5
##$CHEMSTR= <none>
##$CNST= (0..31)
1 1 145 1 1 1 1 1 1 1 1 1 1 1 1 1 1 1 1 1 1 1 1 1 1 1 1 1 1 1 1 1 
##$CPDPRG= <>
##$CPDPRG1= <>
##$CPDPRG2= <>
##$CPDPRG3= <>
##$CPDPRG4= <mlev>
##$CPDPRG5= <mlev>
##$CPDPRG6= <mlev>
##$CPDPRG7= <mlev>
##$CPDPRG8= <mlev>
##$CPDPRGB= <>
##$CPDPRGT= <>
##$D= (0..31)
0 0.7 0 0 0 0 0 0 0 0 0 0.03 0 0 0 0 0 0 0 0 0 0 0 0 0 0 0 0 0 0 0 0 
##$DATE= 1738232327
##$DBL= (0..7)
120 120 120 120 120 120 120 120 
##$DBP= (0..7)
150 150 150 150 150 150 150 150 
##$DBP07= 0
##$DBPNAM0= <>
##$DBPNAM1= <>
##$DBPNAM2= <>
##$DBPNAM3= <>
##$DBPNAM4= <>
##$DBPNAM5= <>
##$DBPNAM6= <>
##$DBPNAM7= <>
##$DBPOAL= (0..7)
0.5 0.5 0.5 0.5 0.5 0.5 0.5 0.5 
##$DBPOFFS= (0..7)
0 0 0 0 0 0 0 0 
##$DE= 6
##$DECBNUC= <off>
##$DECIM= 32
##$DECNUC= <off>
##$DECSTAT= 4
##$DIGMOD= 1
##$DIGTYP= 9
##$DL= (0..7)
0 120 120 120 120 120 120 120 
##$DP= (0..7)
150 150 150 150 150 150 150 150 
##$DP07= 0
##$DPNAME0= <>
##$DPNAME1= <>
##$DPNAME2= <>
##$DPNAME3= <>
##$DPNAME4= <>
##$DPNAME5= <>
##$DPNAME6= <>
##$DPNAME7= <>
##$DPOAL= (0..7)
0.5 0.5 0.5 0.5 0.5 0.5 0.5 0.5 
##$DPOFFS= (0..7)
0 0 0 0 0 0 0 0 
##$DQDMODE= 0
##$DR= 18
##$DS= 0
##$DSLIST= <SSSSSSSSSSSSSSS>
$$ [...]
##$SUBNAM0= <"">
##$SUBNAM1= <"">
##$SUBNAM2= <"">
##$SUBNAM3= <"">
##$SUBNAM4= <"">
##$SUBNAM5= <"">
##$SUBNAM6= <"">
##$SUBNAM7= <"">
##$SUBNAM8= <"">
##$SUBNAM9= <"">
##$SW= 18.0517328524113
##$SWIBOX= (0..15)
0 0 2 0 0 0 0 0 0 0 0 0 0 0 0 0 
##$SW_h= 3612.71676300578
##$TD= 16384
##$TD0= 1
##$TE= 0
##$TE2= 300
##$TE3= 300
##$TEG= 300
##$TL= (0..7)
0 120 120 120 120 120 120 120 
##$TP= (0..7)
150 150 150 150 150 150 150 150 
##$TP07= 0
##$TPNAME0= <>
##$TPNAME1= <>
##$TPNAME2= <>
##$TPNAME3= <>
##$TPNAME4= <>
##$TPNAME5= <>
##$TPNAME6= <>
##$TPNAME7= <>
##$TPOAL= (0..7)
0.5 0.5 0.5 0.5 0.5 0.5 0.5 0.5 
##$TPOFFS= (0..7)
0 0 0 0 0 0 0 0 
##$TUNHIN= 0
##$TUNHOUT= 0
##$TUNXOUT= 0
##$USERA1= <user>
##$USERA2= <user>
##$USERA3= <user>
##$USERA4= <user>
##$USERA5= <user>
##$V9= 5
##$VALIST= <valist>
##$VCLIST= <CCCCCCCCCCCCCCC>
##$VD= 0
##$VDLIST= <DDDDDDDDDDDDDDD>
##$VPLIST= <PPPPPPPPPPPPPPP>
##$VTLIST= <TTTTTTTTTTTTTTT>
##$WBST= 1024
##$WBSW= 4
##$XGAIN= (0..3)
0 0 0 0 
##$XL= 0
##$YL= 0
##$YMAX_a= 241957
##$YMIN_a= -233120
##$ZGOPTNS= <>
##$ZL1= 120
##$ZL2= 120
##$ZL3= 120
##$ZL4= 120
##$ABSF1= 10
##$ABSF2= 0
##$ABSG= 5
##$ABSL= 3
##$ALPHA= 0
##$AQORDER= 0
##$ASSFAC= 0
##$ASSFACI= 0
##$ASSFACX= 0
##$ASSWID= 0
##$AUNMP= <proc_1d>
##$AZFE= 0.1
##$AZFW= 0.1
##$BCFW= 1
##$BC_mod= 2
##$BYTORDP= 1
##$COROFFS= 0
##$CY= -3
##$DATMOD= 1
##$DC= 2
##$DFILT= <>
##$DTYPP= 0
##$F1P= 0
##$F2P= 0
##$FCOR= 0.5
##$FTSIZE= 0
##$FT_mod= 4
##$GAMMA= 1
##$GB= 0.15
##$INTBC= 1
##$INTSCL= 1
##$ISEN= 128
##$LB= 0.25
##$LEV0= 0
##$LPBIN= 0
##$MAXI= 10000
##$MC2= 0
##$MEAN= 0
##$ME_mod= 0
##$MI= 1.114404
##$NCOEF= 0
##$NC_proc= 0
##$NLEV= 6
##$NOISF1= 3.799351
##$NOISF2= 2.8
##$NSP= 1
##$NTH_PI= 0
##$NZP= 0
##$OFFSET= 14.38212
##$PC= 1
##$PHC0= 78.53519
##$PHC1= 31.39222
##$PH_mod= 1
##$PKNL= yes
##$PPARMOD= 0
##$PSCAL= 0
##$PSIGN= 0
##$REVERSE= no
##$SF= 200.129724274929
##$SI= 16384
##$SIGF1= 3
##$SIGF2= 2
##$SINO= 400
##$SIOLD= 16384
##$SREGLST= <1H.CDCl3>
##$SSB= 0
##$STSI= 0
##$STSR= 0
##$SW_p= 3205.1282051282
##$SYMM= 0
##$S_DEV= 0
##$TDeff= 0
##$TDoff= 0
##$TI= <>
##$TILT= no
##$TM1= 0
##$TM2= 0
##$TOPLEV= 0
##$USERP1= <user>
##$USERP2= <user>
##$USERP3= <user>
##$USERP4= <user>
##$USERP5= <user>
##$WDW= 1
##$XDIM= 8192
##$YMAX_p= 0
##$YMIN_p= 0
$$ End of Bruker specific parameters
$$ ---------------------------------
##NTUPLES= NMR FID
##VAR_NAME=  TIME,          FID/REAL,        FID/IMAG
##SYMBOL=    X,             R,               I
##VAR_TYPE=  INDEPENDENT,   DEPENDENT,       DEPENDENT
##VAR_FORM=  AFFN,          ASDF,            ASDF
##VAR_DIM=   8192,          8192,            8192
##UNITS=     SECONDS,       ARBITRARY UNITS, ARBITRARY UNITS
##FACTOR=    0.0002768,     1,               1
##FIRST=     0,             0,               0
##LAST=      2.2672688,     0,               0
##MIN=       0,             -233120,         0
##MAX=       2.2672688,     241957,          0
$$ Real data points
##PAGE= N=1
##DATA TABLE= (X++(R..R)), XYDATA
0 0 0 0 0 0 0 0 0 0 0 0 0 0 0 0 0 0 0 0 4 -8 8 -8 8 -8 16 -16 16 -21 24 -27 32 -36 42 -48 53 -60 68 -76 86
39 86 -96 108 -119 134 -150 165 -182 202 -223 246 -270 297 -328 360 -397 437 -483 533 -591 655
59 655 -729 814 -914 1035 -1178 1352 -1562 1801 -1981 1411 9649 241957 129686 -183622
73 -183622 -121797 83715 89065 -15598 -22073 -28458 -53035 27582 112232 3605 -118321 -41754
85 -41754 100707 85754 -52161 -106646 1472 95832 47981 -51926 -63583 10350 52640 18271
97 18271 -14820 -32364 -33479 25810 63649 -8700 -63430 -1241 54822 5930 -38642 5114
109 5114 20441 -29482 -2937 55428 -6005 -70690 4662 76728 5230 -77139 -18501 59212
121 59212 9290 -43151 4508 25396 -21291 -19027 36699 31543 -43043 -50296 36615 56318 -25580
134 -25580 -54403 10590 51558 5620 -43905 -11702 27889 27 -16793 9512 4626 -21698
146 -21698 -2250 36634 12885 -44327 -20584 43585 20038 -32103 -10627 19812 1822 -8595
158 -8595 12700 9028 -25721 -12091 32853 9092 -33527 -4393 26227 957 -17025 2366
170 2366 12821 -6170 -10574 14233 12823 -14317 -13106 7207 15360 4190 -17216 -10575 16038
183 16038 9333 -10486 -3166 4185 -8724 -9963 17664 20087 -26422 -28422 31195 31401 -26027 -27357
197 -27357 14695 18783 -5470 -6818 2580 -8725 -4278 24250 7986 -31924 -14853 24604 19204
210 19204 -12503 -22888 -645 18729 10012 -6600 -13925 -5243 13498 11733 -5590 -10302 -6515
223 -6515 6855 18925 -1058 -24024 -6420 22039 13743 -18869 -18631 13700 14142 -8480 -3903
236 -3903 3497 -4805 63 10872 2034 -13951 -5825 17394 8685 -16652 -5688 13465 2965
249 2965 -7984 -2566 3213 633 -3763 2128 4153 -5512 -2523 6031 493 -3522 -1326 592 3680
264 3680 10 -3484 2464 3110 -2186 -3179 382 4584 -2051 -8355 4802 8432 -7615 -6245 7200
279 7200 3546 -6471 -3437 6096 1480 -7167 3695 8014 -7507 -4797 9576 2218 -8181 -2261
293 -2261 6048 2691 -5150 -1508 3582 -1410 96 2435 -4533 -1724 5070 403 -2096 -74 -318
308 -318 1703 2685 -119 -3779 -2351 6889 3483 -9633 -1771 9156 -1118 -5996 2071 2239 -3081
323 -3081 -1518 4321 480 -7255 1628 8454 -3439 -5711 3756 2811 -1328 -1019 -567 858 523 369
339 369 218 -2741 332 2989 -2444 -1655 1583 -1576 564 2637 -2165 -1962 2026 2494 -765 -3677
355 -3677 1408 4089 -2242 -1174 2610 -1922 -1203 2889 -85 -2975 -1803 2491 3575 -3051 -3403 2693
371 2693 1448 -457 248 -1688 -71 2054 918 1091 -1615 -2375 2560 2142 -1105 -1490 -2571 1040
387 1040 4340 -1014 -3849 -1264 1578 3366 -826 -3768 161 1149 1682 2866 -2784 -4122 2424 3937
403 3937 532 -3046 -3063 1641 2653 951 -507 -5491 -2402 7497 3073 -6378 -3916 2593 4519 900
419 900 -2833 -1749 -896 2255 5734 -1560 -6878 429 4551 2701 -340 -5596 -3972 4885 6635 -1609
435 -1609 -9208 -2152 9332 3502 -5849 -2583 89 1371 5106 1415 -5548 -4393 3328 7369 -172
450 -172 -7123 -2725 2544 5357 3307 -7613 -8229 6079 9024 -2167 -7863 -1810 5479 3334 -1134
465 -1134 -1225 -3501 -1670 6570 4365 -4298 -5358 -770 5520 5564 -4063 -8629 -1160 8115 6296 -6661
481 -6661 -8504 4035 6250 -671 -2150 -2168 -1910 1918 5288 3151 -5698 -7644 4559 9587 -838
496 -838 -9009 -5379 6111 9842 -2048 -9686 -2821 5087 5912 -592 -6024 -1969 2651 3613 3649 -2548
512 -2548 -7404 -668 7862 6423 -5230 -10999 1507 11571 2493 -8270 -7033 2286 8653 2119
526 2119 -6639 -4697 1554 5069 2827 -2718 -3544 -1915 1656 7855 2561 -10234 -6236 8302 9214
541 9214 -4444 -11390 32 9871 2972 -4688 -4671 -1684 3840 4325 -1494 -3450 -1893 1361 5521
556 5521 2986 -4890 -7488 888 10849 3418 -10944 -5436 7598 5705 -2436 -5293 -2760 2288 4120
571 4120 1939 -3303 -5429 1644 6097 928 -2717 -3589 -2302 5277 7000 -3400 -9100 -673 9352
586 9352 4343 -8045 -6095 3545 4639 1597 -2200 -4983 -743 4222 2841 -1198 -4099 -1500 3877
601 3877 4430 -16 -5894 -4944 5847 7898 -3956 -7605 841 5947 1868 -4149 -3266 734 923 2133
617 2133 1953 -3105 -2926 2189 3067 461 -2665 -2391 1967 2969 426 -1640 -2719 794 3319 -707
633 -707 -2413 -379 74 744 1070 88 -916 -2132 311 3621 132 -2868 -685 1105 2271 1379 -2574
650 -2574 -2509 1193 2921 689 -3272 -1643 2631 672 -1231 184 -1559 -1295 2804 2527 -1921 -3612
666 -3612 778 4506 62 -3585 -269 1343 1293 1328 -1698 -2320 902 1738 109 -1759 -1218 1276 709
683 709 -5 418 -1871 -919 2904 805 -2204 -534 1291 1286 64 -689 -149 -822 73 1999 -900 -2119
701 -2119 1058 805 -565 -1 -543 -522 232 828 1012 -1149 -1249 1866 1053 -961 -180 -278 287 1298 -407
720 -407 -952 -436 -155 916 95 -1124 -47 -20 318 1129 -964 -1267 1011 844 203 -412 -754 904 927
739 927 -701 -250 -302 -274 769 -167 -662 42 -368 535 482 -1254 -49 755 -263 334 149 -403 578 369
759 369 61 -118 -701 760 852 -1357 -245 850 -403 -126 -73 -631 134 190 181 -127 -851 745 982 -918
779 -918 -4 684 -585 506 762 -845 -520 459 716 -289 -1428 355 1015 -870 -110 381 -922 458
797 458 915 -662 -432 441 776 184 -863 362 682 -762 284 484 -981 163 806 -701 -431 1
815 1 137 135 -514 133 298 -447 726 493 -1265 387 1212 -475 -456 31 236 400 -441 -195 121 -635 274
836 274 380 -934 19 373 -300 447 47 -510 422 371 212 220 -533 178 527 -253 278 -207 -900 679 525
857 525 -745 -279 -231 12 614 -340 -210 -44 -249 961 503 -969 -104 463 490 583 -894 -905 985 577
877 577 -327 -573 -688 404 542 -236 -43 -819 -387 1641 358 -1352 -267 569 842 335 -826 -156
895 -156 387 103 637 -284 -1159 81 445 409 11 -1508 -338 1616 279 -975 -508 177 1008 90 -307
914 -307 355 -697 -136 1595 146 -1472 -488 523 1130 1 -1609 -454 770 680 212 -1335 -796
931 -796 1269 737 -151 -351 -977 429 1354 -58 -680 -568 17 1105 361 -720 -870 -764 1256 1627
949 1627 -1708 -2035 1079 1744 13 -1518 -536 1258 343 -358 597 -395 -804 535 1105 412 -1306 -1740
967 -1740 1383 2220 -1117 -2205 45 1942 748 -1775 -838 1138 -15 26 829 -418 -955 145 1093
984 1093 872 -1238 -1455 918 1433 44 -1193 -1446 739 1715 -459 -1386 -396 603 1284 -182 -1192
1001 -1192 139 403 224 412 -88 -382 -462 79 1825 156 -2599 -669 2195 972 -1582 -1782 982
1018 982 1962 -718 -1332 358 323 -124 129 608 425 -1270 -668 2214 839 -2359 -1245 1764 1817 -984
1036 -984 -2071 517 1220 -516 -224 31 -560 419 760 145 -357 -761 104 1060 314 -290 -731 -455 1373
1055 1373 741 -1318 -854 318 769 558 -990 -949 645 825 -84 -781 -204 795 -242 -426 1362 135
1073 135 -1727 282 1860 21 -2024 -706 1964 900 -1768 -496 941 -32 -266 -27 51 88 -334
1090 -334 426 992 -567 -1120 257 1069 438 -1093 -771 1241 507 -970 -188 35 -347 262 300 -219 -641
1109 -641 -170 1023 219 -1118 133 627 -121 203 159 -113 -190 -74 652 185 -1222 -212 1040 187 -688
1128 -688 -559 338 615 -603 -382 717 -168 -498 658 534 -377 -643 186 1054 -132 -995 385 660
1146 660 -234 -306 -283 137 89 -429 326 427 -768 -187 807 216 -549 -390 646 665 -720 -146 899 -362
1166 -362 -597 522 276 -532 -491 380 684 -590 -583 622 114 -366 83 33 150 81 -175 404 192 -512 -31
1187 -31 364 57 -242 -438 418 377 -763 -216 632 -299 -360 430 297 -324 -307 359 546 -731 -240 912
1207 912 -52 -523 209 278 -82 -350 -104 499 -177 -570 264 241 -304 -149 -8 394 -43 -683 421 658
1227 658 -407 -356 393 304 -215 -427 191 468 -495 -236 522 -40 -379 -6 140 154 -259 -213 627 52 -444
1248 -444 236 222 -94 -81 24 344 -107 -458 405 247 -609 78 344 -142 -297 3 329 -53 -531 283 407
1269 407 -388 -90 379 82 -21 -143 39 330 -226 -337 211 157 -180 -273 -21 445 -241 -564 453 303
1289 303 -524 21 397 3 -193 -87 484 29 -531 248 388 -297 -69 91 -73 47 -68 -6 53 -211 50
1310 50 163 -110 26 54 -70 305 -32 -202 367 36 -221 204 51 -67 -103 -35 214 -154 -361 362 189
1331 189 -450 -10 147 44 10 -65 159 161 -171 117 272 -113 -62 -11 61 214 -301 -232 312 -29 -215 96 -17
1354 -17 9 104 -97 87 -51 -84 277 -53 -199 186 -82 8 208 -225 -148 100 -107 19 -85 -199 109 8
1376 8 -10 42 -230 -2 455 -106 -173 218 38 86 47 39 103 -220 -51 393 -135 -197 86 -52 23 48 -300 -84
1400 -84 173 63 22 -163 -31 309 -97 -58 248 -150 -57 247 29 -145 -64 -116 260 46 -281 -113 -33 187
1422 187 167 -324 -52 373 -18 -17 100 -44 107 8 30 100 -153 -150 205 37 5 -88 -274 173 230 -370 -119 114
1446 114 158 108 -164 -35 260 -3 20 182 -45 2 -39 -41 265 -63 -474 89 355 15 -344 -208 376 298 -370
1469 -370 -84 223 -72 -46 25 -24 99 -61 -55 283 42 -251 -65 79 257 -181 -479 246 355 -208 -216 98
1491 98 86 96 -76 32 62 -133 121 198 -48 57 -70 -158 326 150 -337 -130 280 211 -147 -344 118 230
1513 230 -114 41 29 -59 59 -10 -13 127 -127 -183 197 234 -86 -273 -97 387 -19 -481 -4 269 -61 -86 -6
1536 -6 33 29 -102 113 151 -112 -50 126 -4 113 -178 -180 309 68 -231 -68 78 17 4 -92 4 -23 -57 172 62
1561 62 -158 160 33 -91 124 -23 -112 13 65 90 -115 -216 102 55 -170 -12 24 23 127 -76 -56 103 -84
1584 -84 9 219 33 -22 -70 124 247 -174 -236 270 71 -192 -16 11 31 -77 -23 188 -21 -206 126 153 -42
1607 -42 18 -39 91 143 -131 -97 81 -9 43 -7 -6 63 -111 -63 121 -124 -121 201 15 -62 88 -21 39 14 -36 152
1633 152 -49 -64 167 32 -190 -17 -54 -38 7 -83 162 48 -165 55 73 -70 22 -18 81 73 -229 91 235 -142
1657 -142 -156 93 30 -6 -68 -1 148 -90 -112 42 70 -77 -68 -20 204 72 -116 89 115 -67 6 9 82 -1 -66 79
1683 79 52 -175 13 111 -117 -21 68 -79 -85 -50 8 39 -126 41 154 -122 12 33 -22 52 -27 -42 105 -58 -209
1708 -209 68 25 7 -84 -44 141 -10 -184 75 199 -56 -19 54 69 1 -49 89 131 -126 1 113 -66 -43 -27
1732 -27 -29 40 -52 -29 90 1 -62 35 38 -27 54 14 53 -45 -144 122 47 -167 92 14 -44 13 -48 92 14 -87 -20 101
1760 101 -47 57 82 -4 85 -48 -21 106 2 -60 38 42 -2 -43 -6 95 -97 -93 97 -2 -113 93 55 -23 30 11
1786 11 95 -17 -97 122 18 -103 27 51 -9 -10 -82 -42 118 -67 -55 28 38 53 -88 -15 83 -57 -59 188 17 -117
1812 -117 77 77 79 -37 -93 42 -38 -87 62 -27 -93 30 -27 -66 8 -21 -30 9 -86 28 18 -27 20 39 -1 61 -55 16
1840 16 85 -71 -41 132 -27 14 -89 16 155 -47 -18 121 71 -67 59 8 29 -29 -25 74 44 -110 -15 17 23 -60
1866 -60 -54 8 44 -95 -55 79 -24 -90 78 13 -42 -53 14 47 31 -29 62 -88 -17 44 -43 -33 -7 -47 46 7 -76 13
1894 13 11 39 9 -48 82 14 -87 64 89 -125 -3 79 -35 -42 -87 14 59 -95 -67 60 -80 45 46 -22 42 34 -21
1921 -21 20 10 -14 13 2 35 9 -61 15 -18 -50 3 -34 -108 36 35 -37 -29 -53 55 23 -101 93 14 -72 -2 76 -23 -63
1950 -63 -54 13 70 -130 -112 7 -4 9 15 -24 102 -14 -78 66 11 -48 28 10 -1 30 -33 27 78 -80 -79 20 -4 74 -51
1979 -51 -88 26 16 11 41 47 20 -62 -43 116 -27 -107 42 60 -52 31 -30 -20 38 -6 -66 29 -22 28 -3 -65 98 56
2007 56 -12 106 119 -24 74 -4 31 -21 -5 -23 22 -13 -11 -46 -45 45 -30 -90 49 55 -11 -20 -33 94 -43 -25 33 64 -56
2036 -56 -17 8 6 12 -76 -85 40 26 -91 -34 3 25 -52 -5 138 52 -14 14 80 -28 -28 15 49 94 19 7 74 -16 70 -24
2066 -24 4 29 -87 -17 40 -47 -31 64 -6 -3 1 -37 -15 40 36 18 -50 -48 98 -58 -55 -18 12 45 -54 -55 -10 -19 -35 67 42 74
2098 74 1 46 52 32 -100 -27 142 18 -34 39 0 -8 -69 -40 -6 -53 -39 69 15 -10 21 -13 70 29 -42 28 26 -32 31 11
2128 11 -18 10 -68 35 18 -35 -20 5 -9 10 53 1 55 20 40 52 -7 48 126 -10 -55 11 14 50 -25 41 32 -50 -45 5 18
2159 18 -38 -86 24 80 -86 -21 5 24 24 37 45 30 13 -34 102 3 -39 -34 64 -45 -8 48 33 43 36 -21 -49 -9 12 -15
2189 -15 30 -8 6 17 -7 -22 -32 91 -6 -100 -3 12 24 24 -75 27 -50 -1 82 72 -43 -29 15 -1 10 41 11 46 19
2218 19 4 23 -23 40 -22 -25 -20 -7 -49 31 -36 -82 1 34 -29 43 -31 37 26 -45 4 29 -48 -6 -32 17 0 -30 21 57 -57
2249 -57 -34 31 -51 13 22 14 -7 -44 -12 48 -7 7 16 16 26 -64 -2 39 -10 -6 64 -36 -56 21 -18 -6 -6 24 41 -20 -4 30 30
2282 30 -20 -25 26 -35 12 0 -14 -15 15 -35 53 -33 -38 -24 -62 -12 -34 0 -20 -4 3 -39 34 21 31 1 45 -56 -15 44 36 -19
2314 -19 50 -4 -38 0 -79 -2 45 -67 -29 51 5 -19 15 53 39 12 -26 25 20 -30 7 26 -24 26 -15 -13 -58 -9 39 25 -10
2345 -10 -23 -16 9 36 -4 13 27 2 -61 -45 15 29 36 40 9 99 30 25 19 26 15 19 -23 5 32 24 38 -32 -7 -21 -28 63 -43 2
2379 2 45 -24 80 -6 -60 -10 -18 4 25 -22 -10 0 10 -22 71 23 2 48 -18 -29 16 -46 32 -26 1 -5 -122 22 14 18 -27
2410 -27 17 -30 34 -20 -30 21 24 39 50 51 0 35 -75 41 -49 -9 18 -24 -5 -13 -1 -10 8 -18 -11 -12 -31 -4 -72 1 18 -36
2442 -36 31 -32 -46 -13 19 -35 -20 0 -13 25 14 16 63 39 29 31 -10 13 55 36 -20 -36 1 -19 21 37 8 -8 -42 -11 49
2473 49 67 47 -8 -3 -2 26 27 -27 21 41 13 0 -11 6 20 -41 28 45 -2 25 -1 -1 34 33 23 -43 2 -38 25 6 -30 54 36
2506 36 7 -6 4 3 -9 -26 -12 1 -37 14 8 -10 -37 12 -23 -32 -18 33 -45 -21 -16 32 1 42 -13 21 -25 -13 -6 -18 60 -2 -23
2539 -23 8 -46 36 -30 -13 -20 -60 -5 -15 46 19 -20 -2 2 -2 17 -61 -26 68 85 37 2 0 -15 -11 26 35 -5 -7 -21 8 -2 -1 25
2573 25 -8 47 35 -33 -65 40 14 2 2 -63 -22 7 -70 36 50 2 -8 -24 30 15 -33 17 0 23 34 5 -4 -28 7 -3
2603 -3 -26 14 -13 -47 30 33 30 13 -21 79 29 3 -68 5 35 -18 -7 -3 9 11 30 15 -33 47 29 32 5 25 7 -22 14 9 44
2636 44 -12 18 17 36 0 7 26 -20 71 55 40 -71 -23 -19 41 -10 -25 0 50 -57 23 -19 11 34 6 23 -4 -25 2 -54 -88
2667 -88 1 -17 -20 7 1 10 -45 11 -4 6 10 50 55 43 -29 38 13 -54 3 9 43 48 42 -27 15 16 36 -44 4 -39 55 15 -30 -26 24
2702 24 17 -25 -6 -1 34 26 -6 -33 -1 -3 16 64 -18 21 -48 2 44 20 42 20 21 -7 38 12 -13 34 -2 30 39 15 16 25 -9 -33
2736 -33 -56 33 26 -54 -18 35 44 16 -26 -68 -20 51 16 1 -26 -25 -24 -34 41 7 -19 47 -19 -11 42 28 -36 9 -29 67 51 16 -66
2769 -66 26 0 31 30 -11 -25 33 -11 -5 12 -22 -10 -29 -14 -5 14 -15 -30 0 56 18 29 10 -77 -31 38 11 30 22 75 3 -6 17
2802 17 22 -30 -94 2 -26 46 -16 -18 -10 -22 -38 35 34 10 -27 -1 -11 28 -33 27 25 -24 -12 -18 -5 -4 -74 -15 -5 18 -53 -36 55 -26
2836 -26 20 46 -28 -56 24 -1 -33 -7 -22 -30 62 -8 -4 9 -32 12 -29 11 43 44 30 -23 -29 24 -40 -14 -4 -46 14 -31 9 8 8
2869 8 -24 1 -50 -15 14 -20 37 -23 -12 -3 -7 -24 25 -9 49 3 2 4 20 20 25 47 41 29 59 2 -7 -16 -47 7 -24 25 -21 59 23
2904 23 -18 -7 -35 28 18 -40 31 10 -5 17 25 10 44 13 11 21 -33 17 7 -16 -1 -7 -8 -56 -18 55 11 -20 37 11 24 -19
2936 -19 2 31 -56 -38 2 5 42 48 16 15 48 -10 1 -6 -11 -39 40 15 2 -7 -21 -9 30 26 -34 19 29 -60 31 22 15 9 51 -17 20
2971 20 -1 -30 -38 37 10 -5 -28 -50 19 23 14 -15 -17 43 -2 -34 6 -5 40 -25 -31 12 -28 20 36 -9 34 -29 -6 3 -10 -14 -6 37
3005 37 14 -62 -27 50 40 42 6 -67 27 25 81 47 13 0 1 -2 -10 0 14 -1 -3 21 2 70 -16 16 15 -22 -54 -34 23 7 17 -48
3039 -48 -22 24 -2 -15 3 -22 -2 -36 17 40 -22 11 -12 2 5 -31 -13 -47 37 -10 2 -12 26 1 -6 -8 16 52 26 27 0 -3 -3
3072 -3 15 -7 23 18 -1 8 -8 -48 -5 -20 -13 53 5 54 -20 -23 25 -7 51 12 -30 -44 -20 21 24 -19 36 27 -28 17 -6 4 15 3
3106 3 -38 27 -20 -5 58 25 -3 5 -23 25 23 -1 14 14 -58 -31 -57 -14 4 -28 -35 -40 -40 -12 17 -22 -67 -46 9 -1 -23 35 41 -14
3140 -14 27 12 -17 72 -18 43 -70 -4 15 16 38 -1 10 47 12 -3 80 -10 -15 23 -15 41 21 36 64 -25 15 -20 8 18 -28
3171 -28 11 -4 4 -43 -3 -83 12 -20 45 44 14 -53 29 27 -9 -31 54 28 35 -8 48 38 54 16 6 -35 -33 -4 62 55 33 27 -33 24
3205 24 30 -14 -20 6 -49 -13 29 -75 -15 18 32 45 0 1 -16 -1 43 -15 36 63 50 7 9 33 23 28 26 -6 80 -6 -8 -24 -17 -2
3239 -2 -8 9 -45 66 -11 -22 72 10 -15 -56 -16 15 -14 29 -72 -14 54 8 14 12 52 33 -27 -41 26 -52 1 32 -7 -8 13 -38
3271 -38 1 4 25 -2 72 25 -21 16 -16 -28 36 6 6 -13 -3 1 -5 29 -66 21 -6 -9 47 36 -50 23 33 35 43 9 -12 40 13 11
3305 11 -22 7 26 85 15 -27 43 -61 31 -23 -15 33 -8 -39 -24 35 -12 -9 -31 24 -19 20 37 -3 -33 3 3 -86 33 19 -25
3336 -25 5 -4 -32 -2 -21 -3 65 7 -3 1 46 -5 18 25 39 -3 -4 30 0 29 -17 14 -29 -24 -13 35 -13 -27 -43 -10 54 -12 -43
3369 -43 -64 12 4 63 2 -59 -1 2 -24 -64 1 39 18 18 1 10 -31 -18 6 95 10 -18 46 45 -7 49 -6 21 26 7 64 45 22
3402 22 -16 40 48 -21 -33 -46 -51 -66 15 -52 -12 -27 -26 -16 -18 32 3 16 -20 42 2 -27 18 11 -31 -56 -36 33 13 -46 15 15 15 1
3436 1 -22 -11 -55 -21 -49 -29 13 -15 18 -42 -6 0 -24 -2 -3 -53 -7 8 -15 33 43 -22 -23 -18 10 24 -54 2 -9 0 -74 -14 43
3469 43 7 6 46 33 51 -7 -54 21 -26 45 50 -5 3 39 5 16 -27 1 24 0 -36 27 -31 20 6 41 34 -4 8 -22 -34 -31 -15
3502 -15 30 -3 -6 -19 -15 -19 59 12 0 -30 8 43 20 -20 -1 -4 52 14 26 -73 25 12 -48 11 17 24 -24 -9 -48 -8 58 53 -8 0
3536 0 -4 -33 1 -6 21 -12 11 41 72 9 -26 25 -18 58 5 -17 -6 -10 49 -2 -14 -30 -15 39 32 18 0 13 4 32 45 49 20 4
3570 4 42 46 2 -53 59 38 -33 -9 29 -5 -107 2 -7 -31 44 20 -36 -1 -25 -56 -44 40 26 -21 -31 -4 16 21 0 -33 -21
3601 -21 37 41 -39 -29 -5 6 53 42 39 1 24 -29 -5 2 38 -8 23 -19 11 24 37 29 -42 -26 -21 23 -32 -33 -59 6 2 1 -14 5
3635 5 3 -35 -8 -13 17 -22 -30 7 87 -29 -21 39 53 -30 -13 -4 20 15 15 23 -31 -43 60 2 -71 25 -81 15 34 -81 -27 -46 25
3668 25 -22 -23 -8 23 36 27 -10 -11 -3 2 16 -20 20 -26 -26 16 11 0 1 -11 19 8 -10 -69 21 -9 20 -7 -19 16 -6 -8 -12 -17 49 53
3704 53 -21 5 -48 9 75 0 -16 31 -7 -30 -9 9 39 -13 -12 -1 -14 25 10 64 28 52 4 -5 1 69 -9 13 -51 -7 -20 48
3736 48 -9 -8 39 -37 -2 -69 -5 -36 17 -6 -59 8 -18 19 -48 17 -8 -12 30 24 29 28 4 3 -44 11 -1 21 -3 -11 -43 28 34 -24
3770 -24 45 29 -17 -24 -41 -28 -2 -14 -64 14 23 11 43 2 5 -36 0 46 21 34 13 -5 2 -60 1 6 22 20 -76 -21 2 -57 -1
3803 -1 -12 46 10 -40 -25 4 -12 -10 32 -33 4 64 -3 -2 -4 1 -1 -39 22 -15 33 -8 14 -21 -54 11 -71 -3 -12 27 50 -13 12 6
3837 6 12 -21 -34 -41 10 16 -39 -9 -10 -53 49 9 -50 35 17 108 0 24 -3 -18 52 -55 -19 20 19 42 18 -26 -5 -32 -2 -34
3869 -34 4 1 41 -3 4 16 -39 9 -37 -26 -14 -3 5 -23 -29 -59 -61 -2 -29 -1 3 -31 -20 7 4 20 -16 60 -30 -23 48 65 35 35 26
3904 26 12 -1 -13 9 62 32 6 -34 3 -6 4 16 -52 21 4 -8 -1 -3 5 -6 0 -26 -1 -14 -12 64 -19 8 -9 -19 29 -16 19
3937 19 24 14 -9 -2 15 19 -28 -20 -36 14 32 -27 -12 -4 -9 5 -42 48 29 -15 30 -43 -8 -72 28 -46 -65 7 4 39 13 -1 -12
3970 -12 -2 6 -13 -56 39 97 33 12 2 21 16 -13 -44 41 29 11 -10 -12 -13 -2 -56 17 -23 -2 39 28 65 -35 -42 5 11 26 47
4003 47 28 32 -20 -40 30 -43 -43 21 9 -52 -25 2 84 -41 14 14 -48 12 36 19 -48 60 17 -37 -2 -5 22 -5 9 -40 -32 -18
4035 -18 61 27 26 -37 -4 -14 27 3 -12 -29 8 -37 5 18 -35 16 -24 23 -62 -3 16 66 -34 -6 61 51 24 -51 -1 40
4065 40 51 10 28 47 49 -18 -14 -38 26 1 38 -10 8 19 18 45 26 -14 50 21 -59 -27 13 -1 19 -15 -24 -7 -41 11 -48 29
4097 29 -34 -23 -15 -51 -8 -6 45 3 67 0 1 5 -17 35 22 9 -20 5 -31 -16 46 20 33 -3 -12 35 17 54 -59 -17 10 -55
4129 -55 -43 18 -14 -6 -28 42 9 -59 -16 32 11 63 -16 -20 -34 -24 -1 35 -51 -13 3 -31 21 -6 -6 3 23 16 47 -9 -46 -33 -4
4162 -4 29 -50 -88 -22 4 -7 -40 32 -1 -61 17 -17 -63 28 -16 16 55 5 3 -23 -17 6 -35 -31 48 12 3 6 8 48 59 59 1 -14
4196 -14 2 44 24 -2 -15 31 -13 19 12 -45 -22 14 -11 -19 -27 -37 -7 3 41 21 -2 20 -23 -64 -44 -8 16 -39 0 -2 -15 41
4228 41 -27 -29 -4 25 35 15 3 20 26 1 33 85 27 0 23 9 -1 -13 -31 -40 3 -9 15 18 -11 -25 -89 -39 -16 23 -63 19
4260 19 -15 -6 34 9 5 0 23 3 -2 4 9 28 22 19 -2 20 5 -30 11 -11 17 33 41 32 24 -1 -13 14 5 13 19 -38 0 -3 -41 14 -15 -26
4298 -26 16 -39 13 -19 73 18 16 87 -10 17 33 -10 27 5 21 33 3 18 -67 -1 -22 -13 -1 -21 32 0 -11 51 -39 54 -31
4329 -31 32 9 -4 -27 -53 -16 -19 31 29 22 31 -16 -33 -61 18 -28 -27 -10 -33 17 9 -22 -8 25 -8 18 45 -31 -9 64 -6 -10 1 35
4363 35 0 -7 -3 31 -27 33 -51 12 -35 9 7 7 1 -36 -22 30 -43 -27 -19 -55 -67 -13 -20 -18 25 15 4 -13 -14 -56 29 -3 25 -9 17
4398 17 17 -4 -36 3 -17 -9 -6 0 16 -48 14 34 3 -28 43 40 60 -35 -9 1 -52 10 45 24 15 -19 -23 -19 18 44 -11 -12 23 -19 -17
4433 -17 -25 9 24 40 57 -2 -49 6 14 8 17 54 25 22 15 18 11 46 -2 59 -16 -23 -37 -20 10 -15 -16 3 40 -25 -28 51 70 6 18 -31
4469 -31 14 -10 -22 52 -44 -16 7 46 36 8 9 68 -19 -20 3 58 41 61 37 15 34 0 21 -50 46 -9 5 -15 -41 4 26
4500 26 40 50 -8 27 31 -16 -68 -27 14 -12 -28 13 54 11 46 -54 21 -31 77 -13 -25 23 -29 -1 -4 -11 -20 14 -18 13 29
4531 29 24 -17 2 -40 -25 33 6 15 25 4 -2 -13 -44 -30 38 -14 -38 -30 -14 -4 -41 -12 -73 -2 23 8 -45 -53 30 -19 -95 -35 -38
4564 -38 -42 7 -2 -12 9 9 44 -10 72 17 12 24 -19 57 54 9 36 -42 7 17 24 -39 -58 49 7 -6 11 50 -60 28 -11 14
4596 14 30 -8 -34 -18 -78 32 5 41 4 -71 28 16 -23 15 -1 -6 21 -1 3 -9 13 23 -7 13 9 -17 43 -14 -41 46 -11
4627 -11 70 -4 10 25 1 -8 -27 27 -27 -20 -36 1 -9 -54 24 -21 2 -67 35 -17 10 45 29 -29 -21 52 16 39 -5 50 68
4658 68 100 6 -5 -52 5 22 26 16 6 -41 -14 0 4 -5 22 -35 -7 3 -13 -9 -22 81 -10 -31 32 17 -1 25 2 -2 55 55 -58
4691 -58 32 -3 31 72 22 45 11 -7 41 -32 -3 -3 -52 -17 6 17 -23 -17 24 -57 2 14 16 9 -19 -5 -7 32 20 -21 8 -12 12
4724 12 -13 19 -38 -6 1 1 -38 51 2 -43 54 -41 26 -40 -30 -39 -20 38 5 -43 12 -4 -18 -19 12 19 11 -5 36 -24 -45 -2 9
4757 9 -9 -10 -7 26 11 -42 26 -11 27 -36 9 35 -4 -5 42 22 -4 -1 36 22 10 -15 10 -9 28 24 -12 35 37 4 59 27 -8 -20
4791 -20 -36 -22 -72 15 62 -5 -43 7 49 41 -9 36 -63 7 20 41 -9 26 16 -5 -44 -38 43 17 -28 15 39 7 4 12 9 -24 31
4824 31 23 -43 -5 38 -21 6 21 -27 27 -65 64 15 -5 -15 -7 -26 30 -8 -1 -9 -1 29 0 -1 11 26 58 -28 26 -9 -10 9 -10
4857 -10 6 19 -25 -21 18 18 74 -26 11 36 36 31 -4 -33 31 -5 -63 -4 5 -20 3 -31 -26 32 2 1 -87 11 -9 -10 -18 -14 -18 18 -23
4892 -23 -56 22 -43 -1 -7 31 11 50 24 -19 -13 5 7 24 37 19 22 -28 19 -32 47 14 -27 -8 20 22 5 -20 7 -44 13 3 21
4925 21 -22 13 -32 13 49 32 -14 -17 -67 3 -40 8 -29 -31 16 -38 48 -28 63 -53 -17 30 53 -27 21 -7 52 46 20 -32 25
4956 25 19 2 5 -57 -27 28 21 -27 -57 43 -10 -17 22 14 -44 -51 18 38 62 -30 33 -41 -12 -4 1 45 48 29 3 11 -5 -1 10 -33 41
4991 41 21 20 21 25 29 -10 0 -5 3 35 48 -23 -11 3 -43 4 20 -9 17 -20 44 -40 -75 -13 -23 -16 -4 7 -2 -25 -7 71 59 10
5025 10 -26 -21 31 21 -27 -43 -39 56 24 26 -54 31 -16 5 -24 20 63 -6 28 24 8 4 5 -39 18 -25 -8 -36 13 -41 13 0 -55
5058 -55 1 68 -8 30 -11 -55 -66 -15 32 10 3 -15 -38 -50 -56 3 63 29 22 13 5 12 48 43 28 -24 -2 -38 15 36 -39 -23 12 -6
5092 -6 -10 -6 -24 4 19 -74 22 -12 21 24 -44 8 34 -58 5 -23 -6 33 -40 60 -21 -8 -57 -16 -20 32 -42 30 30 -49 28 -6 17
5125 17 -14 9 45 22 57 -37 -51 75 19 -57 21 31 -36 11 -41 47 -2 -3 19 -8 -15 8 5 21 7 -9 13 -39 26 -9 4
5156 4 15 -9 10 -2 -30 -6 -34 63 19 39 42 2 53 24 28 3 -35 -22 -13 20 -13 -13 30 -38 -2 -28 -55 -13 62 -52 -12 -22
5188 -22 10 -30 -7 5 7 27 -40 -90 -8 2 52 14 14 1 35 37 40 10 37 9 -5 11 6 49 -14 16 -20 -3 -11 61 -65 -18 -47
5221 -47 -55 12 -25 61 13 -52 34 26 -20 1 42 -4 -42 -40 27 -15 -14 -24 -28 -9 -14 -53 -12 -12 -35 -16 -19 3 10 -22 20 29 -11 19 -56
5256 -56 -8 -15 -30 -43 -15 7 -27 3 -50 -19 -27 11 5 -2 46 12 11 -1 -8 -25 -4 -4 0 -9 -22 46 9 32 -25 6 26 33 24 39 -14 -16
5292 -16 -25 45 13 47 46 6 -56 2 17 4 6 52 46 12 -7 -57 54 1 -20 7 -5 -26 13 -43 21 -1 18 48 11 26 28 -12
5324 -12 49 -22 -7 69 38 -2 -6 60 -5 -2 -19 -31 7 -30 13 19 -17 -3 -33 16 14 -44 23 -35 21 -12 -14 18 -10 22 6 -14 20
5357 20 15 -15 -13 -30 15 7 -10 43 -47 24 -50 -3 15 0 -54 -38 53 19 -15 -22 40 -2 29 -30 16 19 -6 -51 16 -26 4 -53 -63
5390 -63 1 49 0 26 40 -19 18 30 -28 -20 -15 -9 25 -6 15 41 11 23 96 13 14 -7 5 61 -22 -13 -45 61 -20 -10 22 -4
5422 -4 -50 -6 3 -19 50 -8 66 -23 11 -37 29 13 -52 14 -22 8 3 6 -33 -13 19 69 38 18 34 26 -28 -41 -38 -10 10 36 -31
5455 -31 26 4 -18 68 -23 -22 36 45 4 -68 0 -30 -12 2 9 -4 -29 1 -2 -23 -50 46 -34 -23 0 -30 14 -10 46 47 13 46 -4
5488 -4 94 -36 1 -30 43 -3 15 -6 74 -33 -41 -8 43 36 0 -45 -28 20 4 -46 -24 -4 32 -54 -6 1 66 9 -29 23 -48
5519 -48 -23 4 42 -26 37 11 21 -43 5 4 55 24 4 13 55 60 -24 -23 10 29 -8 -8 4 13 -3 -9 0 46 44 -42 18 -67 -7 2 -5 -23
5555 -23 23 -54 -13 12 -17 30 -26 34 40 32 26 12 9 20 -72 -15 14 -20 51 -10 17 -17 23 15 25 9 -34 31 28 -9 8 -14 34
5588 34 0 15 -34 -31 29 6 27 -25 -38 -16 -85 49 2 -45 -27 -23 -41 -18 -13 15 20 -30 15 -10 42 43 13 5 48 23 30 -10 17
5621 17 43 44 -3 33 -4 -7 -3 31 -12 -10 -25 35 -21 16 41 -43 -6 18 3 -14 -72 0 6 32 -10 12 4 0 -17 14 2 30 17 57
5655 57 9 -13 -44 26 -43 -42 13 82 -24 4 -32 -10 23 -16 26 -46 -80 -25 0 11 -7 -31 9 -19 10 0 -24 -35 15 -38
5685 -38 19 -13 -60 -21 -72 -1 40 -31 -8 28 26 1 34 -31 30 56 20 58 -30 13 -45 23 29 29 -17 37 12 -43 -13 32 12 -21
5717 -21 1 -24 -16 25 17 51 -76 -11 30 -18 -31 -9 -22 -30 -22 -8 20 -43 44 31 16 17 0 15 30 8 11 -12 -17 -52 -4 26 18 40
5751 40 -31 -9 -16 -18 3 -10 -9 -1 -22 63 -54 -26 -38 30 4 -49 -81 -41 6 -56 -29 5 35 -3 -19 -9 -7 -15 -18 4 21 25 74 -45
5785 -45 39 31 -25 37 57 16 2 19 20 32 7 -30 17 -4 -5 1 -31 -35 67 -19 -18 -10 33 -11 9 4 -37 -13 35 43 -70 30 -47
5818 -47 25 16 39 -68 -94 35 21 3 6 65 22 63 -22 1 -2 60 14 3 31 -26 39 20 -25 -2 6 39 -6 -3 32 49 75 23
5850 23 11 -46 37 -37 36 33 6 0 -12 -52 5 50 3 38 53 16 28 1 22 -13 46 10 -67 15 65 -34 -6 -8 -24 -43 15 -25
5882 -25 17 -6 -17 -7 -4 1 -49 -34 -13 -6 2 -3 -16 -20 32 -24 24 -67 -29 28 -1 28 29 -48 41 29 36 20 -3 4 51 -15 6 48 23
5917 23 15 22 31 -47 -23 2 -19 -27 35 9 49 29 -1 58 -28 -8 -4 -47 8 -22 -18 -3 -23 6 26 14 -21 21 37 -2 -30 27 34 -8
5951 -8 12 18 8 12 -19 77 -29 54 -33 1 12 84 -3 -19 20 18 -20 -20 20 18 42 -55 -5 23 -9 1 13 -20 6 4 30 -18 40
5984 40 7 -33 24 -41 -47 18 -14 -64 -8 38 47 45 68 15 7 0 11 -14 7 -15 29 -1 -22 11 63 32 31 4 28 -6 16 -21 -3
6017 -3 19 36 9 73 3 24 -4 -18 -11 -24 -26 -21 -59 53 61 9 59 20 -9 -23 23 -51 -10 -23 -22 7 48 -12 47 38 42 11 -27 11
6051 11 8 -65 -26 -16 -3 -34 21 1 13 15 -43 -20 -72 -1 -42 26 5 3 13 27 -34 -36 66 18 26 -20 -5 -5 25 14 19 -30 44
6084 44 21 -10 32 -70 -10 -34 -29 32 -43 48 -8 -42 35 5 -63 53 -94 24 9 23 -17 -18 -36 -31 -11 -5 -1 21 28 -29 32
6115 32 85 5 -44 37 -12 -16 32 39 -1 43 -21 -5 14 49 19 -7 6 -28 -4 53 3 -23 -69 31 -33 76 -6 -37 5 -16
6145 -16 71 -21 11 -24 23 -22 -58 -74 -32 -1 26 18 -2 35 -14 -2 6 -15 56 -32 82 54 -28 77 -4 28 18 -10 -39 -25
6175 -25 -3 -1 42 -15 -57 24 -4 28 -16 20 7 49 -41 -2 28 16 38 50 9 40 -49 -11 -29 -25 -18 -14 -42 5 21 -3 8 60
6207 60 38 4 36 21 36 -27 2 53 6 -42 27 -35 -48 -18 -7 -40 28 13 -20 3 0 -36 -20 -55 17 65 -18 -7 -13 -34 -8
6238 -8 13 -34 25 -1 12 19 -30 15 9 -23 -81 11 16 5 -12 52 46 -5 -3 -20 -4 24 -24 23 -34 -43 53 -4 -26 -29 5 53 -29 36
6272 36 -4 -18 75 -19 -21 -20 13 -16 25 22 25 -10 -22 -46 69 36 -18 15 -38 38 39 -72 -16 14 86 11 11 28 -26 2 -12 -11 -13
6305 -13 -24 -26 37 3 18 4 -33 14 0 20 40 -69 -23 22 54 29 -40 -28 -24 41 33 11 -1 13 -35 -15 60 -42 43 -42 14
6336 14 17 20 -36 63 71 -17 18 9 -6 -25 24 -10 -1 -8 -28 19 12 66 6 46 -28 -44 -24 -39 22 6 25 11 6 -1 72 -15 27 -52 1
6371 1 38 16 -3 -27 27 0 21 8 57 6 -24 -42 25 -13 -23 43 26 3 11 -80 -7 -13 -62 -20 47 -9 -9 -57 4 -60 -39 -38 7
6404 7 -14 -5 -39 0 -6 -14 -42 -27 -39 36 33 -29 22 71 2 -55 -18 -2 18 64 34 18 -11 -2 13 -33 23 52 -21 0 -43 -17 -11 -14
6438 -14 5 -1 0 -1 -60 -51 -80 26 -3 29 19 -1 10 24 77 23 -25 10 -21 34 76 28 -4 7 62 8 -20 -40 22 2 -28 -36
6470 -36 20 -13 -20 0 -22 -19 47 -10 -52 -29 16 -7 -42 18 -9 8 -9 11 -33 15 17 12 -12 -7 -10 38 19 4 4 0 23 -9 -20 -11 6
6505 6 -2 -52 32 -17 2 -19 0 2 -16 5 -11 55 -5 -21 6 -2 5 -19 0 -23 -20 28 -5 -38 -11 7 -15 -12 -36 -22 7 16 -35 26
6539 26 7 49 16 -64 0 55 23 65 16 28 -13 32 21 -25 -21 -41 16 -52 -37 -31 19 -6 32 16 -62 19 -26 7 -5 27 11
6570 11 -9 0 58 5 18 61 -18 -24 -50 -9 18 -14 -65 38 3 -4 -11 -12 -5 20 -2 -12 6 -5 13 -41 5 4 -4 -28 -31 29 -9 30
6604 30 -7 -16 -11 -32 -5 0 -24 45 -16 -12 31 -8 20 47 30 2 41 -11 -23 24 16 -9 -36 3 2 49 -29 39 -29 -21 -38 -30 10 -51
6638 -51 -15 -9 40 -7 14 -47 18 59 -4 16 10 -22 -71 13 15 -27 -23 -68 -12 -9 -24 -57 36 -12 54 5 7 12 26 22 23 29 -72 33
6672 33 -20 -27 -8 5 23 -22 15 5 -28 -28 11 -5 -6 -14 -30 23 -29 66 -12 -49 -35 12 26 -3 -15 71 -36 3 38 7 -29 -8
6704 -8 41 -65 19 -23 -18 -20 -1 13 71 11 5 9 9 -2 9 41 56 -32 -36 11 -17 16 -38 -26 -42 -28 44 11 -28 -29 -30 6 17 -26
6738 -26 -1 10 33 -35 -21 -46 -42 13 32 -21 -39 27 -56 10 13 48 17 50 -21 6 -12 50 -23 -9 51 -38 18 17 -44 -38 33 -15
6770 -15 -52 8 -54 -6 -49 -74 -44 38 -30 9 -15 -42 89 54 3 -21 8 -34 -8 11 -40 -4 -33 2 -39 30 -23 26 11 -4
6800 -4 -18 25 22 -54 -3 12 -22 -7 -59 -31 15 56 -8 -38 6 -28 -17 11 33 -3 13 14 15 19 -68 9 0 50 -61 53 32 21
6832 21 -28 -38 23 49 -18 42 64 -33 -43 23 -8 29 22 -84 17 45 37 29 18 4 -24 -70 9 -37 1 33 -23 31 0 -26 31
6863 31 -26 29 7 70 78 -19 41 -33 -21 21 1 17 17 -1 69 40 21 -7 23 -24 -46 -8 30 12 38 -13 -29 33 -2 28 29 -19
6895 -19 -48 6 -43 -1 34 -9 19 -30 -28 19 -35 -20 -19 -10 -3 46 -8 5 20 8 -2 2 12 -9 26 64 32 57 31 30 -33 7 -24
6928 -24 -54 -11 -8 -15 51 61 35 -44 26 11 -19 -24 -40 6 1 17 -27 -10 -38 -41 -2 -19 20 34 45 27 8 13 18 -37 -12 36 9 40
6962 40 -13 -7 20 -7 34 21 62 -8 3 -34 -6 21 -56 6 6 -16 -15 -5 2 30 -4 -2 -30 2 17 -10 -48 -9 -15 -11 -24 -16 27 -13
6996 -13 7 42 34 -11 -11 -17 16 -12 -9 -40 86 19 74 -61 -65 14 45 13 37 1 1 28 -1 2 -24 -18 -14 4 21 -21 47 3 -17 2
7030 2 -7 18 21 23 -73 -8 7 10 1 -40 -37 -23 54 -26 67 11 48 -2 -9 -10 -1 1 24 -29 -36 0 -44 13 26 -8 26 37 -3 -75 -49 -2
7066 -2 -11 -1 -11 16 -42 2 32 -25 31 34 10 -12 39 37 27 -10 -28 -44 9 14 17 -8 11 20 44 26 36 -58 5 36 -48 44 -2 15
7100 15 61 6 51 -36 -6 -22 -25 33 5 -60 8 -28 -21 14 -32 -42 -18 55 -48 37 -15 13 -25 18 -64 39 23 -4 44 10
7130 10 -3 34 20 -4 -2 76 -12 -21 52 28 31 -10 -36 -25 -25 -40 3 1 -3 21 -17 -71 0 34 18 7 38 -17 25 -37 -7 2 55 8
7164 8 7 8 61 -1 -14 55 -32 -14 17 -40 -38 34 26 -27 32 -45 5 13 9 -31 -22 -11 -6 -41 -20 -36 -9 46 -13 -34 54 -23 -36 -12 -36
7199 -36 34 -50 -36 21 71 -21 5 -21 68 52 -45 45 23 2 6 -15 31 -4 -13 -15 21 39 -29 7 -45 19 -23 16 26 37 -15 -2
7231 -2 -6 0 -30 27 -65 -1 -17 12 -9 -15 -14 -6 15 8 46 -15 -15 -11 -28 22 23 -19 27 10 42 -2 33 -3 3 44 -26 32 -13 1 45 -5
7267 -5 -30 28 7 19 -58 -28 8 -71 -53 9 -25 -2 1 -24 -11 19 19 8 -38 9 -10 -11 8 37 72 64 -38 5 -1 16 0 82 0
7300 0 28 57 -1 32 7 24 19 -14 16 -36 -47 20 -5 -10 -17 0 15 -21 3 -3 0 -14 -11 28 37 -18 -16 14 -25 -31 -3 -7 24 13 4 -14
7336 -14 -11 11 81 31 29 6 -33 -28 5 7 -26 12 65 32 18 35 10 53 -42 28 -44 -34 -34 1 -17 -8 -43 91 49 -45 20 3 59
7369 59 -10 32 17 3 26 -21 36 31 33 -3 32 -23 27 43 -25 48 -1 2 64 -40 10 -2 14 32 -11 -50 -37 36 56 -18 -34
7400 -34 16 20 -20 -43 4 14 -4 2 -10 -43 21 -27 3 1 31 39 22 -22 17 44 43 -17 -22 17 23 -3 -27 -23 8 46 10 -5 52 7
7434 7 10 -4 -36 -28 55 -48 -12 -15 -6 -15 20 -22 -11 8 -3 35 24 -31 -28 -3 -3 -43 45 44 2 -48 36 -18 23 64 43 -14 10 33
7468 33 25 -52 6 55 -12 24 -5 47 30 -9 36 13 7 -2 7 -31 -23 20 13 35 -40 58 -33 -26 -19 20 -14 27 -16 13 26 -33 -15 21
7502 21 29 3 12 -32 1 8 -15 -38 -17 23 30 27 -19 -19 -29 73 21 -19 -3 4 6 -24 -3 -65 0 -70 -63 28 -17 30 9 16 65 -17 31
7537 31 -1 22 -15 35 -6 65 31 61 17 -28 42 17 -24 45 8 -51 -7 24 -11 17 47 0 41 -90 11 -10 -24 -15 19 19
7567 19 -15 11 -42 -19 41 -37 -19 11 15 -8 -4 23 -17 22 20 -5 13 18 26 -1 15 15 -15 -23 6 22 -27 34 -4 2 8 -26 11 32 -4
7602 -4 -18 -61 -11 43 6 16 44 -41 -33 7 -18 -11 -31 32 -40 -6 -39 10 -39 -31 25 15 -11 -26 47 10 24 41 18 -6 -15 20 53
7635 53 5 5 -37 33 55 31 -46 -31 -1 35 29 -3 24 37 18 -57 -14 4 -21 19 -22 25 -22 1 63 -14 -19 -26 -42 63 25 -4
7667 -4 14 -8 13 14 47 22 -7 6 0 1 5 19 73 9 54 25 15 57 -25 14 7 26 11 -2 54 -38 -43 9 25 32 -41 1 -4 30 17
7702 17 10 35 -9 59 -22 32 9 -13 47 -8 2 9 0 9 -23 53 9 -1 44 42 3 18 9 -17 30 55 34 -31 1 10 -11 -26 39 22
7736 22 9 -23 -17 -60 10 9 -29 -26 19 -8 -22 -21 34 -3 7 -14 29 -15 10 57 -22 -8 8 -32 76 31 33 37 -32 -3 12 -26 19
7769 19 15 15 -21 -11 -28 36 -65 -76 9 -8 -27 46 -6 -13 -10 -42 -6 -12 -30 -40 2 39 -11 8 -29 43 17 -29 -14 60 -10 57
7801 57 46 55 51 17 19 16 11 -74 -20 0 -1 2 9 -42 4 -18 -2 -10 -25 18 28 35 20 11 -20 5 2 13 48 -12 0 -20 15 -9 40 4
7837 4 34 5 39 5 24 27 23 -70 -26 1 28 5 -50 -13 12 -33 39 -56 29 25 -19 -27 -10 52 14 6 19 -41 -11 -30 7 -14 -19 45
7871 45 -17 -4 28 -26 -35 24 -5 16 -13 9 33 39 -12 29 8 33 6 35 5 14 -16 14 -13 -12 -19 7 -4 -74 -7 -22 -20 -28 9 29
7905 29 33 8 21 27 19 -33 -10 -4 32 -51 -3 1 51 -42 -29 -23 -11 -1 -10 1 39 47 20 32 51 -35 70 27 -2 36 42 15 -29 -3
7939 -3 -24 -5 -1 -36 -90 19 -3 8 -29 -3 24 16 -13 -47 4 -16 7 12 36 -27 -6 -19 28 63 -28 44 -14 14 36 58 28 -2
7971 -2 23 -32 8 -30 -38 -39 -6 14 -37 -27 -1 -26 -34 -35 17 20 1 -30 -3 13 28 29 -42 -51 18 8 -69 33 -40 3 11 14 58 23 -2
8006 -2 -18 -10 -16 49 -8 24 14 20 45 37 41 -36 22 26 -45 -85 -17 -46 34 -9 -18 -63 -24 6 -20 -35 -29 -15 -27 -15 -35 -9 -34 -14 -77
8041 -77 -5 -49 49 -11 -65 23 20 -30 -1 -34 -7 42 10 -16 22 27 40 -22 23 24 -51 0 -14 0 -40 19 -6 -41 -21 25 -31 -2
8073 -2 25 -79 15 17 -56 -34 -14 41 -12 0 7 5 9 -21 -4 19 -5 64 -7 6 18 40 48 -45 -74 7 -7 27 9 17 8 -34 -64 12
8107 12 -28 -8 -3 -29 -7 8 66 -16 33 -5 22 -27 20 -13 -30 42 25 44 31 -15 22 -38 -23 -29 -69 27 8 -41 -15 -22 17 30
8139 30 -12 12 13 49 -6 19 54 15 -8 -45 -25 -12 -4 -22 19 -62 4 -38 42 -24 -16 17 16 -3 -47 -44 3 26 -11 43 26 -25 34
8172 34 28 13 0 1 0 -8 6 -4 13 -19 -85 -12 -16 4 2 10 0 -8 -12
8191a2
$$ Imaginary data points
##PAGE= N=2
##DATA TABLE= (X++(I..I)), XYDATA
0 0 0 0 0 0 0 0 0 0 0 0 0 8 -8 8 -8 8 -16 16 -24 24 -32 40 -48 56 -64 72 -88 96 -112 128 -152 168 -192
33 -192 217 -248 280 -312 351 -391 435 -486 538 -598 662 -731 808 -891 983 -1082 1193 -1313
51 -1313 1448 -1596 1762 -1948 2156 -2394 2668 -2987 3364 -3818 4373 -5078 6002 -7267 9120
66 9120 -12101 17666 -31603 141053 143499 -233120 -116291 121313 114015 -55102 -54908 -15317
78 -15317 -10084 32228 93485 -15174 -117578 -24739 113130 60592 -78683 -102389 28864
89 28864 106739 29768 -73362 -55865 30907 62825 3923 -38450 -31615 -12829 27930 50733
101 50733 -18760 -66205 2348 59469 3371 -49054 -5143 27513 -18152 -11953 43262 -1624
113 -1624 -62771 8758 76055 229 -78565 -14254 67816 14131 -53133 -4221 32800 -13229
125 -13229 -19964 30009 23783 -41163 -41475 41017 55031 -31283 -54971 19925 54939 126 -46563
138 -46563 -8854 37579 7628 -21982 4456 9305 -16081 -2741 28671 6511 -41549 -17321
150 -17321 45851 22000 -38375 -15545 26012 6550 -12974 5633 8578 -18578 -9807 31054
162 31054 11794 -34340 -7495 29307 807 -23033 -857 13180 -4552 -11699 10156 11515
174 11515 -15396 -13089 11598 13986 -1324 -16184 -7846 17900 11475 -13218 -6623 6445 -2929
187 -2929 -6358 12644 14016 -23027 -25515 29298 30538 -29800 -29811 21008 24058 -8904 -12771 3839
201 3839 -53 -2532 17616 6529 -29149 -10802 30046 17362 -18942 -21955 5089 21299 5226
214 5226 -13872 -13037 -83 14491 9633 -10101 -11290 240 9137 13562 -3858 -22229 -2272
227 -2272 23811 10358 -20463 -16968 16319 17199 -11675 -9992 5157 -1651 -1881 7763 175 -12465
241 -12465 -3710 16167 8182 -17101 -7301 15639 4171 -10588 -2389 5414 2099 -2914 645 4107
255 4107 -4227 -4008 5709 687 -5551 -866 1681 2590 341 -3523 1632 3665 -2435 -2656 1512 3828
271 3828 -503 -6244 3644 9090 -6372 -7619 7441 4322 -7259 -3832 5700 2531 -6783 814
285 814 7925 -5761 -6577 9129 3433 -8948 -1717 7222 2856 -5295 -2205 4641 24 -2084 1956
300 1956 -2853 -2646 5010 616 -4163 -219 515 829 1524 -1186 -2936 -823 5486 3648 -8066 -2586
316 -2586 10174 475 -7578 1901 3943 -2611 -1742 3366 860 -6059 205 8071 -2882 -7572 3882
331 3882 4246 -2567 -1490 436 1247 1084 -117 244 -1454 -96 3218 -1450 -2648 2223 -178 -894
347 -894 2067 -1956 -2695 1965 1710 -1524 -3141 892 4287 -1598 -2723 2892 -278 -1825 2934 489
363 489 -2941 -523 2628 2796 -2849 -4077 2817 2227 -2041 -641 -1064 -426 2137 382 -402 -958 -1757
380 -1757 2506 2715 -1884 -1475 -460 1450 3888 -1168 -4438 -73 2533 2125 -1287 -4194 303 2570
396 2570 570 815 -2454 -3747 3031 4384 -877 -3215 -1771 2785 3461 -418 -1594 -3244 -1096 6751
412 6751 2728 -7616 -3814 4293 4019 -912 -4226 -1737 1123 2093 3623 -1882 -6681 1405 6320
427 6320 1175 -2256 -4205 -1747 5665 5338 -3574 -8219 -657 9318 2921 -8298 -3435 2954 1928
442 1928 2851 -95 -5735 -2693 4849 6364 -1446 -7493 -1010 5561 4192 492 -6716 -6172 7217
457 7217 8961 -4552 -8842 -265 6550 2784 -3708 -2710 -1294 -146 5634 3325 -5812 -4761 2147
472 2147 5719 3572 -4969 -7346 1817 8598 3855 -7644 -8128 5186 7555 -2780 -4561 -1183 -145
487 -145 2623 3869 377 -5573 -5528 5592 9278 -2858 -9314 -1877 7937 8022 -4273 -10439 -528 7522
503 7522 4444 -2893 -6672 -1096 4536 2901 403 -3511 -5965 1396 8289 3635 -6485 -8792 3651
518 3651 12076 529 -10162 -4861 5281 8236 29 -8346 -3973 3973 4932 715 -4382 -3704 748
533 748 2947 5109 494 -9358 -4306 9898 8019 -6246 -10376 2280 11166 1570 -7711 -4269 1098
548 1098 4334 3299 -3097 -4386 -246 2440 3956 591 -5797 -5158 3306 9701 1740 -11101 -4484
563 -4484 9895 5788 -5025 -5729 -473 4019 3764 -380 -4056 -4108 2325 6128 -591 -4810 -2286 292
579 292 4835 5001 -4567 -8113 1735 9688 2896 -8824 -5449 6109 5626 -1018 -3632 -3893 497 4840
595 4840 1645 -2991 -3783 -303 4277 2985 -2359 -5300 -2437 6357 7063 -4861 -7883 2612 6990
610 6990 597 -5163 -3025 2502 2258 783 511 -3104 -2904 2649 2919 -1044 -2939 -1569 2620 3052
626 3052 -672 -2123 -1536 1261 3436 -617 -3048 221 1229 648 547 -745 -1323 -1246 378 2883 -218
643 -218 -3608 -392 2122 1571 346 -2507 -1836 2297 3003 -30 -2965 -1306 3189 1294 -2173 -322
659 -322 -345 -839 2367 1665 -2746 -3243 1081 4139 -233 -4171 6 2810 839 225 -1422 -1917 1486
676 1486 2186 -333 -1690 -781 1552 1043 -965 -350 -1154 -1031 2415 841 -2781 -568 1787 992 -367
693 -367 -1009 41 203 213 1691 -296 -2170 1087 1575 -923 -443 -211 -566 356 504 237 -1097 -1388
711 -1388 1523 1195 -1505 -453 497 387 1098 -241 -1129 160 416 706 210 -1246 -183 487 -18 554
729 554 -801 -1491 954 975 -529 -532 -531 715 1054 -740 -433 398 2 816 192 -711 274 165 120 347 -1164
750 -1164 -416 980 -382 -341 222 -490 218 410 -309 -69 -276 540 1061 -926 -446 1372 -110 -503 190
769 190 -411 73 382 -210 -243 -637 208 925 -1030 -556 977 -358 -2 841 -658 -477 838 757 -120
788 -120 -1011 278 1367 -770 -713 580 -715 -131 872 -847 -777 511 479 -60 -830 31 1026 -482
806 -482 -101 905 -594 -34 1006 -444 -532 363 128 32 -469 -182 447 -397 92 413 -1101 -70 1287
825 1287 -503 -688 464 384 409 -209 -250 542 -73 46 546 -714 -274 682 -408 -159 75 -739 130 430
845 430 -179 -14 -332 18 751 -163 11 215 -579 581 865 -780 -406 217 16 354 -275 -639 108 -92
865 -92 450 402 -1150 -327 883 315 232 -582 -669 1177 913 -605 -481 -106 561 712 -499 -418 -296 -335 1157
886 1157 214 -1744 -393 954 505 6 -903 -203 862 210 296 -20 -927 301 1064 106 -281 -1085 -217
905 -217 1619 214 -1470 -518 442 783 19 -795 90 -48 -241 1315 202 -1520 -87 1087 980 -153
923 -153 -1461 -248 1232 517 -356 -1080 -613 1311 740 -863 -584 -501 366 1249 -217 -1044 -119 451 993
942 993 276 -914 -523 51 1126 1379 -1618 -2035 1447 1806 -630 -1726 -407 1324 533 -870 141
959 141 12 -690 675 1031 -83 -1026 -996 1506 2147 -1310 -2255 595 1977 405 -1964 -1080 1457 356
977 356 -627 434 -361 -915 385 989 433 -1085 -1156 1330 1594 -409 -1293 -814 920 1692 -673 -1635
995 -1635 11 968 874 -454 -1477 51 858 33 122 -154 -434 -54 312 1202 131 -2264 -324 2583
1013 2583 828 -1911 -1397 1124 1849 -908 -1793 493 695 -270 14 278 37 -917 -526 1912 858
1030 858 -2280 -862 2222 1591 -1251 -2014 692 1704 -540 -783 183 -254 167 590 -283 -677 -486 223
1048 223 1028 115 -612 -443 -47 1219 664 -1353 -741 859 819 214 -949 -859 803 829 -507 -873 -237
1067 -237 719 29 -685 748 251 -1558 167 1912 -65 -1849 -265 2093 930 -1884 -712 1267
1083 1267 120 -596 -65 87 30 -305 77 685 -548 -1212 535 1126 162 -967 -616 1300 812 -1142
1101 -1142 -346 574 -42 191 293 -304 -518 -82 725 135 -1193 -99 848 -177 -158 134 -165 -24 108
1120 108 429 248 -895 -120 1254 219 -879 -412 371 524 -522 -622 666 91 -663 454 428 -596
1138 -596 -515 263 921 -53 -980 355 913 -326 -406 -35 181 211 -346 135 405 -720 -397 787 72 -707
1158 -707 -361 539 697 -629 -439 975 -53 -727 547 491 -439 -301 456 635 -545 -790 556 303
1176 303 -597 -28 122 -29 110 -235 97 192 -539 -82 529 124 -206 -225 326 507 -592 -411 732 -155
1196 -155 -593 406 247 -392 -314 250 401 -622 -436 850 161 -691 274 427 -102 -232 10 458 78 -559
1216 -559 218 389 -390 -234 101 170 -20 -620 123 666 -471 -535 488 253 -207 -242 205 579 -300 -391 602
1237 602 82 -482 77 149 21 -184 -255 426 84 -502 197 268 -215 -147 74 253 31 -349 278 419 -490
1258 -490 -56 517 -79 -211 98 195 9 -486 84 439 -452 -299 322 56 -170 -65 7 349 -63 -350 309
1279 309 291 -165 -121 40 343 -40 -557 291 427 -566 -148 486 -17 -309 -96 389 148 -526 117 543 -313
1300 -313 -174 336 -65 -39 -8 -101 138 -92 -83 184 -168 -188 97 -162 53 -36 -274 229 163 -312 147 188 -85
1323 -85 -37 108 158 -1 -412 220 329 -450 -139 306 -75 -91 -65 -7 175 -161 -79 302 -146 -128 180 103 191
1346 191 -135 -220 378 105 -336 53 1 -49 78 -84 -4 -6 -184 243 24 -263 143 119 -130 249 -55 -121 203
1369 203 35 72 50 -190 85 112 -104 22 -181 -82 337 -124 -365 162 60 -88 61 -12 50 -90 -59 395
1391 395 -12 -355 177 104 -47 39 -231 -189 162 4 -113 -166 -62 304 -60 -196 181 -22 -151 292 63
1412 63 -121 -10 8 247 47 -270 -62 125 68 111 -318 -168 384 -47 -212 15 -16 34 36 -2 101 -70 -165
1435 -165 242 113 -121 -29 -148 150 239 -301 -224 201 87 -77 -257 -102 247 29 -84 179 -16 -81 121
1456 121 -28 125 91 -346 136 419 -132 -415 -141 293 299 -345 -213 334 -44 -122 49 -54 0 3 -2 192 105
1479 105 -207 47 212 219 -136 -393 138 475 -285 -286 170 66 -88 -112 -58 62 -145 27 154 -86 -39 93
1501 93 -108 264 196 -263 -74 285 170 -153 -342 114 253 -221 -118 121 -54 10 37 -84 96 -3 -166 228
1523 228 225 -95 -215 -11 407 81 -404 13 404 -111 -141 34 -5 9 -115 -30 128 -155 -24 135 15 -56
1545 -56 -77 -145 263 169 -223 34 194 5 -34 -87 -48 -16 -109 91 45 -208 39 115 -151 91 16 -116 15 202
1569 202 51 -91 -169 181 135 -216 -70 110 12 53 -31 -140 57 -33 -56 97 14 -71 -9 53 254 -102 -257 250
1593 250 251 -234 -2 109 20 -92 -86 156 8 -210 53 187 -120 -104 -10 -18 26 -96 -142 189 45 -27 120 4
1617 4 42 -118 -79 173 -88 -156 183 98 -137 -66 -67 -46 34 -56 73 -11 -65 136 95 -200 42 58 53 29 -39 104 86
1644 86 -120 -29 98 -150 -16 17 45 56 -179 -28 288 -98 -106 136 64 -3 -96 -33 145 -21 -170 89 4 -81
1668 -81 -19 -20 150 10 -220 -35 164 -54 -65 116 18 -5 -26 102 61 -86 17 135 -137 -139 154 -32 -128 -14
1692 -14 -45 30 -103 -17 142 -124 -118 117 -41 -16 5 -40 103 87 -130 159 137 -44 -62 -46 44 23 -220 -3 222
1717 222 -178 -123 80 -10 -39 -35 42 118 -83 -67 135 -37 -105 75 65 27 6 -86 62 62 -114 5 7 -74 57 -25
1743 -25 65 40 -100 111 68 -87 20 179 -19 -15 7 34 60 -132 23 102 -55 -60 70 -13 28 -17 -78 97 19 -92
1769 -92 56 52 -32 -15 -6 69 -57 -137 93 59 -207 52 17 -126 8 -22 20 18 -67 79 61 -55 3 58 -58 -8 44
1796 44 25 113 -20 -98 47 23 -11 -15 -44 0 -72 -134 99 28 -157 -27 124 20 -65 -44 57 12 -127 64 16 -135
1822 -135 51 -36 -54 41 -71 -47 21 -46 -25 132 -9 -5 61 -17 91 -44 8 112 -12 -107 101 100 -50 -27 -13 23
1848 23 -47 -128 96 67 -93 30 34 -8 10 -25 82 77 -98 -21 89 16 -73 7 -35 57 -103 4 75 -52 -119 89
1874 89 12 -43 -16 9 53 -17 -33 52 -19 -5 104 23 -49 -21 -15 43 48 -79 -5 -14 -38 -14 -53 -8 16 -119 41 39 -80 -51
1904 -51 183 24 -54 -39 40 96 -3 -73 -4 -14 -6 57 -58 -30 50 -27 -100 57 -20 44 3 57 59 -4 0 99 -34 -31 8 -63
1934 -63 39 38 -134 1 45 -25 18 -44 22 55 -24 7 101 -9 -48 12 35 56 -28 -93 78 39 17 -30 -45 46 2 -114
1962 -114 14 43 -123 61 48 21 30 -31 -7 96 29 -21 -15 -32 48 13 -167 -5 62 -65 -55 71 16 -20 -7 49 74
1989 74 -77 41 95 -21 10 9 19 73 12 -82 -18 -53 -23 -21 -50 16 1 -43 16 30 -100 -31 35 35 -4 11 -39 42 -80
2018 -80 54 -10 -23 32 36 -78 0 18 -94 -31 -60 50 -22 -99 -1 53 -29 -4 -24 28 48 -45 -23 117 27 -73 -18 -28
2046 -28 39 -26 -35 51 48 -101 7 35 -15 -8 4 8 23 -63 -30 111 -38 0 22 -32 56 -2 -57 70 -15 -60 30 2 -59 35
2076 35 -34 -5 51 50 58 27 14 113 -3 -112 65 -6 2 20 -29 51 1 -66 40 103 -76 45 18 14 45 -55 22 104 -9
2105 -9 -52 -48 -14 -73 -86 -33 52 -15 15 29 -4 -40 46 59 55 -19 30 7 -18 -80 25 55 28 24 -9 44 59 -21 10 35 -33 36
2137 36 -31 -13 -47 16 13 -5 -46 -2 10 11 -78 24 -31 -39 -32 11 33 12 -90 -17 35 -62 37 -43 -18 -22 -20 67 52 -42 12 73
2169 73 35 -19 -27 24 -13 -32 -37 22 -40 2 78 -30 55 -21 -22 14 23 -3 24 -38 -53 1 -85 -6 3 -39 74 79 -21 -36 46 -34
2201 -34 -20 -59 15 15 -72 43 69 7 -36 53 3 46 35 34 69 -38 -10 34 19 4 17 13 -13 -39 -61 17 3 -95 -24 40 -53
2232 -53 19 -26 -61 19 -39 44 49 -13 36 16 5 3 -26 13 -1 2 11 39 5 -4 51 -53 29 34 -3 -13 35 -22 14 26 -30 -24 41
2265 41 33 -13 -36 40 8 8 -1 -51 -23 -49 -8 -53 8 -57 -1 47 -54 -7 1 -27 -20 -10 -44 10 -14 -10 64 -45 80 4 30 97
2297 97 -81 -40 -38 34 -22 -19 59 54 -31 -7 13 -46 -13 -15 15 29 23 -10 -15 -4 -27 -18 7 -1 41 -5 23 15 8 -2 -21 1 35 48 -6
2332 -6 0 -6 24 7 3 57 26 -42 47 36 -11 -8 -20 51 -37 33 -19 10 2 -38 -62 67 43 -7 0 -6 14 -56 -108 -9 9 44 16 -28
2366 -28 4 6 -43 5 7 8 50 48 -20 15 21 -16 40 1 -20 36 15 -57 10 -12 -12 -46 16 45 -30 -20 15 -39 -75 20 -24 6 -40
2399 -40 -5 34 -32 -33 45 -18 -42 -69 8 -28 34 -19 -4 8 4 5 -16 -30 7 37 21 68 -31 -12 24 28 -11 75 9 -28 -15 12
2431 12 2 -20 -18 36 14 44 10 -37 67 -17 12 -44 -43 -16 -67 -31 -18 14 22 -41 44 -15 27 51 -30 6 13 44 4 -1 -13 54
2463 54 -24 23 0 48 -27 -39 20 -33 -15 -52 23 45 -10 -15 -32 18 -15 -5 29 20 -38 -43 -7 -4 13 4 -29 9 51 7 30 -49 -56
2496 -56 21 -9 -12 10 -55 9 72 26 47 -14 23 34 0 -15 20 -1 -12 3 -18 5 -12 7 14 10 -97 -15 -10 4 27 7 40 -36
2528 -36 20 -5 10 11 -11 22 -47 -3 68 35 -33 -30 17 -4 -6 -24 0 2 -10 53 37 20 -16 -14 47 -8 46 -15 38 -38 50 0 22
2561 22 -7 -48 10 48 -51 34 -42 19 -15 28 -8 26 -61 46 -21 -54 44 -18 44 -20 55 34 47 16 29 0 20 -11 -36 -7
2591 -7 35 -19 -30 19 35 -15 -43 -36 -5 56 -1 29 1 -21 -48 -8 13 -23 -2 -7 -38 16 28 32 2 45 1 -19 -38 -4 7 -12
2623 -12 85 -3 -15 24 55 -37 -36 -11 15 -15 -11 16 37 -7 31 -51 -19 -29 12 -70 58 35 -43 9 -49 52 -44 -15 -55 -12
2653 -12 11 -70 -12 23 4 -23 -2 -21 -9 -1 -6 -11 -50 9 18 18 -2 12 -14 8 -15 26 20 -33 100 -19 -11 1 -1 6 -23 -25 23 -27
2687 -27 66 -21 0 -16 22 -28 -71 -2 -25 41 14 -32 -2 11 -30 -13 0 1 33 8 4 -80 -16 27 1 -9 63 10 24 12 9 -13
2719 -13 -5 65 51 6 50 25 -16 -27 19 -65 -44 -3 -3 48 -41 -94 -6 -29 86 -5 21 41 18 -15 16 -3 20 -1 -4 3 17 11
2751 11 0 -19 -55 23 -14 0 62 -7 13 -26 6 -13 24 -9 41 -22 22 -24 -52 -11 -29 -15 -24 -12 -21 -13 -45 14 30 -22 16 27
2783 27 5 -37 13 7 -56 -27 -5 -10 -2 28 -20 -31 27 -7 -3 40 -46 2 25 -8 -32 -24 -22 22 14 -27 53 17 -29 -25 -12 -16 43 -36 -20
2818 -20 2 -58 -34 -26 -70 12 43 37 -30 24 -3 -23 4 7 -14 -5 -9 -21 1 -10 35 14 15 -7 99 -23 -32 -13 13 -23 37 -6 32
2851 32 50 -1 16 67 -30 18 -53 -3 40 3 11 -11 40 -12 -24 -9 -39 25 -51 -8 37 42 3 -1 -18 -25 -46 -3 -23 -32 0 36 -2
2884 -2 78 26 15 -55 7 -3 20 13 -6 -31 -12 3 -73 20 -85 -34 -15 -6 -29 -49 1 65 -4 -27 17 -20 -25 -11 -13 -4 50 64 10
2917 10 10 -55 42 8 33 11 71 9 71 10 -6 27 49 13 -14 63 -2 -23 -1 -12 -25 -37 -12 -74 44 -26 -36 -1 -27 17
2947 17 26 -52 -12 -24 -9 50 18 -62 -52 38 -30 -9 15 11 43 0 73 -33 -10 -35 4 34 -21 18 -25 15 -2 -6 -8 -41 -69 -83
2979 -83 -4 3 -18 -43 -32 -15 -10 34 -58 -9 25 -29 -32 -30 35 -2 38 -8 -20 41 19 29 -33 -6 -10 17 -29 -28 8 -16 -10 20 43 -28
3013 -28 39 -23 12 34 -22 -13 -4 -34 18 20 0 18 27 7 11 -7 -1 22 -24 3 32 10 -5 30 46 3 -6 30 -2 -17 1 19 -33 14
3047 14 -12 -19 -58 -5 30 -48 -42 -22 -21 13 -13 -48 -34 -15 -10 55 38 -35 16 6 -20 -7 -66 -47 13 -39 -7 -23 -55 0 -4 -35 6
3080 6 -12 -35 3 0 20 -13 54 -37 66 12 47 -8 -22 -14 -11 12 12 10 51 11 -51 -21 14 -11 38 -28 -8 8 16 26 -47 -10 -3 18
3114 18 1 -47 34 -13 -12 -13 2 -13 -12 20 -26 43 18 16 39 -3 40 -81 -4 20 -10 -2 -19 -36 -5 -25 23 62 12 30 1 11
3146 11 -11 -26 -12 0 0 -29 -51 -19 5 -9 5 -26 31 9 64 -29 -7 19 -35 23 -18 -2 16 -17 -23 19 3 39 9 6 49 -20
3178 -20 -21 -14 1 -34 79 17 -24 -43 -9 -28 -18 -1 -41 -24 51 41 -20 -37 -10 -13 -16 -53 49 -21 -35 0 25 -20 -34 29 -8
3209 -8 -28 25 33 8 7 48 12 56 71 -11 -45 -4 -29 45 42 14 -42 -11 -26 -44 64 7 22 -52 31 4 -37 -32 -26 15 15 -55 68
3242 68 48 -56 -14 70 16 -28 -16 -2 23 -5 14 -59 5 17 -31 -41 -26 -1 4 -8 5 54 11 -24 11 -24 -4 -32 -29 58 -55
3273 -55 19 -64 -4 -8 -23 -5 34 -46 -48 -17 34 19 30 -37 -5 -17 36 -35 37 0 5 -12 22 84 33 22 -34 33 14 -25 7 23
3305 23 32 45 -86 -25 81 5 16 -12 24 12 46 41 -47 -46 -8 -55 -1 31 -7 -5 -13 -23 -37 5 -19 -20 16 68 41 3 0 28 -9
3338 -9 23 -21 -32 27 6 -6 -61 38 35 1 -53 -50 -8 42 5 -3 -17 21 -36 -1 -41 8 -33 34 -32 11 -25 -14 3 -30 -5 -24
3370 -24 -12 -31 -11 2 24 26 55 9 -8 -33 31 13 46 34 8 49 1 22 -24 63 -25 20 -69 28 63 -18 -29 -12 4 36 -39
3401 -39 -1 21 -16 5 -60 -4 -24 19 -25 -9 75 21 -33 36 2 -27 41 23 -22 25 -47 -3 -11 34 -36 -21 -18 -7 41 -32 21
3432 21 20 64 3 5 31 -9 -44 12 18 -41 -65 -93 40 27 -18 15 -26 -30 -46 14 -76 29 10 20 -21 -13 -11 -41 4 -24 -3 33
3464 33 83 44 -9 -23 30 8 8 26 19 -9 56 11 37 50 44 -16 3 -20 22 -25 -35 31 -12 -2 18 -32 -5 -33 -36 -2 12 13 -12
3497 -12 -3 22 -8 11 58 -8 31 26 12 -44 7 49 27 40 44 14 -3 26 -35 18 -5 -10 31 35 21 -31 7 -76 -36 13 30 -39 10
3530 10 -17 -15 7 -45 23 24 -24 -15 -9 -31 -3 -10 -35 -34 19 -1 3 36 -21 -11 -4 -7 17 -11 48 -3 -22 3 42 -1 -39 -27 4 27 9
3565 9 43 47 -49 14 -62 -10 -11 -12 30 -57 -35 -31 -23 32 4 -17 -43 -25 0 13 3 -14 -30 -39 -18 -46 -8 0 -17 -38 -5 9 43 -55
3599 -55 -38 44 -23 -36 -12 -9 -19 23 40 -10 9 37 21 -36 -11 -33 -9 -3 -17 -12 -33 8 31 15 -21 -13 -28 -32 -63 -28 31 37 -34
3632 -34 -16 38 -19 21 -24 24 -43 33 -31 25 -32 -56 -6 85 41 16 44 -20 -51 10 -24 20 -17 -15 -54 -68 -16 -19 -7 -53 3
3663 3 -3 26 26 -51 24 36 28 35 45 26 9 27 13 14 -15 -26 36 -18 74 18 -23 46 -33 -9 -40 -42 7 -38 1 -54 2 7 0 34 -68
3698 -68 -43 -22 -7 11 -32 1 -23 -6 -31 -17 -16 -16 41 43 62 24 18 -40 14 61 22 53 -10 7 53 -21 11 39 -19 6 7 5 23
3731 23 -39 -52 -17 -22 -44 -43 21 -22 8 -11 -63 -12 22 -29 -60 -14 39 -9 16 16 54 -18 48 -38 10 29 -17 -32 16 -9 38 34
3763 34 1 39 13 -17 -9 -8 27 -31 -31 -36 2 -10 -22 5 19 52 -26 -54 -13 23 16 -2 6 3 2 -35 -12 -19 32 13 14 27 -12 -33 19
3798 19 -39 -26 26 -29 -8 -48 19 -21 21 -28 -3 53 31 -38 25 -65 21 -4 3 -8 52 -39 -6 -27 -22 -42 -32 -53 28 6 -22
3829 -22 -8 17 7 -6 -43 -16 3 -29 68 38 -38 -45 1 -15 -10 26 48 -38 38 40 20 13 -10 21 2 -8 16 -94 -33 -13 -17 -9 26
3862 26 4 -13 5 -74 2 -18 17 -5 1 -36 -3 29 -46 -2 -11 -3 -4 -1 -18 -27 26 -2 -15 -14 28 34 70 20 2 17 11 14 39 -1 31
3897 31 55 -9 -23 -32 -24 -23 -32 -23 24 -18 -38 -3 54 -67 -45 -13 35 6 -23 57 13 8 -28 -21 91 23 14 -40 -18 30 -6 55 -2
3930 -2 -2 54 43 -16 6 -55 9 8 -57 -16 -28 34 30 -37 -75 3 -22 0 -28 4 35 3 14 -34 -57 4 -17 -39 74 -46 12
3961 12 -1 -58 -5 55 -3 51 51 19 -26 -41 61 -4 -71 -24 40 -23 -19 -41 9 32 48 -11 -10 4 3 4 16 -19 -10 26 -31 -5 -53
3994 -53 7 -49 16 73 -20 39 -17 22 12 18 -17 -10 13 60 40 8 9 18 -34 -79 0 37 -9 18 100 31 29 -30 30 5 44 74 18
4027 18 -63 -38 28 -15 10 -36 -43 -32 23 -36 66 -7 -15 54 -4 11 8 -38 -2 14 59 67 64 -32 -16 29 -32 3 20 -32 20 12 13
4060 13 64 -44 -60 -4 -21 65 -57 5 -5 -34 18 34 12 5 -28 -24 44 67 14 21 4 25 20 -56 42 -54 13 34 40 16 37 -7
4092 -7 -4 28 -2 -40 43 -46 -45 14 -22 -53 34 77 -26 0 -6 11 -34 5 22 -11 -11 -53 -31 -3 -50 -28 -46 2 -38 -86 3 1 1
4125 1 -9 27 30 -3 -5 -25 28 9 -56 58 -1 8 21 28 17 31 57 -19 -8 -15 0 -74 56 24 -3 -35 -34 11 -44 -29 -13 10 -31
4158 -31 -24 1 -33 -31 -29 -48 -37 9 -48 16 -16 -58 22 -13 -24 24 30 32 -5 -17 7 25 13 36 19 4 55 34 -4 -35 4 20 -35
4191 -35 -76 52 13 22 -24 -22 53 44 -31 -58 12 -11 47 -44 10 -20 61 -82 -23 21 85 -49 -33 26 64 -46 0 -2 -24 42
4221 42 -10 -11 -5 51 -49 25 14 -8 20 6 -4 13 16 -2 -32 17 -37 8 -23 -45 44 -47 -18 -48 14 -28 -17 20 -19 11 31
4252 31 29 18 77 52 28 77 -24 -15 -7 37 5 44 60 -28 -32 10 29 -64 2 5 -17 9 5 31 -19 -3 27 -18 -62 -6 -8 80 14
4285 14 -29 -3 -8 -12 33 -23 -32 13 29 6 3 -14 -2 19 0 64 15 -12 -4 7 35 -21 45 25 8 -52 15 -7 34 -11 -38 6 -62
4318 -62 12 -24 -53 -1 -2 -51 -9 -43 -60 12 31 -7 -26 -33 -27 -17 6 22 -5 -11 4 2 48 -19 -27 -8 7 8 35 -4 32 21 -6 -10
4352 -10 8 -2 9 -23 -22 -31 27 -14 12 -8 -45 -80 -26 -2 11 5 -10 -15 -45 35 -39 11 -6 -27 -6 24 4 14 -67 21 18 -17 -1
4385 -1 -19 51 -7 2 -34 -27 23 61 60 -3 -8 31 3 -17 -4 35 56 15 -99 -77 -20 -41 -15 -12 -26 37 -10 -1 -82 -43 -68 -20 -26 8
4419 8 -40 -17 -1 -66 -14 -19 -10 -1 15 24 16 11 -34 -34 -2 -61 -6 22 -8 8 30 -21 -31 -13 22 13 37 12 5 11 -8 -76 -23 -75 -56 -27
4455 -27 -23 -5 -54 -25 -31 38 28 -35 -4 8 -25 -4 19 6 61 -18 42 -19 -17 -13 -26 -68 40 -71 28 58 30 38 -15 5 -25 -32
4487 -32 -10 5 -52 -71 -32 -21 49 31 -51 -28 -22 -65 -35 -7 -50 -14 15 26 28 -43 -36 -16 -32 -4 2 12 66 5 -25 -18 36 36 27 48
4521 48 -41 -24 8 -1 34 21 -22 4 -64 18 2 -16 14 -9 31 -57 6 -66 37 0 19 18 -9 -45 40 32 -3 34 31 16 42 56
4553 56 10 -23 -20 17 -44 -17 -29 -15 -12 70 -30 -7 0 13 -5 -1 -24 -23 -14 25 -34 7 8 -39 53 -43 9 -9 16 -50 -59 -13 -40 14
4587 14 27 37 13 -42 71 37 -51 -24 20 -4 -21 31 50 -5 92 -29 -12 -4 33 35 -22 -18 -3 -14 43 -24 24 -4 -18 -16 -37
4618 -37 -14 -31 -34 21 1 19 -30 -31 -55 -45 -6 -48 -27 23 -16 -8 20 30 -8 53 -42 -30 -12 8 27 6 -9 -28 22 28 -2 -26
4650 -26 21 -26 29 -25 5 24 -26 -32 9 -8 -35 -34 15 -35 13 10 -36 -3 -63 -32 59 9 12 0 -36 27 24 -40 20 15 31 -9 11
4683 11 14 7 -44 21 -18 -13 -14 53 1 3 8 64 30 -64 31 -5 10 -22 19 -49 -7 7 -45 6 76 -28 -60 37 25 3 -10 -42 -12
4716 -12 74 32 -16 16 -11 -44 -45 3 26 85 5 23 -22 22 -9 -8 -30 -16 14 -6 -20 -4 23 -14 13 -6 44 -12 15 -28 -38
4747 -38 -35 19 33 1 -45 24 -64 -40 -4 -4 -29 -24 14 -25 59 -4 -16 -37 11 -14 30 -18 -15 27 -39 16 12 -9 22 -3 -15 -14 -15 31
4781 31 -30 4 -47 1 -7 -9 29 -30 -54 6 -78 -57 -21 -18 -53 -34 -6 20 -34 40 33 -8 43 21 26 74 2 23 -25 -42 -3 45 -26
4814 -26 -11 -39 63 -53 36 -14 6 -12 7 40 -1 -13 -6 16 -52 -36 -9 -16 3 -1 1 -34 23 -12 -1 -45 -57 -34 7 28 -31
4845 -31 -30 -53 1 15 -7 -57 -7 18 42 28 1 53 52 5 6 -2 19 36 57 9 40 1 -7 -22 29 -10 -22 7 48 10 -31 18 -9
4878 -9 -26 -78 -3 -50 59 61 28 -43 2 -27 30 10 16 50 21 -27 -23 15 -13 39 -65 30 81 -9 -47 -18 -17 -58 4 -24 18 -6
4910 -6 -31 0 46 -1 -27 -8 14 8 12 -3 17 24 37 6 -3 -45 -24 -27 -62 44 -3 -17 15 -4 45 -13 -15 12 -40 -8 19 6 47
4943 47 -27 15 57 28 -27 -38 45 -22 30 -14 18 -6 -19 -21 -12 -5 -8 -30 2 -25 -13 23 -8 36 32 6 -24 -16 -62 -17 7 -47 46
4976 46 69 -7 -19 13 -55 -20 11 -12 45 13 -18 -66 24 -36 -14 21 -26 -4 -24 -13 -58 5 7 -31 11 -44 -10 29 -24 -41 -12
5007 -12 -11 -36 18 14 -5 15 27 -36 28 14 3 -14 8 -41 33 26 22 74 0 -14 36 -18 5 11 -28 42 -22 30 13 -8 63 26 -24
5040 -24 28 68 -5 19 -40 -38 -22 -23 4 31 48 7 16 -12 5 4 67 28 7 22 -29 3 28 -48 15 72 36 20 45 17 30 -66
5072 -66 35 2 11 18 -48 -1 -13 34 37 -30 -24 11 3 -7 -4 15 -13 27 -44 -23 -41 25 9 -10 -2 5 -6 22 19 16 -41 43 -10 5 14
5107 14 65 -16 -2 76 -11 2 -8 1 62 27 17 18 -48 -22 57 -22 -31 -11 -50 -44 -16 -31 -5 5 19 -51 36 40 -12 6 2 12 6 1
5141 1 5 -6 18 39 -31 0 17 18 -20 49 39 37 6 -40 16 31 -45 36 9 58 2 -63 -9 -28 -17 -54 14 25 -38 -4 9 -39
5173 -39 -27 22 33 36 11 60 11 8 -11 55 -13 16 27 54 -29 35 32 28 36 -10 -39 -36 78 -14 -10 -23 -22 -20 -36 7 6 35 -21 59 -27
5208 -27 21 3 13 -19 -60 -19 -14 -27 6 3 -27 34 -4 -1 -6 -20 -10 47 4 21 -18 32 -36 35 11 17 33 21 -26 -28 -28 -11 -46 55
5242 55 -3 -67 -9 23 59 -103 54 -3 -81 -6 -37 -21 -11 24 20 -19 -30 23 -12 8 -5 19 0 37 49 -17 51 28 17 17
5272 17 24 -12 18 -17 -41 -51 1 5 -16 21 6 35 5 -38 1 -43 -3 -36 21 -17 -50 -64 -19 -57 -13 -20 34 -32 -35 -12 28 -4
5304 -4 22 13 7 -8 6 -4 66 73 15 81 6 12 -29 -12 -43 -12 -11 -48 40 37 -32 26 16 -42 -6 -54 34 -17 -4 -23 47 -50 -59 31
5338 31 -8 -32 -53 35 4 -8 -3 19 -36 -8 -36 -6 10 -21 41 7 13 -5 24 34 -23 -39 18 -23 14 -34 -14 -1 -34 19 -17
5369 -17 7 34 -58 -25 -1 35 -10 -43 -1 25 -39 -11 0 -15 -46 -75 17 -43 3 13 -14 15 -27 8 26 26 15 51 -9 -9 -15 -40
5401 -40 42 -13 -17 64 -23 10 -30 -11 0 10 2 -23 -56 -3 23 -10 11 19 -59 -4 -26 5 -64 -25 -27 -16 22 7 -21 -17 1 3 18
5434 18 -26 15 52 17 21 -24 14 -13 -25 -32 12 -10 -17 -10 -27 8 29 -29 24 -11 -48 -1 -47 39 -39 -42 -55 -72 -7 -49 -53 -18 -51
5467 -51 -43 -13 -10 -4 59 -11 -18 6 -19 56 -21 -11 -6 28 -16 -58 -57 42 27 60 45 55 19 -16 9 -10 -20 -69 -53 51 20 42 30
5500 30 -39 -16 38 -7 28 53 -24 8 -19 38 24 -14 26 29 -29 -19 -19 3 -27 -8 -31 43 -16 -54 -2 29 32 -32 11 11 19 32 -57
5533 -57 -11 37 -23 -28 31 -1 9 -5 -25 1 -26 -56 24 -27 8 -5 -4 -19 -1 54 -26 30 3 -22 25 -22 6 31 58 41 -24
5564 -24 19 24 24 -11 -40 -18 -1 9 18 62 -41 -35 -23 -15 -22 21 50 -20 39 -55 17 -51 16 9 31 -11 2 44 3 -31 -28 -30 -60 -7
5598 -7 -19 12 24 26 34 0 -17 -26 -4 28 20 7 29 -29 2 16 67 -39 22 -6 -58 -22 -22 -5 36 -22 31 -6 -13 -25 16 -17 -39
5631 -39 12 14 16 -51 -12 74 57 -17 -2 38 -44 -17 41 13 33 68 -18 10 4 -55 5 22 28 -22 -12 56 -9 -29 44 -48 -8 1 29
5664 29 -46 -32 -32 -12 -20 -21 50 -54 -21 -9 -52 -40 -20 -32 34 -49 -7 -9 -26 5 -29 -27 17 -7 23 69 -21 73 0 -29 -8 44
5696 44 -17 -13 -28 -29 38 2 -24 -16 8 -24 -5 9 -71 22 66 -15 48 8 -30 -30 1 15 -39 -33 20 37 48 -2 -59 -34 18 -17 -26
5729 -26 -24 21 34 15 8 -9 -25 -16 38 -28 -19 -57 13 -16 -40 -20 -65 -9 -7 -70 -45 29 -3 -21 -7 -22 1 -27 -17 -15 -20 14 11 -40
5763 -40 5 -30 -1 -15 -12 14 21 -18 42 -13 93 2 -4 36 -8 68 7 -22 -1 -58 -60 -3 -25 6 26 -12 -14 20 16 -60 25 10 23
5796 23 -18 -54 -9 0 -18 2 -28 -1 13 -3 -33 -35 6 -11 7 56 8 -14 1 31 40 -42 27 51 -3 27 -42 22 -43 -25 -12 -24
5828 -24 35 -31 -1 -14 -36 15 14 -14 -2 -22 -79 -23 -18 -52 -4 -22 -15 -25 -18 -30 30 16 -26 1 -15 -51 -13 38 22 47 -37 -64
5860 -64 -59 4 69 0 33 22 -56 8 -22 -4 1 11 2 27 -17 16 26 -55 29 38 -19 58 -10 -53 -1 -12 -50 29 29 36 -34 14 -20
5893 -20 11 73 -13 28 29 1 46 68 -19 39 55 2 46 -29 29 -8 19 24 -51 4 -11 31 -1 -21 14 -13 -23 5 7 63 -6 40
5925 40 -45 -44 -19 -14 41 -21 -10 23 -59 -19 4 -18 -8 -29 53 -6 12 -45 -8 16 50 42 54 -28 17 38 -30 7 -100 -11 -18 -20
5957 -20 -18 -74 12 -10 1 -19 -3 -45 -42 12 33 13 21 14 11 44 -25 -17 2 -37 2 -56 3 -32 -27 23 6 -27 47 -24 -13 -15 -12 11 7
5992 7 45 -23 30 -19 28 -39 -15 -17 -44 -13 -41 -9 5 7 -29 -15 -46 -1 -53 0 -1 -41 1 43 8 13 34 -19 5 68 30 -24 4
6025 4 -6 11 -51 18 -2 -45 -71 -29 -53 -5 28 2 24 24 -10 -69 -39 -39 -98 -15 2 -26 12 -17 -38 -39 -2 -30 48 -28 -19 31 -27
6058 -27 -4 19 47 53 -31 -7 -49 -38 7 1 -2 23 -71 31 71 41 55 52 -13 41 45 -16 -44 71 15 -13 -2 9 -31 -4 -15 6
6090 6 7 1 -18 -14 31 -29 16 -7 -10 -32 82 18 32 27 14 -6 -19 -8 -3 26 8 -14 56 29 -1 58 -4 20 6 -15 -31 -53 30
6123 30 27 -16 36 3 -1 -41 -68 7 -28 39 33 -1 -8 -42 -17 -5 12 14 -20 4 -44 18 -2 0 -38 14 4 -25 5 -1 -25 20 46 7
6157 7 12 -33 68 -72 -21 52 34 27 -47 -25 -7 52 -19 37 -28 -16 -6 -51 -7 -4 -31 -15 -51 -36 13 6 -28 -19 12 7 -3 -22 -24
6190 -24 -10 -38 -57 -14 26 -19 31 -4 22 -3 16 8 63 -50 -27 -36 21 45 -1 -47 -18 -10 -61 -47 -28 31 -36 -31 -48 13 -6 33
6222 33 -1 37 18 -34 -42 29 0 -24 5 -6 20 15 -9 29 -29 -22 -30 3 -11 -51 -12 10 -38 -26 -45 50 -45 11 19 4 8 33 3
6255 3 -44 -12 -3 26 63 12 -61 -1 -19 21 0 -3 32 17 16 23 24 42 32 36 64 8 -33 -10 -10 -23 -6 11 -18 39 -10 45 -23 -3
6289 -3 11 -10 -31 4 -11 -17 7 13 26 71 25 -59 2 -23 3 -25 -42 6 -19 -106 -15 74 -9 15 30 -29 -7 7 3 -5 31 18 -7
6322 -7 -60 -39 20 -9 51 8 30 7 -32 -5 16 33 55 43 -27 33 51 -12 1 -26 9 -7 27 -28 -34 -23 3 -37 -8 1 -62 24
6354 24 -18 45 -23 -14 15 9 -4 -33 22 -16 -18 19 14 10 -24 -13 -66 27 -42 4 -28 32 22 -51 -14 -85 14 38 5 -12 -21 14 -12
6387 -12 -2 -12 -40 28 -39 -29 -20 12 25 31 11 32 17 -5 41 87 23 -30 7 34 16 -30 37 57 -19 -10 -8 19 11 10 -24 31 29 27
6421 27 -83 52 67 -49 -57 61 53 14 17 -38 29 17 34 -35 38 5 16 10 30 -39 -46 -30 51 2 24 -41 -28 41 63 -1 -11
6452 -11 -14 -21 13 74 23 -57 -45 -22 10 9 -78 -20 -30 4 -4 -14 -43 -76 -8 -35 14 -95 6 4 -75 7 16 12 -2 22 24 -39 -5
6485 -5 20 -19 -5 -20 16 -45 -21 38 12 15 26 -8 9 5 38 -41 -48 -30 -2 8 22 56 -7 -67 35 4 -43 5 10 -26 -1 32
6517 32 -12 50 28 -7 -43 47 4 0 -18 -3 28 10 -4 1 7 -36 -2 -13 27 36 -6 67 68 -41 28 -10 6 6 -13 -45 -33 8 -7
6550 -7 -6 69 -87 8 -10 -4 -18 -35 48 -8 -35 43 34 38 61 5 32 -22 45 -33 32 28 13 2 -34 27 0 41 10 -16 27 -31 38
6583 38 14 -43 16 -39 -22 -66 4 -35 31 14 -1 -51 26 -41 -12 -42 -41 4 -1 32 -27 5 13 -60 -81 21 39 10 6 25 -30 26
6615 26 -33 34 -5 17 -15 12 12 45 10 6 -38 44 -25 -10 35 51 -8 -24 -6 -41 20 20 -51 -60 -3 -29 -60 4 -8 -11 -37 -18 -16
6648 -16 -1 -9 8 16 9 28 -5 -40 25 19 20 4 16 25 49 24 2 11 -21 -28 41 18 -24 -3 -17 8 3 -5 20 25 26 28 -27 -7 -7 60 -1
6685 -1 56 30 32 33 -7 4 -20 -2 25 -4 -13 41 37 39 -33 40 18 29 -25 -33 7 -22 -47 7 -7 -2 -25 30 -4 -17 12 21 12 -30 4
6720 4 -40 -10 17 -25 -18 34 30 -9 30 18 -75 31 51 9 -43 8 42 -70 -5 -39 -23 -17 3 -10 39 -21 28 -36 -26 15 72
6751 72 13 -6 -31 -52 22 -24 1 19 -63 -37 57 -54 -22 -27 -30 3 -30 38 -33 18 70 38 39 11 -20 -60 -2 -2 11 -7 -40 16
6783 16 6 -24 23 -7 23 -31 0 -34 10 22 -30 -44 -34 28 36 2 -25 -7 -29 -16 -11 -27 -27 54 6 48 -6 39 -21 18 -46 35
6815 35 -15 -30 -36 28 39 73 54 10 5 1 50 50 47 -9 -20 33 43 60 21 0 -30 37 -1 15 34 24 15 -64 7 14 8 -30 -26 -39 -12
6850 -12 9 23 21 29 39 -3 43 -17 -7 33 0 12 -48 40 -24 -9 -70 48 52 -20 22 24 -18 32 19 36 22 6 11 -28 -7 -27
6882 -27 45 19 -11 22 15 -2 -40 16 -6 6 -11 -55 36 -39 -10 48 -32 -27 25 16 -22 13 -14 -2 5 55 16 13 17 9 -15 -20 -8 23
6916 23 3 9 -3 -14 13 -6 30 -2 -30 -15 -35 -46 4 -44 -50 12 64 -19 -35 -38 -15 26 32 -20 12 -2 -3 -32 -14 31 0 8 -24
6949 -24 70 3 -17 62 11 -33 3 -55 -20 13 29 5 44 3 33 28 -12 -21 0 21 -32 -26 -31 0 54 47 15 -24 -25 -57 15 -7 24
6982 24 19 -11 -5 3 17 14 33 73 37 72 -1 3 40 37 36 23 58 26 -11 1 -29 38 36 13 -39 -12 -13 -39 39 27 47 24 -46 -28 -39
7017 -39 -39 -7 -38 8 -1 -27 31 9 18 28 -12 7 -16 36 -26 57 4 -44 72 8 17 14 -26 61 20 -71 -49 2 -36 39 5 27
7049 27 17 26 -14 -2 -42 0 28 -25 -70 -14 40 16 9 -17 -4 13 -17 -11 -37 -12 30 0 -34 1 -8 -12 35 5 -10 22 -20 27 20
7082 20 -9 1 2 -5 15 7 30 34 8 36 9 -70 -12 8 30 9 -63 -17 8 -15 -21 26 18 -24 5 -8 63 -39 -6 6 2 -9 23
7115 23 59 -14 -20 25 -16 49 2 -31 -15 -25 -9 -5 22 36 72 1 -18 -8 -43 -33 6 22 22 -13 -37 29 -9 -21 25 20 10 -42
7147 -42 -41 -4 39 -58 -22 -40 37 -52 23 19 5 40 3 45 48 16 2 -18 -36 -21 53 5 16 -45 15 -12 19 -51 -42 13 31 -35
7179 -35 -70 -21 -19 -17 -64 -30 -7 8 40 14 7 9 -25 -13 60 -16 51 9 -5 -44 17 -2 -11 -23 -57 2 -9 3 -59 -6 -34 -58 -32
7212 -32 53 -5 -23 -5 31 -43 5 -39 -13 -14 -28 68 -39 41 -40 51 -1 23 38 30 -27 79 46 -77 17 42 15 -87 31
7241 31 37 -47 -16 23 7 42 1 22 9 36 29 45 -62 18 28 43 -9 -25 -51 -9 18 -13 1 -28 -32 -45 -14 -64 -40 -17 -32
7272 -32 -46 -18 -29 -2 40 -20 30 -30 18 -21 -18 25 -9 41 31 -11 -25 -1 -15 12 -4 -39 29 -19 -9 -14 -23 -14 -82 40 -19 12
7304 12 -41 17 -12 -73 -49 -40 -20 35 -3 -28 20 0 -10 1 -17 -12 -26 -34 46 -9 10 4 -7 -2 13 20 23 41 -16 -48 -13 12 20 -3
7338 -3 19 14 -2 -12 -63 20 30 1 -6 -35 -5 -31 34 -24 5 -15 10 23 -29 2 6 78 -9 -10 -47 -24 12 -1 18 31 -23 22 19
7371 19 8 -41 89 10 -6 4 9 32 19 32 4 -2 48 -10 -38 58 -36 -40 26 91 38 -24 -54 52 -18 19 27 -31 -36 -5 -5 18
7403 18 2 51 -44 60 19 50 29 -24 -30 -64 74 42 -24 37 41 14 37 30 58 -28 -2 10 69 -22 -10 -55 14 49 -15 -40 -23
7434 -23 0 13 -96 16 -14 -7 -61 7 26 -18 -32 -46 40 3 -3 20 82 -33 35 42 -9 12 -10 2 1 -13 8 -27 33 -3 -36
7465 -36 -25 4 24 -12 -39 -4 -20 20 -32 -2 -44 -5 15 54 17 33 -71 -6 20 54 44 -8 -55 -6 21 -37 6 -11 8 15
7495 15 12 -76 -25 -41 -1 51 -49 -40 -6 -31 -36 -8 29 0 -9 -10 55 -41 0 -31 19 -18 -20 85 -37 49 -14 32 4 -29 67 -7
7527 -7 27 -11 -9 28 -13 12 -38 -9 6 28 9 -33 -1 49 27 -27 -7 -12 -4 19 31 -28 54 3 -18 -6 3 10 -24 -20 37 -59 -31 18
7561 18 -18 5 9 -25 -7 38 34 27 3 -36 -1 -35 -62 20 -14 -75 25 -5 -19 4 -12 -56 1 -2 7 -16 19 21 -1 -21 -1 8 -20
7594 -20 -28 -28 17 20 -21 -62 24 -28 -50 -11 -10 -6 -70 54 6 7 -12 -20 -1 8 9 -50 -19 -3 26 0 -1 5 29 31 -19 -3 25 3 1 3 -30
7631 -30 -36 -48 -1 -4 14 5 7 20 -5 -72 -15 -9 37 32 66 14 -26 4 -5 -10 6 4 -72 9 -26 10 29 19 31 -7 12 -39 -3 -72 -13
7666 -13 23 -1 59 -16 -9 15 -14 7 15 51 -20 -96 -7 -17 32 11 -5 -63 0 -65 -15 -39 -35 -26 16 -13 -28 11 22 -19 18 18 27
7699 27 24 11 5 0 33 33 45 -3 38 -61 -16 -34 10 2 -17 38 32 38 -16 8 13 8 46 0 -69 -39 10 -10 -36 -10 15 -43 -55 8 -7
7734 -7 12 -58 -51 15 28 22 34 27 -22 8 0 -14 -12 37 -12 61 8 -11 -2 -16 -30 -52 -48 22 -27 -46 -7 -55 -27 3 -41 -32 51 -30 5
7769 5 -13 -13 6 -36 -10 -43 -22 -11 26 -26 41 -24 68 -3 -1 1 -17 -2 28 15 -16 13 -51 -9 -11 -37 -24 5 -15 16 -37 -33 23
7802 23 84 11 -44 -22 -1 -10 25 -11 -17 -10 23 6 35 -10 -22 46 34 -64 -30 -38 -11 50 -20 51 3 45 45 -20 -5 60 3 -61 -19
7835 -19 -18 -11 15 -73 -31 -21 -23 62 -29 -44 -44 40 -21 -40 3 5 8 -31 -25 -26 -17 -22 2 23 4 -1 -38 -4 -12 24 -13 2 -37 2 29 13
7871 13 49 -34 -6 -3 14 -1 -1 -21 5 55 75 -48 -27 23 -30 23 4 -9 -1 0 33 -49 34 14 -1 -39 4 -55 17 -35 -14 7
7903 7 -6 49 -5 -28 36 38 9 -1 33 61 -14 56 8 -2 -16 32 28 -29 -2 27 -36 12 36 27 -45 2 3 12 24 21 9 -15 47 26
7937 26 -22 -54 34 -50 -36 7 -7 16 -105 5 -3 -4 61 17 -21 39 9 -11 -19 24 51 23 -23 -51 -37 -19 -7 -2 -15 19 14 4
7969 4 38 2 12 -15 24 23 -57 28 -28 46 -32 30 24 -35 -18 -13 9 -36 -12 -4 1 -9 65 9 -48 53 2 -37 17 12 -1 10 -25
8002 -25 25 -7 38 33 -8 5 11 15 16 -18 48 7 -18 -35 -20 -7 8 -42 31 12 18 -41 9 -55 -61 50 57 -59 -44 45 -34 22 5
8035 5 30 -1 22 3 25 24 -27 20 6 20 -11 -18 -15 -33 -41 17 -18 16 -35 5 17 -5 -4 -11 -7 -6 40 -12 -29 -37 5 -11 -23 -6 -3 1
8071 1 18 -12 -4 6 51 -10 -25 38 14 -57 26 -1 27 -31 24 -14 -21 -24 1 43 32 1 -33 20 -14 9 -32 -24 -26 -11 -52 -34 -12
8104 -12 4 -39 -30 4 52 -13 29 22 -9 -31 -15 -31 32 24 -10 48 31 31 40 5 48 11 -21 28 -36 -37 -56 4 -58 -39 7 -6 7
8137 7 21 -35 6 -16 -20 -28 -13 21 53 -11 32 -12 39 -21 -34 24 -66 -9 -24 34 -2 34 -9 -21 4 -11 53 6 -4 39 -9 29
8169 29 4 -5 47 -3 -5 59 -8 -40 -1 -36 -34 -1 -11 55 8 3 13 20 -4 14 -10 -17
8191a7
##END NTUPLES=NMR FID
##END=
