##TITLE=1H_Pr 92-2
 CDCl3+DMSO, 8 sc, 
 12.2.2019
##JCAMPDX= 6.0         $$ Bruker NMR JCAMP-DX V2.0
##DATA TYPE= NMR FID
##DATA CLASS= NTUPLES
##ORIGIN= UXNMR, Bruker Analytische Messtechnik GmbH
##OWNER= root
$$ XWIN-NMR		Version 3.5
$$ Tue Feb 12 14:19:13 2019 Russian Standard Time (UT+4h)  she@DPX200
##.OBSERVE FREQUENCY= 200.1313
##.OBSERVE NUCLEUS= ^1H
##.DELAY= (6, 6)
##.ACQUISITION MODE= SIMULTANEOUS
##.ACQUISITION SCHEME= undefined
##.AVERAGES= 8
##.DIGITISER RES= 18
##SPECTROMETER/DATA SYSTEM= spect
##.PULSE SEQUENCE= zg30
##.SOLVENT NAME= CDCl3
##.SHIFT REFERENCE= (INTERNAL, CDCl3, 0, 15.7039)
##AUDIT TRAIL= $$ (NUMBER, WHEN, WHO, WHERE, WHAT)
$$ ##TITLE= Audit trail, XWIN-NMR		Version 3.5
$$ ##JCAMPDX= 5.01
$$ ##ORIGIN= Bruker BioSpin GmbH
$$ ##OWNER= she
$$ F:/spectra/data/she/nmr/H-F/1/audita.txt
$$ ##AUDIT TRAIL=  $$ (NUMBER, WHEN, WHO, WHERE, WHAT)
(   1,<2019-02-12 14:18:13.35 +0400>,<she>,<DPX200>,
      <created by zg, POWCHK disabled, PULCHK disabled
       configuration hash MD5:
       00 E9 B6 7A A2 85 ED C7 34 08 36 98 17 FE 4E 26
       data hash MD5: 16K
       6E 0C BE 98 94 85 4B 1F D3 19 B7 23 D0 13 59 29>)
$$ ##END=
$$ 
$$ hash MD5
$$ 93 BC BA 9C 4C F4 69 99 FB C3 38 FB A5 73 B1 4A
##$RELAX= 
##$RELAX= 
##$RELAX= 
##$RELAX= 
##$RELAX= 
##$RELAX= 
$$ Bruker specific parameters
$$ --------------------------
##$DU= <F:/spectra>
##$EXPNO= 1
##$NAME= <H-F>
##$PROCNO= 1
##$TYPE= <nmr>
##$USER= <she>
##$AMP= (0..31)
100 100 100 100 100 100 100 100 100 100 100 100 100 100 100 100 100 100 
100 100 100 100 100 100 100 100 100 100 100 100 100 100 
##$AQSEQ= 0
##$AQ_mod= 1
##$AUNM= <au_zg>
##$AUTOPOS= <>
##$BF1= 200.13
##$BF2= 200.13
##$BF3= 200.13
##$BF4= 200.13
##$BF5= 200.13
##$BF6= 200.13
##$BF7= 200.13
##$BF8= 200.13
##$BYTORDA= 1
##$CFDGTYP= 0
##$CFRGTYP= 5
##$CHEMSTR= <none>
##$CNST= (0..31)
1 1 145 1 1 1 1 1 1 1 1 1 1 1 1 1 1 1 1 1 1 1 1 1 1 1 1 1 1 1 1 1 
##$CPDPRG= <>
##$CPDPRG1= <>
##$CPDPRG2= <>
##$CPDPRG3= <>
##$CPDPRG4= <mlev>
##$CPDPRG5= <mlev>
##$CPDPRG6= <mlev>
##$CPDPRG7= <mlev>
##$CPDPRG8= <mlev>
##$CPDPRGB= <>
##$CPDPRGT= <>
##$D= (0..31)
0 1.2 0 0 0 0 0 0 0 0 0 0.03 0 0 0 0 0 0 0 0 0 0 0 0 0 0 0 0 0 0 0 0 
##$DATE= 1549966692
##$DBL= (0..7)
120 120 120 120 120 120 120 120 
##$DBP= (0..7)
150 150 150 150 150 150 150 150 
##$DBP07= 0
##$DBPNAM0= <>
##$DBPNAM1= <>
##$DBPNAM2= <>
##$DBPNAM3= <>
##$DBPNAM4= <>
##$DBPNAM5= <>
##$DBPNAM6= <>
##$DBPNAM7= <>
##$DBPOAL= (0..7)
0.5 0.5 0.5 0.5 0.5 0.5 0.5 0.5 
##$DBPOFFS= (0..7)
0 0 0 0 0 0 0 0 
##$DE= 6
##$DECBNUC= <off>
##$DECIM= 32
##$DECNUC= <off>
##$DECSTAT= 4
##$DIGMOD= 1
##$DIGTYP= 9
##$DL= (0..7)
0 120 120 120 120 120 120 120 
##$DP= (0..7)
150 150 150 150 150 150 150 150 
##$DP07= 0
##$DPNAME0= <>
##$DPNAME1= <>
##$DPNAME2= <>
##$DPNAME3= <>
##$DPNAME4= <>
##$DPNAME5= <>
##$DPNAME6= <>
##$DPNAME7= <>
##$DPOAL= (0..7)
0.5 0.5 0.5 0.5 0.5 0.5 0.5 0.5 
##$DPOFFS= (0..7)
0 0 0 0 0 0 0 0 
##$DQDMODE= 0
##$DR= 18
##$DS= 0
##$DSLIST= <SSSSSSSSSSSSSSS>
##$DSPFIRM= 0
$$ [...]
##$SUBNAM2= <"">
##$SUBNAM3= <"">
##$SUBNAM4= <"">
##$SUBNAM5= <"">
##$SUBNAM6= <"">
##$SUBNAM7= <"">
##$SUBNAM8= <"">
##$SUBNAM9= <"">
##$SW= 20.0189088683792
##$SWIBOX= (0..15)
0 0 2 0 0 0 0 0 0 0 0 0 0 0 0 0 
##$SW_h= 4006.41025641026
##$TD= 16384
##$TD0= 1
##$TE= 0
##$TE2= 300
##$TE3= 300
##$TEG= 300
##$TL= (0..7)
0 120 120 120 120 120 120 120 
##$TP= (0..7)
150 150 150 150 150 150 150 150 
##$TP07= 0
##$TPNAME0= <>
##$TPNAME1= <>
##$TPNAME2= <>
##$TPNAME3= <>
##$TPNAME4= <>
##$TPNAME5= <>
##$TPNAME6= <>
##$TPNAME7= <>
##$TPOAL= (0..7)
0.5 0.5 0.5 0.5 0.5 0.5 0.5 0.5 
##$TPOFFS= (0..7)
0 0 0 0 0 0 0 0 
##$TUNHIN= 0
##$TUNHOUT= 0
##$TUNXOUT= 0
##$USERA1= <user>
##$USERA2= <user>
##$USERA3= <user>
##$USERA4= <user>
##$USERA5= <user>
##$V9= 5
##$VALIST= <valist>
##$VCLIST= <CCCCCCCCCCCCCCC>
##$VD= 0
##$VDLIST= <DDDDDDDDDDDDDDD>
##$VPLIST= <PPPPPPPPPPPPPPP>
##$VTLIST= <TTTTTTTTTTTTTTT>
##$WBST= 1024
##$WBSW= 4
##$XGAIN= (0..3)
0 0 0 0 
##$XL= 0
##$YL= 0
##$YMAX_a= 154343
##$YMIN_a= -172123
##$ZGOPTNS= <>
##$ZL1= 120
##$ZL2= 120
##$ZL3= 120
##$ZL4= 120
##$ABSF1= 10
##$ABSF2= 0
##$ABSG= 5
##$ABSL= 3
##$ALPHA= 0
##$AQORDER= 0
##$ASSFAC= 0
##$ASSFACI= 0
##$ASSFACX= 0
##$ASSWID= 0
##$AUNMP= <proc_1d>
##$AZFE= 0.1
##$AZFW= 0.1
##$BCFW= 1
##$BC_mod= 2
##$BYTORDP= 1
##$COROFFS= 0
##$CY= 11.3945322036743
##$DATMOD= 1
##$DC= 2
##$DFILT= <>
##$DTYPP= 0
##$F1P= 18.9103706918063
##$F2P= -1.10871071338519
##$FCOR= 0.5
##$FTSIZE= 0
##$FT_mod= 4
##$GAMMA= 1
##$GB= 0.15
##$INTBC= 1
##$INTSCL= 1
##$ISEN= 128
##$LB= 0.24
##$LEV0= 0
##$LPBIN= 0
##$MAXI= 10000
##$MC2= 0
##$MEAN= 0
##$ME_mod= 0
##$MI= 1.114404
##$NCOEF= 0
##$NC_proc= 0
##$NLEV= 6
##$NOISF1= 3.799351
##$NOISF2= 2.8
##$NSP= 1
##$NTH_PI= 0
##$NZP= 0
##$OFFSET= 15.70392
##$PC= 1
##$PHC0= -8698.064
##$PHC1= 18.00018
##$PH_mod= 1
##$PKNL= yes
##$PPARMOD= 0
##$PSCAL= 0
##$PSIGN= 0
##$REVERSE= no
##$SF= 200.130013532006
##$SI= 16384
##$SIGF1= 3
##$SIGF2= 2
##$SINO= 400
##$SIOLD= 16384
##$SREGLST= <1H.CDCl3>
##$SSB= 0
##$STSI= 0
##$STSR= 0
##$SW_p= 3612.71676300578
##$SYMM= 0
##$S_DEV= 0
##$TDeff= 0
##$TDoff= 0
##$TI= <>
##$TILT= no
##$TM1= 0
##$TM2= 0
##$TOPLEV= 0
##$USERP1= <user>
##$USERP2= <user>
##$USERP3= <user>
##$USERP4= <user>
##$USERP5= <user>
##$WDW= 1
##$XDIM= 8192
##$YMAX_p= 0
##$YMIN_p= 0
$$ End of Bruker specific parameters
$$ ---------------------------------
##NTUPLES= NMR FID
##VAR_NAME=  TIME,          FID/REAL,        FID/IMAG
##SYMBOL=    X,             R,               I
##VAR_TYPE=  INDEPENDENT,   DEPENDENT,       DEPENDENT
##VAR_FORM=  AFFN,          ASDF,            ASDF
##VAR_DIM=   8192,          8192,            8192
##UNITS=     SECONDS,       ARBITRARY UNITS, ARBITRARY UNITS
##FACTOR=    0.0002496,     1,               1
##FIRST=     0,             0,               0
##LAST=      2.0444736,     0,               0
##MIN=       0,             -172123,         0
##MAX=       2.0444736,     154343,          0
$$ Real data points
##PAGE= N=1
##DATA TABLE= (X++(R..R)), XYDATA
$$ [...]
2925C678n999J951K524n205M161J779o075L872M72l887N652j645n075N422j304
2940C21k273N062m117k009N859l616l65M559n433L09M578m226K019J726o118L732
2956HL254m965K505m9m252N955o88m834M361j367k561N569k942k387M794l916
2972a515L2N459m927p75L734l659K209K567n855K330K880m815L665N30n451M423
2988H32L48l399M674k145m007N725r99k642L773l864m73N870m129r41L788m479
3004b068J945L410n427J894K171m774L594J968m977K803n3l315N412j389m651
3019c457M896j446j765M813l631j934M876k821n72M092n267O41M227m235J713
3034A30K083n358L094K736m714K715J24m191N057o1m053M033j687k344N104k443
$$ plain form
2925 3678 -2321 -370 2154 -3051 1110 2889 -3186 686 1158 -2729 2923 1278 -3797 1625 321
2940 321 -1952 3110 -1007 -3016 2843 -773 -1138 3421 -2012 -1703 2875 -1351 668 2394 -3724 8
2956 8 3262 -1703 802 753 -3499 2456 1768 -3066 1295 -72 -2633 2936 -6 -2393 2401 -1515
2972 -1515 -1483 3976 -951 -1726 2008 -1651 558 3125 -2730 -400 2480 -2335 1330 1860 -3591 832
2988 832 1180 -2219 2455 310 -3697 2028 1029 -1613 2160 -1704 -2177 3693 -436 -1377 2411 -2068
3004 -2068 -123 3287 -2140 -246 1925 -2849 745 2713 -2264 539 486 -2829 2583 1194 -3457
3019 -3457 1439 -7 -1772 3041 -590 -2524 2352 -469 -1041 3051 -2216 -1575 2652 -1583 130
3034 130 2213 -3145 -51 2685 -2029 686 810 -3381 1676 1615 -2438 1595 -92 -2436 2668 225
3050B25k394M359l339m65N103m445o34L412l759K204K872n876K003K533l796L460
3066A463k4n001M556L17l481M170j497l321N012j905j636M314l850j464N077l139
3082d09p20L298m527J675L778m864R92K259m160L397J457m623L164Pl195M731
3098B260o64m075L607j010j531M324l458j970M756k775l68L480m414P18L431m223
3114a912J919K206m924K241K433l578K713n83l636M706J82l911L278j189k124
3129b179M885k508k009L827k952m74M149l748n13L143l622J539L164n085J870
3144e13J926l577L096N56m114L351N93l094L828j523l279M338j221j449L434l592
3160a240j215N229l015p00K731l854J448L338m058R56J902l843K983J527m196
$$ plain form
3050 225 -2169 2190 -1149 -1614 3489 -956 -1590 1822 -1937 267 3139 -2737 -734 1799 -1997 1463
3066 1463 1439 -3562 994 1311 -2170 2000 503 -2818 2194 289 -1347 2967 -883 -2347 2730 -409
3082 -409 -1129 2169 -2358 -683 3095 -1769 -777 1482 -2678 719 2176 -2447 717 724 -2471 2260
3098 2260 1596 -2479 1128 118 -1413 2911 -547 -2517 2239 -536 -904 2576 -1838 -1120 2311 -1912
3114 -1912 7 2213 -2711 -470 1963 -1615 1098 515 -3121 1585 1767 -2144 1134 -55 -2179
3129 -2179 2706 198 -1811 2016 -936 -1410 2739 -1009 -1522 1621 -2001 -462 2702 -2383 -513
3144 -513 1413 -2164 932 1488 -2626 725 1318 -1776 2052 529 -2750 1588 367 -1082 2352 -1240
3160 -1240 -2455 2774 -241 -941 1790 -2064 -616 2722 -1336 -380 1522 -2321 662 2189 -2007
3175b007K711L19l516M199o46l669L871j245j785M372k916j971L837k384K47L099
3191B516m460P44L089k945J272J545m120K573J727l510K639J27m150M099K65l072
3207a661L130j534k351M717k181k107L277k392m37L991l441l08L084l821J888
3222a46K923m637J326J938l043L093J46m295L290Q43l186L276j063k972L962j335
3238A20j812L605k679j117L680k321l00L094m249J159L686l864R85J419l523K760
3254F43J367l878K531J96l093M020n37l257L134j484j157M039k674k152L741k066
3270f27k89L150l599L19L294l545J326K079m087K096J528l026K398K98l794L265
3286G86O10k954K468j152k057M500j899j923L145k344k72L683l209n28K838l366
$$ plain form
3175 -2007 704 1023 -2493 1706 1060 -2609 1262 17 -1768 2604 -312 -2283 1554 -830 -583 2516
3191 2516 -1944 -1200 1889 -1056 216 1761 -2359 214 1941 -1569 1070 1197 -2953 1146 1411 -1661
3207 -1661 1469 -65 -2416 2301 120 -1987 1290 -1102 -1539 2452 -989 -1297 1787 -2034 -146
3222 -146 2777 -1860 -534 1404 -1639 1454 1600 -2695 595 1438 -1748 1528 465 -2507 1455 120
3238 120 -1692 1913 -766 -1883 1797 -524 -824 2270 -1979 -820 2866 -998 -13 1406 -2117 643
3254 643 2010 -1868 663 859 -2234 1786 1249 -2008 1126 -358 -1515 2524 -150 -2302 1439 -627
3270 -627 -916 2234 -1365 -1046 2248 -1297 29 2108 -1979 117 1645 -1381 1017 1315 -2479 786
3286 786 1396 -1558 910 -242 -2299 2201 302 -1621 1524 -820 -1092 2591 -618 -1146 1692 -1674
3302a674J464K432l821J303J775l140K551O83l886K797L38k827L273p01k882L795
3318A480j231j822L678k567j437L973k343k56K356l429Q24L050l471J158J063
3333A026l161K462J420l504K135L72k807L172l03k710L171j375j536L561j759
3348A64j838L039j933JL269l805j88K896k843J320J698l987J943J759l020K380
3364H55K31l633L276K10k302K807j213j878L665j589j884K937k305m46L320k973
3380i22J94K314k962R57K350l092Q81J390l106K770J064l839K284M80k221K885
3396A427j003k475L418j115j570K948j935j116L025k123j74K497l299N54L137
3411B196l352J028J382l127K099J471l241K080L23l102L325J55k490K401j306
$$ plain form
3302 -1674 -210 2222 -1599 -296 1479 -1661 890 1573 -2313 484 822 -2005 1268 567 -2315 1480
3318 1480 249 -1573 2105 -462 -1899 2074 -269 -525 1831 -1598 -774 2276 -1195 -37 1026
3333 1026 -2135 327 1747 -1757 378 750 -2057 1115 812 -1898 1273 -102 -1638 1923 164
3348 164 -1674 1365 -568 -567 2702 -1103 -1291 1605 -1238 82 1780 -2207 -264 1495 -1525 855
3364 855 1086 -2547 729 939 -1363 1444 231 -1647 2018 429 -1455 1482 -823 -1269 2051 -922
3380 -922 -728 1586 -1376 -419 1931 -1161 -280 1110 -1996 774 1838 -2001 283 763 -1458 1427
3396 1427 424 -2051 1367 252 -1318 1630 -305 -1421 1604 -519 -693 1804 -1495 -941 2196
3411 2196 -1156 -128 1254 -1873 226 1697 -1544 536 859 -2243 1082 1237 -1253 1148 -158
3426a58j415L713j858j869K709j535k69K878l257j03K893k826R79J730l334J757
3442C5J361k766K311M01l130K468L15k395K815j114k140L570j554r71K209k280
3458h65l15L151k451j43J966k653J046K019k843O82J497k651K281O56l263K253
3474C67K16k039K785n55k505K745q47j369K882j906j071K580j715k68K463l054
3490a291M74K430k663J123J068k904K011J332k767J745J18k494K862k24k343K548
3506A025p87j854L202j367j601K810k097j85K563k576k27K320k321J154J927l523
3522a537J528J249k516K059O48l345K357L44k045K581r58k055L146j146j431K330
3538A209k012l32K715k024l57K283k696Q21K080k711R58J557k996J642J458k902
$$ plain form
3426 -158 -1573 2140 282 -1587 1122 -413 -682 2196 -1061 -1164 1729 -1097 -118 1612 -1722 35
3442 35 1396 -1370 941 1342 -1788 680 995 -1400 1415 301 -1839 1731 177 -794 1415 -865
3458 -865 -1180 1971 -480 -623 1343 -1310 -264 1755 -1088 -406 1091 -1560 721 1377 -1886 367
3474 367 583 -1456 1329 774 -1731 1014 167 -1202 1680 -226 -1297 1283 -432 -700 1763 -1291
3490 -1291 -817 1613 -1050 73 1141 -1763 248 1580 -1187 558 676 -1818 1044 820 -1523 1025
3506 1025 238 -1616 1586 219 -1382 1428 -669 -854 1709 -867 -1094 1226 -1095 59 1986 -1537
3522 -1537 -9 1240 -1276 783 1431 -1914 443 787 -1258 1323 365 -1690 1456 310 -1121 1209
3538 1209 -803 -1135 1580 -444 -801 1482 -1214 -393 1687 -1024 -66 1491 -1505 137 1595 -1307
3554a307J433K69j947K827q59k273K822r39r02K180j534j203K865j718j83J995
3570A526k690M02K299k283P55J054k651J522J498k579J760L8k466K682m0k060
3586a233K060q38j698L099j396j341K497j639R1K171k290m41K182k236R13J589
3602A490k685J061J317k533J803P27k754J742O17k046K057o73k133L056o53j375
3618i82K458j847j031K913j954j82K047k607N79K347k470P30R67k457J868P59
3634A138k685J694j3j390K407n05k230K297n90j206K297j262j189K498j641l14
3650f94K227k283N3K074k083Q34J198k800J287J466k292J353M31k298K569n1k269
3667a278J972m29j371K182o70j726K446j296o75K345j940l30J768k077P52J865
$$ plain form
3554 -1307 126 395 -1552 1275 416 -1857 965 26 -876 1304 -230 -1433 1432 -286 -469 1526
3570 1526 -1164 -762 1537 -746 9 1063 -1588 -66 1432 -1147 613 651 -1815 867 827 -1233
3586 -1233 827 -11 -1709 1390 -6 -1347 1150 -489 -398 1773 -517 -958 1224 -1012 -99 1490
3602 1490 -1195 -134 1183 -1350 453 1180 -1574 168 785 -1261 796 123 -2010 1046 393 -982
3618 -982 1476 -371 -1402 1511 -443 -625 1422 -1185 -606 1741 -729 1 968 -1489 379 1138
3634 1138 -1547 147 134 -1256 1151 646 -1584 713 123 -1083 1214 -48 -1237 1261 -380 -694
3650 -694 1533 -750 -697 1377 -706 128 1326 -1474 -187 1279 -1013 340 771 -1527 1042 991 -1278
3667 -1278 694 265 -1106 1076 406 -1320 1126 -170 -845 1500 -440 -770 998 -1079 -327 1538
3683A538k891R91J351k184J597M85k280J737Q7j541K161q15j846K623o05j352
3699i44K290k054l64K594j718o68J847j860L84J718k184R43J106k406J263J453
3715A400k516J431K76k093K512k12k205K221n93j177K338j403j229K088j438K3
3731e77K042k303l9J842j390N07J286k701J180J386k270J335N90k058J527L05
3747F62j768J965o03j590K409p93j356K108j581n41K505j862l44J650j542K99
3763c82J834k244M52J295k096J421M64j955J586K5j273J652l00j553J948p32j050
3780i08J969j180j035K329j535j40J650k242M60J778j623K36J210k102J071R61
3796H99j688J250J15j595J877k81j710J780n64j029K000j087j119K165j269o08
$$ plain form
3683 1538 -1353 -362 989 -1195 402 887 -1393 344 431 -1110 1051 236 -1610 1013 408 -944
3699 -944 1346 -708 -1072 1522 -196 -864 983 -877 -493 1225 -959 -16 1090 -1316 -53 1400
3715 1400 -1116 315 591 -1502 1010 798 -1407 814 221 -956 1382 -21 -1250 838 -600 -577
3731 -577 1465 -838 -877 965 -425 82 1368 -1333 -153 1233 -1037 298 888 -1170 357 662
3747 662 -1106 859 256 -1334 1075 282 -1074 1034 -547 -1088 1417 -445 -789 861 -681 -382
3763 -382 1452 -792 -340 955 -1141 280 744 -1211 375 400 -873 779 479 -1074 874 142 -908
3780 -908 1061 -119 -1154 1175 -360 -500 1150 -1092 -632 1146 -477 -241 969 -1133 -62 899
3796 899 -789 461 576 -1019 858 577 -1133 647 83 -946 1054 -33 -1152 1013 -256 -864
3812h64K112j759j17J750j892L41J551k188Q16J257j587Q74K59j711J633J06j648
3829a067J811n26j224J808m12j281J888j198m84J861j474k15J497j636M23J308
3845A079j778M93J135j608Q18Q08j960J160N73j887J741p4j482J666n31p97J449
3862H05j037p44J944j102l21J222j275M3J781j822K67J134j691P85J005j973R86
3879GL85j395J709L2j756J389j97r91J534n86j102J681p59o89J752j358l53J449
3897G52j187L26J095j775O31P39j266P95M59j623J564j30j533J475j06j268J810
3914G58l38j250J692o42q05J507r06m30J312j461J18J555j510P2Q32j460J187
3931B31O14j815Q89P12j598J495j29j248J490l74j074J400n97p97J569j029l71
$$ plain form
3812 -864 1248 -511 -628 1122 -770 -429 1122 -1066 -250 1007 -580 294 553 -1158 475 581 -1067
3829 -1067 744 218 -1006 802 390 -891 997 -201 -685 1176 -298 -513 984 -652 -229 1079
3845 1079 -699 -206 929 -679 139 947 -1013 147 720 -1167 574 500 -982 684 153 -644 805
3862 805 -232 -976 968 -134 -455 767 -508 -465 1316 -506 -239 895 -796 -11 994 -979 7
3879 7 392 -1003 706 738 -1018 371 174 -817 717 131 -971 710 -49 -738 1014 -344 -697 752
3897 752 -435 -109 986 -789 -158 581 -685 110 569 -1054 510 380 -1153 322 216 -1052 758
3914 758 420 -830 862 220 -585 922 16 -414 898 -563 -445 1110 -400 -328 504 -956 231
3931 231 845 -970 -81 631 -967 528 399 -849 641 267 -807 593 -4 -801 768 -261 -632
3948f32J417j250p5J643j712O86O39j449M76J236j785J079L48j763J605J79j126
3965d84Q20k51r03J532n01r12J396q01l82J179q94k31J236j373O05Q35j462M26
3983a65R83j431Q74O06j696Q57O38j117Q91J6j384J636l63r13J085p88m06J453
4001G76r71l80J223j182J96J106j315L02P92j260J008M52j486Q32K78j093J322
4018F00M5j322J129j73r30J430n71j084J531p23k85J202j301k8J339j519N79R25
4036H44j498N85P58j257O49M36j353J193N3j113J169l24q21J292m54q42J119n57
4054a21n37J448j174k38J132q48K17J235j564j52J367r57K22N91j386Q07M74r35
4072d19Q39q7j234J121R7q92J101l72q35J504r26k39J129j185J3J248j300J50
$$ plain form
3948 -632 785 -465 -540 1103 -609 77 716 -733 -257 979 -806 273 621 -1142 463 642 -484
3965 -484 336 85 -818 714 213 -699 697 -104 -486 693 -201 -432 804 -569 36 871 -591 -165
3983 -165 818 -613 261 867 -829 28 666 -451 440 456 -928 708 345 -568 517 -271 -677 776
4001 776 -195 -575 648 -534 -338 768 -547 -245 547 -713 295 747 -739 93 371 -722 600
4018 600 645 -677 452 279 -651 779 208 -876 655 -68 -353 849 -452 -480 859 -660 -81 844
4036 844 -654 -69 689 -568 81 517 -836 357 410 -703 466 142 -679 613 159 -683 436 -121
4054 -121 -658 790 -384 -622 510 -338 -121 1114 -450 -602 765 -192 30 621 -765 42 516 -419
4072 -419 420 333 -901 220 317 -575 526 154 -681 823 -103 -342 787 -398 -385 863 -437 -287
4090b87J062j346O00O35j482Q11N73j178J028J05j361R44J44q90J031m51p02J245
4108D81o54j00Q67j063n2J256p91OM33j054M64O45r07M43N71j325R33L66j135
4127f16Q96r6j096J113J33j088J190m30n84J226p65l86J139o85k48J187j117L9
4145a88P33r50O53M33j514P90O83j166J001k3j395J241k8o85J143o73q63J348
4163E40n14m31R91r41j31J080p84K1P23q91K68N96j082M48Q59j562R52K78r77
4182e57P68R9j109J140j1r38J071l12p10J201p75o85J478r28K51P41r90O0P89
4201E83q56K94M24j169P07O26j218R57N8j077Q48K11j157J105k69n02J106n04
4219A67o02Q58o77j82J085p95k77Q26p04L6R22j282N02N39j036P29L04j054Q85
$$ plain form
4090 -287 775 -571 29 664 -818 -7 566 -612 416 521 -840 104 248 -642 389 -62 -764 481
4108 481 -173 -273 594 -469 -521 735 -56 -50 383 -671 -207 438 -469 -26 545 -780 153 519 -616
4127 -616 280 184 -912 201 334 -754 436 6 -578 648 -117 -503 636 -49 -297 890 -227 -188
4145 -188 545 -405 248 681 -833 -43 640 -526 475 452 -943 298 270 -415 728 55 -808 540
4163 540 26 -405 586 -355 -486 594 -190 -169 554 -337 -69 527 -555 -107 752 -810 142 420 -557
4182 -557 211 310 -799 341 330 -608 463 151 -559 642 -133 -818 660 -268 -17 724 -266 -206 583
4201 583 -273 21 445 -724 -17 609 -609 348 406 -671 177 388 -769 336 67 -435 671 167
4219 167 -435 423 -254 -436 649 -146 -423 403 -301 -265 657 -625 -123 416 -620 109 413 -641 244
4238B44K36r42Q95k09r51J260m49q35J101m32l75Q75o04j30Q67r55J63Q46p91
4257a86k4Q93j295O26Q82j666J105J77r73O63j8o12J005n20n77J321p83p24J157
4276D51n06j62R53j124j46J127j236L13J005q43Q6N45q93N63M42j071O77K25o39
4295b33M85k65o61J080j59r86J212p30j37J182r41m09R91p84P0Q99j062L33M40
4314C25o68K58O87j159P63J59r74Q99J74j061R51k43m98M52q3n72J091p43J55
4333h7O28r93O7R80q82N2Q38j151O27N36j219N44K89o45N79K78r22P67M9j092
4353g57J197l44o81J084n14l47J031j008j61J253r22q8P54r88O00N92j053L59
4371GO34j286L73M55o57Q28l52p40J365k01r63Q27j10o30J049p96j45Q81q97J05
$$ plain form
4238 244 480 -462 433 224 -727 533 84 -751 350 -82 -457 418 -186 -316 551 -404 -241 605 -186
4257 -186 -210 683 -612 14 896 -770 335 512 -461 202 184 -428 577 57 -520 801 18 -706 451
4276 451 -55 -217 736 -388 -534 593 -643 -330 675 -168 -82 463 -430 133 575 -496 181 406 -233
4295 -233 252 -13 -674 406 247 -739 473 -257 -394 788 -153 -562 429 -355 -285 614 -448 -115 325
4314 325 -343 -85 602 -557 206 365 -609 290 464 -597 354 111 -387 65 -18 -590 501 -242 -87
4333 -87 541 -452 -385 595 -287 -235 603 -548 79 615 -604 -60 229 -416 163 441 -481 286 335 -757
4353 -757 440 96 -585 499 -15 -362 669 -339 -500 753 -169 -257 497 -491 109 701 -352 7
4371 7 641 -645 -272 183 -474 354 2 -738 627 426 -537 290 180 -450 599 -197 -342 539 -358 -253
4391b53R48r29j47P75j108N81O32j200O05M61p50O27J95j107Q31K04o36O44k92
4410H1o50J129o44l56Q62o62l02J003o52k05Q07r05J87R62j014N1R27j123Q07
4429C03J95j153P23J4n06R30k35j025J104l34l10J075r82k62J036o65k79Q86r36
4448d21M5P54o09J66O21j151M98N42r15Q13L0j053J002J37j088J059k86n65R66
4467E45m02m67R42o72m46J014o82n7O06q97L82Q95j280M80M01q87M97L28p87N54
4487F7J84q05Q12k9j002R21L6o61R82o93k77J073p36r5R58r06J07O35j017L22
4507a24O34r29N38L92j196J026kq98J005j89q66J285o65n89Q72j82p66J039o32
4526b47o2J032r74jR80j116L32N20j109P00N33j124O16L29j056J045P3j087Q87
$$ plain form
4391 -253 695 -234 -381 394 -714 -133 499 -701 -96 365 -385 242 437 -670 161 365 -271 373 81
4410 81 -569 560 -84 -440 422 -240 -542 461 -191 -396 411 -494 -307 655 -359 -308 619 -504 303
4429 303 498 -655 68 82 -424 506 271 -754 350 16 -294 781 -201 -463 573 -92 -371 515 -421
4448 -421 -376 378 -231 -65 556 -595 -97 445 -470 343 373 -680 322 459 -629 430 144 -421 545
4467 545 143 -324 618 -54 -500 514 -168 -225 381 -516 -134 761 -519 -39 362 -525 -28 300 -487 67
4487 67 251 -554 258 229 -773 148 184 -477 505 -188 -465 608 -128 -223 735 -171 -64 571 -446 -124
4507 -124 510 -419 119 511 -685 341 339 -559 446 257 -609 676 11 -578 294 112 -654 385 -247
4526 -247 -309 723 -251 -252 728 -388 -56 464 -645 55 588 -536 80 409 -647 398 471 -616 271
4545B71k17q08J116r7q52J078n64j57P65q89o8J167j209M03O48j028J40O94r17
4564e24O21O88j031L69O0o09P52O1q94P39j20o72R91n11l63P77l63l34R95j051
4584d19o5J323j274M07M27r50N44O36j010L71M47j021Q88j23q30J150l97m91J079
4603F92m68p87J046n58k48R64q02m62J321q38j14Q64r48L05P15j096M65N06j470
4622i13Q68J72r36J235l79o65R05r9o57Q83o78k80J324q64K2L43m95Q9R87j335
4642d73J14R11j005N52K24q90M59O75j097Q25j44q50J167l17o43Q94m04p52J354
4661F00j086nJ127j021J3J150j132L10N31j077N93O65j220P84j12n72O66K95j193
4680f84J041j45q49J325n74r40J165l70l58J151r57r9Q70q33q0R90j054L00N40
$$ plain form
4545 271 54 -754 362 265 -587 491 -73 -230 535 -354 -422 745 -464 -61 587 -441 -301 393 -524
4564 -524 97 785 -246 123 183 -426 326 387 -507 232 112 -560 431 -80 -443 334 -29 -363 632 -419
4584 -419 -484 839 -435 -28 399 -551 -7 629 -381 -10 437 -584 304 181 -649 501 104 -387 692
4603 692 224 -563 483 -75 -323 641 -161 -623 698 -140 -254 610 -338 -33 682 -414 51 557 -913
4622 -913 -45 127 -809 426 47 -618 287 188 -469 414 -264 -544 780 -84 -62 281 -214 -125 862 -473
4642 -473 -359 552 -453 99 323 -567 -108 567 -530 295 151 -699 468 151 -492 402 -2 -754 600
4661 600 -486 -491 636 -385 -372 778 -354 -44 487 -590 3 668 -552 232 120 -452 214 509 -684
4680 -684 357 212 -637 688 114 -826 339 -31 -389 762 -195 -294 576 -257 -337 653 -401 -101 439
4699D39j128P57L09j058J019j5o15O55j18q53J091j33r33J162m63o70R83n23m57
4718e51J111q45m6Q67r45J63O84j192N60P60j005M62M14r25J095l71r06J181j89
4737C22q73R88n00p71J251n00m39J189j049n5J079r43J87O61q13O2P62j017L71
4756h8L22q15P87J87j184R73M05j086R31o1j054R46j73o20J140p72m29J080n51
4775f2j69J066j224J99Q70r70J16P62j068M87N16j036Q13j42p38Q90n6q32J045
4794D67m01o23J076m14n08J126q59m52J430j083J75L80q77N81N94j210M25O69
4812D96j101J007K17j172Q08O5r28R54l87n42Q70l81l46R21o15l45J256j090j06
4831d19R83j057L85P12j033M84L10r82P22N67j427Q52L07r90J108k12j012J148
$$ plain form
4699 439 -689 68 377 -681 338 323 -292 363 245 -608 483 350 -583 579 116 -554 429 -94 -551
4718 -551 560 -285 -331 536 -409 -246 438 -754 -194 566 -439 23 437 -488 607 236 -670 511 322
4737 322 -551 437 -63 -834 417 -83 -522 667 -382 -437 642 -301 -114 547 -266 -204 558 -459 -88
4756 -88 234 -581 206 393 -791 182 587 -499 432 371 -683 263 90 -530 610 -162 -591 489 -62
4775 -62 -231 835 -389 -190 680 -290 -174 588 -480 7 523 -513 300 158 -580 310 254 -578 467
4794 467 66 -557 519 105 -403 723 -136 -588 842 -241 -66 314 -563 18 612 -598 -173 496
4812 496 -605 402 619 -553 255 320 -608 346 -41 -583 287 -94 -440 481 -134 -479 777 -313 -419
4831 -419 564 -493 -108 604 -429 55 365 -617 105 672 -755 97 404 -586 522 310 -702 446
4849D46n16p44J383p61k05R05p67j01R66j034J93R71j139M02M77j065L96N78j036
4868f51P98M00j272Q50L74r61R59n09m83R48m27o84J294q96k5R48o68k37Q82j266
4888f26L90O23p82L48N19j157Q27K44r42Q53j29q55J022k3r66Q68k24o99J158
4907D49n29m60J101p03l56J092q41j22R49q40lP14j111O29O48j333O27K25p29
4926e93Q45O8r47J051k64p84J305n03q55J148q16j18J136p43m19J105j217N11
4944i0N58j091L82R12j117N07L50j055J019J31r54R71l09p71J137m75n66R49o27
4963a39k36J220j140J25P17j157M11O53r21M22M84j190R87M96j462P86K96q53
4981e01P66L8r13R19j50n34R97o59n80J183o95l84R81q25n7J066j148M49O14j293
$$ plain form
4849 446 -70 -814 569 -192 -397 508 -259 -360 606 -428 -235 736 -403 -1 476 -589 -193 385 -651
4868 -651 147 547 -725 125 499 -462 497 -12 -495 453 26 -658 636 -260 -285 663 -5 -242 640 -626
4888 -626 -236 387 -395 -47 472 -685 142 386 -556 297 168 -687 335 312 -654 214 -10 -709 449
4907 449 -80 -540 561 -142 -498 594 -247 -369 580 -260 -263 451 -660 -31 617 -716 -89 136 -593
4926 -593 252 320 -627 424 160 -624 681 178 -677 471 -345 -463 673 -70 -489 616 -601 -90
4944 -90 468 -623 -241 671 -446 61 411 -644 375 506 -448 523 214 -557 580 105 -461 488 -139
4963 -139 -375 845 -295 -170 547 -610 -199 454 -467 -45 439 -751 236 732 -730 56 352 -501
4981 -501 265 303 -610 309 159 -375 622 -37 -617 566 -129 -513 468 -357 -414 652 -496 -47 567 -726
5001g26O92O40r25M84J84j024R18M8j047J217n55n19J073o80k86Q90m15m52J078
5020E95r36P9P80q30J65P40j232N05P15j145N86M54j062O05L61j037J162n1j161
5039g07J258m15p86J327q73m40J334r58k44J176q73J96N41p96K18P87j419O27
5057d7M47r42O94J56p94R91k76q41J057l41o87J098n04o59J115o26r5J002j090
5076c42J43P92p45j2P62j159M65Q76j364Q98Q2j158J171P4r65R14j70q37J091
5095E16k94p20J044l59p38J025m93k04P32j044M44P63r63K24N37j115N43O04j321
5114h19J018J33p10O28q6p03P31Pq78J219n13p42J253n17l96J059q33p0P96q68
5134b91L2O44q77O04O33j243M10L93r42J108k03r09J239l35o98Q58k73q13J346
$$ plain form
5001 -726 -34 606 -319 165 349 -675 243 291 -756 461 -94 -613 460 -220 -506 384 -31 -483 595
5020 595 -341 -262 518 -312 -147 593 -639 -134 581 -564 22 476 -586 19 380 -657 505 454 -707
5039 -707 551 136 -650 677 -196 -636 698 -260 -504 672 -201 -5 536 -260 -42 745 -674 -47
5057 -47 400 -542 152 308 -486 505 229 -612 445 104 -583 515 11 -648 467 -159 -254 748 -342
5076 -342 -199 593 -152 -164 598 -561 -96 780 -584 314 396 -762 409 483 -482 432 262 -575 516
5095 516 222 -498 546 187 -551 474 -19 -223 509 -535 -91 672 -291 -67 470 -645 -102 502 -819
5114 -819 199 332 -378 250 164 -539 192 199 -679 540 27 -715 538 21 -375 684 -149 -219 577 -291
5134 -291 -259 385 -492 112 745 -498 -88 305 -637 471 268 -641 598 263 -435 423 150 -663 683
5153F83r06k27J092p69j87R97j106K18P44j025L35M15p87N87M85j300J073J57
5171D79r86Q80m8j036J221l41p50J063n40l93J206p61k98Q38r16K23P78j119N58
5190E8N47j143M54O21j150P30K79j147Q80J35j212J076j01n52J163n29o96J032
5208D45m98l33J022j119K11J134j157J48N61q53M18O53j110N83J00j073J195O7
5226C94j167J058l45l58J018n14o78J039m16n91J132q17K2P08p55Q5O97r75L12
5245a51R82j395O52K74j353J129K41r64Q04j68q66J303n82n12J315q25k70J162
5263G76q35m47J066q81p9J190j224K46O50j024L38R86j296O23N24j299J154j25
5281C43r52J058j39o98Q73o64m36J314q99n9Q30r38j7J002j119L60O05r87M62
$$ plain form
5153 683 -223 -450 642 -127 -314 683 -423 -205 539 -486 -151 264 -523 64 549 -751 322 479
5171 479 -507 373 325 -711 510 169 -581 482 -58 -451 755 -6 -304 534 -382 -159 619 -500 58
5190 58 605 -538 -84 537 -613 117 396 -751 129 264 -948 128 27 -525 638 109 -587 445
5208 445 -53 -386 636 -483 -272 862 -295 -147 414 -439 -21 632 -478 105 205 -868 327 394
5226 394 -773 285 -60 -418 600 86 -592 447 31 -560 572 -245 -223 485 -270 -185 512 -463 -151
5245 -151 831 -564 88 362 -991 138 379 -585 219 51 -815 488 -94 -606 709 -116 -386 776
5263 776 -59 -506 560 -321 -400 790 -434 -188 462 -562 -224 762 -534 89 613 -686 468 343
5281 343 -609 449 310 -388 485 -179 -615 699 -200 -259 571 -367 -384 618 -501 -141 464 -523 -61
5300f1Q99j331N23L75j013J064P2j144Q66j08n42R84n34n61Q70l17m50R93p37
5319a52j46J065j171K02P83j250P59O99j225M77M33j260J041L73r99P65j41r76
5337g23J144k75n57R01m54n49J172q26m16J107q71M8Q75q72n1J117j117M34M33
5356E20j220P01N01j325J165j35r42J083l11p93J321q48l41J330j033j69J134
5373F38j036P7J108j064R8J036j329M25O38j179O95K95j119J037J01q72Q27J0
5391C86q71R56n28o49J427p34k67P82n82l18J098j112O6J166j302o6Q55q30M79
5410d4K98r89R41R6j038J224k67q73J128n55o17J172l89m31J088o63n40J155r88
5429b92N7Q87j149J84Q47j250Q87M79j358P89M11j117R00Q3j160R97pp75R86k34
$$ plain form
5300 -61 838 -493 30 405 -608 456 528 -616 250 142 -400 584 50 -511 359 42 -408 585 -152
5319 -152 -298 767 -404 -202 581 -669 90 789 -436 41 474 -786 255 628 -371 394 253 -723
5337 -723 421 146 -411 490 36 -513 659 -167 -583 524 -347 -299 576 -296 -347 770 -347 87 520
5356 520 -700 1 502 -823 342 207 -735 348 37 -756 565 -283 -624 706 -327 -496 638
5373 638 -398 -321 787 -277 -179 857 -472 -47 591 -588 107 402 -717 320 421 -451 376 386
5391 386 -485 471 -57 -706 721 -13 -280 502 -80 -398 700 -412 -346 820 -482 -548 307 -523 -44
5410 -44 254 -735 206 302 -736 488 221 -652 476 -79 -696 476 87 -344 744 81 -459 696 -292
5429 -292 -235 652 -497 -313 534 -716 171 650 -708 81 492 -625 275 358 -802 195 188 -587 399 165
5449A65r91J297m78k59Q13p22j55R62r51J59O91q43L23M61r93P19o2q09Q65J60
5469C52j055J065l27o58J198m60n47Q30l96n15J084q16l9J049j130J60R98j251
5487d58L99M03q64M94L53j031P27M49q06P00k04r39J404n15p39J160n62m31J049
5506E89o52j58Q32j151L05R89j128L90N23r83N25L48j263Q80M02r77R44M7j122
5525f60R84J4o12J009o87o22J218p33l88J097j135J77Q37p78J57O56r41M93O15
5544G01j316O65M04j154R06L3q39J043k83o62J020n00o71J194n09o68J489j093
5562b40j24J126j264K16J096j307R9R31j052O29N53j203P00M81j379J075j50p86
5580e99J328m85o97Q86o12j88J079r46L3Q75j165L23Q18j119L39O57j033L57J018
$$ plain form
5449 165 -826 471 -7 -266 547 -175 -330 632 -319 -160 531 -312 11 472 -521 198 136 -673 192 352
5469 352 -703 362 35 -623 575 115 -432 398 2 -513 571 -245 -284 765 -365 -205 793 -458
5487 -458 -59 344 -520 -26 327 -704 23 472 -334 366 162 -777 627 112 -627 533 -29 -460 589
5506 589 -63 -221 611 -540 -235 754 -374 16 539 -444 81 429 -834 46 448 -529 415 462 -660
5525 -660 324 338 -274 735 48 -574 644 -89 -477 620 -515 -338 499 -279 -122 534 -407 86 701
5544 701 -615 50 454 -700 206 239 -600 443 160 -502 518 18 -653 541 32 -636 853 -240
5562 -240 -364 762 -502 -286 810 -497 -398 533 -519 110 663 -540 160 641 -738 337 187 -599
5580 -599 729 244 -453 433 -179 -367 712 -234 -201 674 -491 -168 650 -469 -130 527 -506 -149 869
5599H69j698Q47O25j018O58J47r98Q89M0j015J246o10o85J230o57j68Q37q20l9
5618c20Q80j007J77P58q39M93N19j059M15M99j092O43M06j207R31j38o57R16j96
5637A22p22J178p18l10J322j056k50J166r62P0O52j191N69P04r98O63M46j270
5655e85Q02n4q43Q94J6q98J047k46p77J002l22n02J257j104p4Q40o56l70J191
5674F18q45K40N23j012O47L19j092N85M30q91O69M0q08J158l20p27R68n49l11
5693c58R26n69k56P54o76k83J133j059L17O02j004M74O34j386R82J98j302R84
5711A11L02r85Q07r3r63J357m13p14J247p58l19R59q32j33R48o48j91R31j157
5730e44O18M99j206O76P89j364O30L57j295J052Pp30Q92j14p22J273r36l54Q03
$$ plain form
5599 869 -829 18 643 -375 283 430 -568 321 361 -654 592 -18 -703 527 -130 -298 539 -281 -320
5618 -320 560 -447 -270 488 -351 142 661 -398 17 516 -576 67 473 -734 197 59 -598 318 122
5637 122 -600 578 -140 -450 872 -184 -434 732 -230 -160 492 -699 -130 574 -424 239 685 -585
5655 -585 217 163 -680 214 230 -668 379 133 -644 358 36 -466 791 -313 -387 453 -203 -573 618
5674 618 -227 13 536 -476 171 490 -602 -17 413 -478 191 231 -577 581 261 -466 502 -47 -358
5693 -358 568 -1 -257 497 -179 -462 671 -388 -71 531 -473 1 635 -751 231 429 -873 111
5711 111 413 -572 235 142 -821 536 123 -591 656 -102 -421 538 -294 -427 521 -127 -318 613 -544
5730 -544 74 573 -633 43 832 -532 98 455 -840 212 219 -511 381 267 -455 818 -118 -472 331
5749C31l05n07J108q69k44J212j191J95Q79j232N46O57j210R13J61j037Q14O1
5767B82j017J025j83q69J181l65o27J150p42n9Q70r43k38J220j140M97O07j159
5785e10K60Q54j149N16N18j004O70K42r80Q97Q9j060J157m23o27J095n63n40J132
5804E74p93k32R53q71J35Q56j149J58O30o26L76O52j359O99L99q22Q26l40q91
5823h25J104j82o53R84j75o50R50p07j29J044j135J88N32q53L56R31j397N24P44
5842F51j025M18L13o79O39J33r84R78j3j067J048m53m44J018m18p46J145p07k25
5861d18J041j067P1R84j109K81P15r46M53O10j207N61O28j157Q16N1p87Q81n9
5880C42r85J040l99o59J442r26k81R37q05k52J160j162J48R50j142O98L58j263
$$ plain form
5749 331 26 -481 627 -242 -486 726 -465 -270 609 -623 -77 580 -630 283 444 -593 221 282
5767 282 -735 290 107 -762 419 54 -573 577 -165 -224 646 -297 -535 685 -455 42 649 -510
5785 -510 -250 604 -545 -29 489 -515 155 397 -583 314 403 -657 500 77 -550 545 -18 -558 574
5804 574 -219 -451 502 -369 -234 622 -527 -369 261 -365 11 663 -696 3 402 -420 406 66 -825
5823 -825 279 97 -556 428 253 -397 553 -154 -283 761 -374 -186 346 -507 -151 780 -617 -93 651
5842 651 -374 44 357 -322 317 450 -534 444 431 -636 412 -41 -485 533 115 -631 514 -193 -418
5861 -418 623 -444 -373 611 -498 -217 498 -448 5 615 -592 -31 597 -560 256 307 -480 401 342
5880 342 -643 397 -2 -661 781 -145 -426 511 -294 -546 614 -548 -400 550 -592 106 464 -799
5898g99J330L7j252J244l23p62R71l92q59J269n68n77J220n13m26Q22o65q6J059
5917G30j098K82R32j332M32O16j154O13M56j143R12j15q27J302l87r44J175l99
5935E1q62J318n62n19J095p08k69J121j241K00R63j145L41P86j044N83M40j285
5953g37P51M45j064J013r1j266J464l75o33J186q33l30P62l20m79J405r91j96
5971b89J131j244J11P63j017N46K66r67Q42K02j127J105j8j074J264k76j001J442
5989F59p34o16J165m22m82J065r45nP31r05L33Q14j036N0R27j153P64K45j018
6008e63R18J83j189J125l95p47J423n35p48J155p82m62J492j115k06J100j078
6025d24J17R78j169M28O08j071L99N08q79P12J21r93J089l58r00R86K5p57J263
$$ plain form
5898 -799 531 568 -684 560 237 -525 446 54 -805 464 -104 -681 539 26 -400 422 -243 -329 730
5917 730 -368 -86 846 -486 -54 562 -592 21 477 -666 246 131 -696 606 219 -725 450 51
5935 51 -811 507 -55 -574 521 -187 -456 665 -576 -376 587 -558 -217 569 -475 108 548 -737
5953 -737 14 459 -605 408 317 -949 515 140 -493 693 -140 -470 292 -28 -507 898 -93 -289
5971 -289 842 -402 -291 472 -545 1 267 -700 142 344 -783 322 304 -770 494 218 -783 659
5989 659 -75 -691 474 52 -430 635 -310 -315 416 -489 -156 658 -378 -328 599 -554 210 455 -563
6008 -563 355 538 -651 474 79 -668 755 220 -528 627 -155 -617 875 -240 -446 654 -424
6025 -424 -307 671 -498 -70 538 -533 -134 374 -505 207 328 -665 424 66 -834 152 177 -580 683
6044F83p89p58J408o66mQ14q94J13Q74j168J72P81j262Q00L16j092J007J63j028
6063e30R98l44o85J107m81q64J285n27m36J184q08k35Q04p38q7J071j054J07J027
6082G94j432M52P75r81L84N09r67P24q6p31R52m83o25J339q43m65J347r66j6Q99
6102E80q33j10R97p95J43R55j419K92O15j054O67N12j288J049K37j106Q75J11
6120D28j210J339l27q30J013m84l91J165p80l20J043j051J00J016j334M18P72
6137E67j029M18L62j049Q60K60j019J038P9j016Q10k32n32J125o17o61J309o57
6155A6m78J090j032Q0Q37r64L46O68r73N77N53j249P86R9r25Q89J44j004J155
6174F15l54p17P27j80p94J029l45n88J241p64q2N71o87J88R15j027K01O32j058
$$ plain form
6044 683 -106 -864 544 -122 -126 688 -206 -93 781 -387 -215 566 -696 104 420 -672 335 498 -530
6063 -530 468 124 -561 546 65 -799 486 -41 -477 707 -101 -336 468 -270 -357 714 -340 -233 794
6082 794 -638 -186 589 -392 -8 501 -466 258 172 -559 393 -90 -715 624 -219 -684 663 -303 -319 580
6102 580 -253 -363 634 -161 -18 937 -482 -190 425 -629 38 550 -738 311 548 -558 317 428
6120 428 -782 557 230 -600 413 -71 -462 703 -77 -397 646 -405 -305 711 -623 -205 567
6137 567 -462 -44 318 -731 129 389 -630 408 487 -529 281 49 -483 642 25 -636 673 16
6155 16 -462 628 -404 -324 513 -451 -105 563 -410 167 720 -529 257 356 -569 320 464 -540 615
6174 615 261 -456 271 91 -703 326 -19 -607 634 -130 -212 359 -328 -140 775 -252 -51 581 -477
6193d77N18O16j456J060K40j330J006J5p53J179m35p80J292n37o30R93o89j39
6211c07J039j071R2R31j201M62M60p46J22P75j427R83L34j004J125j06j051R36
6229C46J1r64J090n81l31J057o14o61J322j109J64Q69q14L2Q19j184O28M86j266
6248g00J169j40j050J067j58p41Q89m6j245J428k46j094J338p33l13J200r42J32
6266a85O92q84J31P45r31M42K41q15P63M01j330R14K17j071J206o91m82J153l63
6285A53q72J369p49m02J168j100J59R03j079J26R90r47L03M49r28L81N49j161
6303f88P34N24j228J151j28j128J019m43l35J069n48m83J075n55m66J008o49l97
6321d68J073r27K95N50r29P00J14r57O49K60q59P70K24r91J076l00q68J125l06
$$ plain form
6193 -477 41 657 -799 261 501 -829 177 192 -561 618 183 -597 695 158 -472 521 -168 -307
6211 -307 732 -339 -247 684 -517 -55 405 -341 -219 556 -871 112 446 -558 567 461 -590 346
6229 346 357 -607 483 -98 -429 628 14 -647 675 -434 -270 599 -215 -183 636 -548 80 566 -700
6248 -700 469 329 -721 346 188 -553 336 290 -955 473 227 -867 471 -262 -575 625 -317 -185
6266 -185 507 -377 -246 499 -432 10 251 -564 199 600 -730 184 401 -670 536 -155 -637 516 153
6285 153 -719 650 -99 -501 667 -433 -274 629 -450 -324 666 -281 22 471 -457 -76 473 -688
6303 -688 46 570 -658 493 365 -763 256 -187 -522 547 -1 -484 591 36 -430 578 -71 -468
6321 -468 605 -322 -27 523 -406 294 408 -549 100 360 -499 271 495 -496 580 280 -588 537 231
6340B31q06J307q45l38J232j152k17R43p29J90R74j293K44Q96r54L52K93r62P05
6359G1K32j052J008q4q17J255n77l49Q92n45n02R66o37j88J009j065N9P12p70
6378c82K81N12r80N65O93j089P00Rj074J140k00q46O16K81p54R58m32o15R61j65
6398A79o34R02p37M1R84j074J13R05q76l1O93r46O30J21j092R46J74p46Q42l38
6418E6o06J064l21r18R96m09k39J076j108LJ160j023n0R30r85M84L46j024N15
6437e3O13j083O80p5o72J097o3j262J118pr33R26l75k60J149r31k61Q90q98J3
6457c87Q68r18N60M63j139P46K21j315R31L42q24P79j95p59R66j40p34J169n93
6476D1p19J000l52l33J021q30l38R14p28N85K19j066N59O72j116M16M84q66O42
$$ plain form
6340 231 -575 732 -113 -451 781 -371 -588 355 -374 -184 790 -503 -259 637 -317 35 328 -634 71
6359 71 303 -749 259 175 -642 613 36 -313 579 34 -468 498 -139 -327 682 -383 -324 388 -382
6378 -382 -101 411 -569 -4 689 -400 300 309 -765 375 175 -671 -55 226 -528 430 -2 -617 344 179
6398 179 -455 447 -290 -249 735 -339 -226 679 -197 -228 465 -481 149 270 -822 124 298 -448 394 56
6418 56 -550 514 193 -725 271 -138 -377 699 -409 -406 754 -269 -319 611 -374 110 456 -568 -53
6437 -53 560 -523 157 82 -590 507 444 -818 300 293 -640 286 -89 -349 800 -131 -392 498 -400 -387
6457 -387 481 -437 123 586 -553 193 414 -901 30 372 -452 327 132 -627 339 199 -535 634 41
6476 41 -678 322 -30 -363 658 -172 -510 404 -324 261 480 -586 -27 645 -471 -55 429 -437 205
6495B05m7p33R51j11p37Q36o07k81J027n61k73R26j011j43J110j031M22M13q13
6514d58M94N57j086Q12L20j053O36j02p77J142j87r10R68k30l79Q43n73n09J236
6533G44p30n17J189q56J7N37q86L58O33q29J53P50r58O76J25q28Q06k36p14Q40
6553B74k93n75J023m16n23J088o58k40R20j123K74Q65j192M17O79p77K46O44j024
6572c91O32P6p63M33K18j047J233l41p58J200m49m78P56n94k10R63n88j32O96
6591D56r46M35N99j160O60M27q11N56Q6p38N41Jp37R31Rr47R41k59n77J065p01
6612a69m40J091n61k02R16p66j20P19r31J11Q74j132P55L03p50L83K22j037J008
6631B74J09p79P19k68m67O68q5o42Q52p83J23J033q39q0P32j025M84O33r91K61
$$ plain form
6495 205 158 -575 376 265 -472 364 -243 -524 503 -58 -331 595 -416 -559 551 -480 -58 355 -458
6514 -458 36 593 -493 319 639 -414 222 120 -657 485 298 -612 356 126 -253 590 17 -492 744
6533 744 14 -503 686 -170 -153 384 -502 -144 489 -340 -187 563 -395 281 406 -422 384 148 -566 274
6553 274 -19 -594 429 13 -510 578 -80 -320 600 -523 -249 616 -576 -159 520 -257 -11 633 -391
6572 -391 241 317 -446 -13 205 -842 391 50 -708 492 43 -435 321 -273 -483 480 -108 -240 456
6591 456 -490 -55 544 -616 44 471 -340 216 302 -436 105 106 -631 300 309 -638 303 44 -533 532 -169
6612 -169 -609 482 -79 -281 635 -131 -251 468 -463 -352 522 -610 145 448 -302 81 303 -734 274
6631 274 383 -396 323 55 -412 256 171 -471 381 -402 -279 754 -85 -165 567 -458 26 659 -332 -71
6651g1O04p90K44L53q69M35J49m95P36j11n35Q15l24m76P54n43l09Q72o17p1O64
6672D15o10J95N51r20M91N75j464N70O12p93M31K91j086J016P3p27R65n67m17
6691c99P84k22o23J005p94j25R25r42K00O50o18P8O06p53J34M05o06K88K06p99
6711f00P52Qo07J004n08m88O16j69m66Q49n49j28O89n13j98P00p81K29P56j302
6731g06M52P58r03M53J35p08Q43L7j005J157j63r84J090m47l89J174q23k89P21
6750D03l92j68M70p68L74Q35j261L69N73j069O75M06j039Q65N5r13Q74l7m81N22
6770B93l81j34O99n16j24N14m29k3O52p79j19P26q63M42M78j013M80O41j242Q81
6790A83n8n09M91J02p21P02J2o73P27l90l54J082q05M0O13q12J87O80p53k4O67
$$ plain form
6651 -71 533 -257 -13 340 -529 -94 55 -440 296 185 -350 465 141 -335 419 -124 -433 439 -178 -249 415
6672 415 -195 0 551 -369 122 697 -767 -197 415 -378 53 344 -742 274 347 -380 585 18 -399
6691 -399 385 163 -460 545 -249 -374 551 -391 -191 459 -159 -81 525 -228 -94 311 -295 -7 199 -600
6711 -600 152 160 -447 557 49 -439 177 8 -458 391 -158 -286 403 -110 -308 392 -389 -160 596 -706
6731 -706 -254 504 -399 54 189 -519 324 361 -644 513 350 -634 456 9 -380 794 -29 -318 403
6750 403 11 -157 313 -455 -81 754 -507 -138 435 -634 41 447 -592 273 328 -585 289 252 -229 293
6770 293 -88 -222 477 -39 -163 351 -78 -101 551 -228 -347 379 -484 -42 436 -577 -97 544 -698 183
6790 183 125 -384 107 209 -512 190 202 -471 256 -134 -488 594 -211 -171 442 -370 -183 497 -256 -280 387
6811C87q45N32K72j005P96j5j056J050K08q09Q52Oj138J242l84n16J032p75l63
6830e29Q54k74m40J058j033M04M50q55N52m3m30N28K96j153Q38R5r90R66k31o85
6850f22R75k29l94R27q41l09P77l61l67P38m56r9Q73j090M69M98p43M69J58r22
6870e49Q16j2o29N57Ml17N84k80p76J138m85o89Q08l18j78R16q83K15N75j035
6890e38M99N55q90M40J60o96Q20r0o21M77M48r47Q96l80n25R25p13k10R14o70
6910a46l39J140q64L6M21n72M44L77q81K94M19q59N74L27o94N01j73m93Q30j61
6930A81o68O40r4k80M94m28p7Q01o61k42Q89p78J29O64q90K38N08p42M29O8m87
6951c06O36K9j075J076k07o50Q15j23m46O28l22n29R04l59m29R18q99J10N84o83
$$ plain form
6811 387 -458 74 346 -659 137 122 -934 116 324 -485 367 373 -765 477 93 -423 609 -166 -529
6830 -529 325 51 -389 669 -364 40 490 -365 187 144 -286 242 538 -615 223 318 -672 294 63 -622
6850 -622 353 124 -270 657 -184 -493 284 -77 -444 294 -162 -261 612 -478 -9 489 -254 215 373 -549
6870 -549 267 255 -374 183 187 -130 454 174 -602 536 51 -638 170 -148 -326 590 -293 -78 497 -538
6890 -538 -39 516 -374 66 226 -470 350 260 -361 116 564 -383 513 133 -392 533 -180 -390 524 -146
6910 -146 -485 655 -209 -173 248 -324 120 497 -384 -90 329 -530 44 371 -323 178 5 -488 342 181
6930 181 -487 153 59 -221 273 -155 -232 569 -92 -334 555 -223 -94 570 -320 -82 426 -316 113 181 -306
6951 -306 330 359 -716 360 153 -497 318 195 -251 377 55 -474 430 71 -358 560 -339 -229 355 -328
6971c28J24O85q32M08M48j198J036j36o84O85O6p97R65j01r84Q62j31l27N48o42
6991c33j39R41n63O0O14q30J94M18q41M87N0l94M25J65o64M52J79n81P46j38o56
7012d08Q12l54n34R21n01k18Q23q22J95O16n80l75Q11p77M91O8p42O57O6n25N88
7033B12p9l84L19J44n83N56r4n51P84l51j04O81p66j62P49p78J75P50r95N41K30
7054B94p38L75L74o86K98K95o62P36j4p52R54n25l67Q79m89k50O33l79m61P39
7074B54n67J4N38n62qP89o99K71N57j204P39O8l76L19J10q73J150j47p46Q14l81
7095F0m63N81m33J44N47n86j90Q43q80L20L85p39N63L92j074O77L83j084P62K67
7115D75r92P14l4m79Q75p12k49R94p67k52J011q37J33O56n91j93Q33r92O88J91
$$ plain form
6971 -328 -204 481 -351 57 505 -693 343 207 -477 208 274 -523 442 341 -643 219 88 -239 309 -333
6991 -333 -472 469 -94 -34 580 -250 -56 362 -479 8 58 -336 89 254 -410 42 221 -360 386 248 -408
7012 -408 404 50 -484 437 -64 -282 541 -281 -86 530 -50 -425 386 -391 100 168 -574 83 149 -376 212
7033 212 133 -251 68 212 -371 185 91 -460 324 -27 -131 550 -216 -378 371 -407 -232 518 -477 64 294
7054 294 -444 -69 305 -381 -83 212 -450 286 272 -480 474 -51 -418 461 -28 -278 355 -24 -485 254
7074 254 -313 -299 239 -323 -331 458 -241 30 587 -617 122 190 -186 133 243 -630 520 373 -373 441 60
7095 60 -403 178 -255 -111 436 -150 -340 503 -377 -57 328 -411 152 544 -530 147 530 -554 208 475
7115 475 -517 197 163 -316 559 -153 -402 592 -175 -427 584 -253 -120 536 -55 -248 585 -407 281 472
7135D72p05M11K09o80M43M3m78N83n3q07R93k90o55Q44k29n11O05k35l60R44o14
7156g0j98O48p93K30M73n34K77L52p82M42L84q85P52k37m76O96m4q04J002k19
7176B14n80N75l25l10O71o93J28R77r00l8P23q31K30O50r95O15K73p50N79No27
7197d09O46k20n58O88j81l50O90m44k48Q40o65k61J053q23o5P73q15J04P81r15
7217c79M24M03r92R50r0p87O98k80o33J051rr94P10j70k17P06n93l10P54m91Q
7238b41P77q68J04O01q08L31L96p73N79J33r25Q10j24k70O76j49o68P90k75k17
7258a21L88k35j56P03r12L72M06q75J61R40r76L87K9o06Q01l3q55N75K40o89P57
7279C01k81n76P38l3m78O63l39j22K83n40K48M55l38l60Q25q91K71N20p62L86
$$ plain form
7135 472 -233 178 387 -293 150 193 -285 298 245 -562 431 141 -514 330 101 -410 195 -40 -400 544 -70
7156 -70 -268 380 -413 -183 290 -244 33 385 -397 45 429 -456 296 59 -417 279 235 -569 433 214
7176 214 -366 209 -116 -426 245 -448 -320 657 -243 -281 442 -389 -159 491 -504 111 384 -366 213 218 -409
7197 -409 237 17 -541 147 -34 -384 306 -138 -386 454 -211 -472 581 -242 -307 466 -349 -245 536 -379
7217 -379 45 448 -544 406 316 -471 227 -53 -686 365 356 -638 72 -98 -315 391 -202 -512 242 -249 -241
7238 -241 536 -332 -228 373 -435 -104 292 -481 98 231 -694 116 -8 -278 398 249 -419 371 96 -121
7258 -121 267 32 -124 579 -333 39 445 -430 -269 671 -305 82 111 -495 306 273 -582 -7 233 -456 301
7279 301 20 -556 182 149 -329 334 -5 -127 156 -384 -136 319 -19 -379 446 -445 -174 346 -416 -30
7299c0K79n38K15M88q33M15K87q18J125n12n58Q53n65k8P59o88r7Q34q04L06M72
7320E62p98J43M16o32L98L39p51M63K6o96P53p2o55P89o1m92Q58l31q92J437p17
7341H7n40J040p02j25O10q32M94M56r99M42L59q50M11J20k38N02N2q74R56j61
7361B08o55Q06l49k54P35n42o9O04n67o3O94o20j48O86r08L72K46l32J57J43p15
7382e71P09L68p92M77q7l45O31p6p23P28n28O7N29n26j11Q92r75J8O15o57K84
7403g3N19q47M80K79q11N63O8q44J006j38n53P26m50l08Q47l97m37R07o16r3N35
7424C63m81J9N08m31l0M55o61K52M67r96N70L09p70M49K28n56O05l8p57N66K01
7445B72q95R80n10PO84o82mQ42q63K36J32n27K45L23o70L99L89r03R54l17l87
$$ plain form
7299 -30 249 -289 -74 414 -419 -4 283 -535 590 78 -480 373 -192 -220 539 -149 -246 588 -216 90 562
7320 562 -236 -93 323 -309 89 428 -323 140 166 -530 223 151 -504 285 224 -268 590 259 -633 804 87
7341 87 -453 587 -115 -240 370 -462 32 488 -511 -69 290 -560 -149 -29 -267 235 287 -587 369 208
7361 208 -447 359 10 -244 491 -51 -120 484 -83 -146 548 -72 -220 466 -442 -70 176 -156 1 144 -571
7382 -571 138 506 -286 191 104 -241 390 314 -409 319 -209 -142 387 -139 -250 642 -333 -315 300 -357 -73
7403 -73 446 -401 79 358 -453 110 178 -666 340 202 -351 375 -75 -383 464 67 -370 537 -79 -172 363
7424 363 -118 -99 409 -22 -52 403 -258 -6 461 -535 35 344 -426 23 251 -305 300 262 -495 71 272
7445 272 -623 357 -153 -146 538 -144 -148 694 -169 67 199 -328 -83 240 -430 -31 358 -545 409 92 -295
7466b95M88J36p81Q60m57k51O45l37l97P44n45j19P13o08J38L64n86J43O53p60
7486b52J89L00p00L61L22o84N60J45o22R32o69k54N79k58m95R99n71m72J069n42
7506f3l86P95o97J07O45p28L90K41o14M62L2n59M37L10o43O73j62n57N75k65m08
7527d15M84j16m38P55n74J63M88o36K40M28o66L90J44o14O42K7n81L34L33o91
7547c03N68j65k29N43l0q14Q42m95m84J004p21M8L86l57O1N84o30M71q2p20N01
7568b2M12o65L02j4m32M91M25j050O44J35m29N46l75l53R23n95k52R12o29l10
7588c36K77k8N9M39n73J23M53q03L21L48p86N54J60o31O01J01m54M27j80l69M61
7609A64j81j18O55n68P3J53l16P8J46n05L89L78o34K56J97n14L12J29o68M80N95
$$ plain form
7466 -295 193 329 -452 408 -49 -300 345 8 -389 355 -190 -309 404 -204 -66 298 -288 -145 508 -252
7486 -252 -63 237 -463 -102 220 -464 96 241 -381 551 -118 -372 207 -51 -546 453 -118 -590 479 -63
7506 -63 -449 346 -351 -244 401 -327 63 304 -310 152 184 -375 62 372 -271 402 240 -317 258 -7 -415
7527 -415 69 -47 -485 270 -304 -141 347 -289 -49 379 -287 103 247 -367 275 302 -279 55 388 -303
7547 -303 265 100 -129 414 384 -430 412 -83 -567 437 -284 -236 150 -207 -146 438 -192 279 197 -523 -22
7568 -22 390 -275 27 13 -419 72 497 -553 91 226 -203 343 -32 -385 538 -57 -309 603 -26 -336
7588 -336 -59 -87 -28 411 -162 -39 414 -389 -68 280 -506 48 208 -423 178 279 -175 252 72 -297 164
7609 164 -17 -135 520 -48 25 178 -138 -60 86 -419 -30 348 -286 -30 167 -347 -35 94 -574 -94 501
7630E01o68N84m23l94Q38l20j31O18o43j77P03o80K48K45l89L1N93p08J39L20
7650B87o38M67J68q03P62Mm85L54%m41N33o0l80N07l43J19L62o02J50M46o46J91
7672d8L59p49K65L31n80L52L03m72N13l76l08Q50m39l23O25l87k02P30o50P4N59
7693D27l64o9M25n35q9O65o38K38M65q12N78K7p35M98J12o86P94j31m85N37l25
7714a03j18M60l26j66O99n82j19O38o05M5N66o37K56K20l79L78K63o12K82J10
7734B70l96L08R9n54M46j60l46P21k62k42N21n63N3L30m60K3K06m5k8L84p66N76
7756A15K33o01J34K39l84O00M4p30N44J9k19M42l68l15N78m43k10R01q36K20M01
7777C64n98L11K29m31N7M57o41J39L03m53N03J45q07P70l40n18Q89k6o01O30m47
$$ plain form
7630 501 -167 417 -6 -400 438 118 -13 605 -38 -215 488 -192 56 301 -88 -57 536 -172 -33 287
7650 287 -351 116 284 -519 243 247 -238 116 116 -325 208 148 -232 275 -68 51 413 -189 -39 407 -239 -48
7672 -48 311 -438 -173 158 -422 -70 233 -239 274 -102 -410 440 1 -322 303 -84 -286 444 -206 -132 427
7693 427 63 -6 419 -116 -205 460 -178 60 525 -287 291 318 -417 81 193 -493 301 170 -315 222 -103
7714 -103 -221 239 -87 -253 446 -136 -255 383 -222 -177 389 -248 8 228 -151 227 490 -122 160 270
7734 270 -126 182 281 -273 173 13 -333 388 126 -116 405 -158 -105 225 -235 -212 -6 -51 -79 305 -461 115
7756 115 348 -253 -119 120 -264 336 380 -350 194 213 -6 436 68 -247 331 -112 -322 579 -257 -37 364
7777 364 -234 77 306 -125 -68 389 -252 -113 190 -263 240 385 -422 348 8 -510 379 353 -248 382 -65
7798f5k47O22l36k40M89m06R8N24o36K17M79p42L16K00p49N75J52o42O21q7m61
7819c18N51j73j58O04q09K36M02l54j77N48o36k6O33n90J48L70m21M0K84m53K72
7840b7J57l91M53q1n28P02m51j62O04k85j85M82k64k33M73l89l6N22o36J09N36
7861C70p04K13K20n39N52J43p43N64K08o67O12m8m89N25j91k65K63J16r7O2j01
7882Dj01L26m27Q3L06m86M04K73n72L41J13p36P38J42o80L84n4k63L39K9l96N76
7904C43j38l73N06n05J06N33m05J37m5m47J88K57l44L36L43p55L03J55m50L52
7924I7J48o70Q06j04n55M18j91j84N69m43j44N21m01j09N42m28j27K99l97K44
7944a09K30l07J75J29m36L54N0m79K98J31m30P12l19k63N34l68k9M95k51l17N14
$$ plain form
7798 -65 -312 310 -26 -266 223 -183 -85 439 -197 20 499 -243 73 273 -476 99 251 -391 230 143 -318
7819 -318 233 60 -98 506 -303 -67 335 -19 -196 352 -284 -310 323 -267 -119 251 -170 -130 154 -299 -27
7840 -27 130 -261 192 111 -417 285 -166 -328 276 -9 -194 288 24 -209 264 -125 -161 361 -275 -166 370
7861 370 -334 -121 99 -440 112 255 -488 76 284 -383 229 181 -308 217 26 -239 24 140 43 105 4
7882 4 -97 229 -198 -115 191 -295 109 382 -190 151 264 -472 266 408 -272 112 58 -205 134 163 -233 343
7904 343 205 -168 338 -167 -61 472 67 204 159 -288 -100 157 -187 149 492 -263 40 195 -255 97
7924 97 245 -425 381 277 -278 140 -51 -235 334 -109 -253 268 -133 -242 300 -128 -255 44 -353 -109
7944 -109 121 -186 -11 118 -318 36 86 -393 -95 36 -394 318 -1 -264 270 -98 -127 368 117 -200 314
7965C14o25L37K65q22M58M22m23n9J41j98L20j02l63N45m3q01R50l30n23O85k31
7986h3j52O33l02m79N56m76K23L04n11K71J25l57K85O9j82N7J09l78K38n4j46
8007b50L95Ll95L71Mm33L79l91J42P52p26K7P03r93J97M15n02K58J54k31J55O9
8029A03n62P42r0o65L86J93j62K99j41l62M34l43K0M21n85J19L23m25J94M34k71
8050F2k86M14l00J48K45l54K07Jl05L06Q5m26L07k11k4K70O9m42N84n07J16M02
8072C61o09J89K56l42R3N65p95M45K82o35L79j14m55N79Ml40K32k52k78R12o22
8093a45j26N09k81k53N30l75r0O05k87j80L42m70K35K63l85L67O9o60L74K02o00
8114c56N32M8n65O11m21K8K87j91j18L26k68j36M53n02K75J02n78N87n5k49J99
$$ plain form
7965 314 -311 26 291 -531 -73 349 -74 -133 8 -190 130 28 -335 210 167 -634 316 -14 -537 148 -83
7986 -83 -235 398 96 -383 173 -303 -80 224 -287 -16 109 -248 37 106 -76 -19 90 -288 -50 -104 -250
8007 -250 145 148 -247 124 128 -305 74 -317 -175 577 -149 -122 581 -412 -215 200 -302 -44 110 -121 34 103
8029 103 -459 283 193 -472 -86 107 -55 244 103 -259 175 -168 -148 273 -312 -193 130 -295 -101 333 62
8050 62 -224 190 -110 38 283 -71 136 137 -168 138 223 -203 104 -107 -131 139 208 -234 350 -157 -41 361
8072 361 -248 -59 197 -145 -52 513 -282 163 445 -190 189 75 -380 199 203 -137 95 -157 -435 477 -145
8093 -145 -271 238 -43 -296 234 -141 -231 374 87 -93 249 -221 14 277 -108 259 328 -332 42 244 -356
8114 -356 176 224 -341 270 -151 -123 164 -27 -145 181 -87 -223 230 -272 3 105 -473 114 59 -190 9
8135IJ08n01M93P8l05K75k06j2L76k64k82L92M0k16M51m15j31L26l20j5J99m80
8157d00M62K56o44M13J57n14M13J70n98M24j03k12N12k47l94M06k31p8M07l10
8177a11l8M21k44K59l01k18J58N40o58L59J84n15M03l8
$$ plain form
8135 9 117 -384 109 187 -118 157 -49 -61 315 51 -231 161 201 -15 436 21 -110 216 -104 -119 80 -400
8157 -400 62 318 -326 87 244 -270 143 313 -285 139 36 -176 336 89 -305 101 -130 -208 199 -111
8177 -111 -149 272 28 287 -14 -232 -74 466 -192 167 351 -164 239 201
8191B01
$$ Imaginary data points
##PAGE= N=2
##DATA TABLE= (X++(I..I)), XYDATA
0@%%%%%%%%%%%%Qj6J6j6J6k1K9l2M0m8N6o7P6r0J06j22J40j63J87k12K42k74L09
35A64l48L88m33M89n46O05o74P48q27R14j011J117j232J357j494J644j811J997
53A047k204K436k697K994l334L729m195M754n439O301p423Q947j1142J4591k0805
68a2440L5332j29690o5325K58953m3608J9342m5100j61173J39402J18440j21621
79g488P8382m1396j42374J57118N3950r3305N1666j22906k6948K39991o6094j59736
91g9140N2369m7511Q4748J39809j84180o1177R1662p3859J12247R4806j95135
102f5361j2663O0275k6199J59917l7074k25690R9147R2805k7082P8363j29105
113c2667j04321J84219k944n0336P6384j40400k7653J76539n0489k0551K2317
$$ plain form
0 0 0 0 0 0 0 0 0 0 0 0 0 0 8 -8 8 -8 8 -13 16 -16 24 -24 32 -35 41 -49 57 -65 75 -88 99 -113 129 -145 164
35 164 -184 204 -229 260 -286 319 -355 393 -434 480 -531 586 -646 711 -783 861 -950 1047
53 1047 -1157 1279 -1418 1576 -1758 1971 -2224 2530 -2909 3392 -4031 4916 -6226 8365 -12440
68 -12440 22892 -106798 -172123 86830 43222 62564 17464 -143709 -4307 114133 -7488
79 -7488 70894 29498 -112876 44242 98192 4887 56553 -66353 -93301 146690 80596 -79140
91 -79140 -26771 -74282 10466 150275 -33905 -95082 -3420 -77279 34968 129774 -65361
102 -65361 -78024 -17749 -43948 115969 78895 -146795 -47648 45157 18075 96438 -32667
113 -32667 -136988 47231 44287 -6049 70335 -70065 -97718 78821 28332 7781 30098
124C0098j52659R3148J65925j25861k8995p015q3124J78562O8549j77212J4361
135b4223j3221k9716J92106l4312j67328O1802j7643K0064J43071j35402r6141
146a00943J20077l5319L3838P3557j74791p149J30736m3938N3564j3508j83324
157a47200R7502J25578o9342L4396o9106j05621J71432M3505r1521M9352q8274
168d9299m1364J86201j8235q3007K0965j00947O7598J70668j30218p8467N4948
179a157m5717R6738M7626j68498L0701O1012o8582J01758l88j51690N9500L3021
191e676k349J15960j20808j39915J52403M9107j5257L2157j45689n392J61370
202G5911n5450j1849M3429j29902L9498J16527o9909J6447k6712j12455J48042
$$ plain form
124 30098 -122561 -29413 136512 10651 -18344 -25359 -108483 70079 138628 -38584 -24223
135 -24223 -37444 -67160 124946 90634 -76694 -14892 -32535 -12471 130600 -4802 -100943
146 -100943 19134 -16185 17653 91210 -83581 -90730 40006 -3932 49632 36124 -147200
157 -147200 -49698 75880 6538 40934 -28172 -133793 37639 81144 -10377 38975 -49299
168 -49299 -90663 95538 77303 -5704 15261 -85686 -18088 152580 22362 -56105 -1157
179 -1157 -46874 49864 97490 -71008 -40307 20705 -47877 53881 53493 -98197 -38697 -5676
191 -5676 -8025 107935 -12873 -152788 -385 48722 33465 65622 -80067 -85459 75911
202 75911 20461 8612 52041 -77861 -38363 78164 8255 24702 -2010 -114465 33577
213C3577Q0089j43901r40o476q660J45541n6092j25119Q3466j8344o989J21207
225I7359q3254p6784O3047l9170P2437Q8543j73766m1900J11087p352N4388k3641
237D0994j51823Q3152Q2800p1244N1165l0752r5771J07958K2653n4009N4498q6859
249d7238l9138J62673k0386p8085K0376p1679N9825J29505j10044m5568M2946
260C187o2644Q3509P2292j24456J047J9328m4240J20338N06j42497M9396K8834
272D600j2547R0029q4977r2397J12672K093j5429N5087j11748k0022J23799l6824
284A4336m691J8334j14131N6263J06568p3337N535j1863q7546J08634O1137q9004
296i765J8642l8467l9699J40165q210j01989L7231k7520J4245J03575r0697n9305
$$ plain form
213 33577 113666 -30235 -31175 -37651 -46311 99230 43138 -81981 1485 -16859 -23848 97359
225 97359 14105 -62679 368 -38802 33635 122178 -51588 -93488 17599 10247 64635 40994
237 40994 -110829 -27677 55123 -16121 35044 4292 -91479 16479 39132 -14877 39621 -47238
249 -47238 -86376 76297 55911 -22174 -1798 -73477 -13652 115853 5809 -39759 3187
260 3187 -59457 24052 96344 -28112 -27065 -7737 -51977 68361 68867 -73630 -24234 4600
272 4600 -7947 82082 -2895 -95292 17380 19473 4044 59131 -52617 -72639 51160 14336
284 14336 9645 27979 -86152 -29889 76679 3342 8877 -2986 -90532 18102 79239 -9765
296 -9765 8877 -29590 -69289 70876 62666 -39323 -2092 -29612 -15367 88208 -2489 -61794
308f1794P8336l4898K7225O0743j14991r165P1536l2526O2641K292j41224N0683
320d1142Q2339l2713L9378n6146q3426J15997K3387n9193N0302o0556m3001J09894
332D5120j6290k7404L0794r7950K4995J28402p0112m6925J9879m3124Q7525M2854
344G7764j29054J7890M6846m2339P3656m589r7673M6715J831j2478J03280o3654
356A8195j05083P5738J9564J2815M2520j13204j6325J11469l7186n919L0373q5742
368e2785L2216O9107n5129K8939r102r2410R0395O3515p8877J341l2254j4555
380d9599J23705k7914r8427M5694j4772L886Q5812o5647m5060M9768m5496M1695
392C645P7378j02707k8318N3767k0033O2073J493j18687M8333N8737m2029M1621
$$ plain form
308 -61794 16542 -18356 8869 69612 -45379 -54544 16992 -15534 47107 49399 -91825 -41142
320 -41142 41197 8484 47862 -8284 -91710 24287 47674 -11519 38783 -21773 -64774 45120
332 45120 28830 1426 32220 -65730 -40735 87667 17555 -29370 -9491 -52615 34910 77764
344 77764 -51290 -33400 13446 -28893 44763 40174 -57499 -10784 -8953 -21431 81849 18195
356 18195 -86888 -11150 8414 21229 63749 -49455 -65780 45689 8503 2584 32957 -52785
368 -52785 -20569 48538 -6591 22348 13246 -79164 11231 74746 -4131 -2790 -35044 -49599
380 -49599 74106 46192 -52235 -6541 -21313 -17427 68385 2738 -42322 7446 -38050 3645
392 3645 81023 -21684 -50002 3765 -16268 45805 47298 -71389 -23056 35681 -6348 35273
404C5273l4036p3088Q8574J6249m2859M1151o6657l2984J14427j2013m0869J7646
416A0814p2506L4104J04693o4671k6728K0354n6416O6227N7486q8896M934J1528
428I23l7672Q4807J565r6371L6670Q202j4140P5090n4793p2996O8747j539M641
441C134M8795r3969k6562R2987j3244O918O238r4857M3232Q2951n1236J0678o396
454H669p0672P1089M0741n3911K8923l6305m7933J02472M645o7483K1588l3883
466c2060J5493R0836p0627n3901N5543k3565K8555M8348q7841q046M4248l1461
478b4478O1709J6316j11143K0079N1113j1234M8288m8802p9102Q6085K4407m1438
490h200L5332m6679k7921P8953k1489j3563L6928p7515L548R4008l5389k3434
$$ plain form
404 35273 1237 -71851 16723 32972 -9887 31264 -35393 -68377 46050 34037 -6832 10814
416 10814 -61692 -27588 77105 12434 -14294 6060 -50356 15871 73357 -15539 -10605 923
428 923 -36749 48058 49623 -46748 -10078 -1876 -16016 59074 4281 -68715 32 -1507 3134
441 3134 51929 -42040 -68602 24385 11141 18059 24297 -70560 -27328 55623 4387 15065 8669
454 8669 -62003 9086 49827 -4084 24839 -11466 -59399 43073 47718 -19765 1823 -32060
466 -32060 -16567 74269 3642 -50259 5284 -18281 10274 58622 -29219 -37265 6983 -24478
478 -24478 37231 53547 -57596 -37517 13596 2362 50650 1848 -77254 8831 33238 -8200
490 -8200 27132 -19547 -47468 31485 9996 -3567 33361 -44154 -40606 53402 18013 -5421
502e421j167n1011P6485N4982r6389m964K3299k1079O9463m491p8251L5507m872
515g909j6076Q4783l2514p5383M0263j749K0133N1050q8337k8424P9374k0040
527E171K323J6833p4936K7643N6106m5168K5076l709p7418O0319M9957m2292J4013
540A3918m1600l2174J04737K541o6801K1166k7473Q381Q1238m8797l8677L7101
552A3560l9425K7726O0795p1538j6678L0159k9698N2274J5756r0392K3032L6292
564A1863k3257M6222k8053p0083O2320K1023k0466L5696n8455l4984Q4845k468
576B4203j9070J8654o6925J0547P9632l6678r770R755n9029M6364N3256o0607
588i668K147J267l2827P1473O471p4254K8690K561j3240O5617l3811n5071M5226
$$ plain form
502 -5421 -6588 -57599 18886 73868 -22521 -27485 -4186 -25265 44198 39707 -38544 -3037 -7909
515 -7909 -23985 60798 28284 -47099 -6836 -8585 11548 62598 -25739 -54163 25211 5171
527 5171 7494 24327 -50609 -22966 33140 -12028 13048 9339 -68079 -7760 42197 -95 13918
540 13918 -27682 -59856 44881 47422 -19379 1787 -25686 -17305 63933 15136 -23541 13560
552 13560 -25865 1861 62656 -8882 -25560 4599 -25099 27175 42931 -47461 -24429 11863
564 11863 -11394 34828 6775 -63308 -988 20035 -431 35265 -23190 -58174 26671 24203
576 24203 5133 23787 -43138 -32591 47041 10363 593 10348 -48681 -2317 50939 -9668
588 -9668 -7521 -6254 -39081 32392 38863 -35391 -6701 -4140 -17380 48237 14426 -40645 4581
601D581j2822R366N7825o9206l7349N6563p945K5343J2392r0431J9537O6772l3478
614A148J3760o414n9921N2146K5913m1751L4925k3924m8100P0610R718l8704J9031
627H437m1403O167Q4262m3700m6315L2362k2270K9602M5004o6493o269K8410l4845
640b7051M9505K8946p6442M607K0465q947N6716k9256p4851N5244K2158k3202
652b108K7822m3556k1786O5764k1680j4254L6191n6170m712O4394k3805j178R77
665E899o0515N1796N8593n9614o057J474k4730O6417N018o3857K7123q039j9533
678b6025O7072k0067n0274L0447j7390J1869N4753o3391k8339N4997j5258J3332
690A1726J5851o7601K0103M8694l3906K2183q82o2806M2510L2910k8280K4522
$$ plain form
601 4581 -8241 1125 58950 -10256 -47605 8958 1013 26356 38748 -51683 -32146 34626 1148
614 1148 14908 8494 -51427 719 26632 -15119 19806 -4118 -52218 18392 28110 -10594 8437
627 8437 -32966 -26799 57463 13763 -32552 -190 -22460 7142 52146 -14347 -20616 7794 -27051
640 -27051 22454 51400 -25042 -20435 30 -8917 47799 18543 -56308 -1064 21094 -2108
652 -2108 25714 -17842 -39628 26136 4456 -9798 26393 -29777 -34489 29905 6100 4922 5899
665 5899 -54616 -2820 55773 -3841 -9898 -8424 -33154 33263 38281 -25576 1547 -6492 -26025
678 -26025 41047 20980 -29294 1153 -16237 -4368 50385 -13006 -41345 13652 -1606 11726
690 11726 27577 -40024 -19921 28773 -5133 17050 16168 -46638 -4128 28782 502 25024
702B5024l4459m2517P3225R782l8569J7159l7314j821P0958l1094l0445K5335
714E264l3815K4028M9535n6179q483K5919k8388M1655J7318o7546J8399K1273
726H980k1217M7228j6194o2568M1030J2168q874L9133n0762l8026O4134l350q264
739C418K1887n7388L062N9502k9909K115J3484n5356L2306M4447m2897O572n484
752d241l3540O4334J0417o3204J9256q51q772N6099k8879m2607L8006j8282K667
765i597N4524m5482k9997L2567j5411L1944K4715p6595M012N0672j9891J7697
777A9158r077n2715M5906K1775l8209K8562j5967l9171N3446M374k4748K1493
789A4827m2331m029P4374k4751l5235J6977k7136K9340M4257n5752m585K2974
$$ plain form
702 25024 -9435 -51952 21273 31055 -7514 9645 -27669 -29490 41468 10374 -20071 5264
714 5264 -28551 -4523 45012 -11167 -19650 6269 -22119 19536 36854 -30692 -12293 8980
726 8980 -12237 34991 18797 -43771 -2741 9427 553 39686 -11076 -49102 15032 11682 3418
739 3418 25305 -32083 -29021 30481 572 2687 16171 -39185 -6879 37568 -5329 1243 -4241
752 -4241 -37781 26553 36970 -26234 -6978 -7829 -16601 39498 10619 -31988 6018 -12264 -9597
765 -9597 44927 -555 -30552 2015 -13396 18548 43263 -33332 -29320 21352 1461 19158
777 19158 10081 -42634 3272 25047 -13162 15400 -567 -39738 13708 18082 -6666 14827
789 14827 -27504 -31533 42841 18090 -17145 -168 -27304 2036 46293 -9459 -14044 8930
801H930l4943L7133K7245n4982Q126N230j8218N7251j3249o5961L6587J5371r023
814e03L0586m6105k3798O1808j3680j2898K7990m7611o12N0120k3721P580O755
827A5911n9045L2603M9181l8048K854r622l2066N8573J1646m9850K0621j0819
839h061j7023N6737j6135l7865K7755j9854P627N0085m8460k4924L8211j4801
851f708K0057J9006o3690R423L9678k3160K4093l059n6733L4206K4799k3388K8983
864B3507k5136m0901N4600N784k3005K4397l8283j0738O0946k0388j9534J7441
876H690l7407K2469M8686m8602r857J8221k5397M0018J5994n8639J6369J3824
888D369k1832M6143p769n1340K8612J327m311M5636m0384l8140M6590l772n59
$$ plain form
801 8930 -26013 11120 38365 -16617 -8491 -3261 -21479 35772 22523 -43438 -6851 8520 -503
814 -503 30083 -16022 -39820 21988 8308 -4590 23400 -24211 -24823 25297 1576 9156 15911
827 15911 -43134 -10531 38650 602 3456 -6166 -38232 20341 31987 -17863 2758 -8061
839 -8061 -25084 31653 15518 -22347 5408 -14446 -6819 43266 -5194 -30118 8093 -6708
851 -6708 13349 32355 -31335 -21912 17766 -5394 18699 15640 -41093 -6887 17912 -5476 23507
864 23507 -1629 -42530 12070 17854 -5151 19246 -19037 -29775 31171 10783 -8751 8690
876 8690 -28717 -6248 42438 -6164 -16021 2200 -23197 16821 32815 -25824 -9455 4369
888 4369 -17463 28680 20911 -30429 -1817 -490 -4801 40835 451 -37689 8901 5129 4570
901D570K2234n1395J73M8071k7421M587J4700m8937K2552L5622l0880J2725r498
914b897l8322N6138J9560m7562J0526j0093n964N6075k2457l8333L2900j8487
926h916j144M5948l3657j8223K2570k7520K7186L4246o0374m094L2379j5035K6951
939B0317o702n3463L8105K1802l0327K6148j5888l3660M5892L01j7114K6599m1318
952a9308j3704O1865j3678k0259J0992l6381K3243M5298m4759l583J8031l2846
964b5089L0348K2299m2899J5022O29k5014M9905j334n1033K3505L438k942L8568
977C5403l9762l0875M7818o566m335K3222m5101k550M2532k1967R741J1627n1877
990c2690K0478L6480k7619J3183p743l7979M5658J3912l6635J9484j4331j8152
$$ plain form
901 4570 26804 -24591 -24418 23653 -3768 819 15519 -33418 -10866 24756 -6124 6601 -2897
914 -2897 -41219 14919 34479 -13083 -2557 -12650 -18614 37461 15004 -23329 9571 -8916
926 -8916 -10060 35888 2231 -15992 6578 -20942 6244 40490 -19884 -23978 8401 -6634 20317
939 20317 13615 -39848 -1743 20059 -10268 15880 -8 -33668 12224 12525 -4589 22010 -19308
952 -19308 -33012 28853 15175 -5084 5908 -30473 -7230 38068 -6691 -10274 7757 -25089
964 -25089 5259 27558 -15341 -319 310 -24704 25201 23867 -27166 -3661 -223 -3165 35403
977 35403 -4359 -35234 12584 6018 1683 24905 -20196 -22746 19786 -2181 7560 19187 -32690
990 -32690 -12212 24268 -3351 9832 2089 -35890 9768 23680 -12955 6529 -7802 -25954
1002b5954N0901j2997l0688K5191k1782M464M6240l7470j9716K7932j9709K2470
1014H882K5982n3939K405K7331j9402L0163N23n3333K6827J8068j9993K8855k0190
1027B179l5428M3905j299j8743K8052l1424j4411M6624j6078q162J7322m0635
1039b8098J4935M7137l4576p105Q995k6219L8593J8675n0226J2458Q567k1050
1051a7914L9659l540l9741K3799p874p966M5759k7526l4279L4057o897L990K3993
1064B5520m5654m30M2198k4895N467J4767m1161J8587K6149k6667K0013p526m2697
1077c6329M2512K0310l1453J0785k0701j0983N4777j5830l3615K5848j6849n42
1089a2070L8665l0653q654K3659l0299J8372L3075m3928j865J9290j6852L1294
$$ plain form
1002 -25954 24947 11950 -18738 6453 -15329 -10865 35375 -2095 -21811 6121 -13588 8882
1014 8882 34864 -19075 -16670 10661 -8741 21422 21945 -31388 -4561 13507 -6486 22369 2179
1027 2179 -33249 10656 9357 -9386 18666 -12758 -27169 19455 3377 -4785 12537 -28098
1039 -28098 -13163 33974 -602 -7707 1288 -24931 13662 32337 -17889 -5431 3136 -17914
1051 -17914 21745 18205 -21536 2263 -5611 -13577 32182 4656 -29623 4434 -2463 1527 25520
1064 25520 -20134 -20564 21634 -3261 2206 16973 -24188 -5601 20548 -6119 13894 6368 -36329
1077 -36329 6183 26493 -4960 5825 -14876 -25859 28918 13088 -20527 5321 -11528 -12070
1089 -12070 26595 -4058 -12712 10947 -19352 -980 32095 -11833 -13698 5592 -11260 20034
1101B0034p07n0912K7848J8947k1349K4423j6827l1054L9163j519j3464K7878
1113B2461l3900j7848M6760r196p652J2026l9223J5107M2159l3706l235J2636
1125F389k8267K7525J6776l8381J6403K417k5371L9623N76l8123K0610n706m539
1138a0068M1614k8863l0447L3831p629M197K5481m3123n241L5765j9342J1470
1150G645J1704m5327J7090K6808k5325J7436m273l5808L5723J0916k7692K0616
1162I513j5952j7934M5530q992k5130K0563k1533L427M1768l0621j5319K1540
1174F860k2561J8648K6929m1691R42J5483k0612L1233O352m6214J7555J3346j4014
1187g744K8147j8250l1239L8950q67j6879K4345k5126j0750L7465j7381k579J9386
$$ plain form
1101 20034 19327 -31585 -3737 15210 -6139 18284 1457 -29597 9566 8047 -5417 22461
1113 22461 -11439 -29287 17473 8277 625 12651 -26572 -11465 30694 -3012 -6247 6389
1125 6389 -21878 5647 22423 -15958 445 2862 -22509 17114 17690 -20433 177 -5529 -10068
1138 -10068 31546 2683 -27764 6067 -1562 2635 28116 -15007 -20248 15517 -3825 7645
1150 7645 19349 -25978 -8888 17920 -7405 10031 5758 -30050 5673 16589 -11103 9513
1162 9513 -6439 -24373 21157 12165 -12965 7598 -13935 -10508 31260 639 -14680 6860
1174 6860 -15701 2947 29876 -11815 -10873 4610 -16002 15231 21583 -24631 -7076 6270 -7744
1187 -7744 20403 2153 -29086 9864 8997 -7882 16463 -8663 -19413 18052 671 -1908 17478
1200A7478l8766O474L9684k3577r10J916l0817L4598K2063m0796R407L118j8911
1213a9039L6286l243l1539K3994j0909j0677M1349j9425k6545K4667j0857P549
1225A611K5271m2549m170L5946j8791O469R975l6898J8073K0220k4990K1766k317
1238I616l8654K9198J5327j7787J6402k3863j7549M8214o579k5713J7631j8238
1250a1995K321L4055k8493p474K1962k6058J2840K6836l3808J292J2236j8861
1262a5147L0352N306m3773J8312J2612j3584K6526j5897k9271L2416k728j0236
1274e112K7023k8087j6453L4490j1111k52J5289l7652P629L5250k4363J219O898
1287D768k8191K7296J7259l4026J3560J055k0358L4823j339k9923J9846r403p374
$$ plain form
1200 17478 -21288 -14814 24870 1293 383 2299 -28518 6080 28143 -12653 -3246 -128 -19039
1213 -19039 17247 14004 -17535 6459 -4450 -15127 26222 6797 -19748 4919 -5938 1611
1225 1611 26882 -15667 -19837 16109 -2682 3787 13762 -23136 -5063 15157 -9833 11933 9616
1238 9616 -29038 160 15487 -2300 14102 -9761 -27310 20904 14325 -11388 6243 -11995
1250 -11995 -9674 24381 -4112 -11586 10376 -15682 -2842 23994 -9814 -8522 3714 -15147
1262 -15147 15205 20511 -23262 -4950 7662 -5922 20604 4707 -24564 7852 5124 -5112
1274 -5112 21911 -6176 -22629 11861 750 498 15787 -21865 -14236 21014 -3349 -2130 4768
1287 4768 -23423 3873 21132 -12894 666 1721 -18637 16186 14847 -15076 4770 -4633 -12007
1300a2007L7521j9272k3533K2702j3476O316K8544l5499q350K5452j5625J4099
1312F872J0854l9466J3778K1879k1197J6469k634l0081K8604P596k0992K0111
1324A1793j5435j8966L7516m690j7642J5621k3102K107L7609k3923j1552J6974
1336F310k1763J4686K3265l1540M480J0082k3490K7610J0692l5562J2042M975
1348A787j0722L0156j5917l0895L1696Q73j1154J9731k4395p856L2366j6620j805
1361b755J9998l2168K079K8880j7061P136J270l2911K5979K1535k9170P569j697
1374a316j7076L1493k860k5929K1459r977j1478L3230j2972j8335J8451j4127
1386i437Q051K7058l4457p655K6622j2314J0184P420l4060J5147J7350k1991J8061
$$ plain form
1300 -12007 25514 6242 -17291 5411 -8065 -1749 26795 -8704 -17054 8398 -7227 6872
1312 6872 17726 -21740 -7962 13917 -7280 9189 6555 -23526 5078 12674 -8318 11793
1324 11793 -3642 -22608 14908 10218 -7424 8197 -14905 -12798 24811 888 -10664 6310
1336 6310 -15453 -767 22498 -9042 -4562 5520 -17970 9640 20332 -15230 -3188 1787
1348 1787 -8935 21221 5304 -25591 6105 6978 -4176 15555 -8840 -16696 15670 -950 -2755
1361 -2755 17243 -14925 -12846 16034 -1027 6109 7379 -25532 447 21982 -7188 381 -1316
1374 -1316 -18392 13101 10241 -15688 5771 -4206 -15684 17546 4574 -13761 4690 -9437
1386 -9437 -1386 25672 -8785 -16440 10182 -2132 8052 15472 -18588 -3441 13909 -8082 9979
1399I979P48l0828K0533O656j3171K1100j8870k1135L5996k433j5296J3998k1044
1412a3767K629L2365k2835p406J7080k1242J2729K0952k8535M104Q691j9765K5706
1425A0706P550l3960J2789M837j1405K6989j2092k5820K4906l965o526K3806k2351
1438d536j2275K7027j2114K005J6357l0448L984K5793j7849N534M314k7837K1598
1451A553J6684k4736Q911l256j7190L0516k77k4912J5813q225p249K9846j4659
1464B819j5136J8827j5700L286K6591k4744o712J6683j5313J5585J1575l4146
1476a6385R492J7249j5658J5111m241k5408K4445M939j6715J9171j3011j7787
1488a8798K8884l618r513J4296k3948n85L2692j7067q409J1449j9421J3211J8133
$$ plain form
1399 9979 10727 -20101 432 7088 -6083 15017 -3853 -24988 11008 8575 -6721 7277 -13767
1412 -13767 -11138 21227 -1608 -9014 8066 -13176 -447 20505 -8030 -3926 4765 -15000 10706
1425 10706 18256 -15704 -2915 1922 -9483 17506 5414 -20406 4500 535 -5991 17815 -4536
1438 -4536 -16811 10216 -1898 107 16464 -13984 -10000 15793 -2056 3478 7792 -20045 1553
1451 1553 18237 -6499 2412 -844 -18034 12482 12205 -12707 3106 -5119 -12368 17478 2819
1464 2819 -12317 6510 -9190 -5904 20687 -4057 -10769 5914 -9399 6186 17761 -16385
1476 -16385 -6893 10356 -5302 9809 5568 -19840 4605 9544 -7171 12000 -1011 -18798
1488 -18798 10086 6468 -3045 11251 -12697 -13282 19410 2343 -6066 5383 -14038 -827 17306
1501A7306k6658O373R136k1818J9728R840k4773J0857j276j0697K9802r452k7526
1514a9158K0539J388l338J7362k3933q340K8095j2428j912J5838k4886J659J9597
1527A0483j5147R740M699k9870J6568J7869j9187Q710m759j6033K8013p29k1769
1540a1412J6795p421r244K6324j1427j2399J5044j5895N200K5735k4943q648J5824
1553C533j0993J3989Q144l1221J0035J4817j5723J5279o30k3083J8291K593j2268
1566g237K0760j2392j8211K4895k857p565J3468k0936j424K7724j4998o101J0546
1579E672j9452J1811J8992k2811K629N922j7020K0914P674k5214J0296Q95j0828
1592a0520K4510o697k1545J7379l848m251K0919j8696j0967K1493r953J229J4071
$$ plain form
1501 17306 -9352 -2979 6157 -15661 4067 13907 -10866 -9 -1285 -11982 17820 8368 -19158
1514 -19158 1381 2769 -569 16793 -7140 -15480 12615 187 -1725 14113 -10773 -9114 10483
1527 10483 -4664 5076 9775 -20095 -3527 14342 -4845 3865 -894 -16927 11086 10357 -11412
1540 -11412 5383 -2038 -11282 15042 3615 -8784 6260 -9635 -4435 21300 -3643 -12291 3533
1553 3533 -7460 6529 14673 -16548 -6513 8304 -7419 7860 7230 -15853 2438 5031 -7237
1566 -7237 13523 1131 -17080 7815 4958 -2607 10861 -10075 -11499 16225 1227 -4874 5672
1579 5672 -13780 -1969 17023 -5788 -3159 2763 -14257 6657 14331 -10883 -587 308 -10520
1592 -10520 13990 7293 -14252 3127 -721 -4972 15947 -2749 -13716 7777 -2176 -947 13124
1605A3124k4059K369J9445j4973P468N020k4926J4579J4314j5862J0001o471j7940
1618a7911K6491L512j9390J1084q941n102K5315j2867j1909J6515j3994Q96K0851
1631A4550j8338k551J1228j5620J3900J3028k7198M713J1687j0395J5762m094
1643F672k3458J9285N063j3071J6139j0195j5122K0935l984m879J4739k1372m935
1656a4183K6216r540m939P052j8541J2506J6925k2571M155Q692j6652J5115O001
1669A0236j8226J1406k897j2614K4297k653k1528J2285l180K54J9354k0112j1359
1682a4737K1659q070O23J2216k0942K371J5753j4472R441O249k4057J1366J2246
1695I646j3684J0115n161j6562K3046J578j6760J2288p965o910K2100r137r753
$$ plain form
1605 13124 -10935 -8566 10879 -4094 3374 8394 -16532 -1953 12361 -3501 6500 29 -17911
1618 -17911 8580 12092 -7298 3786 -5155 -10257 15058 2191 -9718 6797 -7197 -6301 14550
1631 14550 -3788 -6339 4889 -10731 3169 16197 -11001 -6288 5399 -4996 10766 6672
1643 6672 -16786 2499 7562 -5509 10630 435 -14687 6248 2264 -2615 12124 -9248 -14183
1656 -14183 12033 2493 -2446 4606 -13935 -1429 15496 -7075 -2920 5772 -10880 4235 10236
1669 10236 -7990 3416 519 -12095 12202 9549 -11979 306 -2874 -2620 16734 -3378 -14737
1682 -14737 6922 -1148 -525 11691 -9251 -6880 8873 -5599 3842 10091 -13966 -2600 9646
1695 9646 -4038 6077 916 -15646 7400 8978 -7782 4506 -3459 -10369 11731 2594 -7159
1708g159J3321j4598K084K2072j6786n484R657j2600J3347J1442k4979M250J0160
1721D727j0925J4336j030k0661J4942L225j0912J6015q972j3862J9488m262n649
1734c540J4389j6929m347K1484r822j752Q119j9685Q198J8001j6629K108K924
1747B519j5900J7401P233j9854R057n64j1225K0424l494j6026J3308n979k825
1760e925J9994j4752j0473J7120p469K342J1669k0748K162J5943j3290O354O069
1773H996k0515R656Q956j1791J2217m997j8875J9086N278j1897Q954j1193n299
1786a1424K3669q988j1313J3083j0133R89J5907j5150q37J0604j5646R865J2929
1799A3555k0034K209O346q939J5687r41k1765J3448M446r141J3980q046j2343
$$ plain form
1708 -7159 6162 -8436 -6352 15720 -1066 -6550 3107 -9493 3854 15296 -9683 -5433 4727
1721 4727 -6198 8138 7108 -13553 1389 4614 -6298 9717 745 -13117 6371 2109 -3540
1734 -3540 10849 -6080 -10427 11057 1235 -517 7602 -12083 -3885 14116 -2513 -405 2519
1747 2519 -13381 4020 11253 -8601 456 -108 -11333 9091 5597 -10429 2879 -3100 -5925
1760 -5925 14069 -683 -11156 5964 -1505 837 12506 -8242 -6080 9863 -3427 2927 8996
1773 8996 -11519 -1863 7093 -4698 7519 2522 -16353 2733 8011 -3886 5068 -6125 -11424
1786 -11424 12245 3257 -8056 5027 -5106 -4117 11790 -3360 -4197 6407 -9239 626 13555
1799 13555 -6479 -4270 2076 -6863 8824 7883 -13882 -434 4012 -5129 8851 805 -11538
1812a1538J6882m893l600J5064j6171o428J8848p069J55N832j9037Q881J6625
1825A3551j6903J517N030j2987J4099L922j6697J1093j526j2294J9043j286j4192
1838g630J0072o950j536K0208j3874j1240J4524o953L329J1461j9275J435J3590
1851G161j2225P661N608j8570Q378R182j1052J0343l926j5686J7939K855j1633
1864c965R771q620o707J9853p400q210J1078j2550O95J7329j2856k503P753j3812
1878a0144J0108J1885j8675L243N563j0015J4988O74j8652J1352K925p421J3747
1891I578q663j1993J6867l663n166J2386j3732m152J6320r391J303Q278j8000
1904a0028M467J4972j1547L748J359j5107J4491P607j5697P823j035r526J6722
$$ plain form
1812 -11538 5344 451 -3149 11915 -4256 -10684 8164 1095 1250 7082 -11955 -3074 13551
1825 13551 -3352 -1835 3195 -9792 4307 8229 -8468 2625 1099 -11195 7848 6562 -7630
1838 -7630 2442 -4508 -6044 14164 290 -10950 3574 -3379 -50 11411 -7864 -6429 7161
1851 7161 -5064 2597 8205 -10365 -1987 7195 -3857 6486 2560 -13126 4813 7668 -3965
1864 -3965 5806 -2814 -9521 10332 2932 -5278 5800 -6750 -6055 11274 -1582 -4085 3668 -10144
1878 -10144 -36 11849 -6826 -3583 1980 -8035 6953 7627 -11025 327 3252 -4169 9578
1891 9578 915 -11078 5789 2126 -3040 9346 -4386 -8538 7782 -1609 -306 7972 -10028
1904 -10028 -5561 9411 -2136 1612 2971 -12136 2355 9962 -5735 2088 1053 -8473 8249
1917H249l099j2425J1660p084l685J8113j0871r330J1490p253M017J1310j8753
1930g661O1J3738j0047N806M914j6650R000N977j1163J2384q79j6680J2969L310
1944E079p133J0329j1732p200K0273n368r072Q972r868K044J4868j4250j168R763
1958E537j3364P264J0826j5150L183K954r647J5177J420j8392R721K476o734J3383
1972H654p532j1079J4814n063m362J4201j2517n525J3936p317K587P481j7772
1985i494M585J4861j1347K388J841j3098J3700N578j4826Q262j025j0189J4942
1998F178j414j0921R992p334l689J7790r520q002J0513q464L708J1976j5790n24
2012e501J0682r519P050N204j6866P193P001r649J0048k685j4276J3867J741q304
$$ plain form
1917 8249 5150 -7275 4385 -2699 -6384 11729 858 -8472 3018 -4235 -218 11092 -7661
1930 -7661 -7600 6138 -3909 1897 6811 -9839 -839 5138 -6025 6359 5480 -11200 1769 5079
1944 5079 -2054 8275 -3457 -10657 9616 4248 -4824 4148 -5720 -3676 11192 -3058 -4226 5537
1958 5537 -7827 -563 10263 -4887 -1704 1250 -8397 6780 8200 -10192 -471 2005 -4729 8654
1972 8654 1122 -9957 4857 -206 -4568 9633 -2884 -8409 5527 -1790 797 8278 -9494
1985 -9494 -4909 9952 -1395 993 2834 -10264 3436 9014 -5812 2450 1425 -8764 6178
1998 6178 4764 -6157 3835 -3499 -7188 10602 1082 -6920 3593 -4871 -1163 10813 -4977 -5501
2012 -5501 5181 -4338 2712 7916 -8950 -1757 5244 -4405 5643 2958 -11318 2549 4290 -4014
2026d014J0350q841p743J7798n242n551R075j1811P77J5311j1502q47P610j2651
2040g281P155R732j4015M409L002j1292J3141K908j5501P894m4n268J4185p620
2054A405j2085J3756k479l236J0980j2602l084J3848q644J372R198j5013K021
2067d563J1310r665N760J577j4922J1421P210j2593O322j647q754J4947k527j0249
2081f373J0485o259m745J5775p217o630Q393q821M486J2596j5877j753J0000p804
2095c744O855L668j5704Q286N461j0923J0029K86j3094J0761K47o440J2092q875
2109a095q871J6059l077n460P912j1320J348J4430j1324j298P490j1661O057R540
2123H730j2941L908K385j1029J3065L337j4691P241L52n727J3635o651j0119J2803
$$ plain form
2026 -4014 6336 -2505 -10248 7550 2308 -3243 5832 -5979 -5202 10109 -1393 -2240 5370 -7281
2040 -7281 -126 9606 -4409 0 3002 -8290 4851 7759 -7742 152 108 -5160 9025 1405
2054 1405 -10680 3076 597 -2639 8341 -4261 -7345 6503 -2141 -769 8429 -6584 -4563
2067 -4563 6747 -2918 2842 4419 -10503 918 8128 -4465 1857 210 -8544 6403 3876 -6373
2081 -6373 4112 -2147 -6892 8883 1666 -4964 3429 -5392 -906 11690 -4187 -5940 4060 -3744
2095 -3744 3111 6779 -8925 -639 4822 -6101 3928 4214 -8880 1881 2128 -4312 7780 -1095
2109 -1095 -9966 6093 3016 -2444 5468 -5852 -4504 9926 -1398 -2696 4794 -6867 -810 8730
2123 8730 -4211 -303 2082 -8947 4118 7455 -7236 5 357 -5370 8265 1614 -8505 4298
2137D298m291l554J1730j0082m149J1571q042K280Q481j5012J982J1479r108M731
2151B314J166j3943J1154O713j1978P049j795r443J4339j361r826J0119o365l913
2165e770J4093p401n620R377r144K013J1813j2911m09P962r463P550N385j5011
2179g536N638N778q824R985j578j2793J1186J293p064J0893p711p728J3864l727
2193A676l621Q204j1366l27J3859r540j131O335j0495O040Q113j2760N029L508
2207C524j1023J0030L807j1881P152j787o426J4866n114j1325J0380l015j398
2220b210J0381j1500l446J2261p932R88Q260j2589K537Q484r104O567K682j4268
2234h889R257O130r778O707k571q383J3692k313r242R694n744m725J2939o428
$$ plain form
2137 4298 7 -3547 8183 -1899 -6048 5523 -2519 -239 8242 -6770 -4788 6691 -2417 2314
2151 2314 3480 -10463 691 7404 -4574 2475 680 -8763 5576 4215 -5611 4508 -1857 -5770
2165 -5770 8323 922 -4698 4679 -4465 -2452 9361 -3550 -3959 4003 -5460 2090 7475 -7536
2179 -7536 -1898 3880 -4944 5041 3463 -9330 1856 3149 -3915 6978 -733 -8461 5403 1676
2193 1676 -1945 6259 -5107 -5434 8425 -1115 -2246 4089 -6406 -366 7747 -5013 16 3524
2207 3524 -7499 2531 6338 -5543 1609 -178 -6604 8262 3148 -8177 2203 -812 -2210
2220 -2210 8171 -3329 -6775 5486 -2446 -1458 6802 -5787 -3250 5234 -3870 2697 5379 -8889
2234 -8889 368 6498 -3280 3427 856 -7527 6165 3852 -5390 4304 -1440 -6165 6774 346
2248C46m132P910j0137K693J2859j2155j728O901p731P745M399j4527O384N823
2262D650r015Q417m95j0709R952p18o693J1199o115q478J2119l210l134Q266j1275
2277e239k23J3072q920n60O216j0849N594Q318j0635M229J952j0296J0381L482
2291F522j1451O467j125n991J2583m874r377J0320l981k534J0551r583l256J0276
2305D547p436J691Q164j2077J696Q040q346O223K426j2845P475N585q383P204
2319C964k853r328J2670m49q259Q290n811l777J2619o753m674R074q444J132J0488
2334G889j0584K86O550r563O726O005j2836M293L956p697R235p16j1367R196K61
2349A634n942J0247n874p231J0970l847k049Q718j0524j331J1959p346l16N239
$$ plain form
2248 346 -3786 4124 -6013 -3320 9539 -2616 -4344 2557 -5174 2571 6970 -7557 -1173 4650
2262 4650 -4365 4052 3557 -7152 2800 2082 -4611 6588 473 -8005 4114 904 -2230 6036 -5239
2277 -5239 -5462 7610 -1310 -1870 4346 -6503 -909 7409 -3226 1003 2955 -7341 3040 6522
2291 6522 -4929 1538 413 -5578 7005 2131 -7246 3074 -907 -3441 7110 -2473 -5729 4547
2305 4547 -2889 -1198 6966 -5111 -3415 4625 -3721 2502 4928 -7917 -442 5143 -3240 3964
2319 3964 1111 -8217 4453 4004 -4255 4035 -1776 -5553 7066 313 -4361 4713 -3731 -2599 7889
2334 7889 -2695 -2409 4141 -5422 1304 7309 -5527 -1234 2722 -4975 4260 3544 -7823 1373 1634
2349 1634 -4308 5939 65 -7166 3804 -43 -2092 6626 -3898 -5229 6730 -616 -932 4307
2363D307j0480O228P208j1496M272L369r489Q458K264r531P233k263p218J2747
2377E609k429q529P505m402l95J1057r923m245J0334o684J535P252j1318K259
2391b374O964q752N926L490j2535O621M805p691O985l177q230J1889p86p866Q419
2406C688n070l679J1051o175k587Q290r514P10J0847q739k52M477q469P105N453
2421G136j2743M494L928p249Q000q39r864R354p16o106R883n046o603R986l816
2436b01j895Q325r684j196J0254o915Q88N056j0565M818O909r044M145K028r799
2451f876Q720K883r145O287j442o203J1609l295p829Q306m076j779R835p996l736
2466d737Q718o530J523P453j0718J698O908q214N411L415j1102N976L330p023
$$ plain form
2363 4307 -6173 55 7263 -4233 39 3408 -6081 2377 4641 -4890 2343 80 -7138 5609
2377 5609 3180 -5349 2156 -2246 -2641 8416 -1507 -5752 4582 -2102 -567 6685 -4633 -2374
2391 -2374 4590 -4162 1764 5254 -7281 -660 4145 -3546 3439 262 -7968 3921 3135 -4731 3688
2406 3688 -1382 -5061 5990 -185 -2772 5518 -3996 -3286 7561 -1178 -1430 3047 -5422 1683 7136
2421 7136 -5607 -1113 2815 -4434 3566 2727 -7137 2217 1501 -4605 5278 232 -6371 3615 -201
2436 -201 -2096 6229 -3455 -4651 5603 -1312 -424 4632 -5933 -1115 5794 -3250 895 2923 -6876
2451 -6876 1844 4727 -4418 1869 427 -5776 5833 2538 -5291 3015 -1061 -2840 6995 -1001 -4737
2466 -4737 3981 -2549 -1026 6427 -4291 -2593 4315 -3899 1512 4927 -6175 -199 3131 -3892
2480c892P690j860r203R960J76n853P327o089l555J1486n597l801P119p345J122
2495b315Q463q777J047N004q876N549N952j0096L312K507o578R060l56r847P845
2510A894jn819Q796m031o007R063m581j652Q651q746k500R012n307J158M236j0601
2526f435N152P580r369L239K002p821P714J863q034O682j578o695R969j684o208
2541c623O570n206j486J0477p174l968P584n497J449O211r510J839O273p640M930
2556A229L440j0101N181L443o488O923k133q331R669k35n560O614n053l164R705
2571E139n519k572P182p233j84Q382p095R72M374q552N308O107r784L243J889
2586A657n948Q124l49r050O975k31m680Q378m737n523Q283l680j562P571p646
$$ plain form
2480 -3892 3798 1938 -7265 2695 2871 -2982 4345 -1744 -5299 6187 590 -3211 3908 -3437 -2315
2495 -2315 6148 -2629 -1582 3422 -5454 95 6047 -4049 -737 1770 -4808 4252 3896 -5951 1894
2510 1894 1893 -3926 4870 839 -5168 3895 -686 -2338 6313 -2433 -4933 4079 -1228 -70 4166 -6435
2526 -6435 -1283 6297 -3072 167 2169 -5652 2062 3925 -4109 2573 995 -5700 4269 2585 -3623
2541 -3623 2947 -2259 -3745 6732 -442 -4410 3174 -2323 -874 5337 -4173 -2334 3939 -3701 1229
2556 1229 4669 -5432 -251 3192 -3296 3627 1494 -6837 2832 2597 -2963 3651 -1402 -4566 5139
2571 5139 -380 -2952 4230 -3003 -3187 5195 -1900 -928 3446 -5106 202 6309 -3475 -232 1657
2586 1657 -4291 3833 3484 -5566 1409 1178 -3502 4876 139 -5384 2899 -781 -2343 5228 -2418
2601b418j588Q050n716J394M828r337L419O361p508L611J745q123O762K473p382
2616c429N491j356n745Q784j674o140O601m177k119R407o093l236O347n498K228
2631f09O297r338J325O057o620M071L013q812N188K212o683O830o68p895P423
2646A791k44m420O805n413l725R568m071k912N779o253J004P681p361N66M805
2661C600q198M420N297q168L344J498o354P699L28q522O112m9m400P127l547m902
2677d715P908m070j712P503o457k039O642m947K248M203r186K550O700o624K906
2692I10Q61p204P072J816p213N701r70n627P856j496m767N991m326k076Q564n035
2708E7k954N687n223J542O226q070J048M535o228M142K985q017L893K239n247
$$ plain form
2601 -2418 -4006 4044 -1672 -278 4550 -4787 -1368 4993 -2515 1096 2841 -5282 1480 3953 -3429
2616 -3429 2062 706 -5039 3745 2071 -4069 2532 -1645 -3764 5643 -450 -3686 2661 -2837 -609
2631 -609 5688 -3650 -2325 3732 -2888 1183 4196 -4616 572 2784 -3899 2931 2263 -5632 1791
2646 1791 1547 -2873 3932 -1481 -5206 4362 291 -2621 3158 -3095 -2091 5590 -1771 -1205 3600
2661 3600 -4598 -178 5119 -3049 295 1793 -4561 3138 3466 -5056 1056 1007 -3393 3734 187 -4715
2677 -4715 3193 -877 -2589 4914 -1543 -3582 3060 -1887 361 4564 -4622 -2072 4628 -1996 910
2692 910 1771 -5433 1639 3455 -3758 1943 973 -4654 3202 1706 -3061 2930 -1396 -3472 5092 57
2708 57 -2897 2790 -2433 -891 5335 -2735 -1687 2848 -3380 762 3747 -4270 -377 1862 -3385
2723c385O433j352p356O970K71l946N923m721l200Q440l868k308N912o289K24
2738b252O755o073P62M118p406L837M839p341K906J398n973O867P34p287M914
2753G98n61l527P531l182n435O947k711j617O550o436j573O570n048J190M505
2768D001p694K104N169o009L483J166o979N471K156n911M709j143n008P487j381
2783A621m736O381m323k438P897m100k560M915n468K039N972p437K05M707n210
2798b535L647J998p605M690K085n675N673k47o048N598p62l358O246l891m145
2813d329P381k393k130M859o206K22O778n613L17M254o768K773M516n799K731
2828E93R80n798O316J189o592M431r32k894O435l158m288O550l309j921O201m777
$$ plain form
2723 -3385 3048 1696 -5660 1310 1581 -2365 3558 -1163 -4363 4077 209 -2099 3813 -2476 -2252
2738 -2252 4503 -1570 -808 3310 -4096 -259 4580 -2761 145 1543 -4430 2437 3171 -4116 798
2753 798 237 -3290 4241 1059 -4376 2571 -140 -1757 4793 -1643 -3216 3354 -1694 -504 4001
2768 4001 -3693 -1589 3580 -2429 1054 2220 -4759 712 2868 -3043 1666 523 -4485 3002 1621
2783 1621 -3115 3266 -1057 -3495 4402 302 -2258 2657 -2811 -772 5200 -2237 -2032 2675 -2535
2798 -2535 1112 3110 -4495 195 2280 -3395 2278 2031 -4017 1581 819 -2539 3707 -184 -4329
2813 -4329 3052 659 -1471 3388 -2818 -2596 4182 -1431 -1114 3140 -3628 -855 3661 -2138 593
2828 593 1573 -4225 2091 3280 -3312 1119 187 -2707 3728 570 -3718 2832 -477 -2398 3803 -974
2844i74j612N281m837J585M904p470J302M583m625L253Q58o700N062K622n871
2859b639M575j054m777O444j231l994N023l244k449P133l910j915M496m832J285
2874a089N389o518Q55L881n133L399K760o534L139J778m899N833n94o152N022
2889A137n97k582N357l544l734O613k445j842M713n657J90O026m815L50L353n534
2905c011K892L442n683L112J219n682N103J322n289M209j537l305O604k184m433
2920c221M824k484q36N598n094j547N350m091R59M028o180J402L980m563K902
2935A027J624o550M293K060m439L621j024m096N710j101l527M833k973k627N912
2950B743k864j496M327n089Q21N788n148l09L067m337L946J917o663L206K007
$$ plain form
2844 -974 -2586 2695 -2142 -557 4347 -3123 -1821 2762 -1863 1390 2248 -4452 610 3232 -2639
2859 -2639 1936 882 -3895 2549 1318 -2676 2347 -897 -3346 3787 -123 -2038 2458 -2374 -1089
2874 -1089 4300 -2218 -1363 2518 -2615 784 3544 -2990 149 1927 -2972 2861 2267 -3885 1137
2889 1137 540 -2042 3315 -229 -3963 2650 205 -1637 3076 -2581 -2391 3635 -1180 -830 2523 -3011
2905 -3011 -119 3323 -2360 752 1971 -3711 1392 2714 -2575 1634 97 -3208 3396 1212 -3221
2920 -3221 1603 -881 -1717 3881 -1213 -2760 2590 -1501 -542 3486 -2694 -1292 2688 -1875 1027
2935 1027 2651 -3899 394 2454 -1985 1636 612 -3484 2226 1125 -2402 2431 -542 -3169 2743
2950 2743 -121 -1617 2710 -2379 -1558 4230 -918 -1227 1840 -2497 1449 3366 -3297 -91 1916
2965A916m507M052J08m876M294o11l152N867l007l594N532k211p57M021n006j23
2981b054N517m374N50K940n127J974L476m976K618Q95m886M432J311m761L393
2996I28r32k845N870k099m020M921k200j460N276m490p26M256m119J211L625n172
3012a976R36L083l906K838J296n863L584J920m006L815j087m170N233n89l265
3027b157M532k987j960N640l241j286L894m235P43M441m661N21K922m579K931
3042E18K294n066K356J217l928M247n5m313L796o34k541M814k293l169M814k324
3058b67j004M170m436o63N008l739N12K339m669K577L018m797K116J194m188L814
3074I85R16m031L304p01l511N558j124l673M028k381r17M897l606j640L798l331
$$ plain form
2965 1916 -2591 1461 1569 -3307 987 376 -2776 3091 84 -3510 2022 -189 -946 3075 -1931 -2054
2981 -2054 3463 -911 -361 2579 -2548 -574 2902 -2074 544 1439 -3447 985 2296 -2465 928
2996 928 -4 -2849 3021 922 -3098 1823 -377 -1837 3439 -1051 -1777 2479 -1640 -429 3196 -1976
3012 -1976 -1040 2043 -1863 975 2271 -3592 -8 1912 -2094 1721 634 -3536 1697 1108 -2157
3027 -2157 2375 -612 -2572 3068 -173 -1459 2435 -1800 -1057 3384 -1277 -756 2166 -2413 518
3042 518 2812 -2254 102 1319 -2609 1638 1583 -2730 1066 432 -2109 2705 412 -2757 2057 -267
3058 -267 -1271 2899 -1537 -2200 2808 -931 -419 1920 -2749 -172 2846 -1951 165 1359 -2829 985
3074 985 1901 -2130 1174 473 -3038 2520 1396 -2277 1751 -630 -1547 3350 -256 -1896 1902 -1429
3090a429J128L161m864J108K840m238K861J777n408L307J425l393L450j307l710
3105c292M922k83l285L801k148j980M790k862r13L678m090Q3M425l599L1K453
3121A731m446K850K916n236J913J536l191L724m39m096L900n41k673M512k097
3136C63l012M413k052o50L704m170n41M089l034M59K390m086J403K999l963K145
3152D57J058m348L490R89l407K980q06l045M853r14l478L604k093r30M386l331
3168e35j149L477k872O98K898m311J129K555l845K560J547m646K586J444l445
3183a909L380m51m013M136n88k223L683k793j560M706k266j333L181l752P02L524
3199B424l697O44K299l783K336K339m263J764J335l506L265J93l900L333m06k291
$$ plain form
3090 -1429 -301 2860 -2004 -896 1944 -2294 567 2344 -3064 243 1668 -1725 1725 418 -3292
3105 -3292 1630 1347 -1938 1863 -285 -2265 2525 -337 -1250 2428 -1662 -1579 2846 -753 -722 1731
3121 1731 -2715 135 3051 -2185 -272 1264 -1927 1797 1358 -2738 1162 621 -2052 2460 363
3136 363 -2649 1764 -288 -938 2766 -1404 -1945 2144 -890 -431 1959 -2127 -724 2275 -1688 457
3152 457 1515 -2833 657 1646 -1761 1219 413 -2632 2221 1307 -2171 1433 -660 -1590 2796 -535
3168 -535 -1684 1793 -1079 -381 2517 -1794 -665 1890 -1955 605 2152 -2494 92 1536 -1909
3183 -1909 1471 1020 -2993 1143 555 -1668 2015 -778 -2338 2368 102 -1231 1950 -1802 -1100 2424
3199 2424 -1273 -629 1670 -2113 223 2562 -1701 63 1398 -2108 1157 1350 -2550 783 377 -1914
3215a914L957j449k888L823k260o12L908l393r96L744k615O70K211m563J851K937
3231B411l724J511J132l638L230Q77l688L065o00l081M030o09k587L031k171j359
3247b170M663k763j212L194k787N78L075l827N39K318l413K519J551m582K065
3262b52J272k631L149m78m003L729p5k452L502k280j295L904k377j034L438l267
3278a150o7L489l061M48K174l987K005K640m084J751P12l086L508J7l288K615
3294F36l21k038L733j517k481L545j976k45L180l302q08L383k419J35K366l698
3310a827J241K470l510K201R85l943K898J004l137K877p94k858L864n59k343K680
3326A249k093o81L966k664j202K842k142K31L040l716Q32K046l069J661J290l435
$$ plain form
3215 -1914 2043 594 -2294 1529 -731 -1343 2565 -828 -1824 1920 -695 -25 2186 -2377 -526 2411
3231 2411 -1313 198 1330 -2308 922 1799 -1889 1176 576 -2505 1525 916 -1671 1360 -811 -2170
3247 -2170 2493 -270 -1482 1712 -1075 -497 2578 -1249 -710 1608 -1805 714 2265 -2317 -252
3262 -252 1020 -1611 1538 1060 -2943 786 711 -1741 1761 -519 -1814 2090 -287 -1321 2117 -1150
3278 -1150 -1217 2272 -789 -341 1833 -2154 -149 2491 -1593 158 870 -2216 1292 1309 -1979 636
3294 636 315 -1723 2010 493 -1988 1557 -419 -664 2516 -786 -1594 1789 -630 -495 1871 -1827
3310 -1827 -586 1884 -1626 575 1560 -2383 515 1519 -1618 1259 465 -2393 1471 912 -1431 1249
3326 1249 -844 -1525 2441 -223 -1425 1417 -725 -494 2546 -1170 -338 1708 -1361 300 1590 -1845
3342a845K062R83k931L125j69l549L019k51j891L265j846k120L899j817p84K635
3358A785l058R4L130k656K77J879l374J760K183l244J270J053l170L067K85l196
3374a915K771m36k116L521j764j834L086j707q57L529k794o35K743k700J102J925
3390A919l789J001K309k610J588O25l124K484J116k900K281k32k747L439p46j954
3406a340K795j623j441L539k007j054K630k521K80K859l370L76K260l078J825
3421A30J582l523J913P76k518L114m00l086K735k31j525K819j997j612L730j799
3437A08j062K540k654r1K786k648M61K107l145J209K097k912J352P58k765K764
3453I05K08k751K513n90k009L302j022k033K799j853p49K958k372n16K423k158
$$ plain form
3342 -1845 217 1200 -1731 1394 1225 -2324 695 444 -1447 1818 -28 -2148 1751 -66 -850 1785
3358 1785 -1273 -1179 1951 -705 -428 1451 -1923 -163 2020 -1224 46 1099 -2071 996 1281 -1915
3374 -1915 856 420 -1696 1825 61 -1773 1313 -394 -1251 2278 -516 -1151 1592 -1108 -6 1919
3390 1919 -1870 -869 1440 -1170 418 1043 -2081 403 1519 -1381 900 668 -2079 1360 614 -1340
3406 -1340 1455 -168 -1609 1930 -77 -1131 1499 -1022 -742 2117 -1253 -877 1383 -1695 130
3421 130 1712 -1811 102 878 -1640 1474 1074 -2012 723 492 -1033 1786 -211 -1823 1907 108
3437 108 -954 1586 -1068 -1159 1627 -1021 -560 1547 -1598 -389 1708 -1204 148 906 -1859 905
3453 905 1113 -1638 875 285 -1724 1578 556 -1477 1322 -531 -1280 1678 -694 -1210 1213 -945
3469i45O15J938l051R03K308l086J574J251l258K155P09k336K328n32k350K874
3485A097k37k172K815j919j270L353j739p98K255k526N28K670k894J15K286k691
3501a127J284J498l229J459J274k665K376J89k780K500j59j901K777j323j956
3516a783K751r10j059K311k319k65K951k703P58J838k944R20J810k356J205N73
3532G78k402K208P61k715J885k31j758K766r15k128L023j415j257L163k322n48
3548a107K398k264L45K379l007K56K374k311J314J078l465K232Q74k368K008m18
3564C18k002K814o38j599K396j447j196K925j584q94K128k022K52K221k475K55
3580e48K031k724J090J540k644J331P19k458K418L02k660K139Lj972K726j192
$$ plain form
3469 -945 -330 1608 -1443 -540 1768 -1318 256 1507 -1751 404 1113 -1223 1105 573 -1777 1097
3485 1097 860 -1312 1503 -416 -1686 1667 -72 -870 1385 -1141 -613 2057 -837 -722 1564 -1127
3501 -1127 157 1655 -1574 -115 1159 -1506 870 1059 -1721 779 620 -1281 1496 173 -1783
3516 -1783 968 58 -1001 1310 -1009 -1274 1677 -1026 -268 1570 -1374 -454 1356 -1000 205 778
3532 778 -1624 584 1345 -1370 515 284 -1474 1292 377 -1751 1272 -143 -1400 1763 -559 -1107
3548 -1107 1291 -973 -628 1751 -1256 -1000 1374 -937 377 1455 -2010 222 1096 -1272 736 318
3564 318 -1684 1130 492 -1107 1289 -158 -1354 1571 -13 -907 1221 -801 -549 1672 -803 -548
3580 -548 1483 -1241 -151 1389 -1255 76 795 -1663 755 1057 -1603 536 539 -1433 1293 101
3596A01j976L020j121r09K255k156k63K442j914M7J917k796R33K111k801J078
3612c2Q98k683K240P02k304J798k02j978K731o71j881K245j184o17K497j764p25
3629i30K091j888L84J884k581N15J601k064J023J046k653J832P09k148K013l50
3645D84k096K505k53j672K240j153j401K463j040p07K085k334o5K556k296K95
3661c89J345j868J029J311k893J579P14k364K131L87k259K011k0k082K488q67
3677B53j378K367j171p85K118j946m57K277j845M5J975k670P68J809k496J339
3693B03P69k547J773P90k079J537k87j551K564n00k138K241r54r63K436j307q82
3710h95J868j697J91J901k180K95J532k141J541N40k289J150J053j693J635m26
$$ plain form
3596 101 -1875 1145 24 -885 1370 -786 -1049 1393 -521 -474 1443 -1353 -420 1691 -1110 -32
3612 -32 866 -1817 423 1125 -1179 619 417 -1561 1170 499 -1382 863 -321 -938 1559 -205 -930
3629 -930 1161 -727 -343 1541 -1040 -525 1076 -988 35 1081 -1572 260 969 -1179 834 484
3645 484 -1612 893 640 -1032 1208 55 -1346 1117 77 -630 1455 -879 -944 1612 -684 -389
3661 -389 956 -912 117 1428 -1465 114 828 -1536 595 982 -1277 734 714 -1368 1120 253
3677 253 -1125 1242 71 -714 1404 -542 -999 1278 -567 -522 1453 -1217 -449 1360 -1136 203
3693 203 972 -1575 198 988 -1091 446 159 -1392 1172 672 -1466 775 -179 -1142 1294 -13 -895
3710 -895 973 -724 -533 1368 -812 -517 1015 -1126 415 955 -1334 -184 869 -824 811 385
3726C85j836K266k70j384K147j209j413K457j102q68J889j940R2K144k058l4J644
3743I10k057R90J384k437J126J168k513J972M38k152J839l18j520K234o12j953
3759a501K298r29q76K454j748n68K101j850M19J319j966L91J812k050O81Q21j910
3776a102J310M35j489J436l59j714K338n87j398J738r03p23K312j419p38J836
3792I73j614Q0K016k001J12J405k152J492Q31k231J083Q68j716J664l11j708K057
3809H48k75j661J774n01j387J925p03q36J849j412l06J886j550qJ174j942Q92
3826b33J465k097O71Q59j696J274M98j838J621n5j500J987p85j244J765p59q04
3843h71K054j382o05K037j559j08J513j873M80J283j751R26R26k231J211P80j707
$$ plain form
3726 385 -1451 815 545 -839 1308 99 -1314 1143 41 -827 1062 -878 -786 1358 -700 -734 910
3743 910 -1147 -157 1227 -1210 -84 1084 -1429 543 981 -1171 668 350 -1170 1064 452 -1501
3759 -1501 797 -132 -1008 1446 -302 -870 1231 -619 -200 1119 -847 -456 1356 -694 -13 808 -1102
3776 -1102 208 643 -846 590 231 -1483 855 268 -1130 608 -295 -1018 1294 -125 -863 973
3792 973 -641 -561 1455 -546 -434 971 -1181 311 1142 -1089 -6 862 -854 810 499 -1209 848
3809 848 573 -1088 686 185 -1202 723 20 -816 1033 -379 -685 1201 -349 -357 817 -1125 -233
3826 -233 1232 -865 -194 665 -1031 243 741 -1097 524 469 -1031 956 171 -1073 692 -67 -871
3843 -871 1183 -199 -804 1233 -326 -434 1079 -794 -314 969 -782 144 1070 -1161 50 830 -877
3860h77J270m5j537J872k18j488J672q02n87J835j171p07J683j166k94J657j808
3877g11L77J401j814P65R76k043P71J150j786J550j01j454J221m4j145J602n86
3894A29q44J319n82n50J632j631m18K015j372j04J222j609M22J613k041N52Q56
3911F09j520J230O06j810J313j75j351J738k88j399J778o14q90J782j222m11J276
3928F52r97q8J372j661J57J437j312L42O39j472R52L96j214R31K01j399J556Q4
3946E76j362J199m85r24K120q93q30J346r44m00J516j140r3J132j419M41J121
3963I61j730O98N78j465J246J60j742J533K29j260J502o47q09J511n58p85J264
3980F86r80m63J532j092q8J327j640M14J072j226N39M37j447R93N80j481J261
$$ plain form
3860 -877 393 348 -1189 683 465 -1023 649 -153 -740 1095 -76 -783 900 -266 -560 1097 -711
3877 -711 -334 1067 -747 18 994 -1049 -278 872 -914 636 535 -919 302 258 -887 715 129
3894 129 -715 604 22 -528 1104 -527 -945 1070 -302 -406 816 -793 -371 1242 -799 -247 609
3911 609 -911 319 925 -885 428 253 -1098 640 352 -1047 731 117 -773 1009 -213 -624 652
3928 652 -345 -433 939 -722 -565 872 -440 -98 541 -931 21 417 -797 134 335 -1064 492 576
3946 576 -786 413 -72 -996 1124 231 -599 747 -197 -597 919 -221 -314 818 -601 -160 961
3963 961 -769 -71 507 -958 288 448 -1294 239 468 -792 710 63 -746 765 207 -578 686
3980 686 -294 -757 775 -317 -405 922 -718 -304 768 -458 81 518 -929 64 644 -837 424
3997D24j21j274J757k56j377J619o26q56J768j151o22J317o93l35J231j105l7
4014c37J073j317L86Q94j367P20N82j308J015M0j267J424j0j253J275n52j020
4031a022J794o70j040J493q77j4J129j001k05J153j311L39J161j498M09R07j487
4048g40J180J38j207J020J19r00R96k73j064J223m01p55J231p18q49J646p53m79
4066e86J275j402M23R35j016Q1Q84j478Q72P48j506J006K27j257R09K30q40Q52
4084C57l08p76J352o87n57J180p98r0J060j055k0R98j032J52Q53j339P28N58j099
4103e23P54J84j460J210K59r99J070m04j171J604k90r56J221o86k74J061q61k26
4121d87J129r59K29Q35j026K60M49j333J225J93j211R69Lp84J034l03r56J355
$$ plain form
3997 424 303 -971 786 530 -847 772 146 -710 1058 -93 -715 602 -91 -426 805 -300 -337
4014 -337 736 -581 -195 699 -668 52 634 -674 341 381 -886 538 528 -725 550 -2 -1022
4031 -1022 772 102 -938 555 -322 -336 793 -208 -413 740 -571 -232 929 -569 -160 747 -740
4048 -740 440 578 -629 391 510 -390 606 333 -731 492 91 -664 567 -151 -1000 646 -107 -586
4066 -586 689 -713 -290 645 -371 -290 594 -884 -12 736 -770 236 463 -794 115 345 -495 357
4084 357 49 -727 625 -62 -619 561 -237 -327 733 -322 -342 656 -376 -224 629 -710 18 576 -523
4103 -523 231 415 -1045 165 424 -575 495 91 -1080 524 234 -722 499 -187 -461 600 -261 -487
4121 -487 642 -317 -88 747 -279 -19 430 -903 322 515 -696 273 276 -508 526 223 -733 622
4139F22m95o44R97m40m15J046q46j11J014j138K4J119j061L31N60j192N17P80
4157F68j069N40L48j178Q78L13j066Q07j73o57J228k67j139J087m52k98Q75p13
4175b68l54J131p62R3P14q63L41M28j068O66O40j334O27M22r10R90l66j013J397
4194E11k66p11J044n17p16J697j026m44P92p50n6J178j287J50Q49q69N30O35j364
4213f20P99L7p45N16K90q75J051q8p90J009m42n54Q91n14m04R68n19m21P94l93
4233a0L9N21j179O14P45j236O35M13r86P57M45j287P12Q0n94O33j62o89R12k06
4253A57j024J574q53l93Q53o29r5R90q89k82J095p79J85Q05j328M76M89r47O05
4272A0L76j307J171P9r69R20O5q57J346r51k55J140p83k75P97o24k7O20q79M26
$$ plain form
4139 622 127 -517 480 40 -375 671 -175 -286 728 -410 -386 733 -328 3 563 -629 -112 668
4157 668 -401 139 487 -691 187 500 -566 241 68 -589 639 372 -767 320 -132 -430 445 -268
4175 -268 -622 509 -253 -160 554 -309 32 460 -608 58 698 -636 -9 413 -497 493 127 -886 511
4194 511 245 -466 578 61 -655 1042 16 -428 364 -386 -442 736 -551 -401 448 -421 109 744 -620
4213 -620 179 216 -529 -13 277 -598 453 365 -425 584 142 -412 479 -35 -439 529 10 -411 383 -10
4233 -10 29 550 -629 -15 730 -506 129 542 -444 313 758 -529 183 263 -331 302 140 -549 363 157
4253 157 -867 707 -146 -539 314 -315 -410 580 -309 -591 504 -275 -90 715 -613 -137 352 -595 10
4272 10 386 -921 250 329 -640 280 345 -512 834 -117 -372 768 -15 -290 507 -117 -144 476 -403 23
4292B3N62p17J48L66o97M75J63q54O01J78n70Q02n05m02R06l10n05R81o50o44
4312f49J219n61j28N61o69j9P50p84K81L75q68M79P43j017N60N9r54R88m5j022
4332g01R67l33n02J069n42l17O79l71j26Q35p93k55R95p83J13O18q90L02N78j259
4352g16P39L07j009Q80k7r59J170l00o69R40l24l61J017q23k16J172j184RQ15
4371D61r38L23R03j280L58O29q49O28L54r42O41Q7q63P94n9q81P85j7r19J064
4391B79m22m60J160p46o4Q76r68K55O41p80J58N82j164O80L61q08J77N01p70O81
$$ plain form
4292 23 585 -132 16 382 -315 160 323 -531 70 248 -322 480 -25 -427 479 169 -336 645 -5 -649
4312 -649 570 9 -119 442 -227 -246 504 -280 1 376 -492 -13 730 -287 273 332 -622 366 321 -701
4332 -701 266 -67 -569 500 -42 -359 320 -51 -177 658 -135 -390 605 -178 -65 553 -337 -35 543 -716
4352 -716 23 330 -679 201 174 -785 385 85 -584 356 32 -329 688 -135 -351 821 -363 -354 461
4371 461 -477 -154 749 -531 -173 456 -393 235 589 -353 288 375 -488 306 247 -634 151 134 -785 279
4391 279 -143 -603 557 -189 -253 623 -345 -90 551 -229 -71 511 -653 27 388 -420 -243 258 -512 169
$$ [...]
8191b61
##END NTUPLES=NMR FID
##END=
