##TITLE=1H_Pr 91
 CDCl3
 8 sc, 
 18.4.2023
##JCAMPDX= 6.0         $$ Bruker NMR JCAMP-DX V2.0
##DATA TYPE= NMR FID
##DATA CLASS= NTUPLES
##ORIGIN= UXNMR, Bruker Analytische Messtechnik GmbH
##OWNER= root
$$ XWIN-NMR		Version 3.5
$$ Tue Apr 18 14:01:16 2023 Russian Standard Time (UT+4h)  she@DPX200
##.OBSERVE FREQUENCY= 200.1315
##.OBSERVE NUCLEUS= ^1H
##.DELAY= (6, 6)
##.ACQUISITION MODE= SIMULTANEOUS
##.ACQUISITION SCHEME= undefined
##.AVERAGES= 8
##.DIGITISER RES= 18
##SPECTROMETER/DATA SYSTEM= spect
##.PULSE SEQUENCE= zg30
##.SOLVENT NAME= DMSO
##.SHIFT REFERENCE= (INTERNAL, DMSO, 0, 15.7039)
##AUDIT TRAIL= $$ (NUMBER, WHEN, WHO, WHERE, WHAT)
$$ ##TITLE= Audit trail, XWIN-NMR		Version 3.5
$$ ##JCAMPDX= 5.01
$$ ##ORIGIN= Bruker BioSpin GmbH
$$ ##OWNER= she
$$ F:/spectra/data/she/nmr/H-F/1/audita.txt
$$ ##AUDIT TRAIL=  $$ (NUMBER, WHEN, WHO, WHERE, WHAT)
(   1,<2023-04-18 14:00:05.18 +0400>,<she>,<DPX200>,
      <created by zg, POWCHK disabled, PULCHK disabled
       configuration hash MD5:
       00 E9 B6 7A A2 85 ED C7 34 08 36 98 17 FE 4E 26
       data hash MD5: 16K
       59 E4 80 E4 AB F0 0C 42 22 B1 AE 45 50 46 2D CD>)
$$ ##END=
$$ 
$$ hash MD5
$$ F5 CB EE E1 5E BE A7 9C FE 31 9C E7 63 5A F5 5C
##$RELAX= 
##$RELAX= 
##$RELAX= 
##$RELAX= 
##$RELAX= 
##$RELAX= 
$$ Bruker specific parameters
$$ --------------------------
##$DU= <F:/spectra>
##$EXPNO= 1
##$NAME= <H-F>
##$PROCNO= 1
##$TYPE= <nmr>
##$USER= <she>
##$AMP= (0..31)
100 100 100 100 100 100 100 100 100 100 100 100 100 100 100 100 100 100 
100 100 100 100 100 100 100 100 100 100 100 100 100 100 
##$AQSEQ= 0
##$AQ_mod= 1
##$AUNM= <au_zg>
##$AUTOPOS= <>
##$BF1= 200.13
##$BF2= 200.13
##$BF3= 200.13
##$BF4= 200.13
##$BF5= 200.13
##$BF6= 200.13
##$BF7= 200.13
##$BF8= 200.13
##$BYTORDA= 1
##$CFDGTYP= 0
##$CFRGTYP= 5
##$CHEMSTR= <none>
##$CNST= (0..31)
1 1 145 1 1 1 1 1 1 1 1 1 1 1 1 1 1 1 1 1 1 1 1 1 1 1 1 1 1 1 1 1 
##$CPDPRG= <>
##$CPDPRG1= <>
##$CPDPRG2= <>
##$CPDPRG3= <>
##$CPDPRG4= <mlev>
##$CPDPRG5= <mlev>
##$CPDPRG6= <mlev>
##$CPDPRG7= <mlev>
##$CPDPRG8= <mlev>
##$CPDPRGB= <>
##$CPDPRGT= <>
##$D= (0..31)
0 1.2 0 0 0 0 0 0 0 0.06 0 0.03 0 0 0 0 0.0002 0 0 0 0 0 0 0 0 0 0 0 0 
0 0 0 
##$DATE= 1681812004
##$DBL= (0..7)
120 120 120 120 120 120 120 120 
##$DBP= (0..7)
150 150 150 150 150 150 150 150 
##$DBP07= 0
##$DBPNAM0= <>
##$DBPNAM1= <>
##$DBPNAM2= <>
##$DBPNAM3= <>
##$DBPNAM4= <>
##$DBPNAM5= <>
##$DBPNAM6= <>
##$DBPNAM7= <>
##$DBPOAL= (0..7)
0.5 0.5 0.5 0.5 0.5 0.5 0.5 0.5 
##$DBPOFFS= (0..7)
0 0 0 0 0 0 0 0 
##$DE= 6
##$DECBNUC= <off>
##$DECIM= 32
##$DECNUC= <off>
##$DECSTAT= 4
##$DIGMOD= 1
##$DIGTYP= 9
##$DL= (0..7)
0 120 120 120 120 120 120 120 
##$DP= (0..7)
150 150 150 150 150 150 150 150 
##$DP07= 0
##$DPNAME0= <>
##$DPNAME1= <>
##$DPNAME2= <>
##$DPNAME3= <>
##$DPNAME4= <>
##$DPNAME5= <>
##$DPNAME6= <>
##$DPNAME7= <>
##$DPOAL= (0..7)
0.5 0.5 0.5 0.5 0.5 0.5 0.5 0.5 
##$DPOFFS= (0..7)
0 0 0 0 0 0 0 0 
##$DQDMODE= 0
##$DR= 18
##$DS= 0
##$DSLIST= <SSSSSSSSSSSSSSS>
##$DSPFIRM= 0
$$ [...]
##$SUBNAM2= <"">
##$SUBNAM3= <"">
##$SUBNAM4= <"">
##$SUBNAM5= <"">
##$SUBNAM6= <"">
##$SUBNAM7= <"">
##$SUBNAM8= <"">
##$SUBNAM9= <"">
##$SW= 18.0517148125397
##$SWIBOX= (0..15)
0 0 2 0 0 0 0 0 0 0 0 0 0 0 0 0 
##$SW_h= 3612.71676300578
##$TD= 16384
##$TD0= 1
##$TE= 0
##$TE2= 300
##$TE3= 300
##$TEG= 300
##$TL= (0..7)
0 120 120 120 120 120 120 120 
##$TP= (0..7)
150 150 150 150 150 150 150 150 
##$TP07= 0
##$TPNAME0= <>
##$TPNAME1= <>
##$TPNAME2= <>
##$TPNAME3= <>
##$TPNAME4= <>
##$TPNAME5= <>
##$TPNAME6= <>
##$TPNAME7= <>
##$TPOAL= (0..7)
0.5 0.5 0.5 0.5 0.5 0.5 0.5 0.5 
##$TPOFFS= (0..7)
0 0 0 0 0 0 0 0 
##$TUNHIN= 0
##$TUNHOUT= 0
##$TUNXOUT= 0
##$USERA1= <user>
##$USERA2= <user>
##$USERA3= <user>
##$USERA4= <user>
##$USERA5= <user>
##$V9= 5
##$VALIST= <valist>
##$VCLIST= <CCCCCCCCCCCCCCC>
##$VD= 0
##$VDLIST= <DDDDDDDDDDDDDDD>
##$VPLIST= <PPPPPPPPPPPPPPP>
##$VTLIST= <TTTTTTTTTTTTTTT>
##$WBST= 1024
##$WBSW= 4
##$XGAIN= (0..3)
0 0 0 0 
##$XL= 0
##$YL= 0
##$YMAX_a= 308953
##$YMIN_a= -423662
##$ZGOPTNS= <>
##$ZL1= 120
##$ZL2= 120
##$ZL3= 120
##$ZL4= 120
##$ABSF1= 10
##$ABSF2= 0
##$ABSG= 5
##$ABSL= 3
##$ALPHA= 0
##$AQORDER= 0
##$ASSFAC= 0
##$ASSFACI= 0
##$ASSFACX= 0
##$ASSWID= 0
##$AUNMP= <proc_1d>
##$AZFE= 0.1
##$AZFW= 0.1
##$BCFW= 1
##$BC_mod= 2
##$BYTORDP= 1
##$COROFFS= 0
##$CY= 11.3945322036743
##$DATMOD= 1
##$DC= 2
##$DFILT= <>
##$DTYPP= 0
##$F1P= 15.7292609196834
##$F2P= 12.9074282941183
##$FCOR= 0.5
##$FTSIZE= 0
##$FT_mod= 4
##$GAMMA= 1
##$GB= 0.15
##$INTBC= 1
##$INTSCL= 1
##$ISEN= 128
##$LB= 0.24
##$LEV0= 0
##$LPBIN= 0
##$MAXI= 10000
##$MC2= 0
##$MEAN= 0
##$ME_mod= 0
##$MI= 1.114404
##$NCOEF= 0
##$NC_proc= 0
##$NLEV= 6
##$NOISF1= 3.799351
##$NOISF2= 2.8
##$NSP= 1
##$NTH_PI= 0
##$NZP= 0
##$OFFSET= 15.70392
##$PC= 1
##$PHC0= -19827.15
##$PHC1= 7.80081
##$PH_mod= 1
##$PKNL= yes
##$PPARMOD= 0
##$PSCAL= 0
##$PSIGN= 0
##$REVERSE= no
##$SF= 200.130013532006
##$SI= 16384
##$SIGF1= 3
##$SIGF2= 2
##$SINO= 400
##$SIOLD= 16384
##$SREGLST= <1H.CDCl3>
##$SSB= 0
##$STSI= 0
##$STSR= 0
##$SW_p= 3612.71676300578
##$SYMM= 0
##$S_DEV= 0
##$TDeff= 0
##$TDoff= 0
##$TI= <>
##$TILT= no
##$TM1= 0
##$TM2= 0
##$TOPLEV= 0
##$USERP1= <user>
##$USERP2= <user>
##$USERP3= <user>
##$USERP4= <user>
##$USERP5= <user>
##$WDW= 1
##$XDIM= 8192
##$YMAX_p= 0
##$YMIN_p= 0
$$ End of Bruker specific parameters
$$ ---------------------------------
##NTUPLES= NMR FID
##VAR_NAME=  TIME,          FID/REAL,        FID/IMAG
##SYMBOL=    X,             R,               I
##VAR_TYPE=  INDEPENDENT,   DEPENDENT,       DEPENDENT
##VAR_FORM=  AFFN,          ASDF,            ASDF
##VAR_DIM=   8192,          8192,            8192
##UNITS=     SECONDS,       ARBITRARY UNITS, ARBITRARY UNITS
##FACTOR=    0.0002768,     1,               1
##FIRST=     0,             0,               0
##LAST=      2.2672688,     0,               0
##MIN=       0,             -423662,         0
##MAX=       2.2672688,     308953,          0
$$ Real data points
##PAGE= N=1
##DATA TABLE= (X++(R..R)), XYDATA
0@%%%%%%%%%Qj6J6k3L1l2M0n6P2q8J04j26J50j76K14k54K96l44M00m64N34o13
31c27P01p97R04j024J156j301J460j635J826k036K266k516K789l087L413l768
47a976M156m581N044n554O118o739P428q198R060j0033J1141j2416J3905j5666
61h311J7788k0411K3742k8135L4241m3384N8778r1359K78900k89994l30914N25109
73A26050L3689k19851L2006J34408j63454N7900j08060P8354K15811j9459m25162
84b57768Q9201L76152j11933j96949Q4823Q2598j44510N7250M0014K3904R461
95E2243r7989m8201J23556M5618j53900J32705J0217j80904K7876K28900j23265
106A6856j06154J49475n6147r5160R1828O3550r0773Q9882p3966j58172J81484
$$ plain form
0 0 0 0 0 0 0 0 0 0 0 8 -8 8 -15 16 -16 24 -32 40 -48 56 -70 80 -96 118 -136 160 -184 216 -248 286 -327
31 -327 374 -423 481 -543 613 -688 772 -863 963 -1073 1193 -1323 1466 -1621 1792 -1976
47 -1976 2180 -2401 2643 -2911 3207 -3532 3896 -4302 4758 -5275 5866 -6550 7355 -8311
61 -8311 9477 -10934 12808 -15327 18914 -24470 34308 -57051 221849 -68145 -399059 126050
73 126050 159739 -60112 -28106 106302 -57152 748 -107312 -28958 186853 167394 -257768
84 -257768 -168567 207585 95652 -101297 -16474 66124 -78386 -21136 18878 42782 52243
95 52243 -45746 -93947 29609 75227 -78673 54032 64249 -116655 -88779 140121 16856
106 16856 -89298 60177 4030 -91130 698 64248 -26525 63357 -10609 -168781 12703
117A2703J84962k35224j18777K53772o4190j70776J49273J45085j86375n9116
127h8663P2921r65O8412J9861j14715k3937J09277p6456K381J36914n5954j66503
139a17427O1724J22907l9738j4368j0536k0096o479J0476Q995Q6598j9077j76445
151a13466K9543J86071k9042j48625P5501N5645q6788j2085O5817J4907L499m5697
163d720r3798R7395J12919j16586q0969J39456M594j42955M4070J17720k4442
174E2684p2898j7956n019O3286M5598o2897l5381L6381j8496k4244Q0871J8097
186F0026p9594k8154K9252J5111L9609J1375p5124k5888M4465K3706N000O771
198B6555m6965j9317M5087p34j4939M0302l407p8797J1501O7298j790k8141K235
$$ plain form
117 12703 197665 -37559 -156336 97436 33246 -137530 11743 156828 -29547 -88663
127 -88663 -15742 -16707 51705 71566 -43149 -67086 42191 -34265 -31884 105030 49076 -117427
139 -117427 -55703 67204 27466 13098 2562 -17534 -24013 -13537 -4542 82056 62979 -113466
151 -113466 -83923 102148 73106 -75519 -18 55627 -31161 -43246 22571 37478 40977 -4720
163 -4720 -98518 -1123 111796 -4790 -85759 53697 58291 -84664 -40594 77126 52684
174 52684 -20214 -38170 -43189 20097 65695 2798 -32583 3798 -14698 -38942 41929 60026
186 60026 -19568 -47722 -18470 -3359 36250 47625 -27499 -53387 -8922 14784 19784 26555
198 26555 -20410 -39727 5360 4626 -10313 29989 26582 -52215 -40714 26584 24794 -3347 -1112
211a112j1909q495K3600l016P063K5487l4617n8884M6029O4364k9703l3858O942
224h109p999n856L6897J3192j6462k2573k4249J3670N5476N711n2521p435J4951
237e307n473J3237L1859j9591l6625J518J5447J9641J1969j8614k7650J1720Q496
250F27k836K0297Q162l4953j8603K5540J3038L693K517j7351k1254J2492J7799
263I168M623N612j5606k6502O492K8645K697l798n966k1174m967K7455J5083j3255
277H507r641r849m551J4434J6534m163r443j1711j1579J6260K5859n737k2995
290h075l027J396K167J5091Q591j4309j6407j768Q841J9336M115k0406j2781R313
304g923N661L679R722o385j7976j895J3223P680K437o417j0918n55P061L363L746
$$ plain form
211 -1112 -13021 -21516 2084 -932 6131 31618 -2999 -61883 -15854 48510 18807 -15051 -8109
224 -8109 -16108 -21964 14933 28125 11663 -10910 -35159 -21489 33987 39698 -12823 -20258 -5307
237 -5307 -10780 2457 34316 14725 -21900 -20382 -4935 14706 26675 8061 -19589 -7869 627
250 627 -2209 18088 26250 -8703 -27306 -1766 11272 14965 17482 131 -21123 -8631 9168
263 9168 13791 19403 3797 -22705 -16213 12432 15129 11331 5365 -15809 -20776 6679 21762 8507
277 8507 -1134 -10983 -15534 -1100 15434 11271 1828 -9883 -21462 -5202 20657 14920 -8075
290 -8075 -11102 -9706 -7539 7552 16143 1834 -14573 -16341 -7500 11836 15951 -4455 -17236 -7923
304 -7923 -2262 1417 11139 4754 -13222 -15117 -1894 5786 8223 1806 -9112 -9667 -2606 757 4503
319D503M437j0723j1242N230J1199L219O26n721j2408N5J1884R704J55r222j4034
334a2338K70J6260R936l644r806j0653k375J5766J4000n301j5018p805L370J2282
348D944R936n030j1600o467K521Q862R214k862j2442m352M614N728M105R77o940
363A208o327K53N510N525J656n094p448o56L279N118M409j974r510n085N408P919
379D191K346l361o895m696K675P141N389k280r411o200N179R966K703m832o788
394d873m218K896P922N016l707q057n095M335Q650L187m943o202k539K630O130
409A132M278l336p273k156M360N114J690k605m199j874K256M136K406j827l676
424a574j513K139K143J010L42n26k529k045J618M260J537k980l080k92J298K530
$$ plain form
319 4503 8940 -1783 -13025 -7795 3404 6623 7249 1528 -10880 -10825 1059 10763 10918 1696 -12338
334 -12338 -12068 4192 14128 10484 678 -9975 -12350 3416 17416 12115 -2903 -10708 -7338 4944
348 4944 14880 9850 -1750 -8217 -5696 3166 12380 9518 -2924 -7276 -2662 3066 7171 8148 1208
363 1208 -5119 -4866 644 6169 7825 2731 -4717 -5373 -2094 3024 7433 5459 -4051 -9136 -3728 4191
379 4191 6537 3176 -3719 -8415 -5740 1401 6790 4510 -4901 -11101 -5922 4044 6747 1915 -4873
394 -4873 -9091 -6195 1727 6743 3036 -5021 -10116 -5781 2869 6056 1113 -5089 -7628 -4998 1132
409 1132 5410 2074 -5199 -7355 -2995 2119 3809 1204 -2995 -4869 -2613 1523 3929 2102 -1574
424 -1574 -3087 -948 1195 2205 2547 2021 -508 -2553 -935 3325 4862 1882 -1198 -1490 -192 2338
440B338K498m31m701l556K768N935K326m194n253p59L942L802R3k142l071k595
456c000K327M953J279m291l823J014K638J473m37j089j666o5O2J316J295r43j432
473c89j893N93J562J197p2j018k321j016K182K293m1j419k352j530J753L247J017
490A793k613l801N52L252J729r37j786j208K51R21J583R72j122k595q14K528K593
507A298k02k591j281J450R47l38J104J081j717k326O30K873J635j624k505L9J918
524C91R83n6p73J79l40p01R28K429m73k632q89J425K029K98j366r80K75N32j6
543A243M84R9M44j418j637J781K173j267j659n77M98J548N38j278q96K33R8k0
561C87N74R49j183k452P73K679n74j633p89P93J003p5j668m38J375L66p16r58
$$ plain form
440 2338 4836 4405 -296 -3852 -1084 4851 7177 2983 -2270 -3029 913 4715 4808 2666 -405 -3000
456 -3000 -673 4280 5559 1268 -2555 -1541 1097 2570 2133 1044 -622 -687 -625 691 1986 1043 -389
473 -389 -2282 -1689 -127 1070 998 -20 -2341 -3357 -1175 1118 1077 -342 -2694 -4224 -2471 776 1793
490 1793 -820 -4621 -4069 -817 912 -25 -1811 -3019 -2768 -1847 -264 708 -414 -3009 -3823 -1295 1298
507 1298 1096 -1495 -2776 -1326 -379 -717 387 1468 -249 -2575 -1945 928 2563 939 -1566 -1527 391
524 391 1374 1318 545 724 384 -317 611 3040 2567 -65 -954 471 2500 2798 1432 452 727 1259 1243
543 1243 1727 1826 2270 852 -785 996 3169 1902 243 -334 164 1712 2250 972 76 309 407 387
561 387 961 1910 727 -1725 -952 1727 1153 -480 -1269 -476 527 452 -1216 -1654 -279 87 -629 -1587
579a587P77r0k51K6O07q75j110R86J689q17q79p26Q3J746J191j329j959q6J839
598g65Q90o19q19k88K82P58P67j171q8P30n51K5J587o95j270N10J333L63r92j067
618a080J649P48n10j074k5J066J110p87j056M10J42l80J003J101q84j536MJ405
636A306J046p95j486j89Q68J531k42j189n03N49N4M32N03p05j140q4Q09N99l29
655A035o79o10L85M35l3n3r75L80J7L5N5M52r88m60M06M38O5k68l47k28N2M12
677d74k55j66J52r4l07k27N26r0p5k08k85M29J24j06J68j05j70K10M73k46K47
698d79l71n15K76O98J88p6o53N7L16N06L85j72m91N2K69M62j3j17o32O49M97l32
720E04J32l3k87K4Q83q9k87j10J42K82j52l45J32J99j42J2N9j7l06LO85k62k35
$$ plain form
579 -1587 -810 -900 -1151 -1125 -518 -1393 -2503 -1517 172 -645 -1524 -2250 -2167 -421 770 -559 -2518 -2604 -765
598 -765 125 -494 -1313 -1601 -1319 -561 206 -965 -1053 -323 -874 -849 738 43 -1227 -717 616 979 -13 -1080
618 -1080 569 1317 807 -267 -292 774 1884 1097 41 451 593 213 1216 2317 1433 -103 -99 1306
636 1306 2352 1557 71 -118 750 2281 2039 850 347 896 950 1382 1885 1180 40 -44 765 1364 1035
655 1035 356 -254 131 566 533 480 -495 -115 -98 -63 -8 444 -544 -1004 -598 -160 -95 -363 -710 -938 -886 -474
677 -474 -729 -895 -743 -837 -1144 -1371 -845 -935 -1010 -1218 -1503 -1074 -950 -1056 -888 -993 -1163 -953 -480 -726 -479
698 -479 -850 -1365 -1089 -391 -203 -279 -932 -875 -559 -53 332 160 -331 -279 -10 452 439 322 -310 339 836 504
720 504 636 603 316 340 1223 1134 847 737 879 1161 1009 664 796 995 853 865 924 907 601 604 1289 1027 792
743G92m3P8L10o8o23l66M91M02l13l64r8o17K66P98K25p49r01J35M67N36j95n40
765c77p29L14L11K97k1o20j66J75L37K85k90l67l00k6K87O7J17l5k44o9J30P9
787h45L3J65O4o42k43R53K53o7j94n70K22L50O44p1r7j032J45J130O42j68j170
808d98j68K45J193M87o62p16l94L75Q92L84l58n71k94Q00L13L93l98n73k35M26
828F41L85L10l57o15k08K94N89J71J55p66o39L48oJ013k20o39n61L0N57K07M7
849G36m03o08j69N77L51P5r35m23LP33N36l94o21m61L62K48M09L05r79m41j16
870a215K77N27N03n47p48l36O87N32p1m02l98n1M54L39K29k88o29l03Q09O15O8
891E2o25j05p2N00J15MN0l24k4K14N28k06P0j97m3Q3N8M60K8l7l93l07P13K14
$$ plain form
743 792 749 827 1137 1069 446 80 571 973 660 296 198 -419 -153 645 870 121 -780 -645 -178 358 163 -377
765 -377 -1106 -792 -481 -184 -205 -825 -991 -816 -479 -194 -484 -851 -1151 -1177 -890 -823 -706 -741 -985 -1054 -924 -845
787 -845 -812 -647 -583 -1225 -1468 -515 -262 -329 -523 -1093 -871 -521 123 52 -45 -1077 -932 198 840 672 -498
808 -498 -666 -421 772 1259 597 -119 -513 -138 754 1138 780 209 -85 715 1028 1421 1023 450 215 641
828 641 1026 1336 979 364 156 450 1039 1210 1365 599 -40 308 302 1315 1095 456 -105 -75 482 689 736
849 736 333 -275 -444 133 484 559 -376 -799 -796 -63 473 79 -542 -1003 -641 -393 16 321 -658 -1099 -1215
870 -1215 -938 -411 92 -455 -1203 -1539 -852 -320 -391 -793 -1191 -1242 -788 -449 -220 -508 -1137 -1440 -631 -16 52
891 52 -573 -678 -750 -250 -135 -131 -81 -405 -429 -215 313 107 177 -20 -63 20 78 538 566 529 136 -171 542 756
915G56N19p87q04M35L37R41l16m63l57J71O11K33m43l35l54M0N30M47m73k76k26
936A86r9O43J96n54l51K30Q5k55K24K61P6p95k10K89o2N79l76l95l7p3M18J30
958A10j2r50j38J73Q61p5k47n80l65L90O99K66o54n65J5O04J19j94N8l18k56K24
980h35P40j59l40j31J80jK82R3n49L21J84k27Q6O65k33o30J62M09K08J21n8Qm47
1003a51J65M42p5M3J13k62n7M53nl48o2K64J4J4r8K29ml71K25M7l50M56J52p04
1027A30J14O23k31K6j28k22m47M94N8J94l06j04l14J40J99j8l79k11O71j59k58
1048a28K89k84k75L67j76k69J7l9J35K82m70j7j42L11M3K07p58J33M2K32J36j80
1070e44n4j26L22J39J3l76J42J64m88M71M13m43o7M22m52Q6L49K1k98K86j86j44
$$ plain form
915 756 1275 488 -316 119 456 1397 1081 618 261 432 1043 1276 833 498 144 184 714 1161 688 412 186
936 186 87 730 926 372 21 251 336 81 305 566 642 -153 -363 -74 -136 443 67 -328 -365 -438 -20 110
958 110 98 -852 -990 -817 44 -31 -278 -858 -1223 -833 -134 132 -522 -1087 -1072 -468 -349 -543 -485 -803 -1059 -835
980 -835 -95 -254 -594 -725 -545 -546 -264 -171 -720 -399 -215 -442 -356 309 76 -554 -392 17 225 346 288 296 -151
1003 -151 14 456 381 424 537 275 218 671 666 318 256 520 534 548 450 679 675 304 529 576 226 682 834 130
1027 130 244 867 636 662 534 312 -135 359 417 611 305 201 -113 27 226 208 -171 -382 289 130 -128
1048 -128 161 -123 -398 -31 -207 -476 -459 -498 -363 -81 -551 -568 -710 -399 -356 -149 -907 -774 -732 -500 -364 -544
1070 -544 -598 -724 -402 -263 -250 -626 -484 -320 -808 -337 76 -367 -434 -12 -464 -378 -29 -8 -306 -20 -206 -350
1092c50K29N97l66k27p2N31K30l6j02l39L3M0K39k04L85l21K94j42k7J45p4j90
1114B73J38n7J43J61L00l44k53l50K06J96N02l22n39j85L89L26l9l36l71jM83
1135C20K06p9o89Q3K4J64K62k22k73P4k41n8L71k1Qk93O7k05m5M56J50l92k15
1158e48j48M35L45j39n94l80K22O65L19r5p01m38N13L72L12m61l79k33P47JK67
1179H2k3l54m06L53N92m16J71j11o4j14L55L9K31J29o11l3J1R05M5m30l88l97
1201d34R09M68K78p37o38j89O51Q93j58n24q74R1O62P18k94m58l76j24O17M77
1221I58k79o17J00j29J58K12j75r2l05j48J93o2P90k48l28o06J50O04M71m1p20
1242a14p96N61L81M00j04r06n70N18P83L79n95o99j90L85Q33m05J10p55Q5L60
$$ plain form
1092 -350 -121 476 110 -117 -189 342 572 536 434 95 128 168 407 203 588 267 561 419 392 537 463 273
1114 273 411 354 497 658 958 614 361 11 217 413 915 593 54 -131 258 584 545 209 -162 -163 320
1135 320 526 447 -242 -159 -135 29 291 69 -204 -130 -371 -429 -58 -79 -71 -364 -297 -502 -547 -91 59 -333 -548
1158 -548 -696 -261 84 -55 -649 -1029 -807 -142 177 82 -619 -1057 -544 -172 140 -321 -700 -933 -186 -185 82
1179 82 59 -295 -701 -348 244 -172 -1 -112 -176 -290 65 104 335 464 -147 -180 -169 736 781 351 -37 -434
1201 -434 475 943 1221 484 -154 -343 308 1201 1043 519 -355 -264 398 1116 822 364 -12 -136 481 958
1221 958 679 62 162 33 191 403 228 136 -169 -317 -124 -186 604 356 28 -578 -428 176 647 606 -114
1242 -114 -910 -349 32 432 328 -578 -1148 -630 153 532 -63 -762 -952 -567 266 -139 -29 -784 -699 -339
1262c39jL25k28r7l08P6K28M79L2L8q35j23N35N38L28m99o23l77O42J206k73o70
1284E4j074MJ098R04l50n42q00J99J093K3N7r02r5J86P40K14r4n43j75r4L06K43
1306D52J93k27k31l26R3L20M69q2m93n05J72L91P00k84q04n86O06O51N01m33j107
1327e30m36N73Q84Q3m00r64OP58L43J39n84l74j53M85K79J20j67n64jrkO54R6
1350B36m97m67q1N44O08N2n61p63J43M57Q18q6p05q79L30Q16Q05%j237k56J31
1371e92O01M29rq71n1K38K96M20k86j81j75o5K78L26N0n8j8m67J15M34O48l45
1393G17o08m92L4R47L87q2r30l36J85P69M95o29r77K5M75P33L93r60n06j20Q06
1414C26K80j2m01m77J14j50O56J64n09j96l56M16L96Q3p1j28m81l51P08L85P9
$$ plain form
1262 -339 -340 -15 -243 -340 -648 -572 -344 135 167 205 -630 -753 -218 320 648 149 -474 -851 -209 997 724 54
1284 54 -1020 -1016 82 986 636 94 -706 -507 586 609 666 -236 -331 -145 595 809 715 172 -3 -97 209 452
1306 452 645 418 187 -139 -46 274 743 661 168 -337 -165 226 926 642 -162 -748 -142 509 1010 577 -530
1327 -530 -966 -393 491 574 174 -790 -784 -26 317 456 -128 -502 -655 -170 109 229 62 -502 -503 -512 -514 140 236
1350 236 -261 -728 -809 -265 343 395 -166 -929 -786 -329 489 403 -302 -1181 -851 -35 770 770 -467 -723 -592
1371 -592 9 438 429 -442 -493 -255 41 461 175 -6 -181 -246 32 358 408 350 332 -135 -20 414 1062 717
1393 717 109 -383 -349 598 985 903 -27 -363 -178 591 1086 457 -520 -495 -20 713 1106 146 -360 -480 326
1414 326 606 594 193 -284 -170 -320 336 500 -9 -205 -561 -145 251 334 263 135 -346 -697 11 396 475
1435D75p07o95K40Q51J47J90j039j66K1M26Q19j92p30l57L01L13L51J95n69o47
1455g73L70L54L82P8o99j51R0J07M57P6k14l21k1O2O14J84k31o47k35M33L48M00
1477F63m61m70l47M17O32J22m26l50r1K32Q28kn87k42n8L76M50n0n94j18m34K21
1499b89O92K10j06o12l37N47O0J70N6l62l35K67L33J00N9n23l71L74L73O6Jl43
1521C0n33M7M92N72m8o48n97L04N48K80P3o83l11N8M66K53J7l32n77R4L31M92
1543C28l59j90r7k31K93Q21j82p22k91J43M57J39J69o03R3k05L79M74k39m04l04
1564e31J13K00M46J45j34j40l21J25L23J84j88l73j33K02N08K4j87n11j60M48
1584D0J51K76n1l86m85M99M8N02k34m98j9K57J83K91m8n51j91L5L46K18m8l45
$$ plain form
1435 475 -232 -927 -687 164 311 501 -538 -704 -683 -257 562 370 -360 -717 -416 -103 248 443 -126 -773
1455 -773 -403 -49 333 411 -288 -439 -349 -242 215 291 77 -244 -265 -203 411 595 364 -283 -518 -85 263 663
1477 663 202 -268 -615 -198 434 556 130 -220 -311 -79 749 747 160 -82 -140 236 686 636 42 -76 -510 -289
1499 -289 403 613 507 -105 -442 105 165 335 391 29 -306 -39 294 394 453 -70 -441 -67 306 372 373 30
1521 30 -503 -456 36 608 560 -88 -685 -381 167 447 520 -163 -474 -416 50 303 320 -12 -589 -495 -164 328
1543 328 -31 -221 -318 -549 -256 565 383 -339 -630 -487 -30 109 278 -325 -232 -437 -58 416 177 -227 -531
1564 -531 -418 -218 228 373 239 99 -222 -97 226 410 222 -151 -284 -82 426 450 263 -248 -408 40
1584 40 191 467 416 30 -455 44 92 594 360 -138 -157 100 283 574 526 -25 -216 -181 165 383 335 -10
1606a0k30J6L56L27j35m73j87J40K20L95j96j53m49j00N49M9K26n25l18J06M61
1627F9Q9m3k82k28j66M28K47j36q7k71j1L29K19k43j33K41m16L81J1J69j47j21
1649a01k49KN13j27J48l26m55N53K39M81m98k07j48L4L94J73o9p18K65K00Q9J08
1671C01p9o35J86L94j16K97l13p1j22J85j10L62N7k45K7l96L40K59j60M7n05j26
1693d23M41J02J77l81j17J11L17n7M2j57j84k38M25Q8K6l24j79M84J21j11l44
1714a81Q4J96l24j02N7L9K96k1m51K92j46M07K26l23k13q4R5N60j56m01k98K0
1736d28N24M6l5k73k1K41J81J65l12j71L9j73K96J53j36Jk77L16RJ98k15K4K07
1759C59m67K40p1J03j63m4J14o8K82J27N8n93j61L86J46J26l22l39J79J51r4K91
$$ plain form
1606 -10 -240 -224 132 459 324 -149 -336 -196 24 419 223 70 -379 -479 70 119 345 -180 -498 -392 69
1627 69 158 115 -167 -395 -561 -133 114 -22 -109 -380 -391 -62 157 -86 -219 22 -394 -13 -2 167 20 -101
1649 -101 -350 -348 165 38 186 -140 -595 -42 197 678 180 -27 -175 -141 253 426 357 -361 -96 104 193 301
1671 301 222 -413 -227 167 51 348 35 -36 -158 27 -83 279 336 91 118 -278 62 321 161 208 -297 -423
1693 -423 18 120 297 -84 -201 -90 227 170 212 55 -129 -367 58 146 172 -152 -331 153 274 163 -181
1714 -181 -97 99 -225 -327 -270 -231 65 44 -407 -115 -261 146 372 49 -164 -248 -153 407 251 -150 -448 -428
1736 -428 96 142 107 -166 -187 54 235 400 88 -83 -44 -217 79 232 96 97 -180 136 145 343 128 152 359
1759 359 -108 132 61 164 1 -43 71 3 285 412 470 -123 -284 102 248 374 52 -287 -108 43 -51 240
1781B40p1k04n2J95k88L93j90n3KlJ91q5p5J50k47J5Q4jL72j87l70M3J5K00j57
1806h3J87j97m0J16M8Ojj93pr7N24k14k88K72k14M4K63j45k63K04k47N92l26N6
1830cM9j08J39Nj65J24R0l52L07m08M21r2K79l40m3n3N2L03J76l08k29K6J34J27
1854A31j82J17l05J05L2J64o3J21j92J02n6j7J51J6K4J7n2oJ00k17K0k47J80K67
1878B10j82K92m84L8j61K81R7j10k78K21J06J13k9J02J6l32N5K87k50N5o1oJ07
1901H7q3o2J03J84m61M0J87l3J82j45k60J88k48J83L19j93P7k67J12NJ13K60l90
1924a02k5O1J18J22J9l37P2j45L31p5P7j52l79L33K31j06j5j05j63K91R6K04k98
1947E3j09J26j3j74K61mj68n1K68q1J72j87j09n8kK67J3j24k63J65j13J26J69
$$ plain form
1781 240 169 -35 -87 108 -180 213 23 -30 -28 -31 160 75 0 150 -97 -82 2 1 373 186 -184 -141 -126 74 -83
1806 -83 104 -93 -133 -17 31 37 36 -157 -164 -261 263 49 -239 33 -181 -137 126 -19 -282 -78 -325 267 -59 -3
1830 -3 46 -62 77 82 -83 41 131 -221 86 -322 99 7 286 -54 -97 -150 -98 205 381 73 -156 -130 4 131
1854 131 -51 66 -239 -134 -102 62 -1 120 -72 30 -26 -43 108 124 148 165 113 107 207 -10 10 -237 -57 210
1878 210 28 320 -164 -126 -287 -6 91 -19 -297 -76 30 143 114 216 232 -100 -45 242 -8 47 -14 -20 87
1901 87 4 -58 45 229 -232 -192 -5 -38 144 -1 -261 -73 -321 -138 181 -12 65 -202 -90 -85 28 288 -102
1924 -102 -127 -66 52 174 193 -144 -72 -217 114 39 116 -36 -415 -82 149 43 28 -77 -240 51 147 351 53
1947 53 -56 70 57 -117 144 140 -28 -79 189 108 280 93 -16 -74 -76 191 204 80 -183 -18 -131 -5 164
1970A64J7l87K44k81m6M05m3l49M21k27J1l0J79q9l2n0j66J39m4K19l07Rm6J20
1994a69K56m7j96n1P3J24K7J99m50j58M39R4O3J07n24K15k53L88K1j55j74j52
2016c23J79J6M3L4J35n8R3j97J27K30l80J42k08j05K97J31l36K11j72K52n5K73
2038C29n3l63l19M01L87r8m4j20k51J87p8J88R6k34m6k21M08J3j8J4k08J3j38
2061a55N6N09l89j18J7k63N21q1j30k17k1o1M34L5j54k86J11Q2M53l04l7m99J73
2084c24M10J03r9k92J28R4j60L21p9m93J17J88p7J26N1j17Q0j49K46j10j5o5J54
2107C8j24KJ71j00P3N7j51n4N1N7J08k15j09K11N0J62J81m61j01R9R5l7J76l28
2131a49R5J74j13K68k15L5l24K65K4J53l66L00p4j25o6K40j89J07Mk38J84J65
$$ plain form
1970 164 181 -206 38 -243 -289 116 73 -276 145 -82 -71 -101 78 -11 -43 -93 -259 -120 -164 55 -252 -243 -289 -169
1994 -169 87 40 -156 -207 -134 -10 17 216 -234 -392 47 141 204 311 -213 2 -251 137 158 3 -171 -323
2016 -323 -144 -128 -85 -51 84 26 119 -78 49 279 -101 41 -167 -272 25 156 -180 31 -141 111 56 329
2038 329 276 -87 -406 -5 382 284 240 120 -131 56 -22 166 262 28 -18 -239 169 182 164 178 -30 -17 -155
2061 -155 -99 410 21 -97 -80 -343 178 97 -33 -250 -271 -332 102 137 -17 -303 -192 -110 343 39 2 -497 -324
2084 -324 86 189 90 -202 -74 20 -140 181 102 -391 -274 -86 -163 -37 14 -103 -23 -172 74 -36 -51 -116 38
2107 38 -86 -84 87 -13 60 117 -34 -88 -37 20 128 -87 -196 15 65 227 408 -53 -154 -55 40 3 179 -149
2131 -149 -54 120 7 275 60 95 -229 36 60 213 -153 147 73 -52 -118 122 -67 40 44 -194 -10 155
2153A55k34L87k51k02N9J55J01j21n0j56Q7K9L37n00J75l88K82J37M2J45n22L7
2175b96K23K14j80J08q6k23Po7K12N0K63l42k83L82J69o7p8m51L75j99L57L8k5
2198A01j45l60K30K74K46o44j23K47J54K14J24l73m6J40O4k6J32n8k02q5J03N9
2220B6J0J57J04n44j2M37O3j55j53J89p0o5K65p6j12n2j75J38l1K44J55l01k41
2243a99K23J92j00j00p9J28k38N2L85j91k17L64j83p2J54k80J80j11k32M71qp6
2265F3j97m53L76LL17K2k60r8J70qJ76M8k66j37j72L12K40L5m19k7P0J00L18k21
2289hp4M3L5p4M01j54k12N4R8Q7l80M35k56O0K21l02K6J95j09j00j68J87J12O3
2313A80j4k17J52p3R7K02J41o11PQ7N12j90j77j94J56p5K2J57J6k78l0L06l70
$$ plain form
2153 155 -79 308 57 -145 -86 69 170 49 -1 -157 -70 -41 296 -204 -29 -417 -135 2 44 189 -333 -296
2175 -296 -73 141 -39 69 -17 -240 -233 -300 -88 -38 225 -117 -400 -18 151 84 6 -445 -70 -269 88 126 101
2198 101 -44 -404 -174 100 346 -298 -421 -174 -20 194 318 -55 -101 39 103 77 209 151 -51 -136 -33 26
2220 26 36 193 297 -247 -259 178 241 86 -67 122 52 -13 252 176 64 12 -163 -25 -56 188 343 42 -199
2243 -199 24 216 116 16 -63 65 -173 -121 264 73 -144 220 37 -35 119 -161 19 -92 -324 147 139 63
2265 63 -134 -587 -211 -208 109 131 -129 -227 -57 -65 111 159 -107 -244 -416 -104 136 171 -248 -275 -205 -105 213 -8
2289 -8 -82 -39 -4 -78 323 169 -43 11 109 196 -184 251 -5 55 276 -26 0 195 86 -14 -182 5 117 180
2313 180 166 -51 101 28 125 327 468 -143 -136 -49 463 273 96 -98 58 -17 5 162 178 -100 -130 176 -194
2336a94L74k10M7q0K04j28K48l41M4k28K97k44M13q9k66O2j28J89J76%j96p0k97
2359d17L60K50j44j14j46j26J21L48o7K3j69m31M49m7j02RJ5m7j6P1M76j05n68
2382c77K15P3J66K90j78m91Q8J69J33J49K8l22j24J50J14L89k96j35r2QL30R3
2404C80m34L37k61p2J71J90P7l10nk29K58j34M60k60m03J03K66p2L42j78o4l36
2426a74J94L15l85P1p2k14K24o4J62l2j30J63l6p4K57K21n65n8K17J06n5k5l84
2449c38Q9m6K23J20kk10q0o7M59P9k55nk06J26n1K07m4j18j80K72J12o3Mr5l23
2474c92N2J67K70r1J6n19L42K68l60M92k89k10N7KL52M0k4k15j20K44j15J98J52
2497C17k89k02J64J46K02J7k34j81q8K40L76j94j41l3OK58O2j60k30j15R8M8M44
$$ plain form
2336 -194 180 -30 17 -63 141 13 261 -80 -36 -264 33 -211 202 113 -153 -91 -219 -30 146 146 -50 -120 -417
2359 -417 -57 193 49 -65 -211 -337 -216 132 65 88 -81 -512 -63 -110 -212 -203 -188 -235 -251 -180 296 191 -377
2382 -377 -162 -89 77 367 189 -302 -214 -45 88 237 265 -57 -181 -31 83 472 176 41 -51 -43 287 380
2404 380 -54 283 22 -50 121 311 388 78 73 -156 102 -32 428 168 -235 -132 134 62 404 226 162 -174
2426 -174 20 335 -50 21 -51 -265 -41 -105 57 25 -105 58 22 -52 205 426 -139 -197 20 126 71 46 -338
2449 -338 -249 -295 -72 48 46 -164 -244 -311 148 227 -28 -33 -239 -113 -164 43 -1 -119 -299 -27 85 22 26 -69 -392
2474 -392 -340 -173 97 6 22 -497 -155 113 -247 245 -44 -254 -197 -195 157 197 173 -42 -162 82 -33 165 317
2497 317 28 -174 -10 136 338 355 121 -60 -148 92 468 274 133 100 106 364 426 266 36 -79 19 67 511
2520E11j87j07j57l29K63J51J81k49k48P4K10K49j31j94l36K04J00l6L3j10n8
2541a66k8K49O6j67K51l16j60K31K00l84L27k18qr2K04J35l82K47k30p4K55L44
2563B84l22j02j36J82Q3O7L5m5k80N6J39K94j50j79L5J71j14o1j8j10J44m4j8
2586h9N4J01l21L41r8O1j15K94n4l81J52J46K66r9Q4l86J14M6NJ37p7L8n01M03
2610A21L12j99k62p2L9L85Jl6l8l66J78j07K86l1j01k6k94P9K10o6N8K0j07j62
2634a78K62J82l79R5pk36K07L90k64r2j24j68K29J17O9Q0j96k46j01L73k90L80
2656A03k65n4j20K88j15K44k13J90j6J4Q8k58k2O7j27J11M1r3r6l2J84J96j95
2679h0j29P8J51r3L81k11j0k74J19J17J42R5k57L6r4j16J39K33j00o6k7L9J46
$$ plain form
2520 511 324 217 60 -269 -6 145 326 77 -171 -97 113 362 231 37 -299 -95 5 -31 2 -108 -166
2541 -166 -194 55 121 -46 205 -111 -271 -40 160 -224 103 -115 -123 -215 -11 124 -258 -11 -241 -315 -60 284
2563 284 -38 -140 -276 -94 -11 56 91 46 -234 -178 -39 255 105 -74 -39 132 18 -43 -61 -171 -27 -71 -89
2586 -89 -35 66 -255 86 -12 49 -66 228 174 -207 -55 91 357 258 342 -44 70 116 121 258 181 219 -282 121
2610 121 433 234 -28 -100 -61 324 325 289 251 -115 63 -44 242 211 110 84 -210 -131 79 13 71 91 -16 -178
2634 -178 84 266 -113 -18 -25 -261 -54 336 72 -20 -144 -312 -83 34 103 183 -13 -259 -360 13 -277 103
2656 103 -162 -216 -336 -48 -163 81 -132 58 42 56 144 -114 -136 -69 -196 -85 -44 -137 -233 -265 -81 115 -80
2679 -80 -209 -131 20 -73 308 97 87 -187 -68 49 191 286 29 65 -29 -145 -6 227 127 61 34 73 219
2702B19Q6j92j51j8N0o5L22m3k86j55M32j49J54q1O0l34ON57k50j75j0Q5J45k82
2726g5j8K91k85k21R4J32N1j5k53K66j34k7K80j17J79m42n9L24J23j23J58j8k27
2749a16j12J75P0q8K6j47O9q5K44l29L09m3l01J48K31J15m0j00j81j29O2K62k
2772C8L3l15O2K52K4j55k08J99j7J33M4K35n32K91l13M37p5j20n4Q0J51k62K09
2795A37p5Q5j37K11j75N1O7J17k27k43L68k14K91l87J15M6R2R7J5m5j94N4j83
2818a34K8K83k14r9J47P1j25L5N7j30qj60M54k59r2p5J41k24K41J48j47j35k0
2841b17K03j95K19j65K53k96j50K75J59j23K9j15K0j04J49J9j74J57rjK39j61
2863A2j2L9j55l9m7L21Mj67J01j62j17L73j69J8L6J9j95L29m4k91R0J5m1M55j24
$$ plain form
2702 219 305 113 -38 -56 -6 -71 251 208 -78 -233 199 50 204 123 183 -151 -145 412 162 -13 -23 62 207 -75
2726 -75 -93 198 -87 -308 -214 -82 -31 -46 -299 -33 -167 -194 86 -31 148 -294 -353 -29 94 -29 129 111 -116
2749 -116 -228 -53 17 -71 -45 -192 -123 -208 36 -293 16 -27 -328 -180 51 166 126 26 -155 -284 -222 40 38
2772 38 71 -244 -182 70 94 -61 -269 -70 -87 46 90 325 -207 84 -229 208 133 13 -41 39 190 -72 137
2795 137 62 147 10 221 46 97 164 281 54 -189 179 -35 256 -131 -16 30 122 219 234 189 -5 49 -134
2818 -134 -106 177 -37 -136 11 82 -43 -8 49 -81 -89 -249 205 -54 -146 -221 -80 -304 -63 85 -62 -197 -217
2841 -217 -14 -209 10 -155 98 -198 -348 -73 86 -37 -8 -123 -103 -207 -58 -39 -213 -56 -65 -66 173 12
2863 12 0 39 -116 -155 -202 119 123 -44 57 -105 -222 151 -18 0 36 55 -140 189 145 -146 -56 -41 -82 373 249
2888B49l05Q8J68k08L4J83l9j09O7j07J19lj56J87j24k46M69j78P3k20K3J50o1
2911E4K02j91k07J07J89j01JJ46k95rN3J15K01j81j68L1K94J5l92L46l23j27J84
2934e6n0N7p7K14k42n1J9n2O6r0K61j8j3l7J15o6p1l31J43J14L04kk21Q8m3k9
2960f8L8M31l94m12K64K51j42M4K75l83N4J06Nj45M56l93m4o5K36m4J32j81j77
2983a56J36M5l6J08MRk8K0n9l7J13L5j69P7k9K34k39j5k17K58J80l01J16j43L06
3008B12j00J12m1j44J23j79j18N16k69o4j07k19K87L4j0O9k64J2L08r2o8q7k02
3031b91J62P2J96r9k57j17M83J4n7k71J9l1L8J78k12J77q3j00K10k93JL38pj94
3055a24J8J05k11m0L34O6k71m7j10K03L7M6j19J20J66j21J21l79L44j69R0K84
$$ plain form
2888 249 -56 32 200 -8 26 209 170 61 128 21 140 137 -19 168 44 -202 267 89 162 -58 -35 115 54
2911 54 256 65 -142 -35 154 53 54 200 -95 -104 -51 64 265 84 -84 -53 241 256 -136 210 -113 -240 -56
2934 -56 -106 -49 -126 88 -154 -205 -186 -238 -172 -262 -1 -19 -32 -69 46 -20 -91 -422 -279 -165 139 137 -84 4 -39 -68
2960 -68 -30 401 7 -405 -141 110 -32 12 287 -96 -42 64 69 -76 380 -13 -57 -122 114 70 202 21 -156
2983 -156 -20 25 -11 97 101 110 82 102 43 6 119 154 -15 62 33 267 28 13 -204 54 234 -67 49 -94 212
3008 212 112 224 183 39 162 -17 -135 381 112 48 -59 -278 9 43 33 102 -162 -150 158 66 -2 -89 -291
3031 -291 -129 -57 139 40 -217 -334 149 163 106 -165 -146 -177 -139 39 -173 4 -79 -179 31 -262 -261 77 70 -124
3055 -124 -106 -1 -212 -252 82 148 -123 -170 -280 -77 -40 6 -113 7 173 52 173 -206 138 -31 59 343
3077C43l25j9J48k05J83J69k91k3J99k5MPj67M00m77J59n6r2K29K01m82j29K24
3100b5J89r3J40l77k17N13K4Q7m4l24lK14j12J25k23J9n9J34n6J80k14R6q6j1
3124a23J30p6M0J42k04J64R2n7L20n28J68P5l63K33Or0j40k42L80K03j43k87J5
3147b85L13l25M74Jk15p4k2J05j21K82Q4q1k66M9J94j21%R5j81J48J28l93L21
3170A10j37R3N2R7j04n2RK2k82M88j32j2J53j70k92p2K65J44j74p8p2QK31l8J32
3195A89j50M8m6K05m22J60mL2j19l3K44J9M1k63J22N2j4QJ07j55l99L79P4R2j21
3220D6j39N6k1K55n2k59q3J53j0K31k86j7J01o6L5K69k71L5r2j5J32p5q3K86k24
3245i4J7R3n6L4j80K80j95J64j15j18M16n99J95JK59J23l52r7J09L56k25M07n5
$$ plain form
3077 343 18 -1 147 -58 125 294 3 -20 179 154 158 165 -2 398 -79 80 24 -68 161 362 -120 -249 -25
3100 -25 164 71 211 -166 -383 130 154 241 197 -127 -130 84 -28 97 -126 -107 -166 -32 -88 92 -122 -26 -112 -123
3124 -123 7 -69 -29 113 -91 73 165 108 428 -100 68 143 -220 13 19 -71 -211 -453 -73 130 -13 -300 -285
3147 -285 28 -297 177 178 -37 -111 -133 -28 -149 133 217 136 -130 -81 113 -8 -8 87 -94 54 182 -211 110
3170 110 -27 66 118 215 111 59 68 90 -192 296 164 152 305 135 -157 -229 36 180 6 -72 -144 -136 95 57 189
3195 189 39 87 41 246 -176 -16 -20 12 -107 -140 104 123 164 -99 23 75 61 69 176 21 -378 1 75 167 46
3220 46 -93 -37 -58 197 145 -114 -197 -44 -54 177 -109 -126 -25 -91 -56 213 -58 -23 -115 -130 2 -73 -156 130 -94
3245 -94 -77 16 -40 -6 -186 94 -101 63 -52 -170 246 -353 -158 -157 102 225 -127 -224 -115 241 16 423 368
3268C68l57L2N9J99j33O4j55k50J65j3Q6Qj9j35J35k86N01k9O1l44q7K1K12Pj36
3293b6J30o8j71L55m39k7L1J67M7J38j64O4J6k86K38K48k55R9j82OJ00J54P4l92
3317a43N3J04j81J41N6L7k03M7K8K13o5Pk25j18L33l82M66l12%r0K14j63K78P3
3341A68m05M7q1J14J64j6p1N0j84N43l66K4R8k50j3M28p3m5p3k21l3J71R9J9j0
3366H4k20J10J60rqk19k03K09P5J48Jp7l1j36K31l6J1J21k06R3jJ94j35Qk15k22
3392b73L08K3K94l94j67J51j53L38N2j64l47J42K86J08m5k14n0J8L2p6J69J42
3414A80m80K47R2qk1k26L39j58j64J46J70K68l80q8N5n8l2Q3j45r9L30l9J13l06
3438a81mR9j34L74j77PJ8o8j53O24m25r8M2J03j16k68K52J35k10j03Q9R9K82m1
$$ plain form
3268 368 11 43 102 301 168 232 77 -173 -8 -21 65 73 54 -81 54 -232 269 240 301 -43 -130 -109 103 110 -26
3293 -26 104 36 -135 220 -219 -246 -215 -48 -1 137 -27 37 53 -233 5 253 -2 97 -85 -79 21 175 249 -143
3317 -143 -90 14 -167 -26 30 67 -136 -89 -61 152 87 94 -131 -249 84 -298 168 -144 -144 -234 -20 -183 95 168
3341 168 -237 -190 -271 -157 7 -9 -80 -30 -214 329 -37 -13 85 -165 -178 250 177 132 59 -162 -195 -24 75 94 84
3366 84 -136 -26 134 125 117 -102 -305 -96 -21 127 128 51 20 -116 115 79 90 211 5 98 97 291 156 164 -51 -273
3392 -273 35 58 352 -42 -209 -58 -211 127 179 15 -332 -190 96 204 159 -55 -105 -87 -55 -131 38 180
3414 180 -300 -53 39 31 10 -216 123 -35 -199 -53 117 385 5 -83 -28 -86 -118 -35 -180 -279 51 12 125 -181
3438 -181 -185 -86 -220 154 -23 -16 2 -66 -219 405 -20 -118 -76 27 -89 -357 -105 30 -180 -283 -194 -95 187 146
3462A46L3m61K46k21M48Jl2j27m33K63L53L1l16k4m6J13J15J44k93J47L8m5Qj39
3486e1L56l78M6o6N6J79l03J64k32J62P3J60k00J56n4j72m1L43o9R7J1l34j51
3509b48L92k54l2J68n06N82L6k0j10J09k15J32Q7J05l54P9J83k15Q0j40K33r2
3531@k18K18k8J01j09J95l90L2K27J71n3j92j99K08J67Nl6J37l89j4R0J60m0j4
3555B9k0r8j48L14j2j93O0r4K17K38l72K06j14j23J33n0J2O7j35q8Q9J64j21p9
3579a18o9K57m9J0Q5Q7l58J6J66j01M4k09L86k85K81q4J08p1j64R2L4N2j65L52
3603B97j23k48o5n6J94k3P9j59j56J53m1K0j6m2K41pL6j36P2J23j62j4K18j38
3627D7j72o5M6K03O1k86J54p2N6PJ02J07m06K34n7J23q3o4J67j12j94K0J57J95
$$ plain form
3462 146 179 -282 -36 -257 191 192 160 33 -400 -137 216 247 -69 -93 -139 -26 89 233 -60 87 125 80 88 -51
3486 -51 305 -73 -27 -93 -37 142 -161 3 -229 -67 6 166 -34 122 68 -104 -145 198 129 226 237 -97 -248
3509 -248 144 -110 -142 26 -480 102 138 118 8 117 -98 34 121 226 -128 -49 134 -81 -1 -141 92 0
3531 0 -218 0 -28 73 -36 159 -231 -199 28 199 146 -46 -245 -37 130 135 99 236 -153 -167 -77 83 43 29
3555 29 9 -89 -237 77 65 -128 -68 -162 55 293 -79 127 13 -110 23 -27 -15 52 -83 -171 -82 82 -39 -118
3579 -118 -187 70 21 31 116 203 -155 -139 27 -74 -30 -239 147 -138 143 59 167 96 -68 24 58 110 -55 297
3603 297 174 -74 -139 -195 -1 -24 55 -104 -260 -107 -148 -128 -144 -186 55 48 84 -52 20 143 -19 -33 185 47
3627 47 -125 -190 -144 59 120 -166 -12 -84 -28 -21 81 188 -218 16 -41 82 -1 -65 102 -10 -204 -184 -27 168
3651A68j92o9R8O8k69M53j52j82j4K59l8k36L2K32l00L0K10o7J83k49k0J4J25
3674H4J2p1k36K57k1r6K28j21M29n22P4J8O8k8j94N9R2j37K53j8l45K37j93Q2
3698h9Q5J8m5k47J09J58k44J97rR4j48J51L55j29j91mJ0K60k32k4n9j78J01lM23
3723C59l50R7k4k50L4J99m3l00K84j91J25K23J95l75O2K0J47k63J78k47J16o0
3745f4k85M53Oj84j05K73o14M65K44l14J60J10j41j53R4J16N3p5l8N1k31L25j83
3768c7LJ70l50N3K95j31Q4j50k2j5K85k90J26o4j00M0K63j00N9n1j66K07J15m11
3792a87n2L23k31P3J42l87L87R7l3j1k20l2J75m5Q9l7J37j10l91J09Pk4J34J51
3816F4k19J80ll11K20K53l10o7L29l65RK54Q2k3k50o3K47j63L03j60p7q5J79P9
$$ plain form
3651 168 -24 -93 5 73 -196 257 105 -77 -91 168 130 -106 -74 158 -142 -112 98 31 214 -35 -55 -41 84
3674 84 96 25 -211 46 25 -71 157 36 465 -57 17 35 103 75 -119 -60 32 -105 148 130 -215 22 -171 -89
3698 -89 -4 14 -31 -278 -169 -11 -255 -58 -67 27 -121 30 385 256 65 61 71 331 99 75 16 -162 -61 -64 359
3723 359 9 106 82 -168 -134 65 22 -278 6 -185 -60 163 358 -17 45 65 212 -51 127 -120 -4 -64
3745 -64 -349 104 110 -74 -179 94 -520 -55 189 -125 35 145 4 -149 -55 61 114 39 1 52 -179 146 -37
3768 -37 -34 136 -214 -161 134 3 87 -63 -85 -100 185 -105 21 -43 -143 -103 160 60 119 68 -98 109 224 -187
3792 -187 -239 84 -147 -74 68 -319 68 165 132 121 -99 -131 44 -1 88 51 188 78 -313 -204 -197 -221 -87 64
3816 64 -155 25 22 -289 -69 184 -126 -193 136 -229 -220 34 116 93 -157 -220 27 -136 167 7 -70 -155 24 103
3840A03Mj27J55k04J2j43L81M1j7K01n64L12m24J49R3k44L04L70n25K13j09j0
3862b9J5L8L4j3j55M02k46m8rJ79j90l0K57j56j26L65p0k3k13k09J43j00M58k02
3886G2J47k00k7J48j23JL9N5j24J61p9P2l92K83P7M7o0j06k02K86o1pJ79m02L49
3911A33k99Mj40J52j98J65K0R5j78L02j76J10k5L3n2K2L60l29rq9K28j1jj29j09
3936a21L77j59m4Q1j52j51N1M3j33M08k40J40j28q5J78p1K60l48n0K19p8j02K38
3959A33M7k67L64l04K72l17k06J02qJ61J97k66o1k1K2J26L7q8N8R5J3J54k57j57
3983a71J56n3m7j14K38K8p5L6k8J43l26L10n2lk40K1J73J17n2m6N2o4L81l02q0
4008BJ65l15L35k35J05J54n6p2K3l19K92l2M9m02J50O8K72m37J20K91pl02L8J78
$$ plain form
3840 103 107 -20 135 -69 -57 -200 181 222 205 406 -158 154 -270 -121 -28 -272 32 402 -123 90 -19 -29
3862 -29 -14 24 58 45 -110 292 46 -2 -11 168 -22 -52 205 49 -77 288 218 195 -18 -227 -84 -184 274 72
3886 72 219 19 -8 140 17 18 57 112 -12 149 70 142 -250 33 110 157 97 -9 -211 75 14 7 186 -216 133
3911 133 -166 -162 -302 -150 -348 -183 -163 -68 -246 56 -120 -10 -35 -2 -54 -32 328 -1 -10 -99 129 118 117 -12 -121
3936 -121 256 97 53 134 -18 -169 -118 -75 -208 200 -40 100 -28 -113 65 -6 254 -94 -144 75 -3 -105 133
3959 133 180 -87 277 -27 245 -72 -278 -176 -184 -23 174 -92 -153 -174 -152 -26 11 -77 -19 76 89 243 -14 -171
3983 -171 -15 -68 -115 -229 9 37 -38 -2 -30 113 -213 97 45 42 -198 -177 -4 113 61 15 67 3 384 82 2
4008 2 167 -148 187 -48 57 211 155 83 106 -213 79 47 96 -306 -156 -88 184 -253 -133 158 151 -151 -113 65
4032F5m2J83j44j77K66k05j18L19j7L5M0l05N9k36K74k57L58R3k7q1J67l14L11
4055B47j10o3P0j27m6J03j17J74j09j07j24K96K25j99k07q2J13N9K99m02J82k18
4077a43K89j63K99j36k23l1j00K85J03j3m3j28j7M1j66J75r4p7N0J69k2r1K27
4100A91k88K54k17R7J61j21k94K05j05rK98j03K4k41K92j11rn3N6k3L9k57J51
4123f3J78k97om8O0K66J50l10J67oJ1j24J52j59J05K5qJ03n0q7j34J27p0L35j20
4148A97j47j69j00k4K04J84Jj32j30J22j17J49l72M76j83L3J16j06m2J09j04R3
4170E8j05N2K31j14q2j6j56J91q4j23M0K21kn4J32j2l1l35Q8L04K3n6j58k11L33
4195A34M7J05m01P1K04l38j35L24r1J09l60K99K23K1k74J86m01J96r4L27M9m00
$$ plain form
4032 65 23 206 62 -115 151 -54 -172 147 130 165 205 -100 -41 -277 -3 -260 98 191 164 83 250 -64 247
4055 247 137 74 144 17 -29 74 -43 131 22 -85 -209 87 312 113 -94 -176 -63 -4 295 -107 75 -143
4077 -143 146 -17 282 146 -77 -108 -208 77 180 167 124 -4 -21 20 -146 29 -65 -142 -92 77 55 -36 191
4100 191 -97 157 -60 37 198 77 -217 -12 -117 -126 172 69 93 -148 144 33 24 -29 27 4 43 -214 -63
4123 -63 115 -182 -188 -236 -176 90 240 -70 97 91 102 -22 130 -29 76 101 93 196 146 59 -75 52 -18 317 197
4148 197 50 -119 -219 -243 -39 145 146 14 -116 6 -111 38 -334 142 -41 -8 108 2 -40 69 -35 58
4170 58 -47 5 236 122 40 24 -132 59 -25 -148 -108 113 111 57 189 177 146 -189 -101 203 226 170 12 -199 134
4195 134 181 286 -115 -44 160 -178 -313 11 -80 29 -331 -32 191 212 -62 124 -277 -81 -175 152 201 -199
4217a99J0J42m2K15L6l53j23M13r5P7K9j84j52J84K3p0J93Kk68R8q3K57k41J09
4241b2j28L5J54O7k27K03k27O7j0j15L18k52K0M1j47K21K48k65%QJ38J71j49m16
4265b67K47j65K03p1L32m09R7O8J57p2l0J55m91K73L0j9R3K1J21l91J56K4k0L4
4289G6j4l15L61j21j41J47K51l54lO5J43r0q6l6l8k2J20RK75k70k54L91j13K55
4313B36l56J22O2k00R3n4Q6j29K47l21p1K31Q5K7k60K10P3q4j89K21j00J8K20
4336A67j68R8m8j24R8%J62j41j17J2K77j70J30N1r9r0J11O2j03m2j51Q1o6l6J37
4361C1K5R2l0m9J70k99mQ8L6l9m4L3Q8J1k4l01M8K76J09j50%q9M3Q1N5K4l64r6
4389b79L40qj89L31j45j28L0L9J21n4l38L56k85L47M7j6k4q0k27kK46k12J76j24
$$ plain form
4217 -199 -189 -47 -89 126 162 -191 -314 99 4 81 110 -74 -226 -42 -19 -89 104 106 -162 -64 -147 110 -131 -22
4241 -22 -150 -115 39 106 -121 82 -145 -78 -88 -203 115 -137 -117 -76 -223 -2 246 -19 -19 -11 127 298 149 -267
4265 -267 -20 -185 18 -53 279 -130 -33 35 192 120 90 245 -246 27 57 38 131 152 273 -118 38 62 42 76
4289 76 62 -253 108 -13 -154 -7 244 -110 -113 -48 95 5 -81 -117 -155 -177 -57 -48 227 -43 -297 94 -19 236
4313 236 -120 2 64 -136 -43 -97 -11 -140 107 -214 -285 -54 31 58 -202 8 81 -3 -192 29 -71 -53 167
4336 167 -1 97 49 -75 23 23 185 44 -73 -61 216 46 176 227 128 38 149 211 108 66 -85 -4 -70 -106 31
4361 31 56 148 118 69 239 -60 -64 24 60 21 -23 10 98 109 85 -216 -168 108 217 67 67 -22 21 102 157 181 -183 -279
4389 -279 61 53 -136 195 50 -78 -48 -9 112 58 -280 76 -209 138 185 169 145 65 -162 -164 82 -130 46 -78
4413g8J06j17L5J11O5l18k11M27J05j26J09m03K61j4m1J16J47j35J8q5K63q2k85
4436a32K76J90q0m00J96K8j26K51l8k41l1J06K3q3l9NJ22J13ql67J59L01j87J48
4460A86k40n2K64k30J55J57j04k19J3K53j96K83j82J88l04k01L52n2J48M1n31
4481b71M1J64K71L1j39k40J50p1J66k1l6P3p0p1r4J20n9R1k76J93j9K25L24q82
4505d00J14K92Q8J5j71o5N2j66N23j93j55J5o7k4J93j23J7l5j60K43L2j4j80k3
4529a92L35j85j03J47M4O6k03j8K76l66M0K64j92K37m16L26L20k64j59J31l39
4550b51L54j7R5k80M91m71OK82k67PJ13J43j80L36k49l08p7L8N3K01P3j31l18
4573c57L59j85j6K65j03k43K53J81q6j35J52L6n1j51K06N9k46R7j06n7k8J98j70
$$ plain form
4413 -78 28 -89 -54 57 122 -196 -407 20 125 -1 108 -295 -34 -48 -89 27 174 39 57 -28 235 153 -132
4436 -132 144 334 254 -146 50 78 -48 203 165 -76 -107 -1 22 -61 -100 -95 27 140 132 -235 -76 225 38 186
4460 186 -54 -106 158 -72 83 240 136 -83 -70 183 -13 270 88 276 -28 -229 123 71 219 260 -271
4481 -271 -230 -66 205 236 97 -143 7 -64 102 81 45 118 48 -23 -117 3 -56 35 -241 -48 -67 158 482 -400
4505 -400 -286 6 94 109 -62 -127 -75 -241 282 89 -66 -51 -118 -142 51 -72 -55 -90 -250 -7 25 11 -169 -192
4529 -192 143 -42 -145 2 46 112 -91 -109 167 -199 -159 105 -87 150 -266 60 380 116 -43 88 -251
4550 -251 103 86 181 -99 392 -79 -73 209 -58 -51 62 205 25 361 112 -196 -273 -235 -182 19 92 -39 -357
4573 -357 2 -183 -199 66 -37 -280 -27 154 68 -67 85 121 70 -81 125 184 -62 35 -71 -128 -156 42 -128
4596a28j44K48n3J6p1J70k62j2J41K32j45L7r6j13K43Jj28M5R0j27j06K11o6m2
4620e9J05j48J40j06r2O1K48J2k63j4J34R5k5n7r2K30j02J16Pl12j05j5M86l9
4644B05P5j92k20J50K1k21L39k06K34n1J8J6j9j1N2k99L21NJ8j21j42k61M65j10
4668F6r8J21m2k56K95p4j03M17l13m7J05o3J89r4j93j82N69l42p7J24J0l0Q7k84
4692b15J27L7k10P6M5J56n0j44k7L45k82R8nJ9J59k61RQ2K4r5O2l5j8L02L3k77
4718d5j20J05j37J97mk8J24j70J30j87K03j3J23k63%K28p4m4m0j27L25p8j31O0
4742C4r4L2Lk1J78k39L18K7k76m2N1J48k62P5Q7mK28k76K64k55k40J86L69k24
4766F7N3j32M2Q2N6J08l77K59n40O51l23J28O1n4P0Ok78J19K73k14k06K09j36
$$ plain form
4596 -128 -272 -24 -77 -61 -132 38 -224 -236 -95 137 -8 29 -67 -180 63 64 -64 -19 71 -56 -162 49 -17 -59
4620 -59 46 -102 38 -68 -160 -99 149 161 -102 -116 18 113 88 31 -61 169 67 183 190 -122 -227 -242 244 205
4644 205 280 88 -132 18 39 -182 157 -49 185 134 152 168 149 138 190 -109 212 217 235 114 -28 -289 176 66
4668 66 -32 89 47 -209 86 12 -91 326 13 -34 71 8 197 103 -90 -272 297 -45 -122 2 12 -18 69 -215
4692 -215 -88 -51 -261 -185 -140 16 -34 -178 -205 140 -142 -44 -49 -30 129 -132 -123 -41 -17 -112 -50 -85 -103 199 232 -45
4718 -45 -165 -60 -197 0 -4 -32 92 -78 52 -135 68 55 178 -85 -85 143 69 25 -15 -142 183 105 -26 34
4742 34 -60 -28 -25 -46 132 -107 211 238 -38 -80 -29 119 -143 -68 19 15 243 -33 231 -24 -264 -78 291 67
4766 67 120 -12 30 112 168 276 -101 158 -382 269 -54 74 135 81 151 157 -121 -2 271 57 -149 60 -76
4789g6Q7L42k43m9k23p9J59L5J92J7m70K9J68m2J02MJ41K6j93o0L50l33j8J03
4813c1J51j73K3J49k03K1k00M01l6j94j8p1J31j29J61j14K9j62L46Q7m11K01J86
4836A44k12k5M01k27j00j01M4J17J82k97q1P9J75k67J15K82k67M0K30m42J81M24
4858C95l90O1J83l51L12j75P1j60o6K75j81l9K20N5k97j23L15K5o9K2l47K75J01
4881A12j44l37K40J63j22M2L2M7J32k84M68k91k65Q8J73j88J71Rj76J2O5k1j56
4904b30p3O2K38J83k64j95J60J4L30j72l2l2n9r0Q5K0L39l27j55J22J48j01m1
4927g0O7J18k0Q1j71r2k38K67lO9K05q9j24j11Pj62M41m25K00l4M9J39R9r0j71
4952e8K8o7L29j43q0l7J26K6m2r7K19k60K45O0m79L70k88K08j56P0R5m6J6r2m4
$$ plain form
4789 -76 11 353 110 61 -162 -241 -82 -47 145 162 -308 -279 -111 -153 -51 -47 94 120 -73 -133 217 -116 -134 -31
4813 -31 120 -53 -30 119 -84 -63 -263 138 102 -92 -110 -181 -50 -179 -18 -132 -103 -265 81 168 -243 -42 144
4836 144 -68 -93 308 81 -19 -120 -76 41 223 -74 -155 -76 99 -168 -53 229 -38 2 232 -210 -29 395
4858 395 5 66 249 -102 210 35 106 -54 -120 155 -26 -65 155 210 -87 -210 105 130 61 83 -264 11 112
4881 112 -32 -369 -129 34 -88 -46 -14 33 165 -119 349 58 -207 -119 54 -134 37 46 -130 -118 -53 -74 -230
4904 -230 -303 -241 -3 180 -84 -279 -119 -105 225 53 21 -11 -70 -160 -75 -55 284 -43 -198 -76 72 -29 -70
4927 -70 -3 115 95 176 5 -87 -325 -58 -61 8 213 124 0 -111 -104 -266 175 -250 -50 -84 -35 104 203 113 -58
4952 -58 -30 -97 232 89 9 -28 98 124 82 -15 204 -56 189 249 -230 140 -148 60 -96 -26 69 23 39 -53 -97
4977i7J09o8j37L57j6Rk32J94M3j66K35l26K9p8N2j72rJ74J52k26jJ50j26J45
5001er7K19j88j11J67J1m3j09L4L28k13J05k24j13J08J13P0j66L36n12K63K03
5023A76k11K3j3L8K5K8j07K47m31J62k53J25K02M9R6mLk37N5J60j53K33m10M34
5047B37l4j46P7l05Q4O1J3j7O6l42K67j60J44m1J78j64J65j30R2K86l61p7M1K67
5071B01N2j68j50J8lj80L68l2l20K12J25n7k32L84k28Q4k61p2M90l40J9K14m13
5094b89J14M07o7rj84L8O7N7j58OJ71J5k65L30j59k08M2j33L66o5n9K5k75L55
5118A22o2J11l80K52k20J77r1Q9K14o8J66k88P8j99J83m9j64J65k23Q3J30J33
5140A59l19K86M2k87J76k9k66L04R6Mj01q9Q7Mk65K85M5K1k62k3K22m6J8K29m43
$$ plain form
4977 -97 12 -56 -193 164 148 157 -75 119 162 -4 231 -95 -66 -144 -92 -264 -273 -99 53 -173 -174 -24 -150 -5
5001 -5 -102 117 -71 -182 -15 -4 -47 -156 -122 206 -7 98 -126 -239 -131 -18 52 -114 222 -290 -27 176
5023 176 -35 -12 -25 13 38 66 -41 206 -225 -63 -316 -191 11 60 156 152 155 -82 -27 133 -20 213 -197 237
5047 237 203 57 134 -171 -87 -26 -13 -30 36 -306 -39 -199 -55 -96 82 -82 83 -47 45 331 -30 -107 -66 201
5071 201 253 85 -65 -47 -50 -230 138 106 -214 -2 123 66 -166 218 -10 74 -187 -259 231 -109 -90 124 -289
5094 -289 -175 232 165 156 -28 10 77 134 -24 -18 153 168 -97 233 74 -134 -92 -225 141 76 17 42 -233 122
5118 122 60 171 -209 43 -177 0 -91 -2 212 144 310 22 100 -99 84 35 -129 36 -187 -104 26 159
5140 159 -160 126 168 -119 57 28 -238 66 162 166 65 -24 63 67 -198 87 132 153 -109 -132 90 44 62 291 -152
5165a52Q7P1j29K01J83l22n8Q1J97j49L9l34Q7J84j33Q3j02L32m41J32rL52j85
5188A5k12J01n8J55Q4k3l20L03j56J03N9k53K94j76l9O9m0J25l5q0L8J90p9j68
5212a03J55M3J09l26k92J45L07O0j40O1J39J39j98j46J5P8J08j23j10L57j61J52
5234B69l07J71J3q8l5k9K5l9J88M0l04P8p4L88j27j53K38j98j33l09O56m3L9j27
5258A39o8N4j50N5J07j26N2l5m1J89k17L0o1j45N10l66K39l06K13j68R4k92J89
5281a04L0K34o1l77O14j59k52J79q9j26K4M1Q0l99J46K59K09k13j23m6J72M8o6
5304B1N0o3M7o6l5k5K24n5M6k54L30p5k15RJ82J13l98K52Q4j18N9k76K67k25K39
5329A18q0J70m39L12q0P1L6j17prOj8J09j1PQ2p5j59J53M4r1j77N7k10L05L5j07
$$ plain form
5165 -152 -65 6 -123 78 261 -61 -119 -38 159 10 49 -285 -198 -14 -147 -64 -166 166 -275 -143 -152 200 15
5188 15 -197 -96 -154 1 85 62 -258 45 -111 -8 51 -202 92 -84 -123 -54 -94 31 -4 -84 -46 144 65 -103
5212 -103 52 95 204 -122 -414 -269 38 98 -42 19 158 297 99 -47 -32 46 154 31 -79 278 117 269
5234 269 -38 133 146 58 23 -6 19 -20 168 208 -96 -18 -92 296 169 16 254 56 -77 -386 270 227 266 139
5258 139 71 125 -25 30 137 11 63 28 -13 176 -41 -11 -72 -217 293 -73 166 -140 73 -95 -1 -293 -104
5281 -104 -74 160 99 -278 336 177 -75 104 15 -111 -87 -46 34 -365 -219 40 249 36 -87 -133 39 87 21
5304 21 71 8 55 -11 -46 -71 153 98 144 -110 220 145 -70 -61 121 234 -164 88 172 54 113 -163 104 -121 118
5329 118 38 208 -231 81 1 72 108 -9 -16 -25 -19 -37 72 61 68 150 75 -84 69 113 22 -155 -98 -308 -3 32 -75
5356g5M3Q7n6l4MN6ql8L3o3k23K31J17j17J10n6k1q5K01k35J44R0k45Q7P5j59
5382a37J94J6ok2j43Q8J48r5p6M2q7J46k00J66QR7j03n2J7J62j1m9k53J79L7M2
5408A08L5j01J5j60K35j27j45j8L66l21J66J09n1k47K16r8o3J85q0Q5l7J30Oj14
5432I4k25K08Nm7K3K2J20l40J16j01L26p9n2j45Q9j46M75m25L14j83L3m1J74j78
5456C7l4K5J16j49J77j30L0P8q2k45J62K35j32n8K44l31K01j50KJ92j06k64J45
5479c7M6J1j13k1n0J4K75O1n2J53k28p0q2P9J4K0J79k99k1K19j87K14j85q0K46
5504A06Mr4J47k85J89j42J6J26K62k13j87J6K7oq0R1j2j02J99r3J28nk88RK95
5529A08R0l12Q2J37K30n39J11K2J33k49Q2J96q8o3J08q6J1l0K20L9k00p4J08j94
$$ plain form
5356 -75 -32 55 -1 -35 -31 25 17 -21 12 -51 -274 -43 74 -43 67 11 -10 -95 106 -129 15 105 -140 -53 22 -137
5382 -137 57 73 67 45 -98 -10 138 43 -33 9 -78 68 -132 34 42 139 36 -16 1 163 152 103 -150 29 66 108
5408 108 143 42 57 -103 132 5 -140 -158 208 -113 53 162 111 -136 80 -18 -81 104 24 109 72 202 208 94
5432 94 -131 77 82 35 58 80 200 -140 -24 -125 201 122 70 -75 14 -132 343 -82 232 49 82 41 215 37
5456 37 3 28 144 -5 172 42 72 150 68 -177 -15 220 88 30 274 -57 144 -6 -4 188 82 -182 -37
5479 -37 9 20 -93 -114 -164 -150 125 186 134 287 59 -11 -93 -14 0 20 199 -100 -121 98 -89 125 -60 -140 106
5504 106 110 16 163 -122 67 -75 -59 67 329 116 -71 -55 -28 -34 -114 -23 -35 -137 62 -31 97 92 -196 -187 108
5529 108 198 -114 -32 105 335 -204 -93 -71 62 -187 -105 91 3 -60 48 -38 -27 -57 163 202 2 -72 36 -158
5553a58J17K63m8k62N5nj5K00j88Q1k54L70j71p7J90q7J67j01N9K3M5k32J08j07
5577b7n0L17k02j53j61J24L53k17n6J74n8k33K01K22j93J96k98m0J42k15J16j63
5599b21K10J67j99K14l3j6j41j57J65P1m3j8j26m7K01k6J17rj27J24j96O1Q0R
5623F0J72m61J62J05Q8j22P6j82J16j5o5K13j32m1m5J12J36o2rj78N1K43l66K16
5647G2j05J21L7J7n2q5j44O8L0pp8J95Nk57L49l44K83Nk47J50j43J33%J77l1j02
5673D7P1R6k82m8K36l71L82k28k0K00nj62K32Q9j08k28Q0kp4K5mK57j57n8j0j8
5699f0J17q7l2Q8K8J34l76J49K12j68j37P4K11m2k10J83p2k1j85J10J83k7P0j30
5723A2j04J31J8JJ83j81p5Q1j40oK32l66J85j38OL89m05J8J93k4k13L90l36O8
$$ plain form
5553 -158 -41 222 174 -88 -33 -38 -53 147 -41 40 -214 156 -15 -92 98 11 178 77 136 159 204 -28 80 -27
5577 -27 -77 240 38 -115 -276 -152 201 -16 -72 102 44 -189 12 234 41 237 -61 -101 41 -174 -58 -221
5599 -221 -11 156 -43 171 138 122 -19 -176 -11 60 17 -1 -127 -174 27 1 118 109 -18 106 -90 -29 51 60
5623 60 232 -229 -67 38 126 4 80 -102 14 -1 -66 147 15 -26 -71 41 177 115 106 -72 -21 222 -144 72
5647 72 -33 88 125 142 90 5 -139 -71 -41 -48 -126 69 74 -183 166 -178 105 110 -137 13 -130 3 3 180 149 47
5673 47 118 214 -68 -116 120 -251 131 -97 -117 83 78 -84 148 237 129 -99 -19 -21 -95 -70 -74 183 26 -32 -42 -60
5699 -60 57 -30 -62 26 54 188 -188 -39 173 5 -132 -58 153 111 -99 84 12 -9 -194 -84 99 72 142 12
5723 12 -92 39 57 58 241 60 -15 66 -74 -80 152 -214 -29 -167 -161 228 -177 -159 34 10 -203 187 -149 -81
5747h1k04L21J48k73Q1K73l04M8j10P5r5j28J29J18n1M7pL07l09J1J85l51J57
5770a3L3L4Q5k0R2j28j14K28Ol18J20o1K08Q8l60j13L82k73L82N4m73J42JN1j03
5795g0k61L46l67K77M4R4j87J22p2Q9Q1Q5l19L2R5K64l12J89m09K12N8j11NJ90
5819G5k02k8K38j75K08j78r0J30J60r2k28J5J70k04K38J58k11K33J10k55Lk37
5841a62K17K64k73o2J30p2P4l85K00k9J67k12J83j93M2L19j23j23m9J44j72K14
5863I9j41J54j83m4O7n1J01j21J75k34K23L4J35j66M0K7m6j70K66l7q3p4j08K98
5887A61K8j93j6k04j43L93k52L26j80J29j78J32j5nj00kN3RJ54l1j76K45j2r3
5911C0L4M0j65q5K29n2r2j78L95j39j38J45j52J88N9j99q0K13k07K71k3m61M19
$$ plain form
5747 -81 -285 36 184 -89 -8 265 -39 9 -101 -26 -121 -249 -120 -2 -53 -6 -13 294 -15 -4 181 -170 -13
5770 -13 20 54 139 119 211 83 -31 197 203 -115 5 -56 152 240 -120 -233 149 -124 258 312 -161 -19 -18 33 -70
5795 -70 -331 15 -352 -75 -31 63 -124 -2 -74 15 96 181 -138 -106 -11 253 -59 130 -279 -67 -9 -120 -115 75
5819 75 -127 -155 83 -92 116 -62 -152 -22 138 46 -182 -167 3 -201 37 195 -16 217 327 72 75 -162
5841 -162 55 319 46 -16 114 42 116 -269 -69 -98 69 -143 40 -153 -111 208 85 -38 -87 57 -115 99
5863 99 -42 112 -71 -115 -48 -99 2 -119 56 -178 45 79 214 48 88 115 69 -101 165 128 45 -29 -137 161
5887 161 189 -4 -20 -224 -367 26 -226 100 -80 49 -129 3 -12 -17 -117 -119 -66 -57 97 66 -110 135 123 30
5911 30 64 104 -61 -146 83 31 -61 -239 156 17 -121 24 -128 60 119 -80 -160 53 -154 117 94 -367 52
5934E2j18k2NJ60q7J35k05n9L7J84j2n6k17m8O94l95M9l0K01k76j62K87j22J85
5958A80l79J58j50J57P8N6j94K2J26j53K66m14J79J1OJ14n8q5K66j83Mj72K78
5981A13j69j44J36J60o4n6O9r7pJ82n9k66K8L54p6K8j01L7k07L31l69K32pp1n1
6006g4m1L50k08J00Q8l64J85j20J44o1j27K99k71J60j43L83j03j60m1J33K2pJ99
6029C43j72l33L6J87R9l94N64k30r6L1J2LN1k3n2j44J97L7Jj12k27J03Q3J28l5
6054E7M6j26N3J8j6J94l37J61J68l92K82k46J5L31j81r5r6K29l14M6K55om0Nk1
6079a0J02j39K07J9N7k95K13l6j45J72l8K5j11k70L38n2j12J13P3l55K6n6K87
6102A3k07J69J30k87J3J76p5m8Jk40M68k50L23J05j94j16J11k01P9N1J41k24N8
$$ plain form
5934 52 -66 -88 -83 77 -10 125 -80 -139 -102 82 70 14 -203 -251 443 48 97 67 268 -8 -170 117 -5 180
5958 180 -199 -41 -191 -34 44 100 -94 -72 54 -99 167 -247 -68 -57 -51 63 5 -80 186 3 7 -165 113
5981 113 -56 -200 -64 96 32 -24 45 -52 -59 123 64 -202 -174 180 104 132 31 68 -139 192 -177 55 48 -23 -74
6006 -74 -115 235 27 127 215 -149 36 -84 60 -1 -128 171 -100 60 -83 300 197 37 -4 129 151 144 343
6029 343 171 -162 -126 61 160 -234 330 100 4 35 47 50 101 78 26 -118 79 116 117 5 -222 -119 -36 92 57
6054 57 103 -23 30 48 32 226 -111 50 218 -174 108 -138 -123 208 27 -68 -164 65 -249 -203 52 46 6 11 -10
6079 -10 92 -47 160 179 236 -59 154 118 -27 145 107 132 21 -249 89 37 -75 38 111 -244 -218 -274 13
6102 13 -194 -25 105 -182 -169 7 -68 -116 -115 -355 113 -137 186 291 97 -19 92 -109 -30 21 162 -62 -4
6125djJ34j9j19j64N2r9J37K40j59K90j10k94K06j08K06Lj28J19m72R2L32k85
6148a51K81j8j17K4j12K4n8K0J54j31K67l36L43m15J76L05j89M1k91k9K44J96
6170B28j59j79K32o1k83L80pK4k57N5r3j33K01J16m7j71L77r7n4Mj20K06j61j96
6194a95J22N6o5p5K47j94K2L03k66j44J36J4M7Oq7j05K21n4k98J65O2j72J85J23
6218E4j3k89J07K34K43l33J45j29m0J91j27m0J56j3J8k24r3L10l66L95j97J43
6240A32M3m4l53J83k48K54M5j90L62O8k04J06j66M6j08K85k71j55K50j41o6K80
6262A08M7j79J41l82L14j38K56k38j51J0n6K63Q0m3p4j27K21j7p9J68r2K12k73
6285b9M8J01j06M7j9rJ42k92J24k24J20K34j9M1k73Q3l4p8J84q1K8P9k88J62%
$$ plain form
6125 -4 -5 129 110 -9 -173 -121 -220 -83 157 -2 288 178 -116 90 -18 188 191 63 182 -290 -198 134 -151
6148 -151 130 112 -5 19 -93 -69 -127 -107 47 -84 183 -153 190 -225 -49 256 67 108 -183 -212 32 228
6170 228 69 -110 122 61 -222 158 151 175 -82 -27 -120 -253 -52 64 17 -154 223 126 72 76 -44 162 1 -195
6194 -195 -73 -17 -82 -157 90 -104 -82 221 -45 -189 -53 -39 8 14 -73 -178 43 -11 -309 -144 -82 -254 -69 54
6218 54 41 -248 -141 93 336 3 148 19 -21 170 43 3 159 146 164 -60 -153 157 -209 186 -11 132
6240 132 175 131 -222 -39 -287 -33 12 -178 184 252 48 154 -12 34 -74 211 -60 -215 35 -106 -172 108
6262 108 155 -24 117 -265 49 -89 167 -71 -222 -212 -268 -5 75 32 -42 -169 52 35 -44 124 32 244 -29
6285 -29 19 120 14 61 42 33 175 -117 7 -217 -97 137 118 159 -114 -31 -65 -143 41 -40 -12 67 -221 -59 -59
6310e9j0J88pm63L48j30J20J75j8o3l09J14O8J61j45J04oJ07k81M9J76k77J45
6333a3k79K37J23l4J07r1p1J71m6k22R5l6J19k8pJ08j41Q1j32LkL15j90J1k34
6358a56J25K74l26R5J03J18k29L6j24o1o5M19j15l70J28K02K7m2K15k41j03N2
6380c8J51J5J01m14Q4J14l69L63O1k7o5J76j55K6R9l28M6p4K14p4J33m5J02n9
6404C7j64J45j78K85o5j78O0K61m43J43J02J36k45l6L00k26nj4n9K6K15j19L00
6427B78k48k3Q6o3j50J77jm18K23J21k3Jj05R3nK72k93j6j58J00M9J90k4l20M46
6452A89j4l21L87k08K24n5j00n4k68K54k03K98k03j38K56M4k58J87O8k73jK59
6474G0Pl5p9O7K2j20J95k30J20j74J88J8j83N8Q5P3k96j3J38j0j47K93j70L1K36
$$ plain form
6310 -59 -69 119 112 -351 -3 -133 -13 162 144 81 -228 -114 -46 115 -30 74 68 175 -106 -57 119 -158 -13
6333 -13 -292 -55 68 34 141 50 -21 150 104 -118 -23 -59 60 32 25 133 -8 73 -59 -56 -58 257 67 78 -156
6358 -156 -31 243 -83 12 115 233 4 40 -84 -145 -210 209 94 -276 -148 54 81 39 254 13 -90 -38
6380 -38 113 128 229 -185 -101 13 -356 7 68 41 -24 152 -3 23 122 -206 -160 -234 -20 -94 39 -6 96 37
6404 37 -127 18 -160 125 60 -118 -58 203 -240 -97 5 141 -104 -140 160 -66 -71 -85 -144 -118 97 -22 278
6427 278 30 7 93 30 -120 57 56 -362 -139 -18 -41 -40 -145 -52 -57 215 -78 -94 -252 -152 -103 87 63 -257 189
6452 189 175 -146 241 33 257 202 102 48 -220 34 -169 129 -74 -212 44 88 -170 17 85 -188 -189 70
6474 70 77 42 -37 30 52 -68 127 -103 17 -157 31 49 -134 -76 9 82 -214 -227 -89 -99 -246 47 -123 -92 144
6499A44k78L44k14p9K12K7k54MJ21j13J86k40K98j07q2J06m5R2j79K46J4L2l77
6522a42K67M4k26N0M6o3K98l00K17m7j93O5J53j24j30n2J62K19k97k7K00j97J65
6545H8O0q1J41j40j99j21M84j20J4j4k14P2K1n6P3j41J31o3m7J34K3j60j22K76
6569C9L9r1p5J88j60O4k29K71j21J75o0N4j10J58k24L06j99j80K76j21k9p6J12
6592GR6q0j00Q3k71L33o1j78J60J61m6l8k23o1M08l1nn4n8nl8j34k3m9PN4K83
6619A37k5j41J26l8n3n3K31q9q2O6j6m6K20j35p2j01N5k47M19l52K47j00O2Q2
6643I5Mj80J53k21Q8J26j5j12j20J51q2J46j62K6J62Lk73J02J62J63m6k64J87
6666I3n5n8R5k41J88k7N0j34r4K38q3N6m2j03J76k18M15j28j39P2k3j32j46L39
$$ plain form
6499 144 -134 210 -4 -83 129 156 -98 -94 27 -86 100 -140 158 51 -31 75 30 122 -57 189 203 235 -142
6522 -142 125 169 -57 -7 39 -24 274 -26 191 144 -49 16 169 45 -85 -137 25 244 -53 -80 120 -77 88
6545 88 148 67 208 68 -131 -252 232 112 126 112 -102 -30 -9 -65 8 -133 -2 -65 -112 22 45 -115 -237 39
6569 39 78 -13 -88 100 -60 4 -225 46 -75 100 40 94 -16 142 -82 224 25 -155 121 0 -29 -105 7
6592 7 103 23 -77 6 -265 68 7 -171 -11 150 104 66 -157 -218 190 159 154 100 42 37 -1 -135 -158 -207 -200 -146 137
6619 137 112 -29 97 59 6 -47 184 95 13 79 63 17 237 102 30 -71 -16 -263 156 -196 51 -49 13 95
6643 95 99 -81 72 -149 -61 65 50 -62 -182 -31 -113 33 -129 -103 59 62 -211 -109 53 216 170 -94 93
6666 93 38 -20 75 -166 22 -5 45 -89 -183 55 -28 28 -14 -117 59 -159 256 128 -11 61 38 -94 -240 99
6690I9j27Q7J05p2j62p3J29o2O2p9J89k42K85j7J52l06J11j7k66K01j28L78l42
6713i5K09l92K85m8J23J57j95o4K32j81O0j83J17J65k59n9J75j49K13l3j10j6
6735d8Q0J18j03P0k03Q2J43j7k48L83j57k21J95j59M0J24r3j49K10j62J30l83
6757c68M02r6M9o2l7m5N1L77k45q5j07J87J55Nk94M9OK27k79L05k54J72J11q9
6781A35n8j61K66l44L29m27R0q1K04MJ74l58M9J61J41m0K7j55rj09J96L0k06Q7
6805e5M2K78k92J97k05m4K96k81J54k40M3K60j56k6J45l28P8J41O7j67J37J02
6827A46l55K24O5j69J23k59K43O5l0k84L87o1j44m8Q6J2J57k73J5q1J46J24L7
6850A26K9m8j60o4J62k85K44j19J68l5R5N7o1J84k12J85o6l53K86o9n6j52K30
$$ plain form
6690 99 -28 59 164 92 -70 -143 -14 -76 -14 -93 96 -146 139 122 274 -32 79 62 -204 -3 -131 247 -95
6713 -95 114 -278 7 -41 82 239 44 -20 212 31 91 -92 25 190 -69 -128 47 -102 111 78 -32 -48
6735 -48 32 150 47 117 -86 -4 139 122 -126 257 100 -121 74 -85 -45 79 -14 -163 47 -115 15 -368
6757 -368 34 -62 -13 -75 -112 -157 -106 271 26 -59 -166 21 176 181 -113 -64 -58 169 -110 195 -59 113 224 135
6781 135 77 -84 182 -162 167 -260 -170 -251 -47 -43 131 -227 -178 -17 124 84 111 -44 -53 -162 34 64 -142 -55
6805 -55 -13 265 -27 170 -35 -79 217 -64 90 -150 -107 153 -3 -29 116 -212 -134 7 74 -93 44 146
6827 146 -209 15 80 -89 34 -225 18 83 53 -231 156 95 -49 -97 -11 1 158 -115 -100 -181 -35 89 126
6850 126 155 107 -53 -117 45 -240 4 -115 53 18 113 170 109 293 81 266 200 -153 133 64 8 -144 86
6873H6j23J10j77J81l17N0J50m7P0Qo7L4m2Q1k09J27K30J02j48k75j27M03j82
6896h2J99j28j08K28M8k18p9K51j23l9j79L65Q3k23m6n3n2Q2J5P8K37Mk63P3k0
6921E0j20J31j71M7p0R1J51j33O7N3q4qnQ5K06n43J63K01j82L9Q3J00P7l52k22
6946c46K26L27l16M4l9%j27J61J99Mj84J26l4k3K57l33r6J52J68l77K01j70L23
6969A43k21k32K55R1k2j6K06l71M82k06k54L6R4o0k7K87J49l82j8O6J55j88oL12
6993B73k35K2K4R8k62J42j37J25L4o3K6l8j06L4l9M07l14J34k46J46l6J11j95
7016i5J38l66M13P3p1m9j31R7r7K35q8N0k01J2M1k8K48k25l0j95J82L09j25j90
7040i3K30j77k6K38j78j5J20k10r8L14j17mj19kj95K68r6L41N8l00R9P2L9j56
$$ plain form
6873 86 -37 73 -104 77 -240 -190 -40 -87 -17 -9 -76 -42 -84 -3 -212 -85 145 247 99 -176 -303 100 -82
6896 -82 117 -11 -119 109 157 -61 -140 111 -12 -51 -230 135 218 -5 -51 -104 -156 -74 -59 19 256 260 -3 70 50
6921 50 -70 61 -110 -63 -133 -42 109 -24 43 96 12 4 -1 84 290 -253 -90 111 -71 -32 51 151 228 -124 -346
6946 -346 -120 207 -109 -65 -104 -104 -231 -70 129 133 -51 75 41 18 275 -58 -154 -2 166 -211 -10 -180 143
6969 143 -78 -310 -55 36 14 -2 204 -167 315 109 -145 -109 -15 -75 -102 185 334 -48 -66 0 155 -33 -39 273
6993 273 38 60 84 182 -80 62 -75 50 84 21 47 9 -97 -63 -102 305 -9 125 -121 25 -11 100 -95
7016 -95 43 -323 90 163 92 43 -88 9 -88 147 59 109 -92 -80 -39 -67 181 -44 -74 -269 -87 222 97 -93
7040 -93 137 -40 -66 172 -6 -21 99 -111 -209 105 -12 -16 -135 -137 -332 -64 -160 181 239 -61 38 110 149 -7
7064gK33k16j26O3j70J97R2k16J79p2j9J81j44l7R8o7k1l3j14L8K92n1m6j33l3
7089a32J19P9j42J11k6J78k01j51J84J32l70N47k37k61N7r8R9N5J37R4k60k4J64
7112E4K0j54OJ95j78k7P4j22P7J87j51J51j30K36m1n0k61M6j48L23o0J74l03j12
7136a94L74j68j94J25j73K28M2RjJ18Q2o9j35k12L73k19j80K48l3P1j11j71j2
7159b02N1K71l19N6j00Q8%p6J85L93k38k81J68P1J30k21R2k87K5J88M6j92K09
7182E7j30%J31k88N18l76N8m9r1M12j64k96K78J81l31K2l1J40n2m1K3MP3r8M33
7207C83n43K9o6K71k30K73o3j74J60o2R2j17Q2J51j54J16m9r0J32j95K24k22j87
7230b39K92N4j18N6M8j87K2J19j26j23Q4J82M7O5k51L5j02J95j24M7J27j38L0
$$ plain form
7064 -7 226 10 -116 -53 -223 -26 66 -150 29 -43 -62 119 -25 -62 36 -31 -52 -85 -199 -161 131 80 34 -99 -132
7089 -132 -13 66 -76 35 9 187 -14 -165 19 151 -219 328 91 -170 -113 -211 -112 -57 80 174 -86 -110 54
7112 54 74 -80 -74 121 -57 -84 -10 -132 -55 132 -19 132 2 238 197 147 -114 -68 -216 107 47 221 -82 -194
7136 -194 180 12 -182 -57 -230 -2 40 49 48 166 248 179 44 -168 205 -14 -194 54 21 92 -19 -190 -202
7159 -202 -151 120 -199 -143 -243 -155 -155 -231 -46 347 109 -172 -4 67 197 -24 68 -219 -194 -6 40 -152 57
7182 57 -73 -73 58 -230 288 -88 -30 -79 -170 242 78 -218 60 241 -90 -68 -99 41 -11 -52 -29 -25 48 -50 383
7207 383 -160 -131 -197 74 -156 117 54 -120 40 -22 70 -47 35 186 32 148 99 9 141 -54 170 -52 -239
7230 -239 53 107 -11 45 93 -94 -72 47 -79 -202 -118 64 111 176 -75 -40 -142 53 -71 -24 103 -35 -5
7253eJ6J93j44q7K25j83j57K62p7k2n3j79K95k68J4J73k8L8k2K62m21L27N9J5
7277B33l45J60j25%j58J70K43l34K63o1K4N4j12l3K79l65Q0J1J09k06J34r4j86
7300b59K86M4p4P8m04N74j39j04J42m31K55J06k28Q5k6k3J10J27n1pJ28j57m4
7323a2K7L92m49j96N54m17K04q5n4j4J63j0j09K4j32Q7J01k20J31o4J63k52J70
7346BK34l26lJ70r0Omk11m2K1PJ50Q9j44J66r9J57qp8Rk3j32K70q8j83M39l87
7373i8R1J74k10r3J64j99L99q4j68J07p9J58l64M89l63j28J7J61p3K62P4k94N0
7396gj31K42n1O1j10n0j27J53mk74N70k46k91K39J08k39K61r7R3r3K33j39M4j01
7420D4K48m83K74k52Q2q9L29k04j54K31j39J62j42J00k48K99j36lJ69r1j72J64
$$ plain form
7253 -5 11 204 60 -27 198 15 -142 120 43 21 -32 -211 84 -184 -170 3 -25 13 -9 253 -168 159 218 233
7277 233 -112 48 -77 -77 -235 -65 178 -156 107 46 70 124 12 -21 258 -107 -27 -16 93 -113 21 -73 -259
7300 -259 27 71 -3 75 -329 245 106 2 144 -287 -32 74 -154 -69 -95 -118 -8 119 68 61 189 32 -12
7323 -12 15 407 -42 -238 316 -101 103 18 -36 -50 113 103 -6 18 -114 -27 74 -146 -15 -79 84 -168 2
7346 2 236 -90 -93 77 -13 -7 -11 -222 -264 -243 -236 -86 3 -141 25 -74 83 75 -3 6 -17 -149 121 33 -150 289 -98
7373 -98 -7 167 -43 -136 28 -171 228 144 -24 83 4 162 -202 287 -76 -204 -187 -26 -99 163 237 -57 -7
7396 -7 -138 104 53 114 4 -46 -173 -20 -24 -298 272 26 -265 -26 82 -157 104 7 100 7 240 101 145 44
7420 44 292 -191 83 -169 -87 -176 153 -51 -205 26 -113 49 -93 7 -241 58 -78 -81 88 -3 -175 -11
7442a1R1k48J2L39j80Rk43M07k33N3p2J9j4J4m7J52j76J10K24k38J36M6m37M10
7466A23j5j25j62J04l3L40j22M0j60R7J7J56R0m86J26p8J75k21K90q0k84K52K0
7489F4r3r1N1j02K17J37k12n2q9K20j31L2K83rR7m25L69j20l79J5J81lj07O4K26
7514A43l34R7J27K1RN0o0j77J71nk00J74k2j75O6K52k01J14k31K47m3j55M7J83
7538I8j88O6J16j92R9M6N4k00j7K27M8m40L49j34J30p1K9J58m0l2m7J8j01J0k12
7563b26L20j33m0J87j87J98j22J98m7mM0Jj79p1K23j84K55k87K30k31l1J83o8
7586B5R5j70k84M18kj16l8j03J94M8L5j40k3l9m0K78j77j80K80n7J19o4po9QK95
7612B86m11K26j49l0r6K36n0K16k35lQ2j13J44l11J86r5n5k7K24M9p6j00P9P1
$$ plain form
7442 -11 80 -168 -156 183 3 12 -231 176 -57 -4 -76 -57 -71 -57 -104 48 -128 -18 206 -32 104 150 -287 123
7466 123 108 -17 -179 -75 -108 232 110 150 -10 87 104 260 350 -136 -10 -88 87 -134 156 76 -208 44 64
7489 64 -29 -120 -69 -171 46 183 -29 -81 -170 50 -81 -49 234 225 322 -103 266 146 -233 -218 -37 -40 -147 -83 143
7514 143 -191 -94 33 54 63 113 53 -124 47 42 -158 16 -6 -181 -115 137 -64 50 -181 66 23 -132 -85 98
7538 98 -90 -24 92 -100 -1 45 99 -101 -118 109 157 -283 66 -68 62 -9 20 178 138 106 59 77 -24 -14 -226
7563 -226 94 -39 -79 108 -79 119 -3 195 148 144 184 185 6 -65 158 -26 229 -58 172 -59 -90 93 25
7586 25 120 -50 -334 84 82 -34 -72 -175 19 67 102 -38 -61 -100 -140 138 -39 -219 61 4 123 59 52 -17 -9 286
7612 286 -125 101 -48 -78 -174 62 12 228 -7 -10 72 -41 103 -208 -22 -117 -172 -199 25 74 -2 -102 -23 48
7636D8kj90J02k05J03J13J11P9K4l40J26J73j95P4k29M13k25l8j67L63k42J94
7658I0j2k20r4K97j22O5q9l5K79m30M18l68N3m9N1N3L50l15o7J99j38M0J13j31
7682f2l0j6J62p3k39M15j03o5J95j25k9J12j32J16j74j4L53k69J13o6j6j96oK19
7706G0k6n8Q1j71J76j88m8K13j12j65J68j31NK13K6j24j93J92J61Pq9j45K66j09
7730A9k04n5K37j09j3O8Q0N6j30L2RJ19k61J84Q7p3J15l27J90J47l00o0L14J8
7754A43r2l23P5Q0J03q2k8N7J88k81O8J76o9pj84J5K54j61N6P7M6k15R6k8J08
7779G2M2k19J27r4M7Q9K4j12mR8R1n1M0k34n4L74j68N0K7k21PlK0L0J80K8j07
7806G9l92N80o81L11J00q2j25K75k83J71K21k38M1n7J32L3j21K12k82J64p8j09
$$ plain form
7636 48 46 -144 -42 -247 -144 -31 80 159 183 -157 -31 142 -53 21 -208 205 -20 -58 -225 138 -104 90
7658 90 78 -142 -236 61 -61 4 -85 -120 159 -271 147 -221 -168 -217 -166 -113 237 -78 -145 54 -84 -44 69 -62
7682 -62 -92 -108 54 -19 -258 157 54 -11 184 59 30 142 10 126 -48 -62 291 22 135 69 53 -143 -149 70
7706 70 44 -14 67 -104 72 -116 -164 49 -63 -228 -60 -191 -186 27 53 -71 -264 -72 89 96 7 -138 128 19
7730 19 -185 -240 -3 -112 -125 -57 23 79 -51 -19 -10 109 -152 32 119 46 161 -166 24 171 -129 -189 125 143
7754 143 51 -272 -197 -117 -14 -96 -124 -67 121 -160 -92 84 15 8 -176 -161 93 -68 -12 65 111 -104 -8 -36 72
7779 72 114 -105 22 -72 -25 64 88 -24 -28 70 161 110 150 -84 -138 236 68 118 145 -76 -69 -72 -52 -22 158 186 79
7806 79 -313 267 -414 -103 -3 -85 -210 65 -218 -47 174 -64 -23 -80 52 85 -36 176 -106 58 -20 -129
7828a29K16j02rR3j35R5l3M7j39j13K65k21J35J08K31o45J71P6J62r6k56K26J57
7851A04k91J52J75J19m04J46N4J14m1k56l4J41k8P4J41j66n3K14L3l34J86j85
7873a39L72k93j40K55L5k58N40j11k55J8J15m2k79K70j62k2K28k82K01k87J31
7894a05J58L0K25k53k02J4J65P1j28Q2j49K87m7l49K6J01k2J95l02J96R3m44L11
7917d7K06k01j15P1L12j48k93L03r2j33L23k14L32j79p9l19K71J23j60J64j29
7938dK01j95l7K4J51k5j49K16j79q2J22j59j5J95l7m0n3j73K00J03j53J92p4K2
7962E1o4J00j43R7j54QJ20J81m74J22K46j16J62p3P9k07R7J63k8q2OK1k62j45
7986b95L67j30kk07K69q8j02J26K8j55K75k69J23K84j52K90m00J46l25L86K6j7
$$ plain form
7828 -129 87 -15 -24 69 -66 29 -4 43 -96 -209 56 -165 -30 78 309 -336 -165 -89 73 -23 -279 -53 104
7851 104 -187 -35 140 259 -145 1 55 169 128 -128 -162 -21 -49 25 166 0 -53 161 194 -140 46 -139
7873 -139 233 -60 -200 55 90 -168 372 261 6 24 139 97 -182 88 -74 -96 132 -150 51 -236 -105
7894 -105 53 83 308 55 -147 -133 32 103 -25 57 -92 195 148 -201 -175 -74 -96 99 -203 -7 86 -358 -47
7917 -47 159 -42 -157 -86 226 78 -215 88 -4 -137 186 -28 304 125 46 -273 -2 121 -39 125 -4
7938 -4 197 2 -35 -11 140 115 -34 182 3 -79 43 -116 -131 64 27 -13 -66 -239 -39 64 -89 103 29 51
7962 51 -13 87 -56 41 -113 -105 15 196 -278 -156 90 -26 136 63 142 -65 32 195 167 85 91 112 -150 -295
7986 -295 72 -58 -60 -267 2 -86 -188 -62 -34 -189 86 -183 -60 224 72 362 -38 108 -217 169 195 178
8008A78l09pJ84n1K36j86J9Qj6K3k37L27k20r3J43L7j30J1q3K07j47Q2K07k24
8032d1J09o8n1K00m2r5Ml7J32j30j84J70K8j09jO3K08lj07j30l0J42oQ5k84M06
8058B29k80P4M1j40O9J9j23J77j15n9lk27K85J79k8k23J91j86J52N0p4k05K23
8081B6j29Q4k7j67L28K15n92J08m6Q5J70K0N1K7l42K14j25J1K64j9r0j29j3R4
8105A8l33K21P1n9J10k97J71L12j38o7K05m90J55JL37l45L14j78j01J05m4j5J97
8128A50k69J22J14L4j73N4j05m3R1P8r4J62M9j7r4l45K44j1j07L16N4l59K36q6
8152AMj82L19r4KN6q3k68J91J67L3k57J27K84l51P6k2j42J80J09k30k4L59L2l56
8177f9J42m5l5pm1QJ55l82K92j68n7J17pK8
$$ plain form
8008 178 -131 -138 46 -5 231 45 64 72 56 79 -158 169 -51 -144 -1 36 -94 -83 -166 41 -106 -24 183 -41
8032 -41 68 0 -51 149 107 12 16 -21 111 -19 -203 -33 -5 -114 -115 -52 156 153 46 -84 -114 28 22 107 -177 229
8058 229 -51 23 64 -76 -7 12 -111 66 -49 -108 -111 -338 -53 126 98 -125 66 -120 32 82 8 -197 26
8081 26 -103 -19 -46 -213 115 330 -262 -154 -200 -115 55 75 126 153 -189 25 -100 -89 175 156 66 -63 -76 18
8105 18 -315 -94 -23 -82 28 -269 -98 214 76 9 214 -276 -121 -120 217 -128 186 8 -93 12 -32 -47 150
8128 150 -119 3 117 151 -22 32 -73 -116 -25 53 -41 121 170 153 59 -286 -42 -53 -160 156 210 -149 87 1
8152 1 5 -177 142 48 50 106 23 -245 -54 113 146 -111 16 300 -51 25 3 -139 41 150 -80 -104 255 287 -69
8177 -69 73 28 -7 -14 -55 -47 108 -274 18 -150 -207 -90 -97 -69
8191f9
$$ Imaginary data points
##PAGE= N=2
##DATA TABLE= (X++(I..I)), XYDATA
0@%%%%%%%%%%%%%qJ6j6J6k4L2l2M0m8N6o8P7q9J06j26J45j67J91k17K48k82L21
35A71l63M08m58N14n77O42p12P91q78R75j079J194j318J453j604J770j952K150
53A127k374K626k905L223l591M016m516N111n840O765p973R632j2069J6021k3505
68a4252M2431j74789k77052N68532J64083m64106N6441J73260n0161o4866n560
79d6039q228J65396M3843l77348P4125L20418m1237l00458J70128R2562j58661
90f5499j4992J07433M6684m2011n3811j20094J62990O7207r3465Q587M5417j76152
102a27706J8084K89251j06451j75651P2647O0455j16249J31925N8289j42296M995
113c2707K2156p2824J10436J82177k72075j34213K65337O2953k35058Q3607J56409
$$ plain form
0 0 0 0 0 0 0 0 0 0 0 0 0 0 0 -8 8 -8 8 -16 16 -16 24 -24 32 -36 41 -48 58 -68 77 -90 101 -116 132 -150 171
35 171 -192 216 -242 272 -305 337 -375 416 -462 513 -566 628 -690 763 -841 929 -1023 1127
53 1127 -1247 1379 -1526 1697 -1894 2122 -2394 2717 -3123 3642 -4331 5301 -6768 9253 -14252
68 -14252 28179 -146610 -423662 144870 308953 -155153 -98712 74548 24387 -40479 -46039
79 -46039 -54267 111129 154972 -222376 -148251 172167 130930 -169528 600 93162 -65499
90 -65499 -80491 26942 73626 31615 -22196 -142290 20700 87907 -5558 3029 48446 -127706
102 -127706 -109622 179629 73178 -102473 -29826 30629 -85620 46305 104594 -37702 -32707
113 -32707 -10551 -83375 27061 209238 -62837 -197050 68287 131240 -103818 -20211 136198
124A36198j77703n5036J22136K2353m3213L9214q8942l988J07398n3258n6891
135e1732J18063M825j76071N7808J18324l3596n2143K9026k5596k2981K7697J6444
147A0068O5147k9464j46681q43K07063j0430j63954L9790P7746q1977k0523J08460
159E4402l292m5999m6457m1035Q8640J19923j17764j25951J32749N1334j22851
170e6301J7178J22291n4980q9483K0811L7119L5592J2989o2585l9855O6062K954
182A1792l9126M6316K7146p4718k4324N2958J0247J2474M753n3865k8066N6652
194B239K3604j3597K883l1737k1874L8871J9655k4303K7566k502p3188P920Q4643
207D0180M517n3548m724m422J369L0660R784j7612L343k1557l7194N3476O0536
$$ plain form
124 136198 -41505 -96541 25595 47948 4735 43949 -44993 -48981 58417 5159 -51732
135 -51732 66331 71156 -104915 -47107 71217 37621 -14522 14504 -11092 -34073 -6376 10068
147 10068 75215 45751 -100930 -101773 105290 94860 -69094 -29304 48442 -33535 -54058 54402
159 54402 51110 5111 -41346 -82381 6259 126182 8418 -117533 15216 66550 -56301
170 -56301 -39123 83168 28188 -61295 -40484 -3365 32227 45216 -17369 -57224 8838 11792
182 11792 -27334 18982 46128 -28590 -52914 44 10291 22765 27518 -26347 -54413 2239
194 2239 25843 12246 15129 -16608 -38482 389 20044 -4259 23307 20805 -52383 -44463 40180
207 40180 44697 -8851 -13575 -17997 -16628 14032 23816 6204 9547 -12010 -49204 4272 64808
220F4808m5405n9714K4522J9045k023K1110J513k8879j4792L864J4629L9027q828
233B8877n2323l614L6252k390n456K2592j5190l0891N778K3765O655N603j5757
246C901k4061R399J5617j623J1081Q777l7892j9340L2261K4888o637q774j9337
259a1740j7991K2796K7254j438j4487j6462j8281J9128L5093m096k3855r892m794
272a8765O162K9733M620k7188j3858P908O907J1072O726j4428r509J110N01Q656
286c53J6499r899k0356L439Q834j162O103R695j3134j3373P75J0781J4217L529
300A5595j8692j4593J0902R675M032N846o568k1551q02K0131J2139l113j3244
313b43j3013J911J6962P713l071o924j1802m845J5257J4450o066j1005n659q83
$$ plain form
220 64808 19403 -40311 -15789 3256 1233 22343 23856 -5023 -19815 -15951 -1322 37705 28877
233 28877 -23446 -27060 9192 6802 1346 23938 8748 -22143 -16365 7400 14055 19658 3901
246 3901 -20160 -10761 4856 3233 14314 23091 -14801 -34141 -1880 23008 16371 7597 -11740
259 -11740 -29731 -6935 20319 18881 4394 -12068 -30349 -11221 23872 19776 -4079 -13971 -18765
272 -18765 -12603 17130 21750 -5438 -19296 -11388 -4481 6591 13317 -1111 -10620 -9510 -9009 -353
286 -353 16146 6247 -14109 -10670 -1836 -2998 3105 12800 -334 -13707 -12932 -2151 12066 15595
300 15595 -3097 -17690 -6788 2887 6919 12765 6197 -15354 -16156 3975 16114 13001 -243
313 -243 -13256 -11345 5617 13330 10259 3335 -8467 -13312 1945 16395 10329 -676 -6335 -7218
327g218O856J2189l46r661o652l124O984J1796J270j0793o142p98K442R321O700
342A2824p939j1637r45N480P217M440m433r324l760K690O663P854j916j1905o487
357a1178N823P409N036l55r174r216K692J0864O919k314j1137q100L737J0903
371A909N651k186q727r048K417J1689P475n627r468l960L456P691M327k439o497
386c337m552J399P595N518l797o411j653J723L108L655R56l210m922j572L791
401a709O005J597m284m388j343K396M967M088l201p699k040N122O233J283l635
416C392n792k036M158O103K115m295o485j621N392N011k72l792l186j071K123
431b56L813K072k770m590j069L471K681n04j207j377j894m88K936K782p83l626
$$ plain form
327 -7218 -362 11827 11481 1820 -4832 -7956 -972 10824 12094 1301 -4841 -5639 -3197 6124 12824
342 12824 4885 -6752 -7697 -2217 5000 9440 5007 -4317 -8077 -5387 1276 9130 7214 -4691 -11178
357 -11178 -5355 2054 7090 6735 -2439 -11655 -8963 1901 8820 6506 -4631 -12731 -8994 1909
371 1909 7560 5374 -3353 -12401 -9984 1705 9180 3553 -5915 -9875 -6419 1272 5599 3160 -3337
386 -3337 -7889 -6490 1105 6623 2826 -3585 -5238 -3515 -407 3248 4204 994 -3928 -5500 -1709
401 -1709 4296 5893 1609 -2779 -4122 -1726 3241 7329 4128 -3571 -5611 -489 5744 7027 3392
416 3392 -2400 -4436 -278 5825 7940 3645 -2840 -4461 931 5942 5670 1878 -1308 -2379 -256
431 -256 3557 5629 2859 -1731 -2800 671 3352 2848 1641 264 -1630 -2118 818 3600 2817 -809
447h09k511J339L145Q45r56j330j282j938J026L791J929m142l527Q78K466J378
463C02P40j286k517j344J394L045J484j838l434j394K105L553J001k057l226r64
479d436J840L777J200k951k963J46J706K220J591j689k819r97K252L087k80k559
495h75p14J090J076J69k06Q45M34k011j087J836K022j68j769o71N90J68K38J833
513B800P24k582l263J843L683J791k790m022N03L127K176j223k077j230N43R44
529I47J792N27k173l145O88L319J402j895k700k68J837J384p69j193k99O98j95
546d3j133P81J006j089r80O87n1K21Q7l89k57P21p31q51J107J605j195k587K08
565b883K645M53j527p25J04O49M11l10j27O52o72n34O66J442o07r79m12J539N83
$$ plain form
447 -809 -3320 -1981 1164 2009 1053 -277 -1559 -3497 -2471 1320 3249 -893 -4420 -3542 -1076 302
463 302 1042 -244 -2761 -4105 -2711 334 1818 -20 -3454 -4848 -2743 810 1811 -246 -3472 -4436
479 -4436 -2596 1181 2381 -570 -3533 -3387 -1681 539 2130 441 -2378 -3375 -1123 1964 1684 -875
495 -875 -1589 -499 577 746 540 1385 1819 -192 -1279 557 2579 2411 642 -29 561 729 967 2800
513 2800 3524 942 -2321 -478 3205 4996 2206 -1816 -1313 1814 3990 2767 690 -540 3 947
529 947 2739 3266 1093 -2052 -1364 1955 3357 1462 -1238 -1506 331 1715 946 -247 -546 152 -43
546 -43 -1176 -395 611 -478 -1458 -771 -822 -601 -514 -903 -1160 -439 -1170 -2021 -914 691 -504 -3091 -2883
565 -2883 -238 215 -1312 -2037 -1933 -1284 -873 -1183 -1310 -658 -1330 -1864 -1198 244 -363 -1342 -1754 -215 368
584C68j131j37Q53l93NL34k03M72Q27p57j048P03R01j18l23K09K96k13k62O96
604A079l28N94M39j323n16J688O33j364j96O97M5l66r3J008j11j836k70J292J128
623B200K4j787j278J385J352q00n23K94n31l17L92O56l27r31m07O93O57l56m88
642i2j006K64J041o51o15M67O15j021j71m9M53M37m78m64p1j94O22N63o25m7n14
663a536M8N44R38j063q64K91Q53N68j47r00n56O08R52O39q41l00n12M79R31M28
683E60p84p25L87O14O30jq62l84R22L39K23L5o38k60L64O42j43N3n41K20M28k27
705H52J34k88L74L01k26m79O8L6N78K3k29l45k90M10L62R0p45m14M33M74j18l54
727F47n50l21N20J48M78p28n97l0L23N82k61p07k79N25J39k67J33l35l62lN33
$$ plain form
584 368 -763 -900 -47 -440 -435 -101 -304 168 995 238 -810 -107 794 676 353 562 858 645 383 1079
604 1079 751 1345 1784 461 -55 1633 2266 902 706 1403 1448 1082 989 1997 1886 50 -220 1072 2200
623 2200 2224 437 -841 544 1896 1096 573 867 336 19 411 1067 740 -191 -598 95 752 396 -92
642 -92 -1098 -834 207 -444 -1059 -592 23 -998 -1169 -1218 -765 -328 -806 -1270 -1341 -1535 -913 -350 -975 -1022 -1536
663 -1536 -1488 -944 -6 -1069 -1933 -1642 -789 -221 -368 -1268 -1824 -1216 -264 375 -466 -766 -1278 -799 132 560
683 560 -224 -949 -562 52 682 681 -181 -565 357 696 919 954 316 56 420 1062 919 972 431 651 1079 852
705 852 986 698 1072 1373 1147 668 736 772 1350 1373 1144 799 509 919 1281 1371 626 212 645 1119 1001 647
727 647 97 -224 296 444 922 194 -403 -433 -110 472 211 -496 -775 -250 -111 -378 -245 -580 -942 -945 -412
748d12M4k86j02l60K81N0l04K57j60K48m10K8L5M67l1j74j50M4j30O79j47K68
770b65j034M07M36K05J72j29m62J44M63K20K20o18l48J42R05K72J6l36o79j10
790c79N38J115n1r41k15K70L01O16J56n17m75k1N42O06j66q63j36nN20M91j91
811A195l10o01M8M61J34K03m88n38k18O42M85n65j96j31l20J35O84P8n87n58k78
832g25J28Q73M72n25q22n95N84N82K25l83j105j00L93R95Ln57q93J39P12N17K22
853A40r65n79R6M93O68k00k11n44k02O68L97K2k73Oj79j25K53M45K80k37m28l80
875h55N56O92j09n61j37L2M42O41O1n99m92P9P03R14l16p59m42K21P66L61k29
896I69j85n53J09O06R3M6p64n0L60K49N3rj32m94K9J92K15M2j91l09l44J97L87
$$ plain form
748 -412 -368 -654 -756 -1116 -835 -785 -1089 -832 -992 -744 -1154 -1126 -1091 -624 -655 -829 -979 -935 -1065 -386 -533 -265
770 -265 -1299 -892 -456 -251 -79 -208 -670 -526 -63 157 377 -241 -589 -447 458 730 746 410 -269 -379
790 -379 159 1274 1223 282 67 337 638 1254 1410 893 418 397 939 1545 1379 516 380 375 895 1386 1195
811 1195 885 284 332 793 927 1130 642 104 -114 528 1013 448 252 121 -199 -64 620 698 111 -447 -725
832 -725 -597 276 748 223 -599 -1194 -610 -28 197 -186 -1291 -1391 -998 -3 0 -557 -1450 -1311 -599 -82 140
853 140 -825 -1404 -1308 -815 -147 -347 -558 -1102 -1304 -636 -239 -217 -490 -484 -663 -788 -535 -90 190 -47 -475 -855
875 -855 -299 393 284 -277 -414 -382 60 701 762 163 -329 -250 453 1367 1051 292 -150 71 837 1198 969
896 969 784 231 340 946 1039 1085 321 271 631 880 933 924 792 298 327 519 734 776 585 276 -68 129 516
919E16L33k22q29j90J37N38K12n87p5m17J05L72L42l74l83q3mM92m1k22l91J13
941f58N9o7M92L5l04n72j30N06O69k90l83j97k63O10N08j46m12m48j00R09N07
962C25k77n61l72L14O70K73K9p43l79N71L77j55o4K56l98J55Q8L71J11n52j5K78
984C02m3M06o1n2J55m00p5L58P92l1j290K02K14N28j43k35k06l05L24J33L70m45
1006D98k88J94k61Q45n38n12L45J52j71r4J87j17k84q0K72j21l80M08J21n01o6
1027c91J86R1j09o1o7m88M18K46Rk16k60k90J24M72J60p79M4N84n5m66J66K14
1049d68k7J26p0N1L2j04j22M59k78p2M3Q2K59j92lL03O4kk35K20k60L0M22J05
1073C63m03K92n7R5j04mL00j51L02j77j04r0L33o5k03J68k47Q6L20L99m89n21
$$ plain form
919 516 849 627 -202 -392 -255 283 495 -92 -167 -584 -479 -107 235 -139 -522 -605 -609 -117 -158 -380 -771 -658
941 -658 -599 -666 -174 -139 -443 -1015 -1145 -639 30 -260 -643 -840 -1103 -493 15 -131 -543 -991 -1091 -182 325
962 325 48 -513 -885 -571 99 372 401 -342 -721 -150 227 72 8 264 -134 21 109 480 591 39 24 302
984 302 259 665 604 552 707 307 232 590 1382 1351 61 263 477 1005 862 627 421 116 440 573 943 498
1006 498 210 404 143 988 450 -62 283 435 264 170 357 240 -44 -124 148 27 -353 55 176 -325 -391
1027 -391 -205 -114 -223 -284 -351 -839 -421 -175 -166 -382 -642 -932 -808 -336 -176 -955 -911 -327 -382 -848 -682 -468
1049 -468 -495 -369 -439 -388 -356 -460 -582 -123 -401 -473 -430 -348 -89 -281 -284 19 83 81 -154 66 -194 -164 258 363
1073 363 -40 252 195 290 186 182 482 331 633 456 352 262 595 530 327 495 248 334 654 1053 564 43
1095D3K14M57K0j61k43p9J75L7L99n55Q1l50N5L60o1qm26k3O8j30m5L66q7k00
1119i3m3j01j00L94j3j10m53j33L72J17l8k30k31l6L73L19m05m08M8J60L81K46
1141A6l20k41j24L23j47L30j38R0k63j85N36P9R0l67J02k58L7N45j21q4m16j09
1163f25N51O30j45l09n18p9N37N76K8m34o89K68N35R2J46m18j46J19L92K27j70
1184E68l82j02O1K51J7L73k43l37k15K55K47M46k47n11m45k7O91M35j9q73l91
1205d48O3P68L20j88p52m62L71P18K43o52l84m03O60K63O7j22o21j88L92L21n0
1226h4J0l44l6j74K28K73K24j23n62l27L81M88K01l34p46rM57R48J7p46o38J66
1248g30O63M33Op15m07P4R01O8J39p23j78L27L86l7K49m53J2J79j43O0K64L39
$$ plain form
1095 43 257 714 734 573 330 251 426 463 862 307 388 38 93 453 392 384 -42 -65 3 -127 -172 194 107 -93
1119 -93 -136 -237 -337 57 44 -66 -519 -652 -280 -163 -201 -431 -662 -698 -325 -6 -411 -819 -771 -611 -230 16
1141 16 -304 -545 -669 -346 -493 -163 -301 -211 -474 -659 -123 -44 46 -321 -219 -477 -440 105 -16 -100 -516 -625
1163 -625 -74 556 411 102 -416 -495 42 618 646 212 -477 -209 326 418 564 146 0 119 511 738 568
1184 568 186 84 145 396 413 786 543 206 -9 246 493 939 692 181 -264 -291 400 835 816 -57 -448
1205 -448 -385 383 703 515 -237 -699 -328 390 633 -19 -403 -806 -146 117 184 62 -559 -747 -355 -34 -84
1226 -84 -74 -418 -454 -628 -400 -127 97 -26 -588 -915 -534 -46 155 -179 -925 -934 -477 471 488 -258 -896 -730
1248 -730 -67 366 372 -343 -750 -676 225 293 432 -291 -469 -142 244 207 456 3 15 194 51 111 375 714
1270G14p28j76q6O73N68M1r80n34J07P96O27J5j046o78L84J070M69p27o17n56
1290f64Q44O17J88p66q71J50O74L37L30n02p08J5K03J80M20l23J3l18q4M9L04
1311H8O24o11o52k88N95O44K97p86o79k04P75P35n9n94q46k4P75P53j26q60l55
1332g98R5N22M90l7o32n50J98M59P11l59j02l48j64J74O42Q6j96l74o58P48L66
1353B73K03r5o37l85M43M51Q81n85r98l75M62J053M35o75q02M2K67O99J05m11
1373C51p41J05J67N92J71l96m61p6K97M96r3J98m34q7k34J53P66n1o80k44m59
1394f60R76N48j27r22k05k9K35P48J81q59m97N5N36P29k39q49o76N84L89L65k28
1415E5o61k47K66N55K56P5o27l1j96J76M87o5p0n63R5M9O96R6l48m57k15M51M93
$$ plain form
1270 714 -14 -190 -276 397 965 1006 26 -508 -401 395 1022 1037 -9 -687 -303 767 1236 509 -108 -664
1290 -664 180 797 985 219 -652 -502 172 509 839 337 -371 -356 -153 27 447 124 137 -181 -265 -216 88
1311 88 712 101 -551 -839 -244 400 697 -89 -768 -972 -197 538 479 -115 -961 -985 -210 543 417 -443 -798
1332 -798 -703 -181 309 272 -360 -910 -712 -253 458 99 -3 -351 -515 -341 301 387 191 -183 -841 -93 273
1353 273 476 381 -256 -641 -198 253 1134 549 -449 -824 -362 691 1126 451 -351 -309 -42 657 762 351
1373 351 -390 -285 -118 474 645 249 -212 -288 9 505 412 610 176 89 -145 8 774 723 43 -201 -660
1394 -660 316 864 737 -185 -390 -419 -184 564 745 -114 -611 -556 -20 709 470 -379 -1055 -471 -82 283 55
1415 55 -606 -853 -587 -32 224 299 -328 -359 -555 -379 108 43 -27 -590 -495 -446 250 346 -2 -459 -674 -223 270
1438B70K13l39n08k89N72M13K30l59o96k08N07M62K62m88l37k6J42M84J23k69
1458A59l74j59K33N12O5%m23m88L80M37M0K34j026J52M17L08L07N6n79q39N65
1479b3J50O54l53n04m55M14N57J86rp95n83P44K87M44k64o22j86R7N27K25m42
1500D9k81n06J8P17L6j61J66l07j38J91M07k29J02o97l49Q71M22j89j64l67k45
1521f54K64Q25k5k48p96p3M21M93K82k46n42k45K18N01L8j7p16K39Q4N60j21j17
1543A25n94p1M29K57J27p3n80j90N99K98J29l39l69K38l41N78M05m93l13j08L40
1564E4K83K43l58k38j58q9M33L30j65j51n78J39M57K81n9m35k75J9N53J98k41
1585B43l29j37j28M33L59l19L6n01j16P10J29k00o24R9j02K16M25R0j6p23j50
$$ plain form
1438 270 483 144 -364 -653 -81 332 562 203 -493 -701 -194 268 530 42 -295 -321 -179 305 428 159
1458 159 -215 -374 -141 371 436 436 13 -475 -95 342 382 616 -410 -258 159 467 774 830 251 -588 -23
1479 -23 127 781 428 -76 -531 -117 440 626 617 -178 -761 -17 270 714 450 -172 -358 -261 266 491 49
1500 49 -232 -738 -720 -3 33 -128 38 -269 -407 -216 191 -38 64 -633 -982 -111 311 122 -42 -409 -654
1521 -654 -390 435 410 162 -634 -707 -286 207 489 243 -299 -544 -326 175 213 196 -520 -281 -197 363 242 125
1543 125 -469 -540 -111 146 273 200 -380 -570 29 327 456 117 -252 -14 -355 223 628 135 -178 -286 54
1564 54 337 580 222 -16 -174 -263 170 500 335 184 -394 -255 202 483 424 -11 -286 -267 286 484 243
1585 243 -86 -223 -351 82 441 122 158 -343 -459 251 380 180 -444 -345 -447 -231 194 284 268 -455 -605
1606f05N22J52M58l24l86k16M4M84K00l65m7m93M59L74O3l60l62j96M79K13Q1
1627A75k11l59J00K17K83qk61l42M84j55J62K08j42m24L79l52Q0K72J86m00K35
1648A27j02j88N76l4l75l0m02M98M26ol71n01K50J75L92j1j49n62J08M01J73k06
1670A89j52l84J73K70N8J6k04J23j9J09p3Q6k07L6j5k18J51L85K5m04l12K59O5
1693d3K61q5n23j94M84J53N5Q3m02j59J77L96l20L3J72k88J96J49j28j77j47Q0
1715b27J91j93L06J93l37J04q5k07K67q0M95n22k36L85P8P0k7m10J9K44J61L8
1737B27k01k02j49M94J27rk34k15J92O8K53k10j41j26j58K91K82j7k74K23M5j44
1759A22j71L90kk78j65K86k90Q6R7nk06q5o9M05o6q6j15O7O8J73J68m69o4L44
$$ plain form
1606 -605 -83 69 527 203 -183 -399 -355 129 329 -36 -83 -576 -117 257 320 -40 -402 -598 -119 94 175
1627 175 -36 -395 -295 -78 205 197 -64 -406 78 -77 85 293 151 -273 106 -246 -166 106 292 -108 127
1648 127 25 -163 413 379 4 -26 -428 70 496 490 119 -382 -132 43 435 424 275 -287 -179 222 395 189
1670 189 37 -347 -174 96 154 170 -34 89 70 179 106 192 -15 21 6 -212 -61 324 349 -55 -367 -108 -43
1693 -43 218 133 -390 -584 -100 53 108 191 -211 -370 -193 203 -117 -84 88 -200 -4 145 17 -160 -307 -227
1715 -227 -36 -229 77 270 -67 37 -48 -255 12 -68 427 -95 -331 54 132 202 175 -235 -216 28 189 227
1737 227 26 -176 -325 169 296 287 53 -162 30 98 351 141 0 -126 -284 7 289 272 -2 221 266 122
1759 122 -49 341 339 61 -104 182 -108 -22 75 70 -136 -221 -290 115 49 -37 -152 -85 -17 156 324 -145 -209 135
1783A35k50L19k65k11J97q7J19p5l2J61j99K8J87j01n3J92p9l48O1K53J75n5K0
1806I2j77NJ01R9J19k39l03J91K33O8k49M4q0r0L23k48J77j12j32K21or0J84p
1830A24r1J0JRM3on3j6kj00M4K57l39J70l4L8L10k26J79l49j17L70m2k35pL3k47
1857b76N08j36L3n9k90J48K6L52j85k53ok1K21j10j58K51j19k65M04N0j38o3j62
1880b48N2L59n9m9J18m62k76O70k19K34p5k93J21L48l40J67r4j51L33o9j56R8
1902Ij51L79l67l18O68j42M2J4j77k2n5K91k4k1j21j70K47J02J35m5k32k24M19
1925B37p1j89J36k48J8K00m2J60j22k86Q4K62J55j42J5l80J0L77j00J62j21j89
1947g4J05k05K41L5p1j5r7m70L70M97k64j97J4j14K95N6j10j30j25K65j51L80
$$ plain form
1783 135 -115 204 -61 -272 -75 -162 -43 -118 -150 11 -188 -160 27 -74 -127 65 -14 -362 -301 -48 127 72 92
1806 92 -85 -80 21 120 239 0 -303 -112 121 189 -60 -16 -96 -186 137 -111 66 -46 -178 43 37 -53 131 124
1830 124 33 43 44 53 96 90 37 21 19 -81 -37 220 -119 51 17 55 365 139 318 -31 -148 222 180 -55 -62 -29 -276
1857 -276 232 96 129 70 -220 -72 -46 306 121 -132 -138 -159 62 -48 -206 45 -74 -339 65 115 -23 -86 -248
1880 -248 -196 163 104 55 173 -289 -565 105 -114 120 45 -248 -127 221 -119 48 -46 -197 136 67 -89 9
1902 9 -142 237 -130 -448 220 78 120 134 -43 -65 -120 171 147 126 5 -165 82 184 319 274 42 -182 237
1925 237 166 -23 113 -135 -117 83 41 201 79 -207 -123 139 294 152 167 -213 -203 174 74 236 115 -74
1947 -74 31 -174 67 102 31 16 -81 -551 -181 316 52 -145 -131 -245 50 106 -4 -134 -259 6 -145 235
1969B35l94M8j8O9J62lL9l10K98l54m2O11l00Q9k6k32Q7K11k18j4k41RL45N05
1993E56m67Kk12J24M1J62k83K28k26K1oL66Q8k21j02l39L66j55M47l72Pp5j58
2016b08K77J16p3j80L2J97k05M19j48k36KJ56p1J86L1k93j3Mk7K88q2l5m15L42
2040F4j59N13l65l4j79J23k0J15O3k36O8j18J08L24l18rk19j74L88J28o9M7m8
2063gp7l20L72j70r8Q2J40kr1RK78k10j5kj3J34J2n4j96J51k73N17k03j06j25
2088b67rL50L01m60O0J9K7n0L11q4j51k06K62j8L7j3n0R6k95j05M63k6n7q6k33
2113a84L57rk5n9P8m01M01L5j09m5K9k46K26L06n7k08l76R7L21J8l0k14K07p8
2137C4k60M67k39j15l9o0J45P3O6k7j72o9L05j64R4J04r3k36j1J15J11k0r8r8
$$ plain form
1969 235 -159 -111 -129 -60 102 99 138 -172 126 -228 -270 341 41 130 104 -128 -41 170 -48 -62 -303 -294 51 556
1993 556 89 91 -121 3 44 206 -77 151 -75 -54 -60 306 394 173 71 -268 98 -57 390 18 25 -50 -208
2016 -208 69 185 112 -68 -36 161 -44 375 227 -9 -7 149 78 264 295 2 -11 -7 -34 254 172 137 -278 64
2040 64 -95 418 53 19 -160 -37 -57 58 121 -115 -47 -165 -57 267 -51 -60 -279 -453 -65 63 -6 41 -7
2063 -7 -84 -404 -32 -202 -300 -218 -78 -80 -171 -162 116 -94 -109 -111 -124 10 22 -32 -228 -77 -350 167 -36 -142 -267
2088 -267 -276 74 375 -85 -25 -6 21 -29 282 198 47 -159 103 85 122 109 59 155 -140 -245 218 192 135 49 -184
2113 -184 173 164 139 80 158 -243 158 193 84 39 68 -178 48 354 297 89 -287 -190 131 149 119 -95 112 34
2137 34 -226 241 2 -113 -152 -212 -67 6 72 45 -127 -196 109 -55 39 143 50 -186 -197 -82 29 9 -89 -187
2161a87j98M30O7Rl63j5L7L96j13j49j52m8K81R9p6p0K20l68K81k21O7R8M05o22
2185a92N7n7J39K56Q3nl40J3J28N3o1Q3k63K41p1j2n7K45l43K35K92k31l1k90
2209a28j07Q6K36M5K13j97j58J81j13K33j08m24K56J66l07J83K6Qj44j67J16K17
2231A13j09Q0j90m5O4O5J80k84J17k11J9L20p4j05j94q8K70J86m52L44jk95M2
2254b48J46K39Q7m84RJ9J31J11r4L06j83j73k34K08K04k6k09q8K44K75L8k57l36
2277c15M8K39J90j24q9j33j37L66K47R9l87m8J12K34Q2j66l16K00j55J47J26q0
2299A40J86k80r7j5L4K35Q5k74ml44K11L22k16K59m55j2O8L26J29k09j55m9K49
2322A34L1m6k12J67j49J8K08p8l41n5k6L26J10l7K71o57m5J61P1N8M48o17K1l2
$$ plain form
2161 -187 -385 45 112 121 -242 -257 -220 176 63 -86 -238 -286 -5 94 18 -52 168 -200 81 -140 -73 25 430 -192
2185 -192 -135 -192 -53 203 286 281 -59 -46 82 135 74 157 -106 135 64 52 -5 240 -103 132 424 193 162 -128
2209 -128 -235 -149 87 132 345 148 -10 171 58 291 183 -241 15 181 -126 57 83 91 -53 -220 -104 113
2231 113 4 84 -106 -151 -87 -22 158 -126 -9 -220 -201 119 45 -60 -254 -342 -72 114 -338 6 5 -290 -248
2254 -248 -102 137 224 -260 -251 -232 -101 10 -84 222 39 -134 -368 -160 44 18 -191 -279 -35 240 278 21 -315
2277 -315 -267 -28 162 38 -51 -184 -321 45 292 391 4 -44 68 302 384 218 -98 102 -53 94 220 140
2299 140 326 46 -51 -66 -32 203 288 14 10 -334 -123 199 -17 242 -213 -225 -157 169 298 89 -66 -115 134
2322 134 165 119 -93 74 -75 -57 151 73 -268 -323 -349 -23 87 50 321 -336 -381 -220 -149 -91 357 -260 -239 -271
2346b71J38K21Q5l58j42J1L31J51k0k24l55L39O4J03Q7n40P5K76M1J27j25j40
2368a26J05k76J53K23J42l69J52Nk9O0p4K62l87j57L85j15K75j25j61k1p4N60
2390D08j55n8k55P0Q6J92Q5Lk91j06m2J48L14j13n93L33OL60mll57j44R4Q4L27
2415C89m0m89M4Q2K15%k64j34p3J11m7Q6J78n5m00K36J0p4K47k46j55K13m7L03
2439I0r0o2p5l2l57O63k2k26k09L2J3K64K8J27l71j84K20L34J24k03q1l29J98
2462a48L57K19m32k56L09r5J21L88k99m20J46Q1M3L8K27k45o9j01L65j33P1L43
2484E10p46L50Q3J09M1j35l50J10J52P0j7R5k49lK12j81K45k57j5q0K31K11j79
2507B07l16J09l44M06q2kJ99l36j18M16q1K58k57l41n9J34L50K07j79k98l41K99
$$ plain form
2346 -271 -133 88 173 -185 -327 -316 15 166 146 -78 -433 -94 -30 73 160 -380 -305 -29 12 139 14 -126
2368 -126 -21 -297 -144 79 221 -148 4 9 -20 40 -34 228 -159 -316 69 -46 229 104 -57 -78 -152 408
2390 408 253 195 -60 10 96 288 373 376 85 -21 -63 85 399 286 -307 26 32 392 388 385 28 -116 -22 62 389
2415 389 349 -140 -96 -14 201 201 -63 -197 -270 -159 -206 -120 58 3 -397 -161 -151 -225 22 -224 -379 -166 -213 90
2439 90 0 -62 -137 -169 -526 137 115 -111 -320 -288 -275 -11 17 144 -227 -411 -191 143 267 64 -17 -346 -148
2462 -148 209 428 -4 -260 49 -46 75 463 164 -256 -110 -29 14 52 279 34 -35 -136 229 96 167 510
2484 510 -236 114 197 306 347 212 -138 -28 124 194 177 272 23 20 232 51 296 39 24 -56 175 386 207
2507 207 -109 0 -344 62 -20 -22 177 -159 -277 139 58 316 59 -282 -341 -207 143 350 171 -127 -468 -169
2529a69K12K16l09j48l41M15L20j44Nk69l2N2J49K24o8m22K2K43j01K05K24n09
2551b25R4j47L60K04m7l20k3j42K79j83K93j26k49j10K70K77qj5l45l3M04j6J00
2574B92m23J62r1O9K34J10j44k81L6j64L62K23k05j71r4P0J46J86m2l81j91M80
2596A83N5O7O1l72l31j5M83n3Kk27k15K69L43r5j70p1l01M68J67l7P1l66j2R4
2620bk26R8Q8k70O0J65j31J28n8J30j52Qk86K70K82l21J20m2j18L56j77J5j94
2643b57MP7J94L55j02l76l39M10J08m8l28J54j08J17L53O5j5p49M39l1J79M9l
2666A48J18m46L71J76j11p0k42K17J7L0k46K72O2l40o5K63r9K00l75j05K56kj
2689B8J29j4k35K22j94K45J03m38Q2M8j93L02R2J9j50Q8k50M70k86J48l2m48M5
$$ plain form
2529 -169 43 259 -50 -198 -539 -124 196 52 57 -212 -244 -192 -43 181 113 -309 -287 -44 -145 60 284 -225
2551 -225 -131 -278 82 286 239 -81 -104 -246 33 -150 143 17 -232 -342 -72 205 197 182 -163 -196 208 192 292
2574 292 -131 31 -60 9 243 353 209 -72 -36 -200 162 385 180 9 -85 -15 131 317 275 -106 -297 183
2596 183 238 305 366 -6 -337 -352 131 78 80 -147 -362 -93 250 155 -15 -86 -387 81 248 211 282 -84 -96 -2
2620 -2 -228 -130 -42 -312 -252 -87 -218 -90 -148 -18 -170 -162 -448 -178 104 -217 -97 -139 -257 99 -78 -63 -257
2643 -257 -253 -176 18 373 271 -105 -444 -34 74 26 -302 -148 -256 -139 214 279 264 -485 -46 -77 102 151 148
2666 148 266 -180 191 367 256 186 -56 161 178 208 -38 234 296 -44 -109 154 55 255 -120 -225 31 29 28
2689 28 157 143 -92 130 -64 181 284 -154 -72 -24 -217 85 177 196 46 134 -116 354 68 216 184 -264 -219
2712b19L06m6nj54p5K05p6J48l82J88k24J91j06J9K17k15k90L18n3J69j86J18
2734a52j59K30k11J10O11n18Q2k80O7K31m4R1k21P6P8Q2J53r6k6k29J79J34R2
2757B80j57k24Rj06J48J18K08l57r7M92m1p4J82k50k1j42q0J95J23j56R0j37j5
2780a2K30J38j88p2j36K32N3j67J18l25K70K1J75j57k83P3k11p0K68j17K65j7
2802H8j53K37j99J04k45K77n1k68J81q8R8Q9k6l26JO8K3Q4l3N4O8J5N7r7j15Q8
2828f9j03J35j00QL1j46n0K6M32l3k44j7j47K03J70J29k28l41Q8N1L07j03r6p3
2852a70O0J89M1M0j51ML06k58R1l02L57k05K9K52k31J8J65j15k35K91j49k01L49
2875A75j08j6pM0j73J00J16m7N7j73J58j39q6r7J05P0R4P1k56j79L89J15k69J35
$$ plain form
2712 -219 87 41 36 -118 -193 12 -64 84 -298 -110 -334 -143 -249 -230 -13 -228 -518 -200 -253 -84 -270 -152
2734 -152 -311 -81 -292 -182 429 -89 -7 -287 -220 11 -33 58 -163 -87 -9 73 226 130 104 -125 54 188 280
2757 280 123 -101 -92 -198 -50 68 276 -81 -178 314 273 199 381 131 110 -32 -112 83 206 50 140 3 -12
2780 -12 218 356 168 96 -40 192 245 78 196 -129 141 162 337 180 -103 -30 -241 -311 -43 -160 105 88
2802 88 -65 172 -27 77 -168 109 58 -210 -29 -117 -19 70 44 -282 -281 -213 -190 -106 -139 -85 -17 -2 55 -42 -157 -69
2828 -69 -172 -37 -137 -129 -98 -244 -294 -268 164 131 -113 -130 -277 -74 96 225 -3 -344 -256 -205 102 -1 -97 -170
2852 -170 -110 79 120 160 9 13 319 61 152 -150 207 2 31 283 52 70 235 120 -115 176 27 -174 175
2875 175 67 51 44 84 -89 11 127 80 137 -36 122 -17 -103 -200 -95 -25 69 140 -116 -295 94 209 -60 75
2899G5j50M3o9N5J16n4q2j18O8J04j87J8K45k61J08J24k53M43l19o9j55KL62l06
2923b60J96R7k39J71l0P3j65O5k92K72R5k01K50j19J3j13J97m4m4L07l20M6L2
2946a3N4R9J72m42m6J86j0J23J26m07K23N4O2J8k5l1r8L5K67k37n5k10J15Q7J13
2971A60j91k24r2L18K15k47L07k02j21Q6j83L14M6k20R6j8j07j17L37j6pj81R8
2994E1L5j51L8Mk92K18k9K29k11Q2q3j22M05m51L66o4k36j2J08q7J02Q0k24J95
3018d9k1k19M48j79J5j20N1Q4J55o6l92m0O6L75N6j95k71K78J04j7M1l34P7M2
3042a11K05J25k32J24k33J79k48J69J11K1j24J43r1L6J05j59K72o0l30o1K01Q4
3064A26o2p7K9J19j4j35K23l10j3Q5J47Q5k34k2k48L48J03o3J82n70N32J96l99
$$ plain form
2899 75 -75 -32 -101 -46 70 16 -66 -184 -116 -12 -199 -181 64 -197 -89 35 -218 225 -94 -163 -318 -316 46 -260
2923 -260 -64 33 -206 -35 -65 8 -157 -92 -384 -112 -17 -218 32 -87 -74 -187 10 -34 -78 229 -91 -45 -13
2946 -13 41 140 312 -130 -176 10 0 123 249 -158 65 119 181 199 174 143 45 80 347 110 55 -155 -40 47 160
2971 160 -31 -255 -347 -29 186 -61 246 44 -77 9 -174 140 186 -34 62 44 -63 -180 157 141 134 -47 51
2994 51 86 -65 -27 -23 -315 -97 -126 103 -108 -26 -109 -231 174 -277 89 25 -211 -223 -115 -202 -100 -20 -244 -49
3018 -49 -70 -289 159 -20 -5 -125 -74 10 165 99 -293 -333 -267 108 164 -31 -302 -24 80 63 104 -230 -153 -111
3042 -111 94 219 -13 111 -122 57 -191 -22 89 110 -14 129 38 74 179 20 292 232 -98 -159 42 126
3064 126 64 -13 16 135 121 -14 209 -101 -114 -29 118 203 -31 -53 -301 47 150 87 269 -301 231 427 28
3087B8mj46p5K76J10l66K44l36K64r6JJ53Q8l96J59j52j6L02L0k75k57J51K14
3110i9J40J33k01J11l36K84j5K7R2j05j25n4L36k41l0P1k57K50o1o1O6J15l2o9
3134f1j0K2J63j43j9j38r3J83P06n84p9k5k63M31J78k82p1j20j4L43j92K47p0
3157A09k18K21N6q4J29o07L91j7JN1K28j88R1j99J14K06j78j34J58n10L89r7L0
3180e8O4K06l58M8J63q3P6L5k57O0qn9J39j55q4R3K6J18j0j04K01j17Q6j26J93
3205H9k81J30J62j24j78L7O3l7l4K85j17j7j51j32K79l62K27J81Or1J7o1P3mK1
3230a9n8K63j62l20M62J4l49J97j05O8K24l47R7J12k19J47J32k3J70k87j18m1
3252a62J47K38j52J32l45K11q6L06j25l26K35J31n7%k57O1j61K94r8J43j70O8
$$ plain form
3087 28 24 -122 -197 79 189 -177 67 -269 -5 -101 -100 53 141 -255 -96 -248 -264 38 68 -207 -464 -313 -99
3110 -99 41 174 -27 84 -252 32 17 44 136 31 -94 -148 188 -53 -83 -12 -269 -19 -80 -141 -75 40 8 -61
3134 -61 -71 -49 114 -29 -48 -186 -279 -96 610 26 -53 -78 -341 90 268 -14 -85 -205 -219 124 -68 179 109
3157 109 -109 112 168 84 213 -394 -3 -20 -19 32 260 72 163 -36 78 284 106 -28 130 -380 9 -88 -58
3180 -58 6 212 -146 -98 65 -18 58 93 -164 -104 -112 -171 -32 -187 -271 -178 -152 -34 -44 -148 53 -64 22 -104 89
3205 89 -192 -62 100 -24 -202 -165 -102 -139 -173 112 -5 -22 -173 -305 -26 -388 -161 20 26 -65 -48 -109 -36 -40 -19
3230 -19 -77 186 24 -296 166 180 -169 28 -77 -9 215 -132 -35 77 -142 5 137 114 284 -3 -121 -162
3252 -162 -15 223 71 203 -142 69 -17 289 164 -162 73 204 147 147 -110 -49 -210 84 -14 129 -41 27
3274B7k68J31K82j06R8k15J44j27J70J00k77o1M9m4J45J57k09r8p4J08K94p7j09
3297D0l10R5K27MR1j07R9l76Q8J93M4j44n6J06o8K34k33k8j08J50J17j13J22J13
3321A80l05j94L12j57M83m05j5j04K87j46J95p3k0l41K92m8K42j25k09k6K49j58
3343h6J77L2J92m67K00l10P60k58n90M34j02qM9J3R2k86Q6R6K25k32k32L52j92
3366e5oL06j91o7Q8k17J51J54m8j32O3n7j38L3L65l46R7j83J03M8K06k30%j22
3390a78R1J2K77j59J51n97K03J66J10q2l06R1J99M2J72j65K6Pj83M3K08Nm0j28
3414c5K07j67N1j63M0L0m20M51K8k73K12j40j06L82j61n4K01J1l36L48j12L14
3436C08k40j9j34L3K85q5K5m89K45O8j01L36j55M1k31R2n2K27R0m6m06J62L01
$$ plain form
3274 27 -241 -110 172 66 164 -51 93 -34 136 236 -41 -102 -53 -97 48 205 -4 -102 -176 -68 226 149 40
3297 40 -270 -175 52 56 147 40 139 -237 -149 44 88 -56 -112 -6 -74 160 -73 -101 -209 -59 58 -55 67 180
3321 180 -125 -319 -7 -164 319 -86 -101 -205 82 -64 131 58 38 -303 -11 -59 183 58 -151 -177 72 -86
3343 -86 91 123 315 -152 48 -262 498 240 -350 84 -18 -26 23 36 128 -158 -72 24 249 17 -215 137 -55
3366 -55 -61 245 54 -13 75 -142 9 163 115 -17 46 -11 -149 -116 249 -97 0 -183 -80 -32 174 -56 -56 -178
3390 -178 -87 -75 202 43 194 -403 -200 -34 76 -6 -312 -221 -22 20 192 27 53 60 -123 -80 128 133 93 -35
3414 -35 172 5 56 -107 -67 -37 -457 -6 22 -251 -39 -179 -285 97 -64 -118 83 94 -242 106 -6 308
3436 308 68 49 -85 -52 233 148 173 -316 -71 -3 -104 232 77 118 -113 -21 -73 154 244 198 -208 -46 255
3459B55k8j99j52n3l9L13k4j1J60o52L63nN28l14k13J3N8l1J70P8k83n7L63k91
3483e1p1M80l36n6m3K93k20N5O9k60O8L34k71N0l4l98J83L12p2L2P2l09j02K82
3507Gj04L25J19l39J9k38K41J99p5L7k67qJ36Q9j36k26J94j8PL10j98j63J30J
3531D2n7N5j4j8k1J61k33P3%K25j16m60J42M95k04J40q7k0J14k53J82k35k66J90
3555a65K77q8O0J01l22J74L6j23J08J26j83L6n8O5J87j17k4J29l26n6J20J67M8
3578A72r5j04N5j01n1K00k80K10K6j70M08n2l25j9j41M09j91k3K72m16K52J02
3600A38j02K49o40K08J65K41j82k42M3M1r7J67L3P9M2l92L76p4j1k26L43l47K76
3623H8Q9r4p3K12k66J29j27K35m1k1L4q1r9P8J53l73K11J8J74q9p1k00L89o87
$$ plain form
3459 255 227 28 -124 -177 -216 97 73 62 222 -430 -67 -72 456 142 -71 -58 0 -31 139 217 -66 -123 240 -51
3483 -51 -122 358 22 -34 -77 216 -4 51 120 -140 -72 262 -9 41 7 -391 -208 104 32 64 136 -173 -275 7
3507 7 -97 228 347 8 27 -211 30 229 154 191 -76 -84 52 141 5 -221 -27 -45 -38 272 74 -89 41 42
3531 42 -15 40 26 8 -13 148 -85 -12 -12 213 97 -363 -221 274 70 210 123 103 217 -36 146 -89 -355 -165
3555 -165 112 24 84 185 -137 37 73 -50 58 184 1 37 -21 44 231 114 90 219 -107 -163 -43 124 172
3578 172 77 -27 28 -73 -124 76 -204 6 32 -138 270 218 -107 -126 -267 142 -49 -72 200 -216 36 138
3600 138 36 285 -355 -147 18 259 77 -165 -122 -81 -178 -11 22 101 143 -249 127 53 42 -184 159 -188 88
3623 88 177 83 10 222 -44 85 -42 193 152 131 165 84 -15 63 216 -157 54 72 246 157 86 -114 275 -412
3647d12J69K53L1M8k9j67J65J86j76j47k8P5nQ8O8m4j52k09M81l4r8N7l21J48
3671e3J18K04j68n0j93J70k10M84k20o1k16J09J63j9M5k21j77K72L3o7Q2k6p9
3694h0J77j99J13J60k56L92k70k64N24k51Q9k63J50q1L9lJ47M0k73Q3k13P8Q8
3717g3j9J09p3Q2N0l8k0P7o8j47K92m0R5o02J61K19o0j54J67JJJ97j03k4J23m49
3743b96L04j78J72k37L93pno26O57k07N2J24k27j92J37J65K9K1L6m2L4k14J46
3766C9K2Q0k86J39k08P4J60K28k77r5J60J08j69j48L3Q1J1L7r1K3J50l18J11M4
3790i2J24p6J71j75R6J2j70O8J18j11M5k60K87N0l32J75K40j52k50K72K23l32
3812f9K27l52K60p8K0j74j5o3M52j24p8J91m83j4L98J9p0O9lj43J72j92Q6j47
$$ plain form
3647 -412 -243 10 41 89 60 -107 58 244 68 -79 -107 -32 -37 51 119 75 -77 -286 195 161 63 120 -201 -53
3671 -53 65 269 101 51 -142 28 -182 302 82 21 -195 -86 77 58 103 -118 -295 -23 10 -57 25 -1 -80
3694 -80 97 -102 11 171 -85 307 37 -227 297 46 135 -128 22 -59 -20 -23 124 164 -109 -26 -239 -161 -73
3717 -73 -92 17 -56 26 76 38 18 95 27 -120 172 132 227 -375 -214 5 -55 -209 -42 -41 -40 157 54 30 153 -296
3743 -296 8 -170 2 -235 158 151 146 -480 177 -30 22 146 -81 -273 -136 29 58 79 115 73 107 -107 39
3766 39 61 141 -145 -6 -214 -140 20 248 -29 -124 36 144 -25 -173 -140 -59 -48 -11 -102 -79 71 -247 -136 -92
3790 -92 32 -44 127 -48 48 60 -110 -42 76 -35 10 -250 37 87 -245 -70 170 18 -232 40 263 -69
3812 -69 158 -194 66 -12 8 -166 -181 -244 208 84 6 197 -286 -300 98 117 47 116 113 -30 142 -50 36 -111
3836a11J50k81L45j5o0k1JK51j50p4lL4J37k10P2Q1M6k89m6J12K28k15N6Q5r2
3861C1j73J75mk1jj30p1J01K31j22j11L90j63n8j82o0R9k08J59P3mK07j1j27K0
3886D0k8j60L48P4l28n2J82k35J99pj22j00L54j50L5J37k02M7J09l07J95K07l24
3909h8J64P8j60R6k21L42j24k08L9J78j54K1J19j63%J86O7j28l20J93k2J60J55
3932B10j85j04N3p7N4o2J87k6j28J16J26k7j0p2J1k60P2K46k26K58j89r4K43j11
$$ plain form
3836 -111 39 -242 103 88 28 7 8 259 109 35 32 66 203 -7 65 146 192 -97 -143 -31 197 -18 38 123 31
3861 31 -142 33 29 8 7 -123 -194 -93 138 16 -95 295 132 74 -108 -168 -69 -277 -118 -45 -49 158 147 20 40
3886 40 12 -148 200 274 -54 -106 76 -159 40 33 -89 -189 165 15 50 187 -15 32 141 -166 29 236 -88
3909 -88 76 154 -6 90 -131 211 87 -121 -82 96 -58 -37 82 -81 -81 105 172 44 -276 -83 -105 55 210
3932 210 25 -79 -26 -103 -49 -111 76 50 -78 38 164 137 127 55 66 -194 -122 124 -102 156 -33 -127 116 5
$$ [...]
8191a07
##END NTUPLES=NMR FID
##END=
