##TITLE=1H_Pr 91-Am
 200.13MHz, CDCl3,
 8 sc
 
 25.4.2025
##JCAMPDX= 6.0         $$ Bruker NMR JCAMP-DX V2.0
##DATA TYPE= NMR FID
##DATA CLASS= NTUPLES
##ORIGIN= UXNMR, Bruker Analytische Messtechnik GmbH
##OWNER= pz
$$ XWIN-NMR		Version 3.5
$$ Fri Apr 25 15:46:07 2025 Russian Standard Time (UT+4h)  she@DPX200
##.OBSERVE FREQUENCY= 200.1313
##.OBSERVE NUCLEUS= ^1H
##.DELAY= (6, 6)
##.ACQUISITION MODE= SIMULTANEOUS
##.ACQUISITION SCHEME= undefined
##.AVERAGES= 8
##.DIGITISER RES= 18
##SPECTROMETER/DATA SYSTEM= spect
##.PULSE SEQUENCE= zg30
##.SOLVENT NAME= CDCl3
##.SHIFT REFERENCE= (INTERNAL, CDCl3, 0, 14.3821)
##AUDIT TRAIL= $$ (NUMBER, WHEN, WHO, WHERE, WHAT)
$$ ##TITLE= Audit trail, XWIN-NMR		Version 3.5
$$ ##JCAMPDX= 5.01
$$ ##ORIGIN= Bruker BioSpin GmbH
$$ ##OWNER= she
$$ F:/spectra/data/she/nmr/H-C/1/audita.txt
$$ ##AUDIT TRAIL=  $$ (NUMBER, WHEN, WHO, WHERE, WHAT)
(   1,<2025-04-25 15:44:53.56 +0400>,<she>,<DPX200>,
      <created by zg, POWCHK disabled, PULCHK disabled
       configuration hash MD5:
       00 E9 B6 7A A2 85 ED C7 34 08 36 98 17 FE 4E 26
       data hash MD5: 16K
       08 D6 27 AB 2C 07 08 E0 15 F9 50 BE 7F 93 E9 C7>)
$$ ##END=
$$ 
$$ hash MD5
$$ 9D D7 97 82 E9 30 9E 4D 5D 82 25 16 88 59 1D 78
##$RELAX= 
##$RELAX= 
##$RELAX= 
##$RELAX= 
##$RELAX= 
##$RELAX= 
$$ Bruker specific parameters
$$ --------------------------
##$DU= <F:/spectra>
##$EXPNO= 1
##$NAME= <H-C>
##$PROCNO= 1
##$TYPE= <nmr>
##$USER= <she>
##$AMP= (0..31)
100 100 100 100 100 100 100 100 100 100 100 100 100 100 100 100 100 100 
100 100 100 100 100 100 100 100 100 100 100 100 100 100 
##$AQSEQ= 0
##$AQ_mod= 1
##$AUNM= <au_zg>
##$AUTOPOS= <>
##$BF1= 200.13
##$BF2= 200.13
##$BF3= 200.13
##$BF4= 200.13
##$BF5= 200.13
##$BF6= 200.13
##$BF7= 200.13
##$BF8= 200.13
##$BYTORDA= 1
##$CFDGTYP= 0
##$CFRGTYP= 5
##$CHEMSTR= <none>
##$CNST= (0..31)
1 1 145 1 1 1 1 1 1 1 1 1 1 1 1 1 1 1 1 1 1 1 1 1 1 1 1 1 1 1 1 1 
##$CPDPRG= <>
##$CPDPRG1= <>
##$CPDPRG2= <>
##$CPDPRG3= <>
##$CPDPRG4= <mlev>
##$CPDPRG5= <mlev>
##$CPDPRG6= <mlev>
##$CPDPRG7= <mlev>
##$CPDPRG8= <mlev>
##$CPDPRGB= <>
##$CPDPRGT= <>
##$D= (0..31)
0 0.7 0 0 0 0 0 0 0 0 0 0.03 0 0 0 0 0 0 0 0 0 0 0 0 0 0 0 0 0 0 0 0 
##$DATE= 1745581493
##$DBL= (0..7)
120 120 120 120 120 120 120 120 
##$DBP= (0..7)
150 150 150 150 150 150 150 150 
##$DBP07= 0
##$DBPNAM0= <>
##$DBPNAM1= <>
##$DBPNAM2= <>
##$DBPNAM3= <>
##$DBPNAM4= <>
##$DBPNAM5= <>
##$DBPNAM6= <>
##$DBPNAM7= <>
##$DBPOAL= (0..7)
0.5 0.5 0.5 0.5 0.5 0.5 0.5 0.5 
##$DBPOFFS= (0..7)
0 0 0 0 0 0 0 0 
##$DE= 6
##$DECBNUC= <off>
##$DECIM= 32
##$DECNUC= <off>
##$DECSTAT= 4
##$DIGMOD= 1
##$DIGTYP= 9
##$DL= (0..7)
0 120 120 120 120 120 120 120 
##$DP= (0..7)
150 150 150 150 150 150 150 150 
##$DP07= 0
##$DPNAME0= <>
##$DPNAME1= <>
##$DPNAME2= <>
##$DPNAME3= <>
##$DPNAME4= <>
##$DPNAME5= <>
##$DPNAME6= <>
##$DPNAME7= <>
##$DPOAL= (0..7)
0.5 0.5 0.5 0.5 0.5 0.5 0.5 0.5 
##$DPOFFS= (0..7)
0 0 0 0 0 0 0 0 
##$DQDMODE= 0
##$DR= 18
##$DS= 0
##$DSLIST= <SSSSSSSSSSSSSSS>
$$ [...]
##$SUBNAM0= <"">
##$SUBNAM1= <"">
##$SUBNAM2= <"">
##$SUBNAM3= <"">
##$SUBNAM4= <"">
##$SUBNAM5= <"">
##$SUBNAM6= <"">
##$SUBNAM7= <"">
##$SUBNAM8= <"">
##$SUBNAM9= <"">
##$SW= 18.0517328524113
##$SWIBOX= (0..15)
0 0 2 0 0 0 0 0 0 0 0 0 0 0 0 0 
##$SW_h= 3612.71676300578
##$TD= 16384
##$TD0= 1
##$TE= 0
##$TE2= 300
##$TE3= 300
##$TEG= 300
##$TL= (0..7)
0 120 120 120 120 120 120 120 
##$TP= (0..7)
150 150 150 150 150 150 150 150 
##$TP07= 0
##$TPNAME0= <>
##$TPNAME1= <>
##$TPNAME2= <>
##$TPNAME3= <>
##$TPNAME4= <>
##$TPNAME5= <>
##$TPNAME6= <>
##$TPNAME7= <>
##$TPOAL= (0..7)
0.5 0.5 0.5 0.5 0.5 0.5 0.5 0.5 
##$TPOFFS= (0..7)
0 0 0 0 0 0 0 0 
##$TUNHIN= 0
##$TUNHOUT= 0
##$TUNXOUT= 0
##$USERA1= <user>
##$USERA2= <user>
##$USERA3= <user>
##$USERA4= <user>
##$USERA5= <user>
##$V9= 5
##$VALIST= <valist>
##$VCLIST= <CCCCCCCCCCCCCCC>
##$VD= 0
##$VDLIST= <DDDDDDDDDDDDDDD>
##$VPLIST= <PPPPPPPPPPPPPPP>
##$VTLIST= <TTTTTTTTTTTTTTT>
##$WBST= 1024
##$WBSW= 4
##$XGAIN= (0..3)
0 0 0 0 
##$XL= 0
##$YL= 0
##$YMAX_a= 696217
##$YMIN_a= -778074
##$ZGOPTNS= <>
##$ZL1= 120
##$ZL2= 120
##$ZL3= 120
##$ZL4= 120
##$ABSF1= 10
##$ABSF2= 0
##$ABSG= 5
##$ABSL= 3
##$ALPHA= 0
##$AQORDER= 0
##$ASSFAC= 0
##$ASSFACI= 0
##$ASSFACX= 0
##$ASSWID= 0
##$AUNMP= <proc_1d>
##$AZFE= 0.1
##$AZFW= 0.1
##$BCFW= 1
##$BC_mod= 2
##$BYTORDP= 1
##$COROFFS= 0
##$CY= -3
##$DATMOD= 1
##$DC= 2
##$DFILT= <>
##$DTYPP= 0
##$F1P= 0
##$F2P= 0
##$FCOR= 0.5
##$FTSIZE= 0
##$FT_mod= 4
##$GAMMA= 1
##$GB= 0.15
##$INTBC= 1
##$INTSCL= 1
##$ISEN= 128
##$LB= 0.25
##$LEV0= 0
##$LPBIN= 0
##$MAXI= 10000
##$MC2= 0
##$MEAN= 0
##$ME_mod= 0
##$MI= 1.114404
##$NCOEF= 0
##$NC_proc= 0
##$NLEV= 6
##$NOISF1= 3.799351
##$NOISF2= 2.8
##$NSP= 1
##$NTH_PI= 0
##$NZP= 0
##$OFFSET= 14.38212
##$PC= 1
##$PHC0= -831.7667
##$PHC1= 8.9922
##$PH_mod= 1
##$PKNL= yes
##$PPARMOD= 0
##$PSCAL= 0
##$PSIGN= 0
##$REVERSE= no
##$SF= 200.129724274929
##$SI= 16384
##$SIGF1= 3
##$SIGF2= 2
##$SINO= 400
##$SIOLD= 16384
##$SREGLST= <1H.CDCl3>
##$SSB= 0
##$STSI= 0
##$STSR= 0
##$SW_p= 3205.1282051282
##$SYMM= 0
##$S_DEV= 0
##$TDeff= 0
##$TDoff= 0
##$TI= <>
##$TILT= no
##$TM1= 0
##$TM2= 0
##$TOPLEV= 0
##$USERP1= <user>
##$USERP2= <user>
##$USERP3= <user>
##$USERP4= <user>
##$USERP5= <user>
##$WDW= 1
##$XDIM= 8192
##$YMAX_p= 0
##$YMIN_p= 0
$$ End of Bruker specific parameters
$$ ---------------------------------
##NTUPLES= NMR FID
##VAR_NAME=  TIME,          FID/REAL,        FID/IMAG
##SYMBOL=    X,             R,               I
##VAR_TYPE=  INDEPENDENT,   DEPENDENT,       DEPENDENT
##VAR_FORM=  AFFN,          ASDF,            ASDF
##VAR_DIM=   8192,          8192,            8192
##UNITS=     SECONDS,       ARBITRARY UNITS, ARBITRARY UNITS
##FACTOR=    0.0002768,     1,               1
##FIRST=     0,             0,               0
##LAST=      2.2672688,     0,               0
##MIN=       0,             -778074,         0
##MAX=       2.2672688,     696217,          0
$$ Real data points
##PAGE= N=1
##DATA TABLE= (X++(R..R)), XYDATA
0 0 0 0 0 0 0 0 0 0 0 0 0 -6 8 -8 8 -8 16 -16 16 -24 24 -32 36 -40 48 -56 64 -74 84 -100 108 -124 140 -159
34 -159 178 -200 222 -246 278 -309 340 -378 419 -464 510 -564 618 -683 752 -826 911 -1004
52 -1004 1111 -1226 1358 -1511 1685 -1888 2130 -2423 2783 -3242 3840 -4660 5846 -7703 10944
67 10944 -17697 37219 -206067 -778074 40551 551110 -25273 -269159 98953 16463 -194298
78 -194298 156765 281374 -263723 -332126 234820 249684 -211526 -173018 100045 52825 -1191
89 -1191 62701 -91128 -192752 112458 268081 -79019 -204603 97045 127364 -56355 54813
100 54813 112758 -125918 -123517 154458 105558 -140135 -24998 135863 -77743 -141033 131829
111 131829 75398 -202441 -42220 186463 -49610 -203023 105181 215938 -114503 -170500
121 -170500 127149 92674 -134850 -8379 129927 -52709 -116116 76812 98594 -68165
131 -68165 -65168 46265 7932 -44313 5062 -8185 -6767 96125 32017 -130320 -16123 161780
143 161780 28109 -128508 1443 91335 -50243 -41803 127324 14730 -171417 -713
153 -713 139642 -60475 -131217 68281 71637 -106561 -36595 125782 3990 -109576 51281
164 51281 84859 -88906 -42045 108376 11187 -84191 43858 82500 -69772 -69855 82159 39304
176 39304 -89945 -24541 33951 -31978 10470 77865 -30852 -89442 42706 87044 -35734
187 -35734 -45525 53458 1817 -62966 59968 81670 -86180 -68146 90771 30741 -102325
198 -102325 -21247 71494 -25220 -63898 56511 38293 -87996 -10887 101944 -3467 -80525
209 -80525 17233 53050 -11666 4488 45290 -25175 -56916 50608 59076 -65859 -54067 41223
221 41223 6001 -33420 20823 13501 -46642 -2003 62506 -11940 -71883 28886 69548 -35065
233 -35065 -33256 54240 12197 -41506 24359 37346 -49274 -42277 49744 18926 -67538 -6441
245 -6441 57766 -23577 -47889 36690 25708 -40619 -6374 40149 -3280 -25110 33266 32043
257 32043 -34483 -7970 44830 -9632 -39535 17184 16206 -30076 -9295 22504 -9550 -27418
269 -27418 18187 17661 -38174 -10753 44349 -2118 -32236 25251 32060 -19111 -8139 30488 1979
282 1979 -31842 9325 26312 -30677 -24582 34408 5055 -40197 83 24329 -14191 -20737 16192
295 16192 10933 -19616 5923 32215 -8289 -16458 28027 13129 -23816 -3 17950 -9183
307 -9183 -15504 9489 4482 -22373 -4042 18632 -15057 -23044 17907 9271 -20981 2792 22884
320 22884 -799 -9999 14575 15351 -13362 -3797 21571 -4668 -20679 11864 10203 -18650 -8332
333 -8332 9552 -4213 -15519 -35 8174 -9528 -5544 16852 2331 -10307 12884 13729 -6303
346 -6303 44 9505 449 -5598 3413 5174 -10668 -7653 9695 -4385 -16565 2101 3209 -10104
360 -10104 -786 6639 -1569 -3206 8173 11574 -3620 -3609 13094 4328 -6824 5453 2656 -8181
374 -8181 1181 4883 -6787 -11016 -1893 3279 -6742 -7610 4353 -1518 -4506 10807 5667 -7856
388 -7856 3547 11840 2557 -2904 2388 5032 -2913 -1083 7577 -6418 -13620 5253 3575 -12762
402 -12762 -5717 2845 -2984 -3350 6172 5710 -7909 -1994 17435 6022 -10388 4322 9109 -2224
416 -2224 2495 6044 -6616 -10276 4089 8646 -11321 -15243 5287 2319 -8684 4454 3394 -12431
430 -12431 1380 19202 4072 -14626 -376 19313 4868 -9089 4493 2036 -8621 7462
442 7462 7958 -17457 -14393 9520 7335 -11637 -8891 4716 -2318 -2376 15242 561 -20573 7677
456 7677 27180 -1842 -15581 5396 12891 -2630 -3701 5306 -7947 -12376 11242 5463 -21075
469 -21075 -7335 11290 -1845 -6170 5627 -840 -11442 8252 23783 -5831 -22636 14204
481 14204 24386 -9656 -10182 9720 -671 -10454 5206 8016 -14465 -16161 10256 9488 -12036
494 -12036 -5701 2756 -3837 6842 13255 -8222 -13260 13706 22535 -4740 -16787 6876 10926
507 10926 -7258 685 6855 -14523 -12918 12432 9470 -14621 -15498 4852 9197 -369 1300 -3215
521 -3215 -9779 12328 21378 -8590 -15468 11899 15286 -6488 -6746 7528 -4289 -16061 9741
534 9741 16490 -19532 -22410 12115 14089 -7377 -9046 273 2433 5538 10258 -1681 -11899 8408
548 8408 17226 -6741 -7523 8997 -1979 -8870 9190 6308 -20977 -14906 19904 12323 -24829 -13078
562 -13078 17298 5009 -6677 5710 420 -8143 8487 16473 -4616 -12420 10490 11240 -13313
575 -13313 -5020 12060 -7459 -12972 10876 4738 -20529 -7433 19497 4998 -20925 -3970 17816
588 17816 2333 -4326 8302 -538 -7886 9350 12236 -6476 -8469 6100 2767 -9236 680
601 680 5294 -14748 -8368 17271 1606 -21417 -249 19667 428 -14102 3822 12154 -3647
614 -3647 1002 14630 -4689 -14911 9925 13486 -9198 -9820 3619 -1022 -7585 4265 4595 -15053
628 -15053 -7604 16225 2214 -14494 5395 12880 -5559 -3999 12131 5133 -9923 1158 12434
641 12434 -4364 -9550 7182 228 -11593 3030 6203 -11778 -9488 9767 6886 -10209 -3908
654 -3908 9196 -1451 -3673 13455 5040 -13349 1317 16422 516 -12029 -594 7077 -3307
667 -3307 -4892 3852 -4707 -10300 5876 6251 -10232 -5886 7874 4384 -3677 1259 6006 -1964 -1313
682 -1313 10566 2916 -9487 1692 8065 -4324 -5485 3020 33 -8038 -2725 5326 -3420 -8285
696 -8285 4682 4880 -6756 737 8501 -624 -2934 5845 5468 -3819 -1576 7846 550 -8381 1664
711 1664 4545 -7174 -4110 3765 -2959 -6531 1165 3676 -3964 -3537 7008 3432 -6013 2927 7791
726 7791 -1851 -476 5839 -405 -4278 2226 4582 -4586 -7184 2758 2109 -7156 -1437 3334 -4561
741 -4561 -2744 5385 1479 -3991 782 6684 1741 -3033 4008 4544 -3879 407 5433 -3358 -4848
756 -4848 2168 798 -4809 -3498 1649 -990 -5085 1964 3509 -4452 -933 6941 1103 -2318 2978
771 2978 4125 -462 -851 3879 1285 -4853 -8 3878 -4572 -4955 1819 -784 -4625 -758 1961 -1259
787 -1259 -2929 2812 3939 -2677 700 6119 -157 -1795 4301 2248 -2439 -918 1795 -841 -4175
802 -4175 -507 1307 -4516 -2691 3083 -2012 -3513 2539 2187 -1329 20 3378 2334 -907 1964
817 1964 4180 -1922 -1439 3678 -720 -3663 388 303 -2813 -2640 -13 398 -2989 -1035 2614 -1437
833 -1437 -1061 3997 1307 -1006 2386 2735 636 -64 1049 1386 -1748 -965 1383 -2274 -3189 1008 -1228
850 -1228 -3132 -373 214 -602 -436 829 2012 -366 673 3966 728 -801 2532 1107 -1050 586
866 586 179 -987 -1933 -1314 261 -1957 -2804 292 -636 -1403 1225 176 -358 1412 1519 1608 826 465
884 465 2216 1171 -165 715 -1039 -1455 688 -1227 -2748 -1191 -874 -1008 -975 -1012 289 -363 -263 3013
902 3013 981 -1103 2037 2444 697 562 178 617 111 -932 25 -1255 -2607 -327 -637 -2101 -327
919 -327 -781 -1006 1290 876 137 282 1022 2986 1348 -329 1310 927 164 1526 -981 -2302 41
936 41 -199 -1629 -1535 -1488 -539 -1126 -641 1548 -569 -1580 3013 2883 -460 75 1544 2339 940 -899
954 -899 -57 388 -618 60 -1598 -2140 -73 -1369 -1719 755 -870 -2349 385 2556 1636 -1565 -268
971 -268 4252 2036 -1422 873 1485 -353 307 -112 -783 -1683 -1885 57 -754 -2446 -572 -511 -1049 1432
989 1432 693 -1512 901 2868 2123 -416 -599 2977 2047 -1901 132 867 -1718 -798 -127 -1184 -1575
1006 -1575 -1736 -506 -84 -552 116 -800 -587 3377 1928 -2378 939 4250 255 -1899 1147 2994
1022 2994 -1219 -3127 1567 1052 -4195 -1711 1680 -1163 -2148 -498 266 312 296 251 179 641 3245 1654
1040 1654 -1786 1281 2424 -1267 -567 1531 -667 -2655 -1138 1034 -962 -3606 -663 914 -1422
1055 -1422 6 1346 -666 541 2316 718 -326 1173 2730 883 -1985 566 1653 -2144 -1554
1070 -1554 1185 -916 -3027 -1407 1431 461 -3033 -1286 2407 362 -364 1546 732 414 1514 1150
1086 1150 911 63 23 198 -719 78 120 -2946 -1346 1553 -1511 -2906 456 1246 -666 -831 1442 1643
1104 1643 -807 858 3378 -506 -1287 2830 1232 -1623 -459 110 -1202 -1712 35 165 -2677 -1600
1120 -1600 1702 -556 -1430 1238 607 -226 1336 1500 881 270 694 1265 -210 48 1210 -1511 -1581 845
1138 845 -1225 -2119 19 -82 -1567 -1379 662 1452 -973 -304 2637 575 -726 1860 1690 -105 -268
1155 -268 485 975 -891 -1415 639 -701 -2359 -434 157 -1153 -555 -165 5 216 355 1477 776 -93
1173 -93 1377 686 -241 1565 415 -1121 -110 498 -573 -1334 -904 17 -1553 -1508 1495 -154 -2400
1190 -2400 716 2040 -548 -205 1721 1527 -378 386 2241 125 -1967 990 1147 -2006 -1316 297
1206 297 -866 -1274 -731 -24 -691 -986 887 932 -523 868 1054 359 1414 962 -224 199 836 410
1224 410 -561 -964 211 -520 -1935 -96 124 -2073 -832 914 9 -618 138 1352 1059 -293 1477
1241 1477 1815 -406 78 1543 58 -796 -431 66 -329 -1560 -416 285 -1684 -858 642 -252 -328 553
1259 553 497 702 463 661 1051 -29 751 1008 -555 -186 711 -966 -989 23 -907 -1261 -707 296 -172
1278 -172 -1237 201 1474 -510 -44 2013 470 -219 1207 1271 130 -523 391 522 -948 -920 392
1295 392 -1008 -1609 97 -269 -635 -489 -45 338 113 352 1161 283 294 1526 296 -160 884 -26 -403
1314 -403 -156 -270 -589 -1099 -661 118 -1056 -1086 374 -191 -624 730 620 217 356 952 1192 -13 -91
1333 -91 1201 122 -993 329 -159 -1294 -630 -289 -220 -662 -969 100 -40 -588 736 630 -65 1127
1351 1127 872 352 680 653 598 120 -163 349 -432 -1071 66 -361 -1343 -625 72 -693 -476 -222 597 143
1371 143 -252 1323 944 -240 717 1218 -307 109 433 34 -451 -702 -61 -390 -1431 -17 107 -1202
1389 -1202 -104 537 -143 71 405 586 604 265 999 769 -380 690 781 -892 -79 406 -656 -734 -746
1408 -746 -402 -620 -1021 56 343 -833 295 1087 -54 306 1003 730 422 455 774 271 -737 313
1426 313 615 -1181 -672 360 -831 -1144 -277 31 -431 -746 408 730 -497 356 1319 26 184 1053
1444 1053 268 -137 487 479 -442 -1016 49 -3 -1499 -643 410 -840 -1176 505 287 -417 81 751 1080
1463 1080 109 469 1185 -122 176 942 -228 -541 411 -266 -1017 -689 -86 -301 -1088 -275 779 -645
1481 -645 -788 1420 729 -472 396 1154 655 -151 350 875 -464 -529 661 -371 -1065 121 -338 -1132
1499 -1132 -432 33 -431 -684 363 1160 -212 -355 1637 914 -472 686 1038 89 -168 278 196 -751
1517 -751 -568 279 -699 -1347 344 -464 -1191 280 631 -612 -336 1120 965 -343 107 1717 432 -600
1535 -600 889 721 -1031 -413 98 -345 -707 -417 -26 -694 -845 383 -131 -699 716 497 -126 455 1131
1554 1131 532 -161 110 928 60 -716 289 247 -1106 -693 212 -429 -794 -424 65 -270 -294 658 356 -518
1574 -518 578 1290 66 119 1105 186 -481 -107 646 -323 -1280 247 142 -1644 -467 585 -516 -747
1592 -747 361 463 -153 173 1161 451 -441 899 1125 -656 40 971 -588 -796 361 -79 -1114 -910
1610 -910 469 -252 -1237 287 703 -717 -369 1128 389 -117 739 928 -42 -190 686 654 -912 -151 545
1629 545 -796 -746 388 -369 -906 -384 295 206 -496 239 720 -261 165 1053 342 -13 650 567 -188 -51
1649 -51 174 -128 -823 -216 290 -1012 -828 383 -194 -1034 75 738 44 -298 905 1003 -254 153 1472
1668 1472 160 -807 696 273 -845 -481 249 -475 -1065 -222 482 -837 -826 784 -108 -548 586 712
1686 712 -185 221 973 530 -121 309 749 -599 -559 613 -169 -1046 -146 -36 -859 -510 282 16 -558 -35
1706 -35 983 -41 -387 1061 635 -495 300 838 -18 -304 40 184 -578 -754 357 -387 -1037 -8
1724 -8 11 -432 59 184 74 -157 182 761 258 -78 826 532 -392 338 519 -474 -451 86 -71 -429 -531
1745 -531 297 -373 -899 378 636 -534 88 968 175 -178 469 759 -38 -356 820 280 -1001 56
1763 56 397 -661 -540 55 -74 -654 -446 433 -226 -418 614 502 -454 172 952 -148 68 602 222
1782 222 -380 -66 455 -287 -799 119 212 -775 -550 253 -234 -572 244 407 -146 38 669 467 -429 358
1802 358 808 -165 -301 366 -62 -579 -128 4 -385 -664 -31 26 -696 -147 534 -112 -88 571 574 -56 171
1823 171 571 311 -282 236 436 -547 -391 358 -381 -626 -215 -161 -273 -408 133 99 -493 171 706 -27 -29
1844 -29 678 312 -124 250 352 12 -348 -155 221 -625 -394 312 -172 -590 56 86 -177 -3 342 165 -75
1865 -75 359 608 -132 -48 545 141 -241 202 221 -368 -401 11 6 -551 -273 251 -245 -484 295 -92 -356 296
1887 296 543 -79 -170 256 378 -183 -6 252 -49 -640 229 167 -400 -244 -17 -220 -349 -20 269 -50 -87
1908 -87 413 202 -154 419 374 -207 -2 275 112 -99 -181 307 -169 -529 54 115 -610 -116 120 -249 -137
1929 -137 325 200 -139 149 607 327 -252 367 194 -286 42 269 35 -419 -316 -81 -265 -353 8 37 -452
1950 -452 174 231 -241 105 486 249 -142 299 408 107 -270 319 351 -296 25 290 -342 -350 -33 -153 -285
1971 -285 -347 72 243 -138 144 315 16 201 568 187 -14 154 34 -21 -107 71 32 -383 -78 107 -459
1992 -459 -274 265 84 -162 -128 220 185 -245 74 399 -10 -65 356 -51 -160 50 140 -199 -387 77 -53
2013 -53 -630 41 225 -357 -383 242 97 -87 138 296 197 -106 135 313 -10 122 257 -61 -273 107 -106
2034 -106 -114 -27 -16 -164 -181 237 218 -332 87 510 97 30 411 395 124 -78 120 185 -43 -285 183 -334 -419
2057 -419 -51 -187 -294 -37 18 -23 29 16 212 -232 11 414 166 -133 219 116 -78 -158 151 -179 -178 -316
2079 -316 89 -450 -88 -68 -61 -323 43 386 -138 -6 299 393 -124 -70 365 -21 -206 279 11 -301 43 170
2101 170 -103 -232 -88 94 -164 -117 71 -58 -50 78 281 -108 -19 308 -29 110 207 12 -114 54 175 16
2123 16 -155 110 -85 -285 -75 72 -271 -9 20 312 49 73 227 302 -10 99 137 -128 -1 -208 -25 -74
2145 -74 -128 -143 30 -408 -239 92 -124 33 146 -80 121 78 -6 227 -196 109 226 -118 102 85 -22 22
2167 22 -90 40 -101 -246 81 49 -167 54 167 -75 -85 311 -3 123 264 221 -83 -43 235 125 -159 -57
2189 -57 -10 -312 -215 178 71 -96 -97 122 -59 2 182 32 -73 139 163 -25 25 91 -74 -25 68 163 15 -199
2213 -199 -12 139 -263 -179 139 -77 30 144 219 52 172 83 280 10 123 117 -8 -205 -174 -19 -132 39
2235 39 65 -136 -292 -43 -39 20 -100 267 241 -50 71 281 122 65 -23 -38 -73 63 -31 -86 -37 131 -38 -208
2259 -208 -136 45 -6 10 37 83 18 -7 27 78 89 34 98 -33 219 154 36 -44 -74 -81 111 -104 214 22 -138 -37
2285 -37 172 -66 95 15 97 91 -107 86 -31 30 68 186 -33 139 -65 -10 -193 -23 -182 -75 -114 117 -104
2308 -104 32 28 270 161 -66 -71 11 -18 40 65 -96 -151 30 106 -106 16 121 103 -9 75 87 70 133 78 -6 85
2334 85 12 42 -26 121 67 146 -55 -16 41 -14 -79 160 74 -207 -193 -101 -45 -49 -12 -24 182 -92 18 62 -39 46 211
2361 211 -45 74 56 51 -111 41 178 -69 77 84 -34 39 -51 148 191 -40 37 76 -75 76 -53 45 -15 -128
2385 -128 -53 95 94 66 101 -37 -123 97 84 86 -121 -86 110 -105 151 14 -31 -113 89 -28 37 -41 -43 1 0 24 104
2412 104 -1 47 168 66 122 53 -29 131 -59 15 -10 25 5 -78 -123 47 -13 -18 -47 -151 -13 -81 191 -124 152
2437 152 24 -8 5 104 -50 6 73 -133 -9 48 -70 -79 -96 -131 -42 -121 142 -108 35 70 -27 66 -100 94 -131
2462 -131 -62 5 91 -46 150 53 -61 12 105 -105 -67 -14 44 70 -143 -6 74 -90 -33 76 -32 123 -20 -23 122
2487 122 -42 68 65 -118 52 -36 59 -4 -168 181 -234 -37 52 -14 -102 98 -66 -45 -86 -84 97 -57 153 55
2511 55 -65 -96 108 -118 -225 13 17 -59 151 -26 -182 -67 35 85 -205 50 148 112 -22 175 -29 44 -144
2534 -144 -25 198 -102 -130 -100 40 -239 -116 -217 81 63 172 42 94 187 214 -76 53 218 94 136 -80
2556 -80 97 -97 -233 -100 -204 -132 -122 27 -98 -57 48 -64 -151 96 -5 -97 51 93 97 -74 92 60 -42
2579 -42 30 11 -37 -81 -196 123 7 -244 -113 84 -109 -78 114 0 145 97 77 -94 -35 216 53 -64 -179
2602 -179 50 -83 -69 134 -215 -87 22 28 -106 26 -142 17 103 82 99 -98 49 -43 -13 70 118 -50 80
2625 80 -13 -97 128 -65 -50 54 -191 -100 -144 -6 -129 21 -85 213 115 43 108 -6 -160 254 10 30 -44 112
2649 112 164 -131 -35 -19 -135 -89 -48 66 65 -58 12 83 -57 151 244 -29 -16 4 49 -3 38 -44 -59 -32 69 -150
2675 -150 -26 31 -72 -115 -184 -58 -33 123 171 14 -38 142 115 21 98 -71 -80 36 -35 88 -14 -116 -168 160
2699 160 66 34 -83 22 20 57 -45 226 -62 48 194 -28 44 -87 -59 -114 -21 -46 -191 -23 141 -35 -34 -132
2723 -132 -191 54 -18 -1 -144 -58 122 77 106 28 4 72 116 -31 -25 -2 -111 106 96 -222 -64 28 -59 73 157 30
2749 30 46 217 191 109 213 182 -44 15 -166 3 -34 -55 -15 70 -73 -191 9 -38 -31 43 -74 -28 29 152 120 35
2775 35 -6 172 19 -46 79 42 82 -72 8 -141 -163 -100 -37 10 -52 7 21 -59 -84 154 225 217 284 65 113 200 254
2802 254 23 -5 82 -47 -38 -222 -291 -141 -69 -178 28 26 -61 -102 14 -8 109 -53 -31 45 22 72 -47 14 -120
2827 -120 -34 -151 -40 51 2 -62 -144 -75 133 -101 189 130 9 116 76 -113 145 133 151 214 84 54 -10 21 -205
2852 -205 -13 -185 30 -220 -97 -152 -33 -133 5 40 -195 27 132 89 59 9 82 96 -193 -16 -152 -102 -169
2875 -169 -42 -44 20 -55 139 112 -8 29 8 145 206 141 49 -84 83 34 30 181 -110 22 125 -7 -154 39
2899 39 24 -60 -58 65 -110 -1 13 25 57 25 3 -25 57 78 127 206 -60 123 156 -47 11 -106 -129 -47 -64 131 97
2926 97 -68 -26 8 22 -6 25 99 247 82 63 156 -80 27 -193 -161 -48 15 -82 16 -35 -84 28 -95 -124 84
2951 84 13 6 14 -127 40 9 9 207 219 -13 41 -22 -114 -232 -48 -335 -30 -126 -44 -111 -142 57 51 52 -50 110 8
2978 8 15 -15 54 -59 -134 -99 -69 -155 -62 -172 -277 -179 -221 -169 20 -3 40 177 117 68 117 68 326 140 -154 195 201
3005 201 -115 35 -98 -266 69 26 -130 -42 -64 -8 -14 3 10 44 230 48 27 -174 -53 55 -10 47 44 -81 16
3030 16 -144 -98 -232 -181 -132 -71 17 42 -35 69 13 -92 34 -34 56 81 9 31 -93 -119 -134 -51 -146 -293 -15 -100
3056 -100 -149 -75 -6 -98 -147 73 -69 134 102 -45 -82 -37 -83 -4 -85 -18 12 -137 -202 -148 7 -39 -81 3 -252 107
3082 107 8 -90 64 223 -47 -19 -30 -83 118 34 -103 -1 -2 -63 134 47 -41 80 -129 -191 124 -145 79 -169
3106 -169 15 169 12 -111 59 -12 34 8 -7 -73 -58 -97 40 -55 -44 38 -80 -156 -35 127 -9 149 107 -114
3130 -114 74 23 79 123 76 163 215 -20 -145 -151 102 -44 -97 44 -10 -160 41 -32 10 74 -115 -76 24 43 205
3155 205 134 50 -81 46 -179 15 36 -172 32 -25 -91 -181 51 -1 -44 90 102 -4 -80 71 17 89 219 -90
3179 -90 188 64 50 60 25 -120 -36 90 -108 -61 24 -186 6 -333 -25 -127 -30 1 112 -34 55 12 49 114
3203 114 -113 -132 -92 234 17 -40 -118 42 90 -219 -1 63 17 18 -16 50 24 195 235 93 68 100 2 172 80 18
3229 18 -141 -79 -51 -173 -82 11 -172 -18 -10 67 12 -43 -16 260 -109 -106 237 148 178 184 111 -21 120 -145 -113 -105 -62
3256 -62 -24 -164 -25 86 97 -45 -184 -2 153 296 133 114 12 -71 -23 -121 72 90 51 -33 -56 -240 -74 -169
3280 -169 -101 -67 -99 -125 -1 170 -131 -52 45 247 21 92 143 3 -195 3 94 -153 12 -194 72 -136 -119
3303 -119 -15 -24 -119 -38 5 135 161 41 85 103 176 120 -14 -80 -33 38 112 -5 -134 -48 -150 -94 -71 -112 21 46
3329 46 42 65 100 -25 -70 210 153 119 136 80 15 -98 98 -94 -7 -1 -130 -75 -183 -149 86 -152 -48 0 85 142
3355 142 -69 265 170 -75 83 198 -33 35 174 -163 -97 -23 -106 -41 -140 -156 52 -173 57 130 -116 110 5
3378 5 19 59 6 163 77 -101 56 -31 -75 -107 -23 -145 -78 128 -115 -192 121 -34 5 90 -92 24 29 -10 -10 161
3404 161 -45 41 -69 -33 -115 -62 52 -10 23 -191 -123 -137 -70 -47 15 66 6 31 115 46 173 -28 51 187 55 60
3430 60 12 25 -52 -121 63 -21 -96 9 -43 -73 -14 116 29 77 179 -53 237 265 139 -65 63 24 -31 118 -135
3455 -135 47 -9 -77 47 -7 11 1 -115 -48 -114 200 25 71 163 227 -38 -7 -4 94 162 106 -48 -14 -224 5 -5
3481 -5 -139 -248 150 133 27 -53 107 210 53 156 16 213 -39 80 -52 112 15 -193 -84 -141 -96 -124 -47
3504 -47 -68 -76 10 -131 113 172 22 181 -42 123 120 120 217 123 -65 -35 -114 -127 -127 145 -106 47 106 129 166 -110 84
3531 84 97 -165 6 -60 39 98 68 8 40 145 -95 -58 -16 43 -46 -62 -89 38 -22 97 -64 10 0 -67 127 155
3557 155 51 -114 267 65 -63 -126 30 -40 -122 124 -123 -91 -43 -179 -197 -115 -86 -10 7 39 148 11 106 61
3581 61 -22 48 174 87 122 -6 -2 -200 193 -147 -193 -176 -55 -109 -6 -7 21 48 62 47 32 120 39 248 34 91 -67
3608 -67 28 -68 -83 -41 -106 -67 -35 -86 -49 -86 -187 118 194 -35 3 53 105 60 95 138 -36 105 4 -23 -78 50 -29
3635 -29 -62 -107 -61 73 65 -61 23 -31 172 10 7 23 -12 164 71 120 217 38 -216 -26 -132 -53 -209 -83 -94 -202
3661 -202 -51 127 -34 67 31 125 20 105 80 -47 -28 20 -2 173 7 -6 -28 -19 -1 119 -51 -90 -28 7 214
3686 214 -44 -82 -193 87 -13 186 0 96 338 145 -52 106 121 -137 41 -60 -178 -158 -49 -182 123
3707 123 -114 -98 29 142 141 8 -84 130 144 175 -66 194 -1 -228 49 158 -282 -241 1 -162 -26 28 -168
3730 -168 79 -114 -66 48 12 -20 45 -105 143 99 23 5 -30 -23 -133 -152 42 -164 -26 38 24 34 -85 -75 -128
3755 -128 120 86 -53 158 -2 82 121 -41 4 -10 -18 28 -78 -80 -145 -24 -1 -52 34 -237 123 -158 -73 35 -39
3780 -39 88 -125 116 58 93 -25 216 126 -78 52 -87 -166 35 -87 -183 -106 103 39 -205 67 -70 124 -17
3803 -17 276 12 59 232 90 183 -195 41 -76 55 -122 -14 2 -148 22 118 128 22 144 10 11 51 76
3826 76 33 -137 223 -70 -224 239 155 -75 -42 -95 -17 -68 -174 83 -66 -60 120 -19 15 107 -14 90 93 144 147
3851 147 99 -54 40 -143 -121 -154 -93 35 -76 -14 -8 -128 -123 10 -28 55 146 164 -6 140 269 -32 -66 67 71 -169
3877 -169 30 19 -24 -210 -19 29 -246 59 129 -99 -106 107 75 8 -52 134 122 -5 95 156 -38 150 -60 -146
3901 -146 -12 -173 -325 -65 -37 13 153 -240 -34 -43 -70 -180 -59 86 227 -30 229 13 -14 20 47 -79 -312
3924 -312 3 -278 -146 -4 86 -34 27 -47 22 14 -2 -8 -117 56 10 242 -261 -63 87 -77 -32 21 281 -127
3948 -127 -268 -113 22 -194 100 55 4 45 -175 -27 59 153 228 -28 -114 -45 39 37 -55 -86 15 -193 -73 -15 -135
3973 -135 -107 169 -62 -31 165 -55 40 113 80 -3 220 -82 122 -241 90 -28 -9 95 -119 -17 -97 -6 -108
3996 -108 7 -80 23 145 -13 11 -64 13 -7 165 288 35 35 55 -28 -45 -12 1 46 -232 25 -58 -40 79 -66
4021 -66 -188 77 142 85 -6 -26 183 68 -91 -68 70 101 202 4 -212 -28 -152 75 -13 -144 -88 -148 -119 -38
4045 -38 0 38 -46 32 83 90 -76 190 55 115 152 68 -110 -109 -38 9 -130 -131 -112 25 22 -135 175 -195 30 20 -89
4072 -89 128 153 141 -161 110 48 -18 -219 -36 -89 -32 -36 -139 -144 105 122 14 -111 71 101 113 11 51 113 140 17
4098 17 33 -4 53 73 45 -66 -97 -155 -9 -171 -12 -62 -86 -131 16 178 -85 125 21 -5 -73 -13 -37 -94 58
4123 58 58 -140 67 -20 -101 -136 -122 157 -67 70 -3 -40 42 13 -15 147 132 -114 78 44 18 52 -16 -28 -11 53 -232
4150 -232 193 -51 -14 -87 -44 -163 1 -39 -23 36 -153 145 58 7 38 137 151 -228 -60 -145 36 54 -43 -68 -163
4175 -163 -127 -41 -132 -35 -45 121 188 75 164 114 5 26 229 -240 9 -18 105 -195 -101 -90 12 -100 -165 -57
4199 -57 -75 -247 118 -52 -69 -48 98 146 -52 75 118 100 -83 -19 98 -130 -84 -154 -171 -13 28 116 25 82 130
4224 130 -74 103 -6 -21 229 294 66 151 97 167 4 -150 198 205 -119 -84 -171 11 -158 209 -4 -180 -11
4247 -11 59 -59 145 25 -14 -8 39 128 -244 -121 50 -78 -31 -107 -45 -23 -122 40 25 -84 142 172 -132 65 41
4272 41 50 -21 121 224 -143 -91 101 24 27 -5 73 -186 -140 -41 54 -133 -98 -326 -135 -35 179 -2 -61 112 -61
4297 -61 234 -168 115 56 105 -43 -31 -42 95 -53 4 78 -44 -113 -162 -77 -43 -108 89 68 83 -31 65 137 104 89
4323 89 -175 -209 -161 -119 53 -66 -155 -160 9 -165 -54 -103 103 55 -72 78 109 98 -30 83 92 128 169 207 -11
4348 -11 69 -53 64 -40 -102 -74 -69 -33 -115 -158 88 17 -87 89 33 174 -51 -6 74 19 122 61 -56 33 -184
4373 -184 -12 -39 -42 -74 0 43 -27 72 -12 -88 -108 21 -104 111 100 29 258 32 -41 237 -18 -3 4 -132 -99 -135
4399 -135 -17 80 -16 -159 5 -146 -141 236 98 -86 116 33 110 68 -70 -25 163 -240 -219 -47 -76 -123 17 219
4423 219 -76 25 -88 -46 6 160 122 30 29 165 -17 75 61 28 -7 -24 -181 -54 -124 -15 -55 75 -54 -109 -12
4448 -12 88 -29 -79 123 132 37 166 -11 -32 -74 -124 -81 -23 66 -35 -67 -180 -94 -75 -168 -28 -84 -59 215 125 -80
4474 -80 22 -52 39 -1 42 160 -51 -44 -175 75 105 1 54 -68 -57 -145 85 -128 133 -109 10 205 -33 -109
4498 -109 72 156 210 178 -8 70 14 -106 -99 -32 -157 -129 -87 -130 7 -47 -51 15 76 -3 161 22 -93 100 79 101
4524 101 -18 -47 -53 -100 -38 4 -24 90 -88 -110 -112 -141 -50 106 -32 153 68 83 51 94 93 0 158 104 88 17 -166
4551 -166 -194 30 -199 -193 -97 -7 49 -32 -124 -177 29 -13 257 55 156 43 127 -178 -59 -65 -193 34 -63 -129 -76
4576 -76 -35 -30 -219 -119 -31 35 6 -53 142 23 -4 160 -59 96 7 67 236 192 -36 -106 122 -30 -12 -2 98
4601 98 -33 17 -47 -48 247 46 148 -29 50 -10 16 -14 -140 -86 43 89 -113 -120 129 43 -107 -7 -80 80 -124
4626 -124 90 -21 -47 49 -31 47 -118 19 3 -53 75 -29 -182 -144 -81 -90 -105 -258 -44 -75 -76 -84 -79 -195 53 -34
4652 -34 230 144 -21 -169 100 18 -35 -97 -66 -80 -214 -89 -65 11 138 -157 8 57 77 74 -42 58 -72 -93 89
4677 89 256 112 13 -66 -13 16 4 8 -9 -25 -20 197 58 68 -150 37 -6 -148 146 -85 -156 28 22 -44 -16 46 -57
4704 -57 10 8 -158 -37 -20 58 31 16 -69 -33 -116 67 15 -49 111 64 -1 31 28 -35 -78 -102 -59 -4 2 -123 -70 -73 -146 -5
4734 -5 -56 39 -119 58 -39 -121 30 47 -11 50 -6 44 99 136 -12 97 67 43 43 -93 -61 -84 -98 -70 -27 -2 -61 -17
4762 -17 24 -65 -59 97 141 256 -77 39 47 33 -1 73 14 19 -31 20 -160 -122 33 -219 31 65 -219 -107 70 72 -72
4789 -72 9 149 182 -109 50 58 -63 -141 -140 -104 -18 69 78 33 70 -73 152 28 111 75 -13 32 111 30 150 -19 47
4816 47 -16 -147 176 -27 -42 -11 -23 -117 1 -146 14 -89 3 3 79 -122 -112 24 -79 58 60 -17 46 -82 -5
4841 -5 -151 -3 -87 -161 116 60 92 5 -11 -129 98 4 54 119 90 103 -61 174 98 -128 -51 63 -93 -154 15
4866 15 -47 34 76 88 -144 -46 -161 10 -119 -31 21 -23 139 139 267 100 197 -96 -89 123 56 -57 -5 -48 23 33
4892 33 79 -134 -138 62 -52 111 116 55 118 70 -37 -14 91 45 29 -34 64 -19 125 94 -227 -188 37 -60 -80 -19 -111
4919 -111 69 -36 -45 -77 131 180 -55 44 -11 -49 -51 -39 32 149 -139 -29 -155 51 26 -65 109 -18 147 -2
4943 -2 18 -18 164 -21 -105 -127 38 -79 -75 -32 123 -81 -133 15 -65 38 -97 61 226 -164 45 43 67 98 90 75
4969 75 29 -53 -98 -21 -132 -4 20 2 30 -141 -67 -13 -126 150 8 -25 80 -38 40 33 43 182 -121 129 -13
4994 -13 -155 -88 -38 -225 3 -108 -92 35 -103 26 -17 -11 124 -96 89 251 126 39 -56 188 127 -5 -35 39
5018 39 -268 -23 37 51 -5 48 24 34 5 -121 80 13 72 -147 126 -12 4 44 8 63 187 -27 17 -9 -187
5043 -187 -243 -116 -252 73 22 -71 126 -58 125 18 -14 36 -23 94 -50 115 37 11 -142 -49 -53 -10 -40 111
5067 111 -107 1 -103 -71 41 -101 -32 -49 260 -24 -18 -162 -112 42 110 -79 -108 -68 -25 -226 -110 -255 27
5090 27 -24 112 -45 71 -53 -168 70 126 -13 89 73 58 -8 115 59 -8 18 -226 -16 -21 -62 27 -18 -84 23
5115 23 11 -19 -18 7 -35 -73 -134 166 152 75 135 38 15 -48 -38 33 -32 144 -4 -53 -33 19 -90 56 -2 104 -26
5142 -26 45 112 133 -26 -48 -4 83 76 25 4 -108 -46 23 65 -110 87 89 -45 -104 -69 -134 84 32 -28 134 76 -67
5169 -67 83 0 20 129 84 -52 -59 -102 121 -109 -107 -121 56 -75 152 -21 -52 4 129 201 360 -13 132 76 -70
5194 -70 -67 62 14 -100 92 -50 -171 -89 -45 -52 -16 -67 80 -15 140 -23 -170 -21 -105 24 50 -131 65 -60
5218 -60 57 -59 90 -95 -119 -74 -61 35 262 136 32 101 29 149 50 98 -81 -46 62 18 62 201 19 -138
5242 -138 147 -90 -83 -59 -31 -11 -59 -96 57 7 -101 -9 -48 121 -32 -33 -18 -107 -50 -192 40 -37 57 -133 -271 -55
5268 -55 70 -11 -29 -109 41 -79 -138 -123 -113 43 -87 98 138 22 76 -100 -13 185 -108 6 -155 -18 -31 -90
5292 -90 -145 -48 -29 56 -81 -81 76 -6 -24 -108 69 14 158 24 83 -24 -33 -15 44 -18 -127 47 140 143 240 0 99
5319 99 -134 -55 103 11 106 31 -81 15 -27 28 71 -8 152 21 32 -192 -205 -133 -184 71 68 -49 32 42 -214 44
5345 44 65 81 -26 -117 -14 11 9 -21 88 -49 -61 -99 95 -208 -127 -131 -9 36 82 -122 40 9 -158 44 92 30
5371 30 -25 -80 90 -65 19 -71 75 -143 -31 79 -53 -151 -64 -74 45 -23 82 83 25 52 84 179 45 -79 65
5396 65 -35 -63 107 15 22 9 -143 74 -21 -68 68 114 75 -78 -31 3 -31 49 141 -9 237 105 -171 173 -9
5421 -9 -161 -52 -159 66 -70 50 71 -13 -65 5 -45 150 82 -74 58 217 19 -63 -29 -51 -60 -92 -125 31 -154
5446 -154 17 -29 31 -53 -65 -150 112 88 -91 -102 175 -78 141 99 -10 -11 -137 66 -220 -20 92 -97 -56 -171
5470 -171 -75 -101 -53 66 12 -140 32 -71 133 -79 -34 148 38 57 205 44 -36 40 -63 -117 -73 60 87 -61
5494 -61 -20 -58 -38 -11 85 -54 -1 205 56 -24 -13 -82 -130 153 -28 24 134 -93 -15 -181 37 -146 84 11 -52
5519 -52 83 -16 -7 58 -30 49 161 51 86 -23 56 41 33 83 -14 -45 42 -179 -253 39 -192 -127 -201 -140 70 -46 -5
5546 -5 60 -140 141 118 -33 14 2 163 -66 26 -125 -37 -95 -11 -74 13 -182 -85 176 -3 134 -9 99 -74
5570 -74 261 -1 -59 49 -31 142 -25 -134 98 -168 96 -33 -35 98 -119 81 35 98 24 -27 166 152 -154
5593 -154 -36 128 41 -108 -7 15 -190 125 -115 -147 33 -131 -56 -5 -199 30 -28 210 -24 183 93 -36
5615 -36 82 53 94 16 -37 -42 -48 -132 113 -11 -157 -43 -74 -195 173 -100 -88 55 73 18 85 -67 57 -108 5
5640 5 70 -37 -14 -85 31 5 -143 -217 34 23 54 13 1 47 -87 48 19 23 170 30 157 -22 -27 -35 79 11 -84
5667 -84 4 -180 -224 -168 93 -35 9 -90 -97 35 112 -37 14 -155 24 34 181 213 49 58 58 -67 -16 -215 -144 109
5693 109 58 -98 72 174 37 -46 -74 68 122 -129 -55 30 123 36 64 57 -34 -73 172 -43 -187 127 -69 -175
5717 -175 119 -156 13 56 -63 31 -108 -66 87 39 1 132 -25 -103 55 -39 -117 -98 -34 -107 -127 -26 -60 58
5741 58 151 20 -70 68 -5 -117 57 209 102 106 -21 -134 -49 -128 149 -15 51 -84 -118 -74 16 82 -246 66
5765 66 141 225 82 125 143 73 -17 61 52 116 -36 -84 -6 -94 94 6 -107 -19 -181 97 -166 26 -2 143 -66 -16
5791 -16 -36 109 139 -53 68 13 16 -69 113 -132 -14 -15 -252 -21 7 -246 -100 46 200 -6 185 97 -52 118
5815 118 96 55 -198 55 235 -69 102 -78 -43 -62 -88 -125 -111 -99 -136 -20 -160 -109 54 97 -40 142 86 -128
5839 -128 -209 85 -97 16 -68 65 -7 -16 18 42 16 -18 31 60 -43 222 -35 4 69 -25 92 224 -107 -48 66
5864 66 -15 120 -84 153 -78 99 -121 -81 -31 -207 -125 -34 -42 5 -27 -15 128 -14 -4 22 28 85 -50 -106 -4 -184
5890 -184 12 -100 -86 -176 -33 -101 -43 9 -92 -26 86 119 86 68 78 -25 -125 -2 -37 57 -174 -60 -105 -19 -6
5915 -6 -66 -90 -76 -72 -41 -166 62 -24 -32 98 13 135 70 -106 23 -41 55 -85 -48 -146 10 -27 -91 -6 1 -101 34
5942 34 -40 -105 -26 207 209 124 37 8 -19 9 -184 -11 36 64 86 -59 0 -118 -143 17 -138 -260 26 -85 20
5967 20 94 87 -28 15 78 -30 -88 12 31 -84 -19 79 47 -21 -46 110 16 -34 97 -182 129 12 187 28 -42
5992 -42 33 -81 49 -39 234 39 34 -24 -51 7 135 134 -50 -94 -71 -135 -86 224 60 -77 163 -83 162 113 96
6017 96 63 49 -81 150 3 -147 51 0 -42 -198 -42 136 -52 -12 -111 165 129 -67 22 7 185 113 165 129
6041 129 48 -80 -117 -197 5 -25 -76 -31 -80 -7 -55 -89 92 -152 85 96 32 50 38 -74 86 -15 23 -87 22
6066 22 -62 -3 2 0 71 -166 74 -66 39 -62 -5 23 -66 12 39 -122 32 121 209 15 -91 22 -4 -13 -23 -189
6092 -189 -72 52 -164 41 -118 -11 161 -3 -159 98 163 -71 -9 105 34 128 127 59 -4 20 -48 -57 -58 -114 136
6117 136 -74 -58 141 -38 11 136 -85 -86 -125 -11 9 -161 -12 58 151 99 -44 -19 -173 34 -36 -22 70 -78
6141 -78 -17 -2 -180 -35 132 119 -4 84 75 -42 161 -19 -267 -18 -86 -16 -87 -76 30 -178 24 41 -53 4 34
6166 34 -71 63 144 -67 112 -46 81 23 110 -3 23 -119 26 163 -21 -106 -24 -105 32 -24 -43 -15 -23 -11 -53
6191 -53 96 136 42 12 59 -6 176 -78 -14 -91 27 30 27 -24 -153 -64 -105 -15 11 -70 74 -74 54 -46 -182 13
6217 13 202 121 -27 111 14 28 -225 -115 92 183 94 -170 104 58 132 18 213 247 -54 68 6 -63 65 -141
6241 -141 29 -99 -89 295 -27 -19 -157 48 -40 -157 96 19 -81 17 66 -59 -176 108 37 68 81 41 -64 144
6265 144 -8 108 52 37 -255 80 -152 33 19 -122 -101 68 -25 -24 165 -61 91 -137 176 131 -25 -147 -46
6288 -46 -107 -28 -172 97 -18 -198 -137 50 23 -150 -8 -119 140 -14 -87 -3 6 34 -108 -159 109 35 -95 -131
6312 -131 49 -21 30 -52 -117 -115 -107 -86 25 80 86 216 -47 58 62 43 150 83 96 -43 65 143 67 -116 -49 -211 -169
6339 -169 -158 -183 -44 1 -43 -83 -47 -158 -39 -22 150 -46 -49 194 84 -75 69 121 -2 -231 -18 -181 -207 -220
6363 -220 11 33 -56 -105 -18 66 11 109 146 -26 -7 -9 -117 70 88 39 -53 -199 -116 158 81 -55 -40 -131 -61 -79 117
6390 117 -216 -31 130 37 86 177 60 5 85 58 16 167 -38 48 48 -21 17 -101 -22 145 -41 51 106 98 44 51 21
6417 21 -89 -129 -53 -3 -35 -43 -157 -109 -76 -64 -114 -23 -113 4 43 70 186 56 77 46 134 19 17 87 68 51 -96 50
6445 50 52 -106 68 -93 -73 -56 -36 -178 -51 -59 116 -42 -14 -42 -113 30 -15 -66 107 -40 57 24 -96 30 -165
6470 -165 -74 35 9 -56 -62 160 132 -88 -57 -131 -6 3 120 155 87 18 -43 -151 44 110 -106 40 52 -58 14 50
6496 50 -184 -112 9 -51 65 57 77 75 -43 186 97 61 -26 15 -43 -93 -60 81 -142 -90 -33 -94 -54 -113 35 90 21
6523 21 -80 -40 14 -60 98 -102 201 153 -137 -55 -48 -53 -8 106 -59 -2 -85 -42 -90 2 40 49 57 -140 -51 -167 76
6550 76 110 79 -10 5 73 23 23 133 -10 58 -81 -80 -75 -133 -114 -194 -41 -17 59 -77 102 120 -54 14 -69 178 -16
6577 -16 63 197 -58 -165 -84 57 -44 40 -202 -131 -60 -51 55 -208 66 -59 -102 -33 126 -23 10 133 -111 -57
6601 -57 -86 -98 -36 -59 43 -147 -182 -31 -108 -100 -57 -165 12 232 81 102 72 115 -63 109 71 -71 94 58 -197
6626 -197 -122 -131 -99 107 -11 -31 -227 -83 7 158 69 46 199 -36 49 -117 49 124 -22 -72 104 -61 -92 26
6650 26 143 -30 -170 -29 6 4 71 94 -50 7 30 40 -80 6 181 58 105 68 28 -109 -100 -42 -76 -116 -91 13
6676 13 -205 -53 -52 -19 133 0 -116 -56 187 -36 54 -18 -6 72 -165 5 -11 43 -6 47 -103 -161 17 44 -75
6701 -75 -32 24 -55 17 88 117 88 90 54 59 94 81 41 -25 -214 -72 150 -152 -180 -171 -5 -51 38 77 138 93 8 42 78
6730 78 159 49 -7 26 153 124 0 -97 -70 -45 -62 22 -98 73 -56 104 -102 145 170 19 28 -129 66 -58
6754 -58 97 171 76 1 22 -204 17 -56 -55 -53 68 -76 -50 -102 205 -38 109 -22 98 47 -23 29 31 113 -27 -83
6780 -83 -29 -28 46 96 5 -42 -26 -156 41 124 -55 -5 -21 146 -21 -133 -62 -22 120 192 137 151 -154 38 122 -121
6806 -121 15 -10 -22 -38 -40 -90 90 157 -14 14 46 -18 62 159 157 -64 128 -132 50 124 -100 72 45 -53 -7 -40
6832 -40 53 -80 -15 102 138 -105 58 39 17 86 -103 116 13 -24 -156 -88 79 -88 -121 -152 -99 -27 -74 -190 -101
6857 -101 -169 66 -16 36 -5 82 -88 -44 15 38 12 -99 -50 142 33 49 -16 -277 6 36 -34 43 12 1 95 141
6883 141 -27 93 119 -15 32 18 -53 84 67 -14 -214 -245 -69 -24 -121 139 -52 -194 -104 8 -74 175 -21 104
6907 104 187 196 96 24 21 47 90 -8 -110 -136 -58 128 -117 -181 -119 -77 29 -59 51 -100 100 82 -11 159 -109 70
6933 70 46 -1 50 42 98 142 -53 -21 -83 -187 -25 30 -4 143 70 51 114 57 36 -10 -24 34 143 10 19 -81 74
6960 74 -122 154 -172 141 -46 -40 -222 -121 3 79 -69 13 -69 138 168 -61 149 17 -78 87 151 -164 0
6983 0 -111 -163 -8 81 80 -141 56 136 27 134 27 -13 -117 111 117 95 -2 -102 204 70 -14 -60 160 66 6
7008 6 -182 -71 74 -73 5 94 -184 -46 50 102 51 -233 -44 17 194 79 -90 41 49 -121 -111 -8 -148 -45
7032 -45 33 -8 41 -76 40 -160 -185 -10 -51 91 163 122 -8 -119 -117 -138 17 -21 -6 -105 95 32 9 -57 -44 -203
7058 -203 -101 -77 14 83 -175 157 37 74 2 48 -74 11 85 -71 -33 28 114 -70 89 64 35 102 16 -131 33
7083 33 -4 68 222 48 76 63 -68 -2 -119 -35 -63 -157 -58 -66 71 -135 -82 79 53 -134 12 94 106 -56 231
7108 231 68 -63 28 81 52 -86 -136 -37 -55 157 -115 -130 -74 65 -30 29 -116 14 -105 32 -13 -136 -104 144
7132 144 134 190 -58 -87 135 84 49 -14 -26 59 148 -173 -2 -98 -1 148 -33 -57 184 261 84 -23 134 -6
7156 -6 -109 -120 93 157 38 -167 32 -237 126 -114 -79 -157 -193 31 -60 111 78 -97 12 -46 41 -11 -140 41
7180 41 -62 85 -75 248 -21 -20 -29 -3 19 34 1 -50 60 149 -26 103 35 -84 154 163 52 -11 31 -126 -28 -156
7206 -156 -30 201 179 -138 3 -34 118 82 16 -34 -66 10 101 30 -47 -111 -22 127 100 183 5 133 76 102 -50
7231 -50 31 -61 -109 -6 51 129 -24 -50 -98 -132 199 28 15 33 224 -23 -44 13 89 63 86 86 -205 -52 -50 -65 67
7258 67 -113 -205 -63 -50 227 -91 -157 19 68 38 61 111 -123 10 -220 -57 4 -37 69 -123 -105 -38 70 -17
7282 -17 -1 95 165 13 146 117 -22 176 -42 47 -59 60 -120 58 58 -21 -15 -182 35 -27 127 -203 -58 -146
7306 -146 10 -30 141 -26 6 -25 -14 14 134 -110 3 13 93 -38 -58 31 28 -116 -133 44 -88 -3 -26 -52 95
7331 95 5 -78 -79 118 -36 -161 233 -4 12 52 -14 -24 -76 40 -64 31 -146 93 -121 12 43 -53 174 20
7355 20 48 1 56 137 -104 -20 46 -12 -171 227 71 -38 -19 115 -40 -172 -51 -15 77 -16 111 38 -19 29 10
7380 10 -14 -37 13 -85 51 -4 -124 37 -4 45 41 -222 117 -170 -10 101 -38 139 88 165 141 -18 -15 -2 96 -16
7406 -16 112 -155 -30 21 24 -108 151 4 -61 81 -48 72 105 96 3 194 115 75 -104 -7 -50 54 121 -126 -46
7431 -46 -36 -149 176 30 81 27 -58 -26 -16 20 44 66 7 44 -19 -8 -13 5 -12 -48 133 -82 -90 -116 -172 -85 -132 8
7459 8 195 -77 148 -12 -24 -17 153 24 -136 -109 73 55 -114 75 -141 -103 -14 -8 -166 171 24 -36 -106 -5
7483 -5 48 25 121 107 119 -78 -64 -19 -60 -10 46 88 123 -27 34 94 27 -75 -27 -28 94 88 168 88 30 86 14 14 6 -37 26
7514 26 -128 -46 -105 -85 20 2 -114 34 72 53 14 -6 -36 -86 257 -20 -29 62 12 99 57 2 3 -92 -88 110 -78 -98
7542 -98 -29 -7 28 31 -119 -86 -56 87 -2 2 214 117 -81 11 8 177 118 -121 2 -91 83 -58 -16 -39 -15 -20 -124
7569 -124 87 -168 6 36 -32 -72 -177 32 257 -28 -89 42 197 -102 -86 -60 -34 158 142 13 34 122 40 -7
7593 -7 24 28 49 81 27 55 -66 71 -43 19 114 -53 -59 13 -4 1 145 -81 -30 -144 -58 178 -11 -105 34 8 -39
7620 -39 153 139 94 4 72 -101 157 95 -42 -28 -33 -78 35 66 -95 49 99 -179 23 17 1 95 85 0 73 45 95
7647 95 110 94 -104 8 368 165 -29 -40 48 -123 -27 -169 -130 -24 -79 -137 -149 -112 49 -3 58 160 -309 50
7671 50 187 16 177 -12 136 -66 59 44 69 -10 -98 -118 -49 -99 49 67 60 143 -129 30 35 -41 172 8 -137
7696 -137 46 -72 95 43 -113 91 129 40 40 194 -10 31 -93 48 -53 12 117 -152 -101 -37 105 119 40 -16
7720 -16 -47 49 -155 16 -64 80 79 -76 -2 88 61 -20 11 -29 10 -14 65 66 98 -177 -121 54 -13 -32 37 16 -39 -100
7748 -100 -24 29 -8 -60 -59 -25 217 7 112 169 153 64 -281 61 -4 55 -91 7 -71 -114 -12 -153 60 4 -90 -112
7774 -112 15 -85 -4 160 -12 -97 17 -23 17 61 -24 73 38 -57 -30 -146 -60 42 69 39 47 -8 168 -172 133
7799 133 -68 108 -119 6 -26 -120 -52 33 -115 -58 82 -46 -33 -204 -35 98 59 -47 27 6 153 72 -56
7822 -56 -102 44 -13 88 -103 36 24 44 135 69 22 -135 21 -209 57 129 -65 -166 -148 -15 -128 61 182
7845 182 78 65 150 101 -45 -98 -32 -108 199 45 -118 85 50 147 -107 22 -43 -94 -114 110 -105 -36 84 119
7869 119 106 -205 -128 48 94 16 -31 -58 -35 -163 -166 47 122 -5 95 -101 -55 -109 -137 -123 -78 206 -13 24 173
7894 173 110 -89 -100 -18 -87 -10 45 59 -2 -43 89 -77 -8 -88 70 80 -5 -42 -81 -50 -62 66 -80 -46 -55 42 -109
7921 -109 -28 -133 -68 1 -152 -98 -53 19 42 68 -21 45 104 -88 19 19 102 79 46 -25 53 40 166 -59 193 113 154
7948 154 -110 58 -19 1 29 70 -41 -100 -31 -67 43 -15 131 -13 45 45 -91 -58 96 27 -22 56 60 69 -95 106
7974 106 -66 -149 112 -28 -72 -115 -95 18 -5 -57 118 -66 164 -102 -170 128 -96 -58 88 10 87 -6 107 178
7998 178 -127 152 177 -113 27 -42 -82 -68 33 30 -86 -21 -122 -116 -118 -21 -73 -13 -43 -46 -219 -95 23 67 -149 -37
8024 -37 145 91 -52 17 100 -134 -110 82 31 -211 51 116 -69 99 -27 -18 -76 -39 3 -120 -70 -156 -53 118 -132
8049 -132 -92 113 -52 -159 64 -38 29 -111 -138 -26 38 -165 -62 5 -21 -107 -35 116 -154 109 -42 -54 -92
8072 -92 -79 42 -16 42 65 5 -49 111 -71 -44 -46 119 4 19 -51 76 -100 64 -59 69 36 166 -99 121
8096 121 133 -120 -120 -2 70 -41 24 -114 -27 13 33 68 85 127 -139 -23 -22 -102 -62 -102 -1 -74 -27 -76 65 210
8122 210 -65 14 -4 -123 38 47 44 -58 155 -13 -70 58 -62 -126 30 -44 -120 165 -35 6 7 -39 108 -9 -41
8147 -41 41 -20 -52 -119 -121 76 81 7 10 27 139 114 21 39 -49 59 -156 23 29 -99 -144 59 27 26 -38 77 34 -19 -73
8176 -73 -61 54 -88 24 154 54 -159 -30 -59 6 138 -85 -18 50 121
8191A21
$$ Imaginary data points
##PAGE= N=2
##DATA TABLE= (X++(I..I)), XYDATA
0 0 0 0 0 0 0 0 0 -8 8 -8 8 -16 16 -24 24 -32 41 -56 64 -80 96 -112 130 -156 184 -216 248 -288 329 -380
30 -380 436 -496 564 -638 722 -812 913 -1022 1142 -1276 1420 -1578 1749 -1938 2144 -2369
46 -2369 2613 -2883 3178 -3499 3855 -4246 4679 -5165 5708 -6316 7010 -7808 8732 -9821
60 -9821 11128 -12725 14738 -17354 20911 -26055 34177 -48979 84571 -353338 -54500 696217
72 696217 -77133 -383445 49601 175466 -139793 103577 228369 -224605 -340790 258334
82 258334 298739 -200296 -183985 206002 146261 -22152 4854 -60021 -158817 82724 214193
93 214193 -108653 -250345 101571 190918 -53874 -25433 83156 -111570 -135969 132982 116645
104 116645 -144082 -55533 156721 -7029 -129289 109622 98556 -196021 -91736 167966
114 167966 -25234 -203222 83203 221862 -100681 -189291 125785 134019 -136697 -53763 134107
125 134107 -17927 -106072 94656 136368 -50736 -69360 59626 27073 -64551 -18808 4413
136 4413 -19786 45708 19130 -114767 -22144 150321 17705 -158753 -27834 103077 -23924
147 -23924 -59586 102420 43574 -138997 4227 166690 -31683 -146410 51455 86824 -100239
158 -100239 -61219 115921 22150 -119193 23720 97283 -77034 -69429 98876 27078 -91836
169 -91836 28672 99361 -40064 -59765 90125 60747 -92158 -41361 54544 -13053 -19342
180 -19342 50910 -27568 -89974 35870 87008 -45243 -77385 34554 19390 -59141 35102
191 35102 84314 -62756 -63329 103647 59112 -93965 -26610 83395 -7184 -74300 35691
202 35691 48211 -76133 -26507 95128 -2701 -100787 4610 62929 -15908 -22087 33323 -6713
214 -6713 -40045 51677 71152 -53363 -56271 55213 28036 -41898 4052 18833 -38844 -11367
226 -11367 50553 -10529 -75859 11972 65629 -38094 -55799 47431 28304 -40029 17349 49411
238 49411 -29318 -33697 53584 32777 -60169 -15441 62103 -10936 -56337 28428 32342 -45821
250 -45821 -22830 32923 -5468 -37388 16428 30654 -30144 -13962 49169 7541 -36335 19840
262 19840 31843 -22649 -11949 26210 -970 -26451 11468 19820 -33212 -21074 35555 -2937
274 -2937 -46087 10015 30538 -21738 -15999 30775 11897 -24032 9804 35131 -15936 -23389 35708
287 35708 16283 -38307 -2339 31084 -10680 -26766 9080 8899 -24936 -9246 22141 -9172
299 -9172 -25057 21873 19914 -21554 -210 26876 -82 -12548 12405 12643 -13848 -3487 21226
312 21226 -6755 -24625 12656 10619 -27006 -9632 16273 -6812 -18571 7496 14595 -10150
324 -10150 -5630 22767 4632 -17755 12803 19682 -12836 -6309 16247 2479 -13041 -737 7939
337 7939 -10194 -13744 7170 -1401 -18653 3196 11665 -9184 -3802 11679 3991 -3183 5800 9672
351 9672 -2874 -3063 13771 4140 -12734 3136 8336 -10513 -6760 2978 -6495 -10008 958 4759
365 4759 -6839 -7607 10044 6948 -7309 4226 8901 -3198 4020 10830 -855 -4854 3899 7255
379 7255 -3783 -9343 1240 -1835 -10495 1576 1361 -12891 -2640 9552 -207 -5609 2059 6953
393 6953 1398 574 9663 1769 -7361 9358 10950 -9256 -5943 5144 -2647 -7296 -542 -421 -10902
408 -10902 -7698 10804 3546 -15089 68 11963 -965 376 8246 -574 -3438 9481 12802
421 12802 -5277 -11920 7607 7563 -10527 -2889 1785 -13245 -4509 13096 -1557 -18718 -3058
434 -3058 17522 4518 -12665 2820 9780 -2722 7274 13011 -9754 -8871 15270 10838 -12246
447 -12246 -11166 4381 48 -7646 5100 -1840 -21654 1650 23565 -5490 -21389 5504 17009
460 17009 -103 -4352 7806 1989 -5838 12500 10809 -16947 -7924 14903 -22 -12371 -114
473 -114 -1573 -11826 1593 15253 -8769 -25035 10101 25904 -9835 -14544 13540 8505 -5621
486 -5621 7204 11594 -8599 -11724 12267 11906 -14265 -11049 4543 -2885 -1534 5812 -10831 -15496
500 -15496 10155 18001 -8424 -18674 8489 18372 -3031 -1340 10743 -5290 -7808 15395 11065
513 11065 -14943 -14801 7217 9971 -6103 -8098 -4801 -8758 5596 14806 -11196 -18420 12060 18388
527 18388 -5528 -7551 10066 4879 -8336 9532 17985 -15154 -20704 15329 16396 -12658 -14983
540 -14983 85 2789 -161 1382 -5662 -12636 5088 16938 -5475 -9997 11560 6553 -5511
553 -5511 8846 9346 -13712 -9747 20636 13318 -24787 -15928 18981 6094 -15740 -2741 436
566 436 -9050 3528 12531 -5616 -13174 9837 15382 -8668 -5351 16124 1410 -10992 10600
579 10600 8923 -16808 -7268 18102 3548 -23847 -8084 16804 766 -13582 1660 970 -7904
592 -7904 7119 12605 -5525 -7335 9204 8790 -4918 608 8872 -6898 -7196 15430 3152 -22272
606 -22272 -3789 17493 -2854 -19985 -1057 12054 -3852 -5653 10468 -1363 -12996 10806
618 10806 17715 -7179 -9252 8727 6248 -4235 2840 5374 -11446 -8932 13721 2400 -18810
631 -18810 -1166 11374 -7420 -9217 8943 5154 -9724 -148 14052 121 -8559 8856 7526
644 7526 -7724 2746 9505 -8131 -9026 9152 5778 -12995 -8954 7050 -642 -8494 6429 3910
658 3910 -13811 -520 16787 1613 -11798 2015 12352 1584 -4214 4984 805 -7477 4649
671 4649 7066 -10553 -8445 6643 2403 -7978 -3721 3140 -2153 -3803 7113 3606 -8555 1966
685 1966 11821 -568 -4389 5723 4039 -4386 -1007 6073 -1489 -8973 1820 4347 -8541 -4504
699 -4504 5883 -2539 -6786 3027 4399 -3782 -1866 8145 3798 -5782 2888 8961 -3069 -3292 6087
714 6087 17 -6095 801 3162 -4746 -6018 3103 1550 -8347 -1540 6743 -2468 -3695 5440 1763
729 1763 -2834 3885 6809 -1199 -4329 5084 5679 -5191 -2743 4263 -3385 -5211 3100 -253 -6922
744 -6922 -2112 3963 -363 -5363 1270 5254 -2214 -129 6884 228 -2783 4840 4177 -2549 -1892 2747
760 2747 565 -4663 -359 2523 -5678 -4774 3955 -592 -5655 631 3198 -694 -1023 3883 3204 -2212
776 -2212 1332 6847 -901 -3649 4071 1938 -3773 -947 1375 -2326 -4451 -217 1457 -4256 -3098
791 -3098 3912 -441 -3733 3465 3584 -1519 706 3950 1847 -1200 1492 3571 -2086 -2446 3066 -992
807 -992 -5219 352 863 -3936 -2556 1033 242 -2397 27 3597 -527 -1266 4754 2394 -2001 2361
823 2361 3429 -897 -1054 1317 903 -2588 -2443 1141 -1883 -3798 1236 -89 -3710 185 1977 -372
839 -372 -258 1541 2525 657 445 3371 732 -1492 2481 994 -2633 -399 260 -1818 -1929 -1227 -561
856 -561 -1960 -1879 1592 -176 -2253 1919 2089 -384 1797 2506 864 634 712 1786 171 -2023 516
873 516 84 -2410 -637 -864 -2597 -580 -400 -695 -601 -609 1050 1605 197 1382 1462 279 2559 1433
891 1433 -1032 674 908 -343 -762 -1410 -1135 -1255 -2115 326 -679 -3096 55 1937 -375 80 903
908 903 1572 1765 722 1623 1323 -413 1215 1158 -1552 -654 -635 -1840 -451 -1053 -2223 -1440 -460 623
926 623 14 -1650 610 1886 444 1871 1092 -328 1994 2098 -19 -271 -170 -1 -458 -1556 -52
943 -52 -1670 -3391 690 1230 -2696 -1849 1011 1590 903 -467 721 2378 1298 1264 745 -448 1084
960 1084 488 -1177 322 -761 -3035 -688 893 -885 -3083 -2051 2350 1388 -2687 163 2551 605
976 605 925 1618 800 517 477 1451 831 -1547 -743 74 -1794 -502 -504 -3019 -1041 1309 -134 -1827 -1176
995 -1176 2204 2461 -1386 307 2916 362 203 1817 601 -404 -229 -92 118 -1265 -1565 -1286 -1906
1012 -1906 1045 260 -3855 -999 3634 170 -2119 1462 3632 322 -1775 2566 3367 -2250 -1072
1027 -1072 3058 -319 -2591 -581 -81 -944 -1475 -1322 -1054 -704 895 551 -2619 430 3178 -434 -100
1044 -100 3105 1219 -995 971 2201 159 -2784 -304 1602 -1476 -1873 246 -1901 -1563 672 -705
1060 -705 -1461 455 1767 1008 -1374 842 3283 -92 -462 2687 760 -1823 115 1589 219 -3182
1076 -3182 -2289 1517 -541 -2512 -489 -225 -966 542 825 138 368 536 1281 1201 1055 1661 -777 -369
1094 -369 2414 -509 -3014 144 1121 -1917 -2275 -381 455 -1990 -1005 2266 -552 -1855 2531 2230
1110 2230 -1120 350 2026 677 99 1127 1193 -1621 -1631 1712 -496 -2773 -179 -104 -2006 -346 325
1127 325 -448 -544 214 1059 478 642 1861 333 -525 2182 750 -1245 571 724 -1447 -1499 115 259
1145 259 -1944 -2047 957 -43 -2014 663 1423 -292 -132 1376 1533 604 -42 1721 1056 -1166 181
1162 181 930 -789 -935 -558 -909 -862 -871 -363 -377 -1357 117 599 -625 1126 1302 -332 971 2065 612
1181 612 -44 420 845 -385 -1201 956 -180 -3208 -567 1147 -1759 -1859 643 465 -954 -227 1926
1198 1926 921 -1105 1425 2595 -708 -289 1841 229 -629 -384 1 -592 -1406 -256 -182 -1895 -990
1215 -990 325 -766 -157 702 -362 411 1614 975 302 262 1027 889 -742 355 988 -1626 -1000 753
1233 753 -636 -1736 -837 135 -343 -1424 -153 1324 -789 -325 1990 955 -210 745 1384 789 -210
1250 -210 111 880 -830 -1061 481 -796 -1392 -469 -396 -704 -549 -377 289 18 234 1246 279 444 1635
1269 1635 435 -26 1285 252 -747 -23 269 -241 -1376 -916 529 -1303 -1592 814 -196 -1207 505
1286 505 1076 264 -141 829 1670 -10 -93 1415 340 -971 554 250 -1006 -580 -591 -422 -647 -1010 -42
1305 -42 -346 -806 694 305 -394 941 1012 190 930 810 413 198 -48 701 -484 -1163 326 -459 -1543
1324 -1543 -347 -203 -998 -703 -13 264 -305 -266 1195 798 -233 877 1334 -150 107 569 119 -171
1342 -171 -687 -150 -231 -1351 -704 -375 -1181 -470 51 -409 183 519 545 583 391 781 712 -133 782 912 -764
1363 -764 -89 442 -591 -811 -622 -357 -602 -1213 -64 40 -787 53 977 -91 -98 1262 640 398 381 698
1383 698 533 -189 -37 384 -812 -656 197 -750 -932 -410 -453 -503 -354 152 306 -424 466 1328 -96 102
1403 102 1196 491 -84 251 598 61 -702 -321 -12 -1208 -1147 401 -745 -817 183 -119 -362 195 717
1422 717 660 -125 646 1428 -96 -116 1154 209 -770 187 60 -662 -890 -331 -67 -1148 -710 488 -327
1441 -327 -699 712 257 -238 701 914 364 100 809 955 -575 -200 1085 -310 -1244 175 82 -1197
1459 -1197 -830 -70 60 -665 -364 754 28 -52 1073 434 -183 1174 789 -243 204 491 339 -682
1477 -682 -479 540 -851 -1572 551 123 -1429 -527 548 205 -292 -28 971 352 -72 1426 767 -288
1495 -288 713 732 -490 -205 307 -557 -1031 -403 337 -932 -1421 540 336 -1319 62 1243 166 -134
1513 -134 827 828 105 97 952 199 -928 810 222 -1408 -310 273 -1305 -944 219 9 -963 -533 1022
1532 1022 284 -726 856 1115 -282 57 1127 589 -205 121 500 -371 -839 2 -73 -1136 -117 44
1550 44 -1101 -428 422 105 -469 61 1005 597 -47 766 1110 -265 83 820 35 -569 -318 -92 -643 -1043
1570 -1043 -194 84 -1185 -224 657 -397 -333 877 393 -290 433 1198 387 -269 815 1057 -746 -367
1588 -367 981 -513 -1385 -179 -71 -714 -699 183 -87 -904 299 1068 -396 120 1429 294 -147 916
1606 916 687 -516 -217 797 168 -1247 -75 513 -1177 -1105 493 -222 -916 -37 470 -289 -123 923
1624 923 916 -312 207 1199 239 -263 735 139 -722 -312 131 -211 -907 -515 103 -858 -857 677 -259 -540 601
1645 601 616 136 309 719 688 23 204 913 -76 -579 436 -172 -1181 -186 384 -685 -961 -63 379 -572
1665 -572 -363 1127 272 -933 828 1130 -234 222 860 71 -411 69 649 -447 -1015 280 -339 -1068
1683 -1068 -32 333 -721 -405 405 98 -341 171 1001 80 -314 1138 542 -468 404 622 -603 -564
1701 -564 205 -158 -945 -651 293 -290 -1106 460 504 -822 73 909 264 14 593 642 274 -96 777 348
1721 348 -759 62 199 -809 -515 -70 -502 -726 -315 209 -146 -323 509 518 -193 301 1042 77 -137 477
1741 477 474 -147 -217 393 108 -877 23 142 -892 -634 338 -173 -722 85 540 74 -197 912 728 -409
1761 -409 424 1170 -130 -285 328 229 -563 -305 87 -417 -809 -123 296 -808 -195 487 -296 -354 511 446
1781 446 -110 102 679 414 -252 225 563 -374 -484 501 -330 -748 -94 29 -497 -611 163 141 -502 120
1801 120 961 62 -143 723 503 -74 161 427 58 -255 178 60 -467 -452 190 -171 -807 143 24 -516
1821 -516 -9 206 37 -243 340 599 -106 -173 632 22 -432 279 264 -292 -300 185 -210 -553 -334 331 -461
1842 -461 -424 375 158 -334 266 665 108 -260 369 573 -172 -230 509 24 -536 169 196 -409 -420 3 -16 -437
1864 -437 -277 328 -152 -140 500 426 -188 316 342 129 -93 349 204 -341 -236 323 -220 -499 -24 -65 -636
1885 -636 -241 220 -308 -189 96 446 -5 -262 613 306 -329 189 436 -110 10 137 -58 -83 -253 37
1905 37 -306 -611 137 112 -526 -2 327 -127 252 344 315 -20 21 571 195 -180 144 198 -421 -172 230 -400
1927 -400 -376 -238 -171 -363 -404 109 93 -430 222 480 -38 100 347 227 -87 141 230 -49 -203 148 54 -556
1949 -556 -45 136 -210 -144 157 -145 -167 -21 281 154 -368 343 434 -188 121 550 45 -39 201 73 -56
1970 -56 -308 106 25 -323 -128 212 -253 -210 142 66 -27 18 204 114 13 191 470 -100 47 336 -173 -295
1992 -295 49 -74 -337 -308 118 -105 -347 -114 365 -67 -164 268 147 -97 247 336 -91 12 105 232 -250
2013 -250 -45 147 -323 -262 241 -111 -320 -129 95 -171 -173 131 387 -24 86 453 119 -146 378 189 -207
2034 -207 117 61 -35 -207 22 38 -398 -404 224 -130 -326 212 103 -3 -2 126 294 -64 35 340 139 -302 288
2057 288 -171 -134 31 -33 -267 -115 -108 -98 -361 -298 166 -18 -46 209 266 -150 24 154 114 -128 183 201 84
2080 84 -100 207 -239 -358 -59 176 -233 -115 -69 -111 -74 -114 490 -48 -364 202 478 -7 187 253 122 -114
2102 -114 180 168 -150 -82 -35 -43 -341 120 -85 -116 -107 212 213 63 142 98 13 -78 269 186 -99 81 198 -321 -18
2127 -18 1 -261 -249 -64 83 -184 -51 117 249 -32 -2 174 186 45 89 64 3 -9 55 146 -75 -48 87 -269
2151 -269 -233 -211 -30 -287 -33 19 10 -31 71 30 9 -33 311 94 -116 246 31 -75 -61 127 -109 -145 -89 89
2175 89 -322 -381 44 26 -110 -156 -37 -94 -99 201 210 76 29 68 -23 -164 274 95 -118 141 25 -210 -64 -30
2199 -30 66 -125 198 46 62 25 281 40 -266 -75 105 212 68 40 2 -126 -169 36 8 -119 -132 120 -15
2222 -15 -112 -27 99 -297 -73 166 184 -49 53 55 18 30 154 109 57 -47 -96 -81 -30 -105 90 -91 -15 56 -99
2247 -99 -144 -135 125 70 133 155 40 -28 28 112 -83 -5 99 -90 -107 -143 77 -13 14 85 -4 -99 -76 138 51 60 156 -82
2275 -82 -103 -92 -68 161 -37 70 24 -26 107 89 -28 -54 62 131 -28 -53 -4 20 212 133 144 -73 176 120 8
2300 8 19 30 -76 -37 50 -114 17 77 133 46 -2 -53 -30 18 94 168 15 -133 19 -22 141 63 107 232 -35 -309
2326 -309 -64 -88 -30 -91 162 36 47 -115 -120 -17 58 215 -33 109 -29 109 -110 4 10 -80 140 -75 104
2349 104 56 -23 21 161 -12 -51 -68 -38 -74 111 214 -114 -134 50 31 -23 102 -6 -57 -50 -1 -111 -154 -65 95
2374 95 -91 40 23 0 201 -44 153 -86 0 96 -112 -77 -58 71 202 -74 143 -110 -3 115 45 -71 -155
2397 -155 -26 -25 28 -127 19 12 23 95 109 36 -149 -163 -146 33 47 104 69 -96 -20 -61 44 106 -40 -38 242 -51
2423 -51 -62 -163 -28 97 -68 -135 -98 62 -144 -330 -124 99 3 -7 61 -168 -3 91 56 -9 176 135 -52 135
2447 135 15 96 70 69 30 34 -1 5 39 44 127 -77 -8 -212 -136 -92 -10 -15 -22 216 49 145 68 -29 -18 70 17 -62 58 -41
2477 -41 114 121 -46 -57 33 -65 86 144 -17 -78 5 92 -80 10 63 -42 -6 110 117 -117 -15 182 -100 -72 2 36
2503 36 38 -98 120 -102 -76 -81 237 -21 150 233 185 174 -59 -95 2 104 22 -6 -110 -45 -5 -67 -56 -1 -55 -38 -182
2530 -182 24 118 109 164 -6 -65 -38 -55 -123 -115 -118 -68 -109 -80 -22 -119 -68 7 -127 -171 -3 173 51 76 94 4 -97 136
2558 136 -20 161 -53 -26 50 61 39 -56 -53 35 107 -132 28 -152 38 28 43 -70 150 79 13 229 79 -141
2582 -141 -167 -167 -93 -15 -146 12 -193 -14 -123 -88 107 -26 67 -133 124 14 -140 69 23 -20 187 200 39
2605 39 -164 33 -160 -95 -94 52 -46 -169 -103 -87 -37 -247 -37 46 -127 -37 49 47 -154 5 175 51 27 2 -99
2630 -99 7 -191 -28 -120 163 -125 -148 -105 -144 -77 40 -28 177 102 -47 63 68 89 -17 23 31 -5 -39 -59 -93 -105
2656 -105 -69 -122 0 -75 -18 72 107 43 -63 -26 -93 -35 -1 14 -76 -8 42 -4 -106 168 -27 -7 -69 -118 -21 -67 86
2683 86 94 -170 -7 -77 109 90 22 78 10 -3 99 36 42 21 27 -91 -82 -114 -164 -85 -80 -104 -63 -13 -86 94 2 -3 73 94
2713 94 19 119 27 -88 58 -68 -65 92 177 63 -13 -3 165 33 44 -49 86 62 -80 76 105 65 125 -53 242
2738 242 -38 45 108 -92 -28 26 -98 -277 8 117 -223 -198 25 -151 -136 83 23 -45 193 -47 218 77 106
2761 106 105 29 -52 -38 70 -83 -88 -28 -85 -262 -32 -146 -212 -2 98 -38 51 20 106 -152 93 15 25 204 9
2786 9 67 -53 -66 -77 -62 -118 -76 50 -53 -194 -2 44 -148 132 74 157 30 285 132 73 30 -98 113 -6
2810 -6 -20 -39 -44 -37 -79 -232 -64 -104 -55 -91 -81 -6 130 -49 56 167 16 9 23 9 -108 -39 83 -141 -7 -182
2836 -182 -173 -119 -21 -102 79 -85 -85 41 123 46 139 76 73 63 101 167 278 105 6 -85 -91 -149 -235 -115 42 -177 -82 -15
2864 -15 87 -1 -155 69 -7 -263 166 157 57 104 45 -3 52 29 -32 -70 -183 -254 -16 76 -161 -98 68 -168 -38
2889 -38 163 -77 154 135 44 181 154 28 -34 -171 137 -14 21 -132 41 -181 -123 -136 26 -129 -275 250 21
2912 21 -34 203 78 38 97 60 26 -59 -72 61 -129 -18 -107 -132 -139 -157 -235 -150 106 -3 -27 -24 115 74 62 112 112 94
2940 94 49 84 -20 73 26 -145 10 28 -150 -68 22 -191 -26 17 -25 -49 -8 84 -41 174 71 68 -54 268 115
2965 115 112 4 -62 -155 -206 -117 70 13 -222 -63 141 7 15 51 -59 151 12 -50 118 60 101 90 69 -157 202
2990 202 -129 -170 -185 -45 -96 -107 -136 -82 -221 71 192 -16 116 290 156 -42 121 2 -101 -119 8 -8 -112
3013 -112 -123 -90 66 -152 -169 -54 -42 -188 67 214 20 57 52 160 57 74 5 83 144 -64 -2 -110 -142 -178 -69
3038 -69 -227 -35 -99 -71 25 -68 -60 239 93 141 -18 34 119 272 -21 -14 12 -52 -16 -179 10 -54 -32 95 -114 -5
3064 -5 -50 -203 -135 66 -47 9 37 -51 -87 34 30 -22 7 -34 -163 -147 -100 -65 -168 -178 105 -226 -147 78 -53 -170
3090 -170 68 -36 120 234 -31 11 -92 73 120 -52 57 49 -167 -163 -149 -47 -100 37 -57 85 -72 28 11
3113 11 -1 14 131 68 46 149 -96 56 181 97 -129 -162 -31 -31 70 -116 -95 -30 183 -64 -15 29 18 -104 3
3138 3 87 139 -62 3 100 -85 38 -62 -90 -137 -39 21 -179 40 56 -10 -145 104 166 -168 -28 76 34 -44 -16
3163 -16 98 17 -15 3 -116 -67 -82 -23 -42 -185 -151 21 -147 112 69 -107 -25 195 123 84 -19 -7 -24 86 82 -58
3189 -58 87 81 -57 22 -132 23 -46 5 -120 37 -46 23 58 26 118 -58 148 -87 75 -97 -23 -81 52 -75
3213 -75 47 -218 -299 -32 -74 -126 -111 -97 72 -11 -203 -181 -97 -18 139 -133 123 27 56 -17 -9 -19 -74 49 -63 -55
3239 -55 -64 -178 -98 -51 -170 67 -53 -11 94 91 84 81 6 -62 108 -112 149 -80 -10 11 25 -83 11 -57 -80 -66 -307
3266 -307 -3 54 -311 4 54 145 43 102 204 86 -33 53 168 40 -123 42 -64 -92 -167 -209 -156 -44 -93
3289 -93 -35 2 166 19 -97 50 228 17 -46 70 193 26 -150 35 -37 -2 -34 -210 46 -326 -142 -121 75
3312 75 16 84 10 72 307 205 85 -31 80 21 8 -1 0 -112 173 -228 -64 -155 84 67 -193 -37 33 -12 6
3337 6 167 -45 74 -50 25 173 -155 -16 -64 14 -34 -109 -111 64 -83 -53 69 -133 -164 -72 -54 -44 268 -60 -59
3362 -59 147 26 -88 56 -52 -51 -157 -233 56 -283 -66 -8 -30 -20 -126 -123 22 160 3 5 25 113 108 36 -40 223
3388 223 8 -42 25 69 -30 -65 57 -31 -142 -105 -128 -186 31 -3 28 -146 214 127 38 180 83 -31 -18 -85 85
3413 85 -132 38 -27 -23 -106 -43 -23 -86 -40 18 38 6 15 46 180 15 127 58 76 167 -7 -28 87 -79 -74 -360 -86
3440 -86 -109 -62 -72 -15 87 -23 40 -1 38 -70 114 95 47 -2 -60 97 51 -16 -1 12 -178 -97 -17 67 -67 -62 8
3467 8 -26 -69 156 158 -1 -128 111 19 109 -4 59 22 -28 222 -141 -6 110 -42 -276 -118 -131 155 -82 20
3491 20 9 -137 56 -40 133 125 138 7 -145 -5 -44 -80 -160 -16 37 -340 34 -79 -66 -68 140 -179 -162 110 145
3516 145 148 80 85 112 -18 11 134 153 -43 102 -34 -120 19 -95 10 3 64 28 -130 -105 -32 9 -29 108 232 -13
3542 -13 -16 65 98 -31 -71 85 -110 -254 -72 -190 -167 -221 -121 17 107 140 66 -7 26 26 -13 -63 58 -79 -32 147
3568 147 63 160 100 -43 100 -27 -88 -97 -145 -182 62 115 -82 96 139 103 -36 87 29 -40 12 162 -50 28 -146
3593 -146 162 -30 -76 -25 -53 -24 -68 -4 -22 105 -27 119 102 60 238 110 -30 -127 104 6 -10 135 -79 -146
3617 -146 53 67 246 -47 -10 -92 90 -68 98 92 -36 51 78 9 183 -41 12 -71 99 -57 -169 -155 -81 -52
3641 -52 -182 -18 8 -115 197 -1 -13 249 -76 176 -10 33 12 148 22 122 -63 178 20 -71 271 -158
3663 -158 -39 -98 59 -117 -6 267 92 -48 89 -6 17 69 -14 127 -57 -86 -95 -85 -129 26 -97 -112 53 -105
3687 -105 -14 60 -56 87 -29 -69 31 47 111 -28 66 19 57 6 201 83 103 155 -15 89 11 -95 -39 101
3711 101 -151 -74 -8 -97 127 -114 75 58 -80 248 328 85 24 102 31 67 152 -47 -157 -150 124 79 -146 -302
3735 -302 27 85 40 -114 -100 -3 179 -232 92 177 20 275 -38 -25 -123 58 -119 -39 -59 -94 -80 39 46 -236
3759 -236 123 71 114 149 193 -109 -66 163 81 64 -90 54 -80 4 -112 95 43 -239 76 137 -68 -192 72
3782 72 -45 -8 159 265 61 45 -9 100 -94 146 26 -223 -163 -47 -258 -145 7 -164 39 92 157 34
3804 34 -43 -13 49 -13 26 100 82 105 12 -125 -31 -163 -85 -28 -133 162 7 -78 9 -127 -6 -50 -60 -2 62 -79
3830 -79 52 288 117 61 111 46 15 -138 -16 62 -152 -87 50 -218 -75 -8 -159 27 -4 11 81 12 193 36
3854 36 -66 74 52 -19 89 216 278 -203 -1 -37 -36 109 78 -141 -4 0 82 -81 29 144 57 168 -25 136
3878 136 66 -62 85 79 -33 -101 -42 -183 -8 -10 -118 32 -109 -105 -27 -134 5 -23 32 103 285 75 -101 -10 -1
3903 -1 25 108 -229 -30 -160 -162 -43 -127 -79 6 10 -11 -127 -172 162 -58 88 168 64 84 63 156 65 65 91 -176 111
3930 111 95 -110 22 93 35 -82 45 127 -17 129 80 235 -23 4 157 10 32 -107 77 31 -85 116 -35
3953 -35 -187 -2 -113 -301 -112 59 123 -73 155 249 179 102 98 109 188 166 45 56 77 57 101 -57 -102 -43 53 -65
3979 -65 -213 36 232 -167 78 -26 -63 -35 215 159 26 91 -113 -90 24 30 21 -239 -5 39 -115 -202 -3 75
4003 75 -95 -70 -5 -79 -95 -31 210 53 44 154 -98 125 -17 41 59 103 28 -71 -119 72 -68 30 -70 29 -17 -40
4029 -40 78 17 74 63 147 140 155 126 52 48 -119 48 63 -12 -194 225 -132 -75 -49 -91 -90 -29 83 -41 -26 116 217
4056 217 9 94 179 144 -124 -9 -4 42 -226 -53 -89 -267 -66 -56 -58 -138 33 -46 161 -62 49 143 276 256 47
4081 47 111 73 -64 -38 133 9 -164 -80 -110 -31 -43 -124 5 51 -40 31 244 21 88 129 5 15 23 105 51 149 -97
4108 -97 56 -142 -147 -96 -66 2 -222 -44 -18 -72 88 140 46 68 227 -134 55 190 -115 -5 -110 -18 -26 65 -51
4133 -51 34 -80 -82 35 -68 -10 171 38 -12 40 -32 34 34 139 81 164 -86 43 31 71 -105 -4 -117 -131 33
4158 33 37 -59 -158 139 -54 -6 305 -88 -29 50 7 57 89 45 152 20 -38 8 -58 -247 41 65 -24 -29 52 162 -151
4185 -151 -6 -24 113 114 153 14 12 83 61 204 -56 66 -170 -162 -166 -45 -58 -31 -130 -58 -32 24 86 42 -70 167 129
4212 129 72 145 -57 193 -35 38 -68 -21 71 71 -27 -92 5 21 118 -188 116 -91 -124 55 28 -7 -17 41 -51 -42 -70
4239 -70 -23 79 10 90 -209 -11 -240 -175 -125 -47 5 -127 59 69 -97 6 -35 115 -8 -129 -21 220 30
4262 30 33 53 -30 89 -64 -18 -41 -235 -67 -67 -77 100 121 107 -24 93 132 61 231 38 183 200 125 28 -99 -20
4288 -20 -51 3 -99 10 -125 -32 -137 1 -24 51 -105 58 111 36 19 15 162 53 149 144 -58 -145 -61 -73 -125 29
4314 29 -141 -109 42 93 -57 2 168 68 35 -24 183 -46 -83 120 6 39 163 -46 -77 -59 -132 -26 -34 -62 -72
4339 -72 -146 17 77 79 95 -48 85 118 -129 38 48 133 7 50 15 -51 144 -9 -101 -219 -164 179 -47 -77 53
4364 53 54 54 -4 101 90 -67 149 36 41 -60 55 -79 -37 38 59 -82 118 21 -38 -179 139 -259 -43 -91 34
4389 34 118 154 144 42 91 102 -154 -84 -104 -44 24 -51 -92 28 -18 -229 41 -32 61 52 58 53 36 42 218 120 -33 89
4417 89 -57 75 7 -113 37 17 -30 90 -96 -88 70 -171 -209 -83 142 45 -56 44 -92 -44 -47 246 28 113
4441 113 86 5 19 -75 -105 2 107 -11 -186 -137 70 29 61 177 -89 111 -139 58 148 -43 -3 -70 43 -50
4465 -50 105 -175 -16 -23 -101 58 -136 -55 -67 -46 148 -67 -7 -8 33 75 -42 139 -25 44 -71 1 14 134 -161
4490 -161 127 -159 -219 -146 134 -118 -132 35 73 77 -25 -83 -93 90 88 85 49 -44 54 112 26 -242 -58 -86 20 -54
4516 -54 -96 1 -23 128 -21 175 -44 244 5 -6 -22 195 57 89 -94 91 40 -1 121 28 -88 -78 -23 23
4540 23 61 -102 -129 -25 -22 -13 54 -229 136 1 81 -67 25 91 126 -105 -178 -6 -40 42 -159 -35 10 33 188 21
4566 21 -11 16 -113 -69 23 142 -25 -2 41 27 -16 -34 -242 -129 -157 -163 -25 -128 -89 102 -154 -171 154 13 33
4591 33 86 130 106 35 -13 12 -38 -163 22 179 47 32 -182 3 -6 -61 -136 25 -118 19 45 210 -76 31 -13
4616 -13 -86 123 -26 200 6 23 78 8 -168 -50 -9 -92 -99 -127 -31 -51 -122 -47 83 122 124 184 55 -84 -55 82
4642 82 156 205 65 126 -208 -214 -8 -96 49 -45 -40 40 -71 8 101 60 -27 74 216 -57 16 26 -71 4 -179 -110 -33
4669 -33 -144 -157 -41 50 163 -96 104 -36 15 -48 -10 62 -148 54 -10 100 21 71 18 -104 24 28 -112 -132 -90
4694 -90 -26 -77 26 -100 -70 -32 37 55 13 177 141 -122 -12 61 -76 -104 30 31 -173 -16 105 -116 -78 -3 64
4719 64 48 -31 20 -12 -54 -65 19 -67 133 136 -66 109 143 22 114 34 -15 -25 -99 -1 -157 115 -40 59 -109 -6
4745 -6 149 67 6 -18 -1 52 251 -6 149 65 -58 -94 87 -30 -67 -15 -57 -139 82 -159 59 -52 27 92 -22
4770 -22 134 -68 128 15 92 29 43 -14 -102 -70 152 11 35 -89 -187 -75 -3 63 43 -15 41 37 102 -58 -40 56
4796 56 -117 153 121 25 152 -10 -18 -68 -13 -14 -116 -133 -8 -82 133 -64 11 -65 -193 0 141 19 76 -19 77
4821 77 -25 -32 52 29 -99 72 -33 41 -47 -227 196 51 89 112 1 -30 223 91 60 164 46 109 109 -156 7
4846 7 75 -90 0 -75 1 55 -43 104 14 -80 103 85 -166 -1 -11 -11 -19 126 121 -45 -175 -65 -154 138 -93 -40 -109
4873 -109 26 -86 -27 -97 3 -26 -37 -66 -103 -10 107 -156 -2 136 -22 -148 -70 157 -77 -122 -169 17 32 75
4897 75 49 -143 -46 -154 -92 -83 26 4 11 78 130 -37 191 -83 3 -225 74 -74 -88 -33 -166 -70 -17 -13 14 77 -11
4924 -11 109 138 85 137 -52 107 69 -54 -41 -132 -72 59 140 -142 101 -12 -133 82 1 183 84 -11 -12 -21 42 13
4950 13 61 -91 53 4 -9 66 -210 -84 -136 34 211 -93 -97 -181 61 -77 -187 36 60 -32 46 56 -33 52 -25
4975 -25 -108 -229 -103 53 13 83 -113 60 -101 26 -80 -211 -158 3 61 48 -2 -70 16 -13 -116 -28 29 109 -15
5000 -15 -49 0 13 -110 -100 -152 -67 102 -28 -49 126 -11 -77 11 -11 56 76 -71 89 169 25 6 -10 -158 -49
5025 -49 58 -88 -132 -140 -224 -95 -79 -51 90 112 130 26 38 88 7 -29 -25 93 37 23 76 52 42 10 -50 64 -22 -30
5053 -30 -100 -5 -126 -58 35 176 -39 198 -10 7 44 18 27 -136 79 -58 -217 9 165 -78 -124 -171 68 -94
5077 -94 -129 36 34 116 -29 91 79 -11 -28 29 22 -12 6 103 -1 96 -186 -242 -83 -65 -49 77 48 36 98 23 -29 28
5105 28 96 -2 68 28 88 59 52 -46 -75 -85 207 -91 113 -49 -91 -18 194 147 -75 8 -19 87 -54 -40 -77 60
5131 60 -40 -47 5 80 99 145 82 -87 -73 -71 -61 -57 5 -19 -122 66 189 -23 -36 27 132 78 -50 81 -84 -136 -64
5158 -64 82 32 12 -47 9 -63 -116 40 182 117 58 -22 16 13 188 76 -32 99 61 -10 177 87 -105 10 -43 -249
5184 -249 -12 81 -47 -163 55 -32 -1 -179 81 100 21 -90 -15 -22 67 9 94 5 -54 -61 -83 50 -20 2 89 -43
5210 -43 -210 193 11 15 73 -132 84 83 -149 213 165 -131 -56 181 -118 31 65 -46 50 -46 -156 -43 -98 6
5234 6 93 -4 -38 57 25 92 82 -72 123 -98 29 -80 -1 94 33 -4 -194 -129 -52 43 -45 65 -27 168 118 141 165
5261 165 28 86 88 -21 5 -93 129 -49 -109 -99 24 -89 -68 -59 -42 -61 15 104 73 -49 100 125 28 -33 7 54 -23
5288 -23 64 35 48 -86 -36 -95 59 -51 -19 3 -125 -23 -98 12 37 -67 -69 -125 218 96 -66 -86 20 85 -65
5313 -65 88 33 -116 -86 35 56 -93 -166 10 29 166 0 -119 86 47 95 44 -109 -59 -18 79 138 -119 -44 -20
5338 -20 -132 -123 89 -168 -69 75 -93 -8 -98 137 -39 74 178 178 88 -92 12 -89 0 96 -106 -35 -60 -39 10
5363 10 -89 -108 -17 46 55 -11 141 23 -25 150 33 145 -80 -112 -17 -47 -147 -65 -29 14 -294 -48 107 -39 15
5388 15 -89 32 1 -19 -125 -32 256 -42 69 -72 -36 80 -18 -107 34 -100 -266 -157 5 -87 -95 4 -60 -150
5412 -150 -193 18 47 -45 -140 129 47 45 -167 -16 135 92 -178 53 39 -109 -154 80 42 57 165 -91 -23 -9 -94
5437 -94 -56 48 139 57 27 2 117 -85 -1 34 29 -137 -141 -20 -37 54 -95 -7 -73 174 -33 -56 -154 -1 108 201
5463 201 18 -119 230 13 29 54 -42 77 -55 -87 -81 -66 47 -100 83 55 86 32 182 55 218 21 -46 57
5487 57 -87 -59 -121 -100 -123 -35 123 -10 145 -99 10 -118 -41 106 -10 42 41 -65 61 7 156 35 -37 -6
5511 -6 23 168 -1 13 12 14 106 -118 72 115 -12 87 -8 -4 113 -41 -104 10 -33 89 -126 -70 14 -162 20 -22
5537 -22 11 79 -79 -74 -42 -29 37 -44 -20 -48 -17 -84 61 -9 266 248 197 -108 5 -67 117 -29 -88 -70 112 12
5563 12 54 45 -95 -73 26 122 86 99 213 16 113 99 16 -29 -40 59 86 -59 -51 -31 -149 64 -179 -35 -48 -7 -186
5590 -186 -122 73 52 -61 -35 60 -46 -25 43 125 -70 -40 59 126 4 -145 -128 -41 -189 -38 -97 125 150 14 198
5615 198 49 2 179 49 103 103 43 32 14 -72 -127 44 12 -76 36 -67 -193 111 -21 -81 63 13 -63 56 72
5640 72 -17 118 42 5 105 -111 13 79 91 -117 -76 -92 43 -14 -92 -113 120 161 -81 -59 -87 -113 143 30 84
5665 84 -61 125 3 64 77 -24 120 4 68 -223 -119 -22 -2 83 37 -42 -232 146 165 201 26 -95 154 42
5689 42 -29 -43 -117 67 55 -29 21 -138 -1 -144 -147 -37 -47 54 -87 2 24 30 -108 89 103 -28 160 -37 -1
5714 -1 -30 -20 -24 -35 -26 -38 -154 -37 -72 -111 -8 -11 -152 -49 37 60 126 121 20 99 43 163 -25 61 50 -6 82 87 126
5743 126 -84 -57 -86 27 122 -17 -14 -133 -115 -60 105 -50 135 4 -6 142 -10 -92 -125 -211 29 -157 -60 -13
5767 -13 -82 -171 -121 79 69 155 -102 92 28 45 133 67 -24 -33 -32 -69 -54 -125 -64 -143 -101 -118 -219 -71 -38 -152 -111 127
5795 127 -111 153 212 -33 -49 121 121 82 34 49 118 -53 106 85 -15 7 14 -60 1 67 181 23 41 -63 -24 126
5821 126 -93 62 -9 -71 -194 -92 49 -45 -150 -17 -86 -185 40 -75 9 -36 -144 -28 3 -129 4 21 130
5844 130 203 -33 39 -4 43 -83 -52 -112 -125 -159 5 90 -145 -13 123 141 213 1 -103 -159 -48 -6 -31 51 -38
5869 -38 -43 -142 -14 -46 -112 -119 -24 5 5 156 -136 -81 79 -51 30 63 181 -23 87 36 136 118 37 69 -5 -70 -63 79
5897 79 -124 -105 -87 -52 -48 45 -12 -159 149 -14 -66 -3 103 -9 66 10 141 4 -113 -60 -21 48 -55 -158 -43
5922 -43 46 55 119 -8 126 -42 62 -41 74 61 -104 -107 -45 49 -187 -95 -55 22 47 -55 36 57 -14 -53 -10 -130
5948 -130 50 74 -31 104 58 -26 -6 70 -153 89 -30 -47 48 243 20 -11 -152 29 73 81 67 -22 33 -84 -14
5973 -14 -109 140 -57 79 26 80 -209 30 34 -141 3 75 90 -31 -67 -134 -3 97 -55 -158 -47 43 -204 -24
5997 -24 181 59 -40 57 131 9 -150 -128 28 62 -112 29 -99 2 -153 122 13 -71 36 185 103 83 82 63
6021 63 -14 101 116 63 116 -119 -5 -164 22 -39 -171 -66 -39 6 7 -49 33 42 -90 -67 -168 84 -67 79 35
6046 35 -190 -14 13 70 17 57 -3 43 -4 -54 -3 -20 74 -61 35 -38 159 35 43 -138 38 -22 12 -124 -69 -49 0
6073 0 110 75 -10 -297 -277 -177 -89 110 0 -105 -8 64 27 -129 38 186 20 67 19 5 48 -206 108 -132
6097 -132 -52 -1 -49 -46 -102 -44 -167 127 143 -99 45 -10 -193 14 97 156 32 -70 42 34 38 -63 -167 -100 -122 -13
6123 -13 66 -66 -14 67 70 -55 -179 -43 130 -165 162 237 -96 261 -9 -140 102 -63 -208 10 88 55 -128
6146 -128 -14 -6 5 105 -119 141 -8 18 158 84 -3 84 -204 45 -4 108 -91 -8 -197 158 -16 -17 16 -67
6170 -67 17 1 117 -100 107 187 38 -82 11 -53 -136 -76 -28 -36 -99 -204 -169 115 79 129 -35 66 5 15 163 -171
6196 -171 -6 -45 54 209 -159 -132 -156 -73 -65 -67 -12 27 -177 -55 -5 -26 244 -57 4 34 -59 23 82 139 -27 78
6222 78 34 6 -51 -104 17 -67 135 -26 74 -122 -48 -25 -51 -106 172 36 -7 -98 16 -43 26 47 -143 73 58
6247 58 -65 -15 56 14 -92 7 -170 36 -122 -84 -156 63 -58 102 145 -32 141 115 -14 71 32 54 -76 -14
6271 -14 103 12 25 71 4 -10 92 -61 -60 51 -268 46 83 48 133 91 268 17 36 6 200 64 170 -98 99
6296 99 -13 -99 -28 -126 76 -32 35 -93 79 4 -51 69 -74 42 -134 126 -35 130 153 117 -98 -53 -9 194
6320 194 31 52 26 -71 -22 -162 -54 23 -61 -65 -208 -150 177 -160 -88 57 116 33 341 7 -43 -143 19 -110
6344 -110 -101 88 -93 -156 107 158 79 209 52 -101 -111 199 -123 -121 -77 -52 -65 122 -69 -111 -30 -172 -118 -137 -310
6369 -310 -184 -87 195 133 109 160 30 55 194 -32 -24 39 114 135 -12 36 -8 -136 61 104 39 -117 -1 -70 -29
6394 -29 20 28 29 38 -159 69 8 -162 -49 -55 46 -196 -57 -51 -55 50 -225 -33 95 14 -112 123 -76 98 -45
6419 -45 -127 85 97 187 67 -12 124 -17 316 -87 -42 -53 22 14 14 -33 -59 104 20 -84 54 -118 32 44 18 11
6445 11 -97 136 -96 -20 -214 104 -6 60 -175 -94 -26 -108 -44 -132 60 -91 93 144 -127 40 301 -147 194
6468 194 190 -115 35 86 -201 -128 7 -2 118 -54 53 -130 29 -208 -16 81 37 0 116 -77 -12 -33 126 -102
6492 -102 22 33 -8 59 -28 -32 38 -67 -173 -78 -49 -84 -103 173 -88 154 -56 3 -48 -127 117 68 25 52 -52 87
6518 87 -84 5 -7 14 -210 -117 -252 -62 77 145 -112 -118 -122 -30 32 -32 116 -35 -48 -46 26 -54 120 -69 -18 19 -167
6545 -167 -95 -162 -201 -85 -114 -117 -66 15 -1 138 34 63 -9 -83 -47 7 57 21 -110 -121 -3 -44 -155 17 -6 -89 17
6572 17 21 -40 79 33 73 106 45 68 119 92 -88 -33 -11 -141 10 -30 20 92 -20 -190 -82 113 59 -14 -139 62
6598 62 138 -41 160 -4 69 113 -59 -29 21 -15 4 0 -5 -25 -27 6 -48 -68 47 -31 2 -67 -50 -75 208 36 -58 100
6626 100 -17 -81 -30 -11 90 -45 77 -49 -73 -96 -106 38 -26 12 20 41 -12 107 12 28 92 13 -66 41 31 -99
6652 -99 -75 35 88 -37 -152 -137 -172 -104 7 -77 -50 79 -157 -95 149 -79 99 -54 69 109 -68 -9 4 -63
6676 -63 -8 99 -86 10 -6 -86 -96 -72 -51 -16 -52 -45 -60 152 19 67 92 126 73 -64 -124 64 13 42 -122 -71 -158
6703 -158 -26 50 -99 -69 -83 -84 -8 -80 -42 78 235 -130 -61 -48 -159 -22 -27 -174 94 -112 -94 -76 -20 -34 67
6728 67 -20 -112 17 21 66 109 -9 39 0 53 138 -83 -74 -34 -43 30 -78 -31 -129 -159 -30 84 -167 -223 -5 163 144
6755 144 85 24 -42 10 -5 7 66 31 20 -88 -48 5 129 101 -23 -16 -37 52 55 -39 -123 -47 -38 -175 34 43 -141 -58 75
6784 75 -164 -103 -109 103 -141 44 -91 -95 -182 19 93 107 -116 26 45 -69 114 -46 -29 84 -37 45 -40 182
6808 182 -90 -114 92 93 -72 -160 -38 -61 -170 37 67 -136 -44 -28 64 182 99 -87 33 55 81 96 134 68 19
6833 19 -102 -102 -10 -193 -41 75 -166 -30 -137 18 -58 -7 80 98 257 -49 218 -45 -7 -59 -30 18 176 -52
6857 -52 -16 -43 7 -34 5 33 -50 -15 64 -57 127 -137 -3 102 -130 210 15 -40 -118 11 -11 32 -21 -45 -154
6882 -154 -115 -180 7 -134 89 98 84 135 -2 99 -74 30 -161 -116 -129 36 38 -195 -23 59 -142 -49 -18 56 -161
6907 -161 56 53 29 -67 49 137 87 -47 14 83 12 12 -78 118 -71 -44 -9 -96 -27 -80 -76 -68 -127 -77 43 -81 12 51
6935 51 53 -34 -104 -14 188 -15 99 164 61 -18 34 27 162 24 77 -53 -199 14 -13 -60 106 -187 -203 -66 -110
6960 -110 21 215 -13 -50 -71 103 9 -34 -99 -43 83 63 142 155 -67 -35 -34 354 -184 -35 -26 135 91 125 106 69
6986 69 -134 137 -100 -42 65 72 69 84 -10 112 -41 -41 -9 -98 -141 1 -126 66 132 45 64 22 -28 -33 78 13 26
7013 26 23 -67 -104 -174 123 -48 -17 13 -154 109 7 13 134 73 52 141 82 -73 177 166 -29 -20 -43 -21 -5 -23 25
7040 25 192 -152 -73 -7 -98 50 77 -41 87 -20 90 -5 169 15 -64 24 -82 -58 94 77 -8 20 -145 -89
7064 -89 41 -37 -71 -137 -205 -77 115 -119 19 104 48 150 12 -21 -166 124 0 154 78 -206 -113 15 79 -55
7088 -55 24 -83 104 -10 40 -118 3 109 113 44 13 141 42 -53 -9 2 -116 59 -10 65 42 -45 42 -114 -150 7
7114 7 -89 -55 139 70 -13 -7 -38 -189 16 48 -46 87 1 -99 -121 -170 -64 -91 -58 165 0 101 16 100 81 122 89
7141 89 -119 -75 -41 -20 -61 97 -47 -104 101 15 45 72 162 1 122 45 98 129 -22 -98 239 -66 -8 -8 -104 159
7167 159 154 -143 -117 71 -10 -54 -40 -79 -59 65 -78 0 -8 -79 -29 74 -42 108 -134 -83 -140 75 -6 -46 -24 -9
7193 -9 -96 43 56 -112 9 -81 15 -92 -105 -79 -18 74 -67 11 -55 32 156 -27 4 10 13 -50 -27 31 -139 15 -92
7220 -92 10 6 -108 27 -43 -42 32 180 51 11 172 -11 53 -63 15 33 -202 -80 16 110 -150 -27 -121 -21 131
7245 131 -152 -2 13 121 -36 51 -178 95 123 29 -17 29 61 -53 -55 62 67 42 29 19 -107 -7 -51 104 81
7270 81 17 -76 73 42 26 44 -60 51 185 -102 7 -33 -34 -24 -158 79 151 34 -27 34 -27 -28 -13 184 -8 119
7296 119 96 -9 131 213 -27 -38 -152 -17 95 10 -21 -1 -68 -64 -49 22 -4 -146 119 -113 66 -138 133 8
7320 8 -100 -113 -122 -209 -57 -123 15 -75 -62 -30 -59 41 2 15 58 -71 -114 77 61 -47 57 50 181 -51 -105 6
7346 6 -69 -8 -84 -36 -31 -13 -81 -171 29 9 44 -128 50 -49 1 73 105 94 38 -109 56 17 21 -213 -99 70 19 166
7374 166 -74 -77 34 68 -55 -8 42 -44 35 -24 146 -69 -127 128 65 49 -45 -48 -28 -134 -157 -113 -61 -66 -140 -20 141
7401 141 22 -127 79 -151 10 6 -65 73 112 -54 202 10 -163 12 102 167 -79 60 57 -92 58 -39 24
7424 24 -72 -135 113 134 98 -10 53 -102 -9 15 37 -7 77 126 184 -101 -24 -79 57 -18 1 -23 61 100 -51 148 -12
7451 -12 128 17 144 -58 33 61 -175 -68 158 -214 76 94 -2 -58 -111 50 -275 -95 53 -22 113 19 140
7474 140 177 79 -92 -1 69 2 62 -80 73 13 70 -131 -98 39 15 39 -124 96 0 5 74 136 -49 -100 -89 51
7500 51 180 -95 144 -19 -138 145 131 -177 81 -67 62 11 -2 76 -68 21 182 37 -44 102 81 11 -24
7523 -24 47 98 -4 -177 -96 76 -5 -57 -78 -47 102 -136 -5 11 -42 10 -146 62 -3 5 -77 78 178 -95 -58
7548 -58 124 171 -19 -74 5 -145 8 85 9 31 -23 -3 2 -50 -21 58 35 92 -67 119 -55 -196 96 6 -54 -106
7574 -106 223 -43 -38 -27 17 154 -120 99 -27 92 -16 77 17 -58 75 39 -38 196 -19 104 59 107 121 91
7598 91 -15 -161 -38 -55 137 -30 48 143 71 215 -43 -96 -122 -88 -14 -68 -11 62 96 -18 -121 -152 -4 -98 -64
7623 -64 -49 -122 -10 154 128 28 229 31 -15 84 8 75 -20 141 -137 -64 2 -230 57 71 -187 30 -3 78 -72
7648 -72 -228 -10 73 18 -11 31 87 15 -7 -16 76 40 11 -86 31 43 -114 -44 109 192 50 41 -49 69 -62 -179 88
7675 88 -102 15 -33 4 44 25 98 48 105 -58 -100 -119 23 32 153 -20 -10 -52 64 -75 13 57 18 272 -30 212
7701 212 -7 112 126 -122 -93 -64 -61 -60 -89 -125 15 131 -34 -116 19 164 25 42 -18 -84 130 102 -18 15 -17
7726 -17 -50 -25 -2 57 160 27 64 21 -72 -25 8 175 -203 227 -85 98 -48 103 91 80 -210 -34 -108 156
7750 156 71 -135 -32 213 15 -76 -39 77 47 -174 -12 -33 162 20 90 -38 56 -84 50 46 -7 134 -97
7773 -97 -28 -111 -72 224 108 105 5 -86 -76 -119 1 99 168 -77 92 172 33 80 73 71 -217 -2 74 49 -59 37 -71
7800 -71 42 -37 117 -59 -11 -11 22 -1 -41 125 -91 -108 139 6 -76 180 68 -74 3 -27 -13 65 70 -44 22 33
7826 33 164 5 76 58 199 37 27 16 -3 23 58 -56 -174 -116 -49 35 -4 -134 -2 0 11 135 43 -72 10 100
7852 100 20 128 10 9 -5 120 -33 125 -53 45 -19 175 96 218 -33 -126 42 -124 59 -65 -91 -32 58 -36
7876 -36 -87 -104 126 -64 -72 -112 -97 -35 137 -8 48 -1 -16 27 -101 -47 -153 -60 -58 84 65 -184 -51 -57 1 121 -12
7903 -12 48 -10 55 89 -8 -37 89 -111 -15 -18 0 18 -107 -64 -61 -39 51 -12 22 -146 -113 -68 4 196 203 -85 -33 -51 -160
7932 -160 16 -29 -48 106 -129 35 41 -24 149 -72 27 -27 4 28 124 164 -2 -181 -27 -34 -209 -42 106 11 -62
7957 -62 121 -54 8 -7 -115 -77 -106 2 9 175 126 -5 87 23 45 137 -199 -56 12 -148 44 -47 -110 131 -8
7982 -8 -68 29 -22 194 24 35 90 56 53 142 75 36 105 98 76 -203 -143 12 -105 99 44 -6 -99 -63 8 55 -157 -48
8010 -48 -9 187 133 20 137 114 -140 24 -70 52 30 65 52 -7 -44 -32 15 45 78 -75 170 -60 -52 -33 45 13
8036 13 -19 -115 -118 -11 -42 -101 21 65 -13 74 197 -12 69 40 175 -55 65 55 44 14 -35 41 95 -81 -14 -31 -116
8063 -116 20 -118 60 -45 151 25 3 16 -14 -37 122 31 -146 -52 -102 4 47 13 -59 -24 22 37 14 55 32
8088 32 57 66 -33 152 51 -149 -142 101 45 -96 -16 -44 13 21 9 55 -183 -84 3 -206 74 149 -40 -109 -35 80 12
8115 12 -2 -62 -26 60 14 -31 63 -10 -13 65 7 13 132 -1 44 22 5 -29 153 58 39 10 65 -92 148 -197 59 105
8143 105 58 -93 -4 33 -57 -53 -201 -173 116 -43 -173 26 -93 -169 81 -52 134 95 -41 28 1 -44 -55 -72 80
8168 80 -47 81 123 -158 -100 -124 98 -109 -29 -91 7 13 173 -102 36 -145 -87 107 -108 146 -68 61 -65
8191f5
##END NTUPLES=NMR FID
##END=
