##TITLE=1H_Pr 88
 CDCl3
 8 sc, 
 6.05.2022
##JCAMPDX= 6.0         $$ Bruker NMR JCAMP-DX V2.0
##DATA TYPE= NMR FID
##DATA CLASS= NTUPLES
##ORIGIN= UXNMR, Bruker Analytische Messtechnik GmbH
##OWNER= root
$$ XWIN-NMR		Version 3.5
$$ Fri May  6 15:25:28 2022 Russian Standard Time (UT+4h)  she@DPX200
##.OBSERVE FREQUENCY= 200.1313499996
##.OBSERVE NUCLEUS= ^1H
##.DELAY= (6, 6)
##.ACQUISITION MODE= SIMULTANEOUS
##.ACQUISITION SCHEME= undefined
##.AVERAGES= 8
##.DIGITISER RES= 18
##SPECTROMETER/DATA SYSTEM= spect
##.PULSE SEQUENCE= zg30
##.SOLVENT NAME= CDCl3
##.SHIFT REFERENCE= (INTERNAL, CDCl3, 0, 15.7039)
##AUDIT TRAIL= $$ (NUMBER, WHEN, WHO, WHERE, WHAT)
$$ ##TITLE= Audit trail, XWIN-NMR		Version 3.5
$$ ##JCAMPDX= 5.01
$$ ##ORIGIN= Bruker BioSpin GmbH
$$ ##OWNER= she
$$ F:/spectra/data/she/nmr/H-F/1/audita.txt
$$ ##AUDIT TRAIL=  $$ (NUMBER, WHEN, WHO, WHERE, WHAT)
(   1,<2022-05-06 15:24:22.31 +0400>,<she>,<DPX200>,
      <created by zg, POWCHK disabled, PULCHK disabled
       configuration hash MD5:
       00 E9 B6 7A A2 85 ED C7 34 08 36 98 17 FE 4E 26
       data hash MD5: 16K
       78 36 F8 2C 56 FC 0D 63 8D 4C 3B 3F 38 38 40 A9>)
$$ ##END=
$$ 
$$ hash MD5
$$ 85 98 56 50 1B 80 4C 6C 4B AE 33 2D 0D 81 32 02
##$RELAX= 
##$RELAX= 
##$RELAX= 
##$RELAX= 
##$RELAX= 
##$RELAX= 
$$ Bruker specific parameters
$$ --------------------------
##$DU= <F:/spectra>
##$EXPNO= 1
##$NAME= <H-F>
##$PROCNO= 1
##$TYPE= <nmr>
##$USER= <she>
##$AMP= (0..31)
100 100 100 100 100 100 100 100 100 100 100 100 100 100 100 100 100 100 
100 100 100 100 100 100 100 100 100 100 100 100 100 100 
##$AQSEQ= 0
##$AQ_mod= 1
##$AUNM= <au_zg>
##$AUTOPOS= <>
##$BF1= 200.13
##$BF2= 200.13
##$BF3= 200.13
##$BF4= 200.13
##$BF5= 200.13
##$BF6= 200.13
##$BF7= 200.13
##$BF8= 200.13
##$BYTORDA= 1
##$CFDGTYP= 0
##$CFRGTYP= 5
##$CHEMSTR= <none>
##$CNST= (0..31)
1 1 145 1 1 1 1 1 1 1 1 1 1 1 1 1 1 1 1 1 1 1 1 1 1 1 1 1 1 1 1 1 
##$CPDPRG= <>
##$CPDPRG1= <>
##$CPDPRG2= <>
##$CPDPRG3= <>
##$CPDPRG4= <mlev>
##$CPDPRG5= <mlev>
##$CPDPRG6= <mlev>
##$CPDPRG7= <mlev>
##$CPDPRG8= <mlev>
##$CPDPRGB= <>
##$CPDPRGT= <>
##$D= (0..31)
0 1.2 0 0 0 0 0 0 0 0.06 0 0.03 0 0 0 0 0.0002 0 0 0 0 0 0 0 0 0 0 0 0 
0 0 0 
##$DATE= 1651836261
##$DBL= (0..7)
120 120 120 120 120 120 120 120 
##$DBP= (0..7)
150 150 150 150 150 150 150 150 
##$DBP07= 0
##$DBPNAM0= <>
##$DBPNAM1= <>
##$DBPNAM2= <>
##$DBPNAM3= <>
##$DBPNAM4= <>
##$DBPNAM5= <>
##$DBPNAM6= <>
##$DBPNAM7= <>
##$DBPOAL= (0..7)
0.5 0.5 0.5 0.5 0.5 0.5 0.5 0.5 
##$DBPOFFS= (0..7)
0 0 0 0 0 0 0 0 
##$DE= 6
##$DECBNUC= <off>
##$DECIM= 32
##$DECNUC= <off>
##$DECSTAT= 4
##$DIGMOD= 1
##$DIGTYP= 9
##$DL= (0..7)
0 120 120 120 120 120 120 120 
##$DP= (0..7)
150 150 150 150 150 150 150 150 
##$DP07= 0
##$DPNAME0= <>
##$DPNAME1= <>
##$DPNAME2= <>
##$DPNAME3= <>
##$DPNAME4= <>
##$DPNAME5= <>
##$DPNAME6= <>
##$DPNAME7= <>
##$DPOAL= (0..7)
0.5 0.5 0.5 0.5 0.5 0.5 0.5 0.5 
##$DPOFFS= (0..7)
0 0 0 0 0 0 0 0 
##$DQDMODE= 0
##$DR= 18
##$DS= 0
##$DSLIST= <SSSSSSSSSSSSSSS>
$$ [...]
##$SUBNAM2= <"">
##$SUBNAM3= <"">
##$SUBNAM4= <"">
##$SUBNAM5= <"">
##$SUBNAM6= <"">
##$SUBNAM7= <"">
##$SUBNAM8= <"">
##$SUBNAM9= <"">
##$SW= 18.0517283424761
##$SWIBOX= (0..15)
0 0 2 0 0 0 0 0 0 0 0 0 0 0 0 0 
##$SW_h= 3612.71676300578
##$TD= 16384
##$TD0= 1
##$TE= 0
##$TE2= 300
##$TE3= 300
##$TEG= 300
##$TL= (0..7)
0 120 120 120 120 120 120 120 
##$TP= (0..7)
150 150 150 150 150 150 150 150 
##$TP07= 0
##$TPNAME0= <>
##$TPNAME1= <>
##$TPNAME2= <>
##$TPNAME3= <>
##$TPNAME4= <>
##$TPNAME5= <>
##$TPNAME6= <>
##$TPNAME7= <>
##$TPOAL= (0..7)
0.5 0.5 0.5 0.5 0.5 0.5 0.5 0.5 
##$TPOFFS= (0..7)
0 0 0 0 0 0 0 0 
##$TUNHIN= 0
##$TUNHOUT= 0
##$TUNXOUT= 0
##$USERA1= <user>
##$USERA2= <user>
##$USERA3= <user>
##$USERA4= <user>
##$USERA5= <user>
##$V9= 5
##$VALIST= <valist>
##$VCLIST= <CCCCCCCCCCCCCCC>
##$VD= 0
##$VDLIST= <DDDDDDDDDDDDDDD>
##$VPLIST= <PPPPPPPPPPPPPPP>
##$VTLIST= <TTTTTTTTTTTTTTT>
##$WBST= 1024
##$WBSW= 4
##$XGAIN= (0..3)
0 0 0 0 
##$XL= 0
##$YL= 0
##$YMAX_a= 170468
##$YMIN_a= -134255
##$ZGOPTNS= <>
##$ZL1= 120
##$ZL2= 120
##$ZL3= 120
##$ZL4= 120
##$ABSF1= 10
##$ABSF2= 0
##$ABSG= 5
##$ABSL= 3
##$ALPHA= 0
##$AQORDER= 0
##$ASSFAC= 0
##$ASSFACI= 0
##$ASSFACX= 0
##$ASSWID= 0
##$AUNMP= <proc_1d>
##$AZFE= 0.1
##$AZFW= 0.1
##$BCFW= 1
##$BC_mod= 2
##$BYTORDP= 1
##$COROFFS= 0
##$CY= 11.3945322036743
##$DATMOD= 1
##$DC= 2
##$DFILT= <>
##$DTYPP= 0
##$F1P= 2.36226072786647
##$F2P= -0.459571619588291
##$FCOR= 0.5
##$FTSIZE= 0
##$FT_mod= 4
##$GAMMA= 1
##$GB= 0.15
##$INTBC= 1
##$INTSCL= 1
##$ISEN= 128
##$LB= 0.24
##$LEV0= 0
##$LPBIN= 0
##$MAXI= 10000
##$MC2= 0
##$MEAN= 0
##$ME_mod= 0
##$MI= 1.114404
##$NCOEF= 0
##$NC_proc= 0
##$NLEV= 6
##$NOISF1= 3.799351
##$NOISF2= 2.8
##$NSP= 1
##$NTH_PI= 0
##$NZP= 0
##$OFFSET= 15.70392
##$PC= 1
##$PHC0= -18032.64
##$PHC1= 12.80075
##$PH_mod= 1
##$PKNL= yes
##$PPARMOD= 0
##$PSCAL= 0
##$PSIGN= 0
##$REVERSE= no
##$SF= 200.130013532006
##$SI= 16384
##$SIGF1= 3
##$SIGF2= 2
##$SINO= 400
##$SIOLD= 16384
##$SREGLST= <1H.CDCl3>
##$SSB= 0
##$STSI= 0
##$STSR= 0
##$SW_p= 3612.71676300578
##$SYMM= 0
##$S_DEV= 0
##$TDeff= 0
##$TDoff= 0
##$TI= <>
##$TILT= no
##$TM1= 0
##$TM2= 0
##$TOPLEV= 0
##$USERP1= <user>
##$USERP2= <user>
##$USERP3= <user>
##$USERP4= <user>
##$USERP5= <user>
##$WDW= 1
##$XDIM= 8192
##$YMAX_p= 0
##$YMIN_p= 0
$$ End of Bruker specific parameters
$$ ---------------------------------
##NTUPLES= NMR FID
##VAR_NAME=  TIME,          FID/REAL,        FID/IMAG
##SYMBOL=    X,             R,               I
##VAR_TYPE=  INDEPENDENT,   DEPENDENT,       DEPENDENT
##VAR_FORM=  AFFN,          ASDF,            ASDF
##VAR_DIM=   8192,          8192,            8192
##UNITS=     SECONDS,       ARBITRARY UNITS, ARBITRARY UNITS
##FACTOR=    0.0002768,     1,               1
##FIRST=     0,             0,               0
##LAST=      2.2672688,     0,               0
##MIN=       0,             -134255,         0
##MAX=       2.2672688,     170468,          0
$$ Real data points
##PAGE= N=1
##DATA TABLE= (X++(R..R)), XYDATA
$$ [...]
2161A538J74j695K231j531r58J649k496P12K60k154K414r59n90K553j814J231
2177E65J066k118J935p46q60J599j882k14J501k848J787l21j263K088j491L99
2193h03J473j596J535M84j753K589j497m13J691k580J351L67k347J949q46k27
2209f23J897j903O52J080k117J846q34j133J935j852L63J296k400J871J86j478
2225a214K468j588K02J481j876J258P1j414K032j961o4J721k569J228L76j463
2241a312J920q68l60K181j674O10J011j882J514q63j562J860j809K86J023k003
2257a928J705R9j112K142j096L6J753j947J478M15j830K063j395q77J827k512
2273a179P53M29j974J785m97n78K045j475R05J392k255J994o15j296J933k217
$$ plain form
2161 1538 1712 17 2248 717 -241 1408 -1088 -376 -116 -2270 144 -815 -1405 1148 -666 565
2177 565 1631 -487 1448 702 -158 1441 -441 -655 846 -2002 -215 -536 -1799 289 -1202 -803
2193 -803 670 -926 609 1093 -660 1929 432 19 1710 -870 481 848 -1499 450 -396 -623
2209 -623 1274 -629 23 1103 -1014 832 -2 -1135 800 -1052 -689 607 -1793 78 264 -1214
2225 -1214 1254 -334 -132 1349 -527 731 802 -612 1420 -541 -605 1116 -1453 -225 151 -1312
2241 -1312 608 -260 -620 1561 -113 497 1508 -374 1140 277 -1285 575 -1234 -948 75 -1928
2257 -1928 -223 -124 -1236 906 -190 -154 1599 -348 1130 1545 -285 1778 383 -494 1333 -1179
2273 -1179 -426 3 -1971 -186 -683 -1261 784 -691 214 1606 -649 1345 730 -566 1367 -850
2289h50M05R58k252J674r1j227K066j079J52J335j771J358M14j477J908j082m99
2306e8J362j816P18O7j863J722r35n40J750j580O90J108j544J957p42p03J349
2323I42j174k6J295j919J295oj483K038j600j20J503j780J260L59j488K551j398
2340B49k83J456j738P15J72k066J816j231n51J801j947J233O76j518J972n86p87
2357f17J907j621O98Q80j842J715m05j322J532j746K59Q63k033J393J74j206K074
2374G03q67K43J391j922J101L60j986J767j094p19J586j664O39P04j861J544k
2391g7q64J820j354M27J339j484J649l3j304J701j560o47R25k135J111N9j446
2408a873K231j300L24J935k056J230M90j633J469q63o15J648j741O79Q81j619
$$ plain form
2289 -850 -445 513 -1739 -65 -156 -1383 683 -396 -244 1091 -680 678 1092 -385 1523 441 -58
2306 -58 1304 -512 206 273 -1590 132 -803 -1343 407 -1173 -483 625 -919 1038 296 -407 942
2323 942 -232 -258 1037 -882 413 407 -1076 962 -638 -758 745 -1035 225 584 -904 1647 249
2340 249 -34 1422 -316 399 571 -1495 321 -910 -1461 340 -1607 -374 302 -1216 756 170 -617
2357 -617 1290 -331 367 1247 -595 1120 715 -607 925 -821 -562 301 -1732 -339 -165 -1371 703
2374 703 -164 79 1470 -452 649 1009 -977 790 -304 -1023 563 -1101 -462 242 -1619 -75 -77
2391 -77 -941 879 -475 -48 1291 -193 1456 1423 119 1820 260 -387 538 -1597 -486 -427 -1873
2408 -1873 358 -942 -618 1317 -739 491 981 -652 817 -46 -661 987 -754 -75 806 -813
2424h13J405q41n08J116j227P11P79j613J748J00j193J862j580K3R81k271J355
2441C4j21j376K004j051j41J206j428R70Oj302J810j021m22J841j594J016N17
2458I48j303J533j026m86J304j677K68R51j975J799j93r65J853j371K20R50j605
2475g75O59L97j227J737j087j35J475j853J328k02j305J338q78l41J776j380Q77
2492D04P15j390J621n57j221J656j944K05J066j600J185j02o78J459j454M99J011
2509H75j770J316J28j319J752j281K67J163j851N45N37j795J633q35m03J592j250
2526f96J178J061j717J753l37j132J191j565r0N50j690J104ko93J429j267K32
2543f91J588j654J094K00r64J608q04l54J256j765Q26j6j983J561q42k81J625
$$ plain form
2424 -813 592 -249 -757 359 -868 -157 622 -991 757 857 -336 1526 -54 -31 950 -1321 34
2441 34 -87 -1463 541 -510 -651 555 -873 97 103 -1199 611 -410 -832 1009 -585 431 948
2458 948 -355 1178 152 -334 970 -707 -439 512 -1463 336 143 -822 1031 -340 -120 830 -775
2475 -775 -116 281 -946 791 -296 -431 1044 -809 519 317 -988 350 -528 -869 907 -473 404
2492 404 1119 -271 1350 793 -428 1228 -716 -511 555 -1045 140 38 -640 819 -635 -136 875
2509 875 -895 421 549 -770 982 -299 -32 1131 -720 -175 362 -1433 200 -635 -1038 554 -696
2526 -696 482 1543 -174 1579 1242 110 1301 -264 -354 196 -1494 -390 -392 -1085 344 -923 -691
2543 -691 897 -757 337 537 -427 1181 377 23 1279 -486 340 324 -1659 -98 -940 -1221 404
2560D04j230R17R76j259J664m92o71J084j811J61N03j573J225j80r84J894j282
2577f54K46Q18j334J355K5j023J657j168j04J234j637J131r2j238J280r17n09
2594i30J509r41L54J352j496J244o39r63J323j560k55N17j417J421J07m69J920
2611A077r80K87J271j638J041m37j063J263r16k82Q55j590P00o1j154J515p36
2628h48Q1J521o73J000P67r59J257o93j283O41j989j61J9j594J409Om30K086m14
2647b57O87J552j560J402Q2j076J275j434l09J045k088K93k52j613R61o40m90
2664b422J999q27J472R62k65J461Oj003P65k003m18J51k029R95n44l86J664o27
2682a049J32J540j059R21M04q01J619m50oQ91j656M39m29j539N17j178m26J284
$$ plain form
2560 404 -826 91 1067 -192 1472 980 309 1393 -418 -257 246 -1327 -102 -282 -1266 628 -654
2577 -654 -408 410 -924 431 456 -567 1090 -78 -182 1052 -585 546 454 -784 496 -421 -930
2594 -930 579 -362 -8 1344 -152 1092 453 -510 813 -747 -1002 -485 -1902 -481 -374 -843 1077
2611 1077 97 384 1655 17 1058 621 -442 821 -95 -377 478 -1112 -412 -473 -1627 -112 -848
2628 -848 -767 754 81 1081 1848 889 2146 1453 170 811 -1178 -1339 -1320 -2914 -1505 -1499 -1929 157 -257
2647 -257 430 1982 422 1824 1906 830 2105 671 362 1407 -681 -388 -640 -2253 -1292 -1932 -2422
2664 -2422 -423 -1250 222 1184 919 2380 2386 1383 2148 145 -273 -122 -2151 -1156 -1700 -2086 -422 -1049
2682 -1049 -917 623 -436 485 889 88 1707 1257 1251 2142 486 925 496 -1043 -526 -1704 -2130 -846
2700h46j451J178J114n99J813Qk32P26j214P2j3j676J158m58m22J431q80J14P71
2719E94j156P33k23r75J259l79%J428j351N33N22j526J112q54o92P83j184J101
2737b75P55j085J501o15l04J048j321J12Q1j331J384l10k26J534o06K80Q71j403
2755I0P74j58j174J088j143k08J109j338R76J63j127J377j114l55J417j328J132
2772A81O98j199J569o64k85J001j530J45K70j341R54l60n03J853j300N22J026
2789A037j026R34r1j439J635j080m33J117j296O96J63q99Q83q67m19J319j188
2806i54P60N02p06J434l84m44J058j205R0M80j588J316n62k49R03j142P25N60
2824E94j112R60k02o42J133j059J00Q04j165Q67O9j155J397j177j9J059j461P53
$$ plain form
2700 -846 -2297 -1119 -5 -604 1209 1217 985 1711 497 569 556 -1120 38 -420 -842 589 -291 -177 594
2719 594 -562 171 -52 -1027 232 -147 -147 1281 -70 463 985 -541 571 -283 -975 -192 -1376 -275
2737 -275 480 -605 896 281 -23 1025 -296 -184 -103 -1434 -50 -360 -586 948 342 622 1493 90
2755 90 864 706 -468 620 -523 -731 378 -960 16 179 -948 429 -685 -1040 377 -951 181
2772 181 879 -320 1249 585 300 1301 -229 -84 186 -1155 -201 -561 -1064 789 -511 11 1037
2789 1037 11 945 854 -585 1050 -30 -463 654 -642 54 217 -682 201 -666 -1085 234 -954
2806 -954 -194 308 -398 1036 652 208 1266 61 151 631 -957 359 -203 -452 451 -691 34 594
2824 594 -518 442 240 -402 731 -328 -228 576 -589 278 347 -808 589 -588 -607 452 -1009 -256
2842b56M41p60J075k49l15J004j040L98O01j108M54j46o20J044j178Q2P18q79
2860g34P72j3o41J048p47jJ000j524J050J35p75J231j061OP21j088O37J56j326
2879a154J217l17N9J145j086M40N63j207J025l78p15J011j126N4P10j188J020
2896G3k55o38J192r32K1J050r90N25P37j201J213p23k50P33r34O28K78j117Q41
2915B51m22l48J087q36L00O72j146J010o02m73R80o61NO96j374J126j18p01J043
2934D89j116K12P86r89N52K86o26J082o96l01R87j103N30K99q38J250o57k98Q39
2953F88o53j79N03j238O28q3m80R04m69M05O96q14N43l02p31R46p56J02N82q75
2973e83P13J93q18R25m60k16N87r41P36J71p83J253n59m2J114j574N13r9j347
$$ plain form
2842 -256 185 -575 500 251 -64 940 -100 298 899 -209 245 99 -521 523 -655 -573 145 -734
2860 -734 38 25 -616 432 -315 -316 684 -840 210 345 -430 801 -260 -254 467 -621 16 172 -1154
2879 -1154 63 -254 -195 950 -136 304 867 -340 685 307 -408 603 -523 -469 241 -947 73
2896 73 -182 -820 372 -560 -539 511 -479 46 783 -418 795 72 -178 555 -379 249 527 -590 251
2915 251 -171 -519 568 -268 32 704 -442 568 -34 -507 473 -188 -183 513 -861 265 147 -554 489
2934 489 -627 -415 371 -618 -66 220 -406 676 -20 -321 666 -437 93 392 -446 804 147 -151 688
2953 688 35 -144 359 -879 -251 -334 -814 90 -379 26 722 -92 451 149 -582 364 -392 -290 292 -583
2973 -583 130 323 -495 430 -30 -246 341 -600 136 307 -476 777 218 176 1290 -284 229 130 -1217
2992a217O92m68j76J300p93R08O56p11Q14j59q98R24q41m81N22j002Q01J88o55
3011e96J101p90l65J024j275J055P34j079J465m08n56J036j114l3j58j322L55
3028i26n32m18J320n39Q37J151p55J285j98p97J111j120j86N58j399O68k70o76
3046h86R10q53k92R66j508J076O08o23J572j15QJ325j311K48j38j569L68q85p25
3065a824Q33p93P81J063n19J254L5n98Q88m46m27Q43q77Q51k42p71N40j075m72
3084i56M59j024N48L86o76J328j9m7J396j019Q50j15j497R74r24p05J237j052
3102h56O62N32p20Q79k39m85Q04j107K64M92r51R74j2o37R53o47j55P46j063P85
3122B19l0n84J068n37l43P74j125K16J58q22Q53o06k10R91m45M49R19n07Q46j04
$$ plain form
2992 -1217 -525 -993 -1169 131 -662 246 902 191 1005 846 -52 872 31 -450 72 -930 -129 59 -596
3011 -596 505 -285 -650 374 -901 154 888 -191 1274 866 310 1346 232 199 41 -1281 -926
3028 -926 -1458 -1876 -556 -1095 -258 893 138 1423 1225 428 1539 419 233 791 -608 60 -210 -886
3046 -886 24 -829 -1121 -155 -1663 -587 21 -602 970 855 863 2188 877 1125 987 -582 -214 -1099 -1824
3065 -1824 -991 -1784 -1003 60 -459 795 830 232 1120 674 247 1090 213 1064 822 51 591 -484 -956
3084 -956 -497 -1521 -973 -587 -1263 65 46 -1 1395 376 1226 1111 -386 588 -336 -1041 196 -856
3102 -856 -194 338 -382 497 258 -227 577 -530 -266 226 -725 249 237 -400 553 -94 -249 497 -566 219
3122 219 189 -395 673 136 -207 567 -558 -342 -184 -1006 -153 -759 -969 22 -423 26 945 438 1284 1180
3142A180n82P26j057j17J01r76K82j72q43P26n86K18R61o91R10L63k52J360n22
3161A029j58N06r98j5k53j247O53n16n17O77m39N58N42m65J205L5k80J358p19
3180I56Q5M22j236L08k67j496N93q27j13M92m13J057J38L3J338j74j48Q57j159
3199D46K68K4p42Q95o46p68M41p46o6O28j004P11o1q2J354j33Q2P61j191R86k79
3220H78j292L35p77l8P95j020P10M50o68J060l18k34M70q72N14J90o16J056n05
3239A18j44J096p31j41J81j138O66m41n00J054n38N23O37o63P41k90q70O95r63
3258g08K85P96j098J044L24o22R53n98k92M24j050L20J06n90P78j68q9Q46o19
3277D2L73kr39N92l21l40Q03n71L55O03j157R69l65m64O87r95L01N22p03P68K59
$$ plain form
3142 1180 598 1324 267 150 251 -725 -443 -615 -1458 -732 -1318 -1100 -139 -830 80 443 191 1551 1029
3161 1029 871 1377 379 364 111 -1136 -483 -999 -1516 -839 -1278 -720 -178 -643 562 597 317 1675 956
3180 956 1041 1463 227 535 268 -1228 -635 -1462 -1575 -1083 -1496 -439 -301 -268 1070 896 748 1605 446
3199 446 714 738 -4 891 245 -523 -82 -828 -894 -266 -1270 -559 -620 -702 652 519 601 1362 171 1157 878
3220 878 -414 -79 -856 -894 -99 -1119 -409 41 -627 433 115 -119 351 -521 -7 183 -433 623 118
3239 118 -26 1070 339 198 379 -759 -93 -534 -1034 20 -518 5 642 -21 720 430 -440 255 -708
3258 -708 -423 373 -725 319 643 21 974 376 84 508 -542 -222 -116 -706 72 -96 -185 661 42
3277 42 415 413 -526 66 -255 -595 208 -363 -8 595 -562 407 42 -422 265 -730 -429 93 -610 158 417
3298D17m76J090n46l63N03j039K82q1q10J004k49j72R50o11L57K77j173Q06m59
3317b93k22P87p63N86M52p24P41l26n90P98n77l01N93q17O25M05n46O73r2%N25
3338I34j298O39j16q47P45l9n40P47n14M36K08p04M84l66l76R11q97L86O73r11
3358d45R56j70p41J137q66R0N35j111P84m2m06N88k89l2O14q24N40k07r22R57
3378A46m23k42P05n89K81Q13j157Q26k31m14N09l12O6J9m86J021n30j99Q81j022
3398c38L37L36p93L86K27o47O15k08K4R62j084K92N81j006N81o26p3N07p18M13
3418b32M44n89N85Q9j53O95j005K72K92r74P37j12l24N42j96n2J94p12N69k29
3438a59m77J142p52J83N68n81N69J1q74M53m70j58N64m33L22P3l77N46R7n18P43
$$ plain form
3298 417 -59 1031 485 122 625 -414 -132 -213 -1023 -19 -268 -440 510 -101 256 533 -640 166 -293
3317 -293 -515 272 -491 95 547 -177 564 238 -352 446 -131 -432 161 -656 -31 374 -172 501 409 409 934
3338 934 -364 275 159 -688 57 18 -522 225 -289 147 355 -349 135 -231 -607 304 -593 -207 466 -445
3358 -445 511 341 -400 737 -129 -39 496 -615 169 127 -279 309 20 -12 602 -222 318 111 -811 146
3378 146 -277 -519 186 -403 -122 691 -466 360 129 -285 224 -88 -22 -3 -489 532 2 -197 684 -338
3398 -338 -1 335 -458 -72 155 -492 123 -85 -61 901 -183 109 690 -316 265 -361 -434 73 -645 -232
3418 -232 212 -377 208 297 144 839 -166 106 398 -576 161 49 -275 267 71 19 213 -499 70 -159
3438 -159 -636 506 -246 -63 505 -76 493 504 -370 83 -387 -545 19 -414 -92 -19 -396 150 247 -271 472
3459D72o42K52L35n93N22j52l75P69o45OM18p35L89k44n00R67k99j57N87n91M99
3480B83n4o64Q37n53m15Q72q25L85L60n59P93m38j93O51p98K93K93n93N87q6m81
3501c05P63o26K5M63p21L05P1l52R62m33j16N46o83J9P6p15K40k82l79J090k55
3522c07J62O13l10O90l27l25P32q43K82J33r59P09j44m81M60p61J2K45q35R17
3542c37L29J40P83k27K30P60j213M11m16j046K02o82j38N64l65P07L62o30J236
3561F70m37k42P10o68O81L86o67O45k20q61N01j273Jj53o19K51M48n0J243j69
3581A77N20N78l82K42J30j235Q4k87l89P52r37Q44J36p22N88l59m47P39p23L16
3601c75Q16l21Q43o3l55N05q46l25O0r79K27j18L3P92L54n1P47n35J35j43j157
$$ plain form
3459 472 -170 82 417 -176 346 194 -181 588 -57 -51 367 -368 21 -223 -723 244 -55 -212 375 -216 283
3480 283 229 -435 402 -151 -566 306 -519 -134 226 -333 460 22 -171 480 -318 -25 268 -325 262 176 -305
3501 -305 458 -168 -143 320 -401 -96 -25 -377 585 152 36 582 -101 -82 -6 -721 -481 -763 -1142 -52 -307
3522 -307 -145 468 158 848 521 196 928 85 367 500 -459 250 106 -375 85 -676 -664 -419 -1254 -337
3542 -337 -8 132 915 688 918 1678 465 876 460 -586 -384 -1066 -1204 -640 -1005 -298 64 -566 670
3561 670 233 -9 701 33 714 1100 433 1078 858 -3 498 -775 -774 -927 -1546 -1295 -847 -897 346 177
3581 177 697 1275 893 1135 1265 30 114 -173 -562 190 -747 97 233 -489 99 -260 -707 32 -691 -375
3601 -375 441 120 963 900 545 1050 204 -121 -61 -1040 -813 -931 -898 -106 248 197 944 409 544 401 -756
3622g56N45l00M3N75r3M09M27p05O10m19j007O50j066L78L16m62J011j55L8P71
3642H10o71j31J12o38L11P1k25O95M2K34N30o60L1n38p40M96p29j57R92l54P76
3663B57K53k74M87j72k23M3n47J31K31p99N96M3j22O33q52j08J74q20N48L22l20
3684e19P23OK84J002r51L38j54q88R7o55l17M86k46N74j1j86Q21j23l88M97n62
3705a72N6L40n11P65k38j76P30o53Ln1p04J56l7k09O70K7MO23n63M62p5m42K81
3728B86m37j02J36n03P31k5n17Q99n16k86M11m98K2M53m28M12NO9N59n65j04P58
3750G60q16J90p6k10P0J2R2J75j68Q9J97n16M27k61k52M46o08N28k3l41N51j41
3772A25j94K25n59K40N7o31P85j08l56O83k45L53o6l51L80r7n22L58l19L06M61
$$ plain form
3622 -756 -211 -511 -468 107 14 423 850 145 755 336 -671 -21 -1087 -709 -393 -855 156 1 39 810
3642 810 139 8 120 -518 -207 -136 -361 334 376 610 1140 480 511 -27 -767 -271 -1000 -1157 -165 -519 257
3663 257 510 236 723 551 328 371 -176 -45 186 -613 -17 26 -96 537 -315 -423 -249 -1069 -521 -199 -519
3684 -519 204 210 494 1496 545 883 729 -159 -62 -717 -1034 -548 -794 -220 -231 -417 404 281 -107 390 -172
3705 -172 -116 224 -287 478 240 64 794 141 144 93 -611 -455 -492 -701 -31 -4 0 623 60 522 447 5 286
3728 286 -151 -253 -117 -620 111 86 -431 468 -48 -334 77 -421 -399 54 -374 38 43 112 671 106 2 760
3750 760 -56 134 58 -152 -82 -70 22 197 29 118 315 -201 226 -35 -287 159 -449 79 56 -285 266 125
3772 125 -69 156 -403 -163 -106 -737 48 -60 -416 267 22 375 309 -42 338 241 -281 77 -242 64 525
3793E25p70N27k51l67P40k12m55O61r14K73L12n57R07m03M9L21l59k2M2l70K39
3814h4K57o21P96l37J51J85m61L51r2m80M44Jr9J13j07J03N6k14K97l46k88N90
3836B15m59K09J04k17M77m7q8j0k07n0K66n55M09k04J94L14m61K88R7o41P10n4
3858B90m72M44l24j90K13k51P70r9q18N69k03j95M02n22L92J18k99N46k68RL12
3879D24n20O2L50p19K74K0j78N33l02pK87m50L42P3m41M02m69R3O14n02K33L14
3901D33n98K14j06j55L9n11M96L7P7M42pL8O4l46r9J46p05M81k00r8O18l79M19
3924C00J75o87K72m79J00L80o07O47J02k15N81L8l94J07m21n72J35l41L62L43
3944a74k48O93L2N3K81m96O0p0m05J42L31l08O90n12n0L51o62r9j1l56L85k64
$$ plain form
3793 525 -245 282 31 -336 404 192 -263 398 -516 -243 69 -488 419 16 65 386 27 5 47 -323 -84
3814 -84 173 -448 348 11 162 347 -114 237 145 -335 109 110 11 124 17 120 176 -38 259 -87 -375 215
3836 215 -244 -35 69 -148 329 282 194 184 -23 -73 193 -362 47 -157 37 351 -110 178 275 -366 344 290
3858 290 -182 262 -62 -252 -39 -290 480 381 -437 132 -71 -266 136 -386 6 124 -175 371 103 112 424
3879 424 -96 -34 316 -403 -129 -109 -287 246 -56 -63 224 -226 116 189 -252 150 -319 -226 388 -114 119 433
3901 433 -165 49 -57 -212 -173 -684 -188 -151 -74 368 361 399 463 117 18 164 -541 -60 -260 -358 260 -119 300
3924 300 475 -212 60 -419 -319 61 -546 101 203 -12 569 607 213 320 -101 -673 -538 -879 -517 -174
3944 -174 -422 271 303 356 637 141 201 131 -274 -132 199 -109 581 69 19 370 -292 -391 -402 -758 -373 -637
3966f37L32M13O1M25j66j13K38n36m54M45o42N26j19J97K20m3p8N27n80K00r1
3987A25n17M36l68J21O78k48m9M14q29L86l21o12M66n2o1O53m48Q02l41n7K94
4008D72n55k13L02m60J73L97k72P16k99j02K58l34j93R3n52L82j73K94p1rL73
4029B27K64o15L56o8n00L18j90K61M72n22K84Pm10M19p22k6K22o24N93m9R4Q01
4051E92j09l46P03o88L28k45m89J97q7k76M52l44Q4J42m1K47l38l37N73q3K13
4072A48L86k15M12j9o01M12m20n49L80m21J54K21j88M0J74Q0J95j10M00m06J9
4093I2M65n80k51P55m43K41j03l23J22k09k33K48j14n9O56n60L23L26k51L49l35
4114A16pL39n52J64J02n57O57m72K05J94q18K58L52n54N44M28l58M13n53L27o
$$ plain form
3966 -637 -305 108 169 594 428 315 553 17 -437 8 -634 -108 -227 -30 190 147 69 596 16 216 125
3987 125 -392 44 -324 -203 475 227 178 592 -237 149 -172 -784 -318 -370 -431 222 -226 576 235 178 472
4008 472 -83 -296 6 -454 -281 116 -156 560 261 159 417 83 -110 -17 -569 -187 -360 -66 -137 -146 227
4029 227 491 -124 232 164 -336 -18 -208 53 525 3 287 294 -116 303 -419 -445 -223 -847 -254 -303 -209 592
4051 592 483 137 840 152 480 235 -254 -57 -144 -420 32 -312 -228 -86 -127 120 -218 -555 18 -65 148
4072 148 534 319 731 712 111 523 103 -446 -66 -487 -333 -112 -300 -260 -86 -6 189 79 479 73 92
4093 92 557 -23 -274 481 38 279 176 -147 -25 -234 -467 -219 -333 -392 264 -296 27 353 102 451 116
4114 116 109 448 -104 60 162 -395 262 -210 -5 189 -629 -371 -19 -573 -29 399 41 454 -99 228 222
4135B22m77L97j16q8K70k71K1M15m36J81l18k57M25l44R1N23p73O60j24k97Q18
4156E22n6m31J13l59j07K56l75M50k07O0J91k02Q2J96l65K10K91l75L81l15J82
4177A42K87m34Q0O3l33K33k30m0J13j43L75l2k77K17P8q4J34k78K91L4j07R0k
4200A77n31M59k22Q4j05l72M63l0M9M81n34J74J05k73J88j70K5K74l07l7J66j02
4222c8n0J53l16L69k41j89M89k83R4J29l13L36p7l7J05j67r2J51k38L66k02o3
4244a14L70l44N72k96k99O2P6l62M04k80R0M04p01L97P9j41L20k6r7%k81L55j23
4267F5k36O15l47l15N62n73N66K08o40M99l64P7K24m21K31j36j51M19k85j56K40
4288H2l06K65L15n83J74l8K6n9J55j51K14r5RK57k34J9j62J9J5L8K34j39r0P4
$$ plain form
4135 222 -255 142 26 -62 208 -63 -42 373 -63 118 -200 -457 -32 -376 -285 238 -535 125 1 -296 522
4156 522 466 35 148 -211 -318 -62 -437 13 -194 -134 57 -145 -63 133 -232 -22 269 -106 275 -40 142
4177 142 429 -5 75 138 -195 38 -192 -232 -119 -262 113 81 -196 21 99 15 149 -129 162 196 89 179 177
4200 177 -354 105 -117 -33 -138 -510 -47 -77 -28 453 -81 93 198 -75 113 -57 -32 242 -65 -102 64 -38
4222 -38 -88 65 -251 118 -123 -312 177 -106 -12 117 -196 140 63 26 131 -36 -128 23 -215 151 -51 -114
4244 -114 256 -88 484 188 -111 -49 27 -335 69 -211 -121 283 -418 -21 58 -83 237 211 114 114 -167 188 65
4267 65 -171 444 97 -218 344 -229 337 545 -95 404 40 117 341 -80 151 15 -136 283 -2 -158 82
4288 82 -224 41 356 -227 -53 -91 -65 -124 31 -120 94 -1 8 265 31 50 -112 -93 -78 -40 194 55 -35 39
4312C9J38n19L31q1j23M38o04K07K65j45K24j66j74J92m84O10j46l29O06k22L1
4333H8J32J11l14J50l02L48m99j02N09j45N5M4j79M49j79l16M04m62J7K61j71
4354a01J31N3q8J40j60K07l2j46k11J50L0L28j86k11L43l6q6J28m26J22l33N8
4376c26N64n96M37K08m34L96O3o39J11Jr2O29m80J94K4j7K94o14J75K69l49J88
4398Fk30J95K86j63QN05l50k02J3q3R7k07j15L44k17M3lJ51k6J11l03N22m46J0
4422e4O1l82N21L9l74N16k53j57J93l55L82j52j01L82k30M3L66n15J20J78l24
4443i6L07l98J52K05l26K26J71n53O21j60k97K00l99L19J18k23M89k83j47K33
4463A59j2l23L17k87L4K30k74K88k4j64L34l56L39pl50K92k54j02O24o84n5N97
$$ plain form
4312 39 177 -342 -11 -92 -215 223 -381 -174 91 -54 170 4 -170 22 -462 148 2 -327 279 57 88
4333 88 220 331 17 167 -135 213 -286 -388 121 -24 31 75 -104 345 166 -150 254 -208 -191 70 -101
4354 -101 30 83 -5 135 -25 182 150 4 -207 -57 -27 301 115 -96 247 211 125 253 -173 -51 -384 -326
4376 -326 238 -358 79 287 -147 249 312 -327 -216 -215 -307 322 -158 36 60 43 337 -277 -102 167 -182 6
4398 6 -224 -29 257 94 102 607 257 55 68 -15 82 -125 -240 104 -113 -70 -73 78 52 163 -140 382 -64 -54
4422 -54 7 -375 146 185 -189 327 74 -83 110 -245 137 -15 -116 266 36 79 445 -70 50 228 -96
4443 -96 211 -187 -35 170 -156 70 241 -312 309 149 -148 52 -347 -28 90 -133 356 73 -74 159
4463 159 147 -176 141 -146 -112 118 -156 132 108 -56 278 -78 261 254 -96 196 -58 -160 464 -220 -275 322
4485C22m63K46ml34K35k56J96J54j62J09N6j92K35r8j75O03p40K26o1R0Q4n5o9
4508e3J64k90J49M8k40J94R2k69L18k89K34J77k73L1K32k62J81j85J98j7k24K85
4530B01k61o6K15n3r4J51m80J97R5P6K89j05j89L00l40J8r9k7L24k85l1L27m85
4553c22J31M51m05N53n29M8K38k91Q7N4k09L82l37J62K75l78p2J50j33nK49l32
4575b33L38L1j32L4o8o8J75k51J54N1L6Q8j82K8k6j47K13k27J46J68k38K89k62
4598h3K8M12k61j63K92l9j32l1k44R2Q7k27M50k59k1J37l87M16K06k12K03o8n11
4621c15M79j26J44P5l83J63l7j37M56j46k60P0k45J67J02l04O43n36Q9K64k83
4642a20J75r6r4L61m45N7N62n52J33J34k22j07J35M7j93R3r1M73l11J25k6p8J18
$$ plain form
4485 322 -141 105 101 -233 2 -254 -58 96 -66 43 99 -93 142 44 -131 472 -268 -42 -103 -13 71 16 -53
4508 -53 111 -179 -30 18 -222 -28 64 -205 113 -176 58 235 -38 -7 225 -37 144 -41 157 140 -84 201
4530 201 -60 -126 89 36 -58 93 -387 -190 -95 -19 270 165 -24 276 -64 -46 -145 -172 152 -133 -164 163 -322
4553 -322 -191 260 -145 408 -121 -73 165 -126 -39 15 -194 188 -149 13 288 -90 -162 -12 -145 -150 99 -233
4575 -233 105 136 4 38 -30 -98 77 -174 -20 31 67 155 -27 1 -25 -172 41 -186 -40 128 -110 179 -83
4598 -83 -55 357 96 -67 225 186 54 23 -221 -129 -42 -269 181 -78 -99 38 -349 67 273 61 264 196 -315
4621 -315 164 38 182 257 -126 37 0 -137 319 173 -87 -17 -262 -95 7 -297 346 -190 -101 163 -120
4642 -120 55 -41 -135 226 -219 -162 400 -152 -19 115 -107 -214 -79 -32 -225 -132 -223 250 -61 64 38 -40 78
4665G8P2j10J49m38J70L88m56K00j06M7J73l46K35j0l6J33l68O5M52l50O9M0l19
4688b68N39k07N7Qq3K2k01o1L56k12J3K5j60k27M43j66K59j0L3l24L27k11J20
4711G2k38l3K29q4L26k12p5j82J59J09K49n77L20k60J12L99k98j06J07j47K13
4732H3j24p8L14j87k60J54%Q7R1k86N24O4k45R2n09M54n3j33J93j99j72M62l27
4755e5K5o0n1M22m75L30R2k42K71q0k12j68j10J41K72j92J59Q3j68J93l91M5K75
4778A04l73K38Pj76J63R2j50N1j68K65j47J37J11j50Q5R6l43J19J50k75J94l3
4800cj16K32m11P6N82o12Q8K22k54M1N0l1M04l97Q8K27j91r4K10k12L18l45J64
4823C6P9k58K21K00k88M2n3l8m7J28ml7J2K28q6k76K58j37Q3K24k51J9j39n6M47
$$ plain form
4665 78 150 40 189 -249 -79 309 -147 53 -53 -6 167 -179 56 46 10 143 -225 -160 292 -58 11 51 -268
4688 -268 271 64 121 129 46 68 -133 -194 162 -50 -37 -12 -172 -399 44 -122 137 127 160 -164 163 -48 72
4711 72 -166 -199 30 -54 272 60 -15 -197 -38 71 320 -257 63 -197 -85 314 16 -90 17 -130 83
4732 83 -41 -119 195 8 -252 -98 -98 -11 80 -206 318 382 137 229 -280 174 121 -12 181 -18 -190 272 -55
4755 -55 -30 -90 -141 281 -194 136 228 -14 257 177 -35 -203 -313 -172 100 -92 67 150 -18 175 -216 -171 104
4778 104 -269 -31 -24 -200 -37 55 -95 -44 -212 53 -94 43 154 4 89 185 -158 -39 111 -164 30 -3
4800 -3 -119 113 -298 -222 360 -252 -164 58 -196 -155 -105 -136 268 -129 -41 186 -5 -99 111 -101 217 -128 36
4823 36 115 -143 78 278 -10 32 -21 -59 -106 22 18 -19 -7 221 135 -141 117 -20 63 287 36 55 -84 -140 307
4848C07l13j51J78j70K33j17k7N1o0o1K27j05Q4l2k79M56l13J98j35j3M3J99l44
4871a44J4J72r2Q3M5M7m5j59K34j63rK4m8q9L04j14k1k7MJ53j36N6j18m2LL39
4897B71k97Q9J2r4l6Rn8O1k53J89k9L62j65o8Q2r2k10L39J00j85m5q0J48J63k84
4922g1L18l65k56N53k60K7Pn5m9N20l20k5j17j28nL53j67k00j5M20L4j20%k64
4946a85P4K23n6j7j93o9L61k43K42k02J61O9j63NK69j84j21K51l66J77j79Q1n2
4969a17K49j22K99j35j12J03j59K70l28l0R6j08J00J20k60J50j57j15K75k23k00
4990d04M64j13%Qj04L02k13L94k73j79R3Q3j19j43K25j15P4N0L3Rj69K31o7l60
5014b93N50n70O55q0j78K04k53l17q1K30O2K45m22L08k4KJ25k57m4J66l1M68l91
$$ plain form
4848 307 -6 -157 21 -149 84 -33 -60 -9 -69 -130 97 -8 76 44 -235 221 -92 106 -29 -42 1 200 -144
4871 -144 -130 42 -50 33 78 125 80 -79 155 -8 -17 7 -41 -130 174 60 39 12 16 169 33 89 -29 -71 -68 271
4897 271 -26 63 75 -19 -55 -46 -104 -43 -296 -107 -136 226 61 -7 75 -17 -227 112 212 27 -18 -98 50 213 -71
4922 -71 247 -118 -374 179 -81 -54 -47 -102 -151 369 49 24 -93 -221 -226 127 -40 -240 -255 165 199 79 79 -185
4946 -185 -111 112 56 39 -154 -223 138 -105 137 -65 96 165 2 7 276 92 -29 222 -144 33 -146 -65 -117
4969 -117 132 10 309 174 62 165 6 276 -52 -82 14 -94 6 126 -134 16 -141 -256 19 -204 -404
4990 -404 60 -53 -53 -45 -149 153 -60 334 61 -118 -25 58 -61 -204 21 -94 -20 30 63 72 -97 134 67 -293
5014 -293 257 -313 342 262 84 288 35 -282 -363 -133 -71 174 -248 60 36 38 163 -94 -138 28 -3 465 74
5037G4k20J52J73k97J32Q1j25O6O6o4k62kL21N1j28K21l24M01j52k13K82M7j91
5060H9k9j26j51O0QJ83m1j09J88k24O0J54o1pK98l86K84P9k60J98l55K84M7l74
5084a91L42l38N0P5q4J76j44j64R1J42l0J2q5K03l2P6K8q2j29K40k10NP9q5k09
5109b64L99j31K12m17K57j13J07rj78M3N20l56J17r2j66J98k96M5n9lK67K12m99
5132b06L20m32K43K03l53L07p3LM4N8r4R9k56Q5L75l55J43j92q5k2J47J03J7j6
5156F3k23N41p34NO19l74J91j50K9jj2K1q5m7M01j77j54L79n39M91j26k09j09
5179b00K74j82N4l4LL00m83K19J23j74L30l61j30K06L8r5J26K41m6k18K40j56
5201G5l05K95P0r9r0k5k23M13l08K75m9j44K63q3j40K49j60j28K62l61L71l48
$$ plain form
5037 74 -146 6 179 -118 14 95 -30 36 102 38 -224 -226 95 146 18 239 -85 316 164 -49 233 280 89
5060 89 60 -66 -217 -157 -149 34 -7 -116 72 -152 -92 62 1 -6 292 -94 190 269 9 207 -148 136 183 -191
5084 -191 151 -187 -137 -62 -146 30 -114 -278 -187 -45 -75 -63 -148 55 23 99 127 45 -84 156 -54 -49 30 -55 -264
5109 -264 135 4 216 -201 56 -57 50 41 -137 -94 426 70 187 95 -71 127 -169 -124 -183 -186 81 293 -206
5132 -206 114 -318 -75 128 -225 82 9 12 56 114 20 119 -137 -52 323 -32 111 -81 -166 -188 -41 62 79 63
5156 63 -160 381 -353 -348 271 -103 88 -62 -33 -34 -46 -25 -110 -157 244 67 -87 292 -247 244 118 -91 -200
5179 -200 74 -108 -54 -88 -85 215 -268 -49 74 -100 230 -131 -261 -55 -17 -112 14 255 209 -9 231 75
5201 75 -230 65 135 36 -54 -79 -302 111 -197 78 29 -115 148 65 -75 174 14 -114 148 -213 158 -190
5223a90J28pk86J17N43l52K34M4k49N1K3j24R6r5J58J14l36J26J3j17J69j16n3
5246a09L51l04K77r9k06K28j3q7J20l2R0n01J48J11m14M96j14n4J23l5o2N9j12
5269a39L1rP9r9J68J09k42M4J22P0k0l16J74k26M49k88R9O9K41m04L67l62J20
5292C7R5l03n1J74J9P3j48J99Jk39J26q8O5p0K4L66j49l72M05j83O4J52j68j49
5316a20J8p9M9J25j7m3k6O8J79l46K40j38N3K16m02K05J02j27l2J63j02K61l94
5339a47o5J23N5l0K32j65K10j95n6J28k59P6J20q7O9n7O9P2k27L08o9j63R8k03
5363a63R2J07j69J36R5j78K49j52L9K03m43K48O6l84P8J07p6M53m35Q0J26J38
5385B17k66J28j49L6q5K25l21K73N5j53J8J30n6k82K56j65K56K42l71n3k76p7
$$ plain form
5223 -190 -62 -69 -355 -238 305 -47 187 231 -18 33 56 -68 28 -67 91 205 -131 -5 8 -109 60 -56 -109
5246 -109 242 -62 215 116 -90 138 125 38 158 126 216 -285 -137 -26 -440 56 -58 -112 11 -24 -86 -27 -139
5269 -139 -108 -117 -38 -137 31 140 -102 -58 64 134 114 -202 -28 -254 195 -93 6 75 316 -88 279 -83 37
5292 37 132 -171 -222 -48 -29 44 -104 95 96 -143 -17 -105 -40 -110 -86 280 131 -241 164 -19 45 197 29 -120
5316 -120 -102 -181 -132 -7 -24 -67 -93 -25 154 -192 48 -90 -37 179 -223 -18 84 -43 -75 88 -14 247 -147
5339 -147 -212 -89 -34 -64 168 3 213 18 -38 90 -169 -93 27 -60 9 -48 21 93 -134 174 105 -58 40 -163
5363 -163 -71 36 -133 3 98 -80 169 17 56 259 -184 64 130 -254 -176 -69 -145 308 -127 -47 79 217
5385 217 -49 79 -70 -34 -119 106 -215 58 113 -40 -22 108 52 -230 26 -139 117 359 -12 -65 -341 -418
5407d18M40j97P8K21j36N0r3K31J68l86K94j14j78K18q8K3P4k68m7J53j08J64
5429H1J4l73L39j88mj72L11k66K56n4j20L10O3k16J98j94L3M2k7K0n5Q4k45J91
5453B8K43j77n3Q8k88J84L6j42K57p3j76K56l73K59N1j22L08k64q1j05K52m9j39
5476h0P1J19j24j77J96q8J66l3%j4Mj42J75p9J27j84R2p7J24j07L56m07p4K33
5500G7j51L04j43J1n3j22K11O6k67J03L7j9j44k30K28L21k04J29k02m9K37l19
5522a79K49j37O1K0j40K22Q1q4k1m0j25q1J00J4K2R6m3K30m26Q1J55k04K82k97
5546a64J01K64j25k9j16Qj46L34k31L54l09KK32j61j00J89k10K85k96K60l02J2
5568a48K9J30j65K82k28J57J53l64J72j42M4K58l1k05J74m12L76J88l32L37j85
$$ plain form
5407 -418 22 -175 -97 124 -12 38 -55 176 344 -42 252 138 -40 178 90 113 187 -81 -128 25 -83 81
5429 81 95 -278 61 -127 -131 -303 8 -258 -2 -56 -176 134 197 -19 179 -15 18 60 33 53 -2 82 -163 28
5453 28 271 94 41 129 -159 25 61 -81 176 103 -73 183 -190 69 120 -2 306 42 -39 -144 108 59 -80
5476 -80 -9 110 -14 -191 5 -83 83 50 50 36 40 -102 73 -6 121 -63 29 -48 76 -31 325 -82 -156 77
5500 77 -74 230 87 98 45 -77 134 200 -67 36 73 54 -90 -320 -92 229 25 154 -48 -97 140 -179
5522 -179 70 -67 -6 14 -126 96 177 93 72 32 -93 -174 -74 -60 -38 58 15 245 -181 -100 55 -149 133 -164
5546 -164 -63 201 76 47 -69 -61 -207 127 -104 250 -59 -57 175 14 -86 103 -107 178 -118 142 -160 -148
5568 -148 -119 11 -154 128 -100 57 210 -154 18 -124 -80 178 147 -58 116 -296 80 268 -64 273 88
5589H8j03L82m33N5j7J25j55K12j11j67K11J09j73j7K71k13j51K19j30L3k67J28
5611a04m5J03j82K52k12J74J57k8Oo1j49J45K3k38K87l08P5K65l96N7L01k01J87
5634A08j80Q2M5j73K25K6m1j12o7J28K9k01J82k04J33J32k60R0o5M51n09K76J3
5657A08o7j07q9K28j06QP5L7l3j05k06L44j43M1n7J43J49j15j00N8o9j1J57j91
5681e1P7k46K4K28j4j9L7K43m28K20l21J34J54j63P5N0p6K38q9l24J24J47L07
5704C27l36O9p2Jq0K21r6J46k12o2R3K69r9l6j57N3j25P6L71l28L2J38k11J16
5728I8j14o6J62k32k5j82M26K9j11j44L3j29M6K9K28m1R9r9Q7%k31J30j99K57
5752E1j91M6j0L92k57M0J16j18k4K50m7q6j43j91j4j5J22j31L04j17J87Q8n00
$$ plain form
5589 88 -15 367 -66 -11 -28 97 -58 154 43 -124 87 196 23 6 277 64 -87 132 2 35 -232 -104
5611 -104 -149 -46 -228 24 -188 -14 143 115 121 60 -89 56 79 -159 128 -180 -105 160 -236 -179 122 -79 108
5634 108 -72 10 55 -118 107 133 92 -20 -87 41 70 -131 51 -153 -20 112 -148 -58 -123 328 -181 95 108
5657 108 41 -66 -155 73 -33 -25 50 87 54 -51 -257 87 -56 -15 -72 71 220 105 5 63 -6 -17 140 -51
5681 -51 26 -220 -196 32 18 -1 36 279 -149 71 -250 -116 38 -125 -50 0 -76 162 73 -251 -127 20 327
5704 327 -9 60 -12 -11 -91 130 34 180 -32 -94 -1 268 169 133 -24 29 -96 -20 351 23 55 193 -18 98
5728 98 -16 -82 80 -152 -177 -359 67 96 -15 -159 -126 -255 -209 -180 48 7 106 7 94 94 -137 -7 -206 51
5752 51 -140 -94 -104 288 31 71 187 69 45 295 248 162 19 -172 -186 -201 -79 -210 94 -23 164 252 -248
5775b48L62j02j46K0K75j90O6O8j87K62k75K2L4k24L31m68J43K00N9J78J33l20
5797gJ7J89j32r1n1K53n2l97K11J79l36K84N4l58K14j54M02l36P6j00K87m48L15
5820A9k91O76k46j43M3j33O7N5j12o0J56q7K80q5j62L8J70p2j28%j24K21M9j24
5844Gk94K81m2R9k35L4N6K47k51q1K37j33J69j24J49L8m03J38j12R8J21n10N23
5867A2L1K37k55M3O6O9k63J66l20J98K10k57m2n4J70m2M7m3k44J96rP7J72j89
5891b4P6j22pk03L71j16m1L0J51L9k99M0o0r7L85M8k83L46k87L43m37J08l5j2
5915h6J04K8j1O9l18j37O00n05K35L5j38J31J2Q7P6j25n0K07m19J69M5l2Q1N0
5939A08j73K8J29j62K08K65n94J36k17K35O2j84L90l31N0K6Qm6J49K6J13m57J46
$$ plain form
5775 -248 114 12 -134 -114 161 -29 37 105 -82 180 -95 -73 -39 -263 68 -400 -257 -57 2 180 313 -7
5797 -7 10 199 67 -24 -75 178 126 -271 -60 119 -217 67 121 -237 -23 -177 225 -111 -35 -135 152 -296 19
5820 19 -272 404 158 15 58 -75 -8 47 -65 -125 31 -56 224 139 -23 15 185 113 -15 -15 -139 82 131 7
5844 7 -287 -6 -48 51 -184 -150 -94 153 -98 -179 58 -75 94 -30 119 157 -246 -108 -220 -122 -1 -511 12
5867 12 43 280 25 68 134 203 -60 106 -214 -16 194 -63 -105 -159 11 -31 16 -27 -271 -75 -84 -7 165 -24
5891 -24 52 -70 -77 -280 91 -25 -66 -36 115 154 -145 -105 -165 -262 123 171 -112 234 -53 290 -147 -39 -74 -86
5915 -86 18 46 35 104 -214 -351 249 -256 -21 14 -124 7 19 106 182 57 7 214 -205 -36 9 -23 58 108
5939 108 -65 -37 92 -70 138 403 -191 -55 -272 -37 25 -159 231 -100 -50 -24 -16 -62 87 113 226 -231 -85
5962h5L14l60j45K72j95J54j99L83J60k89K4j91K97J5j08l6K05k84J5K19k08M33
5984C91n72K59R8j15Q8j68J02J10k43qJ99j19J34p8j91k78L50J11j28j50J70j65
6006b03K52k5K23k18J05j63j24M36l62l7J23J11k15P7J75j80J72P2l77J29L48
6027C19l02j38J65n1J17kJ1m79J46l7J95L3L03o5k98J03k2j97K10n5kK93k51j52
6051a56J14O3L8J69j47p8j22L24k14J43K38n83J13J68k99K33l08K26K87q4k85
6072a60K37oO3L4j2o8J04m33K2J62Q1QL0L23m78k86M61j74M2J19k7Q2j24N4J17
6097A71K49l07j34R1k73K0K54k98K6P1K64j17J23R6O6l62K13k68R5N1k17J46j22
6120a62K38l0r9m1J45J21r3j93L28P9k56L15m25m2J13O0j73k6k14M05K2j34K37
$$ plain form
5962 -85 229 -131 -276 -4 -199 -45 -244 139 299 10 34 -157 140 155 47 11 216 -68 -53 166 -42 391
5984 391 -181 78 176 61 149 -19 83 193 -50 -58 141 22 156 78 -113 -391 -41 70 -58 -208 -38 -203
6006 -203 49 24 247 29 134 -29 -153 283 -79 -116 7 118 -97 -20 155 -25 147 219 -158 -29 319
6027 319 17 -121 44 -7 110 108 119 -360 -214 -251 -56 -23 280 215 -83 20 -2 -199 11 -44 -46 247 -4 -156
6051 -156 -42 21 59 228 81 3 -119 205 -9 134 372 -211 -98 70 -229 4 -304 -78 209 125 -160
6072 -160 77 71 134 168 156 88 192 -241 -219 -57 24 32 62 385 -93 -379 82 -92 -50 69 42 124 0 54 171
6097 171 420 113 -21 70 -203 -183 71 -227 -201 -130 134 17 140 236 302 -60 153 -115 -20 31 -186 -40 -162
6120 -162 76 46 -53 -94 51 172 79 -114 214 293 37 352 -73 -115 -2 58 -115 -141 -355 50 72 -62 175
6143A75n5J27J65k73JK4j07l2o1Jm3q9L36j00l15P5K83r8J0j51K45k42K67o5Q1
6168A59k63Q6j8pm0k8K63k63k39J81J73N9J92k85K82j29Mo1m2J47k83p6o5K51
6192bj48L05k8m01J01J66J5l8Q2J04rl80L33j93O2J89o2L9r3j30P9J12j14j10
6216a21M2K20p5k7J22j81J70j5n0j32M6qj39P0j79L49j40J60j97K50j56j14J51
6239D6Nk87p5K82p1P2J05j58M16k02j89K0L4J41k11P9J87k46K59j60k60M65j61
6262I1o3K2j72K23JK5j62L61j83l57J69l29N80j89k47J83M9J62j68J47k42J74
6284G5j05J79k10L29m66K26J24l25J23O1Lk79L35j37K48m14P0J91R4K4k35M85
6306C96k67nl56L66m36J92J0p8J64k76R4L13j89J38j86rL09K1p6J19m31K62p7
$$ plain form
6143 175 120 247 412 139 140 164 57 25 -36 -35 -78 -167 169 69 -246 -171 112 14 24 -127 118 -124 143 78 159
6168 159 -104 -18 -36 -43 -83 -111 152 -111 -350 -169 4 63 255 -30 252 123 127 66 24 171 -112 -188 -253 -2
6192 -2 -150 155 127 -274 -173 -7 8 -30 52 156 147 -233 100 -93 -31 158 96 135 42 -88 -9 103 -11 -121
6216 -121 -79 141 66 39 161 -20 150 135 85 -47 -1 -9 -148 -78 -257 92 -48 112 -85 165 9 -105 46
6239 46 51 -236 -311 -29 -100 -28 77 -81 335 133 -56 -36 -2 139 -72 7 194 -52 207 47 -213 252 91
6262 91 28 50 -122 101 102 127 -35 326 143 -214 -45 -374 206 17 -230 -47 2 164 -4 143 -99 75
6284 75 -30 149 -61 268 -198 28 152 -173 -50 11 14 -265 70 -67 181 -233 -163 28 122 146 -89 396
6306 396 129 124 -232 134 -302 -110 -100 -178 -14 -290 -196 117 -72 66 -120 -129 180 201 125 244 -187 75 -2
6329bk71K69m8j42J85J53j08k67J31K10nL1k8j3k25M93l86J68Q8l6j82J11k26
6352a00J98k52Q1J23j78J24j44j03L75j32o4J40l8m8P8k38K51k70K40j54p8K17
6374B8J84o33L90N6K8J4j3R5j88j2J30q2j41K26j38Q4J50j76R2j01q8M8j25J58
6398a4O7l14M26j25N7P8m91K37m9m3OJ75j51J73N5q8j01K42j50p9k8L9kJ76j20
6423b4n8O9LK42l68R6N8k2m0J40Jl44K86j0j01Q9QN5q8r8n9K10n99N36K21n40
6449c37M86k38J26J97k28p9J86j27k2J7j38K68q6M5j53o4K54l31J63J31k32o4
6471b26K61K74l41k44K01P9r9J24N6J0P3n3j61n7K28q4pj32M6k11K80K08l29J28
6495B4K87m36N3l3L01j4k33N0J12r7j55L24k66p0K60k32n5K4J45J8j52K23j81
$$ plain form
6329 -2 -273 -4 -52 -194 -9 144 36 -231 -100 110 105 136 108 95 -130 363 -23 145 233 197 15 126 -100
6352 -100 98 -154 -73 50 -128 -4 -148 -251 124 -8 -72 68 30 -18 60 -178 73 -197 43 -111 -189 28
6374 28 212 -421 -31 25 53 67 54 149 -39 -51 79 -3 -144 82 -56 28 178 2 94 -7 -95 -47 -172 -14
6398 -14 53 -261 165 40 97 175 -316 -79 -128 -171 -165 10 -141 32 87 -1 -102 140 -10 -89 -117 -78 -80 96 -24
6423 -24 -82 -13 -10 232 -136 -40 18 -4 -44 96 97 -247 39 29 -72 17 25 80 -8 -106 -165 45 -554 -18 203 -337
6449 -337 149 -89 37 234 6 -73 113 -14 -36 -19 -157 111 25 70 -83 -147 107 -224 -61 70 -162 -226
6471 -226 35 309 -32 -276 -75 4 -95 29 85 95 168 115 -46 -103 125 41 34 -98 -52 -263 17 225 -104 24
6495 24 311 -125 -72 -105 196 182 -51 -1 111 14 -141 183 -83 -153 107 -125 -180 -156 -11 7 -145 78 -103
6518a03L26k60l6J98l1k66J19j2l0L71n27J65n9J54K31m0j58k6J08j34J87l43
6540a66J79j15l3J52j40N6j09M42p0p5l38L33j50o6N7j36J5k0K40o4Mk85L59l4
6564C6Ql36N04k63N6j99L93l19o6O0p5K34J10k15j80J37j11L00j72P6K49l73K80
6587A34j23k27J00J41K1j44J43r7J21N9L6k54K55j84LnJ34j39J13m05L11M1k04
6610a70J29r1M1J24l77K62J93j84K30k86lM10l61O3K5K8j69J26p3j3k0K02K54
6633C40n17K43j13K8lqj71J27K41m56K41r4J81p7L31k65O5j53R8j98O7K91k01
6656cJ8L3l8r0K07k40K37p2k44R5L1K04k25q9L84n7j07J42j19k24N6L09k21Q9
6680G6q3L7k98K11K05m1jj37L7Q2k1P3o7l1l52L32j12L16k61j25O5lNj66L21q7
$$ plain form
6518 -103 223 -37 -73 125 94 -172 -53 -65 -95 276 -251 -86 -145 9 240 200 42 16 124 -10 177 -166
6540 -166 13 -102 -135 17 -123 -67 -176 266 196 121 -217 116 -34 -100 -43 -179 -164 -184 56 -8 -4 -289 70 36
6564 36 44 -292 212 -51 5 -194 199 -120 -186 -126 -201 33 143 -72 -252 -115 -226 74 -98 -22 227 -146 134
6587 134 11 -216 -116 25 46 -98 45 -52 69 128 164 -90 165 -19 -16 -21 113 -26 87 -318 -7 34 -170
6610 -170 -41 -132 -91 33 -344 -82 111 -73 157 -129 -132 278 -83 -20 5 33 -136 -10 -83 -96 -116 86 340
6633 340 -177 66 -47 -19 -22 -30 -201 -74 167 -289 -48 -142 39 -38 293 28 93 -60 38 -160 -93 198 -3
6656 -3 15 48 10 -80 127 -113 124 52 -192 -97 -66 138 -87 -176 208 151 44 186 67 -157 -101 208 -13 76
6680 76 -7 30 -268 -57 148 107 106 -31 6 88 67 140 73 42 -310 22 -90 226 -35 -160 -95 -98 -93 -259 62 -25
6706b5k19L37m2q7R1j88J06K25k20J6q4n1L92l70L40k87k3j38M04l46N0k40M70
6729A11L1J4j66om00N89ml69L36j50j7p9K85o8r3L8R6K9k27k5N9L42l82M24k36
6754A32j22j55M2N7J63j5j48k1RJ50R3j10p9M6J24N7k59j46K29J72l63K36J01
6777A93k82j09j59M32r3j46M25p05N54q6K7k8k3o5j59K29O0k56K57Q6k49K19L7
6800A59l01O8O4o7O6qJ2kJ04l30R2J11Pr0m0K61Qk27K30r8rj14J23J0rO6Q7j25
6828D8n9J76m60K55R4r2K97l59m7K68j97o8K13l83K21l0J56oj39r7K83j74L8R0
6852B8L8J26k15J55k87L31k23KK04k64j14K63r9J03J02nJ1o8j23j09Q2R0j50J54
6876C2j48K26r1lJ42k51R0L4J04J00k79j15J56j02J47r0j15J64l7j79M83m57P8
$$ plain form
6706 -25 -244 93 51 -36 55 -133 -27 198 -22 -6 -90 -141 251 -119 221 -66 -89 -227 177 -169 -119 -359 111
6729 111 142 156 -10 -16 -416 173 169 -200 136 -14 -31 -110 175 107 14 52 148 177 -50 -75 -16 326 -56 368 132
6754 132 10 -145 -103 -46 117 102 -46 -67 -58 92 185 75 -4 42 166 223 -36 -182 47 219 -144 92 193
6777 193 -89 -198 -357 75 -18 -164 261 -444 110 24 51 23 0 -65 -224 5 65 -191 66 152 -97 122 159
6800 159 -142 -74 -10 -77 -11 -19 -7 -9 95 -235 -143 -32 -25 -115 -155 106 114 -113 117 19 10 -104 19 29 20 86 173 48
6828 48 -11 165 -295 -40 54 -38 259 -100 -147 121 -76 -144 69 -314 -93 -123 33 27 -112 -209 74 -100 -62 28
6852 28 66 192 -23 132 -155 176 -47 -45 159 -105 -219 44 -55 48 150 145 156 88 -35 -144 -62 28 -122 32
6876 32 -116 110 19 16 158 -93 -3 31 135 235 -44 -159 -3 -105 42 -48 -163 1 -36 -215 268 -189 -111
6899a11J16k30M4Q6J78J99m6m28M89l43J79p2k14J24l4L79l21m3P1j22O0%R7j50
6923i2L11k82J57r7k3J83Q9k08K0k17L74j26O0q4P7m66M24n6m2K1Q1j66j46Q5
6947a23L77l56K34r2j69J25N2K3n2R5j94qK40j44qJ29J22k87J7j0k1o5o4K15j44
6972a08j59P1K01j57L28k89l7J90k08J05l1J03l1K96l73j50Q6O7n7K41j9r4k5
6995e0r5K27J1m2l07J69M5K1J23j56k9J15j14o3j6J28K24R4m58J77j71J37J2R9
7019H1r8k31J65J56K83k73km30K56j33l8J66M2j7Q9J99j88N0J39j25OO0k79j94
7043c16O87m62J33J10k64k2J13p4Q3N2l55K31O7j91P3L55j15K13m07j7Lk0kr6
7067b21J4Q8L48k56r7Q8N9Q1j38K2K43l53K16l9j58Q8k55K47j51L00N6k19Q7j13
$$ plain form
6899 -111 5 -225 -181 -95 83 282 236 -192 297 -46 133 61 -153 -29 -63 316 -5 -48 23 -99 -39 -39 58 -92
6923 -92 219 -63 94 -3 -26 157 246 38 58 -159 215 89 149 65 142 -324 100 44 2 23 104 -62 -208 -123
6947 -123 254 -102 132 40 -129 -4 48 71 19 114 -80 -88 152 8 0 129 251 -36 -19 -29 -50 -115 -179 36 -108
6972 -108 -267 -196 5 -152 176 -113 -150 40 -168 -63 -94 9 -22 274 -99 -249 -163 -96 -153 88 69 -25 -50
6995 -50 -145 82 93 51 -256 -87 -42 -21 102 -54 -83 32 -82 -145 -161 -33 191 285 -173 4 -167 -30 -18 81
7019 81 -17 -248 -83 73 356 83 81 -349 -93 -226 -264 -98 -56 -73 16 215 27 77 216 91 97 157 -122 -316
7043 -316 371 -91 42 152 -112 -134 -21 -95 -12 40 -315 -84 -17 -208 -135 220 105 318 -89 -106 -103 -123 -125 -221
7067 -221 -207 -119 229 -27 -124 -36 23 104 -34 -12 231 -122 94 55 -103 -15 -270 -23 -174 126 182 -37 50 -63
7091f3P0r5N2R0K01k03n1n6J24j28R3o4J82p0l48L02k98K17j2l9K63j38J14Nk16
7116f8k23J52N5O9j59J78J16q6oq3J49k49P3K75k3l34K34o7p6J79k7n0L08k46
7140I1r9j92J03J49j64J14j88L43q7k6l5r4Qk46L29P3k97K94l11JL87k39K25j72
7164c3m0k21J71J02K71l04k59P2J45r9J09p1J33j39J90Q0j36L0l1N1j7O6k94J87
7188c7k94L15J02o4L6q4Q8k46J2K27J36j76J09p6m0Q7k04O2k3k5K36j72j07J22
7212a6J26k05K63l99M27l15R2ppJ10k11L08l6L6j58J14j07J87j0k28K4O0q9J18
7236G7j02J24OMj22N2p7L15j27l6j40j29P6J25K12p0j27m1J93j68J90l44K89j31
7260D9K33RL4q3k43M5j1o4J13l34K26J34j24q3q6j28M02k64J29K75j54n3J10p1
$$ plain form
7091 -63 7 -88 -36 54 255 52 1 -55 69 -59 34 -30 152 82 -266 36 -262 -45 -57 -96 167 29 143 148 -68
7116 -68 -291 -139 -84 -15 -174 4 120 34 28 -55 94 -155 -82 193 170 -164 70 3 -73 106 79 29 337 91
7140 91 -8 -200 -97 52 -112 2 -186 157 70 44 9 -85 -77 -323 6 79 -218 76 -235 -234 153 -86 139 -33
7164 -33 -73 -294 -123 -21 250 -54 -313 -241 -96 -195 -86 -157 -24 -163 27 107 -29 1 -30 21 4 70 -224 -37
7188 -37 -331 -16 86 22 58 -26 62 -184 -172 55 191 15 124 48 8 95 -109 -47 -70 -95 141 -31 -138 -16
7212 -16 110 -95 168 -231 196 -119 -27 -34 -41 69 -142 166 130 166 8 122 15 202 192 -36 -12 48 -41 77
7236 77 -25 99 105 109 -13 39 -38 277 150 114 -26 -155 -79 46 258 188 61 20 213 45 235 -109 180 49
7260 49 282 291 325 242 -1 44 33 -31 82 -252 -26 108 -16 -99 -185 -313 89 -175 -46 229 75 22 132 61
7284F1m1J0O8j24LK40k11K20l22j93R5L74l36J69m2K01j74J33k17M6O7R8J00m43
7308b18J30N5J01l3m7j74J61O8L4r8oK34k67J32k6p8K35J7l00P0L8j71J56j59
7332a46J41J49p2O7j57m9K73j50k48J66o6mO6m4R7Jn3J31J06k51J63k81J11J10
7356F0j33j08m2L29j05J71k77j6Q1L09m03Q7R7r3M3J08N0l7r7k33J68o8M7K7J10
7381G5j1k55lL83l37J37l6rk7j01J24p5K21j1l02J20j29L04p4J13j71R3K9J4m4
7406B8q8J41k95K93P0l12J69L6nQ0l0j09K05k64M3M19k09k16j42j3L32k22j34
7429b23KJ66n1PJ61j83J78o8J3K36l29l2K07j24l3R5q7J8Q1j83j85L29P0l67L75
7454G3mj90J49n5r3J50j27MP4K1l2J15l72K92p9NJ52J8R4j62J5l6JK33l31J16
$$ plain form
7284 61 20 30 98 -26 -23 217 6 226 -96 -289 -194 180 -156 13 -29 172 -2 131 -86 -40 27 125 225 -218
7308 -218 -88 -33 68 35 -12 -186 -25 43 77 -21 -27 207 -60 72 46 -32 203 220 -80 -10 28 -143 13 -146
7332 -146 -5 144 72 139 -18 -67 206 56 -192 -26 -92 -96 -30 -74 23 24 -29 102 208 -43 120 -161 -50 60
7356 60 -73 -181 -223 106 1 172 -105 -121 -40 269 -134 -47 50 -43 0 108 158 121 24 -209 -41 -109 -62 -35 75
7381 75 64 -191 -194 189 -148 -11 -47 -56 -83 -184 -60 -135 86 75 -227 -107 -236 68 -6 107 -64 29 58 72 28
7406 28 -60 81 -214 79 149 -163 6 42 37 117 87 -22 183 -81 -38 381 172 -44 -186 -199 133 -89 -223
7429 -223 -221 -55 -106 -99 62 -121 57 -11 2 238 -91 -123 84 -40 -73 22 -65 -47 34 -149 -334 -5 65 -302 73
7454 73 69 -121 28 -27 -120 30 -97 -93 -19 2 -30 85 -287 5 -74 -69 83 101 195 33 48 12 13 246 -85 31
7480C1K5M8k66J78MK4p4M0J04j4j2j11j04K24j20km8l48M80j14J11J26k53o4K96
7505A61o9j1kJ18k66m6J77J32k3j22j09L15j29l24L98j73j09n6J16J33j07jR8
7528A01j89J93j90J02r8R1K58j48k59J53k20M24j29q7J72m68K92o0J55l40L25
7549G8l0O7Q4l49J59jQ3q6jJ65j3j14K2j74O5k61K19O6O9l5Q0k66j5L69n57O25
7575B49l28O6J00k33K18J49k65N7J16l70M10m16R4M20l09m8jK12r6l3N5P3p7j5
7599B8M5j59J24P2q4J8J99k01K03j71j46J11k14mj08M71j24j9j29m3p3M44l75
7622a35R5L34n64R2K34j03J39o3j08R8j11Q9J07q4J46M3k54J41J50k21l7R9p6
7645A1K07l59J54J74j43P3m56M39j09n4j5QJ02j24R2j84K18J7J53k43O9Pn9L22
$$ plain form
7480 31 56 104 -162 16 20 44 -30 10 114 100 88 -23 -127 97 -23 -25 -73 -421 59 -55 56 182 -71 -135 161
7505 161 92 81 79 197 -69 -115 62 194 171 49 -60 255 126 -198 200 27 -82 -138 -22 111 4 3 101
7528 101 -88 105 -85 17 -81 10 268 120 -139 14 -206 218 89 2 174 -294 -2 -62 93 -247 78
7549 78 48 115 199 -150 9 8 91 5 4 169 156 42 64 -110 -45 -306 -87 -21 48 13 93 -173 -188 181 -376 249
7575 249 -79 -13 87 -146 72 221 -44 13 129 -241 169 -247 -153 267 -42 -90 -91 121 25 -8 47 120 43 28
7599 28 73 -86 38 110 26 44 243 42 245 74 -72 39 -175 -179 -287 184 60 41 -88 -131 -204 240 -135
7622 -135 -40 294 -270 -178 56 -47 92 29 -79 19 -92 -3 104 20 166 209 -45 96 246 25 -12 87 11
7645 11 218 -141 13 187 44 117 -339 100 -9 -63 -78 -70 32 -92 0 -184 34 51 204 -39 30 37 -22 300
7669C00l06K9k38M08n0J22l04o0K72j92J2j22j2L71J13k19j82j3J3n0k6L93l27
7692f8J59l8k2j5K6k20L01j07n1j70K01n9ok5l9L09j48J7k28J53J12o2M06k58
7716A68k73J48n0j28J6K49l21J16J46O4l02j17K67J0o2K10j00J60l36J96j93Q7
7738d5J80m53M18r1p0K47o2k23K53j59J22j03J02j63Q4K02l86n1K61n0o5n7K44
7761A35J15k96k29L01j08K82lq3m2j74O4J29J5l87N1K92l20J57Pj4J70k31J97
7784B8j19J47O9l00L57k12j42K5J85K2p0K6o5J33P1j17k51L75J13k57k1L58m50
7807i5K41J18m28K02l79K62k03K47M3r2J52n5k88L98l84J69j06K65J64j42m23
7828c34L88M8l82K92n5J8K02j09p8J62j35J85j39m0l07K86j63J19Q4J16j41J4
$$ plain form
7669 300 -6 23 -215 193 143 265 -39 -99 173 -19 -7 -129 -141 230 343 124 -58 -71 -58 -108 -134 259 -68
7692 -68 91 53 31 16 42 -178 123 16 -35 -205 -4 -63 -69 -94 -133 176 28 45 -183 -30 82 20 426 168
7716 168 -105 43 -7 -135 -119 130 -191 -75 71 135 -167 -284 -17 -7 -69 141 41 201 -135 61 -132 -45
7738 -45 135 -318 100 9 -61 186 124 -99 154 -5 117 14 116 -47 37 239 -147 -198 63 13 -52 -109 135
7761 135 250 -46 -275 26 -82 200 197 114 72 -102 -38 91 106 -281 -230 62 -258 -101 -94 -108 62 -169 28
7784 28 -91 56 125 -175 182 -30 -172 -147 38 60 -10 16 -49 84 155 38 -213 162 275 18 -3 355 -95
7807 -95 146 264 -164 38 -341 -79 -282 -35 8 -84 68 13 -275 123 -261 -92 -198 67 231 89 -334
7828 -334 54 102 -280 12 -43 -25 177 68 -10 152 17 202 63 23 -284 2 -161 -42 42 158 17 31
7850C1O9j88P3m7o8K27j03PJ23k23J6j22K48j04j34R2Q6n4K00j64j57J31r9OK74
7875A20R1l22K90N1m06P3J45k1J20j37Lj66L84j03K4j22L22m44P4J73k36K45k62
7898a04L43j47K02k22j14j41L65l22q7L67k40J75k1k81K69n8N1j64R2J03JJ72
7920B39k53J80Lj72J78M8j03k98J82qQ6J70k47o8n9lJ49J87l09p2q6L53K3j93
7944g3J17l7m4J77l38J23K2J55j72K56j62j98K78l03O8Q6J21j97J73N4j43j03
7966a40L07n9j69J42n0P2k35M9K28j77L3j41n8J73j8J43l23L30k45K85k05J31
7988G3n3J0O7N7j9k69kL32j73O0Lj57J65j16J60j29L9NL4R6L7l04J89P4k63q6
8014a70L27k01r7N8J74j54M2J8K7kN3j19k89M72k74K11M3j8j85q2L59m9j77J3
$$ plain form
7850 31 100 -88 -15 -62 -130 97 -6 1 124 -99 -83 -205 43 -61 -195 -103 -17 -71 129 -35 -192 -61 -160 -154 120
7875 120 211 -111 179 230 -176 -103 42 21 141 4 7 -159 225 122 146 24 346 -98 -24 149 -87 158 -104
7898 -104 239 92 294 72 -42 -183 182 -140 -227 140 -100 75 54 -227 42 -16 35 -129 -37 66 67 239
7920 239 -14 166 169 -3 175 223 120 -178 4 -4 82 252 5 -63 -122 -125 24 211 -98 -170 -256 97 120 -73
7944 -73 44 7 -37 140 -198 -75 -53 102 -70 186 24 -174 104 -199 -131 -45 76 -121 52 106 -37 -140
7966 -140 167 108 -61 81 31 103 -132 -83 145 -32 1 -140 -198 -25 -43 100 -223 107 -138 147 -58 73
7988 73 20 30 97 154 135 -134 -136 196 23 83 86 -71 94 -22 138 9 48 53 87 183 220 -84 105 179 -84 -170
8014 -170 157 -44 -141 -83 91 -63 -21 -3 24 22 75 -44 -333 139 -135 76 119 101 -84 -166 193 144 -33 -20
8038b0pk0l4k4L82k03k96K84J0J3k08M59j38j51J17j22l91K80R8j28M6J56k42
8061a39p5L00j32J44l57L39k58M23k05L5p9P1j59qK5P5n7p1k15L04O4j99Q8K03
8085A17k67j04K12j18lK56j29j76K88J8j14Q9q7K1O8k57K89k07r3M85m50J82q1
8108f1K33j25nn9j82K31j03k06K57J78k56oJ64Q1q6j3J95l09J25J72k01K6q4K38
8132B04k62J54k37K41J53l64M7j3Q2j11j08J76Kj32L18L8l17j11M18m64L37r5
8154d4j04K11o1p7oK05O4Mk08JM4k7P8J63k12o2O8K9j99K59J08l14j06n0J87J9
8180c0J63k25Q0J71j47J15m60M56P3l66J42
$$ plain form
8038 -20 -27 -47 -81 -105 277 74 -222 62 72 85 -123 336 198 47 164 42 -349 -69 29 -99 -53 103 -139
8061 -139 -214 86 -46 98 -259 80 -178 245 40 75 -4 67 -92 -100 -75 0 -57 -128 -343 -39 25 -174 -86 117
8085 117 -150 -254 -42 -160 -163 93 -36 -212 76 94 -20 69 -18 3 71 -186 103 -104 -197 288 -162 20 -61
8108 -61 172 47 42 -17 -199 32 -71 -277 -20 158 -98 -104 60 141 55 42 237 -72 53 225 24 50 -34 204
8132 204 -58 96 -141 100 253 -111 -64 -77 5 -106 -214 -38 -36 -168 150 188 -129 -240 178 -286 51 -44
8154 -44 -148 63 2 -75 -81 124 188 192 -16 -15 29 2 80 243 31 -31 37 66 -133 126 234 -80 -186 -236 -49 -30
8180 -30 133 -92 -12 159 12 127 -333 123 196 -170 -28
8191b8
$$ Imaginary data points
##PAGE= N=2
##DATA TABLE= (X++(I..I)), XYDATA
0@%%%%%%%%%%%%%%%%Qj6J6j6J6j6K3l1L2l5M3m9N7o7P5q8R9j10J25j41J58j76
38i3J99k23K49k77L06l39L75m13M55n02N54o11O73p42Q17r01R96j101J221j360
58g17J521j710J936k212K559l009L617m488N838q231J3680m7697J3758J22726
72I7571Q039M9361j690n6621j0123p4359n7910J3650m6872K4416L2678j1334M9188
85A5994j3581k9408K1936n2228j858K3752j2537O5657L3014J4759O1778k6988
97A00290j9995j6869q6573k5772m0512m4824M2078M237L6723P4032N946M4086
109G2847J0627m1248J0297m5633l3667J8759l0193K6951L0880j2803M1090j2977
121C4930k9499R099n3212j2654P059k8012M4241K0641P706N5350j1529R4P302
$$ plain form
0 0 0 0 0 0 0 0 0 0 0 0 0 0 0 0 0 0 8 -8 8 -8 8 -8 15 -16 16 -19 24 -25 32 -35 40 -48 51 -59 66 -75 83 -93
38 -93 106 -117 132 -145 161 -178 197 -216 239 -263 291 -320 353 -389 428 -473 523 -578 643 -717
58 -717 804 -906 1030 -1182 1377 -1632 1985 -2503 3335 -4896 8784 -38913 -25155 97571
72 97571 105610 154971 153281 96660 86537 12178 -45732 -32082 -78954 -54538 -21860 -33194 15994
85 15994 2413 -26995 -5059 -57287 -59145 -35393 -47930 17727 50741 65500 127278 100290
97 100290 80295 63426 -23147 -48919 -89431 -134255 -92177 -87940 -51217 22815 28761 72847
109 72847 83474 42226 52523 6890 -26777 -8018 -38211 -11260 19620 6817 47907 34930
121 34930 5431 14530 -38682 -51336 -44277 -72289 -28048 -7407 299 55649 44120 44214 51516
134E1516n3743k486j9457l3576L3474n521J7155M6934j1689K5252K647l9717P506
147A8295l6374k7010J7033k5725K3147K8731p359M2112K01j2752K0257l6032o657
160b133N133l2083K3346K076r200L3522j7742j200J0798l7250Q639n495k0956
173d2545L2979m246J2857L7805j3103K1621M553l0395J1407k8822k2989J1113
185i765l0998R767J3743j6647L1228o37o399K7431k0132O225J4251k3298K2552
198A7321j792j3677K4296k1096l248J0015l1432J0286l912j9130K5332j0273M734
211a2576K6668j5633J8718Q176j9627K0379j5149j1692J5108k5806N207N761k2623
224b3089J9481p095r254K3203j6908P899J5462j8665K1078j573j2228K1654j7886
$$ plain form
134 51516 -2227 -4713 -24170 -57746 -24272 -29793 -12638 34296 22607 47859 50506 10789 18295
147 18295 -18079 -45089 -28056 -53781 -30634 -1903 -9262 32850 33051 20299 40556 4524 -2133
160 -2133 3000 -29083 -5737 -3661 -12861 20661 2919 1719 12517 -24733 -16094 -21589 -42545
173 -42545 -9566 -13812 -955 36850 23747 45368 49921 19526 30933 2111 -20878 -9765
185 -9765 -40763 -30996 -17253 -33900 -2672 -3309 -9708 17723 -2409 3816 18067 -5231 17321
198 17321 15529 1852 26148 5052 1804 11819 -19613 -9327 -13239 -32369 -7037 -17310 -12576
211 -12576 14092 -1541 17177 25353 5726 26105 10956 -736 14372 -11434 -6227 -466 -23089
224 -23089 -3608 -10703 -19957 3246 -13662 -5763 9699 -8966 12112 10539 -1689 19965 2079
237B079m86J2881k3724J3501n50j6684K1181j3828k394J7048k0907J2442M963
250E522j7374K1518r437n412J9244k0268P962O525k1371J7732q164j0070K0197
263F604j7033O723J2454j8444J8028k491j2238K0084j6491Q97J3113j9903J4048
276E351L50j4390J9789j2791k783J5027j9993J0396L172j6910J8480r859n182
289i343J7458j7856Q921P927j6883J7983n979q563J7660j7865M341Q695j8853
302a2357J6089j972r850K0748j2987K614J2613j9781J1452k512j6009J7233j2909
315g628p70J6243j6025J2687M260j5749J6035j2106q040J3636j7978Q640R207
328B412j2254K1042k478o240J6241j8445k96M167k0660J2705j836o432K2107q194
$$ plain form
237 2079 1593 14474 -9250 4251 3701 -12983 8198 -5630 -8024 9024 -11883 559 5522
250 5522 -11852 9666 229 -5183 14061 -6207 1755 8280 -13091 4641 -3523 -13593 6604
263 6604 -10429 -3706 8748 -9696 8332 5841 -6397 13687 -2804 -1907 11206 -8697 5351
276 5351 5701 -8689 11100 -1691 -4474 10553 -9440 956 4128 -12782 5698 -4161 -9343
289 -9343 8115 -9741 -820 7107 -9776 8207 2228 -6335 11325 -6540 -2199 6496 -12357
302 -12357 3732 1760 -8090 12658 -329 2285 14898 -4883 6569 4057 -11952 5281 -7628
315 -7628 -8398 7845 -8180 4507 8767 -6982 9053 -3053 -11093 2543 -15435 -6795 2412
328 2412 -9842 11200 8722 2482 18723 278 -18 4149 -16511 -3806 -5642 -12074 10033 1839
342A839N403J3149j8700P604n915j8898J2682j2603J01J8165j0401J5670P174
355A5270j3296J3633j4206j1986Q669j9711O849J0500q234K3797K226k546J6253
368B7218j8699l360o04k4200R100l243n643K4036m196Q513J4674j6996O283q358
382D525k0384R136j3445O68J9386o500J8508R862j0775J1408j6273j5296K868
395f312k2775M386R329m925K6748P101K869J8896j5679l298l500k5697L894o362
409a5325p583K0822l288R153J3940j5180N596q194j9811P608j1826K852K1120
422a16k087K1945J2897p775J0956j7478j8319k874k7492j676M224p188K5430Q479
436a074O688K2245r410J497N66k2538N091o767q392J7978n471O296J0824j6318
$$ plain form
342 1839 7242 20391 1691 9295 3380 -15518 -2836 -15439 -15338 2827 -7574 8096 15270
355 15270 1974 15607 1401 -10585 -1916 -21627 -14778 -4278 -12512 11285 13511 10965 27218
368 27218 8519 5159 4555 -19645 -10545 -13788 -19431 4605 409 8922 23596 6600 12883 4525
382 4525 -15859 -6723 -20168 -19500 -114 -6614 11894 21756 10981 22389 6116 -9180 -6312
395 -6312 -29087 -24701 -15372 -20297 6451 13552 16421 35317 19638 16340 12840 -12857 -8963 -15325
409 -15325 -22908 -2086 -5374 3779 17719 2539 8135 -59 -19870 -12262 -24088 -21236 -116
422 -116 -2203 19742 32639 24864 35820 18342 23 -2851 -30343 -32019 -27795 -34983 -9553 -1074
436 -1074 5614 27859 18449 19946 20512 -2026 3065 -3702 -12094 5884 413 6709 17533 1215
450A215L026j0682k1033N403j2498K109K0515J175K4686J6910j826J6053j2502
463C2551j4606l115k7413n291j935j2893J7366K928L261J9210q468L855L757j6897
477g690Q064l256m472J8025m003O665J1408j4672L917r676k0353L206j5055k831
491c0723J4563m556J8919J3383j801J7708o756p861M437k0560q47N63j2491J4476
505a546o75j134J5073j0313J799K437j6813O963m761o954J4845n330N863J1675
519A1129j0138Q758j992j2100R247j0209j455J0834r207J1117N046q680J1547
532A3897r425p891N521j6017K113K874r540J4648M91K58J6496p142N425O444j3118
547E034P370n686j0495Q152j3245k106M964j3420Q031L9o159J5461l029M868J4843
$$ plain form
450 1215 4241 -6441 -27474 -22071 -34569 -32460 -11945 -10770 13916 30826 29000 45053 32551
463 32551 17945 14830 -12583 -17874 -19809 -32702 -15336 -12408 -9147 10063 1595 5450 9207 -7690
477 -7690 374 -2882 -7354 10671 6668 13333 24741 10069 13986 4310 -16043 -12837 -27892 -30723
491 -30723 -16160 -20716 -1797 11586 9785 27493 20737 12876 17313 -3247 -4094 -3531 -16022 -1546
505 -1546 -2221 -3355 11718 1405 3204 5641 -11172 -4209 -8970 -15924 -1079 -6409 -546 11129
519 11129 991 9749 7757 -4343 4904 -5305 -6760 4074 -5133 5984 11030 2350 13897
532 13897 4472 -3419 2102 -13915 -11802 -8928 -18468 -3820 -3329 -3071 13425 6283 11708 18152 5034
547 5034 12404 6718 -3777 4375 -8870 -10976 -6012 -19432 -11401 -11362 -17521 -2060 -5089 -221 14622
562A4622o644J0439L867j0325Q948j0624q485M270j6411M74K3j2872J0034l828
576a6512k729J4608n395R057J2113n115J4406P57o686Q433j3940n597p41j7888
590a5229K513l135p750J3075k904M579J3868o239J0302L711q067J0536n986l647
604E627Q707j1533L071P95j3759N823q625q575Q081j0266N520J0365m286J6077
618G022L817j623J2574j0129k853K042j5968L480k891q058J1821m195J732J0166
632F937r851N609K40j0483Q561n774j939J1542p061P502N461r224P941o556q381
647e476N882j1560K152O046p272J2411J611l106J1223q588r64L283j3228N413
661b173j003n704J2497l497K018J0374r927M979j265j1892O716q029l288Q929
$$ plain form
562 14622 7978 18417 22284 11959 20907 10283 1798 6068 -10343 -9869 -9846 -22718 -12684 -16512
576 -16512 -19241 -4633 -10028 -971 11142 6027 20433 21190 14504 22937 8997 3400 2659 -15229
590 -15229 -12716 -15851 -23601 -10526 -13430 -8851 5017 -1222 9080 12791 4724 15260 9274 5627
604 5627 14334 2801 5872 6667 -7092 -1269 -9894 -18469 -10388 -20654 -15134 -4769 -9055 7022
618 7022 10839 9216 21790 11661 8808 10850 -5118 -1638 -4529 -12587 -766 -4961 -3229 6937
632 6937 -2914 2695 2935 -7548 1013 -4761 -6700 4842 -2219 5283 10744 1520 9461 2905 -5476
647 -5476 406 -11154 -9002 -2956 -10228 2183 3794 688 11911 3323 2359 5642 -7586 -2173
661 -2173 -3176 -8880 3617 120 2138 12512 2585 7564 6299 -5593 1123 -6906 -10194 -1265
675a265p799O965N358p108J0116m094n324Q149j0147K439N391q491J0522l89m052
690B71R454q332n00L785j1619N392q65o439J0779m685J536Q782q211N758L90q901
706c405P701o752l454P866r119M861L974p429R354k769l730Q925q441K653M577
721D812r256P825j793n210R039p066J223N748r134O740m71p096R661p181p21O708
737C828r118N951J449o994R187n188k594P579r752L512K642q078R405k112k144
752b427J0465o767L202M105r955N723l915o839P722p317J484P370p165Q164L50
767D200o000Q167p553j893N072r014N522K541n662J0050l866j686O831j0202K470
782a023O42q741Q090j951j263J0736n107M167M584r766N435m666p382O953p641
$$ plain form
675 -1265 -9064 -2099 3259 -3849 6267 2173 -3151 4998 -5149 -2710 2681 -5810 4712 4323 271
690 271 9725 1393 893 4678 -6941 -1549 -2414 -8853 1926 -2759 -1223 7559 -652 5106 5496 -3405
706 -3405 4296 -2456 -5910 1956 -7163 -2302 1672 -5757 3597 828 -2902 6023 -2418 235 4812
721 4812 -4444 3381 1588 -3622 5417 -1649 -426 5322 -3812 2928 2457 -4639 5022 -2159 -2880 3828
737 3828 -5290 661 2110 -4884 4303 -885 -3479 4100 -5652 -2140 502 -7576 1829 -283 -2427
752 -2427 8038 1271 4473 8578 -1377 4346 431 -6408 1314 -6003 -4519 2851 -4314 3850 4200
767 4200 -1800 6367 -1186 -3079 1993 -7021 -1499 1042 -4620 5430 1564 -122 6709 -3493 -1023
782 -1023 -381 -9122 -1032 -2983 -4246 6490 1383 5550 10134 368 5803 1137 -6245 708 -6933
797f933J660P277o227Q179M97n630P678q229k069M692r531N595K531m865J1175
812E800k999j155P281r765J783M01r086O982k712j721J0136n331M700M259q403
827A70N702m707o592O342p374J647O512o457P895O69n319P397p075k081M384q651
843g538N074J990m650J0065k833q12P107q795K824M93q689O726l255k413Q491
858C785n665L736L881p972O382l481n308P136p100J668N621p370O982J14n289
873b880P400o261o83N210q086N052J590n613Q251l873j195O345p677L367J749
888B696o879P868l304k562P666p232K539L081p725N881k108m871P831o346J130
903b335M542p664N548n16n123Q239m692J057O929o175O039Q81o760O254o296l528
$$ plain form
797 -6933 -5273 2004 -4223 3956 4453 -1177 6501 -1728 -3797 895 -8636 -3041 -510 -5375 5800
812 5800 2801 1646 8927 -838 945 1346 -7740 -758 -3470 -5191 4945 -386 4314 8573 170
827 170 5872 1165 -5427 915 -6459 -4812 1700 -4757 3138 3807 -1512 5885 -1190 -3271 1113 -7538
843 -7538 -2464 -474 -5124 4941 2108 1296 8403 -392 2432 2925 -5764 962 -2293 -4706 3785
858 3785 -1880 1856 5737 -2235 4147 666 -4642 2494 -4606 -2938 2683 -4687 2295 2409 -2880
873 -2880 4520 -1741 -2424 2786 -5300 -248 1342 -4271 3980 107 -1088 5257 -2420 947 2696
888 2696 -4183 3685 381 -2181 5485 -1747 792 3873 -3852 2029 -79 -4950 2881 -3465 -2335
903 -2335 2207 -5457 91 -425 -5548 2691 -2001 -944 5985 -190 5849 6730 -30 6224 -72 -3600
919c600M646q399L518K959n791Q820j684j901P443p043K139L316p687O885j721
934A900l233P798o182L29K536r613L248k368o455P857l615L174R546l373Q117
949I666K477n566N702p411m743L028r941K097J613n581Q189k106k003O683o941
964d837J830K745n962P974M59q67R622m588J501K225j0298J387n258q432N151
979g348n121K232Q975k838R261L740m238O990o074l387L153q883K655K034n783
994d632P944k928k771N354q398J36J326p395P190M62j43J0514k297L399M629q562
1010C828K423m252q085M254n972N98P158l915P013K195m604N902n778l404L389
1025G50p598L427L263m122Q833j217j233N964q045K58K41q336M901j230j832Q815
$$ plain form
919 -3600 1046 -7353 -3835 -876 -6667 2153 469 -1432 6011 -1032 1107 4423 -3264 3621 1900
934 1900 -1333 6465 283 612 3148 -6465 -3217 -5585 -12040 -4183 -7798 -4624 4922 1549 9666
949 9666 12143 6577 12279 4868 125 3153 -6788 -4691 -3078 -8659 -470 -2576 -4579 2104 -4837
964 -4837 -3007 -262 -6224 1750 2209 1342 10964 6376 7877 10102 -196 1191 -4067 -12499 -7348
979 -7348 -12469 -10237 -1262 -4100 5161 8901 4663 11653 5579 2192 5345 -3538 -883 1151 -4632
994 -4632 3312 384 -2387 2967 -5431 -5295 -3969 -11364 -4174 -3712 -3855 6659 4362 7761 12390 3828
1010 3828 6251 1999 -6086 -1832 -7804 -7206 -48 -3963 3050 5245 641 6543 765 -2639 750
1025 750 -6848 -3421 -158 -4280 4553 3336 2103 8067 22 280 521 -7815 -2914 -4144 -5976 2839
1041B839l716L307M377p299M186k836o226N290m875J513O615m145O624K058n054
1056B658N311o630l902K544q475K633J557m159Q254m49l37O956n693J787J913
1071C968o987N136j695k788P462m725J727L478p456L481k434o130N578n106J382
1086e109O091l989O556K244l807O310n155k526L211q030J847J009n971O755j876
1101b440j179O696n776K471K504n909O200j763k327O911m630J641L529o573M042
1116C397k067n133M785n550J95M883n758N377J405l995O835l930r92M410o574
1131b712K859R67n164N914k252j938N868n579K494K139n806N240j676k759N630
1146C225m702J273L893o022M660p92l899N716m976J89L897n943L938M52m352N752
$$ plain form
1041 2839 -877 2430 6807 -492 3694 858 -5368 -78 -4953 -3440 3175 -970 5654 7712 2658
1056 2658 7969 1339 -2563 -19 -8494 -5861 -4304 -8463 -209 -658 -995 5961 268 2055 3968
1071 3968 -3019 2117 422 -2366 5096 371 2098 5576 -1880 1601 -833 -6963 -1385 -6491 -5109
1086 -5109 982 -3007 3549 5793 1986 8296 3141 615 3826 -4204 -2357 -1348 -7319 -564 -2440
1101 -2440 -3619 3077 -2699 -228 2276 -3633 2567 804 -1523 5388 758 2399 5928 -645 3397
1116 3397 1330 -3803 982 -4568 -4373 510 -5248 129 1534 -2461 4374 444 -548 3862 -2712
1131 -2712 147 1114 -4050 1864 -388 -2326 3542 -2037 457 2596 -3210 2030 354 -2405 3225
1146 3225 -1477 -204 3689 -2333 2327 1535 -2364 3352 -1624 -1435 2462 -3481 457 909 -3443 2309
1162B309l687n18M725n908L299J138m960N936k756j468N462m867K376K446n432
1177a905M984j969l038N219n337J428K828n545M768o70l563N711m089J2L782n845
1193c229L690J33m473N813l440l86M615n140L279J024m504N401k250j920N333
1208C946n306K083K406n629M608j876l225N236m772R98L272m823M462k89l235
1223b144N812m391NL741n909L581mm457N296l265p79M554n251L203J302m030N342
1240B606j960j086N458n026K185J647n820M336k562l087M396m797J238L291m723
1255c904N071o75k933N376l823K36L461n187L795L93l811N361l665q71L759n677
1271c094K591O93l922N393k255m13N412m852K719J588n522M006k582l000M715
$$ plain form
1162 2309 -1378 -1896 2829 -3079 220 1358 -3602 2334 -422 -1890 3572 -1295 1081 3527 -1905
1177 -1905 3079 1110 -1928 3291 -2046 -618 2210 -3335 1433 763 -2800 2911 -1178 -1166 2616 -3229
1193 -3229 461 594 -3879 1934 -1506 -1892 2723 -2417 862 1886 -2618 2783 533 -1387 3946
1208 3946 -1360 723 3129 -2500 2108 232 -2993 2243 -2529 -1531 1741 -3082 1380 1091 -2144
1223 -2144 3668 -723 -718 3023 -2886 695 691 -3766 1530 -1735 -2514 2040 -3211 -8 1294 -2736 2606
1240 2606 646 -440 5018 -8 2177 3824 -1996 2340 -222 -3309 1087 -3710 -2472 819 -3904
1255 -3904 1167 492 -2441 2935 -888 -652 2809 -2378 1417 1810 -2001 3360 -305 -1176 2583 -3094
1271 -3094 -503 190 -3732 1661 -594 -1007 4405 -447 2272 3860 -1662 2344 -238 -3238 1477
1286A477m610J584K890m512M396p64l082M728m200L20L251m897M262O67k688N687
1302D509l439o18L198n853K439p1m184N030k061m94N110m109K322J297n106L914
1318A884k458k826M320l968J842L217m053M441p33l484M365m614Q2K812m548M170
1334D49O80k553N590k862m62L140n509J647O5m199M934k266n65N092l980K476
1350A677J050n043L775k577k627M262l766J966K994l468M625o73l127M017m595
1365a510j92K460m465M030N39k265N098k296o04L043n032J580j33m281M560j808
1381a276p25M873l605K229J152m635L138k467k429L846l669J987L131k992M562
1396C120p71k767M045m281M9K098m528L664O6k395N033k790j62K592n061J974
$$ plain form
1286 1477 -3133 -1549 1341 -3171 1225 461 -2621 2107 -2093 -1773 1478 -3419 843 1510 -1178 4509
1302 4509 1070 452 3650 -2203 236 165 -4019 1011 -1050 -1544 3566 -543 1779 3076 -2030 1884
1318 1884 -574 -3400 920 -3048 -1206 2011 -2042 2399 1666 -1818 2547 -2067 -1985 827 -3721 449
1334 449 1129 -1424 4166 1304 842 3982 -1527 120 185 -4014 920 -1346 -1911 3181 -799 1677
1350 1677 2727 -2316 1459 -1118 -3745 517 -3249 -1283 1711 -1757 2868 2195 -932 3085 -1510
1365 -1510 -1702 758 -3707 323 862 -1403 3695 1399 795 3838 -1194 386 253 -4028 532 -1276
1381 -1276 -2001 2872 -733 1496 2648 -1987 1151 -1316 -3745 101 -3568 -1581 1550 -1442 3120
1396 3120 2349 -418 3627 -654 -605 1493 -3035 629 695 -1700 3333 543 381 2973 -2088 -114
1412a14j82l596M086j775k73M532l560K359J659m646L463k357k391L318l426J526
1428a377K369l446M468n26k538M355m019M26K198m169L314j79k204M242k109l60
1444D45K359m898J999m1m039M096k406j7M153l365K751J335l515L396j776j786
1460a309K912l019J096K072l473L536p91k425L836l717M81K031l905L277J18k317
1476a597M672l003k4K816m354J969j93l345L617k097r47L974l584K050J364l309
1492a991L930j731j604L751l533J548J878l659L449p45j913L361l662M30J986
1507A495m240K805j18k156L750k422K42K536l846K493n9l011L960k341o46L466
1523A908l119J615J052k990L562k048j268L335l786J456J749l153L239o95j776
$$ plain form
1412 -114 -296 -3892 194 -1581 -1854 2678 -882 1477 3136 -1510 1953 -404 -2795 523 -2903 -1377
1428 -1377 992 -2454 2014 1488 -1050 3305 -714 -288 1910 -2259 1055 876 -1328 2914 805 445
1444 445 2804 -2094 -95 -136 -4175 -79 -2485 -2502 1651 -1714 1037 2372 -1143 2253 477 -1309
1460 -1309 1603 -1416 -320 1752 -1721 1815 1024 -1401 2435 -1282 -801 1230 -2675 602 720 -1597
1476 -1597 3075 72 48 2864 -1490 479 286 -3059 558 -1539 -2486 1488 -2096 -46 1318 -1991
1492 -1991 1939 208 -1396 2355 -1178 370 2248 -1411 2038 1293 -620 2741 -921 -491 1495
1507 1495 -2745 60 -58 -2214 1536 -886 -644 1892 -1954 539 480 -2531 1429 -912 -1558 1908
1523 1908 -1211 404 1456 -1534 2028 -20 -1288 2047 -1739 -283 1466 -1687 1552 857 -919
1538i19L224l075N85J907l800L055m58k503L699k797o9K668l887K677J23l046
1554b616L805j890n09L441l460K062J004l142L470j392j450K961l349J095J558
1569A588l505L270j256j686L217l178Q36K138l500K964o27k146L729k519O2K300
1585A687l589K260M03k858L675k396k35K835l427K278Q95l092L631j597j391L101
1601B180l232J093J215k986K916j294j850L490k882O78J449l033K844q34k079
1616b325L839k396Q0K406l394K691k06k226L493k368k16L009l584J641J009k819
1632a366L114j428j277K881l204J384J037l199K893j022j778L275k575J062J518
1647A315l098K619q07j909L165k230K72K399l162K320J56k326L241k163o55K578
$$ plain form
1538 -919 2305 -770 -185 1722 -2078 977 519 -1984 1715 -1082 -1151 1517 -2370 307 430 -2616
1554 -2616 1189 -701 -1210 2231 -1229 833 1837 -1305 2165 773 -677 2284 -1065 30 1588
1569 1588 -1917 1353 97 -1589 1628 -1550 -714 1424 -2076 888 261 -1885 1844 -675 -613 1687
1585 1687 -1902 358 761 -2097 1578 -818 -1053 1782 -1645 633 1528 -1564 2067 470 -921 2180
1601 2180 -1052 41 1256 -1730 1186 -108 -1958 1532 -1350 -672 777 -2256 588 -246 -2325
1616 -2325 1514 -882 -802 1604 -1790 901 695 -1531 1962 -406 -622 2387 -1197 444 1453 -1366
1632 -1366 1748 320 -957 1924 -1280 104 1141 -2058 835 -187 -1965 1310 -1265 -203 1315
1647 1315 -1783 836 29 -1880 1285 -945 -673 1726 -1436 884 1040 -1286 1955 -208 -863 1715
1663A715l090K043O43k523L107j736r97K656k947J102J071l032K638r54j567L149
1679A278k787Q51J665l172K749j36k064L356k435L60K090k838K180J45k241K862
1695A863k263m88K488l284J800O58k338K930j530q09K644k743J324Q29k890K614
1711H05r92j438K963k923J131J629k886K382l92j659L041k250M04K002k612J924
1727A129K21k386K786j837n63K143l175J708M00k440K820j312q90K841k792J373
1743B6J048k796K578q59j124K476k580Q97J471k644K386m19j743L007k412M80
1759b08K073k806J940M2k132K962k412k38K394l264J767K67k424L007j491j070
1775a593K776k540J387Q99k891L357j121j339K927k826R88J277k429K252p34j409
$$ plain form
1663 1715 -1375 668 1311 -1212 1895 159 -838 1818 -1129 -27 1044 -1988 650 -304 -1871 1278
1679 1278 -1509 -658 1007 -2165 584 448 -1616 1740 -695 -335 1755 -1083 1097 1242 -999 1863
1695 1863 -400 -888 1600 -1684 116 774 -1564 1366 -164 -973 1671 -1072 252 1081 -1809 805
1711 805 -187 -1625 1338 -1585 -454 1175 -1711 671 279 -1380 1661 -589 -185 1817 -795 1129
1727 1129 1350 -1036 1750 -87 -650 1493 -1682 26 426 -2014 806 -506 -1396 1445 -1347 26
1743 26 1074 -1722 856 -3 -1127 1349 -1231 -334 1137 -1507 879 460 -1283 1724 -688 -208
1759 -208 1865 -941 999 1041 -1091 1871 -541 -779 1615 -1649 118 385 -2039 968 -523 -1593
1775 -1593 1183 -1357 30 929 -1962 1395 274 -1065 1862 -964 24 1301 -1128 1124 390 -1019
1791a019K634k253O20J533k629K036j99j841K549k023j54K154l095J799M99k338
1807a727K596j517p15K246k504J413J045k504L022j126r04K591k379Q88J153k657
1823a079K023n08j653K392j943L97J648k688K053N4j904K889k194p8J753k323
1839a161J347J74j924K555j554p00K376k824J328R24k291K872p33j005L040k354
1855G0O73R85k610K361j363j245K366k379J00J889k464J732J28k207L050k126
1871a040k6K454k390J670N06k192K862j798r64K117l030J563P24k650K979j176
1887c91m18K797k259Q63J492k705K050p15j580K249k353K65J555k984K160k97
1903b71j657K628k056L39K026k344J942L94j798K999j919l16J782k678J039O25
$$ plain form
1791 -1019 1615 -638 -18 1515 -1114 922 723 -1118 1431 -592 -746 1408 -1687 112 611 -1727
1807 -1727 869 -648 -1363 883 -1621 -208 837 -1667 1355 229 -675 1916 -463 425 1578 -1079
1823 -1079 944 436 -1217 1175 -768 -371 1277 -1411 642 696 -1208 1681 -513 -591 1162 -1161
1839 -1161 186 360 -1564 991 -563 -1263 1113 -1711 -383 541 -1750 1122 389 -616 2424 70
1855 70 743 1728 -882 1479 116 -1129 1237 -1142 -1042 847 -1617 115 243 -1964 1086 -1040
1871 -1040 -1066 1388 -1002 668 1174 -1018 1844 46 -918 1199 -1831 -268 456 -2194 785 -391
1887 -391 -809 1988 -271 592 2084 -621 1429 714 -866 1383 -970 -705 850 -2134 26 -271
1903 -271 -1928 700 -1356 -1017 1009 -1335 607 1001 -797 2202 283 -33 1749 -929 110 735
1919G35k389K333j019p76K693k485J128J370k641K318j138j456K566k106M73J384
1935I90k762K427m97k018L001k035j84K403k606J610M90k256K998j439m67K033
1951A688k754J514K94k169K594j276o12K431k127R21N47k245K225j245j077K001
1967G10k174M79J415k347K076j04j459K670j467n2J519k017J517M07k033K188
1983A328j672o27K150k491J398L70k153K528r00p95K396k090P88J195k165J857
1999A117r37j143J976k063M23J115k528K114j04j548L017j670L37J454k132J716
2015A144K4j833K410j619o90J973k502J181M78j962K452j429o50K030k532J286
2031b39R01k245K470q20j035K483k155N13J214k558J865m28j251K340j691Q4J984
$$ plain form
1919 735 -1654 679 -340 -1116 1577 -908 220 1590 -1051 1267 129 -1327 1239 -867 -394 990
1935 990 -1772 655 158 -1860 1141 -894 -1078 1325 -1281 329 819 -1437 1561 122 -345 1688
1951 1688 -1066 448 742 -1427 1167 -109 -721 1710 -417 504 1051 -1194 1031 -214 -1291 710
1967 710 -1464 -985 430 -1917 159 55 -1404 1266 -201 -253 1266 -751 766 1173 -860 1328
1983 1328 -344 -971 1179 -1312 86 456 -1697 831 -69 -864 1532 -558 230 1425 -740 1117
1999 1117 180 -963 1013 -1050 -627 488 -2040 74 -30 -1578 1439 -231 106 1560 -572 1144
2015 1144 1168 -665 1745 126 -564 1409 -1093 88 566 -1396 1056 -373 -1023 1007 -1525 -239
2031 -239 662 -1583 887 67 -968 1515 -640 -127 1087 -1471 394 -34 -1285 1055 -636 -552 1432
2048A432k160J729O3j879K169j423o09K099k254J166N44j950K317j299p12J574
2064H07k203Q81O20j916K127m39j080K726j962N35J425k339J757m32j465K131
2080A173j621j72J664k239J766P8k150K489j396n15K257k377J793L69k042K096
2096A173j252p84J900k553Q62N45k155K035o2q79K559j939J028J102j773J560
2112A367l59j352J861k071R8J171k404J627l56j457K331j350j36K167j886J244
2128D95J046j902K116j330n91J394k296N53l0j994K008q38n51K631j431J102J317
2145A699j852K112m53j568K163j939M2Q42k580J430l91j558K000j529MJ879j769
2162a468J705O82j372K603j321o24J778k371O83M72k503J704p71j067K488j996
$$ plain form
2048 1432 -728 1001 1064 -815 1354 -69 -678 1421 -833 333 877 -1073 1244 -55 -767 807
2064 807 -1396 -515 105 -1811 316 -123 -1203 1523 -439 96 1521 -818 939 507 -958 1173
2080 1173 -448 -620 1044 -1195 571 649 -1501 988 -408 -923 1334 -1043 750 1119 -923 1173
2096 1173 -79 -863 1037 -1516 -654 -109 -2264 -229 -291 -1170 1389 -550 478 1580 -193 1367
2112 1367 1008 -344 1517 -554 -456 715 -1689 -62 -418 -1875 456 -894 -1030 1137 -749 495
2128 495 1541 -361 1755 425 -166 1228 -1068 -515 -545 -2539 -531 -1369 -1920 711 -720 382 1699
2145 1699 -153 1959 1506 -62 2101 162 204 1046 -1534 -104 -495 -2053 -53 -1582 -1578 301 -1468
2162 -1468 237 919 -453 2150 829 205 1983 -388 295 767 -1736 -32 -803 -1870 618 -1378
2178a378R13J463k019K143k06r45J923j850J90J179k080J120l89j479J947j520
2194i88l35J703k153J602L53j415K282n67n10J333j927P52Q18k416K432j088q50
2211i74K203k199R48J311k159J954n20j490J954j960L67J041j836J283Qj574K235
2228E92j102n3J620j858J121O79j829K144j332j38J360k168Q64N59k077J639o16
2245e95n77K247j787R64J057j729J764m86j338J970k163O1J021k136J242Qj267
2262a744K092j162J79J584j907J605L85j471K096j119l62J449k244P71N61j950
2278a237J291p19q05K076j755Q77R98j541K172o19j134J854j897J89J073j868
2294a045J182k04j132J459j062K4J246j852J493O23j690K105o70j96J505j716
$$ plain form
2178 -1378 -465 998 -1021 1122 916 -29 1894 44 234 1413 -667 453 64 -1415 532 -988
2194 -988 -1323 380 -1773 -171 182 -1233 1049 482 -28 1305 -622 130 948 -1468 964 -124 -974
2211 -974 1229 -970 -22 1289 -870 1084 564 -926 1028 -932 -565 476 -1360 -77 -69 -1643 592
2228 592 -510 -563 1057 -801 320 999 -830 1314 -18 -156 1204 -964 -100 459 -1618 21 -595
2245 -595 -1172 1075 -712 252 1309 -420 1344 858 -480 1490 -673 -612 409 -1727 -485 -477 -1744
2262 -1744 348 -814 -635 949 -958 647 1032 -439 1657 538 176 1625 -619 152 713 -1237
2278 -1237 54 -665 -1470 606 -1149 -272 726 -815 1357 738 -396 1458 -439 -250 823 -1045
2294 -1045 137 -67 -1199 260 -802 -778 468 -1384 109 732 -958 1147 477 281 1786 70
2310G0L62O01k133J785j029q78J693j584Q57N20j384J562m82r70J957j503M28
2327a28J088j999J595Q7j573J955j354l66J429k046J478p9j294K323j017j36J497
2344A460j577J079M12k160J849j160r16J840j989P25P35j696J628m71r64J862
2360F57j517P26J480j992J643j23j042J640j459k97J277k247R65K32j482J854
2376C15q78r6K007j747R84Q68j974J614r63j013J872j881L41Q95j911J974q21
2393d14r54J618j561N83J719j794J562j3o56K047j649L0R22k219Q93P3j612J859
2411D34j092k34J741j802J164L47j236J565r74m06J446j522P06Q10j791J303l69
2428I0r74J502j701L27J199j589J828l13p68J905j196j53J369j951P91L3j323
$$ plain form
2310 70 432 1033 -1100 685 -344 -1222 471 -1113 -256 264 -1120 442 -40 -1010 947 -556 -128
2327 -128 960 -1039 556 643 -930 1025 -329 -695 734 -1312 166 87 -1207 1116 99 -37 1460
2344 1460 -117 962 1374 -786 1063 -97 -1013 827 -1162 -437 298 -1398 230 -241 -1205 657
2360 657 -860 -134 1346 -646 997 874 -168 1472 13 -284 993 -1254 -289 -57 -1539 315
2376 315 -563 -659 1348 -399 585 1453 -521 1093 130 -883 989 -892 -551 344 -1567 407 -414
2393 -414 -1368 250 -1311 -728 991 -803 759 746 90 2137 488 518 1440 -779 114 187 -1425 434
2411 434 -658 -892 849 -953 211 558 -678 887 -87 -493 953 -569 137 947 -844 459 90
2428 90 -884 618 -1083 -756 443 -1146 682 369 -399 1506 310 157 1526 -425 366 399 -924
2445i24J548j203j46J563j562Q54L79j766J814j069p31J957j357O18J069j471
2461d27J582n65j089J628j626M66P51j942J701m65q02J808j355L36O71j432R57
2478A97K30j411J837j044j53J554j851Q51K78j281J177j211l99J591j644J072
2494b07O82j139J783o21p72J687j386J6R84j948J222O8j286J662j383L91R61j530
2512h16R86K7j041J651q47l03J349j329O54J69j672J281r48m53J528j477P74J118
2530F51q35J202k72l35J271j577L47N41k025J189l51r45J467j219K01J083j726
2547a333J082N59j157J782n97k82J457j537Q32N4j627J053j092m05J038j155O56
2564f72J005j016J791p5p23J474j428m8M14j423J071k08j264J501r42k97J207
$$ plain form
2445 -924 624 -579 -725 838 -724 130 509 -1257 557 -512 -1243 714 -643 -25 1044 -427
2461 -427 1155 590 -499 1129 -497 -31 720 -1222 479 14 -788 1020 -335 1 672 -760 197
2478 197 427 -984 853 -191 -344 1210 -641 210 488 -793 384 -827 -1226 365 -1279 -207
2494 -207 475 -664 1119 498 -274 1413 27 43 1027 -921 301 369 -917 745 -638 -247 714 -816
2512 -816 170 197 -844 807 -40 -343 1006 -323 331 500 -1172 109 -839 -1292 236 -1241 -467 651
2530 651 -184 1018 746 411 1682 105 452 993 -1032 157 -194 -1139 328 -891 -690 393 -1333
2547 -1333 -251 308 -849 933 336 54 1511 -26 806 860 -767 286 -806 -1211 -173 -1328 -672
2564 -672 333 -683 1108 1033 310 1784 356 308 722 -701 370 162 -1102 399 -543 -840 367
2581C67j323P80K9j051J661q43K9J254j231R02L24j757J121n68o25J392j363P24
2599a78J375j476J725k43r22J285j909J22j23j392J189l60p50J702n07M20R02
2616H60j299J202O5q74J308q41l71R42j768J046n9j729P52q27k44J499j085J305
2634a18J458r14J847J03j126J200j722k09k83k221Q12l85j136J732r77O61J362
2651H4q19J348L84q85J769n43l64J167j259L78l72j931Q60j263j134J106q41O81
2669a634J501m85K091L02l70J419j843M57j71j986O63n26r62R46j192M38R81j204
2687a575J087J99q35J989o48M90J319j232J053P4j472N34j112j370J142j684L93
2704a648R16o38J650J30j69J049j190L11M77j864J060P3q93J427r15m7R65j297
$$ plain form
2581 367 -956 -176 -147 -1198 463 -380 -351 903 -328 574 898 -859 262 -306 -931 461 -902 -178
2599 -178 1197 -279 1446 1203 281 1566 -343 -221 -344 -1736 -547 -907 -1657 45 -462 -42 860
2616 860 -439 763 828 -46 1262 421 50 992 -776 270 211 -1518 -766 -1593 -1837 -338 -1423 -118
2634 -118 1340 426 2273 2376 1250 2450 728 519 236 -1985 -1173 -1558 -2694 -962 -1939 -1278 84
2651 84 -735 613 997 112 1881 1338 974 2141 882 1260 888 -1043 -183 -1446 -2580 -1474 -2315 -1634
2669 -1634 -133 -618 1473 1775 1405 2824 981 1438 1267 -719 -56 -582 -1544 -598 -1790 -1352 -371 -1575
2687 -1575 -488 -289 -1124 865 217 707 2026 794 1847 1921 449 983 -129 -1499 -357 -2041 -1648
2704 -1648 -732 -1370 280 410 241 1290 100 411 888 -976 84 157 -736 691 -224 -271 694 -603
2722f03P16O5j131Q91n70J85J065l56N89K84j291R20o32p75R38j611Q93M25p29
2741g27J413k22l44J019j295MM53j832J221n22m71J737q22P89O26j051J061m53
2759E84r75J098r42L6R11j095O08J40r14J023q65n00R23j216P43O16r70J389J5
2778F09l30J303j545L27L50j540Q48o90p05J345n24L64Q77j171J109J85j080J311
2796A043r45j85J199j479Q21K03j151R47o39n03Q98j438O64L34q79J327m64r4
2814c41J758j453M56N98j456Q84m36o59J119r50J60P75j237J109N7j152J361r05
2832c12K96P44j352R89j65q68J179l65p27J128j556N52N42j134J271m18l57J282
2850G29j100Q72L76j281J194l36o13R79j142o6J078j249O26l8p34J099q24r2R89
$$ plain form
2722 -603 113 178 -953 -62 -632 -447 618 262 851 1135 -156 764 132 -643 295 -1316 -423 2 -727
2741 -727 686 464 120 1139 -156 -152 301 -1531 -310 -832 -1303 434 -388 401 1027 -24 1037 584
2759 584 -391 707 -235 -199 712 -383 225 365 -549 474 -391 -891 32 -1184 -441 175 -795 594 609
2778 609 279 1582 37 364 714 -826 22 -668 -1373 -28 -552 -188 689 -482 627 812 -268 1043
2796 1043 98 -87 1112 -367 454 657 -494 453 -186 -689 209 -1229 -565 -231 -1110 217 -247 -341
2814 -341 1417 -36 420 1018 -438 446 10 -649 470 -480 -320 455 -782 327 384 -768 593 -312
2832 -312 -16 728 -624 365 200 -668 511 146 -581 547 -1009 -457 85 -1049 222 -196 -553 729
2850 729 -371 501 877 -404 790 454 -159 820 -322 -388 690 -559 67 29 -705 394 -430 -522 467
2869D67j210J096n4q20R66k56l88R58j121K79J29j126J184l19o03J479j037L62
2887a4R48j110J032o17l11R48p48j73P57j474Q17oj008J283r07P2P38j151Q48
2906g6M78o43R07n95j26R69j268N80J23r43Q36m81p8R64r40L16N59j059J029o74
2926a22j20Q08p92J10R47j221Q68m15p87J311r29k7N82j167J096J66j186J463
2944E85r30o3J020j207O45L37j085J154m04j88Q86q99N85K46j462J001o11k98
2962f88R86p63J81P35r77J028q3o80P20o40l16J074j137O25M33q19Q91o70l13
2981d13J156j520O51K49o28J266m89j64J011r62J79M34j512P69p60m76J029q53
2999a033N39R79p68R83K4r14J078q85j00P23j160O68j35o54J141j189k63J249
$$ plain form
2869 467 -743 353 299 -521 445 189 -199 759 -362 -83 46 -1080 104 -215 -818 661 -376 -14
2887 -14 934 -176 856 239 -72 876 128 -45 712 -762 55 49 -959 324 -583 -511 227 -924 -76
2906 -76 402 -241 666 71 -55 914 -354 226 349 -594 242 -239 -317 647 -293 23 582 -477 552 -122
2926 -122 -242 566 -226 -116 831 -390 478 63 -724 587 -342 -369 213 -954 142 308 -878 585
2944 585 -345 -408 612 -595 50 387 -698 456 52 -136 750 -149 436 682 -780 221 -390 -688
2962 -688 298 -465 -284 451 -526 502 419 -261 459 -181 -497 577 -560 65 498 -321 570 -100 -413
2981 -413 743 -777 -126 123 -505 761 272 108 1119 157 336 770 -742 27 -733 -1209 -180 -1033
2999 -1033 -494 485 -283 700 724 -190 888 3 -97 626 -534 134 -1 -655 486 -703 -966 283
3017B83j425O82M57m21J191k77K85R77j015K90K42j824M36p21q89Q56q64O27R22
3036a88r55J696o8m39J485j157K38M45o41M59m5r27O44r03o13M29j197N35J41
3055a061n39J552j89N84J523r97N10M15j193M34j243p41P03j414N71K73m14J152
3073g4j55m54J246n79O6R87q87N55N94r96P64n92o03M81j280J3l6o63J065p9o0
3094f87J464p72Q42K29j245J108j045o39J010r13J17Q16p11Q16j40o16O96q21
3112d91K18N76r92Q10p3p00J231l28m82P09j063P25j20m79R98j53m08J046r78
3131D6R0J72j036P07n84p72Q95r11O36P00l94J126K57o97J381r93K63M25j209
3150A02K02j20j123Q76j173j49Q20r35R62L68l11J217m6j74R99j001M65K27j119
$$ plain form
3017 283 -1142 -460 -3 -424 767 490 775 1752 737 1027 1269 -555 -119 -840 -1729 -873 -1737 -1110 -188
3036 -188 -1143 553 485 46 1531 374 612 1057 416 875 830 -97 547 -356 -969 -540 -1737 -1202 -1061
3055 -1061 -1600 -48 -237 347 1870 873 1383 1798 605 1039 -204 -945 -242 -1656 -1085 -812 -1226 -74
3073 -74 -229 -683 563 -16 50 1037 150 705 1299 303 1067 475 -128 353 -927 -914 -950 -1613 -548 -627 -687
3094 -687 777 5 847 1076 -169 939 -106 -745 265 -648 -531 285 -426 390 250 -366 330 -491
3112 -491 -273 303 -689 121 48 -652 579 251 -231 478 -585 140 20 -459 539 386 -22 1024 46
3131 46 136 308 -728 -21 -605 -1377 -482 -1393 -757 -57 -451 675 932 235 1616 623 886 1311 102
3150 102 304 184 -939 -63 -1236 -1385 -565 -1500 -538 -170 -481 736 690 516 1515 514 979 1206 87
3169H7L49p05p41O18r73J90K61l70P76K06p5J270l01L43R26q20L53r2j270O21
3189F53j340p5M6q37O26J87m69J137j42r0J036o45N22M24q79Q01l48m77O80q16
3209fj73K80j583Q98l07n15J097L7M04P37n34O78J05p38O41j035l72M09p34M54
3229b57J55n82J094o03n4O33r57K63K44o06R19p3l24R10l14J29M71j557N49M6
3249H6r48R88p84K22Q71p77Q38k9j123J013j102j56Q00p62P39R4j59J037l81n5
3269D12N21j543O80k68p87R47j4m34Q98n58N44O26j248N53m39n57R60r44O32O56
3289F37q94P76l3o66L49o36k02O62j058J053K17o18J033q0k44N96p26R5j52j078
3309i69Q22J9k39O53l00K82K98q27N57l40l98O80o73J30R41j120P34J80n93R71
$$ plain form
3169 87 436 -269 -1010 -392 -1365 -1175 -914 -1284 -508 -302 -377 893 592 935 1861 1041 1394 1302 32 653
3189 653 -687 -762 -716 -1553 -927 -740 -1209 -72 -214 -304 732 87 609 1033 154 955 607 130 810 -6
3209 -6 -179 101 -1482 -584 -891 -1406 -309 -272 132 869 335 1013 1118 380 1021 -14 -386 23 -711 -257
3229 -257 -102 -684 410 -193 -247 386 -571 -308 -64 -670 249 176 -148 762 448 577 1048 -509 40 86
3249 86 -862 126 -658 -436 435 -342 496 467 -656 357 -745 -901 -101 -863 -124 -30 -189 848 467 412
3269 412 933 -610 70 -198 -985 -38 -52 -486 412 -146 398 1024 -224 329 -110 -667 293 -651 -19 637
3289 637 -257 519 486 -180 169 -467 -669 -7 -1065 -12 205 -413 620 540 296 892 166 261 109 -969
3309 -969 -147 -128 -367 286 -14 268 566 -261 296 -44 -442 238 -435 -305 636 -484 250 430 -163 808
3329H08r91k05M87p56O54K39q48J078j56k21P56j242M40K1o35P96n42j53J206
3348G36j051K82M59p65O93k65o37J114r37J38M51p93M83J78n26Q33o02o1N79q18
3368e09N22J62o76P89l66J66M06m11J02O33j132N60l25j90O71j047Q84J25o27
3387b63O66l11m75Q61p89N6L93p66O66K50p57J135o36k9L36o82O32n17k81P29
3407B18l77K5P47p25M74J61o98O96n56m04O63j058L96K38l24Q08k07n03J163p51
3427a4p5O13q22Q60j20p96R28p29K7P60j308Q67j39o29L74N4j68Q72n37M67K04
3448F89p20O26o98k53R01r82J64J37n13N32P4l04N09l23K57M49q17M72L77p05
3468a28Q38o10l5K83q78M70K22p65J056p83j84Q31o89O87K49o48M26o51j46R20
$$ plain form
3329 808 -183 -388 99 -657 -3 236 -612 466 310 89 845 -397 43 64 -571 225 -317 -470 736
3348 736 -315 -33 426 -339 354 89 -548 566 -371 -233 218 -575 -92 86 -440 393 -209 -270 309 -509
3368 -509 13 175 -501 288 -78 88 494 83 185 818 -314 246 -79 -269 402 -645 239 364 -263
3387 -263 403 92 -383 478 -311 -255 138 -628 38 288 -469 666 30 1 337 -345 287 -230 -511 218
3407 218 -159 -134 613 -112 362 523 -175 521 -35 -439 224 -834 -438 -200 -524 284 77 -426 737 -14
3427 -14 -89 524 -298 562 442 -354 574 -155 -128 632 -676 191 52 -577 -203 -149 -317 555 18 485 689
3448 689 -31 595 -103 -356 545 -437 -273 -136 -649 -117 -43 -347 162 -161 96 545 -272 200 577 -128
3468 -128 710 100 65 348 -530 -60 162 -603 453 -330 -514 317 -372 315 564 -84 342 -309 -455 465
3488D65r31K91O45p60O32j46l11M21n69O6L51p03Q26n6m01P45p81J15M10r13K20
3509c84O38o36N35k14J16O80o18L87P6j122K71n42j32Q29p50L89O65m39O04O9
3529D22k51N46o14L24L45o97O69q3p78O26o79k06J26r37J73N10k71J071m04O52
3549E44R83q80K99ko78J18p21k48J20k74P4J79k72P88j87j60L45n35O32K88j47
3570B66P25M02p06P12q44n46k10r28p6o9l54R33J75K49J102m71M95J97r51M36
3590E37p06NO31j075P15L33o50M07j24p05L07o46N3O29l02J016M12k84P92n30
3610H15j69l06j290O59l22l60O70j02K49O37m54M07j26r73N74n99j94R58m00N48
3630B22N96n20Q24k94p52L24q64K7L25p92R18j35P4O19n91L0K8p69L72P6n47Q50
$$ plain form
3488 465 -466 -175 470 -290 342 196 -115 306 -263 -197 154 -549 277 221 -180 565 -216 -101 309 -604 -384
3509 -384 254 -382 153 -61 55 735 117 504 580 -542 -271 -813 -945 -116 -866 -477 188 -251 353 422
3529 422 171 717 103 427 772 75 744 661 -117 509 -170 -376 -250 -1187 -1014 -504 -775 296 -108 544
3549 544 1527 647 946 944 266 384 -337 -585 -465 -739 -665 -486 -758 30 -157 -317 28 -507 125 413 266
3570 266 991 1393 687 1399 555 9 -201 -1129 -1205 -1274 -1628 -695 -520 -271 831 360 855 1052 101 537
3590 537 -169 -164 467 -608 107 440 -210 197 73 -632 -325 -971 -918 -289 -591 425 837 553 1345 815
3610 815 646 340 -950 -291 -613 -973 -303 -405 -156 481 27 434 308 -665 -91 -690 -884 74 -326 222
3630 222 818 298 1122 828 76 400 -464 -437 -112 -904 14 -121 -47 572 -19 11 39 -730 -358 -282 -829 21
3652B1J32J42P85l33J11k5r70J42q09k3M04m19J83Q10m52P68N5j30K42n38K36
3673C32j0q51P71J08k01M86k99l73P2j046L90k56j00Q41l51M95J024m74M53j83
3693H28m66L75q29k65K00l68M1O40k19K22j10k60L74o22J42L73n05P28Q2j94P16
3714H83o11l1J51p76K33k38m51N92q7n8Q40r07O58K03k95M97o41j08N42q03N54
3735A47K94n93N27m19O4K59o78J19J45m64L36J67j98N45l28L07K58o18M14k13
3755G1m60N01m07Q9O12m67L32L79q89O35l72k95M61o13N97M5m07N99j19l92O23
3776E23m45k4j2m98J66J94j67K12l37M81L67p34M33k73R0L41l21j62M48m97K72
3797E7j7j60M13j55l77L06l53O1M29k51J87p7j98P44o30RL23p29M71k87j45O10
$$ plain form
3652 21 153 295 1080 747 858 833 -137 5 -804 -827 -423 -842 -659 151 -301 467 522 392 634 96 332
3673 332 322 -529 242 350 149 635 336 -37 35 -1011 -621 -877 -977 -136 -487 8 1032 558 1011 828
3693 828 362 737 -92 -357 -157 -525 -484 156 -63 159 49 -211 163 -459 -317 56 -449 279 361 167 883
3714 883 272 241 392 -384 -151 -389 -840 -248 -335 -393 447 -460 198 401 106 603 -38 -146 396 -407 147
3735 147 441 -152 375 -44 20 279 -399 -280 -135 -599 -263 -96 -294 251 -77 230 488 -130 284 71
3755 71 -389 112 -295 -206 406 -61 271 650 -239 396 24 -271 190 -423 174 219 -188 411 292 -100 523
3776 523 78 54 42 -456 -290 -96 -263 -51 -388 93 460 -274 159 -114 -24 317 -4 -166 282 -215 57
3797 57 40 -120 293 138 -239 67 -286 -225 204 -47 140 63 -135 609 -21 -12 311 -418 53 -234 -379 231
3819B31l84L57N9m39M85q3m11N48l57j56L22o56O68P2n88P95l21k37M94q29K80
3840a50J26m61O92j94j35L94m42K4L02l09N5j85j93O60l11J02N86p98N26j28k12
3861e1L87o45L81P7n05P62M1m44L81l04l63L22n11L39J8n49O91J09M4J82l67m7
3883e2M62r58P06l4m11N05k32J05J34j96J94j05n32M76n32L03L83l76O44jm38
3904D5J88l48J1K71q96L02L35j82N79j85M2L14k77K89n19j62J51N4l10O95m82
3925h5M28mm75K87l89k60J27m9P2L14l59R12M63o09J69m21o4j86l04J44%j58P19
3948B72k44k32P08m44K93k16l79L22m00L7O48j70P8N03o01j0l65n56M96k78J75
3969c63N99j18JK65j48M86l79m08K00n75L61N1m90O78j10j7M33l80l3r3l80K96
$$ plain form
3819 231 -153 204 263 -176 309 226 -185 363 6 -150 172 -484 184 256 -332 463 142 -95 399 -430 -150
3840 -150 -24 -485 207 13 -122 272 -170 -146 156 -153 -98 -283 -476 184 -127 -25 561 -237 289 161 -51
3861 -51 336 -309 72 149 -356 406 447 3 384 80 -283 39 -472 -133 -115 -664 27 136 180 362 -5 -52
3883 -52 410 -548 158 124 -287 218 -14 91 225 29 223 118 -414 62 -470 -167 216 -160 484 483 45
3904 45 233 -115 -104 167 -729 -427 -92 -274 305 120 162 476 199 488 -31 -193 -42 12 -298 397 -85
3925 -85 343 339 -136 151 -238 -498 -371 -420 -348 -34 -393 519 982 373 542 121 57 -129 -433 -289 -289 -447 272
3948 272 28 -204 504 60 353 137 -242 80 -320 -283 365 195 273 776 175 165 -200 -756 -260 -538 -363
3969 -363 236 118 119 384 236 722 343 -65 135 -440 -79 -28 -518 160 50 33 466 86 53 -40 -420 -124
3991a24j65k57Q63j89J91N01o74J01k33j97K2l65k30P47k59M94p0j12N82q68J03
4012a39O4m95L07K66l75R42k65L55K18m77j37P1n75q0J05k60N58k37J45J92j51
4033C2M7j70J4O3k24j24M23P4P3K84k87J28j19m54L69o63Q8q3N4N56l79K77M87
4056D66m53L61J61l80J01j07n8mk13J17K76n25R5j31k51R9J05l7N98k04M05j0
4078D11o4L52l69j16r8l81j56J95m09N57P2m73O38m52N30j77k53M75j58J04L33
4099E61o30J36K21k75R5j12n34M03j26j24M37m10M46n1j09K69l39L53%l51L57
4120B17J07m92M33k73k08L31k85O7l8m29P72m30L7M49m56L77j38k02K81l74R3
4141a61N98l45L9J97o64M73J49n14L97j79J29q8n25L55K39l80M24J55l62L29l11
$$ plain form
3991 -124 -289 -546 317 128 319 820 146 247 14 -183 -161 -526 -756 -9 -268 226 156 44 626 -242 -139
4012 -139 -75 -570 -263 3 -372 570 305 660 878 401 264 335 -240 -320 -215 -475 83 -154 -9 183 32
4033 32 79 -91 -77 -14 -238 -362 61 135 208 492 205 333 214 -240 129 -534 -446 -529 -475 81 -298 -21 466
4056 466 13 374 535 155 256 149 91 87 -126 -9 267 -258 -163 -294 -545 -446 -341 -378 220 16 421 411
4078 411 347 699 330 214 116 -265 -421 -226 -635 -78 -6 -479 159 -293 237 60 -193 282 124 228 561
4099 561 -69 67 288 13 108 -4 -538 -135 -261 -385 52 -358 88 37 -72 197 -142 211 211 -140 217
4120 217 324 -168 265 -8 -216 115 -170 -103 -141 -570 202 -228 -191 258 -198 179 41 -161 120 -254 -161
4141 -161 437 92 131 328 -336 137 286 -228 169 -10 119 31 -494 -139 100 -280 144 299 -63 266 -45
4162d5K97Rn39N46k16r7L27m27j42K64l39K40J29j82M30m01K97K06l93J90Q3m87
4184b50M40k15j08M52o10J1J56k51N84k30j3L42l74K35r6k40L71k42O9K17l50
4205a02K09kk39L55j63j92K99l87K78K10j70J28N7l39K69l95j93N46n33O28r4
4226A70j60J97l80o0K51j71J55J11l89K97O5l82M56j63k27L61l66M00n8j04J30
4247A33j39K5J04j60J38J20l30L07l34J41J55j25J7j23J12J8j22K78L0k29k26
4268b10J51n0O8j71J6K91k09%N39o69M69l32p2N60n81l3M64l37J97J57n75N63
4290B36k79K29K4m12n5K76m10L67J75l29M09k30L48J70p77O24m90m19N51q6j98
4311b76L53J21J46o8j46J88m15O8L8n02M87Q7j46L73m94R3K75l48P1k1k42M49
$$ plain form
4162 -45 252 261 -278 268 52 -45 282 -145 -287 -23 -362 -122 7 -175 255 -146 151 357 -36 154 237 -250
4184 -250 190 -25 -133 319 -291 -280 -124 -375 209 -21 -34 308 -66 169 73 -167 204 -38 31 248 -102
4205 -102 107 105 -134 221 58 -134 165 -222 56 266 96 224 281 -58 211 -184 -377 169 -364 264 170
4226 170 10 207 -173 -233 18 -153 2 113 -276 21 86 -296 160 -3 -230 131 -235 165 107 3 133
4247 133 -6 19 123 -37 101 221 -109 198 -136 5 160 35 52 -71 41 59 -63 215 245 16 -210
4268 -210 -59 -109 -41 -212 -196 95 -114 -114 425 -244 225 -107 -179 381 -200 -233 231 -106 91 248 -327 236
4290 236 -43 186 210 -202 -257 19 -391 -24 151 -178 231 1 349 519 -258 366 -124 -543 8 -78 -276
4311 -276 77 198 344 276 130 318 -97 -29 9 -493 -6 81 -65 308 -186 -93 182 -166 -95 -116 -358 91
4333I1N1j04K54l30K59m7k44R9j13l8L26l01J88J78l59L14j34j90L46l72M1K37
4355A52m39L44j23k10N73m77L77O9n54K07K06o39O60k78P0L04k40J64O6k81K89
4376B40m07j72L86j57J45L58j55nj19p8K13k57J9M2l83N41k45q3N84l17j21J63
4398A92l79K89l16j99M27j08r0P15m29nk7r0K10j3k59L59k71P6k7q5K48j01k60
4421a43J65k44J05M07n16K89n4j73L56j29k46J43k82M15J0k77J41P3MJ57k67K72
4443B06j00N7J58l88l2L87m33J8K92l30M73l56j07L28o11N71j6n12M06l6k5J97
4465A47k35J17K01l89K18l7k56O17l09r8M30l02j92K28m30M71j59k38M04k33J92
4486A47kk43J90p9l00L99k28R7Q7k61J29Q3j0L32j8j95PJ17j14Q7q1j43M1J03
$$ plain form
4333 91 142 38 292 -38 221 174 -70 29 -84 -122 204 -97 91 269 -90 224 90 -100 246 -126 -85 152
4355 152 -287 57 -66 -276 297 -180 197 266 -288 -81 125 -514 146 -132 -62 242 2 166 232 -49 240
4376 240 -167 -339 47 -110 35 393 238 233 114 36 249 -8 11 53 -330 211 -34 -117 467 150 29 192
4398 192 -187 102 -214 -413 14 -94 -184 531 102 97 70 -20 190 177 -82 277 6 82 55 -30 218 117 -143
4421 -143 22 -222 -117 290 -226 63 9 -164 192 63 -183 -40 -322 93 103 -174 -33 40 44 201 -66 206
4443 206 106 163 321 -67 -99 288 -145 -127 165 -165 308 -48 -155 173 -438 133 117 -395 11 -25 -50 147
4465 147 -88 29 230 -159 59 22 -234 383 74 -24 406 104 -88 140 -290 181 22 -216 188 -45 147
4486 147 145 -98 92 13 -287 112 -116 -19 68 -193 -64 19 9 341 323 128 135 252 138 225 144 1 42 145
4510A45K58n05R7K73n53K47j67j58N96k76l4L79n10K55L7j45K24k11OL1O7R9o
4533A49m27L45j79k1Q8j67K26j53j16M49j9J29J82n36L99k62j32K84l87K37m3
4554D6k55K31j7r6Oq3J75r8kK10j1n5M2K5L7J02m7k75N6j66L7K1k0L18n02J50
4580a71R9q1N4K21j87K09j69j62P1n4J80L94q00K69R2r8L26j08l72L56k27K13
4602E5J7r9K21k23L2J81k33M5o2k2M3J19j65M33m69j50K21m60O06j44r6L05k46
4625i1k2L44m26L29L10l11Lr2j19K03l97M32k24n4M75l58n0K41l42K54m6j62L02
4648A99m03J4M34l36J94J82l75J79J01j16j87j07P2K96j96K30R2m83J28kj5J45
4670D6k86P16j37o23M86k21m9j05o7K10K36k96M96l42l19K65L9P4ol54J81L2j55
$$ plain form
4510 145 403 -102 -5 268 -285 -38 -205 -363 233 -43 -77 302 -208 47 84 -61 163 -48 -42 -11 56 155 149
4533 149 -278 67 -112 -133 -45 -212 14 -139 -255 194 175 304 486 -50 349 87 -45 239 -148 89 46
4554 46 -209 22 5 -91 -85 -168 7 -91 -93 117 106 51 93 118 155 257 210 -65 -9 -175 -138 -117 -137 181 -321 -171
4580 -171 -72 -153 -99 122 -65 144 -25 -187 -116 -170 10 404 -396 -127 -35 -133 193 85 -287 69 -158 55
4602 55 72 -27 194 -29 3 184 -49 -4 -66 -88 -45 74 -91 342 -127 -277 -56 -516 90 -54 -150 155 -91
4625 -91 -113 231 -195 134 444 133 136 44 -75 128 -269 163 -61 -115 360 2 -48 193 -149 105 59 -103 199
4648 199 -204 -190 244 -92 102 284 -91 88 189 73 -114 -221 -149 147 -49 181 273 -210 -82 -84 -99 46
4670 46 -240 476 339 -284 202 -19 -68 -173 -240 -30 206 -90 406 64 -255 10 49 123 117 -237 -56 -24 -179
4693a79L51l86N68l36j02L72k66j07K6j02m7K07kj07J57m1j39J42n7R4o1o4p9
4716a58j63K42M6q0J00k29K18J48l51L91k01k8M88o52M60r1l09L59j25J29j56
4737C8j26l8L20l47K71k45J54n6N4r5N4Q7R6o4k69J49j94J79J73j41R8Q8k90M76
4761C72r7k75J83j00N4j32j64M52j89K8K88n53K43p3m52N77k30nK29k28MK29m30
4784b69N22m04K18j16j71L56m0l09L50j98J56q1j38J73o2j18J4L48k87p1K79l90
4806b38L41j48n2J92j18q9K11q0K0r7o7M86m75M15k07k72M74m62L4J24jj36K84
4829A39n7L1l96K55p0rm5j31K0K88R5J15l17L61l75R3o6J62lj65Q5j94P8M6J2
4854d8K04k9j36L12l56J04j3J49Q6k71l11M62o2k13M04l73j3J27j25J07L6J61
$$ plain form
4693 -179 172 -214 354 18 -84 288 22 -85 -59 -161 -208 -1 -3 -110 47 6 -133 9 -48 46 -15 -79 -158
4716 -158 -321 -79 -33 -113 -13 -242 -24 124 -227 164 -37 -65 423 -229 231 140 -169 190 65 194 38
4737 38 -88 -126 194 -153 118 -127 27 -29 25 -70 -16 71 167 103 -166 -17 -211 -32 141 0 98 186 -104 372
4761 372 275 0 183 83 137 5 -159 293 104 132 420 -133 110 37 -415 162 -68 -73 156 -72 -68 161 -269
4784 -269 253 -151 67 -49 -220 136 96 -213 137 -61 95 14 -124 49 -13 -131 -117 231 -56 -127 152 -238
4806 -238 103 -45 -97 95 -23 -112 99 19 39 -58 -125 361 -114 301 94 -178 296 -166 -132 -8 -9 -145 139
4829 139 82 113 -283 -28 -98 -107 -152 -283 -263 25 120 235 -82 279 -96 -3 -69 93 90 -75 10 -184 -106 -60 -48
4854 -48 156 127 -9 303 -53 51 38 187 273 2 -309 153 91 -122 282 -91 -104 23 -102 5 41 202
4876B02l9j14j8J22k83J49lp2P8j68R6p5J04qk1P5J4J35p0j77R0J06j17p8J91
4901A19J17l96N26n45K48k29j0K67m5k64L65j98k38K64p0J58j18k9l6ln7L37N7
4924B20n7rl6j72L17k32O7l83K37J43k83L62l08R2rk21K70J70m81M77j62o8Q6
4947B0l1J63Q6l33K56o7j30O9m1k71M21o75O98k09L62k4l29J02j22k2P4N2j21
4970g2J52j10J57o3k8k76J76l6J46k1j24K01j09l7J54k87L13J71n33M50m18j44
4992c38O49o16N04j25k28L48k8j86L1Q6K53l60M5j43m3O2P5k88L66J74k86P1j9
5015DK2j63N4P8J39L7J0j2l12K85j78l8L1j46M41j51j07R5Pj56P3QJ92j33r7k3
5041d0K54l41q1J78J77l64P4J51j96J42K3n3J00K3r3J26J14P4k83j02J33M7j99
$$ plain form
4876 202 163 49 31 153 -130 19 16 -56 22 -146 -50 -125 -21 -29 -50 25 39 174 104 -73 17 123 6 -72 119
4901 119 236 -160 366 -179 69 -160 -170 97 52 -212 153 -45 -283 -19 -89 69 -49 -78 -114 -117 -174 163 220
4924 220 163 154 118 -54 263 31 98 -285 -48 95 -188 174 -134 -42 -51 -272 -2 168 -313 164 2 -66 20
4947 20 -11 152 238 -95 161 94 -36 33 -8 -279 142 -533 165 -44 318 294 -35 67 -55 -77 -3 49 -72
4970 -72 80 -30 127 64 36 -240 -64 -100 46 25 -99 102 -7 -44 110 -177 136 307 -226 224 -194 -338
4992 -338 311 -305 199 74 -154 194 166 -20 11 97 350 -10 35 -108 -151 -89 -14 -302 64 238 -48 23 4
5015 4 26 -137 -83 -5 134 171 181 169 -143 142 -36 -74 -43 -189 252 101 -6 89 96 -60 13 21 213 80 -17 -40
5041 -40 214 -127 -208 -30 147 -217 -143 8 -188 -46 -23 -76 24 47 -46 80 194 268 -15 -117 16 63 -136
5064a36M48k18P9j85j10K02J50k12K9J9j47K21J01j13K78l80p7K39k94L42l03
5085f7J43j46K49m40K96N9K28m89J26M2K36l44J42j06K0J7j35K48j16J08M6l92
5107b75K38j34J40K10n29K37J18J22k62L16j56K92l47k3K85k85j73K79l27K13
5127f1M0j49J51j95L18j93m2J80q6k38M77l20O5M15k92R4l94O7N70o63K23m9k0
5150a02n7J42j63L22k14M5J96k82NN4o5J1j80J70M81l78Ln6k39O11l14Q7%J31
5174B08l32J77l9j11J46k5k09J45N4K00m87L42k9j7O4jk60K31k86N3K0o2K21R6
5198I9l2O9j95O9L91o38L08pj72K73q3O0r9l46L85k15O3Rm0p6K26M1J00k93L32
$$ plain form
5064 -136 312 94 173 -12 -122 80 230 18 47 66 -81 140 241 128 406 26 -51 188 -106 236 -67
5085 -67 76 -70 179 -261 35 94 322 -167 -41 1 237 -107 35 -71 -51 -34 -169 79 -37 71 117 -275
5107 -275 -37 -171 -31 179 -350 -113 5 127 -135 181 25 317 -30 -53 232 -53 -226 53 -274 -61
5127 -61 -21 -170 -19 -214 104 -89 -131 49 -37 -275 202 -118 -53 362 70 164 -230 -163 407 -256 -33 -82 -102
5150 -102 -159 -17 -180 142 -72 -27 169 -113 -108 -54 -119 -108 -288 -118 363 -15 -12 -68 -307 304 -10 77 77 208
5174 208 -124 53 14 -97 49 24 -185 -40 14 214 -273 69 40 23 87 86 -174 57 -229 -176 -156 -218 3 99
5198 99 67 136 -59 10 401 -237 71 64 -108 165 82 142 43 -303 82 -133 -70 -61 -101 -177 49 90 190 -103 229
$$ [...]
8191a72
##END NTUPLES=NMR FID
##END=
