##TITLE=1H_Pr 88-3
 CDCl3
 8 sc, 
 12.4.2023
##JCAMPDX= 6.0         $$ Bruker NMR JCAMP-DX V2.0
##DATA TYPE= NMR FID
##DATA CLASS= NTUPLES
##ORIGIN= UXNMR, Bruker Analytische Messtechnik GmbH
##OWNER= root
$$ XWIN-NMR		Version 3.5
$$ Wed Apr 12 14:01:57 2023 Russian Standard Time (UT+4h)  she@DPX200
##.OBSERVE FREQUENCY= 200.13135
##.OBSERVE NUCLEUS= ^1H
##.DELAY= (6, 6)
##.ACQUISITION MODE= SIMULTANEOUS
##.ACQUISITION SCHEME= undefined
##.AVERAGES= 8
##.DIGITISER RES= 18
##SPECTROMETER/DATA SYSTEM= spect
##.PULSE SEQUENCE= zg30
##.SOLVENT NAME= D2O
##.SHIFT REFERENCE= (INTERNAL, D2O, 0, 15.7039)
##AUDIT TRAIL= $$ (NUMBER, WHEN, WHO, WHERE, WHAT)
$$ ##TITLE= Audit trail, XWIN-NMR		Version 3.5
$$ ##JCAMPDX= 5.01
$$ ##ORIGIN= Bruker BioSpin GmbH
$$ ##OWNER= she
$$ F:/spectra/data/she/nmr/H-F/1/audita.txt
$$ ##AUDIT TRAIL=  $$ (NUMBER, WHEN, WHO, WHERE, WHAT)
(   1,<2023-04-12 14:00:38.56 +0400>,<she>,<DPX200>,
      <created by zg, POWCHK disabled, PULCHK disabled
       configuration hash MD5:
       00 E9 B6 7A A2 85 ED C7 34 08 36 98 17 FE 4E 26
       data hash MD5: 16K
       0E 2C 20 B4 71 9F 86 23 4A B5 B5 DF FC 84 E9 76>)
$$ ##END=
$$ 
$$ hash MD5
$$ 53 08 2C B0 65 59 98 9C EF 75 BD C1 30 A4 A4 7D
##$RELAX= 
##$RELAX= 
##$RELAX= 
##$RELAX= 
##$RELAX= 
##$RELAX= 
$$ Bruker specific parameters
$$ --------------------------
##$DU= <F:/spectra>
##$EXPNO= 1
##$NAME= <H-F>
##$PROCNO= 1
##$TYPE= <nmr>
##$USER= <she>
##$AMP= (0..31)
100 100 100 100 100 100 100 100 100 100 100 100 100 100 100 100 100 100 
100 100 100 100 100 100 100 100 100 100 100 100 100 100 
##$AQSEQ= 0
##$AQ_mod= 1
##$AUNM= <au_zg>
##$AUTOPOS= <>
##$BF1= 200.13
##$BF2= 200.13
##$BF3= 200.13
##$BF4= 200.13
##$BF5= 200.13
##$BF6= 200.13
##$BF7= 200.13
##$BF8= 200.13
##$BYTORDA= 1
##$CFDGTYP= 0
##$CFRGTYP= 5
##$CHEMSTR= <none>
##$CNST= (0..31)
1 1 145 1 1 1 1 1 1 1 1 1 1 1 1 1 1 1 1 1 1 1 1 1 1 1 1 1 1 1 1 1 
##$CPDPRG= <>
##$CPDPRG1= <>
##$CPDPRG2= <>
##$CPDPRG3= <>
##$CPDPRG4= <mlev>
##$CPDPRG5= <mlev>
##$CPDPRG6= <mlev>
##$CPDPRG7= <mlev>
##$CPDPRG8= <mlev>
##$CPDPRGB= <>
##$CPDPRGT= <>
##$D= (0..31)
0 1.2 0 0 0 0 0 0 0 0.06 0 0.03 0 0 0 0 0.0002 0 0 0 0 0 0 0 0 0 0 0 0 
0 0 0 
##$DATE= 1681293638
##$DBL= (0..7)
120 120 120 120 120 120 120 120 
##$DBP= (0..7)
150 150 150 150 150 150 150 150 
##$DBP07= 0
##$DBPNAM0= <>
##$DBPNAM1= <>
##$DBPNAM2= <>
##$DBPNAM3= <>
##$DBPNAM4= <>
##$DBPNAM5= <>
##$DBPNAM6= <>
##$DBPNAM7= <>
##$DBPOAL= (0..7)
0.5 0.5 0.5 0.5 0.5 0.5 0.5 0.5 
##$DBPOFFS= (0..7)
0 0 0 0 0 0 0 0 
##$DE= 6
##$DECBNUC= <off>
##$DECIM= 32
##$DECNUC= <off>
##$DECSTAT= 4
##$DIGMOD= 1
##$DIGTYP= 9
##$DL= (0..7)
0 120 120 120 120 120 120 120 
##$DP= (0..7)
150 150 150 150 150 150 150 150 
##$DP07= 0
##$DPNAME0= <>
##$DPNAME1= <>
##$DPNAME2= <>
##$DPNAME3= <>
##$DPNAME4= <>
##$DPNAME5= <>
##$DPNAME6= <>
##$DPNAME7= <>
##$DPOAL= (0..7)
0.5 0.5 0.5 0.5 0.5 0.5 0.5 0.5 
##$DPOFFS= (0..7)
0 0 0 0 0 0 0 0 
##$DQDMODE= 0
##$DR= 18
##$DS= 0
##$DSLIST= <SSSSSSSSSSSSSSS>
##$DSPFIRM= 0
$$ [...]
##$SUBNAM2= <"">
##$SUBNAM3= <"">
##$SUBNAM4= <"">
##$SUBNAM5= <"">
##$SUBNAM6= <"">
##$SUBNAM7= <"">
##$SUBNAM8= <"">
##$SUBNAM9= <"">
##$SW= 18.05172834244
##$SWIBOX= (0..15)
0 0 2 0 0 0 0 0 0 0 0 0 0 0 0 0 
##$SW_h= 3612.71676300578
##$TD= 16384
##$TD0= 1
##$TE= 0
##$TE2= 300
##$TE3= 300
##$TEG= 300
##$TL= (0..7)
0 120 120 120 120 120 120 120 
##$TP= (0..7)
150 150 150 150 150 150 150 150 
##$TP07= 0
##$TPNAME0= <>
##$TPNAME1= <>
##$TPNAME2= <>
##$TPNAME3= <>
##$TPNAME4= <>
##$TPNAME5= <>
##$TPNAME6= <>
##$TPNAME7= <>
##$TPOAL= (0..7)
0.5 0.5 0.5 0.5 0.5 0.5 0.5 0.5 
##$TPOFFS= (0..7)
0 0 0 0 0 0 0 0 
##$TUNHIN= 0
##$TUNHOUT= 0
##$TUNXOUT= 0
##$USERA1= <user>
##$USERA2= <user>
##$USERA3= <user>
##$USERA4= <user>
##$USERA5= <user>
##$V9= 5
##$VALIST= <valist>
##$VCLIST= <CCCCCCCCCCCCCCC>
##$VD= 0
##$VDLIST= <DDDDDDDDDDDDDDD>
##$VPLIST= <PPPPPPPPPPPPPPP>
##$VTLIST= <TTTTTTTTTTTTTTT>
##$WBST= 1024
##$WBSW= 4
##$XGAIN= (0..3)
0 0 0 0 
##$XL= 0
##$YL= 0
##$YMAX_a= 248785
##$YMIN_a= -210155
##$ZGOPTNS= <>
##$ZL1= 120
##$ZL2= 120
##$ZL3= 120
##$ZL4= 120
##$ABSF1= 10
##$ABSF2= 0
##$ABSG= 5
##$ABSL= 3
##$ALPHA= 0
##$AQORDER= 0
##$ASSFAC= 0
##$ASSFACI= 0
##$ASSFACX= 0
##$ASSWID= 0
##$AUNMP= <proc_1d>
##$AZFE= 0.1
##$AZFW= 0.1
##$BCFW= 1
##$BC_mod= 2
##$BYTORDP= 1
##$COROFFS= 0
##$CY= 11.3945322036743
##$DATMOD= 1
##$DC= 2
##$DFILT= <>
##$DTYPP= 0
##$F1P= 2.36226072786647
##$F2P= -0.459571619588291
##$FCOR= 0.5
##$FTSIZE= 0
##$FT_mod= 4
##$GAMMA= 1
##$GB= 0.15
##$INTBC= 1
##$INTSCL= 1
##$ISEN= 128
##$LB= 0.24
##$LEV0= 0
##$LPBIN= 0
##$MAXI= 10000
##$MC2= 0
##$MEAN= 0
##$ME_mod= 0
##$MI= 1.114404
##$NCOEF= 0
##$NC_proc= 0
##$NLEV= 6
##$NOISF1= 3.799351
##$NOISF2= 2.8
##$NSP= 1
##$NTH_PI= 0
##$NZP= 0
##$OFFSET= 15.70392
##$PC= 1
##$PHC0= -19462.36
##$PHC1= -1.399194
##$PH_mod= 1
##$PKNL= yes
##$PPARMOD= 0
##$PSCAL= 0
##$PSIGN= 0
##$REVERSE= no
##$SF= 200.130013532006
##$SI= 16384
##$SIGF1= 3
##$SIGF2= 2
##$SINO= 400
##$SIOLD= 16384
##$SREGLST= <1H.CDCl3>
##$SSB= 0
##$STSI= 0
##$STSR= 0
##$SW_p= 3612.71676300578
##$SYMM= 0
##$S_DEV= 0
##$TDeff= 0
##$TDoff= 0
##$TI= <>
##$TILT= no
##$TM1= 0
##$TM2= 0
##$TOPLEV= 0
##$USERP1= <user>
##$USERP2= <user>
##$USERP3= <user>
##$USERP4= <user>
##$USERP5= <user>
##$WDW= 1
##$XDIM= 8192
##$YMAX_p= 0
##$YMIN_p= 0
$$ End of Bruker specific parameters
$$ ---------------------------------
##NTUPLES= NMR FID
##VAR_NAME=  TIME,          FID/REAL,        FID/IMAG
##SYMBOL=    X,             R,               I
##VAR_TYPE=  INDEPENDENT,   DEPENDENT,       DEPENDENT
##VAR_FORM=  AFFN,          ASDF,            ASDF
##VAR_DIM=   8192,          8192,            8192
##UNITS=     SECONDS,       ARBITRARY UNITS, ARBITRARY UNITS
##FACTOR=    0.0002768,     1,               1
##FIRST=     0,             0,               0
##LAST=      2.2672688,     0,               0
##MIN=       0,             -210155,         0
##MAX=       2.2672688,     248785,          0
$$ Real data points
##PAGE= N=1
##DATA TABLE= (X++(R..R)), XYDATA
$$ [...]
2439B122l002j014L931j477l277L117J775l996J76L969k555k376L778P53l885
$$ 2122 -880 -1894 2037 560 -2717 400 2175 -1821 -1645 2324 -231 -2607 1171 1924 -1961
2454a961J358K731k790o66K984p27k881K468J555l342M55K834k263j794L130K02
$$ -1961 -603 2128 -662 -1328 1656 929 -1952 516 2071 -1271 -816 2018 -245 -2039 1091 1293
2470A293l101R91K868k559j440K957k01k666J633J983k681m40K465n49k034J634
$$ 1293 -1808 -817 2051 -508 -1948 1009 808 -1858 -225 1758 -923 -1363 1102 553 -1481 153
2486A53J455k380K35J989j069j594J763N80k141L97J977j386j469K376Ok277J085
$$ 153 1608 -772 -537 1452 383 -1211 552 1132 -1009 -612 1365 -21 -1490 886 892 -1385 -300
2503c00J799k228p93K532p8k844K001J564k633m03L082j525j735K250O53k732
$$ -300 1499 -729 -1522 1010 932 -1912 89 1653 -980 -1383 1699 174 -1561 689 1342 -1390
2519a390R59K386k256p07K498r23k257K113J398l168M08K939k167j501K710J54
$$ -1390 -431 1955 -301 -1008 1490 567 -1690 423 1821 -1347 -939 2000 -167 -1668 1042 1196
2535A196k887J358K024k350n28K943j134k148K150P15k679P21K262k030j049K858
$$ 1196 -1691 -333 1691 -659 -1187 1756 622 -1526 624 1339 -1340 -619 1643 -387 -1436 1422
2551A422p76k093J958J133k951K88K755j670j806K868J72k596P04K155k069p48
$$ 1422 646 -1447 511 1644 -1307 -1019 1736 66 -1740 1128 1300 -1296 -592 1563 -506 -1254
2567a254K642r01j735J128J159k079K79J676j048j308K242r0k093J119J948k206
$$ -1254 1388 487 -1248 -120 1039 -1040 -761 915 -133 -1441 801 711 -1382 -263 1685 -521
2583e21j060K870n39k065R41J983k098n41K114m56j601J203Q49j616m43K037q07
$$ -521 -1581 1289 750 -1315 -374 1609 -489 -1030 1084 628 -973 230 1079 -537 -980 1057 250
2600B50j578K024M41k497P95K004j648j216K395K19k958J365K176k408q83L019
$$ 250 -1328 696 1137 -1360 -565 1439 -209 -1425 970 1189 -1769 -404 1772 -636 -1519 1500
2616A500q85k262J844J578k705J00K275j241j719K336L25k704J041K082j938j058
$$ 1500 615 -1647 197 1775 -930 -830 1445 204 -1515 821 1146 -1558 -517 1565 -373 -1431
2632a431K798r04k367J721J572k246k51L082j747k174K424R76l212J325K182k080
$$ -1431 1367 463 -1904 -183 1389 -857 -1108 1974 227 -1947 477 1453 -1759 -434 1748 -332
2648c32j146L088m99j942M06J817k111l32K195q65j573J856R0k295N12J922j346
$$ -332 -1478 1610 1111 -831 -425 1392 -719 -1051 1144 279 -1294 562 652 -1643 -1131 791 -555
2665e55r62K421rk703J602J376j429o06K332j849n87J469k29r46J2K227j442r70
$$ -555 -1517 904 895 -1808 -206 1170 -259 -865 1467 -382 -969 500 271 -675 -663 1564 122 -848
2683h48J407pk165J625J057j526j85J590j216o95J453N70k054O52J556j073j473
$$ -848 559 552 -1613 12 1069 -457 -642 948 -268 -963 490 1060 -994 -342 1214 141 -1332
2700a332J870K14j511M60J669k145L3J634n91j000J181N37k156R46J325j600k24
$$ -1332 538 752 -759 -299 1370 -775 -742 892 301 -699 482 1019 -1137 -191 1134 -466 -690
2717f90J781r77j532J429P11j060o88J952m09k023J537J126j989m1J987j114j129
$$ -690 1091 114 -1418 11 722 -338 -1026 926 517 -1506 31 1157 -832 -873 1114 0 -1129
2734a129J249K42j411J042Q22j385n17K095p96j438J398J303k376N34J478j238
$$ -1129 120 362 -1049 -7 815 -570 -1087 1008 212 -1226 172 1475 -901 -367 1111 -127
2750a27j159K039K00k019O14K064j763n74J513J05j880Q85J176j703k52J774n98
$$ -127 -1286 753 953 -1066 -452 1612 -151 -725 788 893 -987 -102 1074 -629 -881 893 295
2767B95j588K023L04k263M98K137j644j360K546Q7k431J113J922j969q77K420
$$ 295 -1293 730 1034 -1229 -731 1406 -238 -1598 948 1035 -1396 -283 1639 -330 -1207 1213
2783A213l64k114J342J526k469K54J942j278j649K310L18k189N62J826k056n17
$$ 1213 849 -1265 77 1603 -866 -612 1330 52 -1597 713 1031 -1158 -596 1230 -826 -1343
2799a343K525m68k140J609J169k092o3K100j049j266J631L09k163J231J328j665
$$ -1343 1182 714 -1426 183 1352 -740 -803 1297 248 -1018 613 922 -1241 -10 1318 -347
2815c47l28J317J91j908J062Q20j212l77J388m90j072J463J22j253K99J130j204
$$ -347 -675 642 833 -1075 -13 807 -405 -782 606 116 -956 507 629 -624 -325 805 -399
2832c99m90J459L4j534Q73R30j314k07R89O7j197Q62N49q28l61J187m46o57Q66
$$ -399 -889 570 604 -930 -57 873 -441 -648 341 408 -789 73 622 -206 -567 620 174 -483 383
2851C83K24j079O18M74r61k80J239p8j464J239N33j628L8J455p47q27J182N44
$$ 383 607 -472 146 620 -341 -621 618 540 -924 315 848 -780 -742 713 -34 -861 321 865
2869H65j516J39J077p25n19J339k50j019J004M24j872R22J016p80r05J709p7j955
$$ 865 -651 -512 565 -160 -679 660 410 -609 395 819 -1053 -131 885 105 -800 909 832 -1123
2887a123Q98J336j530o37J777l00j452J019Q44j672L34J531j286p04J527jj739
$$ -1123 -225 1111 -419 -1056 721 421 -1031 -12 832 -840 -506 1025 -261 -965 562 561 -1178
2904a178J099R62j431k38J715n09j596J605N52j766L75J484q83j242J650K33j378
$$ -1178 -79 883 -548 -786 929 420 -1176 429 981 -785 -410 1074 191 -1051 599 832 -546
2921e46M13J182j128r20J498k44j264J108N98j348k32K056r56j456J287N46j722
$$ -546 -133 1049 -79 -999 499 255 -1009 99 697 -651 -883 1173 217 -1239 48 594 -1128
2938a128N86J485r33r22J825j37j376J18J458j154p14J691p9j607R29R60j560
$$ -1128 -542 943 10 -912 913 776 -600 -482 976 -178 -892 799 720 -887 42 1002 -558
2955e58j66J623p98j163J400M4j136K44J684j453n56J382l51j428R64J613j579
$$ -558 -724 899 101 -1062 338 382 -754 -510 1174 -279 -835 547 196 -1232 -268 1345 -234
2972b34o84J867o74j231J113L90r14L87J038r88q27J048L39j274N96R80j568L5
$$ -234 -918 949 275 -956 157 547 -367 20 1058 70 -757 291 630 -644 -48 932 -636 -601
2990f01J258q27o17Q99on96n6J473j152k18P43J9r32N23K69o1n31R14k49n61K06
$$ -601 657 -170 -787 112 106 -490 -546 927 -225 -443 300 319 -613 -90 179 118 -413 501 252 -309 -103
3011a03M85j025N8J428j179kO88J2o71K27O82r98k61J151l61o61L92Q30q26n70
$$ -103 382 -643 -585 843 -336 -338 350 362 -309 -82 600 -398 -659 492 131 -530 -138 692 -134 -704
3031g04J535o18r27R73J3q97L34J000n61p28J056M8j557P25J392j181l01J176
$$ -704 831 213 -714 259 272 -625 -291 709 148 -580 476 524 -1033 -308 1084 -97 -398 778
3049G78o17j084J272N93j342m51J521j201j71J387l56q65P12K81j101N0J471q87
$$ 778 161 -923 349 942 -400 -851 670 -531 -702 685 329 -536 176 457 -644 -594 877 -10
3067a0q71J381J62j801J430M47j191k66J617k25k017J485N58j266M3J488j066
$$ -10 -881 500 662 -1139 291 738 -453 -719 898 673 -1344 141 699 -567 -524 964 -102
3084a02q39R86P80j607J10J800j239r97J626Pj231M89R20j234J19J047l44j006
$$ -102 -941 45 825 -782 -672 1128 -111 -1108 518 525 -706 -217 703 -531 -412 635 291 -715
3102g15J095J3p08j46Q25l80r85J352R5r99P34M89p45p52J376J21j357N79P49
$$ -715 380 393 -315 -461 364 -16 -1001 351 446 -553 181 670 -75 -827 549 670 -687 -108 641
3121F41j276k14J099j81j165J247M41q86j09Q45K48j152N00J06k39J22M88n28
$$ 641 -635 -849 250 69 -1096 151 592 -294 -403 442 690 -462 38 144 -95 27 515 -13
3139a3l51M94L52j035N29J098j533K52R39p87o16J042J71j164j19J401l61m70
$$ -13 -364 130 482 -553 -24 1074 -459 -207 732 -55 -671 371 542 -622 -741 660 299 -171
3157a71M08j79l56N78O49j213M26O24l22j129R72L57j379L67J181q46k28L16Q6
$$ -171 237 58 -298 280 929 -284 142 766 444 -685 287 644 -735 -368 813 -33 -261 55 141
3176A41o83J002k04l22j72N78q84k34J122L7j209J139K63p59k36R58r84lJ239
$$ 141 -542 460 256 -66 -238 340 -544 -778 344 381 -828 311 574 -185 -421 537 -447 -450 789
3195G89l87o34K63P64o73KK6l11p47J384r2j159N55J014j027m37J250j58q90K3
$$ 789 402 -232 31 795 122 124 150 -161 -908 476 384 -775 -220 794 -233 -670 580 422 -468 -445
3215d45J232m69j238J676k49r84K06R95q66n08Q35M74j267M99Q04r08M2J068m45
$$ -445 787 318 -920 756 507 -477 -271 724 -142 -650 185 659 -608 -109 695 -213 -171 897 452
3234D52j062R64K30r31J06P55n51l70J000j55j341Q42P55o44j100J890o48j014
$$ 452 -610 354 584 -347 -241 514 -37 -407 593 438 -903 -61 694 50 -1050 840 192 -822
3252h22J373l14n54j4N06o1n54N31J332k039M33M10l94r02J810j90j079N96O33
$$ -822 551 237 -317 -331 175 114 -440 91 1423 -616 -183 227 -167 -1069 741 551 -528 68 701
3271G01j385N73P05k96n48M65J81q12K07N23l6j061Q41J85r62Q41L13r69M28K89
$$ 701 -684 -111 594 298 -250 215 396 -416 -209 314 278 -783 58 243 -719 122 435 -534 -106 183
3291A83J96j116J221p18l7j38J006m67m49M23J65l53J44N75k24o42P28m5q37Q28
$$ 183 379 -737 484 -234 -271 -409 597 130 -319 104 269 -84 60 635 411 -231 497 452 -385 443
3311D43l42k48l46R90o03o09J079l62o15Q7J087k43p97R07k30q63O43J06K10k98
$$ 443 101 -147 -493 497 -106 -715 364 2 -613 -526 561 318 -479 428 198 -665 -22 84 294 -4
3331dQ89p73l15K31N24r74M03O53p26q2N48m33p72J087o5r70M95M91q57K56Q89
$$ -4 885 112 -203 28 552 -422 -19 634 -92 -174 374 -59 -831 256 191 -779 -284 207 -650 -394 495
3352D95j24l70j04O60p35R4P23m59m43M62j21m99K41K83j4k47J26K74m23o6O16
$$ 495 371 1 -103 557 -178 -84 639 180 -263 199 78 -421 -180 103 89 -158 -32 242 -181 -247 369
3373C69l83q17J323K59j257M77Q90o41j58P57l20p89j6Q95r21K73M13j47o39Q80
$$ 369 -14 -831 492 751 -506 -29 861 220 62 819 499 -290 -306 589 -332 -59 354 207 -432 448
3393D48K59j307O00P95j569M51Q96m16q01P13Q62j044m58J205n73q66J460K10
$$ 448 707 -600 0 795 -774 -323 573 157 -644 69 931 -113 -571 634 61 -805 655 865
3411H65j289J00J259r60p40J823j288o00R19L31q47K84J21j68m06J073P02j804
$$ 865 -424 -324 935 -25 -765 1058 -230 -830 89 420 -427 -143 -22 -190 -596 477 1179 -625
3429f25N28J028m98n38R5J89j056L41O69l33p4J302q50p3n57J53o95J057L13p73
$$ -625 -97 931 433 -105 -10 179 -877 -536 133 -200 -274 1028 178 105 -452 -299 -994 63 376 -397
3449c97K38N08k34k3m0L23n16j00N13O3r31R07N69r94p42J288M8k98p9o24K45
$$ -397 -159 349 115 92 52 375 -141 -241 272 335 -596 311 880 -114 -856 432 480 182 103 -521 -276
3470b76K67M53l23k99Q6K31L98l05O09q44r3K55n02j2P03L79j561P81M91O6p95
$$ -276 -9 444 121 -178 -92 139 537 232 841 -3 -96 159 -343 -355 348 727 -834 -53 438 504 -291
3491b91j70j83L24P96J18n54j48R51n41j012P76J50q36j4J296j058o1L05L50j111
$$ -291 -461 -644 -320 476 594 40 -108 843 302 -710 66 216 -620 -634 662 -396 -457 -152 198 -913
3511i13R26N36n20j217J763L86j118O92k58o57j51J477j653J05J331k28p83O05
$$ -913 13 549 29 -1188 575 961 -157 535 277 -380 -531 946 -707 -602 729 501 -282 323
3529C23k51j123P27J88K72m29n09P93k07j82P14n56M6O48k94J57K7P7k97j002
$$ 323 72 -1051 -324 -136 136 -293 -802 -9 -216 -398 316 -240 -194 454 160 317 344 421 124 -878
3549h78J771o94k46J64N9o52M17Q51j017k12J559n51p80N6O55k58m51P22k85J12
$$ -878 893 199 -47 117 176 -476 -59 792 -225 -437 1122 571 -209 -153 502 244 -207 515 230 342
3569C42n15M39j454P55P36o60M53k2J18l39p60J430j14p71O84n78J09n11J272
$$ 342 -173 266 -1188 -433 303 -357 96 74 192 -147 -907 523 409 -362 322 -256 -147 -658 614
3588F14m45m92N90p53K53P10l6j50j19Q9j66o84J196j200N59k20N41m65R3L48
$$ 614 169 -323 267 -486 -233 477 441 291 172 261 95 -589 607 -593 -34 -254 287 -178 -85 263
3608B63Q5j418J111M91R6o35K66O93j238K49N16K70j519Q29K09J58j45L14j262
$$ 263 348 -1070 41 532 628 -7 259 952 -286 -37 479 749 -770 59 268 426 281 595 -667
3627f67P10j9m14L29M99p85N26j30j040R85k74J12M7n4P0Q16j256N71L15k07j05
$$ -667 43 24 -390 -61 438 -347 179 49 -991 -6 -280 -168 -121 -175 -105 711 -545 26 341 134 29
3648B9O92o68j97N97r13J09K38K26j19l22J04Q17j500O63O33o37N58J91k97k53
$$ 29 721 53 -144 453 -460 -351 -113 113 -6 -328 -224 593 -907 -244 389 -248 310 501 204 -49
3668d9qQ79m67r36M66l84N10K97J22j102L69K1J69l2R75r39j35P19Q55j705P19
$$ -49 -57 822 355 -581 -115 -499 11 308 430 -672 -303 -282 -113 -145 830 -109 -244 475 1330 -375 344
3689C44n72k75L60P83l72n74N08M72r70j3M09l1R1o46Q74j036Q55n02Q57n56N17
$$ 344 -228 -503 -143 640 268 -306 202 674 -296 -309 100 69 160 -486 388 -648 207 -295 562 6 523
3710E23M00j458O62l5R6q96l11J465q10M50m33N08P79o78l29p12J556n22o49O69
$$ 523 923 -535 127 92 188 -708 -1019 446 -364 86 -347 161 940 262 -67 -779 777 255 -394 275
3730B75Mn75M69O14l86l98L58l05j72j228K243j358K18N23N76p34M6o5p60R79
$$ 275 279 -296 173 787 401 3 361 56 -116 -1344 899 -459 -241 282 858 124 170 105 -655 324
3750C24k4l20l05L02N49m19p21J527j043j45r6N92n94k62J212n05N5l3R1m60J33
$$ 324 300 -20 -325 -23 526 107 -614 913 -130 -275 -371 221 -373 -635 577 72 127 94 185 -275 -142
3771a42P64p29L45O38p69qP0O1j148Q62M25N0j082L46j73oJ59P53k75qJ75j79
$$ -142 622 -107 238 876 107 99 169 230 -918 -56 369 419 -663 -317 -490 -496 -337 416 141 133 308 129
3793A29o30l7J053n16n51J27O60r97J627p33o5o57P36m37O00M32l93l84o57R82
$$ 129 -501 -538 515 -1 -552 -425 235 -762 865 132 67 -590 146 -291 309 741 348 -36 -693 289
3813B89q44R54m51M17j74O49p01m48k86N01K48m43L74n05L58k18J40Q37p16L37
$$ 289 -555 399 -52 365 191 840 139 -309 -595 -94 154 -289 85 -420 -62 -280 -140 697 -19 318
3833C18l67l68Q99n28o80O07J027j125M33n2M92K27o02M18j02j023Q34o90j61
$$ 318 -49 -417 482 -46 -726 -119 908 -217 216 164 656 883 281 699 597 -426 408 -282 -443
3852d43l36P68j05N35m92m64l06J112O37p63o6j48m07J47O79k75l10J06K00p0
$$ -443 -779 -11 -116 419 -73 -537 -843 269 906 143 77 -71 -478 -331 348 73 -237 -131 69 -1
3872aJ52j75o27N63Q8j97L55m39O12k7j1j98J28j72p4J79k29k14Q40q61k44L30
$$ -1 151 -24 -651 -88 0 -197 158 -281 331 304 293 95 223 51 -23 156 -73 -287 553 -308 -552 -222
3894b22N98q69M7P65l88m69M43J32l02M9L82l42P1P47k64o05n1O70m51j97K75
$$ -222 376 -493 -446 319 -69 -538 -95 37 -265 -216 166 -176 -105 642 378 -227 -278 392 -59 -256 19
3915A9m02M30Q4K69o31K91L40m83q5N15k71j90L15K2o0j81N95m56m64L74J56k73
$$ 19 -383 47 131 400 -231 60 400 -83 -168 347 76 -114 201 223 163 -18 577 121 -343 31 187 -86
3937h6RM52n16k48O19k99k71L72M48o66K86P0K4l26M68j46j54J45k21J01m79L03
$$ -86 -77 375 -141 -389 230 -69 -340 32 480 -186 100 170 194 -132 336 190 36 181 -40 61 -418 -115
3959a15j58N7L03r7j34o6J83j55J9L44PJ13l16L01l84j65K71lK76m02J38r6P1
$$ -115 -273 -216 87 -10 -144 -210 -27 -182 -163 181 188 301 -15 286 -98 -263 8 5 281 -121 17 -79 -8
3982hN2o7j48K3M76l10j37K03j73o8j91O39n22L75M7M5p14P85j26J5J03k72l05
$$ -8 44 -23 -171 -148 328 18 -119 84 -89 -157 -348 291 -231 144 191 236 -478 307 181 196 299 27 -278
4005b78L00K44k55j11L66J18n34J11p3J98j04L65m14k91J29M94m18k1N75l23l84
$$ -278 22 266 11 -100 266 384 -150 -39 -112 86 -18 347 -67 -358 -229 265 -153 -174 401 78 -306
4026c06O08j33m84K84L53m46j5L95J88q63L28K98n98K63N29k42k58Q2M48l99O
$$ -306 302 169 -315 -31 322 -124 -139 256 444 -419 -91 207 -391 -128 401 159 -99 -17 431 32 38
4047C8l0j26n2N43j86k02r5P7j05k6L01l8p4j66L87l43k10N28k75k13L00Q1L4
$$ 38 8 -118 -170 373 187 -15 -110 -33 -138 -164 137 99 25 -141 246 -97 -307 221 -54 -267 33 114 148
4070A48l03L01j04j26R3K01j66j09N3R3L9o7j58j07J49k71LK11K27j41j98K07
$$ 148 -155 146 42 -84 9 210 44 -65 -12 81 120 53 -105 -212 -63 -334 -331 -120 107 -34 -232 -25
4092b5K52k49o9K27n3j93L22p2n78L98J85l81K42m5J29m32K49L54m58l3M15l03
$$ -25 227 -22 -91 136 83 -110 212 140 -438 -40 145 -236 6 -39 90 -342 -93 261 -197 -230 185 -118
4114a18j45N79l36m10O98m9m69J02K52J4l28M02j63j75R6or1N4K61l33K00K78
$$ -118 -263 316 -20 -430 268 219 -250 -148 104 118 -210 192 29 -146 -50 -56 -147 -93 168 -165 35 313
4136C13j77k46j0M91l66j35M25k20k92j8L58k93j59O49j27k68M83j63o73L02K03
$$ 313 136 -110 -120 371 5 -130 295 75 -217 -235 123 -170 -329 320 193 -75 408 245 -428 -126 77
4157G7r5K2R7j04k0j60K04j38J18K27l05M8J89j81k2J62P4l1o25L35J17P7j14
$$ 77 -18 4 101 -3 -23 -183 21 -117 1 228 -77 -29 160 -21 -43 119 193 162 -463 -128 -11 66 -48
4180d8J06k57L29q9k7m7m1L59k30k19J49J30o79Q45K7l35j3K52j7l69K76K19m03
$$ -48 58 -199 130 41 14 -33 -74 285 55 -164 -15 115 -564 281 308 -27 -40 212 195 -174 102 321 -82
4203h2K1K11k59r1K20K3k50K69N17o69j46J89P8j94K27l8l47K20J03l6m3N11n52
$$ -82 -61 150 -109 -200 20 43 -207 62 579 -90 -236 -47 31 -163 64 26 -321 -101 2 -34 -77 434 -118
4226a18l51K57L60k8l70M31l2n9j26K08l42J8L36j23q2L81k48k27P2K72j84k48
$$ -118 -469 -212 148 120 -250 181 149 90 -36 172 -170 -152 184 61 -21 360 112 -115 -43 229 45 -203
4248b03M15M9l67J50L94n25J86k7R7l84K35J64k22m6J15J1Rj29r7K08j20L7n8
$$ -203 212 261 -106 44 438 -87 99 72 169 -215 20 184 -38 -84 31 42 51 -78 -175 33 -87 -50 -108
4271a08P7J19j14p9J17K8P5l23N9J30j80L47L21m74R7J19n55JK63K45l71K83K25
$$ -108 -31 88 -26 -105 12 40 115 -208 -149 -19 -199 148 469 -5 92 211 -344 -343 -80 165 -206 77 302
4294C02j67j63J73k18K54J21m28J06L20l33R7nL5j13J89qk25j23Q7K36k35K79
$$ 302 135 -28 145 -73 181 302 -126 -20 300 -33 64 59 94 -19 170 162 -63 -186 -99 137 -98 181
4316A81N4j45l5J48j94L9J82J86j00o94L74M8n01M24J53l04m15L68O23q94L67
$$ 181 235 90 55 203 9 48 230 416 316 -378 -4 44 -457 -33 120 -184 -599 -231 392 -502 -135
4337a35M44n98J41j16J55O9M6q2o4K00mo6o40P61Q9o26L67J95l16Ln5J02j67k
$$ -135 309 -289 -148 -264 -109 -40 6 -76 -140 60 56 -10 -650 111 200 -426 -59 136 -180 -177 -232 -130 -297 -299
4361b99M34k43O64k93M1k90k58Q15r27N09j90L2J89J07j3n54L86K14k21k88j03
$$ -299 135 -108 556 263 304 14 -244 571 -356 153 -37 -5 184 291 278 -276 110 324 103 -185 -288
4382b88L73J64J47l03r3j40L59k15j8j66K22k20l46R37k53qO9J06m17j89R80o86
$$ -288 85 249 396 93 0 -140 219 4 -14 -180 42 -178 -524 413 160 152 221 327 -90 -279 701 15
4404A5M8L38k77q34J140j100j31Q14j98N71k74L88n11r6J83m11n86N91N58K06
$$ 15 63 401 124 -710 430 -670 -801 13 -185 386 112 500 -11 -107 76 -335 -921 -330 228 434
4424D34j047P44n7M87p94M42l13j07K64Qo70O77L62ql37k02K7O4L98l28j0K79
$$ 434 -613 131 74 561 -233 209 -104 -211 53 61 -609 68 430 422 85 -117 -90 -26 372 44 34 313
4446C13r8K00l21l29N32j68j0l29M12K68q05L26J61l55K24j05J3P41p62j15o8
$$ 313 215 415 94 -235 297 129 119 -210 202 470 -335 -9 152 -203 21 -84 -71 670 -92 -207 -275
4467b75L80j07P2m45N06m89N74n13N4J93k44P71l87l04L14j09p6j37K23M2j18
$$ -275 105 -2 70 -375 131 -358 216 -297 -243 -50 -294 477 90 -214 100 -9 -85 -222 1 43 -75
4488g5J5l77J109l49m51J15N06n13m26J281m72m12M03l27N19K73o16m02P24j2
$$ -75 -60 -437 672 323 -128 -13 493 -20 -446 835 363 -49 354 27 546 819 203 -199 525 513
4508E13o48l00N82J3n09Q55j152J018r47O24k23J20l31P58n49j08R52j026j86
$$ 513 -135 -435 147 160 -349 506 -646 372 -575 49 -174 -54 -385 373 -176 -284 668 -358 -544
4527e44Q96o54m6M8N93J80n12M52p36j6P10m11J162j509O33L46j262j51J472k01
$$ -544 352 -302 -348 -300 293 473 -39 413 -323 -339 371 -40 1122 -387 246 592 -670 -821 651 450
4547D50KL2p4r48l03P94N96j29l64q27L17N22l21M69K4l57j2k8m04L95J26N7M41
$$ 450 452 484 410 -538 -841 -47 549 420 56 -771 -454 68 -253 216 240 -117 -129 -157 -561 -166 -40 17 458
4570D58o04k14Q14j031K20M18Q67o09j063O70J02J47N7l87O0N7L94K69l85o09
$$ 458 -146 -360 454 -577 -357 61 928 319 -744 -74 28 175 232 -155 -95 -38 356 625 240 -369
4590c69M08m08P80N73p91J6l31m7R8O6K49m27O6K20k24P7O54q90n10R34j64k18
$$ -369 39 -369 411 984 193 209 -122 -169 -71 -5 244 -183 -117 103 -121 -44 610 -280 -790 144 -20 -238
4612b38K69K11J23m11n54L99P73q95O32j56n69K43O63p43J74Q66p72o73Q12j06
$$ -238 31 242 365 -46 -600 -201 572 -323 309 153 -416 -173 490 -253 -79 787 15 -658 154 48
4632D8J0J86o51P65n29M37j83j81o45O20n98J395j79o70o4O72m58J9N53n3l81
$$ 48 58 244 -407 358 -171 266 83 -98 -743 -123 -721 674 495 -175 -239 433 -25 -6 547 494 113
4653A13q34K42Q51o63R96n26l51L60J61J22r8p10L50O05o44P2j71N79r2n24N31
$$ 113 -721 -479 372 -291 705 179 -172 188 349 471 373 -337 13 618 -26 46 -125 454 362 -162 369
4674C69k15L5o24K60J89j56J06N56k99M07r17j42J165m51n76J19L98k45L63j91
$$ 369 154 189 -435 -175 14 -142 -36 520 221 628 -289 -431 734 283 -293 -174 224 -21 342 151
4694A51J88m55l91P20o04L95k8L6N27q84M5J45J34q0l5L31m46N6J5o1N19p17O86
$$ 151 339 -116 -507 213 -391 4 -24 12 539 -345 -300 -155 -21 -101 -136 195 -251 -195 -180 -241 278 -439 247
4717B47m62J74K04p87J394o07l33L21J91l69j85o1O32k81l36K67L12M1l16R99
$$ 247 -215 -41 163 -624 770 163 -170 151 342 -27 -212 -273 359 78 -258 9 321 362 46 1045
4737A045j028m7K11J79J04m49J28P10j285M56M13n73J5M37J1l41l06L21oL9l33
$$ 1045 17 -30 181 360 464 15 143 853 -432 24 437 -136 -121 316 327 -14 -320 1 -5 34 -299
4758b99L03o6J162r52l7k19l11M01K13M24m02j08M8n65J75L0j47K0J93J90l43
$$ -299 4 -62 1100 148 111 -108 -419 -18 195 619 217 109 157 -408 -233 -203 -350 -330 -137 53 -290
4779b90N65N9j50m69K10M54q8N03k32p97L87p25L05L21q6mJ3l47L79m82M83m6
$$ -290 275 334 184 -285 -75 379 291 794 562 -235 152 -573 -268 53 -33 -37 -24 -371 8 -474 9 -37
4801c7J36l22J5N34O0n77M4J92p74M10R3K62J33l40J13M43k26k60M59k79O29q57
$$ -37 99 -223 -208 326 386 -191 -147 45 -729 -319 -226 36 169 -171 -58 385 159 -101 358 79 708 -149
4823a49q5K46m90J32M69j52j25R43q68L38o18L05M51l32K53pk53p34J108n61p6
$$ -149 -234 12 -478 -346 123 -29 -154 789 -79 259 -359 -54 397 65 318 311 58 -676 432 -129 -205
4844b05L55L09m71K65L56p87K29K77K7q72O73L64j61p41Q23j96p81Q36Q3k55m35
$$ -205 150 459 -12 253 609 -178 51 328 355 -517 156 520 359 -382 441 245 -536 300 383 128 -307
4865c07L07L78m79mk3J24M4J75j66j56J93M07k55o37K52m06O73k91Q61p23m85
$$ -307 0 378 -101 -105 -128 -4 40 215 49 -107 86 493 238 -399 -147 -553 120 -171 690 -33 -518
4886e18P93q93P95O5K98o8j78m65j45K52O66q37J19N66o13O67l31j00R3J06k67
$$ -518 275 -618 177 242 540 472 294 -171 -316 -64 602 -235 -116 450 -163 504 173 73 166 272 5
4907Eq3j33M76o5o88K38M2L86q09R10k23j84n41O07K53k26K4j61N38n98o6j81
$$ 5 -78 -211 265 200 -488 -250 -208 178 -631 279 56 -128 -669 -62 191 -35 -11 -172 366 -232 -298 -479
4929d79N67O60p99m55M88J1M36m13j29J74m14N61r3m60m93J263m68k29M75j18
$$ -479 88 748 -51 -506 -18 -7 429 16 -113 61 -353 208 115 -345 -838 425 -43 -272 203 85
4949H5o0l16K76j82J07m08M01N20o83J93j06K19l12l3L81j88O4J15L87q92P7Q21
$$ 85 25 -291 -15 -197 -90 -498 -97 423 -260 -67 -173 46 -266 -299 82 -106 -42 73 460 -432 -355 466
4971D66o14J30J51k31o7l41J054n65r4P06l66p42R03q76K6J056j289J87O42n38
$$ 466 -148 -18 133 -98 -165 -506 548 -17 -111 595 229 -513 390 -486 -460 596 -693 -506 136 -402
4991d02J267j816O31n78P16Q17r79J392j069q1M0M56q72P60m97J26m01O21l35
$$ -402 865 -951 -320 -898 -182 635 -344 1048 -21 -102 -62 394 -478 282 -215 -89 -490 131 -204
5010b04r2L14r3K1l03J306o83l52N54K63q75j77L15j49J04Q7O3k13P6K27l26k23
$$ -204 -296 18 -75 -54 -357 949 266 -86 468 731 -144 -321 -6 -155 -51 36 99 -114 -38 189 -137 -360
5032c60R49M5q72L78O84j210O75k36j55N06N30j354J095q40j78L67l50P48m62
$$ -360 589 634 -238 140 824 -386 289 53 -102 404 934 -420 675 -165 -343 24 -326 422 -40
5051d0O42L5o67j087J254l1l22m30R20N36r77K09n7M49j444J488R5j401L38o0
$$ -40 602 637 -30 -1117 137 106 -216 -646 274 810 -167 42 -15 434 -1010 478 573 -828 -490 -550
5071e50j38P10K60q27N43P33j210Kn40J412r39O26j02J69j24m4M41n47n0N5O09
$$ -550 -688 22 282 -545 -2 731 -479 -477 -1017 395 -544 82 -20 149 25 -19 422 -125 -175 -120 489
5092D89P9r63M06k64k50J002j488R88K36l96p13P91n8j23M59o38R01o59O6K06
$$ 489 568 -395 11 -253 -503 499 -989 -1 235 -161 -874 -83 -141 -264 195 -443 458 -201 -135 71
5112G1M90l58K11n64n4K70p55O85m50O55j08n26Q94o41Q0O57o16K35p7K72p20
$$ 71 561 203 414 -150 -204 66 -689 -4 -454 201 93 -433 461 -180 -100 557 -59 176 99 371 -349
5133c49Q66K13o14k74k02K20N93o93l43j11K2R34K50K40q32L7N47j774J736k93
$$ -349 517 730 116 -158 -360 -140 453 -240 -583 -694 -672 262 512 752 -80 -43 504 -1270 466 173
5153A73k5m19J08o44R46k64R65o67j11P85j820J063O12r72L06J51J12o36l09M49
$$ 173 148 -271 -163 -807 139 -125 840 173 62 847 -973 90 702 -270 36 187 299 -337 -646 -197
5173a97K09K32q01J187p75L73l2L44j235Q53j4p21J420o88n02O68J98m81k06O87
$$ -197 12 244 -557 630 -145 228 196 540 -695 158 144 -577 843 155 -347 321 519 38 -168 519
5193E19k83q6m78N64L69l96j08O5n00l4P04L41p35L99l29l18O16m08o8L46j3k31
$$ 519 236 150 -328 236 605 209 101 166 -334 -368 336 677 -58 341 12 -306 310 -98 -166 180 167 -64
5215f4J8L4O63k56r50N01j19J78N84m5o46Ol26L24l05O12P90j222l18M08k70J47
$$ -64 -46 -12 651 395 -555 -54 -173 5 589 544 -102 -96 -422 -98 -403 209 999 -223 -541 -133 -403 -256
5237b56J217l74q53J019k60o16N26m34N80l61l10M70j44j64L15l99K89K06l66
$$ -256 961 587 -266 753 493 -123 403 -31 549 188 -122 348 204 40 355 -44 245 451 85
5256H5K38m90N60o12L28m65Q72J52r62L70m15K58N97l99m73Q83k42n27P83j107
$$ 85 323 -167 393 -219 109 -356 516 668 -294 76 -339 -81 516 117 -356 527 285 -242 541 -566
5276e66K08K57L85l25L23j02rl46J84M30k76J28m85L3K39MJ12K97l6j104J43M6
$$ -566 -358 -101 284 -41 282 180 171 -175 9 439 163 291 -194 -161 78 82 194 491 455 -649 -506 -460
5298d60J46L1L49M52m88n7k8k79M4K01m51N68M77o01O99q75j98O51k38J84l24
$$ -460 -314 -283 66 518 30 -27 -55 -334 -290 -89 -540 28 505 -96 603 -272 -470 181 -57 127 -197
5319a97N58o30m32Q46Q3k85J89l2j64L14l29k43K83k3K99k52K4M38p02J48j55
$$ -197 361 -269 -701 145 228 -57 132 100 -64 250 -79 -322 -39 -62 237 -15 9 447 -255 -107 -262
5340b62O14m88p5O51p39K4N87o75M8L04P7O6J13rk54j7K44l63k80J23J14n79O83
$$ -262 352 -136 -211 440 -299 -275 312 -363 -315 -11 66 132 245 236 -18 -35 209 -154 -434 -311 -197 -776 -93
5363i3K89n67L65J05P8p73J088l68k02%L76q8k95K01q0k98N09K86j037L94N86
$$ -93 196 -371 -6 99 177 -596 492 124 -78 -78 298 210 -85 116 36 -262 247 533 -504 -110 476
5384D76m27M1L75l62K14l97L34M10q95J6k00N89K46m75o8N5J87j63K48o2l3K58
$$ 476 49 90 465 103 317 -80 254 664 -231 -215 -415 174 420 -55 -123 -68 119 -44 204 142 109 367
5406C67l57lL06n68q3M57k03L10l97K6k2K43j29m05L70j96N39L12p78L8l79M26
$$ 367 10 7 313 -255 -338 119 -84 226 -171 -145 -167 76 -53 -458 -88 -284 255 567 -211 -173 -552 -126
5428a26L73l46j43J29M75k53M28l60j54O4j07Mj19M06r0k45l52O00K51m87P9k90
$$ -126 247 -99 -242 -113 362 109 537 177 23 87 -20 -16 -135 271 181 -64 -416 184 435 -52 27 -263
5450b63K64k12k8L6R8Lj13k48N60J77n69k8P3r3j60N80K23m82m65K68O01n13M31
$$ -263 1 -211 -239 -203 -105 -102 -215 -463 97 274 -295 -323 -250 -343 -503 77 300 -182 -647 -379 222 -291 140
5473A40k1P8k32K36j56m34N58j54j36O06k60J46o75P4M05q67R82n23K31J61o4
$$ 140 119 197 -35 201 45 -389 169 15 -121 485 225 371 -304 -230 175 -692 290 -233 -2 159 95
5494I5K00nn47R0R7J95J98o84J94M94k00J16j88k20o2L75k95k8Q9J76m97L36k15
$$ 95 295 290 -257 -167 -70 125 323 -361 -167 327 127 243 55 -165 -227 148 -147 -175 -86 90 -407 -71 -286
5517b86M02J89m46N9M18p79O13k60K33nl6j00P3k2o1P5L98k74o02J025q81N30
$$ -286 116 305 -141 -82 336 -443 170 -90 143 138 102 2 75 53 -8 67 465 191 -411 614 -267 263
5539B63j15j96qj99J46K33n16r8O17j3p92L05P08k97p5J16j6q0O34k90n66M13
$$ 263 148 -48 -56 -255 -109 124 -392 -490 127 114 -678 -373 335 38 -37 79 63 -17 617 327 -239 174
5561A74l51j30R9J23l19K28q9N42l99j10J71j24J80l28N38n53p9L80J38N3j67
$$ 174 -177 -307 -208 -85 -404 -176 -265 277 -122 -232 -61 -185 -5 -333 205 -348 -427 -47 91 144 -23
5582b3L10n78o9L27L09J45q25K34L97j3o16K99j19P24o59O11q94R06k86j28M5
$$ -23 287 -291 -360 -33 276 421 -404 -170 227 214 -402 -103 -222 502 -157 454 -440 466 180 52 97
5603I7J26m22j64P30l95K79j41J10l15R84q01k27N64J25O6j278l3N48K71M11j052
$$ 97 223 -199 -363 367 -28 251 110 220 -95 889 88 -139 425 550 616 -662 -695 -147 124 535 -517
5624e17Q8J278j229N97j91K90Q2j248R82l52O6K12o7M52p56J115J13j493O55J22
$$ -517 -429 849 -380 217 26 316 398 -850 132 -220 -154 58 -9 443 -313 802 915 -578 77 199
5644A99j105N72N42k07J33j7k6Q56k83k08j177Q10O39k52l60o7k76L07k48J29
$$ 199 -906 -334 208 1 134 117 91 947 664 456 -721 89 728 476 116 49 -227 80 -168 -39
5664c9j56P67J28l39m0j5P28o04J13l66n9K26q07L12j90j48J116k66o19N39l10
$$ -39 -195 572 700 361 321 306 1034 430 543 177 118 344 -463 -151 -341 -489 627 361 -258 281 -29
5685b9O20j142K59J229j233J14l11L5j54J611m58q55M91q97J338k58o14M21K92
$$ -29 591 -551 -292 937 -296 -182 -493 -458 -612 999 541 -314 177 -720 618 360 -254 167 459
5704D59k11j5l60L08m32K35j4N08o72J228r63o59J44J188n73N28l74j47l81k03
$$ 459 248 233 -127 181 -251 -16 -30 478 -194 1034 71 -588 -444 744 171 699 325 178 -203 -406
5724d06q4L22K33j45L52l05M40m79J073j047o63R19l45K14q0p1o59J124j07m85
$$ -406 -490 -168 65 -80 272 -33 407 -72 1001 -46 -709 210 -135 79 -1 -72 -731 393 286 -199
5744a99K59p0N00k29m80Q91p21L32k80P4K23J46o62P75j82r64K39m00Q64J11k85
$$ -199 60 -10 490 261 -219 672 -49 283 3 77 300 446 -216 559 377 -587 -348 -748 116 227 -58
5765e8M79k95m23O67l14j61O85J92j127M20J27k23m37N74Q9p01L02L16J55r8m99
$$ -58 421 126 -297 370 56 -105 580 772 -355 65 192 -31 -468 106 195 -506 -204 112 267 169 -330
5786c30N11m99N49Q1q10K10K02M02P2o70N56k71O07n16k46J14k73O3M71n23Q26
$$ -330 181 -318 231 312 -498 -288 -86 316 388 -282 274 3 610 94 -152 -38 -311 -248 223 -300 526
5807E26j31q22O34O82M7j143j32L30R8L76o94q21J06P15L66l22n4L05j82J40q92
$$ 526 395 -427 207 889 936 -207 -339 -9 89 465 -229 -1050 -944 -229 137 -185 -239 66 -116 24 -868
5828h68J425j007K56j9Q09j387Q57M4P7M45j00q30L89j30K69k6J52p56qO40O52
$$ -868 557 -450 -194 -213 596 -791 66 110 187 632 532 -298 91 -39 230 204 356 -400 -408 232 884
5849H84l88o52J49J87Q9K62k21p42K58R10p32l03P44j48q29q5J53k46k8M08K53
$$ 884 496 -156 -7 180 269 531 310 -432 -174 736 4 -299 445 297 -532 -617 -464 -710 -738 -330 -77
5870g7L96j54m37o1L05J09l13O7L75p4J072j710Q52m12l52O45k93L41L4kq71K98
$$ -77 319 165 -272 -333 -28 81 -232 -165 210 136 1208 -502 350 -62 -414 231 -62 279 313 311 -560 -262
5892b62q5j4J86QN34m67P81o28P81j373L84l66L76J32q56J488o09l04O39k75p42
$$ -262 -347 -361 -175 -167 367 -100 681 53 834 -539 -155 -521 -145 -13 -869 619 10 -294 345 70 -672
5913f72R03k41K99k16pM56q74J76J8p0J028m83p72p8K81K71J13j84L79n30J595
$$ -672 231 -10 289 73 66 522 -352 -176 -158 -228 800 317 -455 -533 -252 19 132 -52 327 -203 1392
5934A392j670P24r9l2j68k99J11lm2N01k69Km4k91M89p2J1l17l83Q2O10K70n75
$$ 1392 -278 446 347 315 147 -152 -41 -44 -86 415 146 148 104 -187 302 230 241 -76 -459 -377 233 503 -72
5957g2O74p16P36L2j038K78k4R6K06m19m27M39pR7J60Q98r45N00p40Q64l01n19
$$ -72 602 -114 622 654 -384 -106 -130 -34 172 -247 -674 -235 -242 -145 15 913 -32 468 -272 592 291 -228
5979b28k5j62M47m71K55J00l04O95K99k15k87n18O94j39n67N94K66R7p96R8o06
$$ -228 -253 -415 32 -439 -184 -84 -388 307 606 391 104 -414 280 141 -426 168 434 531 -265 -167 -773
6000g73R09l11J69j21J47N90j227O95l97L46p27o60J744R5r6m43Q7P84q36j80
$$ -773 136 -175 -6 -127 20 610 -617 78 -319 27 -700 -1360 384 479 383 -60 27 811 -25 -205
6020b05O95k69k87J09K15r36O28j26K8N07p74P12p42L16J5j49j00K23o8O48k09
$$ -205 490 221 -66 43 258 -678 -50 -176 -148 359 -415 297 -445 -129 -114 -263 -363 -140 -208 440 231
6041B31p78J186q82K97Q4p09M38p1L56J80o94o18J090M90L3o69l57L98j75O95
$$ 231 -547 639 -243 54 138 -571 -133 -204 152 332 -362 -980 110 600 633 -36 -393 5 -170 525
6061E25n03k58M76j71J71m21Q6q16O03K80J9J11l38k06N51j3L50l29N37n94l12
$$ 525 22 -236 240 69 240 -181 -95 -911 -308 -28 -9 102 -236 -442 109 96 446 117 654 60 -252
6082b52P30o37O58k40l46J39m8M28k78L69L7m77J51O42o30q06J47O76o59L27O6
$$ -252 478 -159 499 259 -87 52 4 432 154 523 560 83 234 876 246 -560 -413 263 -396 -69 -3
6103cr7Q25n04o11k31M68N08m73J47P22q01m94J205k74n69M06M3K88q87K32L07
$$ -3 -100 725 221 -390 -621 -153 355 -118 29 751 -50 -544 661 387 -182 224 267 555 -332 -100 207
6124B07Q2k30M13j15j410P78l8K0J77L03r33K67J307m39J3l46j84P2Oj71J83J98
$$ 207 289 59 472 357 -1053 -275 -313 -293 -116 187 -746 -479 828 389 402 56 -128 -56 -50 -221 -38 160
6146A60j49M15j81l40q0K18O43o79L26o13J30K26j73k32K80M05L6m15q0k02m7
$$ 160 11 426 245 -95 -175 43 686 7 333 -280 -150 76 -97 -329 -49 356 392 -23 -103 -305 -352
6167c52M01L2k74o9N83p16P94J43m97J63K39K37r51K54N41r58J066o12L68J93
$$ -352 49 81 -193 -262 321 -395 399 542 45 208 447 684 -267 -13 528 -430 636 24 392 585
6187E85p07k9J045j319M95p2J22m4o3J19j61o2k62J250R6m44j46k33k77lr16J475
$$ 585 -122 -151 894 -425 70 -2 120 76 13 132 -29 -91 -353 897 993 549 403 170 -107 -110 -1026 449
6209D49m82o82P54M47l62M88Qn51j87M32o22N02K25J16k85l55N8J5j87K97L17
$$ 449 -33 -715 39 486 124 612 620 69 -118 314 -308 194 419 535 250 -105 -47 -32 -219 78 395
6230C95j03m26J73L66l54R8l67L33l78P26r22J040j79p40L75j9L6k41O88q2l4
$$ 395 292 -134 39 405 51 149 -218 115 -263 463 -459 581 402 -338 37 18 54 -187 501 419 385
6251C85p62K24K42m7M6j6k86j79N95j46l83K33Q3L34n62M51n30N21l97N46J12
$$ 385 -377 -153 89 42 88 72 -214 -393 202 56 -327 -94 -11 323 -239 212 -318 203 -194 352 464
6272D64O8n40q5J1l6N33l81l14K64o76L15P38n67k54N69j02L03l40q7J98l9O7
$$ 464 532 -8 -93 -82 -118 415 34 -280 -16 -692 -377 361 -206 -460 109 7 310 -30 -117 81 42 109
6294A09k19l25L35K20K55q25O58K23m84n48L40L73j85M78o28J1M71K54j107M42
$$ 109 -110 -435 -100 120 375 -450 208 431 -53 -601 -261 112 -73 405 -223 -212 259 513 -594 -152
6314a52R66l87l86N09l09p45P93j12q20Q34j14n6J49j59N58l15l65L84j21m6l83
$$ -152 814 427 41 550 241 -504 289 177 -643 191 77 21 170 11 569 254 -111 273 152 106 -277
6335b77J31L5L0M86k67j96N36l72N3M55r22Q6k7K54L7Q6L88k80l2k87K74K36l21
$$ -277 -146 -111 -81 405 138 -58 478 106 159 614 -308 -222 -249 5 42 128 516 236 204 -83 191 427 106
6358A06j13KK07k56K34L39n32m84O80j10L16o9j252N52O41J22m25L84o69K21K92
$$ 106 -7 -5 202 -54 180 519 -13 -497 183 73 389 320 -932 -380 261 383 -42 342 -327 -106 186
6379A86M06m53l65N68j39K29K42n33K00o09L38J62m80K26K63j26m36N75j02K66
$$ 186 592 139 -226 342 203 432 674 141 341 -268 70 232 -248 -22 241 115 -321 254 152 418
6399D18m37P08m73J5m18L11Q1l85K33P6l68K54L09l35K92k21J51qn97P41j83k
$$ 418 -19 689 216 231 -187 124 205 -180 53 129 -239 15 324 -11 281 60 211 203 -394 347 164 162
6421A62k92K15l82R9O81l36J28m44J43J82j25L74q89P42q4l98M34n80M94L9k47
$$ 162 -130 85 -297 -198 483 147 275 -169 -26 156 31 405 -484 258 174 -224 210 -370 124 163 -84
6442h4k53N01m15Lj64Q65m12m72L05R4L33l6r13Q62J08O9l63J63l7J32q3r5J27
$$ -84 -337 164 -251 -248 -412 453 41 -431 -126 -32 301 265 -648 214 322 391 28 191 154 286 203 108 235
6465B35J68m71P0N37j029M79K02l82K79M3p4J34M34m68j21m64N84l27M62J23j72
$$ 235 403 -68 2 539 -490 -11 191 -191 88 131 57 191 625 157 36 -428 156 -171 291 414 242
6486B42p26L5Q76o63L03k69R73r31J71j43P5P7L34m34K38k45j30l43Q36lj70k43
$$ 242 -484 -449 427 -236 67 -202 771 -160 11 -132 -57 20 354 -80 158 -87 -217 -560 276 273 103 -140
6508a40M73p71O7N37P9J9o32L49L60P29j065m95O69O08j052J107n45n67j31O19
$$ -140 333 -438 -371 166 245 264 -368 -19 341 1070 5 -490 179 787 -265 842 297 -270 -401 218
6528B18j56K82m80Q7L76O1J7l93q8M36J4j24n13P84l14l9o51O55l14N7L25K9j32
$$ 218 62 344 -136 -49 327 388 405 12 -76 360 374 250 -263 521 207 168 -483 172 -142 -85 240 269 137
6551A37k53M17n88j88P57j16k13o6N21o78j1O08n40J66L77k69o66R12Pk47M4r9
$$ 137 -116 301 -287 -475 282 166 -47 -113 408 -270 -281 327 -213 -47 330 61 -605 307 314 67 111 12
6573A2m01Q41m19J34o74M56p4l29m32J083l25M53n1j3P0J24l19j04l25M94k86
$$ 12 -389 452 33 167 -507 -51 -125 -454 -886 197 -128 325 274 261 331 455 136 32 -293 201 -85
6594h5K21l0m92L54M51p05L63P6m86L7P56n20l83L64m99L64L19j26L19j22j91
$$ -85 136 106 -386 -32 419 -286 77 153 -333 -296 460 -60 -443 -79 -578 -214 105 -21 298 176 -15
6615a5p0R0O8K26l27M72m83o40J200K56r67M38n64N43M58q35M95J20o76M12K12
$$ -15 -85 5 73 299 -28 444 -39 -679 521 777 -190 248 -316 227 685 -150 345 465 -211 201 413
6636D13m5l94K33q7k36j75L46J08p9j89J6R7Q1k59l87L10m1R36o09k83P2N15l51
$$ 413 368 -26 207 120 -116 -291 55 163 84 -105 -89 8 89 -170 -557 -247 -288 648 39 -244 -172 343 -8
6659hl8n43N04M2K79l68O4M58o58K08o24J017j78p1M24l79m93L74N94m55j11L95
$$ -8 -46 -589 -85 -43 236 -132 -68 390 -268 -60 -684 333 155 84 508 129 -364 10 604 149 38 433
6681D33q51J96L51n06J84N64n88n6N90L5j34k44J8k10J021j232K38J85J85m6N5
$$ 433 -418 -222 129 -377 -193 371 -217 -273 317 352 218 -26 -8 -218 803 -429 -191 -6 179 133 188
6702A88M00r33L75N05q99N45J65J6m15l46M12m29J524r26o27M72j59M12k60J17
$$ 188 588 -345 30 535 -364 181 346 362 -53 -399 13 -416 1108 182 -445 27 -132 280 20 137
6722A37K04M13o74l40P28m04p57Q91j16L91L54j054J17J37M85j54m07k01M25J79
$$ 137 341 754 80 -260 468 64 -693 198 82 473 827 -227 -110 27 512 358 -49 -250 175 354
6742C54m70k67P55l54m47O56k0n44K9Q58j33k32K63l71J18J47j143M14N84k30
$$ 354 -116 -383 372 18 -429 227 207 -337 -308 550 417 185 448 77 195 342 -801 -387 197 -33
6762c3o21J288N71j858P82j02r12O67J7k96O6J117j062M74P51Q2q28mQ2o5J37
$$ -33 -654 634 1205 -653 129 27 -885 -218 -201 -497 -431 686 -376 98 849 931 103 99 181 116 253
6783B53L3j045P10J49o09P05L5p76Q53l28M80K14m31j72p56Q23N27n21q8J49K78
$$ 253 286 -759 -49 100 -509 196 231 -545 308 -20 460 674 243 71 -685 138 665 144 56 205 483
6804D83k91o59M06P80o82o43P96l09J36k44O54k20k69o2L31j023Q81p03N66J50
$$ 483 192 -467 -61 719 37 -606 190 -119 17 -227 427 207 -62 -124 207 -816 65 -638 -72 78
6824G8N40r47L93p26J441j210M21K56L5j69l24O48p62Q0K47j70J40L7oj92j73
$$ 78 618 -329 64 -662 779 -431 -10 246 281 112 -212 436 -326 -246 1 -169 -29 8 2 -190 -363
6845c63J05j15P39L09R4m17m53l6n02N01M7J72L33k31j94l35J53L61j05m0k72
$$ -363 -258 -373 366 675 769 352 -101 -137 -639 -138 -91 81 414 183 -11 -346 -193 168 63 23 -249
6866b49J04n1P73r61K52n8N01n95R5O09k80l2L70o2n33n8K25k79J59K54Q8p9r06
$$ -249 -145 -196 577 -384 -132 -190 311 -284 -189 420 140 108 478 416 -117 -175 50 -229 -70 184 272 193 -713
6889g13N23m3J39m04P53k46Q2j46m3J19J17K16r44K01M03K55q32P80j18K31k33
$$ -713 -190 -233 -94 -498 255 9 91 -55 -98 21 138 354 -590 -389 14 269 -563 217 99 330 97
6910I7o14K62J10Q07o33j62J65M98m67k85K67J83L40k22j10J27L09j21j55j82
$$ 97 -517 -255 -145 662 29 -133 32 530 63 -222 45 228 568 346 236 363 672 551 396 214
6930B14K15K8p72n2J67M65k0J65R1j03k00k00J06K27m24J19N4M02l73Q19N1m91
$$ 214 429 457 -315 -367 -200 265 245 410 501 398 198 -2 104 331 -93 26 80 482 109 928 979 488
6952D88j421J380q95J10Q34k35r44Q62j87L50m56p96O70K79M9j14J20j68L02R82
$$ 488 -933 447 -448 -338 496 261 -683 179 -8 342 -114 -910 -240 39 88 -26 94 -74 228 1210
6972A210j088Q65j561J264k70j012K086j020l82lk23M21K77J43o05k61j11j69
$$ 1210 122 987 -574 690 420 -592 1494 474 92 89 -134 287 564 707 102 -159 -270 -439
6990d39J58r5J119j185O47M75n19j61J29N6M25l20n48Q8Q29M17j099p75J548p36
$$ -439 -281 -376 743 -442 205 680 161 0 129 185 610 290 -258 -170 659 1076 -23 -798 750 14
7010A4m93K09J92N72j521J297j11M95j373J603j092j05N4N15j50O1J02p55O00
$$ 14 -479 -270 -78 494 -1027 270 159 654 -719 884 -208 -313 -259 256 106 167 269 -486 114
7029A14K83r4j194Q85o7J199r04n7O78j126M75L30j165k1J743j446J067m15q63
$$ 114 397 303 -891 -6 -73 1126 222 165 843 -283 192 522 -643 -664 1079 -367 700 285 -578
7048e78K74M15O58n00j40J96l81M91l35l59J30q42J110j28M05J18j527P38J41
$$ -578 -304 111 769 269 129 325 -56 435 100 -259 -129 -971 139 11 416 534 -993 -255 -114
7067a14N70j64o85P89j214J229L50m43n07K68l12R8p4l80J542j010j49O17p89
$$ -114 456 292 -393 396 -818 411 761 318 -189 79 -233 -135 -209 -589 953 -57 -206 411 -378
7086c78j84K02J39K91N99r27J489j025n08P40L21j02o95j02L03K98m80o2K35K32
$$ -378 -562 -360 -221 70 669 -258 1231 206 -302 438 759 657 -38 -140 163 461 -19 -81 154 386
7106C86p41n2M44L83j48o7J81o99K7J40M6J042o44J14p79J91N81k48o16K85K16
$$ 386 -355 -407 37 420 272 205 386 -313 -286 -146 -100 942 298 412 -367 -176 405 157 -459 -174 42
7127D2j80J48J15j2j7p08P67m8L90p6k71K45j71n50N04l51P85o12L68l34n71M40
$$ 42 -138 10 125 113 96 -612 155 107 497 421 150 395 224 -326 178 -173 612 0 368 34 -537 -97
7149i7O65n41q4N66j173J013j45j89m50J025l72Kn89l6K29l36L95M2K76l78K55
$$ -97 568 27 -57 509 -664 349 204 15 -435 590 218 220 -369 -405 -176 -512 -117 -75 201 -177 78
7170G8J15N11j06m63P00n24l01p4M52n00P58j525R24J167j626n5L76k46P90j85
$$ 78 193 704 598 135 835 311 10 -64 388 -112 646 -879 45 1212 -414 -469 -93 -339 451 266
7190B66j1n8n85O53l59P61n02l68j99M75K11N69m57l58Ol2l77P58m73M1M86K84
$$ 266 255 197 -388 265 -94 667 165 -203 -402 73 284 853 396 38 44 12 -365 393 -80 -39 447 731
7212G31k97l97K25j4m28K42J18J60m44K58m11P30m41O6m56K90K91k33Q57j021
$$ 731 434 37 262 248 -180 62 180 340 -104 154 -257 473 32 98 -358 -68 223 -10 847 -174
7232a74n08M35o28J196j218R94o0J54O29j04p18K58j47l48K37j038P07P85p78
$$ -174 -682 -247 -875 321 -897 97 37 191 820 716 -2 256 109 -239 -2 -1040 -333 452 -326
7251c26k6N31K37J45l57n41Q1R49p60R72m44j2q96J041j086P64K85l26k74n54
$$ -326 -352 179 416 561 204 -337 -256 693 -67 905 461 449 -447 594 -492 272 557 231 -43 -597
7271e97O22K27p19J266q34O52r63M44O01n54M51m28L68k65J39p21P0M23Q26r15
$$ -597 25 252 -467 799 -35 617 -346 98 699 145 596 168 536 271 410 -311 -241 182 1008 93
7291I3k72L3K48j23m9M1l36n6J73L63M20n8p92L34j47K10J92O46r78j0r63Q61
$$ 93 -179 -146 102 -21 -70 -29 -365 -421 -248 115 535 477 -315 19 -128 82 274 920 -58 -68 -1031 -170
7313a70P9lj13O87K67j170p0O52K51j43Q3m4l01o40K1R34k9k36m71N39P71j204
$$ -170 -91 -94 -207 480 747 -423 -493 159 410 267 350 306 5 -635 -614 320 291 55 -416 123 894 -310
7335c10L29J10mk53R0L68M13j137Q85k63o32O23K77r37M43k89J36Q35n17k51n5
$$ -310 19 129 125 -128 -38 330 743 -394 491 228 -404 219 496 -441 2 -287 -151 684 167 -84 -139
7356a39L82J37j1k53j37J27K70r30Q43o98P17j37q34P23L88p0j593P95K60LJ58
$$ -139 243 380 369 116 -21 106 376 -554 289 -409 308 171 -663 60 448 378 -1215 -420 -160 -157 1
7377AJ51P9j60j05k0K03o53J59P30J66q01j21M3P31j33M0n84K29O0N35n75N18
$$ 1 152 231 71 -34 -54 149 -504 -345 385 551 -250 -371 -328 403 270 310 -274 -45 15 550 -25 493
7399D93j139M48j7L28j80M3j22l74M64N23l45K1m96J51ql98L25L89j02K88o08
$$ 493 -646 -198 -215 113 -67 -24 -146 -520 -56 467 122 143 -353 -202 -210 -608 -283 106 4 292 -316
7420c16J5P48p55P54l38l14j82O14m73j25J14q5l42Q26k74N61p91L66k83Q55o64
$$ -316 -301 447 -308 446 108 -206 -388 226 -247 -372 -258 -343 -685 141 -133 428 -363 3 -280 575 -89
7441h9J4n3K04J87k33N03j079O72l23K56k91n3K62r34J136J41m42N72K79j613
$$ -89 -75 -128 76 263 30 533 -546 126 -197 59 -232 -285 -23 -957 179 320 -122 450 729 -884
7461h84Q02o30M47M22K96q04o2O02o84N59m8M15l84K93n64j27l84Q04J74J36p23
$$ -884 -82 -712 -265 157 453 -351 -413 189 -495 64 16 431 47 340 -224 -351 -735 69 243 379 -344
7482c44L07j5L81n51M24j88m28M57L31k38k65P6M85p91O46l2m38R84l82l61PL45
$$ -344 -37 -52 329 -222 202 14 -414 43 374 136 -129 -53 432 -359 287 255 -183 801 419 58 65 410
7504D10o48L45o91J005l0k42N02m54m07P1j26K12J7j21O95n22K82m65M02J43j68
$$ 410 -238 107 -584 421 391 149 651 197 -210 -139 -265 -53 -36 -157 538 16 298 -167 235 378 210
7525B10j74m98O82p15J28J038q79J05J79o83O73J94k20N57J1n20l28J06L61k56
$$ 210 36 -462 220 -495 -367 671 -208 -103 76 -607 66 260 40 597 608 88 -240 -134 227 -29
7545b9K49q76N40K20J85MN6m39l4J159p43o34O64l4n57J99J13Q8j01j61L43L17
$$ -29 220 -656 -116 104 289 293 349 -90 -124 1035 292 -342 322 288 -269 -70 43 131 30 -131 212 529
7567E29k86k73pn93R02o3o44O26m23k39L18j8J50m86L01NN6m5J48k85L45J08L50
$$ 529 243 -30 -37 -630 272 209 -435 191 -232 -471 -153 -171 -21 -507 -206 -201 -145 -190 -42 -327 18 126 476
7590D76n85l6r9J51N11m97N98o46J61J22n71L25L27k79N33p35P05r3n57K53j09
$$ 476 -109 -145 -244 -93 418 -79 519 -127 34 156 -415 -90 237 -42 491 -244 461 368 -189 64 -45
7611d5J91k12j82m06N44J78j45K48O4j74o36N17K00j1J82n18K2O29m54j82L02
$$ -45 146 -66 -248 -654 -110 68 -77 171 235 61 -575 -58 142 131 313 -205 -183 446 -8 -190 112
7632A12K42q07O94l71K04k09J07j95k2m7L65K75q09N00j43L34J56Q5Q2r89o9N96
$$ 112 354 -453 241 -130 74 -135 -28 -223 -245 -292 73 348 -461 39 -104 230 386 471 553 -436 -505 91
7654I1M0n62R49j42m78K56o5l95j02P18j86j25J57l97O8J73j45l03N84l45N77
$$ 91 131 -431 518 376 -102 154 89 -306 -408 310 124 -1 156 -241 -173 0 -145 -448 136 -209 368
7675C68n96R1L23j03L0M54j27p46M02K56j129O85j96O47k45l99M23l79l48M60
$$ 368 -228 -137 186 83 113 567 440 -306 96 352 -777 -92 -288 359 114 -285 138 -241 -589 -129
7695a29l86M05k9j3L95L92j28m07N5j58o3k10K6J35K11J0n6K51l58L69l04L13
$$ -129 -515 -110 -139 -152 243 635 507 100 155 -3 -66 -276 -250 -115 96 106 50 301 -57 312 8 321
7717C21k05K95n64k60J08J64m9N32l71Po8l90M10j93l3L70L62m88K44m66n04J083
$$ 321 116 411 -153 -413 -305 -141 -190 342 -29 -22 -90 -480 -70 -263 -296 74 436 -52 192 -274 -778 305
7739C05j47k85k79R04n99j82L30K04k51Q9M74j25n32M65p21L65O7j02P0l02L91
$$ 305 158 -127 -406 498 -101 -283 47 251 0 89 563 438 -94 371 -350 15 82 -20 50 -252 139
7760A39J80j57q9l85R0J49K37L95p06L73O4m3r05J11O06l80J73n35J040o42n4
$$ 139 319 162 73 -312 -222 -73 164 559 -147 226 290 247 -658 -547 59 -321 -148 -683 357 -285 -339
7781c39K20K26k48P27m61J7K98n85j30M55M26q60kj55J17M30m16Q83m68l43q4
$$ -339 -119 107 -141 586 125 142 440 -145 -275 180 606 -254 -256 -411 -294 136 -280 603 135 -208 -292
7802b92q5Q02o50J33m44O09K05o50N12P2o42k11N60J09K66J11q58P25l08k6L6
$$ -292 -377 425 -225 -92 -536 73 278 -372 140 212 -430 -641 -81 28 294 405 -453 272 -36 -62 -26
7823b6k2k90J39K41P4k63J53N92l45m1l10K51k76L86M86k49k46j28n89N41o29
$$ -26 -48 -338 -199 42 116 -147 6 598 253 212 -98 153 -123 263 749 500 254 126 -463 78 -551
7844e51J737j082l01K20J64n00R1N4R25m96p23M5O59m95L71J22J01p01J4k13O20
$$ -551 1186 104 -197 23 187 -313 -222 -168 757 261 -462 -417 242 -253 118 240 341 -360 -346 -559 61
7865F1M7k92j57m2Q61p23l1K69k18L76M1o14J097r65O0J10j1P57n4n47M69k22
$$ 61 108 -184 -341 -383 478 -245 -276 -7 -225 151 192 -422 675 -290 -230 -120 -131 626 572 25 494 272
7887B72l43K19l62j92K6K22P15p73M04J58p06O21p04L21L22n31o86K021o50J98
$$ 272 -71 148 -214 -406 -380 -158 557 -216 188 346 -360 261 -443 -122 200 -331 -1017 1004 354 552
7907E52K48j131M35J1N7k09j23J16M50q05O00o75J110p23J65k9n61J137p15O42
$$ 552 800 -331 104 115 172 -37 -160 -44 406 -399 201 -474 636 -87 78 49 -512 625 -90 552
7927E52r44J068r29Q78o50L82K64j107N35p22J293j054Q62K99j448J386o14o36
$$ 552 -392 676 -253 625 -25 357 621 -486 49 -673 620 -434 428 727 -721 665 51 -585
7945e85J01N99q69K21L36P2L20j65M2N23n41J155j803L34N51o95M1J352l51q45
$$ -585 -484 115 -754 -533 -197 -125 195 30 72 595 54 1209 -594 -260 291 -404 -363 989 638 -207
7965b07l55R09k94k11K00L27m95l6Q61k14n95N50r9m30l97K03Q68j158r8N75o08
$$ -207 -562 347 53 -158 42 369 -126 -162 699 485 -110 440 341 -89 -486 -283 585 -573 -671 -96 -704
7986g04K70M44l37N57m09Q52j107O19j175J764k23m42l89L19k35N29p89k12J420
$$ -704 -434 10 -327 230 -179 673 -434 185 -990 774 551 109 -280 39 -196 333 -456 -668 752
8005G52r40J22L16Q72j049K68L13o71K2K61l8l08M23n13J32j46J136o80J92q84
$$ 752 -188 -66 250 1122 73 341 654 -17 5 266 228 -80 343 -170 -38 -184 952 272 464 -420
8025d20P15j67k24j10P3k15K68j92J28N03L12o92N24j116R88n47M54lk89l40K7
$$ -420 295 128 -96 -206 -133 -348 -80 -272 -144 359 671 -21 503 -613 375 -172 282 279 -10 -350 -323
8046c23P26k50L27o22O4N88n56l33M48p30N39nM98k84J080j319M01P47j637J079
$$ -323 403 153 480 -142 -78 510 -46 -379 69 -661 -122 -127 371 87 1167 -152 249 996 -641 438
8066D38l24m03k69J640q42k9M7Q0m70P72k87m63J439j532J43m84R18k57o33n2
$$ 438 114 -289 -558 1082 240 211 258 338 -132 640 353 -110 1329 -203 -60 -544 374 117 -516 -568
8086e68N23P27l04n18q19R13m59R71o98J184j143m04J089n87P45k23n12N74l01
$$ -568 -45 682 378 -140 -959 -46 -505 466 -232 952 -191 -595 494 -93 652 429 -83 491 190
8105A90k01k32J00M03J90j5K45j110P71l08k19P24J82j128Q05J1o48O99j23m77
$$ 190 -11 -243 -143 260 450 435 680 -430 341 33 -186 538 720 -408 397 408 -240 459 336 -141
8125a41Q95q65J099n92M55n00r66M20O25M71l28n71P25l46r49Q15k35j53j37K89
$$ -141 754 -111 988 396 851 351 -615 -195 430 901 573 2 727 381 -568 247 12 -141 -278 11
8145A1n55J40M47p0K60N0N6j72L96p11K78K38p67O42J38p55N38K36p86P68l38
$$ 11 -544 -404 43 -27 233 283 339 167 563 -148 130 368 -399 243 381 -374 164 400 -386 382 44
8166D4r7M72j34m53j27K61p4jm06K82K38k17K40o17O40l06j19M43p40J389n70
$$ 44 -53 419 285 -168 -295 -34 -108 -109 -515 -233 5 -212 28 -589 51 -255 -374 69 -671 718 148
8187A48l1M18r33l
$$ 148 117 535 -398 -401
8191d01
$$ Imaginary data points
##PAGE= N=2
##DATA TABLE= (X++(I..I)), XYDATA
0@%%%%%%%%%%%%%pJ5j6J6j6J6k4L2l9M7n3O1p2Q7r8J10j27J47j66J87k14K41k73
$$ 0 0 0 0 0 0 0 0 0 0 0 0 0 0 -7 8 -8 8 -8 8 -16 16 -23 24 -29 32 -40 47 -51 59 -68 79 -87 100 -114 127 -146
36a46L08l41L80m25M72n26N83o44P12p85Q67r57J053j160J281j411J554j715J897
$$ -146 162 -179 201 -224 248 -278 305 -339 373 -412 455 -502 551 -609 672 -739 815 -900 997
55I97k101K331k597K909l278L721m264M951n854P093q899J1783j7106L0008j14660
$$ 997 -1104 1227 -1370 1539 -1739 1982 -2282 2669 -3185 3908 -4991 6792 -10314 19694 -94966
70i4966j15189L11045j051j60842J72075J37713k16718j6287J67546j14974j17247
$$ -94966 -210155 100890 99839 -61003 111072 248785 32067 15780 183326 68352 -48895
81d8895J84774J4124j80101Q0536J12985j84642o0997J57280o9754j54216J25606
$$ -48895 135879 150003 -30098 50438 163423 -21219 -82216 75064 5310 -148906 -23300
92b3300O9887j63034M552J41023q3034q9619J33064M4891j04623N1281R5759q1030
$$ -23300 46587 -116447 -111895 29128 -53906 -143525 -10461 34430 -70193 -18912 76847 -4183
104d183l5104J06135r255q0185O5724N6565q7004j9933P6927l2878o9329N1305
$$ -4183 -39287 66848 57593 -22592 43132 99697 12693 -7240 69687 36809 -32520 18785
116A8785K7273p7845o463N7111m8030n5935O5256K8917o8122J9586P7253m4865
$$ 18785 46058 -31787 -38250 18861 -29169 -85104 -19848 9069 -59053 -39467 37786 -7079
128g079n5977O4271J6486p2989K8194P3140m5233k6516P6808o443p0744M4865
$$ -7079 -63056 1215 17701 -55288 -27094 46046 813 -25703 51105 44662 -26082 18783
140A8783M0005p7510l998P2366n2499o1185P9228J7164q5815M1432Q0148p3845
$$ 18783 58788 -18722 -22720 49646 -2853 -64038 15190 32354 -53461 -12029 68119 -5726
152e726l7718Q5546k2686q0434O9711M9828q2287J7093Q7427o5732n9233Q6363
$$ -5726 -43444 42102 19416 -61018 8693 58521 -23766 -6673 80754 15022 -44211 42152
164D2152n886r7151N3469O5931q8040j2532R3063n0397p6617Q2946K2523r4801
$$ 42152 36266 -60885 -7416 58515 -29525 -42057 51006 609 -76008 6938 29461 -65340
176f5340L9355Q0794q1891l5693R7616k5689q6242Q1976O0836r2312N283R8944
$$ -65340 -25985 54809 -27082 -62775 34841 9152 -77090 4886 65722 -26590 -21307 77637
188G7637n1787p0479P6477J4140q6870L0806O1116o8243j8431Q4121k7335p1306
$$ 77637 25850 -44629 31848 45988 -40882 -10076 51040 -17203 -35634 48487 21152 -50154
200e0154O5656L3908r3899o81Q0061m7870n7737Q1353L0534p6253K0711O8170
$$ -50154 15502 49410 -44489 -45170 34891 -12979 -70716 10637 41171 -35082 -14371 53799
212E3799n6550m5967O7474O750o1809L6911N0569n3907j2717O3982k7140o0232
$$ 53799 -2751 -48718 18756 25506 -36303 608 51177 -2730 -15447 48535 21395 -38837
224c8837N2944K8103p7614J674P4486l9919o0248O4376K7569p1810J6868O9113
$$ -38837 14107 42210 -35404 -33730 40756 837 -59411 4965 32534 -39276 -22408 46705
236D6705m9814m4105O6771O82p3370L8191O0619n8663j9328P5494j6562o3967
$$ 46705 -3109 -47214 19557 20239 -53131 -14940 45679 -12984 -32312 43182 26620 -37347
248c7347N1286L4351p1025M324O9701m3930n0261O5768P867p5587L1112O3030
$$ -37347 13939 48290 -22735 -18411 51290 7360 -42901 22867 30734 -44853 -13741 49289
260D9289n8465k7136P2636j8491p4867M5865M4068o5000j633P3686k6868m8843
$$ 49289 -9176 -36312 36324 17833 -57034 -11169 32899 -32101 -33734 39952 13084 -35759
272c5759N2699J2717o2759K0771M7640m9809j6789O7390j2997n6385M6361L4375
$$ -35759 16940 29657 -33102 -12331 35309 -14500 -31289 36101 23104 -33281 13080 47455
284D7455o4589m600N8488l3785m7784M9205J5172n3764K1285M8056m1565k2769
$$ 47455 -17134 -21734 36754 2969 -44815 4390 19562 -34202 -12917 35139 -6426 -29195
296b9195M8956j3375m7986L7927L1013m8349K808N3183k7184l8579M5134J2788
$$ -29195 19761 6386 -41600 -3673 27340 -21009 -18201 34982 7798 -30781 14353 27141
308B7141m8441J7836M0976l6648j7353M4421j7085m7364L7879K8073n0649L206
$$ 27141 -21300 -3464 37512 864 -16489 27932 10847 -36517 1362 29435 -21214 -18008
320a8008N5666l0265m6059M2164J3211n2673J5700M8159l3035j9319M9329p733
$$ -18008 37658 7393 -38666 3498 16709 -35964 -20264 27895 -5140 -24459 24870 17137
332A7137m5579L3673K6134n0288L684N2079l4054l7363N6672J1630o2520K2962
$$ 17137 -28442 5231 31365 -18923 -15239 36840 2786 -34577 22095 33725 -28795 -5833
344e833N6697n0270l6352N6194l937o1072K9808M0792m6720l698N6450k6312m4252
$$ -5833 50864 594 -35758 20436 16499 -44573 -14765 26027 -20693 -24391 32059 5747 -38505
357c8505M7662J3948o0707J8097N5742m1631k8134O1882j440o0898L3969M4100
$$ -38505 9157 23105 -37602 -19505 36237 -5394 -33528 28354 26914 -33984 -15 44085
369D4085n6025j4409O4506j9461n8129M2388L0868n8370J882N9099l0911m0790
$$ 44085 -11940 -26349 38157 18696 -39433 2955 33823 -24547 -22665 36434 5523 -35267
381c5267M9225P505n9688K0380M9027m2868k0300N8884q803n2869L7757L3175
$$ -35267 13958 21463 -38225 -17845 31182 -11686 -31986 26898 18095 -34774 2983 36158
393C6158n5477r31O2012k9014m9665M9452K0076o2976J0125O0100l0508l4052
$$ 36158 -19319 -20250 41762 12748 -36917 12535 32611 -30365 -20240 39860 9352 -24700
405b4700M9018J483n7245J8229L5469m2938q971N4836j3104m1895L8905J9575
$$ -24700 24318 25801 -31444 -13215 22254 -20684 -29655 25181 12077 -29818 9087 28662
417B8662n4540L793N0405k9482l2803N0121J1147n2882J4763M1739l5081k0588
$$ 28662 -25878 -22085 28320 -1162 -33965 16156 27303 -25579 -10816 30923 -4158 -24746
429b4746M5409m123m2804K4776K4362m1051p64M4738j9312l1911L6833J1009m5840
$$ -24746 20663 16540 -26264 -1488 22874 -18177 -18941 25797 6485 -25426 11407 22416 -23424
442b3424Q895L6728k9959j9139M3205m39l8522K3585K5198l8952l685M3561j6801
$$ -23424 -14529 22199 -7760 -26899 16306 15867 -22655 930 26128 -12824 -16509 27052 10251
455A0251l1800L5909J0208m8035R191M0497k8940k1222M4342J502m1718J9074
$$ 10251 -21549 14360 24568 -23467 -14276 26221 -2719 -23941 20401 21903 -19815 -741
467g41K3894l7322n815L6890j9132k5792M0337P508m5634J6740L8564l8330j9532
$$ -741 23153 -14169 -19984 16906 -2226 -28018 12319 19827 -25807 -9067 29497 -8833 -28365
480b8365M8717m107m5408K7226K8034m1517k326M6078j9537l2443L6829O968m5710
$$ -28365 20352 16245 -29163 -1937 26097 -15420 -17746 28332 8795 -23648 13181 20149 -25561
493b5561J4558L3779l4823j1451M8265j0150m1182L3502K1686n0466r25M8109
$$ -25561 -11003 22776 -12047 -23498 24767 14617 -26565 6937 28623 -21843 -22768 25341
505B5341k3157l1902M2190J0257m7103J4781L8286l3828j6607M6872m934m4758
$$ 25341 2184 -29718 12472 22729 -24374 -9593 28693 -5135 -21742 25130 20196 -24562
517b4562K3725K6291l9309o506M0465j4548k8680L2930J0928m0632R333L5405
$$ -24562 -837 25454 -13855 -20361 20104 5556 -23124 9806 20734 -19898 -10565 24840
529B4840l0115k2784M1497M743m2789J5863L6002l0861j8551M1671O02m0125J7282
$$ 24840 -5275 -28059 13438 18181 -24608 -8745 27257 -3604 -22155 19516 20118 -20007 -2725
542b725K6396l4633j0098L9486o310l0582K7837J4376m1448J878L5893k7674k7884
$$ -2725 23671 -10962 -21060 18426 12116 -18466 9371 23747 -17701 -15823 20070 -7604 -35488
555c5488M3771R309m6200J7329M3017l6489k3866M6151j612m3944K7754L1119
$$ -35488 8283 17592 -28608 -11279 31738 -4751 -28617 17534 15922 -28022 -268 30851
567C0851m2475n471M6137k0940l4882M2529J4244m9637J1799M0517l8200k3206
$$ 30851 -11624 -17095 29042 8102 -26780 15749 29993 -19644 -7845 32672 -5528 -28734
579b8734M8524m443m6037K9019K7978m5261l566M4773k3476l0582M1817Q128m4432
$$ -28734 19790 15347 -30690 -1671 26307 -18954 -22520 22253 -1223 -31805 10012 18140 -26292
592b6292J8395L6590l6322j4835M4894o297l6180K6798K0114l7531m52L2207k1086
$$ -26292 -7897 28693 -7629 -22464 22430 16133 -20047 6751 26865 -10666 -11118 21089 3
605Cj9330L2183R95l0955J7219J9789l1421o557L0163j3004k4081K5779J1428
$$ 3 -19327 12856 13851 -17104 115 19904 -11517 -18074 12089 -915 -24996 783 12211
618A2211k9460N681K7661j4375j4701K2897K794k2420P580J4906j5329l025J9610
$$ 12211 -17249 -11568 16093 1718 -12983 9914 12708 -9712 -2132 12774 -2555 -5580 14030
631A4030n720j6327J3307Q002k0395j771J7724r974j4543J7815P521k0492L481
$$ 14030 8310 -8017 5290 13292 -7103 -8874 8850 -1124 -15667 2148 9669 -10823 -7342
644g342J8773j5882j4783K3953P034k4598O909K1819j9320j3222K7425K115k3560
$$ -7342 11431 -4451 -19234 4719 11753 -12845 -5936 15883 -3437 -16659 10766 12881 -10679
657a0679J5781J6302k7619l796K8737j5355k2274K8734N585l5280J4428L0334
$$ -10679 5102 21404 -6215 -10011 18726 3371 -18903 9831 15416 -19864 -5436 24898
669B4898l2710j5707M2156q083m1321K9249K7056m2086o274M3194j7311k8681
$$ 24898 -7812 -23519 18637 10554 -30767 -1518 25538 -16548 -22822 20372 3061 -25620
681b5620L7293R933m0113J5591K9189l8384j0870M6653j2889l7598L7008K0395
$$ -25620 11673 21606 -18507 -2916 26273 -12111 -22981 23672 10783 -26815 10193 30588
693C0588m8376K129M3415k8744l0452M2137P467m1958J7485L1982l3879j2999
$$ 30588 -17788 -15659 27756 -988 -31440 10697 18164 -23794 -6309 25673 -8206 -21205
705b1205L7801r579l0600K8789J6308l6798L251L3057k1957k1891L3082O952l2043
$$ -21205 16596 7017 -23583 5206 21514 -15284 -12033 21024 -933 -22824 10258 17210 -14833
718a4833J0751K4738k4828j2760K8501l658k5509J8274J7973k5451n795K6541
$$ -14833 -4082 20656 -4172 -16932 11569 7911 -17598 676 18649 -6802 -12597 13944
730A3944q199k2556J8755J4014k3817k284K2862j0262j9401J9042J0083k1737
$$ 13944 5745 -16811 1944 15958 -7859 -10143 12719 2457 -16944 2098 12181 -9556
742i556L642K1319j5260j4222K1548K99k5005J2812K1087k1272r223K9492m918
$$ -9556 -5914 15405 145 -14077 7471 7770 -17235 -4423 16664 -4608 -13831 15661 10743
755A0743k7994J6567J7857k6828k657K8669j3293k1263K5232P231k8927J0278
$$ 10743 -17251 -684 17173 -9655 -12312 16357 3064 -18199 7033 14264 -14663 -4385
767d385K4552k3901j3400K9096n990k6004K1506J5318k9600L604K9113k0483j8983
$$ -4385 20167 -3734 -17134 11962 5972 -20032 1474 16792 -12808 -9204 19909 -574 -19557
780a9557L0558J125l2175J7064K3899k8513o140L2087j2661k6322K6005J2520
$$ -19557 11001 12126 -20049 -2985 20914 -7599 -13739 18348 5687 -20635 5370 17890
792A7890k9897N743K5544k1785j3534K6288m823k3621K0966J3728k8830L206K8967
$$ 17890 -12007 -6264 19280 -2505 -16039 10249 5426 -18195 2771 16499 -12331 -9125 19842
805A9842j9822k1377K7836O164l0021R742K5657j9625j1750K4935k654k2811J5091
$$ 19842 20 -21357 6479 12643 -17378 -7636 18021 -1604 -13354 11581 8927 -13884 1207
818A207J2833k1698n90K1017j1945j4250K0838L850k3102Q817J9730j9369j2945
$$ 1207 14040 -7658 -8248 12769 824 -13426 7412 11262 -11840 -3023 16707 -2662 -15607
831a5607K4452K57k5230J1356K0457j8205r338K2652m128k1425J3960J3336k0977
$$ -15607 8845 9102 -16128 -4772 15685 -2520 -11858 10794 6666 -14759 -799 12537 -8440
844h440q52K2468j1303j7798K0801P696k4367N996K2851j8246j4196K5442N92
$$ -8440 -9292 13176 1873 -15925 4876 12572 -11795 -5799 17052 -1194 -15390 10052 10644
857A0644k7466J3831K0721k3873p316K8899p776k6048K0549J4031k8528J374K8370
$$ 10644 -16822 -2991 17730 -6143 -13459 15440 7664 -18384 2165 16196 -12332 -10958 17412
870A7412j5994k0471K5900N628k7927J0933K3245k2351j0416K7873o869k5458
$$ 17412 1418 -19053 6847 12475 -15452 -4519 18726 -3625 -14041 13832 6963 -18495
882a8495K0681J5026k8171J211K9233j5147k0548K4919N573k9764Q293K4122k0554
$$ -18495 2186 17212 -10959 -9748 19485 4338 -16210 8709 14282 -15482 -7189 16933 -3621
895c621j0651K6820k975k5047J5134J4348k3817j557K3855j1777j7481K1447O384
$$ -3621 -14272 12548 9573 -15474 -340 14008 -9809 -11366 12489 712 -16769 4678 11062
908A1062k3866O981K0828j7213j1182K2298j317k0321J2892J3115k0072j216K1466
$$ 11062 -12804 -5823 15005 -2208 -13390 8908 7591 -12730 162 13277 -6795 -8011 13455
921A3455r808j7241J8368P920k2594K417J9942j1757j3035J7211J304j7588Q540
$$ 13455 3647 -13594 4774 12694 -9900 -7483 12459 702 -12333 4878 6182 -11406 -2866
934b866J2821j4735k729J7451p777j4096J5883O060j9607N094J8711j3965j1135
$$ -2866 9955 -4780 -7509 9942 2165 -11931 3952 10012 -9595 -4501 14210 245 -10890
947a0890K0615J486k2108P730J5797j5658o883J8275l486j4926J1439O190j6745
$$ -10890 9725 11211 -10897 -3167 12630 -3028 -9911 8364 4878 -10048 1391 7581 -9164
960i164M993J5561j4220r584J9319j196k0163J1441J5827j7983m995K1215n442
$$ -9164 -4171 11390 -2830 -12414 6905 5709 -14454 -3013 12814 -5169 -10164 11051 5609
973E609j8230J4701R545k0252J355J9594j0194j3015J7711K293j9738P826J4539
$$ 5609 -12621 2080 11625 -8627 -7272 12322 2128 -10887 6824 9117 -10621 -2795 11744
986A1744j6377n581J9879n200j8210J4758J0663k0552M05K0863j1395j5090J9924
$$ 11744 -4633 -10214 9665 4465 -13745 1013 11676 -8876 -8471 12392 997 -14093 5831
999E831M907k2845O681K0023j6434j0871K2480p0k1363J1068J4315j8584l749
$$ 5831 10738 -12107 -5426 14597 -1837 -12708 9772 9702 -11661 -593 13722 -4862 -8611
1012h611K0449q797j6332J7205O728k1680N302K0679j5570j2723K1963K97k3286
$$ -8611 11838 3041 -13291 3914 10642 -11038 -5736 14943 -627 -13350 8613 8910 -14376
1025a4376J0396J7348j8901o753K2932l970j9762J4423R751k0524Q72J9970j0749
$$ -14376 -3980 13368 -5533 -12286 10646 6676 -13086 1337 11088 -9436 -8564 11406 657
1038F57j2845J8785L302k0835P169J6910j5833q173J9811k274j7875J1824J1055
$$ 657 -12188 6597 9899 -10936 -3767 13143 -2690 -10863 8948 6674 -11201 623 11678
1051A1678j8338j375J8617q052j4052J6108N892j9939L212J6628j2449r495J7921
$$ 11678 -6660 -8035 10582 2530 -11522 4586 10478 -9461 -6249 10379 -2070 -11565 6356
1064F356R70j7684Q216J2730j3950m456J5901m387j2879J1709N061j5047L295
$$ 6356 7326 -10358 -2142 10588 -3362 -7818 8083 3696 -9183 2526 7587 -7460 -4165
1077d165J3825j1426p906J6797Q13j7575P752J3539j5166o340J6842j879j3632
$$ -4165 9660 -1766 -9672 7125 7938 -9637 -1885 11654 -3512 -9852 6990 5111 -8521
1090h521R813P248j3670J80J2559q224p703J3134m57j3796Q418R759j4029j632
$$ -8521 1292 8540 -5130 -4950 7609 -615 -8318 4816 4359 -9437 -1019 8740 -5289 -6921
1104f921J6401p140j3530J3789N898j6610K393J4985r773p263J4614k22j3877
$$ -6921 9480 2340 -11190 2599 8497 -8113 -5720 9265 -508 -7771 6843 6621 -7256
1117g256P829Q328j4036q25J4927o742j0866J2920K290j4819N467J2229j2296
$$ -7256 573 8901 -5135 -5960 8967 2225 -8641 4279 6569 -8250 -2783 9446 -2850
1130b850n138J5683l620j4334J0620R286j5644k112J5885n722j1423J2174N464
$$ -2850 -7988 7695 4075 -10259 361 9647 -5997 -8109 7776 2054 -9369 2805 8269
1143H269j4910K602J1666q619o455J3528L02j3352P120R060j3163k350J4773m663
$$ 8269 -6641 -4039 7627 -992 -7447 6081 6383 -6969 151 9211 -3952 -6302 8471 3808
1157C808j3756J0973Q008j5832j152J7040o355j3833J3221O203j6363J862J4721
$$ 3808 -9948 1025 9033 -6799 -7951 9089 2734 -11099 2122 8325 -8038 -6176 8545
1170H545j0539q410J6354O85j5943R049J2193j6277m462J9243n733j6359J4416
$$ 8545 -1994 -10404 5950 6635 -9308 -259 11934 -4343 -8805 10438 4705 -11654 2762
1183B762R586j9673O21J8449j1808j2612J8731K175j9720Q599J5633j8385o522
$$ 2762 12348 -7325 -6704 11745 -63 -12675 6056 8231 -11489 -2890 12743 -5642 -12164
1196a2164K2504n394j8560J5308J1198k0908l78J9818j0710j1778J7160K508j8173
$$ -12164 10340 4946 -13614 1694 12892 -8016 -8394 11424 714 -11064 6096 8604 -9569
1209i569Q892J3124j6912l667J8610o033j6159J4839P442j8231J256J6583j1610
$$ -9569 -677 12447 -4465 -8132 10478 4445 -11714 3125 10567 -7664 -6408 10175 -1435
1222a435r973J6178K575j5074N188J1311j1760m667J3045l296r097R042L643j1357
$$ -1435 -11408 4770 7345 -7729 -2541 8770 -2990 -7657 5388 2092 -7005 2037 5680 -5677
1236e677K831J0637p080p192J0177Q82j1104M886Q697q026m613R598q71r200M963
$$ -5677 -2846 7791 711 -6481 3696 4578 -6526 -1640 7057 -969 -5582 4016 3145 -6055 -1092
1251a092O487p559k688Q250q76p118L708N604o688j799P934l532n884Q023K176
$$ -1092 5395 -2164 -4852 3398 2522 -4596 -888 4716 -1972 -3771 4163 631 -5253 2770 4946
1266D946j0453L389Q501p815m866J1742L75j2685O475R318j1705l275J3632l600
$$ 4946 -5507 -2118 6383 -1432 -6298 5444 5819 -6866 -391 8927 -2778 -6053 7579 3979
1280C979j2477R917N820j2679J571J2562r635p622J4016j606j4148J1145Q367
$$ 3979 -8498 1419 7239 -5440 -3869 8693 -942 -8564 5452 3846 -10302 843 9210
1293I210j6241m16J7035r368j2384J6675M263j8178N889J5092j4919o126J8159
$$ 9210 -7031 -7447 9588 220 -12164 4511 8774 -9404 -3515 11577 -3342 -9468 8691
1306H691l468j5398J2825P428j7370J858J6527j2779j0216J8389J92j7476Q729
$$ 8691 5223 -10175 2650 10078 -7292 -5434 11093 -1686 -11902 6487 6679 -10797 -2068
1319b068J2824j5685l414J6750n357j3371J2519O339j6399L169J4778j0535q603
$$ -2068 10756 -4929 -8343 8407 3050 -10321 2198 8537 -7862 -4693 10085 -450 -9053
1332i053J4466J860j4203O003J1359j1497m862J2539k432j1040P962O448j1266
$$ -9053 5413 7273 -6930 -927 10432 -1065 -5927 6612 4180 -6860 1102 7550 -3716
1345c716o17R837m198q258R456K630j1169K096R742o521p096J0535L105j2111
$$ -3716 -4333 5504 1306 -6952 2504 5134 -6035 -3939 5803 -718 -7814 2721 5826 -6285
1359f285K590J0843o799p495R849K011j1100M933Q655q120m422J1209k369j1341
$$ -6285 -3695 7148 349 -7146 2703 4714 -6386 -1453 7202 -918 -5340 5869 3500 -7841
1373g841P708P137j1333o56J2214o945r071J2150L203j4163M317J2217j0794o930
$$ -7841 -133 7004 -4329 -4985 7229 284 -8787 3363 6566 -7597 -3280 8937 -1857 -8787
1387h787J4617r63j2928P895Q085j2703m76J3983o739r865J1332K816j3274N215
$$ -8787 5830 4867 -8061 -166 7919 -4784 -5260 8723 1984 -7881 3451 6267 -7007 -1792
1401a792R902r839m227J2951m693j0956J1158M657j3493K322J3123q755r062J2357
$$ -1792 8110 -1729 -5956 6995 2302 -8654 2504 7161 -6332 -4010 9113 358 -8704 3653
1415C653K000j2512N194Q318r054j712R122m668o814Q451J613r012L178Q451q478
$$ 3653 5653 -6859 -1665 6653 -2401 -4113 5009 341 -6473 1978 3591 -5421 -2243 6208 -2270
1430b270l685J0805k039r521O782O965j0186k117J0221k062q842P070M004r028
$$ -2270 -5955 4850 2811 -6710 72 7037 -3149 -5266 4955 2893 -5949 1121 5125 -3903
1444c903L517N808o212l333P465j44q140M837O424q997k294R800m164o956P947
$$ -3903 -386 5422 -790 -4123 3342 3198 -4942 -105 6319 -2678 -4972 4828 664 -6292 1655
1459A655K919q843M42R881n560o471Q423K882j0160L326P828p763l990J0494j242
$$ 1655 4574 -4269 -3827 6054 494 -5977 2446 5328 -4832 -1506 6322 -1441 -5431 5063 3821
1474C821j0026O554O691j0436q32J0976n493p775P562L478j0758K650J0816q853
$$ 3821 -6205 349 7040 -3396 -4228 6748 1255 -6520 1042 4520 -6238 -3588 7228 -1625
1488a625n316J1132N32j2022N902Q449j0035l054J2388l915r855Q505N885j1765
$$ -1625 -6941 4191 4723 -7299 -1397 7052 -2983 -6037 6351 2436 -7419 1086 6971 -4794
1502d794P89J1016n865q145J0887J432j2002N551Q303q857l960J1038k732j0132
$$ -4794 -4005 7011 1146 -6999 3888 5320 -6682 -1131 7172 -1685 -5645 5393 2661 -7471
1516g471P530N388r445j816J1273m619p951Q727L759j0858K218Q945n856o000
$$ -7471 59 5447 -3998 -5814 5459 840 -7111 1616 5375 -5483 -3265 5680 -176 -6176
1530f176R544J344j0319M952O234p505j837R200l447o886O244L528r191J229R014
$$ -6176 3368 4712 -5607 -655 5579 -1926 -3763 5437 1990 -4896 1348 4876 -4315 -3086 5928
1545E928o828n929J0007O91r710L068Q612p591l980J0077j723p566N589L805p431
$$ 5928 -900 -6829 3178 3869 -5841 -2773 5839 -1752 -5732 4345 2622 -4944 645 4450 -2981
1560b981Q33N906k958m631O689M88q770N140N824q354j245Q631l357o906O825
$$ -2981 -2148 3758 800 -3831 2858 3346 -5424 -284 5540 -2814 -4059 4572 1215 -5691 1134
1575A134L680q637L32P924m976m949Q272n69p057M567L809o314k94P628l369o161
$$ 1134 4814 -3823 -3491 4433 -543 -5492 2780 2211 -4846 -279 3530 -2784 -3078 4550 1181 -4980
1591d980O301K316p789K850P610o035m916Q090j138o333L965M721p597j081P903
$$ -4980 1321 3637 -4152 -1302 6308 273 -4643 3447 2309 -4024 -59 4662 -2935 -4016 3887
1606C887k655o829N919L712p803P32P438m866m249P597J92p826M260N783p001
$$ 3887 1232 -5597 322 4034 -3769 -3037 4401 -465 -4714 2883 3075 -4751 -491 5292 -1709
1621a709k098Q868k483q114O610M662r541MR659n098p127Q590K410r911K617Q142
$$ -1709 -3807 5061 2578 -5536 1074 5736 -3805 -3801 5858 760 -6367 2223 4633 -5278 -2661 5481
1637E481o602m519R635j587q731O535N346q709j325J0545m435p944Q195M365j0208
$$ 5481 -1121 -5640 3995 2408 -6323 212 5558 -3151 -4476 6069 1634 -6310 1885 6250 -3958
1652c958J732R260p252n808R799M27j1092N319Q489r900l261J0515j422r574O264
$$ -3958 -2226 7034 -218 -6026 3773 4200 -6892 -1573 6916 -2984 -6245 4270 2848 -6726 -462
1667d62N827r388K49Q275m458o197Q278K246r396L177Q196o477m977R753r28j0168
$$ -462 5365 -4023 -3774 4501 43 -6154 2124 4370 -5026 -1849 6347 -130 -5107 4646 3718 -6450
1683f450O348N947r669j716J0855l004q228O298N224q790j62P108m050m401O945
$$ -6450 -102 5845 -3824 -5540 5315 2311 -5917 381 5605 -3185 -3347 3761 -289 -4690 2255
1698B255R32p667L945N013n870k566Q458k673p379O514L697q430Q61P957m389
$$ 2255 3187 -4480 -535 4478 -1392 -3958 4500 1827 -5552 962 4659 -3771 -2910 5047 658
1713F58n929P153K114q196K239O061n526k985P504j848n302M975L263p314N54
$$ 658 -5271 1882 3996 -4200 -1961 4100 -1426 -4411 3093 1245 -4057 918 4181 -3133 -2579
1728b579O837m135m160O701J94p071L700M959n927j953P252k335o191N131K976
$$ -2579 4258 123 -4037 2664 2858 -4213 -513 4446 -1481 -3434 3818 1483 -4708 423 3399
1743C399o192R38N512l992l468N970p7n544L173L753n662k7N680k512l719M311
$$ 3399 -2793 -1855 3657 -335 -3803 2167 2090 -3454 -281 3472 -2190 -2217 3463 951 -2768 1543
1759A543J608o090J891N215m554l037O008M51n855J966L943m088j409M635j090
$$ 1543 3151 -2939 -1048 4167 -387 -3424 2584 3035 -2820 -854 3089 -999 -2408 2227 1137
1774A137m902L763K550n401J59N417k696l318M699J646o485J953N489m568l467
$$ 1137 -3765 -2 2548 -2853 -2694 2723 27 -3291 1408 3054 -3431 -1478 4011 -557 -4024
1789d024P026m46o569L720N051o375k221P800k392o338N867L761q356M65P604
$$ -4024 3002 2556 -4013 -293 4758 -1617 -3838 3962 1570 -4768 1099 4860 -3496 -3031 4573
1804D573m516n496P689J262q349L385O126o860k008Q898l052o692O653L923r711
$$ 4573 57 -5439 2250 3512 -4837 -1452 4674 -2186 -4194 4704 1652 -5040 1613 5536 -4175
1819d175J105R603o337n965Q828J144r282L630P945p800l185Q650k003p396O147
$$ -4175 -3070 6533 196 -5769 3059 4203 -5079 -1449 6496 -1304 -4489 4161 2158 -5238 909
1834I09L352p640Q22O968n445m146Q186l19p368L999N406o839k352P922j180o799
$$ 909 4261 -3379 -2557 4411 -1034 -5180 3006 2687 -4681 -682 4724 -2115 -4467 3455 2275 -4524
1850d524M847L464n370o47N779k777l660L629J879m843J357M287m097j763L781
$$ -4524 323 3787 -1583 -2230 3549 772 -2888 741 2620 -2223 -866 3421 -676 -2439 1342
1865A342l36l662J965L002l785j110M955j467m004L103K765m392o88M853j468
$$ 1342 1006 -2656 -691 2311 -1474 -2584 2371 904 -3100 3 2768 -1624 -2312 2541 1073
1880A073l877L422K553m263l70M384k434k688L765M10m368K126L049m407n40M960
$$ 1073 -2804 618 3171 -1092 -1462 2922 488 -2200 1565 1975 -2393 -267 2782 -1625 -2165 2795
1896B795k195m641N031J955o260J055N709l767l286N755j7n647L306L810n322
$$ 2795 600 -4041 990 2945 -3315 -2260 3449 -318 -3604 2151 2134 -3513 -207 3603 -1719
1911a719n04N938k805m410N613J193o601K719M771n910j888O925j949n765N283
$$ -1719 -2223 3715 910 -3500 2113 3306 -3295 -576 4195 -1715 -3603 3322 1373 -4392 891
1926H91K527p008J261O242m512l476O842j54o751L793M828o342j049O806k705
$$ 891 3418 -3590 -2329 3913 -599 -4075 2767 2613 -4138 -345 4483 -1859 -2908 3898 1193
1941A193n229N272K173n954J356N175m675k902O038l49n750L570L785n860j047
$$ 1193 -4036 1236 3409 -2545 -1189 3986 -689 -3591 2447 2098 -3652 -82 3703 -2157 -3204
1956c204O435k052n143M553K917n806j22N496k153m175M138J550m574R50M363
$$ -3204 3231 1179 -3964 589 3506 -2300 -2422 3074 921 -3254 884 2434 -2140 -1190 3173
1971C173l324k415M599m63m626K668L894m919j749N742r59n401M042L324n517
$$ 3173 -151 -2566 2033 1570 -3056 -388 3506 -1413 -3162 2580 1621 -3780 262 3586 -1931
1986a931j206O219j935n103M838K748o074O49N432l491l497N720M04n926K594
$$ -1931 -3137 3082 1147 -3956 882 3630 -2444 -1795 3637 146 -3351 2369 2773 -3153 -559
2001e59M477n510j535O275k027n552N052L030o906R62O400m323l875O330Q03o688
$$ -559 3918 -1592 -3127 3148 1121 -4431 621 3651 -3255 -2293 4107 -216 -4091 2239 3042 -3646
2017c646K734N134n181j972N859j523m670M287K065n400J051M921m053k676N308
$$ -3646 -912 4222 -959 -2931 2928 1405 -3265 1022 3087 -2313 -1262 3659 -394 -3070 2238
2032B238m88n552L623L701n520q69N735k206m147M139K014m558M67L981k370k048
$$ 2238 1750 -3802 -179 3522 -1998 -2867 2868 662 -3485 654 2668 -1890 -1423 2558 188 -1860
2048a860L695m04l916K912K254l430m63L663j615l951M106J474m056O52L111k459
$$ -1860 1835 1431 -2485 427 2681 -749 -1212 2451 836 -3115 991 2465 -1591 -939 2172 -287
2064b87k126L969k36l623J912K936l658j090M477j233l503L020J974l996J49M166
$$ -287 -2413 1556 1320 -2303 -391 2545 -1113 -2203 2274 1041 -2462 558 2532 -1464 -1315 2851
2080B851k591k803M692m86l881J862L069l856j140M344j286m295L972K483n056
$$ 2851 260 -2543 2149 1663 -2218 -356 2713 -1143 -2283 2061 775 -3520 452 2935 -2121
2095b121l27N323k548m066M735J485n213J384M493l853k222N130k20n020L328
$$ -2121 -2448 2875 327 -3739 996 2481 -2732 -1348 3145 -708 -2930 2200 1980 -3040 288
2110B88K782m809q0M904k622l884N011J324n564J283N203m115l272N652K60n409
$$ 288 3070 -1739 -1819 3085 463 -3421 1590 2914 -2650 -1367 3836 -279 -3551 2101 2361 -3048
2126c048K496L903m508j717N516j317m412L374K706n191O4N365k838l283M401
$$ -3048 -552 3351 -1157 -2874 2642 1325 -3087 287 2993 -2198 -2134 3231 393 -2890 1511
2141A511O23m821K010M390m349k804N806l64n585L049M182n020j250N259j651
$$ 1511 2134 -2687 -677 3713 -636 -3440 2366 2002 -3583 -534 3648 -1372 -2622 2637 986
2156I86m480L675K523n096J02M834l055k494M428K21m694K568L507m443q15N200
$$ 986 -3494 181 2704 -2392 -2290 2544 -511 -3005 1423 1644 -3050 -482 3025 -1418 -2233 2967
2172B967j704m547L487K950m712m6M668k079l609L733J189m256J424L221l203
$$ 2967 1263 -3284 203 3153 -1559 -1605 3063 984 -2625 1108 2297 -1959 -535 2686 -517
2187e17j453L862r14l146K607J865m181N41L978k573k466L550N45l618J134L027
$$ -517 -1970 1892 978 -2168 439 2304 -1877 -1336 2642 69 -2397 1153 1698 -1920 -786 2241
2203B241k753j056L166o83k913K254J556k944j7K809j545k033K647M28k682P54
$$ 2241 -512 -1568 1598 915 -1998 256 1812 -1132 -1149 1660 115 -1918 729 1157 -1525 -771
2219g71K375k338q74K681l85k608K115J093k643l9K908j438j600K257P04k845
$$ -771 1604 -734 -1608 1073 688 -1920 195 1288 -1355 -1394 1514 76 -1524 733 1437 -1408
2235a408O22K725k151j831L190K23l058J578J889k474m34K823j320k555L325O59
$$ -1408 -786 1939 -212 -2043 1147 1370 -1688 -110 1779 -695 -1129 1694 374 -2181 1144 1803
2251A803l447J059K955k874j451L822n02l626K226K532l899o27M117j544l101
$$ 1803 -1644 -585 2370 -504 -1955 1867 1365 -2261 -35 2497 -1402 -2029 2088 544 -2557
2266b557L552J097m031O44L561k610j813L923l86l956K583K527l997j83M030j985
$$ -2557 995 2092 -1939 -1295 2266 -344 -2157 1766 1380 -2576 7 2534 -1463 -1646 2384 399
2282C99l232L840J380m812J074M260l196k948M626N36m344J599L310l289j128
$$ 399 -2833 1007 2387 -2425 -1351 2909 -287 -3235 1391 1927 -2417 -818 2492 -797 -1925
2297a925L662p98l179K806J514l741N64L741k533k000L384M73m172J468L366k789
$$ -1925 1737 939 -2240 566 2080 -1661 -1097 2644 111 -1889 1495 1968 -2204 -736 2630 -159
2313a59k381M004L9l786J617L025l065j028L134r08k571K420J364l178L03L272
$$ -159 -2540 1464 1503 -2283 -666 2359 -706 -1734 1400 492 -2079 341 1705 -1473 -1170 2102
2329B102k265k081L309O49l666J411L065l403q91L496o65l156K094K286l475j72
$$ 2102 -163 -2244 1065 1714 -1952 -541 2524 -879 -1770 1726 1061 -2095 -1 2285 -1190 -1362
2345a362L446j713k772K926J109l144Q00K553k225j398L231p71k485J902J530
$$ -1362 2084 371 -2401 525 1634 -1510 -710 1843 -382 -1780 1451 680 -1805 97 1627
2360A627k906O49K633j824j896K767L29l201J387K292k294j149K943n37k390J617
$$ 1627 -1279 -630 2003 179 -1717 1050 1379 -1822 -435 1857 -437 -1586 1357 820 -1570 47
2376D7J484k371RK286j563j143K187j43k133J076J681k079n03K318m65k325J667
$$ 47 1531 -840 -831 1455 -108 -1251 936 793 -1340 -264 1417 -662 -1165 1153 688 -1637 30
2393C0J266k578N17K340j519j602K241N19k726J177K303k264j438K735j0k491
$$ 30 1296 -1282 -765 1575 56 -1546 695 1214 -1512 -335 1968 -296 -1734 1001 991 -1500
2409a500J444J632k392m10K637j362j969K791O46l402R89K900k780j184L605m70
$$ -1500 -56 1576 -816 -1226 1411 49 -1920 871 1517 -1885 -896 2004 -776 -1960 1645 1175
2425A175l580J962K728l377o65L833j290k892K584J396l375R65K738k601j567
$$ 1175 -2405 -443 2285 -1092 -1757 2076 786 -2106 478 1874 -1501 -536 2202 -399 -1966
2440a966L753o02l476K327K585m104l50M049j541l366K995J698m206P01L611k078
$$ -1966 1787 1185 -2291 36 2621 -1483 -1833 2216 675 -2691 304 2002 -2204 -1503 2108 30
2456C0k364L497J94l406J651K587l080m42L103j011k686K378J612l167K60L061
$$ 30 -2334 1163 1357 -2049 -398 2189 -891 -1333 1770 759 -1927 451 2063 -1104 -844 2217
2472B217k254j679K462N77k979R88K267j996j351K558M8k581J480J852k321n38
$$ 2217 -37 -1716 746 1323 -1656 -668 1599 -397 -1748 810 858 -1723 -243 1609 -712 -1250
2488a250K486n46k066J558J464k086l39J999o80j931K091O56k700Q18K245j590
$$ -1250 1236 690 -1376 182 1646 -440 -779 1220 540 -1391 700 1356 -1344 -526 1719 129
2504A29j618K228L06k768J122K274k236r20K648o24k119J825J122k596L0K747
$$ 129 -1489 739 1045 -1723 -601 1673 -563 -1483 1165 541 -1578 247 1369 -1227 -1197 1550
2520A550j698j266K432J13k822J732J750k487p16K872q99k495K431J121l071Q00
$$ 1550 -148 -1414 1018 1131 -1691 41 1791 -696 -1412 1460 561 -1934 497 1618 -1453 -653
2536f53K815k876j096L191l60l011K055J603k555o3K585j342j805K427J19k768
$$ -653 2162 -714 -1810 1381 1021 -1990 65 1668 -887 -950 1635 293 -1512 915 1034 -1734
2552a734J536J768k457m08K703j126k117K428Q83k612P8K754j659j398K335J58
$$ -1734 -198 1570 -887 -1295 1408 282 -1835 593 1476 -1136 -1058 1696 37 -1361 974 1132
2568A132k632J301J630j901m61K127j174j536J624J019k343M07K047j558j571
$$ 1132 -1500 -199 1431 -470 -931 1196 22 -1514 110 1129 -1214 -807 1240 -318 -1889
2583a889K698N06k691P68J969j721q52K135o8j959J089J343j590o53J825k05j837
$$ -1889 809 1315 -1376 -608 1361 -360 -1212 923 855 -1104 -15 1328 -262 -915 910 705 -1132
2600a132J674R24k448L30K254j286j980K179P34k627N28K653k168j447K794P8
$$ -1132 542 1466 -982 -652 1602 316 -1664 515 1249 -1378 -850 1803 -365 -1812 982 1060
2616A060k924J685K102k520j062K869o12k134J872J404k960L95K665j932j584
$$ 1060 -1864 -179 1923 -597 -1659 1210 598 -1536 336 1740 -1220 -825 1840 -92 -1676
2631a676K766L22k615Q62K019k023j332L248j134k294J736K005k835j29K343j011
$$ -1676 1090 1412 -1203 -341 1678 -345 -1677 1571 437 -1857 -121 1884 -951 -1080 1263 252
2647B52j957K397l17j747M65K175j866j271L299n23j757O66R90j224q78K372r01
$$ 252 -1705 692 375 -1372 -907 1268 -598 -1869 1430 907 -850 -184 806 -418 -1296 1076 175
2664A75j365J751J477k979J301N88r83r86K600m97k086J812L09j291o32J916J76
$$ 175 -1190 561 2038 -941 360 948 -35 -1021 1579 1082 -1004 808 1117 -174 -806 1110 1286
2681A286k496J352J024k162J41K305j618n84J763p03o98M93J027k140O40J386
$$ 1286 -1210 142 1166 -996 -855 1450 -168 -752 1011 308 -390 103 1130 -1010 -370 1016
2697A016j236p75J271M97j539K22J440q43j174J803k36j276N65R41j519R4J229
$$ 1016 -220 -995 276 773 -766 -544 896 53 -1121 682 446 -830 -265 676 -843 -749 480
2714D80m94j328J517N13j735J064J267j647o68J760K77k257R41J700k374O03J250
$$ 480 -14 -1342 175 688 -1047 17 1284 -363 -1031 729 1006 -1251 -310 1390 -984 -381 869
2731H69q92j282K027R7j742L19J687j357m75J219o1j509J217J036j932k5J739
$$ 869 -23 -1305 722 819 -923 -604 1083 -274 -749 470 409 -1100 117 1153 -779 -804 935
2748I35r72j289J784M47j899N77J537j211j149J858J67j670P50J551j735p55K074
$$ 935 -37 -1326 458 905 -994 -417 1120 -91 -1240 618 785 -885 -135 1416 -319 -1074 1000
2765A000o30j505J397J095k082r7K079j185j689K118O77k670R38J934j169j695
$$ 1000 370 -1135 262 1357 -725 -822 1257 72 -1617 501 1178 -1492 -554 1380 211 -1484
2781a484K307J36k320J214J615j946n05K219r09j726J764J070k252J51K360j853
$$ -1484 823 959 -1361 -147 1468 -478 -983 1236 327 -1399 365 1435 -817 -666 1694 -159
2797a59j399K410j1k357R09K061j823p46K378n74j983J124J425k082m6K271j519
$$ -159 -1558 852 841 -1516 -607 1454 -369 -1115 1263 689 -1294 -170 1255 -827 -873 1398 -121
2814a21j084J758K37j703N78J335j566j24J318m31r18P51N46j359K16J551p89
$$ -121 -1205 553 790 -913 -335 1000 -566 -690 628 197 -721 30 576 -783 -567 984 195
2831A95j171J393M23j384J61J042q43o74J248o6j055K19J082p47m68R80J19j043
$$ 195 -976 417 840 -544 -383 659 -184 -858 390 324 -731 -512 570 -177 -645 335 454 -589
2849e89O21N14j197L16J063p37n37R84l6j273O48J378j223o55J400j19j390N67
$$ -589 32 546 -651 -335 728 -9 -546 438 402 -871 -223 1155 -68 -723 677 558 -832 -265
2867b65Q97j333lJ223n14p16J125J70j325N07J064j253k90J574q83p69J315M44
$$ -265 632 -701 -704 519 5 -711 414 584 -741 -234 830 -423 -713 861 -22 -791 524 968
2885I68j938L50K004j486r56J906R3k032J190J016j218q43J623n68j191J548M19
$$ 968 -970 -620 1384 -102 -1058 848 941 -1091 99 1115 -103 -946 677 109 -1082 466 885
2902H85j762P33J192j538n09J832j78j794J244J295j934m01J888m40j733J666
$$ 885 -877 -144 1048 -490 -999 833 655 -1139 105 1400 -534 -935 953 513 -1220 446
2918D46P58j842R8J521r15p76J275r0j302O97J076j708j08J692m01j689J394Q42
$$ 446 1204 -638 -540 981 66 -710 565 475 -827 -130 946 -762 -870 822 421 -1268 126 968
2936I68j580m37J698m00q88R16P47j788K71J619j237q79J588M26j928P21J282
$$ 968 -612 -1049 649 249 -639 277 1024 -764 -493 1126 -111 -990 598 1024 -904 -183 1099
2953A099j332m45J429o06r54R24R60j728j27J436r67o80J004R46j896Q36J095
$$ 1099 -233 -678 751 145 -809 115 1075 -653 -780 656 -311 -991 13 959 -937 -101 994
2970I94j304r25K031P5j574L49R85r41j56J352q19j343J499K45j062K07J224j135
$$ 994 -310 -1235 796 871 -703 -354 631 -310 -466 886 67 -1276 223 468 -594 -387 837 -298
2988b98j34J006k95p95Q16N98j429KJ247m30j056J321k10j127O78R44r70l58Q10
$$ -298 -432 574 279 -516 300 898 -531 -529 718 288 -768 553 343 -784 -106 838 -132 -490 320
3007C20no49MN92q27K14Q55l45p71J104k42p20P89j94k75o59J234o5j113P23O78
$$ 320 315 -334 -330 262 -565 -351 504 159 -612 492 250 -470 319 125 -150 -809 425 360 -753 -30 648
3028F48j149k43J298j77j090O71N96j143J02J079o02j41N51j31j035N16J300j207
$$ 648 -501 -744 554 377 -713 -42 554 -589 -487 592 -10 -151 400 269 -766 -250 1050 -157
3046a57j48J140m54j031Q40P20j130k49J321l27j677J111M46j016M79P35j172
$$ -157 -305 835 381 -650 190 910 -220 -469 852 525 -1152 -41 405 -611 -132 603 -569
3063e69L38Q28o54p17J322Q3j176L56J146j327n70J310j44j130O56R41q60q68
$$ -569 -231 597 -57 -774 548 631 -545 -189 957 -370 -940 370 226 -904 -248 693 -167 -1035
3081a035J663k29j419R80J102j555J76Q08n06q35J011N85j638M65J165j152o28
$$ -1035 628 399 -1020 -40 1062 -493 -317 491 -15 -850 161 746 -892 -427 738 -414 -1042
3098a042J928k94j212P48J64o16m38J736o76r61J042L26p46m88J148l92o45P42
$$ -1042 886 592 -620 128 292 -324 -762 974 298 -663 379 705 -41 -529 619 227 -418 324
3116C24J6m76p4P10k37n66L41P78j490N64O86r37k78J134o42p08N15J037j355
$$ 324 340 -136 -210 500 263 -303 38 816 -674 -110 576 -361 -639 495 -147 -855 -340 697 -658
3135f58L45R56l68j476J208M17j151Q67M63j367j51J440n86j253J040N86l97j59
$$ -658 -313 643 275 -1201 7 424 -727 140 603 -764 -915 525 -61 -1314 -274 312 -85 -244
3153b44Q37j001l65J062n2j43k12K57o13K0O64L14j232L06P92m77k57Q94r28O3
$$ -244 593 -408 -773 289 237 94 -118 139 -474 -454 210 524 -708 -402 390 -87 -344 550 -378 -315
3173c15N94L17p50K94K38r67M30Q45j343N5J278k16q03r6P44p11j47R65l41j062
$$ -315 279 596 -154 140 378 -589 -159 686 -657 -602 676 460 -343 -439 305 -406 -553 412 71 -991
3193i91J231m8j019L12P09k21l62L94L12q97K49N23k24k00N81M31j302L86N99
$$ -991 240 192 -827 -515 194 -27 -389 5 317 -580 -331 192 -32 -232 349 780 -522 -136 463
3212D63n56m40P87k77M3L45m08p91j24J150n00p55J818l35j487J270R0m20l24
$$ 463 -93 -533 254 -23 20 365 -43 -834 -958 192 -308 -1063 755 420 -1067 203 293 -127 -451
3231d51P06l53k49N34K43r49K92R64r57p15J152K75p07k52J081m63o21L41P14
$$ -451 255 -98 -347 187 430 -519 -227 737 -220 -935 217 492 -215 -467 614 151 -470 -129 585
3250E85j291Q67K5l03o84R96L5j064J071M29j107n72J316m52k07M21K79j250Q44
$$ 585 -706 161 186 -117 -801 195 230 -834 237 666 -441 -1013 303 -149 -356 65 344 -906 -62
3269f2R51j383j75J088l67o71N26J332j827J51P54l97q31Q70M95j224J23J165
$$ -62 889 -494 -669 419 52 -619 -93 1239 -588 -437 317 -80 -911 -41 454 -770 -647 518
3287E18q74j56J179K7j587P19P83r60K20N97n61m40O83J17p32L69L49R0j221Q37
$$ 518 -356 -512 667 694 -893 -174 609 -351 -131 466 -95 -535 148 265 -467 -98 251 341 -880 -43
3307d3K51p54N39J57j16o85P11j86m04Q49p6n25N31L04r05p37J678q8j578J017
$$ -43 208 -546 -7 150 34 -651 60 -126 -530 319 243 -282 249 553 -352 -1089 589 501 -1077 -60
3327f0N85n89l88Q10n11j39P79Om74l20P64n08L89l65J33o67K20O68n06j76Q24
$$ -60 525 -64 -452 358 -153 -292 487 493 19 -301 463 -45 344 -21 112 -555 -335 333 -173 -349 475
3348D75P8j060O23k65M15p04P74m19m17O58m11k00R8P55n92j88J87M27q20N69
$$ 475 553 -507 116 -149 266 -438 336 -83 -500 158 -253 -453 -355 400 -192 -380 -193 234 -586 -17
3368a7L26o35k05k0J91k34O27M7k60K94K31m07o67J030k86p96O20N35o85k32R92
$$ -17 309 -326 -531 -551 -360 -594 33 80 -180 114 345 -62 -729 301 15 -781 -161 374 -311 -543 449
3389D49o7j060N79L02j154N71O60p77K40O59l83j087Q76J114j219j20R97j73j090
$$ 449 382 -678 -99 203 -951 -380 280 -497 -257 402 19 -1068 -192 922 -297 -417 580 407 -683
3408f83J200m0j109K60J580j185o34Q71J54j384O98Q96n58o6P68o81r16K90J312
$$ -683 517 477 -632 -372 1208 23 -611 260 414 -970 -272 624 66 0 768 87 -829 -539 773
3427G73j297k40J613o22q98P92M03j357R38K19k14l76O14L11q88P1P61p99j61
$$ 773 -524 -764 849 227 -671 121 524 -833 105 324 110 -266 348 659 -229 -158 603 -196 -357
3446c57J42O22r97N1P35r05J221K9p88j011Q12M02j1L8M41k36j097K002n88q43
$$ -357 -215 407 -590 -539 196 -709 512 541 -247 -1258 -446 -44 -55 -17 424 188 -909 1093 505 -338
3466c38J069j5k90o29O21j00j06k86K59J14j271Q41R41r74K75J26j126R68J33
$$ -338 731 716 426 -203 418 318 212 -74 185 299 -972 -131 810 -164 111 237 -889 79 212
3485B12k28l51L53J95p02O95N91j592O89M46j494Q86L14Q29r85J40k80N12o15
$$ 212 -16 -367 -14 181 -521 174 765 -827 -138 308 -1186 -300 14 843 -142 -2 -282 230 -385
3504c85L32K80R3K22M8o88J51O22j241l82J833q17j042J544j54q68l65J868j141
$$ -385 -53 227 320 542 590 -98 53 675 -566 -948 885 68 -974 570 416 -452 -817 1051 -90
3523i0q01N41M06j182R61P38j001K58O23k04n28J155j160j95P15p48O76q68J091
$$ -90 -891 -350 56 -1126 -165 573 -428 -170 453 249 -279 876 -284 -479 236 -512 164 -704 387
3542C87k53n82P62K80j509M46N22O97q98j88M52k97k93J248o87n74Q64L8J74j487
$$ 387 134 -448 314 594 -915 -469 53 750 -148 -336 116 -181 -474 774 87 -487 377 415 589 -898
3562h98J673r11r58J009Q62m98n28P60j036J28Q09K57j053M96n36j95N03K82J2
$$ -898 775 -136 -1094 -85 777 279 -249 511 -525 -397 412 669 -384 112 -424 -619 -116 166 178
3581A78p56J015n99n34J15O67J34m79l7Q34j443L72O32k12q4P1m42K09rJ83k75
$$ 178 -578 437 -162 -696 -581 86 220 -259 -296 538 -905 -533 99 -113 -197 -126 -568 -359 -368 -185 -460
3602d60k78R65o86k06J334p14n4o56J197j614J265J08p85J146r4j27q20R12M2
$$ -460 -738 227 -459 -665 669 -45 -99 -755 442 -1172 93 201 -584 562 468 341 -479 433 475
3621D75K53j214N90K13r14J186k79q43M71J95n1k81j36M03k41L43l86l27M68m54
$$ 475 728 -486 104 317 -597 589 310 -533 -62 133 82 -199 -335 68 -173 170 -216 -543 -75 -529
3641e29N42M15j12r50Q38o88N68N51o36q64J122O74j189L72M34q56K31R6J1m7
$$ -529 13 428 316 -634 204 -484 84 635 -1 -865 257 931 -258 114 548 -308 -77 19 30 -17
3661a7K92k88K67j237R49n46m18P33Q8l95J052k04j013R46k35k38L76k01M23j145
$$ -17 275 -13 254 -983 -34 -580 -998 -265 -177 -572 480 276 -737 209 -26 -264 112 -89 334 -811
3681h11J038k41j75P68qL49j535R16j144j48J572m26j200J038p0R45j628J376
$$ -811 227 -14 -189 579 571 920 -615 301 -843 -991 581 155 -1045 -7 -77 868 -760 616
3699F16o83m37P80l65K1j099J375j08q91L85O48n62%R46q61J23N7Km83O99L56
$$ 616 -67 -504 276 -89 -68 -1167 208 100 -791 -406 242 -320 -320 626 -235 -112 -55 -53 -536 163 519
3720E19o35m58J025n11k5m26J032o68n41O58R40j328M24M01j245M68N81k95k42
$$ 519 -116 -574 451 -60 -85 -511 521 -147 -688 -30 910 -418 6 407 -838 -370 211 -84 -326
3739c26N46P24j215oO38l52o09J114p28j47K34R7M01r28L72Q08j700J062Q3R8
$$ -326 220 944 -271 -277 361 9 -600 514 -214 -361 -127 -30 371 -557 -185 623 -1077 -15 68 166
3759A66q9R2m7n19O91K46l94Q78o95k50K62K46Q7n76j32Q81j308j70P83J46n41
$$ 166 77 169 122 -397 294 540 146 1024 329 79 341 587 674 98 -34 847 -461 -631 152 298 -243
3780b43M55p65K99N71j00q73J37O32n9j72j41j34L39j0M26o83R4P70o40q23J84
$$ -243 212 -553 -254 317 217 -656 -519 113 54 -118 -259 -393 -54 -64 362 -321 -227 543 -97 -920 -736
3801g36M67k22r3M56%qN63j27k48p05K57Q18p36j86L12N62m03M66k17o71J046
$$ -736 -269 -491 -584 -128 -128 -136 427 300 52 -653 -396 422 -314 -500 -188 374 -29 437 220 -451 595
3822E95J06n77n35J44M88p79J179Lj320Q54m82K0J69Q64l07r94J097j125n71P99
$$ 595 701 124 -411 -267 221 -558 621 624 -696 158 -324 -304 -135 729 422 -572 525 -600 -1171 -372
3842c72M02n92n7P71M28q03O16n26j9K74l6L43j131K74K27K23L81p5n92k42Q25
$$ -372 30 -562 -619 152 580 -223 393 -133 -152 122 86 429 -702 -428 -201 22 403 328 -264 -506 319
3863C19o78J31J10M49j144Q80M94m99p9J85J78m09J67Q6n60J69l3N61n32QN65
$$ 319 -359 -228 -118 331 -813 67 561 62 -17 168 346 -63 104 190 -370 -201 -234 327 -205 -197 368
3884C68l81L72k29J62l73K25n7Kj57K63k88k26N22l00k48L72M29r93K92K70J4
$$ 368 -13 359 130 292 -81 144 87 89 -68 195 -93 -319 203 -97 -345 27 456 -537 -245 25 39
3905C9m64M98L01p35N40N6n28M6K08j81J60j91N36p14q9J155n85k45J77N29p80
$$ 39 -425 73 374 -361 179 235 -293 -247 -39 -220 -60 -251 285 -429 -518 637 52 -193 -16 513 -267
3926b67j63J014p28J27J78r4n85L16L73k92j08O16k56k65L33j79l73O6N58J44
$$ -267 -430 584 -144 -17 161 67 -518 -202 171 -121 -229 387 131 -134 199 20 -353 -287 271 415
3946D15l56J93l18l5K32J49n97j33O41k61l2K35J42k04k33M72l69K1K58l23K72
$$ 415 59 252 -66 -101 131 280 -317 -450 191 -70 -102 133 275 71 -162 310 -59 -38 220 -103 169
3967A69m34J17L40l82M20o0l97L35J51j36K7j10l27J99L06p0l12J86K33m13L63
$$ 169 -265 -148 192 -190 230 170 -227 108 259 123 150 40 -287 -88 218 148 -164 22 255 -158 205
3988B05k91J46k77J99J21l68L4K07k08M5L99j21n77K3P15m05k07N45l02j22N3
$$ 205 -86 60 -217 -18 103 -265 -231 -24 -232 -187 212 91 -486 -463 252 -153 -360 185 -117 -239 -186
4009a86M53o53L11L01l17j60M64j89k7K2J6j54J90P5mo53M94R3n4k80K53p9j07
$$ -186 267 -386 -75 226 -91 -251 213 24 -3 19 35 -119 71 146 142 -511 -17 76 22 -258 -5 -84 -191
4032a91M71k61k53l75N75J36m58M05K93n05K91J83r17M33N42j37r3m5K4m92P12
$$ -191 280 19 -234 -609 -34 102 -356 49 342 -163 128 311 -606 -173 369 232 139 94 118 -374 338
4053C38j49j48J6N5j28j83L23P7j13j15N9j1m73O09j50m78L80rKj34J37K44j72
$$ 338 189 41 57 112 -16 -199 124 201 88 -27 32 21 -452 157 7 -471 -91 -100 -98 -232 -95 149 -23
4076b3k95M05k38j6J03L88j99j61R1p9k37K76j9k06L15q2j90l5K90k37P3K81J37
$$ -23 -318 87 -151 -167 -64 324 125 -36 55 -24 -261 15 -4 -210 105 23 -167 -202 88 -149 -76 205 342
4099C42l79p2J61j02j33K37k03JQ5L93m26N68N2o41J26j32L27k37m3M43l66k60
$$ 342 -37 -109 52 -50 -183 54 -149 -148 -63 330 -96 472 524 -117 9 -123 204 -33 -76 367 1 -259
4121b59L58j72k89N07j36j14l02O60r3m56L06j76N2P7Q2O1j15L89m95JK35J55
$$ -259 99 -73 -362 145 9 -105 -407 253 160 -296 10 -166 -114 -37 45 106 -9 380 -115 -114 121 276
4143B76o82M55J70k25l13P33l92l13M36J10l57k10M59j25p2m16P14m03J37K7n6
$$ 276 -406 49 219 -6 -319 414 22 -291 145 255 -102 -312 147 22 -50 -466 248 -155 -18 9 -47
4164d7l15M21N0l81J73K53l07j40J70r2N7L21O0l24Q0P6j21J56j05K49k37J8K73
$$ -47 -362 59 109 -272 -99 154 -153 -293 -123 -215 -158 163 223 -101 -21 55 -66 90 -15 234 -3 15 288
4187B88l28m6J19r2J65r9J65l32k3L78l51J4R0M37n41o9M08l8l51L32J99l23P9
$$ 288 -40 -86 33 -59 106 7 172 -160 -183 195 -156 -142 -52 385 -156 -225 183 145 -206 126 325 2 81
4210H1N1m40m0N65Q5m05J89m5p5k72L84k65j57K99K68m47M3O30o92Ok13J93J65
$$ 81 132 -308 -348 217 302 -103 86 41 -34 -306 78 -187 -344 -45 223 -224 -181 449 -243 -237 -450 -257 -92
4233i2l6L72l42k00L51O4m04J36J19k0j1J90l50K3K92j16j80M32j8j95P4O7q3
$$ -92 -128 244 -98 -298 53 117 -287 -151 -32 -52 -63 127 -223 -200 92 -24 -204 228 210 15 89 156 73
4256G3m09M69l43L25k40o7O3J37j63K59o3j99L01k24K44J3Ql84K15j20k62M79
$$ 73 -336 133 -210 115 -125 -192 -129 8 -155 104 41 -158 143 -81 163 176 184 -200 15 -105 -367 112
4278A12r6m2l81O66k38o5j32L49k06k73K49J52Pj55K26k13J58k91K18j41M02l7
$$ 112 16 -26 -407 259 21 -44 -176 173 -33 -306 -57 95 102 -53 173 -40 118 -173 45 -96 306 269
4300B69k87O1O1j48k68L90J98m56L81J4o0l28R7j0j69M50k3k94m82N57N36o78
$$ 269 -18 43 104 -44 -312 78 276 -180 201 215 155 -173 -76 -86 -255 195 172 -122 -604 -47 489 -189
4322a89M95l38R7k04M3J89k22K93j70J94j84J20m30J46J57o0k50M13J00j27k02
$$ -189 306 -32 65 -139 -96 93 -129 164 -6 188 4 124 -306 -160 -3 -63 -313 100 200 73 -129
4343a29j96J69L0M02l84l02L91J06J50J16J5l79k96M28l90J44M12j84l85n1M30
$$ -129 -325 -156 -126 276 -108 -410 -19 87 237 353 368 -11 -307 121 -269 -125 287 103 -282 -333 97
4364I7j10l43M86N7m03M03K16p49L31j00J34l07r4N10j43l66L35L6j3k17J72N26
$$ 97 -13 -356 130 187 -216 187 403 -346 -15 -115 19 -288 -382 128 -15 -381 -46 -10 -23 -240 -68 458
4386D58r69J156q72J8R1N57o09NL63l9j00l16K75k00K61k11O79o24K69n34j41
$$ 458 -511 645 -227 -209 -118 439 -170 -165 198 159 59 -257 18 -182 79 -132 547 -77 192 -342 -483
4407d83P66j41j073J088m88J86j91M85O95m38n90K76o43m53P71M71O8l70k60L35
$$ -483 283 142 -931 157 -331 -145 -336 149 844 406 -184 92 -551 -1004 -233 238 306 -64 -324 11
4427A1j88L90l8k95M1J97o0K3K41o2p23P53p9m54LM32l97K09k82K25J84j51r7
$$ 11 -177 213 175 -120 -79 118 58 81 322 260 -463 290 211 -243 -240 192 -205 4 -278 -53 131 -20 -117
4450a17p5L42q7k05M5k0K36n47O27o96M77r94R08L73J04m94K63l42N1O41l67l65
$$ -117 -192 150 63 -142 -97 -117 119 -428 199 -497 -20 -1014 -106 267 371 -123 140 -202 -151 490 123 -242
4472b42K09k2J03j85L73p33P36R1m63r99J256k35J07L05k0K99k87n97K67M71o15
$$ -242 -33 -55 48 -137 236 -497 239 330 -133 -1132 124 -111 -4 301 281 580 293 -304 -37 434 -181
4493a81L05j47j21K50m09M09K80l3m78O4J83K58m64M01K24j128N84n42J092n72
$$ -181 124 -23 -144 106 -303 106 386 353 -125 -61 122 380 -84 317 541 -587 -3 -545 547 -25
4513b5K21q62Q23j18L26o79k98M69L96j129O66N62j88L22l55N91m83kp7l89K39
$$ -25 196 -666 157 39 365 -314 -612 -143 253 -876 -210 352 164 486 131 722 239 237 160 -229 10
4534A0L80k13p2R41m48j024J27K6M53L47o02q74J163J88o92k03K71J74j3K75L42
$$ 10 390 177 105 1046 598 -426 -299 -273 180 527 -75 -949 214 402 -290 -493 -222 -48 -61 214 556
4555E56r54J41l61J401o54r32J229o64K83j28j74K66m33K80l92l44R08m65J7N81
$$ 556 -398 -257 -618 783 129 -803 426 -238 45 -83 -257 9 -424 -144 -536 -880 28 -437 -420 161
4575A61K9o45k45O22n29N35l67L29l26J48J65k75L32l49R27m56r91N77J39J22
$$ 161 190 -455 -700 -78 -607 -72 -439 -110 -436 -288 -123 -398 -66 -415 512 56 -935 -358 -219 -97
4595i7j92J71m48Q02j51l06K05l12L32m15L68j48r0O57m28O4q44L22L69j68L09
$$ -97 -289 -118 -566 236 85 -221 -16 -328 4 -411 -43 -191 -281 376 -52 12 -832 -510 -141 -309 0
4616@K25n60M95J74j021P11m35K01J93l35K86l4J18N35n26j79n4R14o45K10L10
$$ 0 225 -335 160 334 -687 24 -411 -210 -17 -352 -66 -100 18 553 27 -152 -206 708 63 273 583
4637E83p23n3M49k35q4k79N93j11o02N78j497K440j185j74j52J153k89o1j108
$$ 583 -140 -193 256 21 -63 -342 251 140 -462 116 -1381 1059 -126 -300 -452 701 412 351 -757
4656g57R44j33q43J356j096N29R0K25L88p54p00R78l83q9M85m65L07k17J17m6
$$ -757 187 54 -789 567 -529 0 90 315 703 -51 -751 227 -156 -245 240 -225 82 -135 -18 -64
4676f4L31n15l52Q07k88l5K40n55J50m76K80J05r7L28n05J437r82j74j69P16l30
$$ -64 267 -248 -600 207 -81 -116 124 -431 -281 -757 -477 -372 -469 -141 -646 791 -191 -365 -534 182 -148
4697a48j65M4L06n42P61q0J00J77p04L61m49R80n04k04mM74n45M68m94L0j22j36
$$ -148 -313 -269 37 -505 256 176 276 453 -251 110 -339 641 137 -67 -71 403 -142 326 -168 -138 -260 -396
4719c96M22J49k6m72J04N85l94k39l70N35R0k40L00l03l56O59j51j01k58Q09n08
$$ -396 26 175 149 -323 -219 366 -28 -267 -637 -102 -12 -252 48 -255 -611 48 -103 -204 -462 347 -161
4740a61K28q38J022p76N40m2j69R4R1j46j01K61k07l81Q60o35M38k39R0K61l94
$$ -161 67 -771 251 -525 15 -27 -196 -102 -11 -157 -258 3 -204 -585 275 -360 78 -161 -71 190 -204
$$ [...]
8191e02
##END NTUPLES=NMR FID
##END=
