##TITLE=1H_Pr 88-2
 CDCl3
 8 sc, 
 17.11.2021
##JCAMPDX= 6.0         $$ Bruker NMR JCAMP-DX V2.0
##DATA TYPE= NMR FID
##DATA CLASS= NTUPLES
##ORIGIN= UXNMR, Bruker Analytische Messtechnik GmbH
##OWNER= root
$$ XWIN-NMR		Version 3.5
$$ Wed Nov 17 12:55:31 2021 Russian Standard Time (UT+4h)  she@DPX200
##.OBSERVE FREQUENCY= 200.131346
##.OBSERVE NUCLEUS= ^1H
##.DELAY= (6, 6)
##.ACQUISITION MODE= SIMULTANEOUS
##.ACQUISITION SCHEME= undefined
##.AVERAGES= 8
##.DIGITISER RES= 18
##SPECTROMETER/DATA SYSTEM= spect
##.PULSE SEQUENCE= zg30
##.SOLVENT NAME= CDCl3
##.SHIFT REFERENCE= (INTERNAL, CDCl3, 0, 15.7039)
##AUDIT TRAIL= $$ (NUMBER, WHEN, WHO, WHERE, WHAT)
$$ ##TITLE= Audit trail, XWIN-NMR		Version 3.5
$$ ##JCAMPDX= 5.01
$$ ##ORIGIN= Bruker BioSpin GmbH
$$ ##OWNER= she
$$ F:/spectra/data/she/nmr/H-F/1/audita.txt
$$ ##AUDIT TRAIL=  $$ (NUMBER, WHEN, WHO, WHERE, WHAT)
(   1,<2021-11-17 12:54:27.45 +0400>,<she>,<DPX200>,
      <created by zg, POWCHK disabled, PULCHK disabled
       configuration hash MD5:
       00 E9 B6 7A A2 85 ED C7 34 08 36 98 17 FE 4E 26
       data hash MD5: 16K
       80 74 D3 0A 75 5C B7 C8 41 C0 AC 47 28 D5 1E B6>)
$$ ##END=
$$ 
$$ hash MD5
$$ 03 FB 94 CB 21 B0 BC 26 CC B0 26 DA FC E1 BF FD
##$RELAX= 
##$RELAX= 
##$RELAX= 
##$RELAX= 
##$RELAX= 
##$RELAX= 
$$ Bruker specific parameters
$$ --------------------------
##$DU= <F:/spectra>
##$EXPNO= 1
##$NAME= <H-F>
##$PROCNO= 1
##$TYPE= <nmr>
##$USER= <she>
##$AMP= (0..31)
100 100 100 100 100 100 100 100 100 100 100 100 100 100 100 100 100 100 
100 100 100 100 100 100 100 100 100 100 100 100 100 100 
##$AQSEQ= 0
##$AQ_mod= 1
##$AUNM= <au_zg>
##$AUTOPOS= <>
##$BF1= 200.13
##$BF2= 200.13
##$BF3= 200.13
##$BF4= 200.13
##$BF5= 200.13
##$BF6= 200.13
##$BF7= 200.13
##$BF8= 200.13
##$BYTORDA= 1
##$CFDGTYP= 0
##$CFRGTYP= 5
##$CHEMSTR= <none>
##$CNST= (0..31)
1 1 145 1 1 1 1 1 1 1 1 1 1 1 1 1 1 1 1 1 1 1 1 1 1 1 1 1 1 1 1 1 
##$CPDPRG= <>
##$CPDPRG1= <>
##$CPDPRG2= <>
##$CPDPRG3= <>
##$CPDPRG4= <mlev>
##$CPDPRG5= <mlev>
##$CPDPRG6= <mlev>
##$CPDPRG7= <mlev>
##$CPDPRG8= <mlev>
##$CPDPRGB= <>
##$CPDPRGT= <>
##$D= (0..31)
0 1.2 0 0 0 0 0 0 0 0.06 0 0.03 0 0 0 0 0.0002 0 0 0 0 0 0 0 0 0 0 0 0 
0 0 0 
##$DATE= 1637139266
##$DBL= (0..7)
120 120 120 120 120 120 120 120 
##$DBP= (0..7)
150 150 150 150 150 150 150 150 
##$DBP07= 0
##$DBPNAM0= <>
##$DBPNAM1= <>
##$DBPNAM2= <>
##$DBPNAM3= <>
##$DBPNAM4= <>
##$DBPNAM5= <>
##$DBPNAM6= <>
##$DBPNAM7= <>
##$DBPOAL= (0..7)
0.5 0.5 0.5 0.5 0.5 0.5 0.5 0.5 
##$DBPOFFS= (0..7)
0 0 0 0 0 0 0 0 
##$DE= 6
##$DECBNUC= <off>
##$DECIM= 32
##$DECNUC= <off>
##$DECSTAT= 4
##$DIGMOD= 1
##$DIGTYP= 9
##$DL= (0..7)
0 120 120 120 120 120 120 120 
##$DP= (0..7)
150 150 150 150 150 150 150 150 
##$DP07= 0
##$DPNAME0= <>
##$DPNAME1= <>
##$DPNAME2= <>
##$DPNAME3= <>
##$DPNAME4= <>
##$DPNAME5= <>
##$DPNAME6= <>
##$DPNAME7= <>
##$DPOAL= (0..7)
0.5 0.5 0.5 0.5 0.5 0.5 0.5 0.5 
##$DPOFFS= (0..7)
0 0 0 0 0 0 0 0 
##$DQDMODE= 0
##$DR= 18
##$DS= 0
##$DSLIST= <SSSSSSSSSSSSSSS>
$$ [...]
##$SUBNAM2= <"">
##$SUBNAM3= <"">
##$SUBNAM4= <"">
##$SUBNAM5= <"">
##$SUBNAM6= <"">
##$SUBNAM7= <"">
##$SUBNAM8= <"">
##$SUBNAM9= <"">
##$SW= 18.0517287032376
##$SWIBOX= (0..15)
0 0 2 0 0 0 0 0 0 0 0 0 0 0 0 0 
##$SW_h= 3612.71676300578
##$TD= 16384
##$TD0= 1
##$TE= 0
##$TE2= 300
##$TE3= 300
##$TEG= 300
##$TL= (0..7)
0 120 120 120 120 120 120 120 
##$TP= (0..7)
150 150 150 150 150 150 150 150 
##$TP07= 0
##$TPNAME0= <>
##$TPNAME1= <>
##$TPNAME2= <>
##$TPNAME3= <>
##$TPNAME4= <>
##$TPNAME5= <>
##$TPNAME6= <>
##$TPNAME7= <>
##$TPOAL= (0..7)
0.5 0.5 0.5 0.5 0.5 0.5 0.5 0.5 
##$TPOFFS= (0..7)
0 0 0 0 0 0 0 0 
##$TUNHIN= 0
##$TUNHOUT= 0
##$TUNXOUT= 0
##$USERA1= <user>
##$USERA2= <user>
##$USERA3= <user>
##$USERA4= <user>
##$USERA5= <user>
##$V9= 5
##$VALIST= <valist>
##$VCLIST= <CCCCCCCCCCCCCCC>
##$VD= 0
##$VDLIST= <DDDDDDDDDDDDDDD>
##$VPLIST= <PPPPPPPPPPPPPPP>
##$VTLIST= <TTTTTTTTTTTTTTT>
##$WBST= 1024
##$WBSW= 4
##$XGAIN= (0..3)
0 0 0 0 
##$XL= 0
##$YL= 0
##$YMAX_a= 224484
##$YMIN_a= -147921
##$ZGOPTNS= <>
##$ZL1= 120
##$ZL2= 120
##$ZL3= 120
##$ZL4= 120
##$ABSF1= 10
##$ABSF2= 0
##$ABSG= 5
##$ABSL= 3
##$ALPHA= 0
##$AQORDER= 0
##$ASSFAC= 0
##$ASSFACI= 0
##$ASSFACX= 0
##$ASSWID= 0
##$AUNMP= <proc_1d>
##$AZFE= 0.1
##$AZFW= 0.1
##$BCFW= 1
##$BC_mod= 2
##$BYTORDP= 1
##$COROFFS= 0
##$CY= 11.3945322036743
##$DATMOD= 1
##$DC= 2
##$DFILT= <>
##$DTYPP= 0
##$F1P= 2.36226072786647
##$F2P= -0.459571619588291
##$FCOR= 0.5
##$FTSIZE= 0
##$FT_mod= 4
##$GAMMA= 1
##$GB= 0.15
##$INTBC= 1
##$INTSCL= 1
##$ISEN= 128
##$LB= 0.24
##$LEV0= 0
##$LPBIN= 0
##$MAXI= 10000
##$MC2= 0
##$MEAN= 0
##$ME_mod= 0
##$MI= 1.114404
##$NCOEF= 0
##$NC_proc= 0
##$NLEV= 6
##$NOISF1= 3.799351
##$NOISF2= 2.8
##$NSP= 1
##$NTH_PI= 0
##$NZP= 0
##$OFFSET= 15.70392
##$PC= 1
##$PHC0= -15510.77
##$PHC1= 7.600809
##$PH_mod= 1
##$PKNL= yes
##$PPARMOD= 0
##$PSCAL= 0
##$PSIGN= 0
##$REVERSE= no
##$SF= 200.130013532006
##$SI= 16384
##$SIGF1= 3
##$SIGF2= 2
##$SINO= 400
##$SIOLD= 16384
##$SREGLST= <1H.CDCl3>
##$SSB= 0
##$STSI= 0
##$STSR= 0
##$SW_p= 3612.71676300578
##$SYMM= 0
##$S_DEV= 0
##$TDeff= 0
##$TDoff= 0
##$TI= <>
##$TILT= no
##$TM1= 0
##$TM2= 0
##$TOPLEV= 0
##$USERP1= <user>
##$USERP2= <user>
##$USERP3= <user>
##$USERP4= <user>
##$USERP5= <user>
##$WDW= 1
##$XDIM= 8192
##$YMAX_p= 0
##$YMIN_p= 0
$$ End of Bruker specific parameters
$$ ---------------------------------
##NTUPLES= NMR FID
##VAR_NAME=  TIME,          FID/REAL,        FID/IMAG
##SYMBOL=    X,             R,               I
##VAR_TYPE=  INDEPENDENT,   DEPENDENT,       DEPENDENT
##VAR_FORM=  AFFN,          ASDF,            ASDF
##VAR_DIM=   8192,          8192,            8192
##UNITS=     SECONDS,       ARBITRARY UNITS, ARBITRARY UNITS
##FACTOR=    0.0002768,     1,               1
##FIRST=     0,             0,               0
##LAST=      2.2672688,     0,               0
##MIN=       0,             -147921,         0
##MAX=       2.2672688,     224484,          0
$$ Real data points
##PAGE= N=1
##DATA TABLE= (X++(R..R)), XYDATA
0 0 0 0 0 0 0 0 0 0 0 0 0 0 0 8 -8 8 -8 15 -16 16 -24 25 -32 37 -41 49 -57 66 -78 89 -103 115 -131 147 -170
35 -170 190 -212 239 -267 298 -331 367 -408 451 -499 551 -608 671 -740 816 -897 989 -1091
53 -1091 1203 -1328 1474 -1634 1821 -2037 2294 -2599 2976 -3452 4075 -4925 6172 -8176 11956
68 11956 -21710 108121 224484 176940 152709 39523 -9916 -92413 -134925 -133010 -126731 -83486
80 -83486 -22818 -16525 26281 25651 -1575 2970 -20394 -29400 6804 14213 61161 100525 97102 107690
94 107690 73962 10252 -27913 -100203 -137771 -134655 -137044 -80859 -14903 26820 95254 115990
106 115990 106731 99471 44935 2885 -24419 -63522 -50217 -35634 -25493 21076 27662 23095 29292
119 29292 -9100 -32611 -44378 -67703 -48548 -28164 -5684 44021 57326 66961 74946 36229
131 36229 11640 -14317 -54675 -53495 -51500 -40459 1452 19385 40999 60144 39043 26941
143 26941 3068 -36609 -44112 -56178 -55810 -22959 -7881 18490 47964 43824 46895 35013 5816
156 5816 -3020 -23657 -33288 -19673 -21956 -6743 11837 3845 11100 6767 -13525 -12219 -21361 -23137
170 -23137 -4302 952 21180 41032 37867 46085 36147 9316 170 -26830 -45910 -43479 -52071
183 -52071 -39244 -18124 -11399 12991 23721 21718 33513 22509 14412 18296 2835 4839 8791
196 8791 -3309 4336 219 -12427 -7790 -20514 -24974 -17144 -24089 -10634 2250 2095 22325 25140
210 25140 20194 29569 15188 5968 5279 -13711 -13504 -14694 -24626 -12030 -13626 -13769 1925 -4505 1723
225 1723 12393 2823 12788 15117 6051 16185 8499 1952 8856 -5976 -5625 -3136 -16161 -6347
239 -6347 -6674 -13216 1628 -3826 -4056 8168 -2295 3573 8286 -2486 7959 3931 -3110 8052
253 8052 -3660 -3832 3762 -9354 -1794 1515 -7848 5177 2277 -1173 10567 191 2683 7597
267 7597 -5743 2144 692 -8830 3206 -3416 -5783 4879 -5600 -1318 3249 -7276 2156 -247
281 -247 -6409 5367 -2672 -1698 7433 -3533 3896 6648 -3403 6850 2799 -2976 6577 -3729
295 -3729 -2520 2745 -8231 -1 1077 -6074 6204 1596 -972 8415 -2576 -1033 1444 -9881
309 -9881 -3153 -3850 -8639 3822 -565 1285 10520 583 4335 4696 -6849 -897 -3799 -7709 3774
324 3774 440 4684 13405 4954 8516 5419 -7116 -3770 -11324 -15725 -5149 -7822 -199 10583
338 10583 6327 12582 10382 -826 315 -10018 -15182 -8225 -11959 -3081 8433 7209 16546 16118
352 16118 6463 6400 -5998 -13773 -10737 -16093 -7467 3246 5264 17745 18800 11670 11755 -3253 -14049
367 -14049 -15841 -24725 -18747 -8526 -3551 12513 18293 17484 20666 7390 -2763 -7524 -20607 -17371
381 -17371 -10792 -7401 9018 16502 17825 22836 10761 -200 -8164 -24316 -24530 -20620 -17124 2492
395 2492 14228 22225 33664 25919 16890 6726 -14628 -22912 -28851 -32574 -18571 -9505 1915 18803
409 18803 17962 18371 15706 -1194 -5587 -11403 -16043 -3734 2718 12630 27764 24251 22583 14204 -8763
424 -8763 -20111 -34554 -45456 -35431 -28507 -11644 14346 24542 38815 43391 30077 23035 4461
437 4461 -13825 -17244 -26669 -22701 -9899 -8130 4467 9519 1534 2912 -7686 -17028 -12674 -15143
451 -15143 -3472 13942 20830 37887 41659 31691 26592 3468 -19092 -30437 -48850 -47918 -37717
464 -37717 -29835 -4939 11302 20741 35086 29068 22378 17826 98 -2653 -4059 -9158 2278 4554
478 4554 4120 10527 -467 -7753 -12817 -27163 -24752 -21714 -18137 2568 12876 23203 37313 30806
492 30806 26310 17425 -3700 -12086 -23457 -31249 -21805 -19799 -9554 6337 7122 14427 15551 4603
506 4603 4252 -3503 -10044 -3440 -5721 713 10990 8777 14634 13034 2767 2151 -7422 -13909 -9678
521 -9678 -13536 -7258 1586 423 7802 7706 1316 2094 -6833 -11267 -8050 -12256 -4561 4417 5475 16459
537 16459 18790 15414 17176 7420 112 -4110 -14813 -15552 -15285 -18566 -10072 -7260 -5295 3926 3449
552 3449 6777 12164 8832 13572 14063 9506 12486 6476 -264 -1852 -12212 -16536 -17949 -23302 -18064
567 -18064 -13801 -11000 1293 6550 11273 20657 19558 21355 21294 14046 12133 5291 -4642 -6940 -15670
582 -15670 -21870 -20066 -24057 -20081 -12844 -8904 2293 9567 13641 22140 20289 18335 18062 8280 3544
597 3544 -229 -9201 -9644 -11922 -15256 -10560 -12212 -10557 -4673 -6180 -279 5351 5495 13582 15212 14577
613 14577 18249 11302 6124 2787 -9121 -12797 -15512 -20842 -14670 -11948 -7741 2606 3850 8530
627 8530 12432 6601 7700 5897 -630 2601 54 -374 4383 980 2440 3168 -3911 -2488 -5682 -10787
643 -10787 -5369 -6587 -4427 3479 2608 7466 9781 4063 5546 599 -5718 -3143 -7791 -6851 -401
658 -401 -2008 4362 7375 3291 6857 2156 -3377 -1225 -7529 -6674 -2283 -4342 2733 5448 3479 9121
674 9121 4315 756 3071 -4384 -4008 -2187 -6274 -683 -24 -1801 3807 -178 -1272 1267 -5811 -3239
690 -3239 -1149 -4363 2627 2947 2788 8575 4243 4093 4994 -2366 -1039 -2412 -6858 -1927 -3519 -2962
706 -2962 2474 -656 2097 4564 -778 2242 800 -3013 964 -2466 -2878 1118 -2882 383 1886
721 1886 -1978 2302 1520 -835 3120 -242 69 2689 -2018 1003 1151 -2436 2083 25 -1413 2221
737 2221 -1475 -929 1036 -3101 -244 -130 -2484 2500 734 651 4141 -52 452 756 -4646 -2573 -3738
754 -3738 -5816 -456 -893 934 5805 3923 5830 6141 1187 2146 -1557 -4501 -1956 -4179 -2981 1044
770 1044 -494 2254 3009 -934 365 -2782 -5031 -2248 -4120 -1533 2931 1983 5749 6703 3049 3588
786 3588 -1253 -5036 -3930 -7138 -5163 -1115 -804 4507 6640 4847 7197 3021 -988 -910 -6115 -5765
802 -5765 -2872 -4223 1011 3015 2366 5577 1941 -925 -928 -6079 -5725 -3567 -4703 806 3852 4003 8650
819 8650 5560 3046 2527 -3743 -4384 -4730 -6908 -1619 184 1104 6532 4661 3561 4025 -1913 -3122
835 -3122 -3758 -7418 -2756 -2050 -707 4855 3147 3758 4933 -1079 -1218 -3017 -7093 -3166 -3450 -1955
851 -1955 4520 3109 5904 7531 2044 3110 -219 -4725 -1999 -4732 -3847 1044 -947 2378 4186
866 4186 21 2236 -949 -4361 -1471 -4672 -3149 911 -1337 2875 4333 1225 4265 818 -1930
881 -1930 465 -3432 -2364 569 -2243 1983 2721 117 3707 495 -1182 963 -3487 -1935 -153
896 -153 -3048 1373 1248 -263 3538 585 -52 2023 -2667 -529 -270 -3514 285 -1162 -2482 971
912 971 -1988 -1020 1297 -1502 2481 3274 1831 5811 3604 2025 4078 -1054 -1335 -1164 -5003 -2814
928 -2814 -3549 -5015 -1044 -3016 -2474 758 -1859 896 2844 1239 5630 5350 4447 6915 2916 899
944 899 -79 -5878 -6134 -7050 -9535 -5368 -4451 -1750 4046 4069 6669 8821 5127 5997 3812 -132 1034
961 1034 -1774 -2555 -953 -3932 -3259 -3231 -6915 -5369 -5566 -6747 -1968 -574 2899 8669 8763 11744 11586
978 11586 6679 5006 -151 -5594 -6694 -10104 -9894 -6350 -6042 -1251 1866 1662 4750 3653 1679 2719
994 2719 408 669 2640 1356 3911 4016 1440 1938 -1827 -5739 -5941 -8949 -8172 -4665 -3381 2228
1010 2228 6138 6871 10041 7935 4584 3751 -1908 -4049 -3960 -5987 -3050 -1071 -750 3157 1786 158
1026 158 931 -3200 -3923 -3275 -4807 -1179 724 1643 6185 5008 4162 4785 -46 -1387 -2230 -5364 -2525
1043 -2525 -1830 -1018 3615 2638 2744 3724 -860 -1461 -2971 -6339 -3790 -3438 -2131 2941 2999 5071 7005
1060 7005 3109 3215 646 -3756 -2956 -5315 -5382 -1972 -2922 172 2437 304 2589 1844 -999 1171
1076 1171 -761 -14 3106 1420 3817 4721 1678 2754 -407 -4292 -3303 -7234 -6859 -4143 -4573 119
1092 119 2395 1971 6175 4601 3119 4332 368 -96 455 -2631 -123 -369 -1908 1314 -932 -1440
1108 -1440 496 -2892 -1465 -542 -2012 1632 1405 1207 4311 1971 1790 2641 -1514 -959 -1875 -4683 -1911
1125 -1911 -2696 -2401 1064 -535 835 2743 406 1949 1284 -624 1585 -309 -397 1769 -640 573
1141 573 1527 -1247 551 -66 -1918 212 -1762 -1484 75 -1786 198 688 -1263 1091 206 -714 963
1158 963 -897 -302 965 -882 897 1192 -436 1754 516 -187 1389 -562 -259 464 -1548 -11
1174 -11 -137 -1328 863 -261 -412 1212 -323 188 474 -1287 -189 -787 -1684 414 -554 -853 1193
1191 1193 -122 850 1515 -373 1034 245 -795 536 -800 -568 1065 -678 469 782 -546 597
1207 597 178 -819 729 -593 -355 1158 -754 173 646 -1054 150 -1041 -1698 -469 -1978 -1037 545
1224 545 -539 1157 1988 634 2392 1319 340 1565 -516 -416 399 -1676 -360 -397 -1901 -105 -983
1241 -983 -1208 288 -958 94 1203 -180 1421 1214 -22 1679 -412 -984 145 -1890 -941 -259
1257 -259 -1901 328 378 -277 1939 504 897 2231 137 1457 1443 -437 1383 -14 -1058 220 -2163
1274 -2163 -1751 -925 -2842 -928 -510 -1454 1505 646 867 2523 345 1105 1084 -1181 535 -431 -1390 798
1292 798 -689 -239 1237 -809 -56 367 -1267 681 -241 -882 1771 -31 776 1839 -445 680 -287
1309 -287 -2374 -555 -2260 -2317 -25 -1311 545 1771 212 1794 837 -793 889 -953 -782 757
1325 757 -481 938 1755 -7 1677 273 -721 110 -2124 -1775 -478 -1841 112 1127 196 2077
1341 2077 594 -392 779 -1874 -1145 -796 -1958 286 552 143 2309 1004 807 1316 -915 -679 -154
1358 -154 -1653 95 -30 164 2197 709 1087 1107 -1179 -773 -1182 -2619 -826 -1020 -899 1196 516 1439
1376 1439 1991 -194 -68 -329 -1882 -358 -779 -670 1545 923 1694 2170 665 675 68 -1760 -791 -1683
1394 -1683 -1359 117 -81 1136 1628 437 1062 150 -1169 -631 -1885 -1550 -269 -866 607 1539 361
1411 361 1170 496 -663 -405 -1278 -1146 33 -381 869 1761 1222 2201 1478 45 476 -1471 -1590 -1150
1429 -1150 -1918 -697 -20 -462 913 608 -339 681 -776 -797 -48 -1151 446 916 443 1970 1173 362
1447 362 1188 -740 -778 -578 -1821 -834 -594 -783 1126 870 564 1778 140 269 335 -1212 -426 -568 -987
1466 -987 387 -315 -51 800 -745 -478 -358 -1562 24 -564 -436 1639 667 1335 2425 659 1192 639
1484 639 -938 -11 -1163 -1674 134 -926 -268 773 -756 727 219 -701 318 -728 -925 523 -661
1501 -661 484 1099 -483 948 502 -660 463 -896 -574 337 -959 513 712 -265 1608 787 -100
1518 -100 920 -734 -174 210 -1292 181 296 -604 941 -141 -394 590 -1037 -178 9 -1354 366
1535 366 -365 -649 1199 -13 181 1269 -303 547 634 -639 734 53 -202 940 -392 -63 682 -892
1553 -892 271 -318 -1137 62 -829 -533 781 -557 317 783 -194 798 298 -217 367 -618 -548 488 -776
1572 -776 411 522 -424 727 300 -42 905 -188 43 712 -370 501 597 -305 579 -74 -497 73 -816
1591 -816 -590 -1 -917 162 262 -573 392 59 72 845 -154 345 634 -148 564 398 -20 868 24 -57
1611 -57 438 -413 -55 210 -921 -16 -184 -978 413 -422 -227 420 -570 10 378 -644 303 -116 -411
1630 -411 707 -167 -55 665 -181 189 562 -455 584 224 -468 768 -11 -120 823 -420 255 376
1648 376 -524 233 -329 -618 167 -602 -520 400 -605 10 104 -529 454 -182 -640 504 -582 35 856 -163
1668 -163 775 649 -75 832 -116 48 670 -715 -173 277 -1140 158 -137 -644 471 -647 -666 323 -806
1687 -806 207 211 -807 772 129 -188 806 -170 77 394 -852 337 111 -769 556 -240 -228 746 -184
1706 -184 448 597 -279 488 41 -819 315 -669 -785 29 -931 -73 134 -865 344 -115 -509 919 -287
1725 -287 160 1010 42 702 743 -234 682 -361 -187 404 -847 -339 249 -764 216 19 -623 566 -138
1744 -138 -15 707 -670 -166 247 -908 271 -82 -631 563 -575 -220 440 -499 403 542 -306 818
1762 818 352 130 1164 -252 130 371 -525 290 -156 -903 43 -501 -596 209 -734 114 282 -490 300 290
1782 290 -558 362 -485 -98 750 -429 183 277 -304 287 132 -387 759 33 181 516 -142 140 470 -118
1802 -118 344 -73 -337 318 -555 -327 -87 -831 -110 207 -761 303 -429 -279 578 -76 263 708 -68 379
1822 379 263 -416 130 -287 -476 177 -400 125 559 -41 354 326 -14 627 70 -260 418 -558 -173 104
1842 104 -998 -26 -485 -965 158 -554 -50 578 -205 481 783 302 861 616 262 1064 141 -209 297
1861 297 -837 -290 -522 -948 -110 -326 -541 307 -156 65 935 -75 727 605 72 752 -112 -382 188
1880 188 -803 -581 -237 -1201 -229 -11 -292 894 644 721 1395 336 838 707 -355 483 -217 -1146 -1
1899 -1 -1029 -955 -123 -1181 -274 -281 -767 430 157 -41 1123 41 453 950 -97 540 -54 -812 -13 -854
1919 -854 -807 140 -808 -130 613 -172 916 431 242 1035 -296 -375 329 -749 -71 -25 -833 225 -260 -532
1939 -532 462 -517 -187 378 -580 617 247 107 870 52 -93 780 -153 -107 158 -627 444 299 -255 578
1959 578 136 -9 522 -775 -241 -271 -1059 -41 -462 -793 386 -492 49 579 -161 593 571 -139 457 294
1979 294 -301 620 -445 -1 63 -570 124 -378 -567 69 -270 -272 623 -14 484 847 311 643 -46 -467 87
2000 87 -608 -795 -165 -986 -357 -288 -585 374 336 312 757 250 475 1066 81 698 430 -251 246 -290 -334 -223
2022 -223 -906 -536 -145 -537 75 161 -225 407 -86 199 557 -39 -203 373 -296 30 -13 -527 129 -82 -163
2043 -163 21 -162 162 336 -369 343 324 -172 381 22 -349 274 -172 243 205 -536 153 8 -540 33 -423
2064 -423 -506 244 -499 -118 522 -153 847 440 240 627 208 -221 573 -307 -39 -82 -421 323 -335 -491
2084 -491 365 -482 -267 537 -438 264 430 -317 507 -68 -301 370 -716 -353 -201 -1158 -314 -386 -590 321
2104 321 244 498 1155 570 822 708 210 537 -228 -545 -185 -1009 -866 -353 -1134 -290 -140 -769 426 213
2124 213 354 1144 415 970 1063 102 500 -130 -1019 -545 -1352 -1112 -484 -1067 -244 270 201 1139 987 932 1725
2145 1725 862 764 798 -671 -141 -567 -1425 -671 -1301 -1379 -570 -1327 -290 273 -112 1043 1057 831 1615 1252
2165 1252 746 1154 -180 -342 -506 -1342 -1158 -1017 -1189 25 -577 -69 988 356 1111 1113 406 896 127
2184 127 -89 86 -737 -539 -733 -1259 -738 -687 -895 -160 -433 -107 1015 558 885 1262 437 905 342 -197
2204 -197 129 -780 -481 -112 -734 -349 43 -410 144 197 94 613 237 -60 328 -268 14 82 -450 112 -36
2225 -36 -145 341 -196 199 544 180 379 570 -135 334 230 -122 75 -551 -243 -246 -553 -49 9 -215 402
2246 402 346 572 682 16 454 147 -383 -90 -437 -911 -230 -491 -705 244 -117 254 713 243 842 622
2266 622 243 615 337 129 345 -529 -454 -256 -983 -584 -598 -888 -275 -283 -97 568 220 587 629 -127 589 286
2288 286 -172 -38 -404 -401 -391 -600 -248 96 -336 164 -165 -88 804 209 456 539 72 430 127 -283 146 -341
2310 -341 -1045 -302 -969 -714 -483 -482 147 104 -79 717 131 281 658 4 291 271 -310 377 -61 -343 213
2331 213 -725 -348 159 -423 216 81 -163 634 320 180 665 -70 41 176 -524 -307 -654 -957 -43 -533
2351 -533 -227 0 -180 538 690 375 1010 321 240 723 176 180 621 -451 93 -369 -854 -286 -796 -907 -169
2372 -169 -581 163 794 82 1146 694 560 700 147 -180 115 -679 -331 -457 -661 -113 -109 -213 239 7
2392 7 -109 577 254 796 787 259 858 285 -1 172 -710 -871 -623 -1225 -796 -658 -699 99 77 454 909 325
2414 325 582 666 180 260 201 -306 110 -320 -428 187 -449 -386 -344 -432 -157 -256 50 468 392 332 698 536 294
2437 294 267 -388 -525 -471 -801 -374 -447 -180 145 -222 276 374 91 231 282 168 436 20 242 584 -49 520
2459 520 -33 -451 170 -572 -684 -177 -609 -388 -109 -7 220 139 -265 412 -48 33 471 -538 104 224
2479 224 -37 103 172 -101 270 -196 -418 55 -211 -88 303 -119 469 450 384 727 140 -217 46 -486 -666
2500 -666 -565 -733 -161 -492 -348 376 57 106 778 106 258 508 -145 430 -33 176 180 -346 -178 -147 -815
2521 -815 -270 -305 -501 421 244 612 843 263 504 487 -132 14 -509 -952 -807 -1049 -859 -13 -560 38 491
2542 491 108 1060 647 529 976 378 463 745 -210 64 -134 -977 -710 -1162 -1272 -684 -787 -28 555 59
2562 59 1064 1226 618 867 465 209 -4 -672 -751 -679 -1101 -209 -221 -223 296 -21 650 585 169 533 768 405
2584 405 734 216 40 190 -480 -221 -570 -859 -532 -560 -425 212 88 220 805 333 392 78 -422 -182 -437
2605 -437 -606 -4 -366 355 743 317 889 689 407 352 134 -194 -213 -646 -482 -391 -687 -594 -561 -727 -266 -179
2627 -179 -158 654 622 1071 1314 903 1016 563 -215 -326 -1286 -1634 -1376 -1789 -1215 -671 -36 728 1157 1198 1602
2648 1602 1460 970 738 144 -72 -279 -843 -911 -1342 -1444 -1187 -1769 -1441 -877 -629 310 734 1083 2085 2170
2668 2170 1942 2065 1019 276 -618 -1418 -1950 -2115 -2169 -1447 -1002 -352 613 503 1155 1547 1144 1053 1174 362
2688 362 697 264 -217 76 -562 -953 -1216 -1934 -1570 -1476 -1244 -155 162 1107 1957 1941 1727 1655 879 758 -316
2709 -316 -1117 -928 -1460 -1134 -804 -594 109 246 289 269 -91 -37 214 69 259 619 436 893 611 74 -63
2730 -63 -591 -1123 -657 -1213 -459 -270 -117 857 993 724 986 267 -107 -247 -856 -522 -659 -441 496 524 533
2751 533 597 61 -162 -174 -1039 -491 -440 -567 154 116 186 816 164 340 382 -294 203 -218 -383 435 227 545
2773 545 545 192 132 112 -634 -547 -910 -1400 -657 -500 292 549 506 842 887 379 448 -285 -401 -199 -696 -135 -97
2796 -97 104 603 259 -63 -86 -360 -688 130 -527 -350 342 495 613 431 390 242 -247 -569 -626 -999 -712
2817 -712 -323 -343 447 380 430 553 257 176 310 -186 -208 -39 -134 88 176 38 613 -206 52 -333 -657 -217
2839 -217 -268 -336 28 145 296 895 55 353 -90 -255 -417 -240 -523 -346 -62 -54 361 -228 440 374 69 69
2861 69 -44 -161 121 -82 84 561 7 153 180 -143 -134 -502 -534 -148 -443 -171 285 -25 444 315 -49 498
2883 498 -108 -131 78 -341 -340 2 -137 -103 194 -172 201 83 -15 275 -51 -13 131 77 160 179 -16 317 -214
2906 -214 -323 -305 -619 -553 -331 -646 94 304 186 620 21 180 457 -259 -20 103 -503 29 28 -170 530
2927 530 103 -102 83 -512 -23 -113 -537 189 -178 -212 426 -124 216 163 -112 161 -224 -268 -21 -184 72
2948 72 368 83 529 99 -162 151 -74 -212 23 -256 3 170 -130 272 430 -214 273 -203 -349 -123
2968 -123 -557 -375 55 -174 240 107 118 421 187 -225 80 -129 -143 251 15 474 449 145 216 -298 -601
2989 -601 -92 -755 -370 -285 -209 246 714 325 448 273 147 118 -686 -724 -728 -684 -48 22 194 594 469 532 468
3012 468 199 272 275 267 415 336 125 334 -172 -135 -240 -998 -739 -1133 -959 -308 228 923 1141 1405 1389 1253 193
3035 193 45 -488 -1139 -1120 -1367 -865 -731 -542 -100 184 263 361 626 461 707 646 771 1020 951 633 307 -389
3057 -389 -806 -1732 -1976 -1872 -1664 -1096 -254 337 1256 1783 1502 1815 1394 655 310 -326 -513 -785 -933 -557
3077 -557 -448 -489 -355 -85 -564 -268 -273 88 626 831 1253 1181 1123 1306 345 -174 -502 -1558 -1478 -1107 -1336 -805
3099 -805 -123 317 1073 975 804 1004 324 142 -192 -322 -43 171 -12 235 26 -54 41 -260 -548 -704 -1010
3120 -1010 -295 -352 -31 543 463 616 361 -173 -69 -553 -490 -72 -312 24 495 725 769 844 344 191 -413
3141 -413 -915 -960 -1144 -745 -225 15 274 819 708 1017 975 84 422 -113 313 112 -39 -240 -279 -457 -512
3162 -512 -827 -926 -714 -911 -227 216 579 953 1411 1519 1531 846 683 18 -593 -1002 -1280 -1692 -952 -1017 -907
3183 -907 -312 -24 289 724 341 832 1058 493 825 599 463 448 -373 -616 -725 -1141 -1040 -1039 -1146 -285 -211
3204 -211 146 768 696 1359 1342 782 740 370 -17 -96 -419 -810 -630 -997 -593 -568 -469 -38 -55 122 499 605
3226 605 552 811 372 758 519 255 53 23 -317 -241 -556 -409 -104 -261 -122 21 141 250 94 327 454
3247 454 169 353 34 -99 -147 -275 -195 -107 -418 -362 127 -36 63 67 49 201 -200 -540 247 257 28 385 260
3270 260 126 234 192 213 83 -255 59 -205 -315 -31 -151 -117 84 -306 100 86 -52 -54 -37 -170 34 -67
3292 -67 233 382 3 163 49 -44 -49 -246 -173 -306 -199 61 -4 162 288 55 -156 60 -217 -207 33 -378
3314 -378 77 -59 -220 87 171 130 225 -313 -128 64 -73 64 112 -27 194 138 396 278 -131 -238 -111 -225
3336 -225 -263 -298 -161 144 -19 -67 67 137 -105 -81 -127 17 -166 -241 73 -346 -141 124 0 375 37 -159
3358 -159 103 196 136 71 0 -234 233 15 223 -79 -39 208 -233 -65 102 -190 -156 -120 -136 201 -151 68 244
3381 244 10 205 196 -166 69 -125 -93 84 -135 -183 300 125 265 311 257 169 -90 83 -42 -196 0 43 -144
3404 -144 149 -361 -125 -59 -407 -36 -189 -412 -138 115 62 312 338 329 342 -220 -253 -292 -249 -356 -235 -220 233
3427 233 120 258 585 307 307 154 -236 -128 -265 -278 295 -139 52 49 -238 99 -102 -211 -351 -234 -59 233
3449 233 571 609 560 522 623 366 28 -339 -545 -696 -526 -816 -282 100 317 293 317 261 -29 -32 -231 -145 90
3472 90 10 211 110 223 225 -338 -301 -716 -538 -457 -402 -120 312 337 665 564 252 306 94 -337 -167 -377 -380 -217
3496 -217 -97 -92 445 244 234 69 -55 -165 -566 -421 -234 -64 -145 428 79 217 -22 -231 -14 -121 -173 26
3518 26 142 224 192 351 218 139 1 -528 -487 -888 -477 -567 38 126 289 446 596 527 508 204 293 -139 -372
3541 -372 -312 -525 -396 -135 -462 -488 -260 -336 -174 104 292 370 693 843 892 558 268 257 -610 -456 -1065 -972
3563 -972 -578 -499 -442 -164 -27 162 583 414 1133 634 710 840 376 197 293 -424 -538 -980 -1163 -692 -917
3584 -917 -639 -40 -101 430 808 807 728 858 259 430 183 -182 -216 -456 -515 -555 -636 -514 -267 -539 -70 -166 185
3607 185 651 684 1067 828 860 740 288 226 -301 -818 -680 -689 -704 -238 -397 -40 110 10 25 36 -128 -261 -135
3630 -135 61 235 127 479 667 169 -7 -27 -654 -352 -333 -452 -135 -102 256 390 251 369 224 9 -349
3651 -349 -391 -424 -127 186 232 573 456 479 116 -165 -369 -652 -1026 -630 -489 -415 198 291 398 613 427 349
3673 349 224 62 69 -49 154 -59 269 6 248 -112 -277 -517 -559 -722 -569 -142 -44 156 803 1014 901
3694 901 785 472 -88 -311 -600 -670 -582 -592 -179 9 270 57 105 37 -5 128 -214 15 -160 437 634 515
3716 515 532 92 -230 -315 -467 -678 -593 -594 -501 -134 -155 818 375 368 526 415 89 -173 -50 -395 87 -28 73
3739 73 15 7 319 11 -380 -275 -458 -50 -296 -234 448 350 327 406 -93 -18 -13 -245 -306 -213 -82 50 -75 280
3763 280 201 61 -187 132 -38 259 -122 -38 -141 147 218 392 114 284 259 114 77 -572 -402 -148 -83 20
3785 20 41 -96 131 292 71 338 -16 48 136 -65 -33 -11 -27 140 123 131 302 -99 -62 -181 -170 -115 -93 -76 125
3810 125 -162 8 271 -59 34 -37 -169 -128 -190 -232 -96 -30 21 181 185 142 185 138 379 44 -99 -54 -168 -116 209
3835 209 56 179 78 213 -67 -215 -114 -170 -92 -40 283 182 199 449 -9 39 -176 -107 -105 -280 97 -172 217
3858 217 86 -29 156 117 -42 150 64 -265 -106 -46 -95 3 96 25 279 64 29 -121 -226 -38 -94 233 67
3881 67 175 154 97 43 152 16 -118 -272 -267 -286 -82 103 -103 183 -11 70 169 30 -253 6 -255 80 117
3904 117 12 231 -58 -213 -145 -187 -226 -186 -194 13 -44 148 451 -80 317 59 138 39 -77 -262 -97 -255 -22
3927 -22 87 -162 -167 -44 80 -49 55 -98 254 40 62 233 139 388 40 -292 -268 -183 -357 -450 -302 84 198
3950 198 34 400 692 363 286 268 -123 -149 -17 -135 246 -155 8 43 -212 -180 -257 -283 -163 -372 12 162
3972 162 374 987 679 222 284 32 -9 -526 -690 -400 -265 -155 -80 11 99 184 -37 -42 -73 257 50 -140 258
3995 258 642 472 462 311 114 -185 -422 -604 -390 -262 -157 127 79 411 614 232 240 29 -93 -106 -346 -265
4017 -265 183 139 179 372 165 151 -268 -385 -434 -592 -561 -349 -150 230 340 183 337 216 144 -157 -127 -92 -223
4040 -223 -205 204 286 260 368 147 -122 125 -530 -558 -490 -256 24 161 276 546 557 306 343 -263 -348 -461 -485
4063 -485 -355 -250 -202 57 85 99 -75 -34 -46 -335 -347 144 330 388 705 709 407 337 47 -194 -692 -691 -570 -663
4087 -663 -374 -244 146 625 231 563 401 99 -2 -138 -34 -147 42 133 106 -148 -127 -403 -391 -620 -338
4108 -338 -151 -157 221 13 544 591 454 638 -33 7 -125 -438 -526 -127 -344 -254 53 233 143 -172 -164 -189 -125 9
4132 9 -10 -22 91 367 220 309 191 232 -232 -155 -260 -277 -263 -89 -13 142 -1 160 152 -66 -65 -110 31 -313 -20
4157 -20 95 -8 100 182 -19 318 -100 143 -255 59 -363 -147 -286 -174 103 15 246 181 143 250 137 -6
4179 -6 28 101 142 -102 -53 -156 -184 -115 -186 -375 -149 -224 -291 101 248 96 -51 -38 310 -24 150 196 41 -206
4203 -206 -411 -334 -97 29 3 225 150 -66 149 -81 176 126 -137 -131 -111 -108 190 -217 -133 157 -96 -284 -347 -309
4227 -309 -138 -31 -534 161 22 100 -13 156 -39 10 -42 247 -89 -33 241 42 41 79 -96 12 215 -377
4249 -377 -20 -59 161 -257 -11 8 -48 -42 126 110 -88 -134 -229 19 111 176 327 73 -194 -158 6 78 13 -173
4273 -173 1 -197 -73 -28 102 -90 121 -104 -59 231 -11 -265 -194 -165 -44 -209 65 3 -103 174 -36 -77
4295 -77 113 -22 75 190 269 212 124 75 -54 28 -128 -169 -248 -21 -199 -78 -227 -69 83 314 166 -43 -162
4318 -162 133 55 -167 43 35 193 294 -60 40 94 -50 33 78 -10 -84 60 92 225 227 212 -74 19 -231 -27
4342 -27 -125 -90 116 48 -11 231 157 -12 -52 11 -200 -207 -102 9 48 -53 -19 40 156 -8 148 -71 160 -282
4366 -282 -108 -211 189 142 25 -26 242 47 -252 165 -365 -307 -76 -150 17 148 285 335 -7 157 105 38
4388 38 -356 -173 -176 -87 100 -53 126 185 -152 150 -14 104 -133 -101 133 -102 115 464 -163 -8 79 190
4410 190 -59 -191 -298 34 -239 -150 359 128 237 226 117 -13 -135 -3 148 -99 -35 94 -141 29 29 -20
4432 -20 166 62 -381 78 -67 -54 115 18 200 -31 -50 -233 37 -68 -13 -255 -55 -36 71 42 282 161
4454 161 255 -73 60 218 103 -112 59 242 -16 -15 -34 39 13 -244 -72 -32 -87 68 -254 -39 305 -18 82
4477 82 -217 -220 149 -232 -35 -150 -182 25 -30 147 39 -192 -196 2 -54 -177 -284 -83 266 42 151 130 67
4500 67 72 -144 -185 -154 -95 -12 -50 -33 -35 63 48 107 -292 73 -4 -73 -10 -25 -62 300 259 -114 -65 80 34 -236 -103
4527 -103 -285 -143 -103 -63 -187 15 -12 10 370 -12 62 282 100 53 -32 245 50 85 116 253 41 3 -253
4550 -253 0 -153 -135 567 -48 -46 163 237 19 -122 -65 40 -53 -329 4 94 -191 -65 -145 -253 -104 -49 -30
4573 -30 121 -92 -81 256 150 335 255 175 102 -72 81 -183 -218 -28 -91 99 109 169 131 342 16 139 -42
4596 -42 2 87 108 69 -126 222 87 -67 -196 -187 -1 -88 -34 172 -113 -17 96 40 -56 6 -122 -17 -55 -19 -31
4621 -31 -6 114 -195 -45 -194 102 -59 74 191 57 -245 -96 -31 108 156 13 95 -164 7 8 -49 -184 -249
4644 -249 -28 -4 150 -221 126 279 -178 352 205 -182 -141 87 -76 64 161 262 17 -119 -30 129 -6
4665 -6 167 -78 -11 -48 -124 124 -49 -55 -48 -192 -115 88 -171 -49 224 -109 8 -55 159 70 83 -3 -78 -88 -64 -129
4691 -129 -149 -129 -163 -196 60 -112 -285 132 29 7 46 -243 80 239 -181 -10 20 -43 -67 -28 45 -48 -124 -13
4715 -13 -94 -74 27 97 273 -230 -34 -82 136 -62 -218 -73 -172 366 -183 31 -138 0 188 -125 105 250
4737 250 104 -45 -264 -132 -240 298 -80 -62 -48 -49 55 -35 -7 -45 -38 169 223 -295 10 48 -76 85 78 -12 -67
4762 -67 138 332 -41 -112 2 333 -302 141 -39 93 -4 -402 -41 -57 -155 26 80 -239 85 -250 -184 -60
4784 -60 -244 281 -99 14 55 -86 47 135 -60 -100 -68 0 -130 143 -34 105 52 120 -136 -88 -123 33 -157
4807 -157 101 -67 -138 255 -37 35 56 39 -34 -145 -159 -37 -221 56 165 -42 131 -33 40 -94 1 37 233
4830 233 -189 -77 97 -233 -33 25 -190 197 -26 -81 105 -65 -236 -95 -262 40 -73 9 305 -151 -104
4851 -104 67 -265 -136 57 -288 56 -217 142 67 156 149 -122 -17 95 -273 -168 -53 92 101 6 62 154 411
4874 411 -80 204 -103 -252 -6 -40 -83 -54 216 -41 168 -98 174 60 115 138 -16 130 -6 224 226 145 314
4897 314 154 -439 -119 101 -216 -50 428 31 -65 43 78 35 -192 -65 -2 -183 77 16 6 196 260 304 168
4920 168 137 -78 -8 18 -96 -181 184 226 156 -167 78 -191 18 185 -126 -132 -120 -70 -87 43 -88 74 17 -279
4944 -279 300 -78 -90 -22 -117 -51 -159 34 -10 68 159 438 122 68 77 -136 164 -187 -261 27 185 -288 70 93
4968 93 4 -261 -181 -82 140 55 3 154 1 80 23 -104 61 -94 -145 -208 -72 -197 -60 -162 225 135 200 242
4992 242 -10 414 -107 -245 37 -180 -150 -202 11 52 299 -13 48 136 -178 -22 154 81 88 126 216 226 149 228
5016 228 -94 -152 62 -181 -44 -103 -167 91 125 94 431 71 47 254 -225 -151 -175 -122 -154 -77 -346 43 24 -238
5040 -238 -132 -201 52 21 -75 111 36 178 277 485 218 -198 8 -194 -82 -190 -192 99 -373 -146 66 205
5062 205 314 0 -9 144 40 34 -173 129 181 -47 41 30 84 170 95 130 -2 -101 -35 -229 -74 23 301 320 55
5087 55 113 -82 121 -10 167 91 30 -104 -115 10 -69 -214 90 201 81 -46 -58 -105 -45 237 28 241 -120
5110 -120 101 114 -118 -109 287 7 -42 -87 -76 7 43 227 78 16 12 96 -312 11 149 -118 7 -1 61 -39 342
5135 342 -17 -240 117 107 61 -184 -170 -1 -105 98 -49 35 261 156 240 -204 -106 58 -412 101 -24 -140
5157 -140 330 88 121 196 93 33 99 -29 81 45 48 11 223 168 65 155 25 296 108 -4 -14 -197 171 -100
5181 -100 -21 38 141 85 44 -21 -355 -224 -47 76 -22 -29 -12 -252 98 126 3 -44 -120 -55 48 68 -139 34 19
5206 19 153 289 65 6 -18 62 111 125 251 -44 -108 -17 84 -129 -131 96 -192 29 55 322 51 -34 -142 186
5230 186 21 -26 15 -222 -162 -83 -217 -171 -121 -129 -33 107 60 -45 -104 234 131 100 -46 103 51 121 -252 -431 -335
5255 -335 -117 114 47 46 45 -130 202 79 177 192 106 86 174 -86 8 -288 -185 -49 -132 -62 24 -179 -20 134 -11
5280 -11 273 101 254 34 43 -41 -94 -114 -12 7 -329 -79 -186 -30 81 -225 177 132 45 68 166 -8 -78 -33
5304 -33 -69 -20 -191 130 56 -297 -14 1 -63 -152 14 -121 280 98 236 176 69 41 -121 -115 -234 -170 132 -123
5328 -123 126 49 104 221 208 183 126 -209 -294 54 -35 186 104 162 136 113 21 -136 14 -248 -210 -162 -4 1 -52 81
5354 81 323 205 -133 81 -148 -45 -343 4 36 -33 84 71 130 42 -2 -136 -292 -307 -208 -64 -25 123 250
5377 250 322 308 -105 -151 -83 -430 -409 -187 -172 190 402 -59 364 386 162 -270 -54 -263 -33 -246 -150 9 78
5400 78 276 -52 -59 21 -50 -326 -229 -107 40 -7 -115 335 239 35 117 110 -31 -154 -525 -127 -261 -43 -62 -29
5424 -29 118 251 193 51 155 115 -96 -38 -153 52 -90 -40 160 40 4 94 -345 -197 -198 -176 60 -35 289 237
5448 237 215 282 230 16 -340 -118 -213 -56 99 153 201 295 297 86 87 219 -87 -197 -63 -392 80 -9 -28 289
5472 289 226 17 96 102 -173 -41 111 47 -77 -161 97 -52 45 139 -113 -181 -279 37 -65 -65 113 224 44 -17
5496 -17 134 212 -59 -30 -204 21 -39 -110 -132 -16 66 159 247 158 6 242 15 57 -57 103 -116 -89 -7 -35 38
5521 38 -102 122 31 30 -205 -177 -247 -106 -72 180 343 277 -46 79 -99 -65 -82 -287 -130 -325 -261 -68 17 -73
5545 -73 -211 75 -33 86 105 -164 -92 -181 44 34 300 231 -73 -37 -108 20 -466 -157 -19 -138 -151 -147 313 2
5569 2 271 -57 -46 156 244 -22 234 -148 101 40 -60 -227 100 -299 -187 39 -288 -82 100 -293 -57 197
5591 197 91 160 -131 319 -47 -223 -66 156 -90 -47 -183 -237 -253 -121 -146 140 64 -140 70 -16 125 219 76
5614 76 317 94 28 -19 -123 -353 -213 -194 -41 139 2 113 271 399 342 41 74 131 324 -83 -54 -131 -143
5637 -143 -75 -620 -151 -66 24 112 114 122 162 312 344 53 315 12 -169 -37 -45 -279 -103 -183 86 105 -116 257 226
5662 226 19 233 201 307 68 -20 251 81 145 123 -188 -281 -100 52 146 -296 77 210 87 93 410 397 9
5685 9 302 -111 -52 -226 -67 -266 -61 -62 -86 66 132 70 36 152 -183 181 55 316 336 249 -37 7 -11 44 15
5710 15 -536 -99 -74 -97 146 200 275 297 87 45 80 -20 -142 12 -45 8 -107 24 364 98 65 227 209 -132
5734 -132 22 -283 -26 2 180 57 44 5 2 -73 61 -106 -114 -97 -21 317 224 102 105 266 -52 -132 -50 -285 -522
5759 -522 -97 -3 174 302 170 527 355 43 251 -78 -217 -107 6 -89 -63 -17 194 77 -183 -129 -317 -133
5781 -133 -140 -106 -76 112 186 177 -41 80 -243 -102 -97 -246 -449 -126 -321 -308 129 201 269 64 120 170 -68 -180 -174
5806 -174 -32 185 51 25 -43 -118 -55 -67 85 -144 -473 -224 -22 148 -66 311 146 41 326 -79 -154 -82
5828 -82 -309 -244 -331 -66 -72 -70 -60 -61 229 -102 104 54 -85 113 72 69 285 101 33 321 -26 -8 -233 -291 151 51
5854 51 116 136 201 260 274 22 82 -172 18 16 -198 -60 90 57 -69 63 38 251 -105 -92 -167 -125 71 38 99
5879 99 189 83 135 70 -39 51 -22 -69 49 4 102 40 -28 -47 -83 110 107 255 182 104 -41 -86 -51 -36 85 259 -298
5906 -298 -204 3 -103 65 -159 -173 -98 -187 -208 254 -115 -52 191 186 280 211 -60 178 -205 -216 -138 12 -38 30 61
5931 61 20 1 -223 -46 -195 -28 308 231 -53 -160 23 5 -77 -33 273 -26 26 -138 -164 -287 -125 -8 210
5954 210 177 160 101 -41 75 -185 145 -19 -206 -104 9 14 -16 -20 2 -199 -119 -26 -60 139 -5 -40 189 29
5978 29 -153 63 101 189 13 8 -259 -172 -159 15 51 172 -16 39 -117 62 136 -210 -74 -100 112 93 -85 64
6002 64 156 -51 151 -68 -210 9 -147 -162 -173 62 -2 142 13 -28 185 226 20 -60 -157 158 174 180 138 -164
6026 -164 104 2 41 -36 -22 199 92 89 87 -36 -66 -221 -127 -382 -78 -76 52 48 -64 141 164 -38 224 169 92
6051 92 -76 -31 -73 -31 -100 9 99 -88 -113 29 114 -29 -173 81 54 -5 166 62 -6 184 -268 -211 -120 -153 72
6076 72 -68 15 92 265 123 4 7 17 240 -56 -118 -37 -40 102 -369 87 150 44 78 -51 203 53 -206 -79
6100 -79 422 67 37 268 94 -13 -86 -218 -183 -121 -149 -116 -17 -103 123 444 291 439 179 86 -35 22 -232 -14
6124 -14 -67 198 -76 9 145 32 298 62 -38 -7 21 26 335 -43 -280 45 -32 -180 -481 -489 -257 -359 -115
6147 -115 288 642 193 233 429 207 336 -89 -317 -336 -213 -163 -171 -66 -249 57 230 192 111 402 343 29 253
6170 253 297 375 348 50 114 107 -178 -300 -427 -401 -193 -75 54 232 -35 243 206 207 451 257 -208 -193 -246 -363
6194 -363 -473 -296 -315 -123 -183 143 38 -58 -48 31 199 325 351 424 179 143 217 -233 -262 -241 -334 -308 -47 -173
6218 -173 -15 112 41 123 238 142 117 200 77 153 -38 252 100 -32 -75 -135 83 72 -44 -15 -23 109 119 -152
6242 -152 51 253 94 164 67 -174 -61 -326 -168 216 150 -66 -72 -26 20 -179 -184 -32 -70 31 -93 -109 -128 222
6266 222 -98 18 -23 29 281 -118 59 179 28 55 -141 -58 -76 86 -242 -172 20 47 -106 -83 -52 -125 95
6289 95 -148 197 2 194 80 -27 -266 -129 -194 155 1 -86 -266 -64 -28 227 139 358 309 100 115 -141
6311 -141 61 -355 -158 -164 30 -98 73 63 13 -33 19 41 -83 128 108 -36 90 126 184 -145 -150 172 -60 -50
6335 -50 -154 -129 -10 104 -272 218 88 -104 134 -78 54 75 87 -7 -52 -153 -31 -217 -39 79 -8 303
6357 303 131 101 -273 -52 298 19 135 29 112 280 191 68 82 -46 -171 65 -95 -85 -136 -34 -24 120
6379 120 70 222 -80 22 -53 -103 271 -191 186 9 0 161 -160 -259 81 -262 -237 -16 -61 11 -63 -130 312 19
6403 19 144 184 -26 -115 91 -104 150 33 -104 -142 -25 -104 45 212 -146 -101 9 -112 92 -86 221 51
6425 51 95 -15 -129 118 -95 -204 91 47 4 44 87 129 140 35 -81 169 56 -85 -96 -154 -53 -122 -147 -44
6449 -44 -231 141 -67 65 10 -34 237 -32 17 -76 93 -26 -112 0 -226 -6 137 121 18 189 -25 92
6471 92 -14 -125 -81 -197 99 228 243 125 258 192 124 52 -88 116 -110 138 -245 238 120 -33 -328 -131
6493 -131 217 -98 34 9 146 136 193 153 122 29 -85 6 46 -276 -132 -100 1 82 55 279 -121 38 -89 73
6517 73 119 143 67 138 67 25 88 -16 80 13 224 -25 143 -192 109 150 168 17 289 60 35 113 -100 -15 51
6542 51 -195 -120 -124 94 -77 135 21 106 103 232 287 175 42 -69 49 -49 -124 -76 -69 -235 -276 -116 4 -159 43
6567 43 102 250 72 248 215 82 21 154 -132 -318 -325 -166 -333 -297 -247 -313 179 -5 -45 159 -24 300 55
6590 55 139 -201 139 -16 -42 -114 -25 -95 20 -248 -74 -152 97 120 53 74 367 86 125 191 296 124 -175 -232
6614 -232 -140 -9 -78 -148 -69 -2 86 -88 67 -17 -221 218 33 51 91 -386 79 219 37 224 25 78 24 -199
6638 -199 4 200 53 108 108 38 14 -34 228 -73 171 78 135 -130 64 93 -83 413 245 153 -92 -152 -280 -126
6662 -126 -217 -383 -369 -191 -25 148 78 119 247 46 229 211 170 60 127 71 133 171 -166 -240 -244 -136 -291 -24
6686 -24 -122 -359 224 32 236 184 -115 -23 56 -51 -39 -185 -284 -150 -168 -329 -89 -262 10 -1 -31 109 146 314
6710 314 322 412 439 -13 124 61 14 -286 -210 79 78 -224 10 -161 117 -107 49 143 258 461 296 139 151 -111
6734 -111 2 54 -213 -374 -102 -158 -159 -310 29 -128 -36 29 66 196 58 98 121 295 -210 74 63 -225 -33
6757 -33 -122 -209 -124 65 -136 96 142 -168 -25 -8 99 -40 -72 98 147 155 206 299 19 91 -95 -32 -10 -452 -32
6782 -32 104 -286 -235 -44 -87 -76 -282 270 194 73 64 -109 80 195 139 -218 170 101 -297 -386 -156 13 -177
6805 -177 66 142 86 209 -18 135 61 87 54 147 -179 23 60 -271 33 -71 -54 -48 201 -199 -59 144 -23
6828 -23 51 -26 181 150 43 124 -39 -122 112 -95 -381 59 69 -23 -65 143 -76 -208 262 -100 -173 -19 56 -77
6852 -77 291 187 265 -18 64 31 122 -102 84 294 153 -13 122 31 -19 84 128 -195 -175 -12 -68 101 362
6875 362 18 156 -57 -80 -7 156 -147 46 -208 -93 -105 -59 136 -42 35 -43 -238 -212 -83 151 122 38 61
6898 61 17 -49 -105 85 -121 -89 -169 74 -23 149 -292 302 373 -137 -50 -14 -182 -172 -104 52 -214 69 326 164
6922 164 136 -22 152 -7 156 -169 -31 -8 0 -187 10 63 -39 47 8 254 -213 27 16 -36 66 -81 -129
6945 -129 -71 90 93 215 -112 56 -221 -155 202 80 -250 -163 -237 285 -29 37 161 -220 88 109 -124 88 310
6968 310 -130 98 96 -43 147 -31 -22 -74 130 77 -211 -179 233 -116 -193 113 -36 147 66 138 42 123 77 25 -38
6993 -38 182 66 196 64 -151 -86 -112 -236 -22 -206 181 53 5 217 -50 -226 -76 -123 51 -125 48 87
7015 87 136 42 373 212 -26 11 175 67 61 -244 132 -189 -40 28 161 -14 10 1 -22 -348 -102 83 25 79
7039 79 178 225 226 50 -198 -244 -232 -295 106 -130 -170 186 47 153 148 115 -60 207 -54 -3 -99 51 21 149 -96
7064 -96 -229 231 -63 -115 138 -135 -187 -25 -20 126 -9 14 106 244 -77 94 12 -128 -130 -178 -171 67 -145 -274
7088 -274 55 140 267 14 255 137 95 198 191 -16 -27 -316 -251 14 -241 -170 -192 -248 -188 -146 -196 -11 148 214
7112 214 289 3 72 170 -83 -180 -83 136 -127 -31 -162 -356 52 -85 153 -181 -37 260 2 31 -28 354 75
7135 75 172 -94 28 139 -284 -204 71 -180 -161 -35 -210 -68 -105 35 -118 91 132 233 105 224 488 287
7157 287 26 -228 44 36 -201 -97 -10 -220 -173 -30 -64 -234 206 272 48 352 162 -31 26 319 -73 40
7179 40 -152 76 20 -131 -244 -23 -196 -61 -149 -103 -84 -97 -101 198 -53 -52 26 49 244 45 -120 -156 -63 -192 -34
7204 -34 -203 -322 -139 -246 -90 -97 265 194 476 100 69 26 49 92 -143 20 -26 -155 -42 -73 15 -192 -111 -39
7228 -39 92 209 -62 29 84 -68 82 185 114 77 135 85 -26 -49 22 212 -153 81 106 -70 -137 57 -146 283
7252 283 125 63 -41 229 125 -96 -85 31 319 44 -222 65 28 -14 76 -142 105 7 126 -3 -148 251
7274 251 -150 134 201 -244 -55 38 8 96 72 98 -122 -47 -139 -193 -161 -331 -23 -48 -149 248 -67 93 -18 131
7298 131 92 -32 86 -108 -181 -185 -222 -149 72 -188 -35 84 27 50 -152 100 28 -144 -44 45 -8 4 -147 -94
7322 -94 124 -198 -246 65 -83 -201 -70 89 -9 -78 4 -99 -61 -109 91 -93 -186 245 -191 -162 33 -28 -140
7345 -140 -122 67 199 -60 -3 129 -216 17 21 88 103 -10 83 -239 10 -92 -124 0 43 34 202 -4 -223 225
7369 225 305 -139 62 -38 -78 28 -87 -42 27 55 64 -23 72 -46 -176 -212 278 -1 77 96 154 170 -8 209 -55
7394 -55 1 28 -80 -54 91 39 -49 146 75 -105 -35 20 -202 -160 -148 -26 108 176 92 -43 83 67 8 -142 161
7419 161 -30 -1 223 14 -231 290 -99 -40 107 -191 -10 18 -20 11 276 4 193 127 198 -157 146 -22
7441 -22 -134 -135 80 -164 -290 -112 3 133 -101 -151 -58 57 77 44 -86 -66 54 -84 181 107 201 -117 -89 134
7465 134 -8 89 76 101 198 155 -216 3 294 111 26 25 235 -98 -143 202 77 109 -144 240 -51 62 -226
7488 -226 11 -87 120 103 -17 20 76 119 54 34 -70 154 134 -148 73 46 114 135 -111 6 -47 -245 -69 60
7512 60 -222 112 8 -50 209 -112 389 351 19 -62 -311 -54 77 7 -83 31 19 -77 -19 -109 -1 -7 105 262
7536 262 47 419 85 156 -48 -14 102 188 -153 -146 -44 -187 110 130 20 -80 -52 39 186 228 -124 -25 128
7559 128 99 -84 168 -127 -48 -226 -70 -38 -35 -483 -55 162 72 76 107 85 56 77 89 77 -92 -47 -334 -93 -23
7584 -23 133 -50 125 -21 -79 -48 85 -124 -11 95 -82 159 135 166 116 100 64 -38 -185 -138 -3 -189 -202
7607 -202 47 -7 95 168 -152 193 -71 68 152 -118 152 -42 -7 159 87 232 11 -285 -18 -144 -135 -52 -114
7630 -114 28 -94 41 16 -6 85 -12 51 -266 -188 -112 121 8 23 -18 -17 114 -254 103 -106 -32 117 103 -193
7654 -193 85 -49 138 253 158 124 -84 135 120 -2 -27 60 96 -42 -20 67 -201 -163 -134 -133 93 192 -131 124
7678 124 150 123 208 305 -88 90 -66 -75 -40 -278 -190 -53 -69 -187 202 19 124 -132 55 86 332 127 -6
7701 -6 67 234 82 148 402 178 -116 -79 33 118 8 -6 -163 3 76 225 48 156 92 -26 77 -339 38
7724 38 -39 8 -3 240 -170 54 -71 67 -238 -172 -12 262 113 68 326 159 4 -51 86 188 68 -133
7746 -133 69 -107 -26 -231 -251 65 177 177 -135 -277 56 114 11 -146 99 131 285 239 218 230 -305 165 202
7769 202 -46 -133 -28 42 184 140 93 86 -10 23 -58 -89 -105 76 152 35 9 60 61 -64 -74 -129 -154 79 -147 49
7795 49 18 -4 -14 -8 -52 -98 -114 -96 100 -2 -39 -29 97 -110 187 89 -11 -1 66 -242 -156 165 -2 -128 -56 -24
7821 -24 99 117 -7 194 -44 44 -74 -24 197 -51 -323 97 -55 -241 13 56 -169 -2 -28 141 26 136
7843 136 128 106 163 -4 508 187 -167 -45 -90 -38 -113 190 -9 -179 28 -83 11 94 24 -97 -16 -132 115 140
7867 140 26 70 -133 46 -93 182 -20 -43 -258 -80 4 127 159 -234 9 -90 175 1 -146 -166 -27 -216
7889 -216 -113 -70 -96 189 -247 182 -154 -51 66 128 193 81 90 330 -33 57 -94 -175 19 -174 -111 120 9
7912 9 180 -103 122 115 208 -18 27 -14 -92 75 105 104 136 185 -74 65 126 -28 290 -26 -44 -169 7 27 135
7937 135 267 58 139 -12 5 -29 -132 -89 -171 -204 -340 243 213 -36 130 171 216 66 -168 -34 166 27 146
7960 146 -154 325 -49 228 59 -54 183 -186 -79 31 153 70 54 46 33 36 15 -121 -363 -213 -126 -91 140
7983 140 9 -294 -2 97 -9 100 43 57 57 -132 -15 44 -208 -185 194 68 -120 172 -185 -51 -165 -95 -1
8006 -1 107 244 62 233 -33 237 -30 -196 79 -117 -124 -171 122 12 96 296 -90 65 -37 81 3 8 97
8029 97 77 -216 91 -62 -162 22 26 -97 338 78 -105 -16 80 96 -60 99 -12 151 140 182 -5 -60 -69 -210
8053 -210 46 -62 166 119 213 359 -65 297 96 153 122 89 -75 158 -13 41 -141 -49 198 -109 196 -250
8075 -250 3 -90 -114 -82 25 58 -7 -4 141 67 54 4 -50 -37 -239 -255 -171 219 47 44 119 207 25 -135 -246 80
8101 80 61 147 -227 40 84 131 19 -74 -120 27 146 117 16 265 92 -145 213 -128 -107 -177 192 -119 -152 -37
8125 -37 6 96 26 197 145 -2 211 279 -230 -13 54 -8 -156 -165 73 -135 177 -208 -200 -266 182 -210 171 -78
8149 -78 44 20 105 101 191 -43 33 9 -50 -188 -183 -15 215 6 -161 -160 179 231 -11 47 33 -80 126 83 103 -29
8175 -29 -129 -25 -237 93 123 -91 -172 126 -57 65 -187 -49 32 -56 125 200
8191B00
$$ Imaginary data points
##PAGE= N=2
##DATA TABLE= (X++(I..I)), XYDATA
0 0 0 0 0 0 0 0 0 0 0 0 0 0 0 0 0 0 8 -8 8 -8 8 -13 16 -16 20 -24 26 -32 36 -40 47 -54 61 -69 77 -89 99 -110
38 -110 123 -137 152 -168 190 -208 231 -257 282 -310 342 -376 415 -457 504 -556 615 -681 755
57 755 -842 944 -1061 1205 -1379 1604 -1894 2293 -2877 3816 -5558 9899 -43663 -30265 104612
72 104612 142251 190552 191028 137467 92292 23723 -40788 -52380 -88738 -72599 -33983 -31621 288
85 288 6704 -26810 -26398 -58759 -75345 -49140 -41940 6983 69163 93217 137779 136249 95568 65138
99 65138 -12081 -76726 -105684 -147921 -130009 -87173 -54239 16652 59212 75654 95206 63439
111 63439 35084 12514 -33528 -31578 -23820 -23685 19481 34765 35688 47993 16388 -10299 -31877
124 -31877 -69611 -66194 -59156 -47879 2340 25968 47154 74401 54572 38588 17266 -27227
136 -27227 -38486 -50245 -53964 -20740 -3147 22626 54720 48559 47597 32895 -7048 -21781 -45099
149 -45099 -61739 -43052 -35088 -13337 20409 27217 41302 41689 20749 16048 -4225 -20558 -11081
162 -11081 -17796 -8854 10891 5584 12624 10708 -9610 -13514 -28673 -38501 -25601 -24260 -4279 23331
176 23331 29533 49730 54956 38061 34319 10188 -15050 -21811 -41995 -43028 -32589 -34151 -14033
189 -14033 -2347 -1509 15012 10992 7537 17387 6356 9972 18342 8987 17761 16272 3748 6641
203 6641 -8579 -18988 -16837 -30837 -24367 -13965 -17342 3155 12105 11450 27706 21515 17150 20677
217 20677 3417 2121 -912 -15952 -7850 -13233 -19305 -6407 -13884 -11297 455 -7664 2840 8732
231 8732 1993 15449 11770 7107 16381 3786 3021 6498 -8931 -2032 -3091 -13192 -894 -6252
245 -6252 -8448 3458 -6122 -711 5464 -4796 6558 4274 -2709 9727 -484 -2650 5753 -7966
259 -7966 -2912 435 -9733 1914 -305 -4064 8890 -183 2342 9872 -3361 4188 4468 -6080
273 -6080 4867 -1070 -4691 5865 -4419 -1297 3895 -7356 1223 -492 -8360 3410 -4089 -5356
287 -5356 5139 -5619 576 5432 -4100 6036 3745 -1930 7889 -1349 -1515 4915 -7054 -386
301 -386 1098 -6819 4892 2122 -677 9756 623 1367 4744 -7569 -2191 -4068 -10904 400 -3370
316 -3370 -2200 8499 312 3965 5846 -5980 -1648 -4751 -10832 -423 -2962 1376 12258 6696
330 6696 12208 12262 -159 1911 -6110 -14442 -7320 -11320 -6049 5550 3845 12241 13463 4081 5738
345 5738 -4841 -14100 -9973 -16269 -10868 973 1108 12624 16684 10443 11932 856 -8962 -9334 -18401
360 -18401 -13801 -3819 -1729 13023 19711 16790 20476 9002 -3264 -7901 -21611 -21846 -16331 -14223
374 -14223 1978 10887 13865 21998 13665 4311 -344 -15961 -18697 -15707 -15737 -100 10383 15736
388 15736 26158 19797 11122 3651 -16160 -22771 -25167 -28858 -13003 -535 10497 28958 30504
401 30504 28191 23933 4083 -6904 -18026 -30144 -22835 -18533 -11045 7280 10042 13918 15346 762
415 762 -4896 -12675 -21735 -12705 -7059 4243 24853 29187 35545 34898 15211 3121 -16626 -37906
429 -37906 -39483 -43117 -35270 -12633 -556 19033 33545 30583 32231 20434 3135 -772 -14001
442 -14001 -16196 -6558 -7226 3446 10226 2868 3747 -8031 -21624 -22483 -31156 -24351 -7297 2320 25580
457 25580 41313 42780 48382 33946 13967 -369 -26406 -37668 -39381 -43126 -26602 -13057 -3436
470 -3436 15214 16056 15498 17116 3450 1185 1017 -4598 6598 10880 12339 20931 12587 5401 -1527
485 -1527 -20895 -25459 -29512 -34078 -18217 -8301 4265 24693 27894 31946 31334 14660 7484 -6011
499 -6011 -20514 -17377 -21341 -16918 -2968 -1321 6952 11566 3412 4358 -2989 -11501 -7057 -10697 -5505
514 -5505 5511 6084 14340 16717 9199 10518 1039 -7401 -5496 -11614 -8698 -570 -1003 7215 9067
529 9067 3783 5677 -3696 -11128 -10282 -17899 -14304 -6673 -5318 6641 13505 14943 21283 16653 12022
544 12022 10434 -1658 -4981 -7082 -15203 -11744 -12404 -14199 -7271 -8435 -5498 1509 547 7366 12793
559 12793 12084 18391 17607 13504 13540 3718 -3149 -7410 -18263 -19459 -20180 -23450 -15884 -11777 -7379 3651
575 3651 6836 13816 20773 18999 22945 21414 13280 12036 2915 -6896 -10207 -19298 -22073 -21190 -23065
590 -23065 -14933 -8517 -4010 7578 11124 13964 19853 15496 13950 12718 4268 3317 -904 -7253 -5794
605 -5794 -10588 -13121 -10296 -14493 -11743 -7097 -7156 2011 7188 10151 19435 17695 15959 16216 5543 641
621 641 -4926 -14314 -13439 -14873 -14405 -5758 -5136 -692 5773 1903 4269 4442 -1137 2533 579 223 6484
638 6484 3806 5901 8690 1103 1844 -1216 -9120 -6115 -8924 -8228 -1427 -1723 3966 8631 4626 7491
654 7491 4385 -2969 -833 -6727 -7483 -2327 -4895 921 5708 2662 7703 4907 -461 1092 -5783
669 -5783 -6684 -3855 -7331 -1311 2158 452 7748 5442 2750 5530 -797 -1361 -13 -4871 -65 502
685 502 -1771 4571 552 -1121 1886 -5194 -4379 -3125 -7538 -1495 -857 -960 6435 4104 4829 7668
701 7668 923 2215 1086 -4698 -1118 -3243 -4099 1305 -1662 547 4155 -649 3088 1763 -1967
716 -1967 1779 -1792 -2771 1141 -3283 -1146 1097 -3183 1069 543 -1985 2883 -484 -355 2765 -1675
732 -1675 928 1776 -2036 2129 894 -1227 3073 -517 -560 1427 -2832 -516 -777 -3283 1640 558
748 558 545 4899 1864 2456 2897 -2643 -1554 -3954 -7289 -3592 -4696 -3073 2223 1449 4421 6583 2844
765 2844 4200 1492 -2261 -392 -3081 -2831 1272 -329 2503 4003 566 1972 -1296 -5045 -3292
780 -3292 -5995 -4861 -156 -621 3696 6456 4145 5867 2328 -2051 -2235 -6894 -6927 -4107 -4333 803
796 803 4241 3774 7394 5661 1651 2104 -3396 -4421 -2536 -5002 -689 2126 2083 5924 4334 1269
812 1269 1608 -4648 -5852 -4951 -7659 -2941 250 1079 6652 6141 4589 5498 -521 -2240 -3046 -7299 -3690
829 -3690 -1888 -1484 4966 4461 4490 6302 746 -442 -1665 -6368 -3474 -3468 -3065 3351 2349 3643 6051
846 6051 730 651 -1111 -6712 -4344 -5433 -5253 686 377 3456 6938 3222 4647 2593 -2566 -346
862 -346 -3537 -3937 181 -1654 1725 4355 1167 3599 1249 -2953 -858 -4653 -4556 -758 -3143 571
878 571 3225 438 4078 1756 -1178 1468 -3058 -2580 334 -2873 843 1969 -233 3906 1477 -63
894 -63 2286 -2287 -1519 -150 -3489 339 472 -745 3519 800 583 3096 -1260 447 1150 -2480 718
911 718 -589 -2826 42 -3394 -3196 -958 -3956 -387 1124 -237 4451 3814 3305 6264 2345 2432 2719
928 2719 -2070 -27 -1150 -4008 -843 -3620 -4184 -1917 -4921 -3089 -1135 -2593 2365 3782 3986 8600
944 8600 6642 5755 5992 -136 -1395 -4116 -8970 -7004 -7907 -7396 -2060 -1609 1642 5412 3934 5867
960 5867 5282 2721 4741 2286 1630 3658 907 654 421 -4444 -5255 -7647 -10580 -8279 -8393 -4953 1057
977 1057 3390 8386 11974 10100 10877 7163 1978 156 -4865 -7009 -5727 -7339 -4548 -1488 -2510
992 -2510 1208 845 -936 1055 -1028 -473 2388 1660 4574 6780 4926 6055 3135 -1357 -2655 -7567
1008 -7567 -9276 -8075 -8515 -4063 -152 1996 7089 7208 5970 6265 2043 -472 -1116 -3968 -2109 -721
1024 -721 -837 3180 2727 1631 2567 -1603 -3438 -3306 -6464 -3905 -2339 -1931 3304 3758 3856 5773 1886
1041 1886 478 -278 -4366 -2623 -2343 -2381 2619 2400 3347 5657 1693 900 -789 -5501 -4319 -5343 -5229
1058 -5229 -155 -114 2898 6641 4297 5165 3641 -632 -93 -3204 -4691 -1881 -3819 -1619 920 -1240
1074 -1240 1134 346 -2359 -127 -2172 -2034 1689 454 3640 6023 3975 5861 3861 132 31 -4503
1090 -4503 -5751 -4688 -7111 -3925 -1560 -2112 2596 2600 1932 4286 1191 1446 1991 -1610 557 690 -1015
1107 -1015 1915 2 -937 768 -2435 -1920 -1328 -3825 -383 20 -304 3886 2460 2452 4550 897 1063
1124 1063 228 -3216 -1118 -2507 -3465 -180 -1826 -806 1341 -760 1044 1219 -917 1326 -397 -514
1140 -514 1917 -289 806 2042 -301 1420 541 -965 1009 -797 -1032 905 -1465 -129 696 -1572
1156 -1572 413 -125 -1347 726 -1029 -575 752 -1443 255 499 -773 1497 425 114 1929 -237
1172 -237 212 1256 -1171 212 69 -1376 608 -310 -238 1490 -251 106 1031 -932 261 -231 -1623
1189 -1623 76 -1160 -1156 357 -727 97 1114 -547 948 539 -914 953 -473 -891 918 -593
1205 -593 579 1125 -318 988 364 -630 694 -703 -418 1365 54 888 1228 -396 740 -390 -1843
1222 -1843 -311 -1896 -2024 -584 -1890 -193 724 -125 1652 1216 742 2283 515 473 1534 -423 287
1239 287 245 -1253 316 -848 -1485 185 -1737 -769 511 -806 1139 1369 441 2065 637 -99 1170
1256 1170 -1472 -819 -464 -2337 -593 -825 -1773 681 -392 -77 1638 -268 1075 1944 319 1989
1272 1989 1322 269 1903 -372 -939 -94 -2748 -1313 -1237 -2337 233 -600 -361 1966 81 823 1615
1289 1615 -878 985 118 -1025 1006 -399 -106 1475 -968 67 230 -1921 130 -568 -1041 1326
1305 1326 164 863 2599 174 1405 1253 -1200 -144 -1713 -2250 -588 -1607 -404 818 -678 1441
1321 1441 928 -808 1021 -707 -1358 686 -941 665 1770 514 2453 1255 79 882 -1276 -1644
1337 -1644 -591 -2231 -346 542 -360 1866 1263 287 1471 -1180 -1224 -622 -2367 -673 -279 -818 1300
1354 1300 754 546 1481 -482 -485 -76 -1939 -383 -154 -262 2222 1330 1377 2231 190 269 -342 -2546 -956
1373 -956 -1411 -1920 662 236 840 1755 218 458 -247 -2131 -875 -1262 -1341 486 139 902 2197 984
1391 984 1557 846 -961 -354 -1209 -1596 -34 -679 434 1640 670 1496 1047 -714 -102 -1235 -1651 -368
1409 -368 -1011 -92 1163 497 1244 514 -531 159 -1414 -2108 -609 -1742 96 1180 994 2299 2151
1426 2151 1288 1685 86 -679 47 -1371 -742 56 -806 652 432 -142 400 -844 -978 -513 -1585 -463
1444 -463 132 -220 1667 1486 890 1803 281 -29 -78 -1879 -894 -934 -1581 542 142 369 1694 289 541
1463 541 1140 -706 243 -119 -794 453 91 69 972 -531 -302 -352 -2044 -831 -1338 -1827 442 -89 634
1482 634 1733 826 1476 1264 -123 691 -566 -1406 203 -772 -27 913 -747 711 394 -880 659
1499 659 -626 -1274 289 -945 61 889 -591 807 652 -639 753 -761 -902 216 -1291 -28
1515 -28 453 -459 1298 631 12 1377 -363 245 435 -1185 340 389 -836 759 151 -95 1103 -838
1533 -838 -406 149 -1614 -165 -753 -1023 724 -103 -110 1028 -301 570 295 -619 620 236 -161 1369
1551 1369 -41 364 1118 -340 805 155 -1260 340 -600 -1064 227 -521 -120 497 -554 515 83
1568 83 -197 569 -306 -356 517 -614 -187 156 -642 363 170 -410 782 -128 -44 786 -360 355 552 12
1588 12 931 395 -41 683 -663 -786 94 -1087 -376 -177 -896 44 -249 -120 775 -162 170 589 -569
1607 -569 95 274 -471 842 523 66 1000 19 -109 531 -660 31 138 -720 251 5 -559 478 -360
1626 -360 -205 321 -850 263 -340 -615 -113 -421 -304 477 -252 -23 460 -378 453 215 -603 629 -61
1645 -61 -39 747 -105 449 433 -661 409 150 -403 789 -401 -389 444 -736 -16 63 -712 622 -78 -625
1665 -625 437 -686 -416 594 -559 204 542 -339 828 229 -69 1042 -573 188 615 -660 439
1682 439 17 -642 397 -726 -442 511 -848 -102 214 -821 574 -194 -388 812 -726 -100 567 -897
1700 -897 24 67 -699 463 -144 -290 724 -176 475 1015 -267 780 520 -328 687 -288 -181 561 -864
1719 -864 -108 55 -947 205 -244 -1144 244 -644 -275 488 -465 646 689 -202 933 343 -137 801 -508
1738 -508 -82 629 -746 507 380 -492 750 -7 125 787 -328 32 404 -649 299 -46 -585 266
1756 266 -743 -330 322 -836 -59 227 -645 515 294 7 938 22 230 888 -368 350 188 -423 450
1775 450 -238 -584 445 -377 109 282 -774 358 134 -231 405 -92 -332 427 -523 156 53 -405 463
1794 463 -224 -335 337 -152 -18 496 -244 641 655 42 590 241 -382 305 -158 -242 263 -568 -125 -137 -700
1815 -700 -151 -392 -568 349 -80 -131 707 -465 245 475 -417 425 -198 -336 417 -475 -143 620 -447 304
1835 304 446 -242 818 295 100 895 52 -35 507 -323 381 -193 -520 -259 -711 -1030 61 -1203 -305
1854 -305 479 -248 873 610 206 1210 421 233 761 -514 -19 -23 -877 154 -251 -520 162 -579 -176
1873 -176 470 -275 521 627 -5 1084 647 12 753 -546 -429 -168 -1345 -556 -853 -1025 118 -355 -3
1892 -3 972 285 1038 1238 3 978 708 -144 561 -687 -477 261 -988 -325 -453 -1139 -5 -421 -671
1911 -671 508 -22 462 1132 153 840 541 -462 457 -571 -869 47 -1037 -452 161 -552 631 335
1929 335 -88 1261 59 57 736 -252 166 319 -721 339 -210 -620 167 -762 -361 245 -918 -307 212
1948 212 -459 920 36 -32 890 -350 -29 329 -732 196 281 -359 960 196 600 1060 -159 235 290
1967 290 -616 35 -641 -732 -158 -650 -549 321 -425 388 286 -425 472 195 3 880 -58 240 658 -419
1987 -419 115 -167 -873 169 -591 -312 439 -433 554 566 197 658 587 274 768 -131 -395 21 -815 -554
2007 -554 -429 -922 -187 -297 -340 455 -57 138 937 290 381 741 315 608 196 -234 156 -218 -415 31 -1053
2028 -1053 -137 47 -370 58 -81 -234 484 -347 -143 278 -276 65 92 -564 146 -78 -517 251 -395 -137
2048 -137 447 -361 465 436 -451 414 44 -68 680 -236 132 213 -406 398 -299 -381 238 -276 -489 104 -821
2069 -821 -486 56 -382 162 176 -132 661 171 232 329 -28 64 201 -157 476 -75 -406 262 -290 -289 315 -563
2091 -563 403 233 -128 948 330 268 705 -80 -143 75 -880 -569 -745 -1135 -160 -588 3 787 49 945
2111 945 1002 217 1182 586 223 625 -537 -575 249 -1163 -597 -393 -942 -438 -553 -325 626 117 765 1375
2131 1375 594 983 676 -92 364 -1016 -954 -744 -1458 -1147 -555 -947 357 360 229 1338 1027 1095 1483 650
2151 650 973 646 -225 169 -1067 -1173 -917 -1622 -1362 -999 -1175 -261 143 227 1350 1062 1165 1859 642
2170 642 577 506 -637 -277 -817 -1366 -626 -1223 -890 243 -341 572 724 470 1167 686 572 1076 353 251
2190 251 34 -681 -735 -751 -1132 -791 -1094 -840 178 -239 215 645 413 972 999 372 755 84 -141 -67 -410
2211 -410 -349 168 -234 -175 18 15 379 203 86 446 -485 81 108 -506 -201 -43 -472 219 -391 -336 86 -146
2233 -146 352 384 43 556 369 -93 459 -284 -206 62 -600 -145 81 -589 -32 344 373 805 199 344 663
2254 663 -92 55 47 -758 -170 -742 -731 -258 -720 -320 7 -123 297 333 596 1062 871 460 830 222 276 215
2276 215 -540 -342 -615 -868 -699 -508 -577 165 -111 418 583 220 721 523 231 335 -2 -60 194 -676 -240
2297 -240 -88 -590 -31 -271 -362 274 -170 269 866 299 720 765 417 751 -102 -235 495 -958 -503 -538 -1103
2318 -1103 -245 -202 -387 268 -8 -71 834 -78 645 482 -66 514 118 -202 367 -477 -521 -84 -726 35 -69
2339 -69 -385 252 88 307 888 339 422 752 -179 176 -72 -816 -27 -739 -599 -175 -635 -118 -83 -228 230
2360 230 109 91 482 283 532 969 108 450 318 -367 153 -670 -685 -688 -761 -501 -160 -371 483 492 516 1133 281
2383 281 -20 272 -35 -330 -320 -639 -46 -449 -612 -263 -514 -470 65 -186 504 704 336 1094 964 420 788
2404 788 220 -16 -265 -1027 -624 -895 -1128 -665 -612 -388 192 346 124 686 144 493 434 97 466 49 55
2425 55 235 -208 -150 -197 -584 -461 -382 -627 30 105 548 775 604 645 591 -4 90 -45 -523 -371 -686 -524 -256
2448 -256 -464 -284 146 -59 142 -124 -316 440 29 32 489 89 426 656 -151 191 83 -392 -193 -547 -501
2469 -501 25 -417 213 110 -92 385 176 -80 111 -214 85 -77 -155 247 282 196 576 -302 -326 -323 -559 -427
2491 -427 -325 -360 157 215 137 734 305 108 141 -408 -231 -124 -670 -55 -134 -587 -178 -348 -144 81 -352 386
2513 386 155 -73 647 287 16 586 -340 -60 197 -582 -124 -364 -964 -54 -193 -4 594 223 599 1211
2533 1211 463 588 217 -390 -102 -828 -667 -547 -984 -526 -384 -574 145 130 179 659 637 774 1006 663 672
2554 672 517 -235 156 -811 -603 -697 -1365 -779 -164 -317 414 766 533 1167 662 375 573 73 127 -30 -1158
2575 -1158 -474 -575 -856 -154 -373 -474 93 -43 370 658 204 1012 517 342 702 177 185 -128 -711 -349
2595 -349 -820 -869 -207 -43 199 440 101 493 362 -269 75 -390 -717 -653 -697 -248 -23 294 647 811 684
2616 684 726 397 319 337 69 -81 65 -404 -237 -583 -848 -715 -662 -648 -208 -169 549 1212 1412 1359 1405 978 895
2639 895 -21 -645 -1096 -1750 -1728 -1530 -1279 -562 45 317 890 1209 1231 1704 1034 953 749 477 497 -88 -689
2660 -689 -683 -1328 -1850 -1783 -1924 -1455 -776 -440 798 1373 1782 2444 2228 1879 1379 -5 -297 -952 -1934 -1765
2680 -1765 -1510 -1529 -898 -576 -282 402 -3 655 767 599 1254 1134 1117 1073 274 224 -144 -1126 -1412 -1805 -2204
2701 -2204 -1596 -1246 -425 574 994 1451 1868 1284 1346 786 137 55 -566 -837 -346 -676 -89 -10 -191 96 -480
2722 -480 -426 -165 -564 -171 526 113 826 1064 618 689 200 -453 -408 -1145 -1024 -571 -633 253 370 720 999
2743 999 495 321 269 -507 -294 -612 -674 -50 187 355 934 388 284 255 -495 -173 -474 -704 -251 -164 -175 590
2765 590 190 290 401 -347 0 -323 -432 1 169 321 912 477 684 700 -161 10 -418 -951 -760 -1042
2785 -1042 -449 138 -72 647 898 245 400 165 -163 -15 -520 -326 -24 -117 414 312 -130 208 -234 -501
2805 -501 -516 -559 -263 -45 62 778 713 592 682 77 -45 42 -883 -850 -530 -529 -129 -65 161 281 234 189 235 -125
2829 -125 -336 -128 -336 247 171 287 720 46 256 -53 -509 -174 -544 -636 -129 -139 34 400 161 322 432
2850 432 -82 36 -216 -308 -392 -411 -392 -45 -10 332 292 -116 115 199 -40 26 -65 -227 339 295 263 183 49 151
2874 151 -236 -485 -327 -546 -627 -276 -368 248 229 43 589 177 -146 240 -116 16 -118 -276 67 137 -181
2895 -181 278 84 -217 130 -44 66 171 -138 225 541 0 454 37 -45 76 -462 -563 -152 -705 -12
2915 -12 26 -487 308 240 164 538 190 207 144 -118 180 -99 166 505 -159 97 302 -355 38 -68 -244 -67
2937 -67 -247 -255 226 -217 -64 249 -177 -6 -278 -259 31 -73 -156 275 -169 231 356 -49 240 -55 -350 176
2959 176 -262 -355 213 -35 -17 284 172 514 208 -403 207 -353 -399 -46 -275 81 85 -247 158 -93 -179 6
2981 6 -335 -114 -202 -62 472 494 219 599 137 -130 -56 -582 -462 -168 -374 125 419 276 676 646 357 561
3003 561 -281 -337 -542 -905 -397 -274 -369 277 -169 145 111 -11 181 -156 95 483 417 431 710 369 324 93
3025 93 -572 -662 -1052 -1382 -934 -1047 -40 437 849 1256 1654 1169 897 325 -349 -277 -998 -863 -677 -824 -586
3046 -586 -544 -447 -529 -252 -265 405 489 778 1093 1206 1353 1248 976 575 -180 -1147 -1606 -1814 -2027 -1488 -1046 -482
3068 -482 525 783 1490 1294 1298 982 499 27 -19 -414 39 -159 -329 -175 -656 -959 -575 -1040 -675 -402 -283
3089 -283 905 1252 1325 1892 1567 902 597 -375 -671 -1063 -1652 -1278 -836 -750 137 128 698 791 272 372 298 -87
3111 -87 13 -31 -31 556 379 602 550 86 -85 -296 -840 -672 -694 -299 150 378 480 629 431 52 -639 -701
3133 -701 -365 -805 -289 160 490 887 1353 895 729 514 -199 -281 -849 -1149 -836 -783 -117 194 251 651 543
3154 543 637 614 255 591 499 203 389 267 104 128 -668 -1002 -1180 -1534 -1545 -705 -952 279 617 1026 1730
3175 1730 1535 1513 1548 730 212 -116 -965 -681 -1265 -993 -901 -812 -591 -366 -315 207 453 503 1007 1069 1102 898
3197 898 619 402 -29 -627 -585 -931 -1260 -910 -932 -618 -196 -104 560 847 730 1178 994 983 435 228 29
3218 29 45 -313 -597 -644 -906 -438 -664 -518 -258 158 104 439 230 672 738 347 586 231 -29 -40 -299 -163
3240 -163 -246 -425 -376 -277 75 -5 -165 101 399 -50 95 58 41 360 45 -286 -62 -391 -185 -111 -93 -14 170
3263 170 -111 33 48 -134 41 -87 -63 51 -174 160 244 136 163 174 -46 91 -196 -133 -126 -94 31 -67 -138 -150
3287 -150 -91 -136 42 -338 186 -108 -199 68 390 179 392 250 -92 122 -152 -181 -151 -424 -62 -82 -25 251
3309 251 -165 170 312 -20 46 267 -194 196 -336 -150 156 -266 78 205 -14 -84 -43 -152 -115 112 -196
3330 -196 276 -116 385 215 107 118 186 -398 -172 -410 -355 -74 127 -172 396 105 95 324 -39 38 -270 -153
3352 -153 293 -132 176 -113 -374 224 -126 -29 54 -57 91 222 -119 93 324 -307 -123 120 -158 204 -110
3373 -110 64 -87 -217 16 71 65 -226 -248 -174 119 -21 75 263 204 237 85 -232 -45 -291 -3 -40 -158 169
3396 169 177 67 -24 188 -11 43 163 14 141 -36 224 -7 93 246 74 -141 -128 -592 -258 -80 -36 262
3418 262 259 468 341 136 -4 86 -115 -554 -278 -435 -140 -76 234 414 296 116 424 31 -36 -160 -70 154
3440 154 97 206 372 225 36 -65 -366 -531 -513 -785 -313 50 -45 390 414 596 819 282 120 156 -674 -392
3462 -392 -357 -545 -146 25 24 65 148 114 -19 -261 -90 -129 358 377 295 209 209 134 291 -448 -434 -428 -781 -349 -251 -334
3488 -334 223 660 485 549 331 7 -4 -356 -116 -221 -291 -21 -13 -1 273 391 261 -15 -374 -78 -27 -341
3510 -341 -73 47 58 178 -85 -49 -198 -168 -159 -112 -35 140 439 362 495 413 181 -63 -192 -461 -507 -739 -580
3533 -580 -333 -147 401 50 450 527 300 408 554 -6 -98 -90 -248 -320 -418 -593 -382 -577 -559 -356 -247 -4
3555 -4 547 524 990 898 822 735 309 -48 -179 -586 -581 -812 -1009 -562 -1056 -489 -309 -223 202 453 393 668 920
3578 920 883 665 548 258 51 -591 -914 -1108 -1176 -668 -765 -380 -31 228 466 625 631 885 592 687 521 274
3600 274 4 -12 -263 -376 -676 -874 -835 -923 -670 -536 -155 477 784 798 977 591 578 268 -169 -364 -255 -302
3622 -302 -255 -173 -410 -136 -135 -65 101 -466 -264 -50 -127 363 258 472 489 195 219 333 116 -345 -388 -398 -568
3645 -568 -302 30 22 289 409 397 -71 -171 -394 -630 -247 226 149 168 707 703 622 418 98 -1 -613 -505 -737
3668 -737 -605 -411 -542 112 273 314 291 147 69 223 208 58 289 537 412 647 220 203 -112 -549 -733 -778
3690 -778 -779 -401 -334 26 461 595 612 561 373 193 -121 -210 -49 -774 -173 -164 -269 74 128 -198 -238 -287 -261 -224
3714 -224 -168 319 384 865 690 830 218 159 -429 -352 -378 -742 -631 -588 -74 236 58 528 375 178 3 56
3736 56 -255 -67 -137 -63 183 351 266 57 -176 -161 -226 -252 -208 -84 -565 -40 -29 246 378 -66 208 27 -86
3759 -86 -432 -49 -204 -140 -261 -161 131 -78 353 -169 -98 17 -179 -213 227 131 63 242 398 353 270 -11 2
3782 2 42 -44 -180 -232 -176 -109 -291 -126 82 -67 110 -264 140 310 -115 7 254 -150 292 59 -106 126
3804 126 108 145 117 -231 -64 -52 -65 -138 -168 -43 211 156 199 146 -126 -47 -116 -339 -306 -214 -21 -19 -224 92 55 72
3830 72 8 -208 -229 -74 -254 -94 -3 205 125 402 40 363 -20 -383 -83 -286 -89 -158 -125 201 235 111 174
3853 174 -76 -163 53 -51 -186 -377 -106 -249 87 -47 186 5 -174 99 -9 15 -115 81 83 56 -44 191
3875 191 -64 199 -1 18 -188 -64 -389 6 71 177 132 -168 336 320 62 19 -289 -122 -25 -16 -44 360 154
3898 154 81 103 -85 3 -40 -51 -122 26 78 339 65 194 230 -76 -49 -299 -500 -267 -139 -86 144 143 234 296 27
3923 27 355 8 -186 67 -194 126 -41 137 166 64 -427 47 -203 -267 -68 2 14 284 422 257 297 80
3945 80 263 -17 -495 -408 -498 -271 -81 -53 315 275 299 104 152 147 -13 20 50 64 97 378 109 -155 40 -128
3969 -128 -392 -453 -851 -398 -86 5 204 184 515 624 230 -1 74 -211 -129 -175 -171 98 4 277 269 121 -35 -235
3993 -235 -344 -160 -76 87 252 241 301 635 301 232 -154 -410 -357 -598 -509 -324 -42 134 397 124 145 130 -263
4016 -263 36 -317 -151 132 12 329 344 446 311 280 53 -162 -470 -406 -369 -114 41 161 -9 383 268
4037 268 281 170 -291 -180 -211 -202 -33 266 334 624 363 50 158 -226 -532 -704 -876 -594 -57 125 478 415
4059 415 432 405 380 388 -115 -228 -222 -175 -156 -102 102 -100 -282 -327 -281 -363 -229 -214 -175 92 580 576 394 632 203 163
4085 163 -215 -329 -400 -690 -512 -308 -226 -37 136 103 109 117 69 227 -73 -37 173 364 186 424 233 -153 -359
4108 -359 -457 -528 -493 -536 -232 -58 451 396 589 251 527 184 115 148 -5 -322 -320 -83 -149 -288 -79 91 -139
4131 -139 113 -142 -393 -310 26 -147 66 42 459 256 285 172 229 -232 -243 -271 -4 -108 -136 176 50 -73
4153 -73 200 -34 -2 39 -218 -308 148 71 170 328 13 133 -16 -66 98 -219 -375 -155 -344 63 -26 -46 195
4176 195 31 107 -36 136 14 2 522 227 -26 94 397 -6 -27 -109 25 -244 -241 -30 -357 -114 8 227
4198 227 156 6 77 116 306 78 -268 132 -17 -24 28 -215 -39 24 -70 81 -130 -11 88 -112 161 108 115 27
4222 27 -50 -231 -17 22 -46 -202 -179 -162 -118 -261 -41 -176 -116 198 -13 -118 72 -195 17 -45 -88 -180 38 -48
4246 -48 165 61 152 255 -124 72 -24 -26 -6 -81 -115 122 -43 88 -187 224 58 -61 5 -94 103 127 -61 38
4270 38 109 -76 103 234 -77 -136 -281 -75 -303 -344 128 107 115 -109 -52 126 -144 -15 27 -241 25 139 125
4293 125 125 -190 -281 -192 -122 -8 -211 -22 64 59 27 202 356 308 12 -171 -216 -75 -122 -124 -73 178 18 -2 234
4318 234 62 -140 -78 -54 -157 135 -97 128 -65 251 -121 13 -117 147 -210 -282 30 -71 -45 74 -29
4339 -29 220 85 6 65 -49 -60 -273 -275 -153 184 4 300 304 74 -310 -206 -104 -160 -197 -137 -216 -12 191 1
4363 1 159 55 56 98 -201 -266 -141 -135 -135 132 -78 98 201 -229 -131 74 -333 -114 -234 156 29 -110 66 29
4387 29 10 299 -3 -168 -218 -275 -9 281 -214 129 102 309 292 -18 101 -407 -78 -74 110 30 164 195 98 329
4411 329 24 -57 -30 -174 -275 -298 -123 -21 328 146 116 256 -44 -135 -75 -1 -181 -16 56 -189 185 63 -23
4434 -23 179 -2 -2 21 -228 -74 70 -41 417 154 23 3 175 -250 -192 -334 -219 -40 -216 196 -45 -101
4456 -101 -159 45 -106 -140 -7 161 -53 15 83 201 127 202 227 -71 207 -89 -65 -198 112 124 -333 -208 84
4479 84 -175 180 -270 -34 -231 117 -123 -67 68 52 129 186 46 127 -120 -85 -287 -211 78 89 100 -1 16 25
4503 25 38 245 -159 -248 -114 100 70 -246 26 233 -123 -78 -110 5 128 -24 -17 -45 214 -44 17 193 143 258
4527 258 177 104 -359 -165 -30 -12 105 134 199 -164 -111 275 -48 -66 -33 191 -80 76 83 96 302 176 -89 95
4551 95 -137 173 100 -138 -122 40 60 89 85 -22 68 -18 -62 -121 -128 -6 -106 -81 67 -149 98 80 114 -150 -119 -204
4577 -204 333 -154 -14 -43 94 602 351 5 -1 -77 0 -54 -146 -127 102 -144 -61 -114 -81 29 -73 -185 102 7
4601 7 -16 16 -50 0 74 235 -10 4 113 -184 -274 6 190 -15 251 122 -120 310 -23 -81 -175 -76 3 -168
4625 -168 -35 -158 -192 -162 -9 60 -159 -306 -107 -21 -40 -95 -150 -224 -9 111 -36 -43 -165 -142 62 21 -63 -42 -181
4650 -181 221 -159 -153 81 -75 -55 -65 92 12 -161 127 240 -56 -30 -48 73 56 -16 116 85 136 115 18 -96
4674 -96 -207 -178 -54 -141 179 -77 145 -53 0 146 -14 113 -64 94 208 -47 -238 -49 17 -220 -150 -102
4696 -102 -79 -79 61 32 55 -135 -126 83 91 273 202 273 15 14 271 -123 -17 -3 128 40 -325 -55 -35 43 -36 70
4722 70 209 -45 26 -27 -8 194 58 -41 -16 -247 123 278 54 -122 13 89 -62 -24 -43 -26 -185 116 -25
4745 -25 442 -184 -86 -47 235 242 -127 56 163 142 321 -147 48 -193 45 95 32 -226 143 -44 -47 226 -84
4768 -84 132 62 53 11 -20 -60 -12 31 -216 -120 60 161 38 -121 84 37 -169 62 281 -233 11 -12 170 -140
4792 -140 -32 -30 -71 55 -93 -135 -89 -368 -4 337 -190 210 81 -75 14 89 17 119 51 -61 245 122 152
4815 152 -59 -92 80 95 0 -65 -101 -215 -34 -97 -33 25 43 28 -75 -267 -38 -233 -109 -103 -154 -115 -150 54 42
4840 42 124 79 212 139 -72 -88 -176 -144 235 -93 -74 61 -166 -173 -103 -164 101 -60 -247 32 -2 264 84 27 40
4865 40 -55 -19 -265 9 48 75 13 114 -79 6 204 -248 58 -89 -143 -180 52 -33 -141 -14 -16 32 75 -38 -137
4890 -137 -32 -117 186 -50 170 -48 161 -25 -123 65 -192 -231 -217 -301 -74 -197 90 18 343 -13 48 274
4912 274 -92 -78 -147 14 -33 -165 3 165 326 137 38 -9 284 45 -76 -237 -127 135 157 86 86 156 99 -92
4936 -92 -25 -170 55 -87 270 119 -129 -7 255 165 102 55 -290 45 -18 -191 -240 -299 42 154 65 -27 -120 91
4960 91 408 16 -78 29 96 50 -142 24 103 -202 -42 92 -198 144 -438 -67 81 110 116 299 77 113 249
4983 249 -161 208 76 -376 -69 -171 -53 98 54 108 248 234 7 -39 -8 11 98 -51 106 -169 -148 -67 2
5006 2 -163 -73 -76 9 12 -90 10 -103 223 163 25 28 -152 -5 21 -75 -125 47 -212 -67 -83 57 211 -40 217
5031 217 -21 -61 123 -97 -94 79 -60 41 62 -114 110 -81 -97 -236 9 -73 -53 105 34 170 112 105 63 199
5055 199 -162 64 197 -117 44 -241 118 -122 97 -30 -110 82 -18 74 153 101 -218 -106 56 -189 99
5076 99 132 -22 159 -214 -71 0 -125 -218 11 -184 -80 90 128 -43 30 2 -151 -15 -109 -106 -115 32 95 142 -143
5101 -143 105 135 -36 172 -158 -264 -211 -199 -25 161 150 46 27 221 119 -91 -282 -281 -67 -55 193 -88 -130
5124 -130 23 91 318 -43 229 38 -166 -171 27 -88 -79 70 152 20 202 -32 -139 -82 31 189 -65 17 155
5147 155 8 172 -183 -79 155 157 -117 89 -38 -120 123 -126 107 233 -5 60 -264 143 -89 -212 -64
5168 -64 -123 -36 -36 -86 -67 -87 226 -70 51 220 133 -7 -222 -33 -13 -99 288 -52 197 -103 -244 -165 -95 -312
5192 -312 103 -56 -74 181 72 -102 130 5 -58 -96 -259 62 -190 -159 -72 80 198 -3 108 269 -62 118
5214 118 192 -127 20 4 -11 -84 -97 -109 -178 81 112 -48 -40 -16 87 -121 99 -63 29 106 117 250 100 -74 -24
5239 -24 -138 -147 -239 -106 -147 55 -127 184 120 74 223 361 517 71 -171 -72 -200 -239 -19 -189 -22 -76 -235
5262 -235 137 -23 5 104 60 169 297 -8 243 298 -213 107 -211 -20 -142 -148 -240 -19 -66 150 236 83 259
5285 259 82 121 29 97 -25 -18 54 -172 18 -189 -111 -56 -14 11 -43 126 -63 132 -81 -58 90 -61 103 37
5309 37 -58 -47 -82 195 -58 -211 -246 -187 -371 180 38 56 167 145 208 68 -5 -39 -92 88 -55 -158 104 207
5333 207 106 261 86 286 -299 -89 -115 -15 107 -73 213 184 132 8 200 -103 -198 -125 -181 -342 -175 -72
5355 -72 6 242 221 196 58 -148 235 -178 -192 -235 58 56 5 140 395 300 -62 -57 -61 -20 -60 98 -35 118 223
5380 223 373 169 145 -17 -349 -19 -128 -300 -198 -175 -33 110 138 97 180 58 128 -151 -284 -206 111 272
5402 272 150 -11 21 10 8 -115 -292 -207 -235 66 23 187 319 40 395 -10 278 -9 -20 -341 -377 -77 -158
5425 -158 53 291 117 245 -130 146 -265 -19 -95 -258 172 193 226 295 160 121 20 -132 147 -176 -314 -337
5447 -337 -95 -63 63 398 212 201 -104 -80 -340 -119 23 -6 -168 78 78 223 420 163 -156 100 -52 2
5469 2 6 -217 112 -134 52 278 -185 271 -18 125 108 -63 -173 -81 -41 149 175 168 235 -60 74 -35 -25 -3
5493 -3 -99 -127 -48 272 13 98 83 97 248 100 -143 -85 -132 -97 -20 -74 -115 -85 191 -4 20 -78 -192 247 339 -63
5519 -63 36 104 -92 44 253 164 131 82 -189 -187 -137 -81 -82 97 -64 36 254 -173 91 334 79 -253 -34 -147
5543 -147 8 -139 177 187 -157 -105 -116 -55 -166 47 -55 104 75 394 183 253 235 -67 224 23 -207 131
5565 131 3 104 -5 -60 -198 -148 -6 15 53 85 176 -224 133 263 174 77 24 4 105 111 -5 -46 -318 77
5589 77 -191 16 -89 168 -113 107 95 146 171 237 63 19 -57 211 -165 95 -172 -271 -148 -195 64 31 33 51
5613 51 38 50 276 61 50 -33 294 -17 46 -12 -192 -22 -209 129 -291 -216 -152 -84 290 225 308 139 -65 -168
5637 -168 55 8 170 10 -188 -166 -201 -299 25 111 225 101 67 138 438 7 120 220 103 78 -235 -280 -195
5660 -195 -418 -206 -118 65 -141 -313 166 295 118 87 165 247 159 -42 -181 -62 -84 -206 -90 -335 -179 -119
5682 -119 -46 193 401 301 201 385 410 42 -273 -98 -159 -54 49 41 -94 12 91 117 60 -56 37 8 -57 44
5706 44 -5 237 210 222 207 -140 -362 -258 -263 -94 -71 163 381 275 366 -35 142 -127 -5 -292 -258 -8 -152
5729 -152 124 -43 165 -22 453 307 -75 -86 31 -99 -299 0 260 207 -33 -274 143 -91 -100 -50 -163 102
5751 102 129 154 93 319 129 53 98 -143 -47 -184 -340 -217 -282 -81 101 304 115 161 204 -130 -3 -54 -64 3
5775 3 216 16 47 77 360 141 -90 -297 -187 -310 -9 83 236 308 454 245 382 192 -32 -60 -69 -268 -204
5798 -204 -262 -236 -22 20 116 180 165 15 -130 134 190 -158 193 230 364 299 155 -38 134 -261 -252 -192 -291 -142
5822 -142 -221 205 292 153 312 19 -131 -38 123 -38 -137 133 -187 17 -84 65 0 151 420 -268 55 83
5844 83 -54 177 -25 290 151 25 37 33 -176 -131 -140 -338 -92 -276 -201 70 85 120 203 45 91 361 82 130
5868 130 126 -104 103 -14 226 -72 -88 -33 -356 -232 87 -149 -103 -42 177 35 250 -96 312 -49 -192 0
5890 0 -160 -69 29 -49 20 -84 -156 -61 -167 -58 157 -66 -38 23 42 28 -129 -182 -277 -187 128 -97 -291 -81 -34
5915 -34 -183 -358 -183 -104 5 -13 92 55 139 -40 202 -169 -160 106 -38 -65 8 -119 0 136 79 8 63 64 64
5940 64 0 103 159 37 35 100 195 -207 -103 51 29 -1 17 -282 1 -35 293 76 40 121 149 102 -74 180 -137
5965 -137 -91 -194 -244 54 44 -28 18 107 -223 -34 -18 26 -168 52 54 32 92 263 188 283 141 -205 -117 -43 -299
5990 -299 174 -18 -130 190 -16 239 7 -82 17 178 258 59 35 132 45 -146 36 221 -6 166 -145 -109
6012 -109 -7 -29 -123 -20 -169 26 77 -21 55 90 21 98 -120 -151 70 -193 129 64 49 -46 75 98 -33 193
6036 193 114 69 72 -84 -74 -139 124 -108 -98 -109 -63 -13 231 56 214 157 -66 -53 -106 122 -3 5 -171 49 -127
6061 -127 -127 -125 -153 162 -68 -37 129 121 236 -10 128 158 -55 -83 -200 -60 -263 18 -338 -68 137 210 165 111
6085 111 365 250 -27 -136 61 -178 31 72 -132 -83 83 -213 -41 40 -123 -69 -176 -61 115 3 345
6106 345 165 265 249 -70 -147 -289 -561 -177 -63 89 -23 180 311 289 221 17 129 -59 -46 -346 139 -38
6128 -38 -40 -63 -80 -87 124 58 -223 -12 -98 -12 224 195 383 93 -20 -133 -251 -386 -346 -359 -217 -167 -317 217 259
6153 259 342 290 292 228 -15 -33 -177 -136 73 -87 -7 -50 -225 -215 199 48 -2 -79 27 148 300 254 149 226 152
6178 152 72 -311 -328 -537 -455 -217 -436 -278 -309 110 66 193 458 108 214 -121 8 299 -195 -261 -114 -256
6200 -256 -214 30 -121 -172 -231 -193 4 -43 -83 326 332 369 456 156 28 162 -202 -17 -347 -308 -101 -66 -136 98
6224 98 164 -159 123 207 73 -41 -27 -103 23 150 -77 30 -24 -129 87 -301 40 50 115 8 227 25 117
6247 117 78 -281 46 24 -121 59 116 -65 51 191 99 286 -78 223 186 23 -108 -152 -309 38 -132 -207
6269 -207 48 -209 -91 112 426 21 122 1 48 -26 6 -226 -21 -254 -157 65 64 -42 -18 9 140 129 237
6292 237 126 -178 181 88 402 15 164 -173 -172 -230 -93 19 -110 -104 114 -129 -21 140 -4 360 103 62
6314 62 21 -83 -36 -120 108 80 -22 125 -31 -118 -39 -262 -353 -72 -221 -44 124 245 76 152 68 244 226 109
6338 109 89 -177 -122 7 19 -118 191 219 118 -3 191 -33 246 110 -479 -45 231 -231 277 -9 -185
6359 -185 -139 99 11 -184 45 -27 -32 381 169 54 -189 131 126 -186 -20 49 -69 -48 26 -106 139 240 78
6382 78 -162 193 132 -82 141 46 -78 -126 4 158 85 -141 63 -95 -126 -102 116 -27 67 -37 -216 12 39
6405 39 -70 -18 -126 -34 -11 9 84 11 97 -64 -50 1 155 -85 29 140 107 6 14 75 -70 208 -25 133 17
6430 17 30 -178 -51 23 -173 -170 114 -147 -197 2 -93 75 241 25 72 31 229 43 -68 186 84 69 224
6453 224 48 -200 -92 -56 79 29 -60 50 -178 -74 -68 -177 -26 -13 43 169 32 -86 132 0 -22 97 -138
6476 -138 -289 -28 -70 74 -25 -210 21 -124 -196 62 96 -217 -47 4 189 -73 -117 35 -2 -37 51 142 -101
6499 -101 0 62 -44 -61 100 -1 129 8 233 -166 -253 -112 -104 68 25 28 19 61 42 -51 -91 236 -47 -206 116
6524 116 78 125 163 -237 -67 -43 -123 -185 -284 -277 160 64 -117 144 305 210 146 67 -122 -92 -128 -323 -253 -66 -161 158
6550 158 -15 32 155 28 114 118 294 110 10 -68 -45 137 -72 -170 -179 -60 -232 37 -288 -254 152 -73 -73 282
6574 282 110 212 47 323 41 -76 72 -206 -313 -295 -160 223 176 19 -174 4 83 58 185 30 146
6595 146 330 32 58 -138 221 -159 -185 -445 -293 -366 -266 -220 85 -212 138 324 71 155 184 77 34 79 -33
6618 -33 -318 70 -104 -224 214 -13 -37 113 2 227 -248 34 -62 72 22 245 43 -104 30 0 -76 27
6640 27 73 16 -3 -92 90 264 251 -13 173 -148 -193 62 48 37 353 -3 97 82 479 137 240 75 -4 145
6664 145 -157 -178 -16 -172 -172 -140 -296 -45 11 -290 132 336 168 97 264 346 161 105 -55 -243 -41 -161 -170
6687 -170 -279 -310 -104 -11 0 122 290 147 235 277 214 74 -286 -310 -226 -202 -226 -218 -470 -272 -273 -81 60 149 137
6712 137 -55 87 117 424 98 258 184 -14 244 -89 -343 -448 -464 -364 -100 4 -68 -68 -61 -165 146 265 219
6735 219 8 267 33 -133 -13 -36 64 110 -154 80 -130 -404 -203 -169 19 61 -236 236 118 224 211 169
6757 169 131 -159 110 -88 -263 -55 156 -99 -30 -7 -3 -175 -122 127 22 110 -167 112 84 139 394 72 -53
6780 -53 -40 -58 49 -54 84 -74 66 -2 144 -59 -23 69 -67 -241 223 144 128 123 131 -121 166 161 160 138 -180 -134
6806 -134 -114 -141 -220 22 82 -75 -7 149 -60 -60 13 190 -175 147 155 -150 66 -34 146 -95 -202 -47 -171
6829 -171 -7 142 -152 116 111 -63 -147 9 26 349 20 14 247 -60 30 81 -80 71 158 -37 212 207 -74 -108
6853 -108 -41 106 220 -23 133 -291 -198 119 -41 50 -9 21 -117 -195 -77 22 -11 7 -5 -160 -19 47 -4 -110
6877 -110 136 -84 144 -32 264 10 146 158 -66 -254 6 23 -297 -242 15 217 -70 -23 33 22 -54 -120 119
6900 119 -60 -74 78 -76 -75 -44 -30 -78 -212 88 15 -78 61 -21 -61 -53 76 77 -41 -24 78 -147 167 -226 16
6925 16 64 82 12 48 170 99 104 -43 86 -24 -168 177 61 -70 157 -327 -103 -75 -41 -371 55 -70 -139 161
6949 161 97 168 -9 37 -274 -339 -30 -18 70 136 -71 104 208 20 60 27 -77 -292 -102 22 67 38 100 123
6973 123 -36 97 191 118 -186 -130 -259 -76 -127 87 20 -192 258 -157 -260 32 179 -58 10 -116 48 29
6995 29 255 28 86 124 -26 174 -68 98 77 -289 104 116 197 7 -122 -59 32 10 17 -121 109 40 166 -76
7019 -76 -28 88 -18 286 171 206 65 51 1 -109 43 33 214 200 -65 202 43 -237 -185 186 174 165 300 -51
7043 -51 -95 -65 -84 -260 -151 -269 -120 -343 -270 -54 24 -40 44 -58 -11 186 98 167 -99 -27 30 12 -40 -108 142
7068 142 85 -190 -269 -23 -272 256 -20 -29 90 298 -1 205 122 225 -83 163 -32 -323 -200 -143 -415 -236
7090 -236 -60 42 63 -134 263 143 171 39 -10 147 180 204 297 130 -146 -179 -152 -211 -266 -238 4 41 -192 -120
7114 -120 79 193 169 185 44 -14 278 -154 -73 -199 -253 96 -6 -121 -207 192 68 -201 -23 128 48 -112
7136 -112 356 -93 134 143 154 -125 116 -98 169 65 -147 -225 200 -95 -244 -161 27 -34 -94 36 162 -69
7158 -69 86 40 66 -37 50 57 79 -124 -31 126 -231 -104 -48 -154 -78 124 -257 126 -304 45 265 -136 -2
7181 -2 177 457 116 -101 21 133 -8 -65 -19 112 6 -539 -16 356 -5 -159 44 56 196 191 127 287 -17
7204 -17 -67 53 -262 -184 -32 -7 -279 -84 154 98 211 117 41 93 226 -49 203 -80 122 -160 -218 -54 30
7227 30 -212 -17 -163 -102 -64 -130 56 -159 -120 110 147 184 64 -15 5 -72 -170 -46 14 -359 -57 -158 -53 135
7251 135 224 399 -23 71 -303 -294 132 -154 178 -163 -37 -91 4 -128 -163 5 57 -167 -207 84 19 -46 125 -139
7275 -139 -5 -38 -9 18 -57 194 240 91 101 23 -112 69 -96 -300 305 -51 -201 -112 -142 62 191 -21 162
7298 162 75 17 8 -160 -71 -28 -13 172 60 -258 66 233 155 -126 38 211 -14 81 -49 180 -28 -82 19
7321 19 89 166 145 -58 -142 110 45 -150 -198 -157 -188 -85 41 10 32 155 117 44 89 -70 -28 169 -32 -35 -318 67
7347 67 -60 -47 -74 -69 22 -68 3 86 -60 -66 232 196 99 13 81 -178 -47 93 -73 -138 10 80 -117 -21 -4 49 34
7374 34 -323 -71 -87 -166 158 184 217 64 118 133 -76 -12 11 20 -79 -101 -41 170 -124 53 -53 33 -191 -214 47
7399 47 -49 -24 115 138 30 186 -103 66 5 -189 -11 79 -99 -91 -93 112 -7 250 21 320 99 19 47 -145
7423 -145 -211 -93 -44 -32 -134 -76 141 -3 53 -146 -155 40 -124 60 287 -21 209 71 -183 -168 -67 -21 -63
7446 -63 -124 143 94 17 -44 -69 -109 189 -98 -78 -81 -105 -137 151 -113 212 -11 -169 345 58 -139 427 -159 172
7470 172 106 -43 130 -61 202 159 131 -317 -78 -83 158 38 -46 225 34 -39 20 -83 157 -50 -20 -47 -159
7493 -159 -179 60 110 180 43 -42 190 -80 29 176 -116 -103 211 87 40 170 -181 -102 46 -195 -159 -25 -172
7516 -172 131 -16 -76 104 0 172 130 13 -14 16 105 193 -11 128 -216 -103 156 36 -90 -52 -100 80 101
7539 101 105 399 58 191 307 -51 -243 -229 56 -28 -278 -199 67 242 -50 71 32 -208 238 142 -122 178
7561 178 150 179 165 170 -86 109 127 206 -22 -186 -370 -314 8 -76 103 -22 -23 178 105 -34 39 184 -12 3 40
7586 40 -136 -56 4 93 -153 126 -27 -171 -84 -157 74 112 65 140 221 276 178 287 10 84 -233 -125 -31 56 -86
7611 -86 144 53 -122 9 -342 106 -72 -170 -44 25 -63 -162 152 29 27 223 -63 -101 -267 -108 -98 48 110 -103
7635 -103 -81 95 29 -165 -155 -48 -179 -88 -131 46 57 132 130 155 -39 -27 -237 -312 -259 -138 -144 -222 45 203 119 -103
7661 -103 15 168 -136 97 -33 -86 33 -124 -229 -211 88 -164 -68 50 40 -86 -219 -189 60 -43 412 625
7683 625 513 42 180 80 -10 110 -118 -126 -303 -27 34 -90 4 79 118 -87 188 50 -283 88 -92 66
7705 66 267 46 262 -148 15 51 -218 -47 -94 -73 -223 118 -54 163 -13 241 -7 65 13 161 59 -287
7727 -287 -109 -255 165 -37 167 -55 -208 146 -79 -127 29 2 -202 101 217 102 289 79 -65 -82 -295
7748 -295 -87 94 -62 -97 -12 70 82 60 286 171 -201 -56 52 57 -113 207 82 69 295 87 -116 -194 -110
7771 -110 -136 -180 -128 23 128 49 64 80 276 93 163 114 51 279 -13 62 20 45 -27 -88 13 -2 100 -95 214
7796 214 -91 -244 -100 -311 249 -101 -147 113 -30 214 62 22 34 -104 -20 135 97 -91 -67 -9 -192 -24
7818 -24 -180 124 -33 -54 249 87 -220 -48 63 -180 39 -108 48 -38 178 73 63 -144 -127 -229 -89 -59
7840 -59 -46 42 126 44 -42 -103 198 -7 14 211 -52 -87 -79 -115 -114 153 -96 169 159 128 103 -20 -331 -35 -64 -3
7866 -3 13 50 -129 20 -10 -157 243 -213 -158 -63 -48 -194 -96 113 243 19 184 -37 -186 103 -14 -113 -69 -54
7890 -54 67 -154 -24 81 -65 -23 -4 63 -21 -83 -276 154 -251 171 351 33 -209 247 120 53 -71 15 -285
7913 -285 210 35 127 46 77 325 -90 -176 -145 -102 -121 -28 -186 212 341 301 33 113 -20 156 -170 -9 -155
7936 -155 93 -268 190 368 -173 186 -45 107 -114 71 -161 54 162 -135 -31 -171 -159 121 -4 -71 -41
7957 -41 -59 -116 -224 -56 57 20 214 132 -96 -281 -58 -13 3 -134 -261 -14 19 123 245 -10 126 66 -16
7980 -16 63 18 -204 104 -119 -271 -277 -101 -136 -90 74 62 103 -178 -110 65 -143 34 54 96 -135 78 14 48 156
8005 156 -43 -191 -280 -130 127 256 150 -132 173 55 229 17 214 -114 -124 -489 -87 -238 3 382 -135
8026 -135 90 -30 -139 -226 3 -64 149 130 118 -77 143 -163 87 153 -14 -17 -234 -124 122 66 -16 -59 304
8049 304 176 255 21 250 -86 -211 -213 -12 75 -203 140 365 251 26 112 109 163 -256 31 -84 -393 106 206
8072 206 -105 -200 -101 13 33 -110 -154 -186 -111 99 251 269 15 320 10 -76 -205 -156 -72 164 -35 110 -227
8095 -227 84 154 31 -61 -96 -70 -223 -103 236 -165 19 -117 54 -79 30 106 -205 -107 82 14 -80 151 52
8118 52 139 93 -22 197 34 405 -245 -258 -71 -323 38 120 75 57 168 146 256 -76 13 35 -211 -112 -232 -3
8142 -3 195 75 114 -12 129 -47 112 -119 -63 -144 -62 21 66 -44 -149 272 -34 -58 31 -187 86 -350 66
8165 66 98 -139 -95 -76 2 -303 -11 151 92 -220 -91 222 -16 71 127 117 54 -249 -350 203 -356 -78 -52 -148
8189 -148 145 65
8191F5
##END NTUPLES=NMR FID
##END=
