##TITLE=1H_Pr 87
 CDCl3, 8 sc, 
 9.06.2021
##JCAMPDX= 6.0         $$ Bruker NMR JCAMP-DX V2.0
##DATA TYPE= NMR FID
##DATA CLASS= NTUPLES
##ORIGIN= UXNMR, Bruker Analytische Messtechnik GmbH
##OWNER= root
$$ XWIN-NMR		Version 3.5
$$ Wed Jun  9 13:18:06 2021 Russian Standard Time (UT+4h)  she@DPX200
##.OBSERVE FREQUENCY= 200.131506
##.OBSERVE NUCLEUS= ^1H
##.DELAY= (6, 6)
##.ACQUISITION MODE= SIMULTANEOUS
##.ACQUISITION SCHEME= undefined
##.AVERAGES= 8
##.DIGITISER RES= 18
##SPECTROMETER/DATA SYSTEM= spect
##.PULSE SEQUENCE= zg30
##.SOLVENT NAME= CDCl3
##.SHIFT REFERENCE= (INTERNAL, CDCl3, 0, 15.7039)
##AUDIT TRAIL= $$ (NUMBER, WHEN, WHO, WHERE, WHAT)
$$ ##TITLE= Audit trail, XWIN-NMR		Version 3.5
$$ ##JCAMPDX= 5.01
$$ ##ORIGIN= Bruker BioSpin GmbH
$$ ##OWNER= she
$$ F:/spectra/data/she/nmr/H-F/1/audita.txt
$$ ##AUDIT TRAIL=  $$ (NUMBER, WHEN, WHO, WHERE, WHAT)
(   1,<2021-06-09 13:16:31.21 +0400>,<she>,<DPX200>,
      <created by zg, POWCHK disabled, PULCHK disabled
       configuration hash MD5:
       00 E9 B6 7A A2 85 ED C7 34 08 36 98 17 FE 4E 26
       data hash MD5: 16K
       7B 16 CC 12 9C 39 81 AD 92 7B 6D 4C 4B 3B 9A D7>)
$$ ##END=
$$ 
$$ hash MD5
$$ C0 0B 37 90 38 28 DC 17 D6 1F 40 8F 53 D1 23 77
##$RELAX= 
##$RELAX= 
##$RELAX= 
##$RELAX= 
##$RELAX= 
##$RELAX= 
$$ Bruker specific parameters
$$ --------------------------
##$DU= <F:/spectra>
##$EXPNO= 1
##$NAME= <H-F>
##$PROCNO= 1
##$TYPE= <nmr>
##$USER= <she>
##$AMP= (0..31)
100 100 100 100 100 100 100 100 100 100 100 100 100 100 100 100 100 100 
100 100 100 100 100 100 100 100 100 100 100 100 100 100 
##$AQSEQ= 0
##$AQ_mod= 1
##$AUNM= <au_zg>
##$AUTOPOS= <>
##$BF1= 200.13
##$BF2= 200.13
##$BF3= 200.13
##$BF4= 200.13
##$BF5= 200.13
##$BF6= 200.13
##$BF7= 200.13
##$BF8= 200.13
##$BYTORDA= 1
##$CFDGTYP= 0
##$CFRGTYP= 5
##$CHEMSTR= <none>
##$CNST= (0..31)
1 1 145 1 1 1 1 1 1 1 1 1 1 1 1 1 1 1 1 1 1 1 1 1 1 1 1 1 1 1 1 1 
##$CPDPRG= <>
##$CPDPRG1= <>
##$CPDPRG2= <>
##$CPDPRG3= <>
##$CPDPRG4= <mlev>
##$CPDPRG5= <mlev>
##$CPDPRG6= <mlev>
##$CPDPRG7= <mlev>
##$CPDPRG8= <mlev>
##$CPDPRGB= <>
##$CPDPRGT= <>
##$D= (0..31)
0 1.2 0 0 0 0 0 0 0 0.06 0 0.03 0 0 0 0 0.0002 0 0 0 0 0 0 0 0 0 0 0 0 
0 0 0 
##$DATE= 1623230190
##$DBL= (0..7)
120 120 120 120 120 120 120 120 
##$DBP= (0..7)
150 150 150 150 150 150 150 150 
##$DBP07= 0
##$DBPNAM0= <>
##$DBPNAM1= <>
##$DBPNAM2= <>
##$DBPNAM3= <>
##$DBPNAM4= <>
##$DBPNAM5= <>
##$DBPNAM6= <>
##$DBPNAM7= <>
##$DBPOAL= (0..7)
0.5 0.5 0.5 0.5 0.5 0.5 0.5 0.5 
##$DBPOFFS= (0..7)
0 0 0 0 0 0 0 0 
##$DE= 6
##$DECBNUC= <off>
##$DECIM= 32
##$DECNUC= <off>
##$DECSTAT= 4
##$DIGMOD= 1
##$DIGTYP= 9
##$DL= (0..7)
0 120 120 120 120 120 120 120 
##$DP= (0..7)
150 150 150 150 150 150 150 150 
##$DP07= 0
##$DPNAME0= <>
##$DPNAME1= <>
##$DPNAME2= <>
##$DPNAME3= <>
##$DPNAME4= <>
##$DPNAME5= <>
##$DPNAME6= <>
##$DPNAME7= <>
##$DPOAL= (0..7)
0.5 0.5 0.5 0.5 0.5 0.5 0.5 0.5 
##$DPOFFS= (0..7)
0 0 0 0 0 0 0 0 
##$DQDMODE= 0
##$DR= 18
##$DS= 0
##$DSLIST= <SSSSSSSSSSSSSSS>
$$ [...]
##$SUBNAM2= <"">
##$SUBNAM3= <"">
##$SUBNAM4= <"">
##$SUBNAM5= <"">
##$SUBNAM6= <"">
##$SUBNAM7= <"">
##$SUBNAM8= <"">
##$SUBNAM9= <"">
##$SW= 20.0188882624521
##$SWIBOX= (0..15)
0 0 2 0 0 0 0 0 0 0 0 0 0 0 0 0 
##$SW_h= 4006.41025641026
##$TD= 16384
##$TD0= 1
##$TE= 0
##$TE2= 300
##$TE3= 300
##$TEG= 300
##$TL= (0..7)
0 120 120 120 120 120 120 120 
##$TP= (0..7)
150 150 150 150 150 150 150 150 
##$TP07= 0
##$TPNAME0= <>
##$TPNAME1= <>
##$TPNAME2= <>
##$TPNAME3= <>
##$TPNAME4= <>
##$TPNAME5= <>
##$TPNAME6= <>
##$TPNAME7= <>
##$TPOAL= (0..7)
0.5 0.5 0.5 0.5 0.5 0.5 0.5 0.5 
##$TPOFFS= (0..7)
0 0 0 0 0 0 0 0 
##$TUNHIN= 0
##$TUNHOUT= 0
##$TUNXOUT= 0
##$USERA1= <user>
##$USERA2= <user>
##$USERA3= <user>
##$USERA4= <user>
##$USERA5= <user>
##$V9= 5
##$VALIST= <valist>
##$VCLIST= <CCCCCCCCCCCCCCC>
##$VD= 0
##$VDLIST= <DDDDDDDDDDDDDDD>
##$VPLIST= <PPPPPPPPPPPPPPP>
##$VTLIST= <TTTTTTTTTTTTTTT>
##$WBST= 1024
##$WBSW= 4
##$XGAIN= (0..3)
0 0 0 0 
##$XL= 0
##$YL= 0
##$YMAX_a= 308508
##$YMIN_a= -252195
##$ZGOPTNS= <>
##$ZL1= 120
##$ZL2= 120
##$ZL3= 120
##$ZL4= 120
##$ABSF1= 10
##$ABSF2= 0
##$ABSG= 5
##$ABSL= 3
##$ALPHA= 0
##$AQORDER= 0
##$ASSFAC= 0
##$ASSFACI= 0
##$ASSFACX= 0
##$ASSWID= 0
##$AUNMP= <proc_1d>
##$AZFE= 0.1
##$AZFW= 0.1
##$BCFW= 1
##$BC_mod= 2
##$BYTORDP= 1
##$COROFFS= 0
##$CY= 11.3945322036743
##$DATMOD= 1
##$DC= 2
##$DFILT= <>
##$DTYPP= 0
##$F1P= 15.9154993809931
##$F2P= -4.1035820241983
##$FCOR= 0.5
##$FTSIZE= 0
##$FT_mod= 4
##$GAMMA= 1
##$GB= 0.15
##$INTBC= 1
##$INTSCL= 1
##$ISEN= 128
##$LB= 0.24
##$LEV0= 0
##$LPBIN= 0
##$MAXI= 10000
##$MC2= 0
##$MEAN= 0
##$ME_mod= 0
##$MI= 1.114404
##$NCOEF= 0
##$NC_proc= 0
##$NLEV= 6
##$NOISF1= 3.799351
##$NOISF2= 2.8
##$NSP= 1
##$NTH_PI= 0
##$NZP= 0
##$OFFSET= 15.70392
##$PC= 1
##$PHC0= -11483.7
##$PHC1= 10.60101
##$PH_mod= 1
##$PKNL= yes
##$PPARMOD= 0
##$PSCAL= 0
##$PSIGN= 0
##$REVERSE= no
##$SF= 200.130013532006
##$SI= 16384
##$SIGF1= 3
##$SIGF2= 2
##$SINO= 400
##$SIOLD= 16384
##$SREGLST= <1H.CDCl3>
##$SSB= 0
##$STSI= 0
##$STSR= 0
##$SW_p= 3612.71676300578
##$SYMM= 0
##$S_DEV= 0
##$TDeff= 0
##$TDoff= 0
##$TI= <>
##$TILT= no
##$TM1= 0
##$TM2= 0
##$TOPLEV= 0
##$USERP1= <user>
##$USERP2= <user>
##$USERP3= <user>
##$USERP4= <user>
##$USERP5= <user>
##$WDW= 1
##$XDIM= 8192
##$YMAX_p= 0
##$YMIN_p= 0
$$ End of Bruker specific parameters
$$ ---------------------------------
##NTUPLES= NMR FID
##VAR_NAME=  TIME,          FID/REAL,        FID/IMAG
##SYMBOL=    X,             R,               I
##VAR_TYPE=  INDEPENDENT,   DEPENDENT,       DEPENDENT
##VAR_FORM=  AFFN,          ASDF,            ASDF
##VAR_DIM=   8192,          8192,            8192
##UNITS=     SECONDS,       ARBITRARY UNITS, ARBITRARY UNITS
##FACTOR=    0.0002496,     1,               1
##FIRST=     0,             0,               0
##LAST=      2.0444736,     0,               0
##MIN=       0,             -252195,         0
##MAX=       2.0444736,     308508,          0
$$ Real data points
##PAGE= N=1
##DATA TABLE= (X++(R..R)), XYDATA
0 0 0 0 0 0 0 0 0 0 0 0 -6 8 -8 8 -8 15 -16 16 -23 24 -31 39 -47 55 -63 71 -86 94 -110 126 -145 165 -188
33 -188 212 -239 270 -302 339 -378 420 -467 520 -576 638 -703 777 -858 946 -1042 1148 -1264
51 -1264 1393 -1535 1697 -1876 2080 -2311 2578 -2891 3262 -3710 4265 -4971 5907 -7206 9140
66 9140 -12311 18416 -34363 163055 308508 -191668 -202884 137149 148017 -121703 -73266
77 -73266 94430 42188 -77663 -60239 -40881 34913 107208 -20088 -188523 -45506 170451
88 170451 51432 -150671 -15024 131314 -21418 -110132 56810 130574 5102 -64282 -8435
99 -8435 24438 55279 82062 -8366 -83816 13100 76276 -3068 -32017 32976 14309 -64751
111 -64751 -42945 22271 18665 11148 -23393 -104269 -54678 86301 51377 -100624 -70901 63019
123 63019 7421 -95127 19107 108944 -24010 -103939 2556 67506 19034 13575 17838 -49587
135 -49587 -27762 76523 34653 -49712 17407 49065 -66160 -68229 89548 78538 -94589
146 -94589 -74555 56038 2974 -64242 29492 59583 -68112 -91939 42507 64750 -29543
157 -29543 -23591 20863 -15777 -25975 31105 47458 7533 -6737 -5386 -18785 29714 87483
169 87483 13605 -65032 229 60393 4804 -22542 43025 37471 -56791 -49828 41088 49146 -4362
182 -4362 -35262 -31200 -8060 16314 13874 -10089 -9581 1506 -29824 -28270 43564 49784 -31082
195 -31082 -51053 12230 32100 -3106 10981 34730 -18758 -43621 17139 46372 9471 -11714
207 -11714 -5445 -16435 -17423 25351 28468 -20403 -24620 -9290 -22149 -6069 30686 9754 -50242
220 -50242 -42119 14111 11714 -13311 5359 2128 -37223 -27293 26226 34280 -6749 -16154 -1322
233 -1322 -12359 1920 39716 26432 -18378 -23893 3231 16759 15578 18766 -183 -25162 -6842
246 -6842 12069 5848 12924 12599 -22961 -40762 4206 45852 7964 -32648 -10643 6719 -5629
259 -5629 923 22975 19696 -16216 -25615 1158 27592 34047 7191 -26493 -12581 24211 21731
272 21731 3082 7406 15039 -15104 -29263 18161 43128 2432 -27560 -18280 390 6331 11421
285 11421 7139 -15591 -23302 -8241 416 7969 14483 -7678 -30083 -19290 11312 21218 467
298 467 -7078 -10386 -17692 -133 25618 14659 -10285 -16285 -4492 -430 5538 21349 6349 -25884
312 -25884 -20259 4840 14167 8005 -4441 -15412 -20212 -5025 13222 6613 -3156 -8898 -20797
325 -20797 -15165 12746 24847 2650 -22472 -14077 5239 7155 13216 14637 -4461 -16812 -6027
338 -6027 16521 21869 10833 -1185 -13799 -10085 15075 22603 8365 -3870 -9989 -8395 1791
351 1791 16865 17969 -6944 -18931 -6125 3501 11843 14083 1331 -16368 -16208 6133 19643
364 19643 9713 -532 -8163 -13229 476 15121 18075 4508 -12699 -11355 -2102 11756 20617
377 20617 4009 -16262 -13298 -1060 8049 10278 4143 -7065 -20822 -11981 8729 11152 1110
390 1110 -11711 -19982 -11795 3205 13747 4946 -13668 -16789 -7420 1607 10561 8196 -4027 -14223
404 -14223 -13560 3087 14451 11815 -1117 -16833 -13572 6299 14662 6810 -5508 -9740 -6542 -5536
418 -5536 7293 16664 3397 -14103 -16894 -2727 15978 14317 -3383 -13415 -9381 3744 7183
431 7183 8553 9175 -3300 -14389 -6100 11967 22083 9715 -9595 -10578 -468 11915 16408 5569
445 5569 -3033 -6023 -4394 4408 12966 14948 -995 -17789 -9000 9840 13395 5795 -3240 -10952
459 -10952 -10629 315 13595 10192 -6876 -12014 -8959 -732 8175 10318 2356 -11380 -15332 203
473 203 11192 10318 667 -12027 -12988 -2154 10938 10662 -3700 -10604 -6355 -5588 -659 10086 8641
488 8641 -7223 -23294 -11139 13034 13684 -3789 -14813 -9553 -1267 -46 4135 5892 -2284 -9500
502 -9500 -10748 -2761 14272 16386 -3574 -22103 -10728 17891 17047 -6691 -7683 5830 782 -10158
516 -10158 814 23081 12165 -19901 -18325 6055 20301 10359 -7719 -12251 -3158 7654 7615
529 7615 -1521 3363 9389 -8244 -18871 6136 31062 11857 -25825 -17992 16906 17007 -2856
542 -2856 -3250 7015 137 -12709 -720 17946 11189 -4964 -13448 -10082 7044 17922 6546
555 6546 -14147 -14697 4867 7070 -4710 2206 8714 -7130 -21274 -5172 18950 10163 -12739
568 -12739 -12539 -3747 -2088 4333 9862 380 -15673 -10412 6504 5210 -1168 4872 -410 -15193
582 -15193 -11084 10906 17902 -3970 -15801 -5859 41 2679 7972 4172 -8963 -12925 241 7777
596 7777 1247 2973 5103 -10799 -15862 4698 22493 6334 -16404 -8410 6410 5294 3135 6287
610 6287 3880 -5541 -7407 3550 9946 7892 5826 -6686 -15307 2004 21859 12341 -13024 -12138
624 -12138 9842 6833 -7551 4519 16222 -557 -20524 -6976 19692 15491 -5774 -11355 -5680
637 -5680 2953 8560 5489 -2109 -3649 -194 -3691 -6981 9679 18417 -6585 -24633 -4463 20191
651 20191 9583 -12205 -6015 3769 -6055 -7798 6845 11515 -3555 -16088 -7715 4123 6855
664 6855 5049 -4496 -12882 -6647 3748 5714 611 -2139 -3499 -9670 -5421 9088 10009 -2572 -11066
679 -11066 -7040 2545 4919 4571 3005 -6052 -10231 -2098 8474 9594 -1055 -7352 -3760 -1830 2998
694 2998 8977 5385 -4932 -9909 -2160 8110 6946 3881 -941 -8435 -4918 6730 12375 3327
708 3327 -6636 -3010 1434 -451 6003 10861 1657 -9788 -7125 6792 11282 4648 -1545 -7031 -4356
723 -4356 5300 7021 2444 218 -1125 -5317 -6647 5894 15100 385 -14935 -7881 6387 8068
737 8068 -30 -2187 -783 -5587 -5661 1735 7725 5502 -6286 -13252 -3824 8225 8044 -3085 -9133
752 -9133 -3349 -1730 -1260 4038 4614 -2618 -9967 -7663 3286 7756 3051 -5129 -9977 -3995 3797
767 3797 4338 2142 -1928 -5981 -5867 -870 7073 5920 -2828 -5829 -4728 -910 7249 7553 -862 -8029
783 -8029 -4926 3994 5454 3641 2621 -2682 -6223 -1493 6910 8674 1925 -5191 -5299 -1106 7423
798 7423 8537 536 -3827 -3009 -1305 2965 6872 6311 -2452 -9300 -1379 7014 6461 2491 -2607 -4886
814 -4886 -2573 2279 7452 4143 -2575 -4484 -4967 1289 7817 4639 -2437 -6863 -4141 1725 3921
829 3921 4214 -122 -7536 -6053 1062 4893 3559 -1167 -4961 -6359 -3127 5489 4876 -1963 -6046 -5974
845 -5974 -1048 3337 3650 707 -5687 -6522 -1779 2428 4862 2681 -5434 -7440 -1522 4905 5316 -385
861 -385 -2186 -4022 -4098 1509 6128 2998 -2372 -6778 -3194 3898 5925 3381 -2177 -5179 -2499 1326
877 1326 5351 5029 -730 -3877 -4808 2354 8012 4580 -890 -2862 -3314 1030 5462 5298 1321 -4258
893 -4258 -3469 2093 5280 5987 1530 -4956 -3787 -585 4894 6346 1985 -3165 -5170 -1611 5059 5494
909 5494 1537 -2592 -5267 -1956 2419 4597 2456 -3802 -6441 -1746 1802 4718 1346 -3169 -5453
924 -5453 -3733 1263 4101 2027 -2439 -6013 -5234 1926 3964 1963 -1306 -5724 -3887 -1285 2979
939 2979 4583 -819 -6051 -5106 -202 5139 3202 -1689 -3752 -4359 -139 2510 3712 1938 -3430 -5790
955 -5790 -1888 3923 5172 1638 -4799 -4046 151 3534 4979 1459 -1894 -3726 -2310 3124 5999
970 5999 3075 -1927 -4739 -2106 4001 5580 3336 -1801 -3997 -6 1863 3861 4362 824 -3545
985 -3545 -4240 1668 7223 4328 -1342 -4004 -2775 1885 4654 3355 -160 -3387 -3070 -305 2219 5202
1001 5202 1945 -4946 -5973 -122 5258 3800 -1897 -3056 -3184 -2060 1966 3731 1121 -3483 -5729
1016 -5729 -2164 2211 3494 1553 -3819 -6131 -2281 2262 3932 318 -3439 -3409 -3215 92 3722 2524
1032 2524 -1948 -5266 -3587 1860 3585 2114 -903 -4451 -4180 656 4770 3081 -2779 -3200 -973
1047 -973 -870 1910 5030 1778 -4464 -5344 1662 5344 2718 522 -1745 -3793 -206 4993 4877 -359
1063 -359 -2445 -171 -935 32 6385 5419 -3698 -6689 815 6740 2830 -692 400 -1771 -2748 2167
1079 2167 4949 2886 -1473 -2793 -2202 -16 4980 5341 -3375 -6415 -542 3787 2137 -560 943
1094 943 -713 -5245 -2109 4795 4746 -1257 -6200 -3399 1608 2307 1923 -964 -3995 -3165 -655 1901
1110 1901 1922 -192 -1908 -4600 -3986 2992 5211 -467 -5993 -4048 1808 1357 -184 2117 -301 -5526
1126 -5526 -3510 3082 4579 -80 -2717 -1636 -3076 -334 5890 3270 -3621 -4119 729 2290 428
1141 428 2661 2552 -4432 -4558 3127 5480 1454 -1513 -303 -1808 -1725 5155 5712 -1685 -3961 -541
1157 -541 2131 1492 2309 3077 -1574 -4684 423 4841 3142 250 -1702 -2350 -1268 2855 5118 540
1173 540 -3318 -1858 -27 1431 2209 2227 -585 -4422 -3109 2832 4304 1233 -2988 -3621 -310 717
1189 717 1646 2029 -883 -3821 -3166 731 3240 805 -1188 -3653 -4224 6 4236 1365 -2780 -3469
1205 -3469 -1383 -612 -265 3235 1665 -4638 -4669 708 3121 1678 -1149 -1746 -3740 -2037 3424 2698
1221 2698 -1127 -2388 -1563 -1464 773 3968 3482 -3402 -4468 565 2750 2408 1136 -609 -1989 -2211
1237 -2211 2251 4389 1461 -1060 -1803 -1538 1199 3956 2648 -457 -2753 -394 2080 2372 2853 -490
1253 -490 -2864 -1294 1157 3034 2438 525 -1870 -2127 519 3062 2526 198 -1517 -2410 116 1976
1269 1976 2718 -47 -3153 -2681 -405 1710 3413 577 -4195 -3855 -962 1627 1615 -90 -1672 -3221
1285 -3221 -1578 2214 1477 269 -2088 -2658 -1862 83 3113 1889 -2554 -3636 -2469 702 2037 1485
1301 1485 -979 -2948 -2415 1233 2484 1154 -176 -2784 -2359 463 3202 2372 -1038 -2775 -1414 -355
1317 -355 2124 3415 667 -2117 -1938 122 2504 2307 1019 -1216 -2934 30 3339 2593 1444 -1002
1333 -1002 -2270 -717 1895 4077 1440 -1698 -1588 -345 1520 3258 1952 -864 -2264 -1056 2042
1348 2042 2540 1672 -439 -2958 -1502 1388 2826 1791 -992 -2210 -1994 -230 2483 2115 -1042 -2190
1364 -2190 -2090 -19 1983 1706 -75 -2811 -3018 375 1630 1319 6 -2292 -2944 -744 1562 2287
1380 2287 -270 -2217 -2298 -1578 1043 2604 -100 -2608 -2740 -967 1016 1517 1261 -1098 -3343 -1070
1396 -1070 1408 1628 993 -1074 -2290 -1794 647 2819 1198 -1540 -1850 -1355 473 2858 2366 80
1412 80 -2522 -1513 1189 1980 2187 676 -1632 -1895 711 2748 2481 16 -1130 -1425 -304 3171 2788
1429 2788 279 -1514 -1615 91 2052 2626 1277 -1544 -1961 227 1547 2188 758 -1107 -2261 -567
1445 -567 1952 2645 227 -949 -2296 -1081 1410 1770 1010 -1201 -2216 -930 195 1948 1556 -983
1461 -983 -2920 -1738 551 1980 1115 -1009 -2274 -2425 -526 2181 1373 -790 -1622 -2072 -221 1475
1477 1475 1667 -451 -2352 -1907 -525 666 2208 66 -1720 -2350 -237 2275 1678 379 -692 -1830
1493 -1830 -1283 1663 2293 766 -1193 -1397 -244 1207 1491 2166 -1095 -2036 -398 1038 2821 1963 -244
1510 -244 -1290 -1579 1354 2770 1251 186 -1131 -1443 1096 2439 2395 -374 -1775 -1121 332 1625
1526 1625 2339 72 -1458 -954 435 1495 1577 951 -958 -1429 -768 2077 1646 -519 -1093 -2075 -596
1543 -596 910 1338 307 -1947 -1234 -954 1147 1323 682 -1054 -2773 -1679 1365 1630 1097 -986 -1668
1560 -1668 -670 -47 1507 1217 -498 -2388 -1542 323 1923 1211 -869 -1329 -1708 802 2030 1078 -532
1577 -532 -1748 -1244 -78 957 1315 742 -1855 -1755 246 1469 1628 21 -1527 -1778 -721 1982 1901
1594 1901 -193 -1314 -600 -212 1306 2146 1726 -709 -2502 -173 2166 1952 993 -55 -1063 -893 1174
1611 1174 2512 1638 -861 -1272 -220 943 1841 1294 151 -1324 -1464 1639 2175 1394 -682 -962 -675
1628 -675 -449 1260 2356 157 -1842 -1671 -148 1123 1114 563 -828 -2400 -200 1625 379 -183 -1281
1645 -1281 -1643 -1080 331 1346 156 -2933 -1816 -570 828 1247 802 -1042 -2008 -1430 1277 1121 -552
1662 -552 -853 -1474 -1053 5 1822 763 -1386 -1857 -378 767 825 1231 -357 -922 -1669 826 2474
1679 2474 872 -572 -986 -782 21 1553 1561 127 -1363 -825 589 1252 1207 617 -966 -772 -415 1906
1697 1906 2515 0 -820 -853 -106 875 1230 1277 -320 -1699 -383 1500 915 138 -320 -942 -1444 920
1715 920 2906 816 -1121 -1059 -524 -394 449 1080 -392 -2388 -1309 1079 1031 505 -181 -1508 -1518 -94
1733 -94 924 1328 -947 -2043 -894 -1070 258 1558 -568 -1123 -1467 143 911 58 45 -828 -1702 -513
1751 -513 930 897 95 -1805 -1683 108 385 1270 589 -294 -569 -1253 1211 1556 961 7 -188 -370 351
1770 351 907 1641 -24 -1015 -712 -42 738 1153 527 -1460 -1345 34 2622 1620 -422 -351 -734 517
1788 517 1148 1194 505 -809 -618 442 1008 1370 574 -503 -1425 -437 1911 1165 305 -674 -465 -1398 802
1807 802 1484 418 -1171 -663 -469 533 563 1042 -1370 -1067 -435 1037 1110 201 -430 -1564 -1146 175
1825 175 1253 282 -1188 -599 -1184 819 371 857 -676 -1056 -96 49 696 1004 564 -1257 -1153 -251
1843 -251 1177 1042 -119 -611 -1403 8 1067 1072 -121 -396 -1256 -571 810 1390 614 -518 -600 349 717
1862 717 1186 1082 -268 -1347 -79 984 1289 557 -90 -846 -480 1013 1448 979 -476 -833 -478 392
1880 392 1129 1215 -229 -800 -522 445 1069 832 282 -742 -1095 346 1163 840 -35 -982 -1049 125 1066
1899 1066 1285 -174 -950 -675 -317 785 1249 160 -830 -1645 -673 724 855 -52 -788 -1601 -778 228
1917 228 544 356 -717 -1424 -696 41 933 210 -756 -1045 -991 -43 903 546 -332 -1251 -885 72 996 827
1937 827 -54 -1151 -920 68 855 859 -271 -689 -806 -280 979 1000 12 -560 -745 -77 1248 1006 570 -882
1957 -882 -1018 371 1067 1027 711 -203 -653 -23 645 1528 375 -209 -622 -549 904 1436 524 -54 -1168
1976 -1168 -285 568 733 853 0 -780 -339 278 729 1093 -402 -877 -850 -24 1116 628 -58 -1214 -1056
1995 -1056 -7 676 326 102 -1238 -953 28 278 658 -174 -1040 -1156 -433 473 703 -194 -868 -923 -446
2014 -446 319 754 190 -418 -1207 -658 464 614 275 -594 -957 -626 14 825 601 -499 -828 -768 18 1009
2034 1009 538 -322 -777 -789 114 1061 790 12 -839 -332 229 789 884 205 -724 -297 165 1094 1043 17
2054 17 -315 -259 -33 854 913 259 -598 -760 -126 322 956 826 -571 -645 7 417 818 216 -369 -1007 -377
2075 -377 861 734 425 -150 -557 -627 459 600 786 -98 -962 -641 74 766 645 -503 -1243 -685 -222
2094 -222 583 485 -423 -885 -1163 93 537 246 20 -1069 -898 -368 486 802 -169 -986 -924 -217 354 997
2114 997 126 -888 -1047 -280 285 382 190 -411 -702 -414 410 829 442 -314 -888 -388 419 836 738 -232
2134 -232 -604 -359 494 1074 722 230 -499 -667 291 911 734 217 -320 -271 401 974 1100 433 -609 -471
2154 -471 390 1214 1049 51 -190 -748 -289 766 933 320 -737 -1061 -107 642 478 387 -589 -891 -428 463
2174 463 918 227 -530 -724 -507 162 730 648 -333 -1237 -507 352 285 139 -256 -1130 -764 -104 704 418 -373
2195 -373 -1026 -798 -314 585 626 -509 -978 -980 40 470 398 180 -617 -1124 -107 614 1034 309 -676 -536
2215 -536 -505 365 1008 278 -883 -713 -185 610 626 221 -33 -731 -502 481 702 235 -318 -507 -53 191
2235 191 1185 869 -458 -837 -412 292 1040 724 321 -466 -595 291 948 500 55 -500 -256 178 592 920
2255 920 293 -691 -735 276 613 683 89 -155 -701 -396 538 537 69 -1036 -551 -188 239 532 178 -627 -1242
2276 -1242 -401 153 691 -12 -542 -766 -355 110 585 -29 -221 -795 -572 161 346 486 -299 -699 -392 -99
2296 -99 542 604 -433 -470 -422 116 304 846 -239 -572 -484 325 669 427 91 -270 -722 114 841 698 -188
2317 -188 -334 -267 -210 816 755 323 -59 -343 -216 387 902 445 -18 -638 -283 781 930 322 282 -624 -144
2338 -144 -8 476 760 -131 -619 -416 115 740 337 -133 -588 -414 308 333 500 386 -610 -766 4 459
2358 459 711 -315 -1014 -785 -60 439 274 -161 -393 -1091 -108 959 -142 -117 -349 -728 -555 263 783
2377 783 -10 -774 -932 -712 -79 137 356 -557 -977 -430 354 383 558 -474 -485 -249 -225 742 290 -461 -309
2398 -309 -470 140 835 684 212 -510 -419 898 1117 659 110 -575 -144 -264 758 666 27 -236 -238 669 -90
2419 -90 457 422 -988 -75 418 691 854 319 -119 -516 -254 411 873 588 -248 -465 -137 738 461 527 -450
2440 -450 -556 -162 -17 230 646 -108 -777 -394 -213 474 143 -278 -755 -934 -197 299 499 225 -738 -815
2460 -815 -45 414 437 -488 -663 -602 -367 31 544 -215 -438 -430 -204 391 102 -4 -585 -768 -5 501 766
2481 766 105 -357 -600 -90 171 660 353 -427 -138 -65 258 544 321 -64 -151 -325 331 515 485 12 -222
2502 -222 -139 99 730 320 207 -295 -12 43 295 856 -50 -337 -305 -9 917 570 122 -90 -596 61 441
2523 441 610 476 -334 -242 -281 448 490 18 -448 -667 -282 500 224 -6 -162 -745 -286 45 221 85 -283
2544 -283 -905 -244 -176 217 306 -454 -695 -342 -182 736 385 -575 -402 -580 -58 400 230 -171 -564 -686 -226
2565 -226 299 430 -47 -630 -374 -301 593 515 117 -327 -439 -195 229 381 372 -312 -463 238 331 554 443 -455
2587 -455 -588 -522 134 692 456 -118 312 20 783 -174 870 -427 -1034 -371 -34 503 138 349 -554 -202
2607 -202 161 311 586 -7 -318 -244 125 490 622 430 -656 -525 -58 714 578 -121 -173 -721 49 60 112
2628 112 203 -560 -472 -288 370 495 -83 -464 -464 -715 485 95 89 -541 -704 -55 30 210 -314 -410 -529 -95
2650 -95 53 548 53 -376 -1008 -573 207 787 362 -368 -571 12 47 536 324 455 -820 -746 -180 397 526
2671 526 -370 -296 -16 -576 670 498 159 -335 -359 255 595 689 117 420 -1023 -98 698 474 396 -287 -470
2692 -470 -109 298 301 403 -193 89 135 427 650 428 16 -485 -480 -13 439 -2 -368 -293 -382 -35 -60 622 -312
2715 -312 -201 -419 -142 557 275 -234 -371 -424 -265 536 -9 157 -483 -537 -484 191 252 -299 -480 -311 -253 374
2737 374 286 -104 -18 -559 -418 340 349 -595 -470 -361 -198 -16 -31 346 -469 -868 -63 -246 740 799 244 -603
2759 -603 -506 34 328 420 -175 -264 -105 375 362 565 363 -286 -40 360 261 533 -42 -93 -27 -381 371 22
2781 22 291 -327 116 -74 69 670 -125 -278 -437 -777 505 516 361 172 -183 168 -610 440 702 -479
2801 -479 -834 73 531 -77 -159 200 -474 -721 149 552 460 -7 -409 23 -50 383 45 -102 -81 -161 -345 -57
2823 -57 -22 -333 -411 -769 -482 360 -53 -604 -460 -765 126 423 649 -343 -410 -707 -23 -693 312 466 -294
2844 -294 -474 -191 -323 213 394 -186 -14 -259 363 505 509 -16 -590 -545 766 694 412 -44 -140 -154 273 770
2866 770 -13 -27 -326 -531 -298 610 880 432 -3 -69 240 -129 433 288 -573 -247 -598 523 608 -261 -212
2887 -212 2 -251 43 526 148 -502 -409 416 795 478 268 -352 -480 -176 247 543 -359 -496 -390 -292 -173
2908 -173 105 32 -11 -1169 -478 -57 234 -480 -1013 -1128 -449 -341 -390 -167 -363 -1108 -718 -209 -78 790 -121
2929 -121 -198 -667 -172 875 441 -40 367 209 446 549 584 285 -106 -357 -61 745 314 600 -384 -310 331
2950 331 695 -63 -110 24 147 -138 54 -111 366 205 -929 -85 -250 381 306 249 -546 -626 -161 800 186
2971 186 -53 -63 -549 2 276 368 85 -601 -646 658 228 347 -56 -725 -134 -7 417 -12 -45 -629 -571
2992 -571 -26 -36 178 -139 -350 -558 -515 481 565 180 -351 -282 -264 131 211 -94 -640 -477 -213 44 126 161 -318
3015 -318 -557 -542 189 398 257 -72 -224 -531 48 374 135 -76 -635 -333 75 441 492 -30 -309 -425 189
3036 189 574 473 140 -156 -150 508 134 439 145 -48 -112 -31 468 506 505 -59 -206 -103 239 661 15 -187
3058 -187 -200 21 393 299 273 170 -628 -243 399 309 259 -55 -229 -101 56 219 317 -132 -297 -353 148 320
3080 320 230 -187 -339 -323 -51 154 146 -131 -703 -759 -408 292 63 -200 -553 -313 -340 141 319 -160 -312 -761
3102 -761 -458 341 200 -51 -222 -500 53 184 331 256 -266 -523 -56 29 514 -174 -145 -58 -93 242 544 179
3124 179 -52 -153 -141 94 411 517 167 -217 -128 470 600 294 -197 -124 -233 383 252 391 57 -189 -296
3145 -296 117 218 609 239 -139 -312 -138 385 562 46 -564 -179 -244 -12 570 86 -198 -342 -155 221
3165 221 417 305 -397 -625 -192 212 151 236 -316 -384 -300 -66 56 356 -111 -495 -408 -9 105 -102 -177 -535
3187 -535 -426 253 52 318 -174 -463 -355 -342 147 333 208 -101 -31 -162 458 301 -144 -180 -215 -142 181 450
3209 450 284 -252 -180 -226 368 250 502 -242 33 -59 223 777 531 42 -268 -270 453 492 353 -141 -322 92
3231 92 312 571 382 -125 -422 -102 46 323 325 -229 -396 89 231 469 332 90 -362 -270 207 287 315 -166
3253 -166 -520 -513 -139 177 388 -94 -246 -278 -197 98 98 -200 -98 -712 -191 130 355 -89 -39 -692 -360 170
3275 170 268 112 -363 -381 -84 26 224 -8 -159 -266 -121 37 220 108 -41 -296 -670 -220 190 524 84
3296 84 -254 -89 171 362 554 57 -105 -235 114 564 196 130 221 -164 52 407 579 222 -196 -137 181
3317 181 548 638 454 -221 -283 303 582 518 367 -87 -386 -120 261 640 161 153 -711 -90 134 105 178 -178
3339 -178 -439 -401 -116 351 487 -180 -251 -270 -155 150 209 -203 -391 -103 44 309 254 187 -552 -674 -60 319
3361 319 361 -207 -378 -383 -298 -61 121 -38 -386 -332 -58 261 210 -25 -331 -542 -249 35 101 -61 -170 -189 92
3384 92 158 179 428 -193 -379 -268 205 323 287 153 -196 -109 182 160 586 289 -388 -264 196 370 669 -5
3406 -5 -331 -217 -58 454 160 110 -157 -380 -220 387 12 53 -21 -414 -39 -176 344 314 -92 -371 -224 272
3428 272 84 174 -14 -1 -370 -83 208 113 -53 -288 -431 6 83 48 -303 -302 -243 -14 121 -35 -489 -121 -236
3451 -236 -33 121 -96 -257 -436 -352 133 55 137 120 -172 -319 -272 -131 222 192 -241 -237 -239 276 270 -7 -546 -577
3475 -577 -387 390 608 121 -5 -159 -48 479 507 342 -370 -162 -82 61 396 271 79 21 -144 151 842
3496 842 125 32 -11 -255 133 359 313 281 -432 137 247 218 192 -139 -374 -494 214 358 110 22 -263 -368
3518 -368 -72 519 318 64 -203 -376 -130 -40 273 171 -365 -279 153 -16 199 17 -495 -259 -203 33 540
3539 540 -219 -4 -323 -131 48 -45 -52 127 -413 -613 36 401 73 -316 -266 -505 -134 191 129 21 -230 -315
3561 -315 31 1 336 -156 -379 -211 11 503 448 109 -258 63 -67 248 488 67 30 -49 138 293 97
3582 97 124 117 -344 124 340 133 297 -101 -117 -301 219 534 269 -203 -103 -285 147 594 38 15 -116 -367
3604 -367 224 45 369 111 -303 -129 -43 107 209 -172 -463 -402 -230 260 118 -229 -356 -454 -363 302 -1
3625 -1 -78 -293 -175 65 -143 -226 29 -311 -265 -257 -49 96 31 -166 -305 -153 117 319 -7 1 -312 -274 -11 207
3649 207 221 -186 -383 -37 -24 278 451 -428 -210 26 -152 230 93 80 -21 -207 -26 344 178 160 -176
3670 -176 -44 57 151 433 60 -237 79 57 155 420 162 -174 10 16 331 331 272 -5 -199 -163 -74 153 -150
3693 -150 -241 -145 167 7 210 210 -208 -224 -282 -73 181 -70 -225 -249 -557 54 210 5 -132 -592 -259 83
3715 83 217 157 -272 -498 -15 -211 225 78 -269 -79 -240 -270 404 135 -77 -451 -243 128 130 89 -6 -162
3737 -162 -400 -59 -130 348 -47 -235 -113 -335 316 293 111 41 80 -33 215 216 336 121 -68 -81 264 233 289
3760 289 -49 206 84 31 235 274 -41 -25 -337 359 238 204 13 -59 -356 217 130 51 373 -270 -161 -13
3782 -13 -118 409 -123 -160 -41 65 133 -59 62 -81 -127 -35 104 219 -63 -190 -429 62 117 162 60 -173
3804 -173 -189 -392 262 199 -115 -179 -350 -73 290 222 123 -21 -348 -366 189 335 57 -369 -153 287 -38 226
3826 226 181 -165 -165 -44 -66 674 45 -15 -179 -356 -28 183 -9 -72 -257 68 96 144 137 155 197 102 -22 132
3850 132 537 9 210 -71 -95 48 255 179 433 -28 107 207 -56 203 -61 315 -138 289 443 180 284
3871 284 -240 -10 362 147 391 -158 -525 -7 -186 49 349 102 -72 -122 18 66 80 -246 178 -258 -190
3892 -190 310 85 -156 9 -246 -212 365 12 65 -161 -530 -101 76 321 -177 -116 -368 -47 -123 710 460
3913 460 -72 -316 -188 260 -77 126 -192 -377 64 74 331 4 -655 -60 -506 141 532 22 329 -462
3933 -462 161 195 47 50 -244 252 -363 241 574 720 482 -512 228 422 266 657 -10 194 217 -376 866
3954 866 640 442 323 -368 -119 265 -543 126 250 -89 -295 9 358 357 212 -1051 -127 -162 -36 298 -568
3975 -568 207 -777 -476 117 4 -27 -584 -863 448 306 194 312 -440 -213 -554 -346 445 -63 -388 -571
3995 -571 -145 412 101 -670 -244 18 225 -211 -67 43 -223 -259 -318 521 154 231 -293 -347 -172 579 406
4016 406 127 1 -154 60 -40 167 -417 83 -72 106 -119 170 499 616 270 212 10 150 313 -748
4036 -748 -273 -610 6 739 156 51 -16 79 574 11 131 296 -265 61 229 108 50 -93 -443 -153 -150 346
4058 346 492 10 -19 -242 37 -141 212 -321 -18 -94 135 99 -107 268 -166 -162 -278 37 28 399 -206 -234 -129
4081 -129 -24 142 115 -527 -331 -75 -134 20 -232 -184 87 -73 278 13 117 71 -109 -264 42 343 140
4102 140 -80 -221 -270 -235 279 86 -128 -30 -521 66 52 61 92 -47 -100 61 295 217 163 -12 -48 -37 377 122
4126 122 395 -180 -190 -19 166 140 -38 -226 -211 256 214 264 103 -26 -278 -222 112 481 -206 175 36 -352
4148 -352 45 -18 -130 56 -294 -271 -57 163 -301 46 156 -270 439 -710 179 -300 -163 85 -84 -250
4168 -250 -65 97 -288 -349 -308 -301 553 -124 -212 -222 -462 -358 339 328 277 267 -395 326 426 327 -98 -180 55 -523
4192 -523 327 350 -109 -446 -49 -93 -265 553 -327 196 -516 -20 727 374 160 -642 22 -225 354 231 -135
4213 -135 233 -653 -144 665 1102 482 -179 -12 -336 471 505 -477 235 -178 25 189 596 453 -526 -121
4233 -121 126 12 407 -160 363 -393 -106 117 489 555 -248 -20 -150 97 -407 179 -190 -217 -463 281 347
4254 347 251 342 -922 -643 -48 -114 405 -213 -426 159 -688 119 -105 7 -799 88 -572 -629 422 -711
4274 -711 393 -475 406 229 246 188 411 -580 687 549 704 396 -296 -740 -499 -71 523 126 -727 394
4294 394 -1324 375 559 949 -300 177 -438 131 205 -523 64 137 61 154 5 644 -439 -590 11 -100
4314 -100 481 -218 1081 -467 -422 194 141 772 -412 207 -299 -96 -507 1175 286 -126 -60 -423 -318 -287
4334 -287 211 -185 -707 144 -105 446 -220 -349 -244 -347 -185 -573 484 -270 -186 -362 -224 436 412 -452
4354 -452 -62 444 -663 377 -199 -426 -209 -583 841 1062 -736 -36 -737 -396 -72 377 103 -511 61
4373 61 -4 -192 78 -348 443 -202 -153 233 -108 -512 375 306 271 -507 866 1305 -728 400 -298 -186 -232
4394 -232 823 728 33 -194 571 39 428 861 -86 -929 -315 -58 -76 184 -263 358 -37 -156 -19 25 340
4415 340 519 1 233 535 -42 334 -119 -65 -700 -22 -133 118 -87 220 -508 -46 520 -6 -117 573
4435 573 147 29 -260 195 -709 -59 -91 -286 -242 -265 394 -358 -328 -547 257 93 29 -118 73 -188 239 552
4457 552 -233 102 -374 -128 167 -353 -250 -21 350 -345 -74 108 195 -35 344 -17 83 -196 -27 -232
4477 -232 -51 389 653 -124 281 20 268 596 286 847 350 -316 -516 -286 -76 -57 -678 -41 83 -708
4497 -708 84 -229 -102 -329 -469 -450 399 169 649 389 -618 -197 -357 301 -183 354 -244 -300 -438 286
4517 286 -146 -150 -236 -356 -94 282 83 168 -168 -672 -282 -87 -200 220 -255 -77 -478 -110 17 -84 -223
4538 -223 -368 -250 160 391 267 -603 106 285 227 269 -12 614 77 140 -100 655 106 -139 121 -83 -153
4559 -153 506 3 -82 -366 -176 -162 62 -75 546 -281 -369 447 -440 -268 -369 353 126 -142 -116 -295 -672
4580 -672 -201 128 -200 -456 123 -23 -15 270 -53 314 7 -136 206 210 -146 230 185 1538 -228 42 -23
4601 -23 -772 493 484 -358 -816 -648 -20 593 158 -485 -665 -243 -498 302 -625 -35 -1288 -797 -497 -421 -104
4622 -104 151 -1054 -895 556 517 -91 -100 -11 88 -773 -650 -200 14 -323 -323 1133 -306 -89 69 504 -193
4643 -193 37 243 -517 -508 1104 486 -7 445 66 63 122 -690 1101 599 680 -1107 -1218 -360 183 78 -321
4664 -321 400 -112 140 -179 -432 32 341 -279 1050 -166 -373 544 -478 -395 -590 240 -447 -633 -686 -353
4684 -353 -38 -256 -398 254 -753 -719 139 -296 60 -271 -1056 82 -962 492 -486 -178 -953 -540 575
4703 575 58 434 -598 641 -606 -76 63 -791 204 218 -1689 -67 -280 115 504 772 -63 754 -107
4722 -107 465 929 -524 691 -627 422 -343 -1206 -19 127 563 -348 43 -19 23 70 -677 563 -508
4741 -508 -130 260 -55 41 204 16 204 -435 -812 -703 -24 629 -420 211 70 -536 1037 550 -777
4760 -777 762 -395 49 -375 324 -389 606 -34 -157 548 -684 -75 -609 -687 287 -795 -1633 -168 8
4779 8 -626 698 -59 -251 290 203 258 -228 -826 74 -273 -1108 -338 -690 767 315 54 -996 637 -26
4799 -26 -488 -212 -31 301 -340 -380 530 -110 -476 -220 -24 -503 163 -397 -191 15 -333 -74 17 -469 150
4820 150 305 -104 -76 413 134 -369 150 -146 218 -283 -481 24 -467 -307 62 1146 461 437 -191 -782
4840 -782 730 606 -60 -132 197 492 -426 715 -373 -839 466 -127 -501 -28 -1017 53 -421 374 393
4859 393 295 -123 194 128 -587 -146 -659 285 -228 -537 -475 346 33 406 71 -388 -334 -340 185 -54 67 123
4881 123 56 173 -41 102 632 -280 -252 176 408 -80 -26 -178 33 -230 -68 -203 -475 -75 -147 234 -25
4902 -25 127 -34 -96 -175 45 131 9 -29 -94 -188 -237 472 -128 78 196 240 -147 -46 347 266 -367 117 -181
4925 -181 124 61 -196 132 59 99 -180 274 262 -40 107 108 -99 65 -296 -218 199 -122 -59 -270 195 75 -151
4948 -151 186 47 -227 -99 61 -239 51 -69 386 33 -142 -42 -155 19 31 27 315 -57 -11 215 94
4969 94 77 68 -104 -159 57 -24 88 -64 -128 -151 44 72 -27 -97 48 36 -228 -6 -135 149 -51 -270 -28 -157
4993 -157 33 -2 0 -52 76 -299 227 139 3 -135 -85 -1 55 259 -21 -68 -206 -8 51 148 -24 186 -228 -114
5017 -114 -58 238 -152 -145 315 308 -101 -21 182 -139 -375 245 96 109 158 -102 -128 -190 -111 49 -72 -27 25 -273
5041 -273 22 -12 85 -75 -88 -239 263 -16 255 96 -387 -203 224 -30 317 -5 184 -309 50 -46 -150
5062 -150 -36 22 -76 -5 151 -53 49 31 -73 20 -130 23 -89 -166 -115 -29 -85 -65 216 -270 123 26 29 -43 333
5087 333 -110 -153 -111 229 -119 127 19 170 146 63 -76 64 -188 233 139 -146 151 -89 232 -69 -235 207
5109 207 91 9 -274 34 -330 -39 186 172 31 204 -15 -46 80 437 5 51 217 41 182 36 6 -162
5131 -162 -49 -202 58 69 73 -128 -314 -35 230 -62 30 -43 -326 -99 -88 -21 -153 82 -105 -11 205 240 69
5154 69 171 -79 191 291 -88 93 -8 43 -185 -313 123 88 -94 -99 -25 63 -35 153 22 -40 -91 5 83 -44
5178 -44 -21 6 -111 -49 13 257 85 -30 38 149 104 97 125 -68 343 -81 330 -98 149 251 -219 -119 33
5201 33 225 30 -71 185 -19 -10 32 -23 188 156 -165 186 260 155 -1 -60 -174 -38 72 214 -70 -12 159
5224 159 137 91 262 135 16 -49 171 264 -113 -63 -32 -49 65 123 1 7 -174 -64 -38 130 -17 45 90 123 -254
5249 -254 -73 195 73 -307 -30 -121 170 -66 -160 56 -87 90 228 122 -43 -179 -92 -6 -90 48 13 -54
5271 -54 -93 -271 235 236 27 276 -3 6 127 369 -20 24 -28 -318 -83 155 24 148 111 25 24 -16 73 237 94
5296 94 135 215 136 278 408 -48 -113 88 70 23 26 -245 -93 21 -65 65 58 127 -24 -158 113 188 303 -223 -30
5321 -30 -80 -399 -41 272 110 -42 -40 152 -45 -72 -233 -74 -115 -245 0 -57 148 -200 148 134 110 292 -90
5344 -90 -200 -195 -205 192 -80 -87 46 -2 -311 31 -84 -63 74 -173 -149 117 180 77 -256 -174 -124 208 79 58
5368 58 43 -83 37 109 6 126 -63 -17 48 181 138 -61 149 172 107 38 95 248 253 -25 173 81 237 138 191
5393 191 66 53 31 -43 -108 -284 70 23 -234 189 135 80 4 -23 214 -75 192 282 88 -105 -185 104 1 180
5417 180 -284 -143 -108 -106 301 127 -98 -150 -271 24 120 -6 4 -97 -125 1 2 79 94 -92 6 -25 -121 -79 -233
5442 -233 206 121 -105 58 191 78 -278 172 148 97 157 37 -63 48 141 -126 -162 57 -219 185 135 134 -87
5465 -87 125 24 -174 29 -148 201 187 -125 109 143 110 4 1 -18 -63 -47 -126 190 34 -156 92 67 -60 39
5489 39 68 85 105 124 77 14 -398 -69 -153 -226 88 -86 -64 -60 -81 88 -92 182 195 42 47 89 -139 -176 -74 125
5515 125 -106 185 -59 -62 -13 1 117 -220 -124 9 195 -118 288 41 -122 -218 -76 -110 175 294 -202 -72
5537 -72 36 235 147 -268 -106 49 108 -9 -63 191 69 51 25 237 -172 232 -96 57 65 400 46 -193 117
5560 117 158 94 -168 15 185 193 101 -48 115 305 -245 -38 -44 27 130 -40 -51 -141 -158 -52 -22 -153 -47 -460
5584 -460 -293 55 51 175 -74 79 -73 124 -137 102 203 -179 -132 27 182 -142 -54 -187 -173 -125 94 42
5606 42 -39 51 -60 3 100 295 -3 270 -164 15 -145 -175 213 125 118 -59 -116 -223 96 -64 -166 -17 -83 295
5630 295 133 304 -152 -48 59 53 -98 29 -96 -302 223 211 109 141 26 -176 -232 264 73 324 247 -118
5652 -118 -10 42 -80 444 -10 92 74 -178 99 -22 272 13 -327 105 -244 -7 149 124 -98 -84 -151 -264
5674 -264 154 -82 -74 85 -31 -20 -52 -67 2 -241 -105 187 -177 -158 -67 -75 43 190 -268 -22 -5 -135 -207 124
5698 124 -134 98 -43 130 -12 81 -259 -30 -34 -99 164 99 -170 -201 145 -120 42 -208 -19 -2 -223 -48
5720 -48 303 211 243 -119 -110 -131 -132 403 3 150 44 183 37 -61 236 81 63 -77 149 346 229 -205 193
5743 193 45 -264 -21 223 84 -23 284 153 -4 -105 35 78 84 -141 -100 -125 114 -86 -221 -154 333 -261
5765 -261 -122 -15 119 -88 -28 51 -134 -69 139 -136 26 -12 57 -29 359 -177 69 224 -235 16 64 60 -172
5788 -172 136 78 68 -15 47 7 2 37 130 -46 30 49 39 26 -363 -251 -153 86 -31 55 -63 -149 -18 -353 -126
5813 -126 205 -120 203 -101 -258 160 113 177 -8 67 86 -48 -49 -142 114 -402 123 -128 264 351 84 279 -350
5836 -350 -125 -129 -311 188 180 128 92 -224 -287 40 265 -138 -224 74 -398 -97 303 147 170 -131 -73 124 -10
5859 -10 -122 246 213 107 -57 181 -144 116 -23 -134 82 393 -129 -202 54 163 -215 -25 -170 97 -32
5880 -32 -389 -233 -299 -166 140 47 7 -141 -328 -115 452 -234 -89 16 342 6 -144 -49 159 -80 -286 20
5902 20 -131 -257 72 -274 139 125 48 -37 -241 332 120 93 -24 69 17 -77 -144 -359 115 -208 135 -126 -145
5925 -145 258 -150 128 -278 -235 -107 32 -182 275 -205 371 -419 -179 -150 20 -224 146 245 37 141 131
5946 131 -119 -70 242 213 295 -158 149 8 16 46 -109 177 55 243 84 -245 172 -192 238 35 -22 -60 21
5969 21 65 168 82 -25 -105 -238 -128 -104 356 122 -45 -7 -215 -317 -252 245 -1 198 -243 13 -29 20 136
5992 136 -138 -393 -146 340 5 261 25 113 -91 -84 -46 249 44 127 178 -142 60 113 276 -280 303 95
6014 95 187 166 172 -104 -40 -108 -25 -175 163 -6 -103 387 -622 -435 -72 227 123 142 -2 719 -164 136 223
6037 223 666 20 196 815 -606 297 316 818 -151 -504 -40 -501 554 -182 -217 -235 -758 -633 -60 266
6057 266 -335 231 -458 -301 -693 630 255 434 637 182 363 -608 493 -228 1088 358 197 246 -435
6076 -435 31 -406 125 -83 -135 -597 120 -445 365 -6 10 340 -365 81 -117 -31 -476 368 348 329 -235 -454
6098 -454 -90 873 356 143 -638 -172 171 159 445 -122 -248 281 -224 256 737 -343 -18 460 -405 177
6118 177 702 -103 329 58 185 -121 888 -305 207 -365 378 -580 878 -802 -572 -125 -21 177 -246
6137 -246 -30 -286 401 -564 -189 639 -13 462 -469 -643 17 -260 542 57 -100 203 -342 -66 359 114
6157 114 -16 -434 -132 180 744 -352 -146 382 -330 -495 25 398 -542 222 -154 131 276 -664 -700 -59
6177 -59 -94 522 -227 59 -229 67 -671 496 -105 27 522 -320 -641 -72 -306 298 259 -112 166 -315 494
6198 494 -791 57 -112 -42 -240 104 -137 -187 11 -59 588 -189 124 321 126 40 513 -253 427 568 -822
6219 -822 571 -437 -535 -1193 782 65 -385 2 -247 -196 11 928 -203 -554 -248 -132 -72 233 -262 218
6239 218 150 -345 -179 -639 -168 -98 -253 621 -443 133 116 79 -263 -500 155 138 0 -807 -434 -108 -658
6260 -658 -46 -484 466 238 238 164 -113 -80 409 389 -369 355 276 532 -341 167 342 297 113 -61 578 -153
6282 -153 -90 -378 -284 201 -970 113 -22 -304 -209 -90 261 -36 -716 -264 -221 325 285 -155 505 164 131
6303 131 -107 -179 465 248 -512 408 23 193 312 -406 -414 254 302 254 189 107 -8 -101 -264 107 89 -110 218
6326 218 -68 -274 171 125 -211 507 -407 374 17 -71 309 77 -600 390 790 -79 352 -207 445 -152 110
6347 110 191 233 599 363 443 279 -299 198 -401 -213 65 -425 -1035 676 887 -7 1057 -706 330 958
6367 958 48 276 -120 105 278 -119 -265 -603 1133 -490 499 240 -312 680 657 -1392 195 -123 412
6386 412 -740 -640 -59 -282 111 -131 48 554 -1149 -523 111 717 503 1898 1470 79 -387 907
6404 907 545 -62 147 663 -79 70 130 482 393 163 373 -83 252 -636 -66 196 101 -148 493 186 -138
6425 -138 -373 -116 -475 -315 46 275 -582 -616 -190 -940 45 624 143 122 187 -41 620 291 1 -280 296
6446 296 -11 193 -407 787 752 1049 -782 177 -426 430 437 22 922 -73 504 -54 -231 842 581 240
6466 240 -295 575 144 435 -138 79 152 -107 -563 168 313 272 -430 137 -41 416 76 -86 1 -74 245
6487 245 263 901 711 463 -114 434 393 -590 175 814 667 -822 227 271 340 -772 326 -194 389 91
6507 91 -82 -407 -297 -449 348 -15 -208 -24 -188 -403 695 150 -695 -1033 -577 -466 476 83 562 336
6527 336 85 514 -116 -515 1209 -386 -100 -202 -864 -859 -211 166 -284 -203 248 844 -168 91 -74 321
6547 321 -272 -424 -452 -408 -248 112 -257 -561 134 732 -207 -553 -553 -271 265 47 -726 473 -22 -564 128
6568 128 266 652 -368 -654 -41 -588 -598 117 -845 2 -884 286 1053 153 -93 816 43 -455 -195 -405
6588 -405 790 383 -102 229 215 -84 103 135 13 -226 933 45 89 -738 -525 667 664 -224 16 13 -118
6609 -118 152 445 -529 -14 -215 170 -634 380 -283 108 252 10 -615 -673 253 -570 226 -202 -342 384
6629 384 -370 334 -487 719 26 292 80 -141 452 -955 689 -130 -280 -766 24 -230 -478 88 340
6648 340 144 -45 412 270 -480 -356 -138 104 96 -30 58 -253 -435 -511 137 -25 655 591 -378 272 -288 -81
6670 -81 219 179 -271 46 44 250 -434 -357 -120 -53 298 -985 -193 441 79 -8 -300 48 29 162 -191 -1068
6692 -1068 -135 192 -370 -201 42 -742 -16 112 -170 -281 -161 -312 85 -144 -37 -332 152 82 -78 -365
6712 -365 157 712 232 -371 337 264 335 156 428 -356 -526 -282 259 -70 162 -401 420 -422 54 196 -158
6733 -158 382 456 -214 -267 -295 217 -208 263 -380 -596 87 -205 42 91 -359 -109 -8 275 373 -376 574 -418
6755 -418 -95 -220 363 -210 99 -251 6 670 -236 -149 33 225 -132 176 -178 150 45 392 -353 -135
6775 -135 -126 72 125 283 238 -51 -295 -823 -197 107 126 -120 -683 52 -455 -258 292 -261 -126 255 -368 7
6797 7 -46 -335 -535 510 112 315 -224 287 -112 283 -162 105 381 102 130 192 -58 -172 -8 -132 59
6818 59 -337 260 185 -64 27 37 -71 152 -191 28 54 136 97 -186 224 329 45 -202 543 363 -1 -28 -325
6841 -325 -60 34 -100 -182 28 19 -209 -135 -292 38 58 -434 -76 -24 104 23 236 38 -368 -280 -19 105 -63
6864 -63 65 -193 -217 140 25 -101 -104 -44 -422 -111 -24 -2 8 -17 -218 124 -78 -78 175 -293 -104 201 309 -139
6888 -139 83 -66 1 115 203 125 -171 22 60 -341 113 398 265 8 -94 71 -72 -269 -141 69 -21 -47
6910 -47 -22 -176 125 -64 151 135 48 -51 74 70 353 -103 -75 -184 -184 57 -209 35 158 -87 315 -66 -294
6933 -294 205 -159 70 33 17 -137 -237 220 -12 -41 47 -47 -159 -216 94 -135 -146 185 -6 -172 -117 -161 -104
6956 -104 -90 -300 -219 -87 43 -101 19 113 -231 9 161 -108 -237 236 -149 -69 -307 72 179 56 -38 -89
6978 -89 -40 -94 35 -186 -159 369 164 239 -19 12 -26 168 67 -244 -53 278 436 -96 113 196 -103 -213 -93
7001 -93 111 -18 91 158 -178 -130 -246 -2 192 105 -157 125 -159 393 -22 45 88 -90 310 -16 146 -238
7023 -238 199 117 169 -110 173 110 -79 -161 -340 250 58 -6 -351 -168 144 -93 80 -312 -185 -153 -204 -8
7045 -8 -17 -14 -50 -3 -445 -55 58 32 71 207 230 300 242 -338 -226 71 -121 49 -263 201 139 -188 -297 158 141
7070 141 -43 225 -46 -414 161 -205 -148 154 335 430 172 -24 -271 17 -34 148 299 306 -160 -427 167 -65
7092 -65 -33 47 12 57 247 -230 -133 18 -112 223 -181 390 -252 307 130 -150 -352 6 -24 -37 -354 -604 -315
7115 -315 5 -129 -269 -398 -107 38 498 -346 325 -179 -211 219 -41 -88 -601 -694 77 -318 130 597 4
7136 4 -7 -427 -265 -282 -199 570 79 -191 -186 226 -536 238 -7 155 -377 -333 -132 582 -447 477 -376 -511
7158 -511 -481 121 236 -29 119 411 553 131 135 423 -31 -479 -307 -14 160 595 -184 -245 133 -201 277
7179 277 -681 -290 559 -100 268 -232 383 -63 -287 408 -333 129 155 625 -141 -377 18 -15 -568 -222 -431
7200 -431 -325 -314 -25 245 530 213 -168 -239 369 -663 77 348 -244 175 66 41 -503 160 20 276 -45
7221 -45 190 72 173 -430 494 833 314 148 176 -480 -446 129 -226 -373 541 194 101 342 -605 -312 206
7242 206 -280 181 99 -275 -17 -131 338 -340 -238 -37 25 223 -73 -66 494 -569 534 -254 313 142 0
7263 0 -135 102 66 182 11 -272 315 370 -368 -93 131 -71 29 44 64 9 53 37 -124 -239 -220 194 19
7286 19 136 321 98 -197 -21 133 75 -177 69 -53 256 87 136 -81 -130 70 287 -165 -183 93 -229 -197
7308 -197 -102 -76 -25 270 -48 223 -387 34 -251 508 -180 -178 -17 -84 -418 85 173 82 164 -73 299 524 377
7331 377 -278 -495 -96 23 355 17 218 216 192 204 45 -135 188 -61 -548 233 197 -175 219 367 201 -71
7353 -71 -179 208 22 113 -101 165 48 -272 338 -90 -422 1 -1 72 -155 329 161 -60 40 12 463 -160
7375 -160 0 -161 -148 -312 389 -522 129 -395 -276 -9 141 -43 -83 -79 -19 -9 -140 -164 -210 -80 190 -245 -216
7398 -216 -9 207 -160 -533 -196 403 -27 -242 -301 -387 -329 -611 -268 19 -300 -365 -14 -168 -499 198 -155
7419 -155 546 213 -344 228 -238 -93 301 150 -254 282 258 -39 442 464 -152 17 -86 223 -87 655 -442
7440 -442 283 630 181 -35 -71 8 103 590 -166 57 0 220 -145 -362 20 -116 -96 205 191 310 77 -52
7462 -52 -117 -497 96 -422 -25 -323 -324 153 -110 -41 -519 -125 -559 191 -166 -266 -87 174 -346 68 -23 -541
7484 -541 -93 -52 -872 250 -253 265 209 477 148 209 130 -83 213 27 263 -36 54 -101 -140 235 -52 80
7506 80 213 170 -44 52 -133 210 -107 -159 -96 -154 -443 -119 -144 -331 -151 25 -76 140 -282 187 -1 361
7528 361 128 285 -386 341 297 202 57 496 -59 54 -196 -64 337 -598 -167 -685 -148 -241 -331 -286 47 50
7550 50 -82 181 91 -15 -461 -363 186 -416 -234 -423 -176 -117 -260 -40 225 296 55 205 -390 307 99 484
7572 484 -534 -177 -508 523 -499 -236 -23 -103 472 -80 -462 -3 -176 485 324 -211 428 19 -519
7591 -519 -636 -135 48 152 -98 62 -145 203 130 453 17 159 -160 197 -276 48 291 170 68 -362
7611 -362 -33 535 -319 -30 -504 -324 169 755 32 320 136 -305 -4 -421 -327 -1220 -134 55 306 -123
7631 -123 -307 -525 302 -142 579 268 -383 9 291 475 266 -732 -379 82 -151 428 -359 118 465 93
7651 93 99 -221 -564 -188 388 410 167 76 -295 -913 -516 215 5 -402 108 47 -173 -506 239 -322 194 -114
7673 -114 -155 65 27 181 63 133 107 282 -185 -66 129 -214 -172 566 465 286 -184 66 -14 99 -12 -116
7695 -116 -327 239 -160 -150 -211 -223 270 -161 249 -278 631 27 -438 290 -476 -446 -15 -82 -119 147 -91 -220
7717 -220 222 257 585 -329 82 298 -374 -68 -46 -316 389 -86 275 217 -542 541 -339 270 125 28 238
7738 238 420 323 349 -412 -102 288 163 308 -275 -593 -357 -113 -499 -634 -327 246 101 -163 203 -1 247
7759 247 730 338 -244 -543 -230 -3 7 -848 -28 -235 -72 206 -57 76 -129 403 -24 -208 -548 -465 160
7780 160 -80 -255 219 -121 234 114 -634 -119 -273 -280 -376 -99 228 -291 -356 123 80 -727 -562 -48 123 409
7802 409 1 -7 279 -306 -796 405 -560 33 440 370 -775 -490 156 -169 518 -57 -300 129 -590 -518 -204
7823 -204 -143 -34 -970 371 73 -102 604 -526 -233 -84 -201 173 69 -2 -251 -228 520 -588 22 452
7843 452 31 152 -556 95 787 -618 -884 155 397 1032 105 -326 108 -638 -246 -243 -27 -229 -252 664
7863 664 -371 62 925 173 112 216 -365 -605 -696 300 -203 44 -226 97 398 -666 -318 -119 119 66
7883 66 -698 242 247 -608 -1168 -349 68 -415 1 138 586 -2 -125 319 102 1059 748 817 310 158 -342
7904 -342 371 242 -557 -311 115 -124 -428 -83 -419 -461 -1184 -476 -87 -1103 -251 123 438 -1251 -369 146
7924 146 -223 1575 264 1 -644 -345 667 -470 -219 -659 -503 -52 -210 1725 923 -172 -240 110
7942 110 -415 594 588 -163 -591 -132 -121 351 523 325 -1117 -510 444 259 283 867 -238 -132 -112 331 191
7963 191 -183 -1351 -384 -387 -520 277 497 -112 272 47 232 -99 91 -207 399 249 -247 -47 -185 936
7983 936 -879 -419 -141 -377 269 507 -873 420 249 61 -46 365 -142 294 -13 -96 257 368 -490
8002 -490 -203 -575 79 -984 -44 -51 -243 208 -357 256 -242 -28 -366 -244 58 -679 -46 46 242 67 426
8023 426 -343 -368 -568 81 -203 -13 237 -175 -285 622 -173 753 -379 330 -221 240 29 -430 139 -388
8043 -388 -26 -240 -41 116 484 -7 605 -494 -169 157 -624 -183 19 -260 500 382 -39 -341 543 55
8063 55 99 300 -312 -712 -336 -664 -488 -330 28 -403 130 289 166 -283 34 799 1 -56 -295 -293 81 492
8085 492 463 525 408 -241 -63 127 458 -189 -405 1236 302 -32 -675 -518 41 72 -110 -134 -458 -312 -417
8106 -417 -495 504 -387 -22 -63 220 57 297 -17 -774 -981 -656 486 -367 55 569 -186 434 805 340
8126 340 -228 856 487 428 88 223 -171 -680 162 49 96 -869 1036 504 -342 679 -651 151 16
8145 16 362 -134 -98 -96 -259 118 14 157 -375 101 -466 187 -465 -366 -335 -391 552 -284 389 -68 253 -299
8167 -299 -203 -603 -621 239 -470 -328 333 -202 371 -1502 -288 -729 479 -182 -472 216 -261 191 316 -1074
8187 -1074 -313 255 193 -104
8191a04
$$ Imaginary data points
##PAGE= N=2
##DATA TABLE= (X++(I..I)), XYDATA
0 0 0 0 0 0 0 0 0 0 0 0 0 7 -8 8 -8 8 -15 16 -23 24 -31 39 -47 54 -62 71 -86 96 -110 129 -148 168 -190
33 -190 216 -245 276 -309 348 -387 432 -481 534 -595 658 -729 805 -890 980 -1082 1191 -1311
51 -1311 1446 -1592 1757 -1940 2146 -2380 2646 -2955 3317 -3750 4275 -4931 5773 -6901 8500
66 8500 -10950 15221 -24739 94770 -160794 -252195 198922 193892 -93384 -87274 136676 66636
78 66636 -73324 -42575 33479 51363 77316 -38093 -161542 -29426 170133 33736 -181807
89 -181807 -61737 116925 -29924 -141055 23049 102605 -47409 -115680 -19998 40093 30661
100 30661 31144 -32330 -85431 16278 94056 7653 -38979 29704 32645 -40025 -15382 60268
112 60268 41551 -2175 -20392 -61024 -16917 96194 49899 -104232 -78707 65062 27148
123 27148 -91105 -6201 87653 -40565 -123605 3144 81380 5113 -31990 -5601 -33598
134 -33598 -20766 75479 45706 -53128 1895 60627 -26459 -40029 99312 94001 -80295 -67332
146 -67332 88665 52189 -48472 22842 63846 -50973 -78196 55041 79555 -40736 -53181
157 -53181 14529 -7776 -30187 19543 30280 -22406 -37862 -12518 -7258 18716 55872 -6268
169 -6268 -78396 -4706 70324 13703 -30289 26337 36546 -45108 -35051 61831 58376 -19228
181 -19228 -40347 -15167 13134 25843 10538 -18554 -22098 -6555 -19757 -22985 29777 27993 -52961
194 -52961 -66243 9322 33797 -12824 -18065 10049 -23853 -45782 19697 48076 -2847 -28859
206 -28859 -7190 591 47 30434 31586 -18302 -24406 9835 7846 9235 33617 9811 -41960
219 -41960 -28138 34832 29653 -15021 -5580 1416 -28969 -17448 30968 29378 -20490 -31568 -841
232 -841 1258 2626 30366 14915 -29620 -22627 16925 28727 15009 8455 -1840 -17444 4956
245 4956 30007 17710 9359 7678 -15002 -23391 20191 49483 4715 -41358 -12187 16962 -84
258 -84 -3589 11680 2882 -27106 -28988 5217 24329 11858 -14982 -38282 -15450 24799 17957
271 17957 -9894 -8827 4463 -11554 -21729 19954 41108 -6377 -36567 -10311 14877 16380
283 16380 7861 -442 -16484 -19248 1520 11356 5210 3525 -14261 -30337 -11987 17996 19355
296 19355 -10130 -21424 -13636 -10642 3576 22093 5692 -20994 -19018 1496 11076 9846 15247
309 15247 3466 -23858 -11017 22518 25359 8520 -6471 -10534 -4371 8954 23503 11114 -6486
322 -6486 -7180 -9127 -1386 19528 21567 -4898 -26142 -10433 14442 12683 5298 3878 -11931 -17060
336 -17060 234 19167 18566 -1167 -12019 -10675 -2505 19576 21930 -62 -11484 -7465 429
349 429 9816 17156 11565 -12639 -20216 867 11983 10447 5247 -10128 -20251 -12036 8741 16497
363 16497 -1493 -15354 -15491 -12024 972 12263 6769 -9610 -21098 -12778 3086 11472 11386 -4999
377 -4999 -20963 -9677 8488 12772 7606 -1960 -9686 -13710 -1489 17649 13494 -4586 -13118 -13593
391 -13593 -1630 13116 13379 386 -16662 -14713 1574 8357 10569 2927 -10815 -13581 -4464 10188
405 10188 16930 5007 -8034 -13734 -6072 15664 19815 3769 -7670 -6335 1894 6740 12134 14684
419 14684 592 -13949 -7656 8561 21588 11910 -9880 -14898 -3496 9138 10855 3331 -11
432 -11 -7142 -13900 -1555 13640 14898 -2036 -18443 -11763 4782 11764 9966 -3304 -11012 -6490
446 -6490 -1164 6999 10500 4412 -8381 -18040 -4559 15355 11828 -2508 -9611 -13078 -4495 4840
460 4840 11235 4826 -14748 -14467 -4251 3711 7576 3114 -6411 -14364 -13371 4016 13321 4117 -7657
475 -7657 -14258 -8829 4649 13483 7951 -7761 -13208 -1211 3530 4864 10885 5838 -8643 -14926
489 -14926 -804 21216 14559 -8150 -14064 -3898 7817 7352 4301 3788 -4430 -9522 -3134 5688
503 5688 15582 11486 -9614 -19485 -2196 22821 16970 -9736 -10823 6246 4902 -4656 3918 18820
517 18820 7066 -21282 -13746 16248 23279 4314 -13672 -11837 2671 11046 7161 -3395 -2806
530 -2806 3231 -7077 -14385 8202 24930 1153 -31285 -18071 20280 17100 -10435 -12238 2126
543 2126 -825 -10914 -492 15356 5091 -13833 -14708 -4202 10719 15103 -1637 -18051 -12573
556 -12573 7872 10839 -4762 -2928 4342 -7756 -16500 545 20018 7376 -18295 -14162 3186
569 3186 4387 4764 5739 -4196 -14802 -6299 10904 8914 -3313 -353 -154 -9993 -4533 15069 17028
584 17028 -6697 -16573 17 9616 7148 7232 1537 -8451 -7692 6782 13198 2596 -1351 2448 -7093
599 -7093 -9490 10150 21458 1895 -19811 -8066 12767 8467 271 1740 -868 -6299 -5062 5975
613 5975 10734 3081 -1984 -8159 -10602 6037 20437 5874 -17929 -13345 11889 10152 -7942 -800
627 -800 10297 -4641 -19396 -3995 20605 11235 -14515 -16415 -2583 6140 6898 173 -7035 -7420
641 -7420 -1997 -1279 -3829 6008 11535 -11005 -24073 75 22275 7438 -17479 -9952 6221 -727
655 -727 -5399 7073 9160 -6644 -15373 -2943 10987 8225 795 -6519 -10754 -922 9267 7311
669 7311 -650 -4731 -3071 -3795 139 11424 9067 -6201 -10655 -1811 8408 8417 2654 220 -5239
684 -5239 -5846 4200 11692 8006 -3722 -8366 -466 4646 5992 8367 2115 -6812 -6911 2792 11376
699 11376 6364 -1436 -4534 -6490 -1662 9110 9993 -1645 -10680 -4477 3997 1957 3091 5800 -3602
714 -3602 -11781 -4832 8460 9631 -1264 -7674 -7651 -2683 6167 6293 -2254 -4887 -3914 -3973 -3135 5571
730 5571 10539 -4318 -17691 -5720 9898 7833 -3765 -6770 -2405 -3738 -3311 3689 6083 218
744 218 -8870 -10854 1047 11305 6174 -6532 -10257 -920 3920 1652 3963 2822 -4175 -7602 -1932
759 -1932 8251 9686 371 -6429 -6430 1172 8588 5745 289 -2702 -4463 -1034 4079 8207 4666 -4649
775 -4649 -5994 -348 4015 7741 5584 -3528 -7969 -1705 7587 7306 885 -785 -3319 -4502 1805
790 1805 8281 6202 -1987 -7500 -3709 3010 7452 5636 -3661 -6553 -2149 1372 3465 4353 1088
805 1088 -5783 -9213 46 8603 3895 -2964 -6366 -5248 -581 3512 5593 -301 -6954 -6144 -2351
820 -2351 2438 6171 926 -6946 -6713 -1709 4393 4266 826 -3464 -8048 -3898 4127 5892 1277 -3750
836 -3750 -5901 -3708 840 6415 4808 -4603 -6902 -2894 2585 5643 2868 -2083 -5038 -4076 2958
851 2958 5845 4881 518 -5438 -5350 2255 7628 5991 -2069 -4725 -1761 599 4610 7358 2074 -3859
867 -3859 -5331 431 7627 5531 897 -3780 -4768 862 4714 4798 2754 -2681 -5297 -2144 3766 7947
883 7947 1228 -5308 -3949 -2124 2631 5631 2333 -3066 -5565 -2967 3629 4855 2149 -2861 -6241
898 -6241 -3743 2564 4646 2945 -2864 -5943 -4568 244 5144 3402 -2826 -5822 -4633 -407 4147
913 4147 2278 -627 -5764 -6118 70 3887 2953 -833 -4982 -5217 -1789 2931 5046 16 -4482 -4808
929 -4808 -2265 4289 5016 654 -3049 -4557 -1583 2610 5088 3583 -3009 -4890 -1004 3451 6622
944 6622 2471 -3855 -4607 -800 2712 6091 3650 -808 -2856 -3277 2383 5970 4697 -203 -4789 -2210
960 -2210 3285 4984 3394 -497 -3554 -1791 -291 4513 5841 -18 -3706 -4176 -35 5410 4605 -73
976 -73 -4328 -3871 1134 3238 2416 1136 -1949 -5010 -3047 2291 6022 913 -5443 -5192 -1705 2666
992 2666 4092 -9 -3461 -4639 -2299 1222 2480 2028 -1295 -6731 -4921 2291 5459 1802 -4568
1007 -4568 -4900 -1703 -59 2758 2794 -1287 -4625 -4419 426 4127 2879 -421 -4681 -4642 1157 4854
1023 4854 3591 -760 -4378 -2334 596 2638 4299 1490 -2842 -3992 -352 4849 4785 910 -1767
1038 -1767 -3298 -1128 3919 5649 2140 -3437 -3054 1669 2424 2930 3942 91 -4595 -3237 3921 6767
1054 6767 1303 -2261 -2018 -2474 1720 5417 3113 -2544 -4078 31 1355 658 4418 2661 -5726 -6405
1070 -6405 2056 6986 1294 -4158 -2147 -1364 -1971 2020 3836 -411 -3896 -3968 -938 1513 3677 2058
1086 2058 -5491 -7056 615 4864 1542 -2835 -1607 -1139 -3879 -1291 4979 2987 -3938 -6639 -1598
1101 -1598 3765 2868 169 -2182 -4014 -1759 1834 2720 1572 -1591 -2458 -2382 -870 4617 4932 -1971
1117 -1971 -6005 -2065 4323 3442 -57 720 -140 -3771 -917 5393 5132 -758 -3812 -348 340 1658
1133 1658 5696 2298 -4437 -3662 2793 4465 943 841 1359 -3666 -3456 4865 6130 -297 -3436 -1071
1149 -1071 216 197 4118 4182 -3473 -5222 630 3361 1619 303 490 -2580 -4673 1374 5185 939
1165 939 -2634 -3209 -2381 106 2683 3181 -1898 -5318 -1725 1336 1364 1000 -244 -2281 -4288 -1963 3524
1182 3524 3337 -1400 -4603 -3353 882 2177 818 228 -2297 -3731 -1441 2362 3387 386 -2654
1197 -2654 -2877 -1874 1916 4707 1026 -3534 -3214 581 2465 1141 2353 1345 -4718 -3095 3294
1212 3294 4558 1223 -1937 -1836 -1125 400 4382 3025 -2093 -2042 -127 1059 2315 3527 1435 -3360
1228 -3360 -3323 2852 4336 1516 -716 -1305 -1764 -292 3231 4130 -138 -2202 -1713 -340 1875 3332
1244 3332 836 -3221 -4233 -75 2598 1846 631 -1761 -3424 -1304 1540 2399 1452 -2304 -3093 -1211
1260 -1211 1385 3082 1665 -1960 -2429 -2562 856 1740 971 -2048 -2856 -1112 1625 1966 1877 -856 -3858
1277 -3858 -3196 540 2522 1492 -408 -2785 -2339 -1133 2926 1895 -1482 -2732 -2104 -627 1873 2989
1293 2989 856 -2753 -2835 626 2689 2912 1211 -1581 -2274 -652 3215 3102 613 -552 -1574 -1009
1309 -1009 1853 3753 1568 -1149 -2548 -209 2168 2189 2149 -438 -2615 -1168 1712 3451 1495 -954
1325 -954 -1859 -2103 1188 3789 1643 -240 -1538 -1874 278 2692 2266 172 -3268 -1882 626 1587
1341 1587 2137 -151 -2208 -2488 -158 2204 1949 -495 -1776 -2962 -1400 1949 1865 -216 -2192 -2897
1357 -2897 -710 751 2044 864 -2596 -2969 -869 702 2013 624 -1608 -2886 -1961 1492 2459 203
1373 203 -646 -2619 -1923 890 2495 1633 -1052 -2616 -1019 482 2111 2491 -549 -2623 -1503 1093
1389 1093 2596 1861 201 -1580 -2218 566 3514 2311 -131 -1740 -1554 508 1887 3255 647 -1823
1405 -1823 -1600 536 1537 2653 1521 -1463 -2116 -424 2687 2168 635 -404 -2126 -1244 1866 2761
1421 2761 899 -1649 -1917 -557 130 2751 1967 -1552 -2907 -1165 498 1820 1115 -516 -2136 -2932
1437 -2932 690 1403 899 -465 -2005 -2558 -249 2038 1951 -775 -2288 -1980 -504 960 2034 -382
1453 -382 -2547 -2522 -612 1460 1240 578 -1646 -3181 -693 1750 1341 -402 -1509 -1906 -1326 1371 2781
1470 2781 863 -1836 -2035 -834 1301 2214 1162 -53 -2681 -714 1817 2469 1281 150 -2257 -1376
1486 -1376 1003 3268 1989 -235 -1132 -756 303 2414 2324 -291 -1336 -1447 399 1910 1107 820 -1651
1503 -1651 -1639 568 2309 1884 662 -1252 -1792 -265 1532 2143 149 -1210 -1621 -414 1236 2191 595
1520 595 -1555 -2345 -736 1379 1549 687 -959 -2413 -644 923 1987 567 -1882 -1830 -2090 40 2172
1537 2172 618 -971 -2380 -1655 798 1014 1607 -526 -1991 -2055 239 606 792 -104 -2866 -2303 -764
1554 -764 1555 1715 -312 -1599 -1301 100 1051 1502 240 -1233 -1800 2 1572 2377 1148 -1377 -1117
1571 -1117 -467 1211 2659 732 -1564 -813 -625 1230 1878 1123 -408 -2031 -963 1978 2570 937
1587 937 -492 -1666 -438 146 1678 2169 -240 -1805 -147 418 1651 1167 509 -900 -2713 614
1603 614 2194 694 -870 -1303 -1577 -17 1403 2154 221 -2279 -2166 188 1000 1308 -100 -1306 -2045
1620 -2045 -856 1275 1695 -503 -1535 -1389 -793 277 1093 1660 -1315 -2516 -556 1400 1601 217
1636 217 -1150 -1071 -1621 118 2067 639 -1056 -619 -1311 8 1542 1832 62 -2784 -936 1254 1266
1653 1266 1074 242 -1022 -1286 -474 1691 1349 -394 -464 -808 -217 1088 2297 1519 -779 -1881 596
1670 596 1063 1495 785 -718 -1603 211 1240 2145 807 -1336 -443 -407 1581 1539 1064 -380 -1846 -767
1688 -767 1336 2057 997 -101 -629 -686 846 1699 2104 -1257 -1702 -1068 517 635 852 4 -1727 -2059
1706 -2059 376 1701 325 -927 -1119 -1185 -503 876 1440 -659 -2084 -1508 -311 216 1292 976 -1039
1723 -1039 -3209 -813 1247 170 -716 -831 -785 -1260 900 1887 714 -1907 -2044 183 342 279 24 -1108
1741 -1108 -1776 -765 374 1042 927 -120 -1186 -1036 361 2519 672 -693 -1100 -266 127 1679 1491
1758 1491 471 -1178 -577 -101 1210 1644 467 -887 -420 748 1561 1115 -143 -628 -1468 -361 560
1775 560 1292 957 -826 -747 -525 1268 1636 389 -720 -1081 -416 -573 970 601 -605 -1554 -1389 1123
1793 1123 773 827 -157 -1403 -1559 1242 948 -189 -1767 -1409 228 -1000 1627 977 -1307 -1508 -829
1810 -829 -485 1344 670 526 -1415 -1543 620 1019 1669 274 -1257 -420 110 1406 833 -457 -594 -591
1828 -591 -121 878 1803 510 -627 -1360 -458 627 1626 609 -444 -830 -137 1180 1363 1431 -324 -1159
1846 -1159 -1015 190 1601 1395 -456 -864 -320 771 1215 1040 -27 -1097 -898 553 696 948 79
1863 79 -533 -539 438 1409 1055 -491 -714 -568 -497 1253 1068 -306 -947 -968 -61 900 1066 797 -1220 -1113
1883 -1113 -103 712 1022 127 -723 -1030 -787 665 1284 69 -494 -1235 -904 514 1177 346 -626 -1921
1901 -1921 -647 -153 537 434 -763 -1374 -985 147 1112 843 -296 -641 -1268 1 960 818 -105 -1040
1919 -1040 -1163 139 743 1141 -8 -1028 -942 -141 785 1697 654 -702 -984 -5 1162 1284 619 -461
1937 -461 -969 -377 1271 1129 967 -403 -959 -487 160 1508 886 -260 -688 -381 604 1245 1001 -333
1955 -333 -645 -482 711 1227 737 -181 -1100 -915 288 1010 711 -215 -1045 -692 -45 620 782 -253 -1014
1974 -1014 -1023 -221 563 387 -130 -736 -1412 -435 436 814 249 -978 -1150 -484 191 707 295 -998 -968 -611
1994 -611 123 787 -33 -857 -1212 -712 456 881 370 -504 -1211 -791 384 847 794 -539 -1126 -729 171
2013 171 673 703 87 -513 -593 238 895 1023 -10 -797 -563 344 724 769 425 -728 -604 -28 805 1110
2033 1110 412 -719 -362 -207 1002 916 459 -432 -727 -260 470 865 852 -232 -958 -272 595 942 671
2052 671 -444 -645 -474 339 882 694 -607 -945 -802 147 701 309 -110 -1132 -766 304 649 666 -234
2071 -234 -1060 -703 -397 600 588 -246 -542 -842 -758 528 879 -17 -902 -849 -367 451 399 124 -736 -1144 -304
2092 -304 276 607 48 -623 -709 -836 582 903 136 -435 -912 -557 188 839 780 -149 -684 -125 310 925
2112 925 910 -308 -684 107 532 1014 815 -151 -457 -217 74 1181 797 127 -719 -816 420 690 775 375
2132 375 -426 -646 19 597 854 116 -525 -397 -117 278 1057 293 -587 -1236 -160 541 486 261 -361 -1222
2152 -1222 -663 157 866 190 -745 -709 -462 -21 548 445 -519 -899 -919 132 346 333 -181 -871 -994 -131
2172 -131 276 523 -298 -846 -558 -401 208 579 -181 -569 -875 -94 683 761 35 -184 -629 -416 641 868
2192 868 348 -704 -638 -64 354 1025 839 -643 -758 -441 694 964 85 -22 -291 -212 457 967 1007 -201
2212 -201 -745 -173 430 937 685 -34 -839 -152 234 913 374 -12 -120 -475 -30 898 812 -189 -558 -452
2232 -452 250 398 956 290 -986 -1009 258 461 488 8 -715 -371 -661 215 998 -168 -570 -816 -214 293
2252 293 481 290 -368 -1413 -477 306 400 246 -519 -777 -596 213 488 -61 -619 -589 -740 -24 519 307
2272 307 -58 -751 -769 242 264 54 -119 -542 -385 -199 289 588 392 -294 -508 -13 437 882 127 -448
2292 -448 -584 102 327 610 354 -166 -348 -291 253 1028 618 -328 -451 -112 633 971 536 -213 -173 -602 573
2313 573 656 570 -512 -501 -142 282 618 275 -188 -548 -178 -9 476 115 -9 -266 -696 -376 698 367
2333 367 39 -449 -655 -237 135 335 -45 -795 -878 -178 217 -55 195 -674 -570 -854 437 536 -37 -696
2353 -696 -942 -318 195 190 -151 -180 -761 -582 211 552 175 -500 -651 -591 -361 702 251 -66 -510 -877 314
2374 314 751 383 346 -781 -385 183 487 503 -286 -673 -192 -303 959 860 -168 -262 -649 -233 92 974
2394 974 247 24 -724 -141 928 515 44 -32 -964 44 790 605 372 -794 -109 -457 171 1091 321
2413 321 -157 -616 -449 -56 720 596 -46 -780 -429 55 503 354 18 -514 -549 -158 460 251 -248 -374
2433 -374 -904 -174 315 60 73 -696 -594 -76 4 498 114 -497 -798 505 148 554 241 -385 -392 -483 201
2454 201 668 -127 -290 -952 22 378 681 494 -170 -589 -227 441 303 393 -97 -566 -269 254 899 460
2474 460 -69 -312 27 -77 784 460 -16 -279 -457 376 367 767 24 -355 -35 553 619 749 97 -427 -477
2495 -477 -97 476 575 -90 -309 -438 -201 255 625 408 -103 -658 -218 -177 489 258 -512 -469 -577 -70 456
2516 456 -138 -343 -571 -583 266 449 163 -482 -797 -441 71 288 345 -448 -469 -478 129 422 75 -220 -470 -466
2538 -466 -245 280 195 -2 -444 -717 242 478 94 291 -280 -400 -133 323 661 342 -497 -352 -287 255 615
2559 615 209 -162 -215 -187 496 403 167 272 -559 -167 399 752 544 120 -191 -32 353 909 522 -1 42
2580 42 -10 129 494 204 190 -251 -416 406 805 379 -146 -451 -71 474 56 870 378 -689 -468 178 1151
2601 1151 375 -237 -26 -579 -219 189 682 -25 -651 -248 -633 295 83 374 -962 -621 -327 -51 133
2620 133 118 -418 -832 -583 207 649 139 -128 -550 -373 410 217 599 -387 -794 -105 -164 338 147 -197 -338
2641 -338 -792 361 390 -23 539 -111 -499 136 485 392 173 -356 -221 55 506 844 533 -174 -359 -35
2661 -35 411 681 182 -100 -185 -127 369 639 -416 -471 -536 122 50 251 283 -201 -530 -407 273 305 636 -350
2683 -350 -404 -591 -233 713 418 239 -263 160 376 47 71 -78 -659 -107 215 57 617 69 -726 -785 -243
2704 -243 417 218 111 8 -528 -913 254 163 485 -320 -846 -36 110 -181 -34 -635 -864 -110 462 614
2724 614 -126 -346 -400 -343 363 248 4 -301 -463 -567 22 -58 -133 260 -189 -8 81 796 710 58 60 -78 139
2747 139 380 475 -366 -295 -421 -226 790 126 -164 216 -346 -126 380 770 -12 -336 -602 -347 376 223
2767 223 426 -444 -227 -157 744 632 11 -257 -681 -60 46 410 354 -264 -848 -404 -259 35 102 -12 -985
2788 -985 -556 -21 878 -154 -66 -464 -556 -188 362 374 56 -740 -473 99 395 -197 387 47 -1014 -231
2808 -231 640 751 -83 -433 -750 -356 173 -391 549 -860 -348 204 262 241 489 24 -676 -180 562 1065
2828 1065 205 -189 -942 -412 317 433 -203 -79 -765 -379 636 338 513 160 -577 -488 106 521 329 4
2848 4 -716 -395 57 193 503 -508 -817 -221 564 136 621 -27 146 -293 -250 120 69 235 -273 29 -80
2869 -80 471 314 230 -201 -756 -376 -350 28 503 112 -728 172 383 325 310 101 -318 -355 -124 357 127 -367
2891 -367 -1225 -534 -259 -382 590 40 -573 -724 228 22 241 -201 -544 -544 179 467 246 -94 -559 -129 -198
2912 -198 36 544 -16 -177 -727 586 -86 -266 908 -763 -313 124 135 715 371 -24 -135 -74 -152 686
2932 686 131 -369 -847 513 252 311 485 15 183 -366 -114 389 116 818 -742 -25 22 436 395 -308
2952 -308 -200 41 91 -79 765 -349 -453 -157 -152 493 349 -298 -476 -644 -247 354 219 -295 -556 -409 -413
2973 -413 247 93 -355 -155 -666 -268 29 341 456 -248 -451 -266 203 833 46 -520 -1018 -714 44 164
2993 164 -319 -50 -294 96 -36 486 462 -338 -597 -573 451 553 332 -190 -55 -97 189 324 387 262 -476
3014 -476 -3 -56 729 463 144 -209 -7 0 26 527 597 -40 -148 193 250 454 483 -134 -104 342 192 400 333
3037 333 -224 -197 -322 184 537 383 -174 -475 -436 11 479 416 -166 -520 -239 162 314 141 -41 -497 -369
3058 -369 -67 375 90 -219 -165 -386 -136 258 62 -82 -239 -344 48 61 299 129 -357 -283 -382 121 236
3079 236 5 -188 -204 -282 419 130 -208 -228 -332 -107 197 616 141 -279 -434 36 -99 393 635 -279 -191
3100 -191 -137 82 417 235 44 11 -186 151 339 526 115 -468 -359 -106 613 322 136 -145 167 133 345
3121 345 659 65 44 -432 68 337 455 282 -278 -367 27 740 336 236 -230 -422 -191 -50 215 50 -308
3142 -308 -635 -370 230 200 201 -89 -438 -329 37 287 20 -277 -494 -217 49 104 267 -239 -327 -531 1 202
3164 202 245 -334 -605 -484 95 691 346 40 -498 -402 -60 -43 369 72 -384 -252 -122 405 552 75 159
3185 159 -346 -251 300 442 161 -14 -250 225 480 287 353 -296 -197 -100 299 529 174 -282 171 -177 20
3206 20 456 586 -13 -113 -79 160 624 545 375 -161 -405 78 368 326 -283 -297 -55 -1 135 370 75 12
3228 12 -510 -246 292 124 -94 -232 -341 -267 335 122 191 -516 -366 -64 172 312 -61 -341 -239 -577 217
3249 217 268 158 -321 -183 -506 -107 258 466 -129 -309 -264 235 -201 70 -141 -293 -197 -242 401 289 -234
3270 -234 -183 -484 -244 368 359 -24 -313 -7 246 198 246 491 -283 -270 72 280 491 261 -117 -188 -134 375 602
3293 602 230 -6 -536 337 380 -4 408 -229 -328 -42 374 424 -47 -340 79 -332 87 234 305 -27 -236
3314 -236 -163 159 302 108 -141 -209 -193 -38 120 256 -28 -371 -144 -254 173 202 -96 -335 -566 -133 69
3335 69 100 125 -131 -462 -371 -157 288 -234 -358 -436 -121 19 196 75 -392 -469 -150 261 193 128 129 -187 -425
3358 -425 -36 214 412 -19 -297 40 286 43 178 15 -213 30 -69 487 347 99 -253 -173 209 318 328
3379 328 246 48 -434 395 69 449 14 -76 -181 94 250 402 -21 -217 -150 -150 60 538 186 58 -283 -115
3401 -115 565 62 -123 9 -687 -130 100 287 164 -96 -249 -47 153 546 160 -417 -291 -415 -139 266
3421 266 -192 -72 -545 -429 -5 6 293 -188 -635 -569 -102 50 285 -21 -102 -422 -523 384 321 25 -329
3442 -329 -212 -340 0 216 106 -231 -198 23 99 333 185 -262 -95 -202 200 311 135 177 -355 -102 330
3463 330 469 268 35 -243 -81 269 401 480 168 -363 -38 369 757 226 407 41 42 -138 223 395 331
3484 331 -221 -232 165 419 188 288 57 -448 204 133 335 0 -97 -217 -108 41 374 -43 -139 -631 -235
3505 -235 105 130 156 -217 -450 -144 60 -137 78 -106 -375 -143 -270 244 59 -283 -455 -380 168 207 39
3526 39 -49 -534 -154 -49 -8 245 -236 -173 -223 114 251 223 -251 -73 -152 88 330 286 69 -157 98 299 291
3549 291 -15 285 8 -201 1 252 217 241 3 -76 83 268 496 28 47 -17 -163 187 410 -55 89 -181
3571 -181 -159 166 313 379 38 -173 19 -238 211 382 -42 -443 -88 -269 176 75 -172 -396 -235 53 282
3592 282 182 -135 -415 -540 -193 74 424 -80 -451 -218 34 71 -28 152 -152 -359 -354 188 73 185 -99
3613 -99 -516 -193 64 213 -37 -264 10 -296 -165 297 11 -197 -290 -137 235 267 204 71 -466 -36 191
3634 191 169 593 -162 -312 -257 261 292 302 86 -134 -178 -165 570 398 -111 -60 -494 110 293 266 216 -102 -150
3657 -150 -135 110 301 163 -224 -112 -335 22 404 110 -275 -188 -210 95 304 196 119 -338 -398 -44 246 242
3679 242 -181 16 -78 9 42 126 -227 -256 -358 150 183 -28 -189 -359 -410 -18 282 119 343 111 -299 58
3701 58 117 50 -84 -260 -162 -320 147 139 148 -222 -394 -130 28 403 180 126 -272 159 118 301 116 -314 -128
3724 -128 324 311 401 -31 -63 -104 12 -15 473 353 -152 -79 93 266 78 253 0 -231 -28 251 204 211 -140
3747 -140 -82 14 -50 455 442 -339 -57 -646 362 273 204 70 -232 -444 -31 231 28 387 -283 -288 17 73 242
3770 242 27 -109 -259 -185 152 148 15 -51 -170 -249 -109 -54 -8 -109 -290 -204 -27 192 27 -360 -483 -270 -190
3793 -190 18 -57 -123 -494 -149 -114 -13 108 209 -228 -298 -175 266 234 30 -309 -14 28 113 210 -73 -67 -31 6
3817 6 333 -257 157 89 35 -17 95 397 -128 -79 -58 66 215 222 340 26 -256 -294 -178 290 317 118 -89 13
3841 13 308 183 210 179 -508 13 77 191 508 69 9 -298 -5 97 302 61 10 -639 -27 -83 247 292 -154
3864 -154 -276 14 168 351 -174 -441 -250 -236 -219 252 303 -461 164 -107 -489 -397 85 -196 -521 -258 98
3885 98 -298 618 -232 -184 7 2 -300 227 -239 -400 -305 112 27 531 -540 -418 29 -222 209 299 -420 -318
3907 -318 -537 5 -287 46 67 -294 -679 -105 393 591 632 86 -58 307 284 26 -7 -140 -182 85 226 240
3929 240 678 -381 -8 126 233 305 -482 -337 -291 462 593 133 -16 486 -224 -297 135 -208 469 -174 -3
3950 -3 -126 -420 494 -104 -569 116 -432 -767 827 222 -363 -143 -568 -134 344 -495 396 -327 -414 -245 -97
3971 -97 -348 346 -319 447 -361 534 667 407 -29 -374 90 -151 -81 -171 232 -639 555 612 39 586 132
3992 132 84 273 -228 -79 223 -360 264 61 434 373 14 -208 -396 554 133 528 215 -76 -49 -49 298 216
4014 216 498 47 113 -77 119 982 66 -364 -671 -294 3 408 403 -280 -11 88 -131 -201 470 -122 -308 -321
4036 -321 99 492 -426 -607 -159 -205 -20 -224 223 -27 42 171 -26 -372 369 -117 -345 -263 -416 95 57
4057 57 31 -365 79 -131 -149 4 -37 -179 -139 -278 -186 421 80 25 -423 -434 -180 89 453 147 -92 -222 -50
4080 -50 365 169 34 -112 -82 -106 245 279 -57 0 -280 55 69 317 287 54 -290 249 160 -1 449 146 -92
4103 -92 241 123 304 425 -101 86 -19 273 101 7 18 -283 -432 -2 174 192 -218 -113 -44 89 277 193
4125 193 140 -153 -299 -111 208 156 -251 -433 -319 -70 -254 95 -128 -309 -153 -365 168 77 -117 -186 -270 -365
4147 -365 -79 83 -3 -349 -188 587 -272 -272 24 -309 -516 24 -224 -24 12 -357 -68 241 155 -207 9 156
4169 156 553 -128 352 39 -138 133 163 -312 207 698 358 36 -68 -231 292 463 192 136 164 -195 334
4190 334 197 520 -138 -69 22 -466 327 75 464 110 -108 291 -302 -208 -89 -308 481 -56 -254 562 -15
4211 -15 -186 118 273 -37 -410 -36 -3 -1001 -141 -3 -136 -700 -84 -417 202 23 -24 405 -125 76 -825
4232 -825 55 199 -334 -29 22 -430 -242 136 568 130 -16 -680 -460 273 111 119 -861 -74 -292 17 47
4253 47 198 -118 349 -242 396 -102 -200 516 -147 -238 -182 347 311 -385 -480 -469 126 33 -403 298 -340 569 -746
4276 -746 270 673 -66 -303 177 -635 174 1130 -650 791 -886 325 330 271 -475 -175 -242 -737 728
4295 728 -327 -403 272 -418 -337 918 354 317 523 -49 -38 70 513 49 -541 170 -310 -646 -257 384 203
4316 203 278 329 -263 -279 -385 52 -380 -712 119 -42 -74 -582 -566 -478 -58 -14 465 -561 272 -630 107 -186
4338 -186 -549 -23 -657 323 -895 -588 -534 66 -697 448 -115 563 -132 215 49 -244 -531 376 91 278
4358 278 319 -114 240 247 752 74 303 263 -522 251 -553 -629 -152 203 -627 171 101 88 120 127 57 782 -29 337
4382 337 -71 -372 -265 -255 82 -122 -225 -884 152 1023 156 85 457 -1440 -116 151 80 623 -105 -368
4402 -368 552 1 -500 -279 429 -666 -294 -422 134 120 -456 -237 -199 -24 -129 132 -312 293 86 353
4422 353 -203 684 -53 370 -824 -416 257 -225 -1 78 -559 -105 106 155 378 -298 -384 -286 143 50 -20 360
4444 360 110 -18 211 -139 156 -62 135 -388 162 481 728 -359 -359 -20 -126 310 -155 3 351 -97
4464 -97 -211 168 -141 217 -359 200 -267 98 246 613 -544 191 -153 380 230 -513 24 -421 -321 -234
4484 -234 -73 -351 106 -249 -471 -575 308 46 55 -690 135 -505 -132 71 78 50 -430 -164 -237 129 124 471 90
4507 90 -15 7 147 100 -277 -27 152 246 -51 416 30 259 -118 -139 -223 69 554 -223 -217 -178 -163 100 81 -235
4531 -235 -103 391 -303 -347 -144 -50 -324 44 -142 88 197 -68 903 56 246 115 85 -35 -78 734 -16
4552 -16 558 171 -335 -686 635 -204 260 355 440 -159 -805 293 -143 417 55 112 -786 -276 -217 241 113
4573 113 -304 113 2 -160 292 -986 -233 -130 -335 260 -245 -360 261 275 -275 -182 165 352 55 -1134
4593 -1134 33 -104 765 281 -464 -353 -455 -243 258 515 -266 -621 -87 -310 118 -486 -529 354 -870
4612 -870 996 1162 41 117 17 -752 1153 -497 1479 426 -128 -479 -682 630 -379 -556 -847 327
4630 327 792 255 -157 114 -396 -461 -294 -114 166 -331 -2 538 -334 -2 100 217 -381 -491 -885 -376
4650 -376 -279 252 554 -245 214 -124 -207 188 -547 500 275 128 10 81 161 -182 32 288 426 -1005 371
4671 371 -75 -359 -236 355 -35 -1013 319 673 -305 108 -461 -930 2 -1507 -3 582 -1198 -2
4689 -2 -1061 8 362 403 -684 307 -682 41 101 -124 -164 -721 -657 509 925 -669 -147 580 -684 514
4709 514 -141 -507 -1245 -415 -584 -220 -112 -592 -129 226 535 53 1236 262 -284 223 -496 -586 706 1092
4729 1092 -897 332 188 351 -762 -288 -280 -705 109 -220 241 102 -474 -789 57 -116 -336 -226 464
4748 464 36 -593 -510 302 -114 -194 462 -734 -800 242 192 -253 50 6 -518 -55 814 272 50 785 -8
4769 -8 409 439 538 498 -276 139 -615 -1179 672 -39 -293 -149 -492 -637 -730 25 283 -67 -148 -292 -249 377
4791 377 -9 -427 -563 313 -987 -286 690 -424 614 199 -92 60 -111 -92 387 -600 403 -101 -732
4810 -732 250 91 -196 -319 -247 167 174 322 385 -636 133 127 519 -741 -887 594 -133 763 422 -307 -118
4831 -118 -133 -105 727 -362 -43 -314 -300 -332 -147 -588 936 -663 -116 -689 -448 132 -1 -599 162 607
4851 607 -728 -79 -601 -379 -117 81 -49 986 190 -135 -951 -182 64 -541 150 588 299 375 -249 -332
4871 -332 -75 -304 527 417 -273 35 325 200 -588 216 168 -328 -89 -322 54 -347 228 88 -71 -106 -65
4892 -65 36 -196 200 405 -15 127 83 211 261 -30 -3 -36 -89 95 -12 230 117 -284 -173 157 216 302 385
4915 385 -136 -100 -128 189 27 -66 -73 -128 -144 -85 102 -145 -307 15 301 -201 -121 223 -39 12 -87 218 -162 -16
4939 -16 -326 19 -143 16 364 -149 -2 -207 -133 27 -162 -39 -210 -80 199 -24 239 -5 235 -190 -123
4960 -123 128 140 173 -230 -109 -1 -224 30 39 -317 80 -88 202 -183 506 67 -118 228 -30 131 364
4981 364 -78 75 132 -137 284 295 215 178 -28 201 159 141 71 -219 -94 159 111 390 -152 83 -46 103 -67
5004 -67 279 -59 -23 -32 211 208 -126 42 -37 -277 215 -229 -260 -327 -181 -40 -182 -80 62 301 94 -205 -214 -100
5028 -100 88 114 -216 213 -251 158 111 -88 -22 89 -94 -97 2 -188 26 -115 -198 -320 311 93 -48 -67 -222
5051 -222 -79 -55 -62 -41 326 -435 13 -31 -111 -15 -292 -290 -133 124 145 416 -19 -71 -114 -71 241 -27 -259 -230 254
5076 254 203 229 -11 -47 -44 259 137 -106 111 141 17 -104 43 26 86 105 1 100 -117 75 -140 -7 -144
5099 -144 -184 -159 -245 104 31 14 51 -178 102 187 73 -31 -11 45 31 -74 197 -70 -113 202 276 7 241 -6
5123 -6 -126 -172 97 194 47 97 -317 17 -24 59 114 -69 -78 231 -62 185 -33 -162 -236 121 -21 181 -27 80
5147 80 89 -39 -218 113 -5 -56 -22 2 70 34 29 106 216 -37 -108 242 207 -25 -118 49 192 172 214 51 -25 41
5173 41 -106 -41 106 232 132 367 -232 120 107 58 116 17 -152 126 115 -186 80 102 -66 255 189 174 27
5196 27 -32 -208 -191 -55 128 -97 -287 -99 178 156 140 -1 -18 -218 -313 31 -5 -72 99 -67 -61 13 151 103
5220 103 7 -32 98 -38 -214 69 -109 94 86 -109 -88 -66 -246 98 -310 -159 185 -74 93 -49 -285 -220
5242 -220 -190 82 296 -57 -119 45 110 -81 -77 -91 114 186 31 204 -199 188 71 60 137 65 79 26 -28 -72 182
5267 182 130 -20 -37 -192 50 208 119 -89 204 72 -332 -111 -8 -163 56 -171 24 27 109 181 155 -242 -125
5290 -125 1 4 -192 -32 -211 39 146 53 200 13 81 -179 89 187 237 -101 -208 37 -85 -39 -4 -67 161
5313 161 13 27 -237 -79 -56 49 -119 -227 34 -197 -169 -110 -32 75 -15 -313 34 -34 2 66 -242 -185 60
5336 60 -90 -80 -69 -192 -62 44 70 122 82 126 24 6 183 359 13 -82 129 135 150 -92 72 88 496 61
5360 61 174 95 8 -86 -111 400 61 54 170 -5 -131 91 60 -42 123 -5 52 23 1 122 -123 -11 129 183
5384 183 99 -63 -430 -291 -76 77 -385 -9 -230 25 -1 166 -34 -6 -194 -160 -17 -198 -44 -128 168 -198
5406 -198 -336 -126 -220 -164 -127 92 160 231 93 294 75 -184 137 -201 192 -192 167 -123 58 112 5 -260
5428 -260 40 108 -64 125 194 150 -117 -41 27 -174 244 137 -211 -205 -172 -114 123 90 -74 44 99 -179 169 117
5452 117 61 171 43 -8 129 -125 -22 14 -37 167 -168 -58 -338 -150 38 12 90 -78 32 -171 -127 -27
5474 -27 172 -106 42 -107 -234 20 -12 98 -145 23 -192 19 90 95 -32 98 -145 261 -26 314 56 -120
5496 -120 114 -91 -214 172 -10 35 -119 -163 -74 -7 -82 -89 -100 -35 6 -134 85 -12 -96 215 -43 -14 99 249
5520 249 -38 -17 -33 182 81 -36 50 -170 197 293 211 182 269 -95 69 80 -142 44 162 -223 -5 83 -14
5543 -14 125 142 -74 -65 -116 52 314 18 -70 20 295 458 66 53 -102 -246 149 77 -100 -212 2 -136 -313
5566 -313 -125 65 -71 -62 -101 29 105 -4 75 -26 -59 -351 59 91 -48 92 103 110 -331 -121 224 -229 60
5589 60 -6 -55 156 68 -212 -34 168 -1 -148 -132 -129 -187 159 164 55 10 37 -39 -277 -63 92 29 -90 -74 142
5614 142 -149 -37 84 18 -169 73 167 -43 -339 -86 335 88 62 243 62 -233 39 -130 145 -103 315
5635 315 -29 62 -140 -44 -37 -66 102 -64 -189 30 -40 -114 49 43 123 66 -104 67 -181 270 -139 -33 141 150
5659 150 31 67 -246 -6 -252 -131 -46 -106 -107 93 -56 -78 53 -247 143 -34 -41 32 -60 127 -159 -528 144
5682 144 154 44 44 -24 158 -18 -191 -69 -35 185 214 -51 40 191 -45 68 198 -84 75 152 -67 86 11
5705 11 165 73 -146 57 74 74 -37 -106 14 84 -41 3 5 9 -124 -95 -63 -148 218 28 55 -141 -21 79 -8 -43
5731 -43 142 242 -130 45 -25 -84 -132 399 108 26 -55 -230 54 135 26 -161 60 130 -117 80 -26 -174 -197
5754 -197 -43 -55 69 148 -94 0 63 30 -131 -173 53 153 -131 -64 256 324 66 -296 -134 67 93 -133 -129 -94
5778 -94 159 -143 235 -25 -63 -287 -84 429 210 29 -116 -115 143 -29 -23 175 263 226 26 -106 -82 146 94
5801 94 -118 204 87 13 231 15 209 -207 165 193 74 28 154 -199 -434 2 241 134 105 -118 217 70
5823 70 -56 -78 45 -151 174 -419 322 -25 293 77 60 12 -31 -1 -192 25 142 -115 -347 -10 -302 -87
5845 -87 65 152 -264 -31 -117 -180 -439 73 -59 404 -91 -79 -31 -520 -17 86 -221 -56 -109 -210 -100 -117 -430
5868 -430 -158 80 -6 257 -30 233 224 -143 132 -179 -169 -16 123 -279 -298 7 83 -165 -407 -386 -36 11 118
5891 118 -169 193 -65 -187 -34 -240 459 -32 65 -117 337 -323 301 -207 -455 -105 197 262 16 240 -294
5912 -294 -38 -555 5 -87 -97 -238 168 138 -149 363 -314 51 145 -39 -102 -194 276 -299 -214 -237 -147 -292 192
5935 192 -29 -234 -173 -107 139 374 -114 173 -352 -96 264 -256 -223 -186 -218 166 120 90 81 -87 -182 180 76
5958 76 -77 128 -22 -23 -34 -314 -46 65 131 57 293 -100 -222 235 144 101 -133 -129 144 103 -69 214 -65 263
5982 263 87 -71 286 -32 -105 -47 56 37 3 251 -2 343 80 170 420 -92 -365 54 -63 96 -197 -173
6004 -173 284 -126 201 -101 59 255 -184 136 98 -200 54 -191 28 -198 445 103 380 -13 7 -473 -184
6025 -184 -199 370 -261 -166 4 -72 -323 -219 342 668 -350 -287 139 -402 218 -51 -524 -324 -175 483 234
6046 234 -84 -984 533 -300 -633 105 -438 0 -897 30 -582 379 -263 833 59 -979 -374 485 -193
6065 -193 -490 -72 369 176 33 522 477 -250 239 570 -873 250 -47 -218 43 60 395 115 -61 36
6085 36 -673 -174 465 -333 -339 -449 -60 -90 -513 -357 -82 -112 -107 -176 -164 99 -589 290 9 -21 71 197 -134 -384
6109 -384 -33 -306 384 195 225 38 -103 340 -11 326 -784 -64 165 140 -839 -642 222 -9 -39 568 154
6130 154 173 -336 -180 -193 513 81 379 387 342 -167 -282 -99 -70 -157 282 281 -309 -198 240 363 -123 192 -344
6153 -344 96 -389 154 -21 -403 -277 462 -101 29 -521 -55 -412 -351 182 106 438 -477 -496 -565 288 374 -224
6175 -224 -828 27 486 -478 47 667 -321 -190 -1 -143 36 -419 -101 -114 -208 542 -475 -602 -55 -252
6195 -252 -498 -334 191 -395 126 -62 -640 -531 -56 -257 35 155 203 -22 -167 -378 -725 435 -136 -427
6215 -427 -250 -419 285 -871 -371 -537 -454 402 696 -211 -503 616 64 421 -239 -315 575 -422 -126 -444
6235 -444 213 -236 194 -296 -40 162 -119 -287 -255 -445 -609 -182 -42 323 373 110 95 584 33 -120 -164
6256 -164 195 357 204 -276 101 -350 -266 429 -34 -150 166 83 -52 -19 -111 -217 89 -10 -172 -26 46 -561
6278 -561 -70 189 344 109 148 -140 18 383 -377 -240 7 3 -215 -404 25 -289 292 16 30 281 546
6299 546 -670 -72 265 -105 233 -158 275 143 -554 146 166 -482 -18 -573 -328 668 246 -228 -619 31
6319 31 -11 -370 441 312 -135 -328 -173 15 -192 225 351 -477 424 97 -673 -13 365 -181 57 443 495
6340 495 278 59 103 -473 367 -415 992 -357 -390 208 -62 -1205 -403 -532 -665 -858 -914 1607 509
6359 509 -322 135 513 566 -929 519 1081 -65 52 -201 730 672 45 -426 202 32 -407 785 248
6378 248 1219 393 -811 31 477 -140 -350 -618 45 807 124 -113 -421 0 -558 182 640 -790 369
6397 369 -728 -978 770 -279 -1319 913 411 92 -131 -305 108 -236 -604 -252 361 -542 2 -63 154
6416 154 -853 -29 170 -551 39 -529 -277 1749 -764 -616 -784 -124 454 149 -644 641 145 541 72
6435 72 1090 1050 -221 340 468 -260 686 -542 -5 237 -74 111 13 -101 -81 -173 -661 -408 -88 284 516
6456 516 798 -726 1288 118 -693 -167 242 -475 -300 -436 -163 35 -557 -141 -121 -11 -250 -105 -48 -702
6476 -702 -440 624 -302 900 824 -148 171 -708 315 94 -202 334 -197 167 541 -123 46 484 324
6495 324 199 964 90 -892 -36 -118 213 80 122 1691 1540 877 319 316 170 -493 -396 615 858 502 -182
6516 -182 -280 869 -163 -3 159 -287 207 -14 294 95 -148 -237 -275 -823 56 186 23 140 -62 168
6536 168 -409 562 626 426 3 -380 544 647 378 799 458 -23 837 231 -552 91 -331 -524 614 -205
6556 -205 166 -508 -731 119 -966 459 110 -753 114 833 -262 88 774 646 -372 165 432 129 -530
6575 -530 -288 190 114 402 189 474 178 -217 58 43 431 -306 201 136 564 -4 583 -229 -70 -783 316
6596 316 -503 -388 -306 226 393 -184 -814 -40 -224 -177 564 280 533 -278 327 -15 -161 -236 104 677 -508
6617 -508 542 20 -190 5 -312 -162 -266 101 -241 -632 -593 -40 -73 -297 45 -483 114 494 92 329
6637 329 175 636 23 58 70 -308 -210 123 544 -147 13 446 829 -648 -502 230 -309 145 117 -288 -69
6658 -69 784 -652 274 553 248 -465 -179 164 176 -377 -32 1065 34 96 -63 -104 278 -653 -690 -108 75
6679 75 -325 -58 -719 199 -198 575 -475 455 658 -280 36 -256 112 -71 99 -185 -695 -325 5 329
6699 329 262 599 -146 215 -136 -201 -282 -353 304 -330 213 388 -2 72 176 597 295 103 -276 3 44 -158
6721 -158 111 -681 -160 -132 10 430 218 155 -21 -277 493 -174 44 -214 173 -101 -329 140 -521 423 -74
6742 -74 -223 -212 93 366 -264 -37 -228 132 -90 -86 -192 393 169 118 7 5 165 -468 277 192 -180 -311 187
6765 187 -73 -41 496 43 139 -263 -46 246 -370 139 -26 -248 200 380 75 227 307 -210 -60 -364 358
6786 358 277 -351 151 205 257 -219 -384 460 -19 4 320 524 685 -329 29 106 72 -74 29 217 148 -330
6808 -330 -16 183 217 336 -594 156 408 314 558 -226 -409 -72 -243 -379 -67 -277 90 -79 213 207 -309
6829 -309 -341 -104 -205 -67 -147 -252 -18 166 216 -64 -245 -22 272 -229 -38 335 -229 53 -183 -91 161
6850 161 162 155 275 84 92 -170 81 29 -72 -34 -94 -105 60 -85 8 -130 -202 -121 81 -48 301 -155 -144 293 197
6875 197 207 -101 191 -68 70 48 -60 -118 130 75 67 480 -86 -13 -72 83 111 -206 -38 164 -137 3 -271
6898 -271 188 127 48 -130 -87 56 -82 19 175 209 141 56 -3 -100 -69 -200 -113 -227 -228 -100 105 246 7 129
6922 129 167 133 33 -334 -407 186 2 28 -117 51 247 -19 -188 44 78 96 -182 182 108 -66 -50 158 37
6945 37 -92 207 -35 81 -14 199 176 48 36 129 49 104 -58 100 -25 0 -105 -182 -46 -67 -119 5 -59 -364
6969 -364 41 20 -135 21 251 329 35 -18 103 -97 253 -227 25 150 227 139 -356 111 111 249 410 -47
6991 -47 233 -46 107 -166 10 71 27 199 8 187 32 155 -78 -271 -42 -83 -87 134 81 -258 -94 137
7013 137 -315 -101 42 28 287 146 -81 159 11 195 69 263 -292 24 29 -210 -18 126 179 -39 -320
7034 -320 112 218 510 9 1 71 1 -32 -117 94 -22 140 -50 308 260 -227 -22 522 45 151 18 34 -19
7057 -19 -142 -123 -106 -40 120 -101 -295 -191 387 -416 111 163 73 384 -294 123 -272 297 -72 23 13 -18 70
7080 70 -305 27 203 -168 -350 190 -172 65 347 -334 89 23 -95 434 -318 -82 -394 -384 -261 -314 -190
7101 -190 -273 -293 93 -468 -99 -145 406 -170 -564 -72 475 503 64 176 681 367 114 -412 -583 -434 -264
7122 -264 157 -273 -134 94 -75 -480 -109 -341 -139 304 -57 -481 -293 -250 384 -197 -4 -27 308 -86 379
7143 379 125 228 -262 97 -93 21 -14 99 -586 -90 103 -204 -65 -261 143 191 62 -365 -110 234 430
7164 430 52 264 -1248 259 210 -123 562 607 -706 -38 462 79 280 503 -22 -212 -275 90 631 -747
7184 -747 -255 403 -64 -65 -873 147 46 307 -182 -160 -553 -260 324 -177 94 183 379 -232 718 -642 -8
7205 -8 -491 -672 -217 -144 -70 -421 -425 210 73 -111 -165 396 342 192 -360 53 445 371 -123 203 -395 -82 -341
7228 -341 676 344 428 295 -81 31 531 691 -28 34 -151 279 -281 -404 64 317 73 548 -556 88
7248 88 -299 104 -139 -460 -424 -298 31 -245 102 534 -30 37 47 43 193 362 -296 129 83 408 -377 -288 -57
7271 -57 -246 18 -78 10 -181 124 269 177 214 -498 285 -381 -111 -352 167 64 -211 -29 61 -100 219 312
7293 312 160 -207 -396 -368 -12 -230 277 -253 -48 104 191 -197 -73 287 -467 244 259 63 -298 -178 -44
7314 -44 179 293 129 5 -139 -356 -443 -22 153 0 107 -391 -267 140 -137 355 -102 -166 -139 14 13 213
7336 213 -14 -88 241 32 -330 195 147 -126 89 -257 48 356 -4 71 -50 403 95 165 79 -362 -354 -168
7358 -168 -204 -66 -24 -227 26 172 -253 -263 55 -122 74 -111 -269 208 -324 72 140 293 -42 -365 275
7379 275 -119 -87 303 372 291 199 -267 256 269 42 55 -524 264 -176 105 487 98 249 222 149 -286 27 -368
7402 -368 -260 -602 -14 -555 439 95 -125 215 391 308 72 -324 392 -219 -314 593 185 -1 519 45 -198
7423 -198 -470 2 98 -573 -270 -400 334 230 533 -119 123 6 -511 272 -526 -188 -30 -174 368 381 -362
7444 -362 145 86 68 399 -2 554 134 36 21 -254 -296 -130 103 -149 -375 -183 90 273 437 120 -191 -145
7466 -145 206 -66 309 -194 117 481 225 231 126 -429 -55 -67 288 26 47 -243 -338 -490 -397 165 -457 2
7488 2 -67 -176 237 -135 -68 146 657 311 -181 95 -467 -199 -12 -57 -40 -18 -57 -449 -386 63 -104 -438 432
7511 432 -132 187 390 377 156 -251 538 -485 -1 115 205 -19 -204 383 -353 -311 -256 21 -314 -266 -372
7532 -372 -80 -301 -149 -24 219 155 -46 81 639 16 -4 -122 221 220 -21 -115 -392 157 91 11 10 27 194
7555 194 406 -254 -200 509 707 67 -28 486 315 -65 391 -164 202 17 42 430 -1 -173 -270 -165 288
7576 288 -195 541 -17 -224 90 -257 479 -404 -360 -509 -482 64 184 327 0 -270 241 -52 -161 -342 342
7597 342 -423 -75 -48 -160 -462 -629 631 397 26 -417 16 108 -284 -85 74 -3 58 -332 271 -157 173
7618 173 -253 -367 202 364 -313 59 -363 -358 -144 138 186 -439 -191 -706 -403 -374 -70 367 -472 -169 -200 -49
7640 -49 -484 108 -88 534 501 -430 -1220 200 230 -442 -183 213 -27 239 -136 -36 -175 412 -96 -449 116
7661 116 -39 -391 -227 -619 224 2 -289 138 -230 138 -257 -153 175 452 -585 -26 -716 -150 -123 164
7681 164 29 -500 262 -97 8 48 -285 -15 644 151 178 86 338 686 170 560 478 -269 113 -375 188
7702 188 -210 639 -37 -354 -592 508 228 -111 170 264 -451 -263 -341 -89 130 -134 -85 -1107 254 -108
7722 -108 174 261 74 295 -435 517 -38 -528 -239 -312 724 397 -130 -220 -362 478 56 -19 63 -586 202
7743 202 171 -21 -362 -372 -364 -326 -461 -291 508 -388 -311 684 113 -490 669 -440 28 -244 546 414 -174
7764 -174 182 -236 76 121 222 64 -185 -136 676 150 453 -253 257 -85 439 346 140 153 -176 213 -347
7785 -347 401 -169 -248 271 -379 -125 140 -71 -204 -21 688 -255 641 -596 -259 187 -153 -180 141 667
7805 667 -247 178 494 -25 196 565 -178 123 314 -250 -35 72 -181 -264 146 579 8 -424 50 738
7825 738 221 161 -219 791 287 -363 -199 277 -256 -84 113 -659 -496 615 -483 -522 -50 -560 -22 141
7845 141 -403 -190 -314 -399 -18 -37 -327 -147 260 338 -341 -176 90 -133 732 -157 -579 -343 123 217 -205
7866 -205 183 -258 -279 -839 -46 110 380 -611 -944 155 269 -281 -151 519 -160 -437 -436 -20 280 198 26
7887 26 -951 380 626 -43 -526 -38 -269 -678 93 590 869 -456 -239 216 396 861 -568 215 8
7906 8 -279 -646 -167 -726 -361 -37 303 521 -54 -339 575 -800 -343 -342 -484 -89 -239 751 36 721 154
7927 154 -290 -808 -769 551 89 -262 -914 383 747 -280 653 -782 14 -410 -663 -208 -120 -160 549 212
7947 212 709 106 68 143 -252 -245 -575 -175 -804 264 743 620 -474 517 610 577 320 232 -359 -352 -118 -366
7969 -366 11 -246 -88 79 -332 316 -605 -753 614 522 -151 25 771 76 463 440 -130 -813 234 -528
7989 -528 -440 952 69 -306 -77 -416 -706 -439 -161 -498 -158 -235 409 -276 12 -106 -258 487 -206 106
8009 106 -21 313 -219 -3 377 13 -142 -32 -36 241 6 -560 -594 -379 -104 -109 73 -268 93 188 555 -137
8031 -137 232 134 690 290 -88 285 -686 -131 -322 50 -279 407 355 -735 775 196 -393 -486 33 -819
8051 -819 -777 256 -240 47 160 96 250 493 -356 222 -575 183 197 117 437 402 10 204 -217 -19 -229
8072 -229 -242 -166 -11 -163 -159 -343 124 852 -31 -87 164 630 -293 919 -317 -262 245 -454 -865 -32 418
8093 418 -43 -75 233 -396 -776 -201 10 -480 -707 119 473 157 -776 -411 153 38 344 416 -43 -178 360
8114 360 -79 149 602 868 203 228 -117 -278 -30 -546 -688 -601 131 4 215 18 272 -179 76 -413 937
8135 937 -81 390 447 -59 424 -111 351 701 76 -455 250 39 -281 -660 56 406 323 -574 -252 119
8155 119 435 68 815 -509 -109 771 545 753 -84 -180 71 -397 75 511 -258 264 208 1035 587 763
8175 763 -868 -1067 320 -194 687 -139 451 -501 -998 -77 -185 -46 2 325 -474 -693
8191f93
##END NTUPLES=NMR FID
##END=
