##TITLE=1H_Pr 87-1
 CDCl3, 8 sc, 
 28.04.2021
##JCAMPDX= 6.0         $$ Bruker NMR JCAMP-DX V2.0
##DATA TYPE= NMR FID
##DATA CLASS= NTUPLES
##ORIGIN= UXNMR, Bruker Analytische Messtechnik GmbH
##OWNER= root
$$ XWIN-NMR		Version 3.5
$$ Wed Apr 28 13:26:59 2021 Russian Standard Time (UT+4h)  she@DPX200
##.OBSERVE FREQUENCY= 200.131506
##.OBSERVE NUCLEUS= ^1H
##.DELAY= (6, 6)
##.ACQUISITION MODE= SIMULTANEOUS
##.ACQUISITION SCHEME= undefined
##.AVERAGES= 8
##.DIGITISER RES= 18
##SPECTROMETER/DATA SYSTEM= spect
##.PULSE SEQUENCE= zg30
##.SOLVENT NAME= CDCl3
##.SHIFT REFERENCE= (INTERNAL, CDCl3, 0, 15.7039)
##AUDIT TRAIL= $$ (NUMBER, WHEN, WHO, WHERE, WHAT)
$$ ##TITLE= Audit trail, XWIN-NMR		Version 3.5
$$ ##JCAMPDX= 5.01
$$ ##ORIGIN= Bruker BioSpin GmbH
$$ ##OWNER= she
$$ F:/spectra/data/she/nmr/H-F/1/audita.txt
$$ ##AUDIT TRAIL=  $$ (NUMBER, WHEN, WHO, WHERE, WHAT)
(   1,<2021-04-28 13:25:39.07 +0400>,<she>,<DPX200>,
      <created by zg, POWCHK disabled, PULCHK disabled
       configuration hash MD5:
       00 E9 B6 7A A2 85 ED C7 34 08 36 98 17 FE 4E 26
       data hash MD5: 16K
       3E AE 43 6A 66 B4 E6 B2 8E 31 91 C7 AC 94 D2 54>)
$$ ##END=
$$ 
$$ hash MD5
$$ B7 69 29 17 C7 EF D6 41 04 F8 0C F1 4F 9E 24 74
##$RELAX= 
##$RELAX= 
##$RELAX= 
##$RELAX= 
##$RELAX= 
##$RELAX= 
$$ Bruker specific parameters
$$ --------------------------
##$DU= <F:/spectra>
##$EXPNO= 1
##$NAME= <H-F>
##$PROCNO= 1
##$TYPE= <nmr>
##$USER= <she>
##$AMP= (0..31)
100 100 100 100 100 100 100 100 100 100 100 100 100 100 100 100 100 100 
100 100 100 100 100 100 100 100 100 100 100 100 100 100 
##$AQSEQ= 0
##$AQ_mod= 1
##$AUNM= <au_zg>
##$AUTOPOS= <>
##$BF1= 200.13
##$BF2= 200.13
##$BF3= 200.13
##$BF4= 200.13
##$BF5= 200.13
##$BF6= 200.13
##$BF7= 200.13
##$BF8= 200.13
##$BYTORDA= 1
##$CFDGTYP= 0
##$CFRGTYP= 5
##$CHEMSTR= <none>
##$CNST= (0..31)
1 1 145 1 1 1 1 1 1 1 1 1 1 1 1 1 1 1 1 1 1 1 1 1 1 1 1 1 1 1 1 1 
##$CPDPRG= <>
##$CPDPRG1= <>
##$CPDPRG2= <>
##$CPDPRG3= <>
##$CPDPRG4= <mlev>
##$CPDPRG5= <mlev>
##$CPDPRG6= <mlev>
##$CPDPRG7= <mlev>
##$CPDPRG8= <mlev>
##$CPDPRGB= <>
##$CPDPRGT= <>
##$D= (0..31)
0 1.2 0 0 0 0 0 0 0 0.06 0 0.03 0 0 0 0 0.0002 0 0 0 0 0 0 0 0 0 0 0 0 
0 0 0 
##$DATE= 1619601938
##$DBL= (0..7)
120 120 120 120 120 120 120 120 
##$DBP= (0..7)
150 150 150 150 150 150 150 150 
##$DBP07= 0
##$DBPNAM0= <>
##$DBPNAM1= <>
##$DBPNAM2= <>
##$DBPNAM3= <>
##$DBPNAM4= <>
##$DBPNAM5= <>
##$DBPNAM6= <>
##$DBPNAM7= <>
##$DBPOAL= (0..7)
0.5 0.5 0.5 0.5 0.5 0.5 0.5 0.5 
##$DBPOFFS= (0..7)
0 0 0 0 0 0 0 0 
##$DE= 6
##$DECBNUC= <off>
##$DECIM= 32
##$DECNUC= <off>
##$DECSTAT= 4
##$DIGMOD= 1
##$DIGTYP= 9
##$DL= (0..7)
0 120 120 120 120 120 120 120 
##$DP= (0..7)
150 150 150 150 150 150 150 150 
##$DP07= 0
##$DPNAME0= <>
##$DPNAME1= <>
##$DPNAME2= <>
##$DPNAME3= <>
##$DPNAME4= <>
##$DPNAME5= <>
##$DPNAME6= <>
##$DPNAME7= <>
##$DPOAL= (0..7)
0.5 0.5 0.5 0.5 0.5 0.5 0.5 0.5 
##$DPOFFS= (0..7)
0 0 0 0 0 0 0 0 
##$DQDMODE= 0
##$DR= 18
##$DS= 0
##$DSLIST= <SSSSSSSSSSSSSSS>
$$ [...]
##$SUBNAM2= <"">
##$SUBNAM3= <"">
##$SUBNAM4= <"">
##$SUBNAM5= <"">
##$SUBNAM6= <"">
##$SUBNAM7= <"">
##$SUBNAM8= <"">
##$SUBNAM9= <"">
##$SW= 19.0423571276983
##$SWIBOX= (0..15)
0 0 2 0 0 0 0 0 0 0 0 0 0 0 0 0 
##$SW_h= 3810.9756097561
##$TD= 16384
##$TD0= 1
##$TE= 0
##$TE2= 300
##$TE3= 300
##$TEG= 300
##$TL= (0..7)
0 120 120 120 120 120 120 120 
##$TP= (0..7)
150 150 150 150 150 150 150 150 
##$TP07= 0
##$TPNAME0= <>
##$TPNAME1= <>
##$TPNAME2= <>
##$TPNAME3= <>
##$TPNAME4= <>
##$TPNAME5= <>
##$TPNAME6= <>
##$TPNAME7= <>
##$TPOAL= (0..7)
0.5 0.5 0.5 0.5 0.5 0.5 0.5 0.5 
##$TPOFFS= (0..7)
0 0 0 0 0 0 0 0 
##$TUNHIN= 0
##$TUNHOUT= 0
##$TUNXOUT= 0
##$USERA1= <user>
##$USERA2= <user>
##$USERA3= <user>
##$USERA4= <user>
##$USERA5= <user>
##$V9= 5
##$VALIST= <valist>
##$VCLIST= <CCCCCCCCCCCCCCC>
##$VD= 0
##$VDLIST= <DDDDDDDDDDDDDDD>
##$VPLIST= <PPPPPPPPPPPPPPP>
##$VTLIST= <TTTTTTTTTTTTTTT>
##$WBST= 1024
##$WBSW= 4
##$XGAIN= (0..3)
0 0 0 0 
##$XL= 0
##$YL= 0
##$YMAX_a= 146887
##$YMIN_a= -169401
##$ZGOPTNS= <>
##$ZL1= 120
##$ZL2= 120
##$ZL3= 120
##$ZL4= 120
##$ABSF1= 10
##$ABSF2= 0
##$ABSG= 5
##$ABSL= 3
##$ALPHA= 0
##$AQORDER= 0
##$ASSFAC= 0
##$ASSFACI= 0
##$ASSFACX= 0
##$ASSWID= 0
##$AUNMP= <proc_1d>
##$AZFE= 0.1
##$AZFW= 0.1
##$BCFW= 1
##$BC_mod= 2
##$BYTORDP= 1
##$COROFFS= 0
##$CY= 11.3945322036743
##$DATMOD= 1
##$DC= 2
##$DFILT= <>
##$DTYPP= 0
##$F1P= 15.9154993809931
##$F2P= -4.1035820241983
##$FCOR= 0.5
##$FTSIZE= 0
##$FT_mod= 4
##$GAMMA= 1
##$GB= 0.15
##$INTBC= 1
##$INTSCL= 1
##$ISEN= 128
##$LB= 0.24
##$LEV0= 0
##$LPBIN= 0
##$MAXI= 10000
##$MC2= 0
##$MEAN= 0
##$ME_mod= 0
##$MI= 1.114404
##$NCOEF= 0
##$NC_proc= 0
##$NLEV= 6
##$NOISF1= 3.799351
##$NOISF2= 2.8
##$NSP= 1
##$NTH_PI= 0
##$NZP= 0
##$OFFSET= 15.70392
##$PC= 1
##$PHC0= -11278.59
##$PHC1= 11.20102
##$PH_mod= 1
##$PKNL= yes
##$PPARMOD= 0
##$PSCAL= 0
##$PSIGN= 0
##$REVERSE= no
##$SF= 200.130013532006
##$SI= 16384
##$SIGF1= 3
##$SIGF2= 2
##$SINO= 400
##$SIOLD= 16384
##$SREGLST= <1H.CDCl3>
##$SSB= 0
##$STSI= 0
##$STSR= 0
##$SW_p= 3612.71676300578
##$SYMM= 0
##$S_DEV= 0
##$TDeff= 0
##$TDoff= 0
##$TI= <>
##$TILT= no
##$TM1= 0
##$TM2= 0
##$TOPLEV= 0
##$USERP1= <user>
##$USERP2= <user>
##$USERP3= <user>
##$USERP4= <user>
##$USERP5= <user>
##$WDW= 1
##$XDIM= 8192
##$YMAX_p= 0
##$YMIN_p= 0
$$ End of Bruker specific parameters
$$ ---------------------------------
##NTUPLES= NMR FID
##VAR_NAME=  TIME,          FID/REAL,        FID/IMAG
##SYMBOL=    X,             R,               I
##VAR_TYPE=  INDEPENDENT,   DEPENDENT,       DEPENDENT
##VAR_FORM=  AFFN,          ASDF,            ASDF
##VAR_DIM=   8192,          8192,            8192
##UNITS=     SECONDS,       ARBITRARY UNITS, ARBITRARY UNITS
##FACTOR=    0.0002624,     1,               1
##FIRST=     0,             0,               0
##LAST=      2.1493184,     0,               0
##MIN=       0,             -169401,         0
##MAX=       2.1493184,     146887,          0
$$ Real data points
##PAGE= N=1
##DATA TABLE= (X++(R..R)), XYDATA
$$ [...]
1562A666J80k225j400Q24J794J216q58k297p12J920J617j03j328j969N02K458
1578A285P48j182j552q70J438K027j05k026j057M11J557J526j233k256o7J374
1594A8J446L18j889j788Q68K062N96p08j916j184J911J879l38j434j705P7K346
1611E59J364j285k001n90R14K213P29k429j584O19J451J652m74k571q12J557J708
1628A020M48j228k239J5K475J080o71j564j516J141K535J96j617j512k55J612
1644h0K185o27k397o95O61J807J494j603k248J21J458J486K41j829j849J083J950
1661A158N30n51j832j112J913J689l22j302j392J05K014J184j418j447l31O97
1677d17J861K91k105r52N18J221J178n82k068n89J641J049J57j022j871L77J967
$$ y = [1666, 1846, -379, -1779, -955, 839, 2055, 1197, -1100, -1812, 108, 1725, 1622, 294, -1675, -1173, 1285, 2033, 851, -701, -1571, -133, 1894, 1789, -237, -1294, -883, 674, 2200, 967, -1289, -1356, 18, 1464, 1782, -107, -1895, -1027, 1035, 1631, 923, -993, -2177, -266, 1613, 1275, -159, -1864, -1787, 559, 1923, 638, -1363, -1953, -1039, 1174, 1903, -526, -2110, -1491, -40, 1612, 1138, -1433, -2245, -688, 1020, 1468, 240, -1999, -1984, 491, 1571, 900, -664, -2180, -1039, 1496, 1692, 75, -1437, -1692, -80, 2105, 1478, -919, -1614, -953, 854, 2348, 745, -1503, -1382, 76, 1562, 1803, -26, -1875, -792, 1158, 1688, 1137, -695, -1807, 106, 1795, 1473, 171, -1221, -1116, 898, 2082, 664, -783, -1114, -417, 1444, 1735, -370, -1322, -804, 417, 1595, 1013, -1055, -1644, -3, 1046, 1203, 181, -1690, -1313, 654]
1694F54N69o78j286j092J029J940l2j488q55j14J187J614q47j755j92N87J259
1711E00P09j365j359L76J261P52j06j508j016J343J346o5o53j446j62J766J085
1728A458q52j226n83M62J846N57j580j072P9R71J491k97j800o41R10J163N60o93
1746G53j755p3J620O31J1j108j366P47J617K87p88j239m20J038J609m75j470n39
1764i20J63J389J022j216j439n8R46J239J32j419j416P35J415N56m53j646p03
1781a673J330J208J24j060j273K4J521R81p53j148p07N41J614L33j278r69m8J114
1799a19J079l24j358p11R49R69M95p40j508K02J231Q31j21j230r25O45J373N14
1817A252r48r98l66J005J352k97j130p60K58J329O65p35j252j78Q98R76J73j120
$$ y = [654, 1223, 545, -741, -1833, -804, 1136, 1104, -384, -1239, -1353, -166, 1448, 601, -1154, -1346, -759, 500, 1209, -156, -1515, -1139, 122, 874, 768, -740, -1756, -413, 933, 868, 215, -1231, -1393, 373, 1458, 606, -620, -1203, -741, 1105, 1662, 82, -990, -911, 60, 1551, 1254, -546, -1187, -277, 886, 1446, 753, -1002, -1075, 545, 1176, 1187, 79, -1287, -540, 1077, 1364, 576, -663, -1083, -45, 1564, 1089, -381, -920, -757, 632, 1654, 438, -1001, -1059, -113, 1126, 1258, -161, -1577, -842, 573, 1129, 676, -970, -1673, -343, 865, 989, -71, -1344, -1320, 201, 1182, 429, -719, -1426, -885, 729, 1062, -216, -1185, -1233, -119, 960, 636, -722, -1433, -484, 485, 980, 240, -1268, -1066, 165, 996, 875, -355, -1280, -635, 738, 1252, 304, -694, -1060, -55, 1297, 1000, -130, -890, -632, 697, 1362, 627, -625, -803, 95, 1071, 1244, 124]
1835A24j082N50J066O02n11j279l41R07J057m9j035q00J03J167P61p42j100m47
1853a049P39J257N2j058r84J23J170P61l85j341n20P68J049M22j004j137N1J069
1871a7R10l44j147o66M69J338K99q58r60j86J006R97l26j053o78M85J198M71p81
1890A57j131o9R50Q80k8j164o93M77J180M99o72j138j72R13J135j28j070q47K84
1909f37J306O40o06j232m26R92J076Lr48j038K90J138P16m98j263m02Q05J074
1927I90J84j124r44K22J177P41o43j115n33Q05J228M1r79j093J07J217Q34m02
1945G13j270p16P51J210L78j003j278R0J106J008l46j258o83N28J286M64q76j096
1963i92k44J069J006k50j048p51M08J281L88p21j130j21J083R41j42j268o54M79
$$ y = [124, -958, -408, 658, 1260, 749, -530, -871, 36, 1093, 1044, 9, -791, -688, 479, 1240, 498, -602, -1049, -310, 947, 999, -59, -1043, -920, 250, 1011, 626, -715, -1235, -467, 582, 1004, 0, -1137, -1086, -17, 893, 549, -598, -1264, -795, 543, 842, -16, -976, -1162, -156, 841, 515, -538, -1216, -731, 467, 938, 157, -974, -1043, -93, 787, 759, -405, -1098, -621, 559, 1058, 386, -752, -924, -11, 1124, 996, -74, -921, -637, 669, 1309, 703, -529, -955, 37, 1113, 1116, 168, -870, -580, 558, 1274, 776, -487, -889, -84, 990, 1174, 50, -894, -672, 505, 1246, 603, -512, -1045, -240, 988, 1029, 50, -1043, -936, 281, 1115, 713, -557, -1273, -522, 688, 1066, 63, -1215, -1125, -19, 989, 643, -615, -1298, -770, 516, 980, 104, -992, -1236, -167, 839, 589, -459, -1210, -802, 479, 867, 146, -984, -1105, -22, 919, 777, -491, -1145, -666]
1981f66J193O29q44j220p3R39J128j42j100q64L56J319N87p24j112l49J002J058
1999A117l2j034r74L64J144P74o63j242k55P24J135J45j264q29L01J105P24n46
2017F94j298m43R09J110N3r96j094J86J331O94n65j263n99Q39J197K72j131j075
2035a179J57J003J074m17j381n55P38J065N03j011j104J9J078Q08k33j059q97
2052a391Q40J176J20o69j057j28J186Q59l30j142n81N81J128N30j041j027J22
2069h24Q70R84j36j323o44P17J045M24o91j155k46J279P92k48q84r46N24J308
2087H46L22p55j010j34Q56J108k48j307m87M58R49P09r07j195K9Q79Q69n2j135
2106b05r56O13J225K78m67j225n19J236J013l06q89r08J62J281Q02p97j185k28
$$ y = [-666, 527, 1156, 312, -908, -981, -42, 1086, 944, -156, -1020, -664, 655, 1242, 518, -594, -943, 59, 1117, 1085, 51, -923, -559, 585, 1359, 696, -546, -801, -77, 1058, 1203, -61, -890, -589, 516, 1240, 694, -604, -1047, -138, 972, 1025, 29, -1065, -879, 452, 1146, 581, -682, -1281, -442, 755, 1027, -104, -1179, -1022, -19, 1055, 638, -743, -1298, -560, 505, 1008, -3, -1107, -1088, -10, 798, 565, -494, -1391, -551, 625, 745, 76, -981, -1109, 77, 936, 606, -536, -1117, -536, 592, 1122, 81, -946, -824, 46, 1030, 894, -429, -1073, -356, 689, 1113, 422, -733, -979, 300, 1092, 844, -40, -986, -462, 846, 1168, 413, -597, -731, 125, 1233, 985, -322, -809, -351, 598, 1307, 400, -795, -766, 113, 982, 930, -205, -1161, -548, 677, 955, 488, -737, -1256, -20, 993, 687, -202, -1110, -948, 333, 1135, 338, -847, -1075]
2124a075N57J242K90j353q67M13Q11Q82m27j315m25R90Q78J05o72j210K01J351
2142C76M38l11r96o32O57J257R2r55o83j10Q83J142n23j193k74L96J008N90q50
2161C12j129J15Q93O52N0r69q81P35Q85J58l03r80k95J023O98l05p17m84J62J045
2181F65L67r40o28Q6L57R39q1j179l03N29N59M35m77j090nJ002L64j22n99r23
2201a044N06J036J30m60p85l05O81R85l15r03k71O9P37P62q11q18J00M78O67J84
2221F23q88q34P26P72J00j82r31l88R88P07k27n79p20J55J072N20o88p11j94L23
2241c56J156J22j087n13K38P11P83m38j089l25Q07N92K81n18j072J70R68L60j30
2260F60p26o29M69J035K2o52n43k36O90R21m32q44l02J64Q76M77p59q16J5O16
$$ y = [-1075, -518, 724, 1014, -339, -1206, -793, 18, 900, 473, -842, -1267, -277, 601, 706, 34, -1176, -975, 376, 814, 503, -493, -1125, -468, 789, 881, -74, -757, -867, 16, 1158, 635, -558, -832, -436, 572, 1162, 312, -817, -702, 191, 843, 893, -76, -957, -222, 663, 821, 518, -462, -757, 266, 964, 659, -58, -542, -380, 665, 1032, 92, -536, -450, -93, 846, 765, -414, -717, -188, 371, 806, 329, -761, -766, 236, 600, 478, -121, -1044, -538, 498, 628, 168, -617, -922, -241, 744, 429, -474, -745, -676, 61, 823, 12, -806, -706, -228, 439, 623, -265, -1099, -373, 399, 499, 317, -614, -1002, -14, 693, 466, -113, -833, -678, 394, 914, 226, -485, -679, -356, 800, 922, -165, -678, -440, 271, 1054, 616, -473, -798, 9, 601, 882, 364, -708, -538, 430, 790, 660, -66, -695, -226, 809, 831, 179, -364, -600, 90, 1011, 579, -265, -567, -403, 473, 950, 191, -625, -610, 6]
2280FO10J34r49p83O46N71L21k20r19l21P68O47p0n71n85M4Q37N15o43m88j83
2301f33K59Q07no62m48K07M50N47k38q47j58N71M67J65m86p04K26O47M23j98o89
2322b99l58M46Q18K3o24l58j58P03N54k90o25l26L44N89K70m91p11J50N47M31
2342F35jp65l93N04N27K29m51o71q7O18N89k47n82m13J10Q65K27m54n85k39N20
2363f4O69r5o64m95K03O37M44l27q05j95N45N36J11p00n06J92O54L70l39o37l21
2384g87M52O95pm84n26kO93M76k86o49l06M43O55J56n15o91J70O24M28j06q53
2405d20k38L97P05K29n83n73j08P47N55j98o67m21L81P58K00m98o74l9N48O36
2425G37p2p70m11L23O45L41m62p81LM86P09j62p13m10J53Q00L23m84o87k03O80
$$ y = [6, 616, 750, -199, -982, -336, 235, 556, 336, -583, -904, -136, 511, 441, -130, -715, -671, 166, 681, 38, -450, -633, -374, 433, 428, -234, -682, -475, -25, 522, 284, -563, -721, -150, 317, 482, -4, -708, -482, 165, 588, 390, -299, -657, -211, 607, 630, 6, -352, -510, 193, 747, 457, -168, -494, -150, 439, 709, 218, -493, -343, 204, 635, 634, -131, -524, -20, 507, 736, 285, -386, -473, 145, 734, 487, -95, -508, -398, 467, 694, 240, -345, -584, -64, 605, 510, -154, -649, -446, 191, 635, 308, -497, -692, -147, 389, 500, -200, -706, -514, 140, 510, 171, -466, -787, -335, 360, 353, -131, -657, -659, 34, 510, 224, -425, -731, -288, 367, 523, 8, -683, -513, 111, 539, 433, -420, -658, -261, 444, 673, 90, -483, -591, 156, 711, 513, -154, -575, -194, 564, 764, 266, -408, -447, 101, 737, 665, -105, -516, -193, 452, 793, 331, -450, -447, 39, 748, 586, -127, -537, -384, 416, 739, 255, -432, -635, 45]
2446D5N66m8o54n60K42O35L70l74p42j93N58O44J30p60n81J89O30M92m05o74k97
2467g87M87P13M7o43n84J16P47M02k58p16l11N04O93J30o54o29K03O34N31k90
2487C35p99j82L70P72J80o27o72J29P05N02k27p01m15M50P29J86m58p33n7P03
2507A90N70j59p71m04L83O43L41n77o77j6O10O30j97p05m58L28Q16K28n97p06
2527e28j00P06O28k00p04n50M01P37L18n17p76j75P07N95k4q19m98L20O89M52
2547F62m90p24k03N29P32l6o83n76K72P66L00l87o85l04O98O36j05n91m94J26
2567e57P47M71m47p00j75M68P00J42p88n13K11O19N72l26q01k70N27P81qn45o51
2588e43R7Q83L12k68p10l48M69P70P2o63n26N8O49N93m07p48k06L35O97K87o55
$$ y = [45, 611, 563, -91, -651, -409, 226, 596, 222, -520, -713, -155, 489, 619, -141, -722, -533, 97, 589, 184, -490, -787, -300, 413, 460, -183, -767, -651, 96, 498, 240, -476, -787, -283, 410, 540, -114, -743, -540, 94, 625, 335, -464, -646, -276, 496, 676, 49, -623, -494, 211, 713, 486, -215, -630, -180, 549, 735, 277, -456, -513, 190, 760, 601, -170, -574, -191, 452, 793, 216, -461, -477, 133, 763, 566, -139, -597, -269, 547, 775, 178, -528, -628, 78, 706, 506, -198, -748, -347, 390, 708, 191, -585, -760, -53, 542, 518, -301, -799, -479, 210, 662, 172, -552, -755, -226, 506, 470, -213, -789, -517, 249, 549, 162, -523, -827, -129, 507, 402, -189, -683, -557, 190, 661, 214, -486, -661, -193, 507, 649, -139, -652, -441, 178, 750, 424, -377, -647, -120, 661, 653, 108, -543, -446, 437, 749, 481, -229, -577, -108, 662, 734, 71, -455, -397, 252, 845, 438, -310, -516, -181, 516, 803, 148]
2609A48p70J13O83M73j05p87n50N30P61R1m46p24j55P97N24j94o75m64K77P99
2629C26L65p01n76J6L63P51r2q24m12L59O51K85l69p79j24P24M39j9n58o17L70
2650d22P20J70l70n04k55N45P43j90o99k26P5O02N44n22o08k9L62O21O0o23n48
2671e54L36N73K31j93o33l38P38M83j50l89n32J25P05L63n21m31j89K64O58J00
2691F46q10k79K27M14M85l26p34j88N71L90R9n01o86L03P55Q2k16n21m67N43O37
2712D24m3m80m28n2N67N76m22o39k2J67O25K60o80n19K48M02L84j7o81m63O04
2733a89N36Q9k37p89n0P52M09k36m42m25J52R08J59o23m11o8L56P74j08o86l00
2754d29J17N33M32k49p49r9N16L68K37m73p01K12P18J60k07m86l61L63O78o4m52
$$ y = [148, -622, -509, 174, 647, 542, -245, -795, -265, 496, 587, 141, -583, -738, 59, 583, 389, -286, -750, -473, 326, 691, -10, -586, -570, -207, 544, 452, -372, -784, -425, 226, 511, 142, -637, -761, -37, 402, 383, -175, -792, -422, 298, 468, 98, -406, -661, -116, 627, 437, -262, -488, -413, 189, 733, 211, -397, -426, -64, 557, 617, -6, -554, -218, 355, 586, 393, -240, -578, 160, 643, 493, 104, -428, -303, 402, 765, 244, -187, -376, -112, 546, 646, -164, -443, -216, 198, 683, 357, -377, -565, 6, 396, 495, -6, -692, -389, 366, 448, 232, -289, -756, -213, 424, 381, -99, -527, -579, -12, 564, 142, -497, -519, -352, 273, 533, -147, -666, -418, -16, 368, 351, -330, -793, -189, 347, 436, 199, -590, -640, 112, 521, 285, -157, -582, -430, 478, 637, 14, -397, -465, -109, 665, 557, -129, -429, -312, 221, 653, 404, -345, -444, 72, 440, 677, 204, -497, -285, 433, 593, 386, -100, -461, -98, 580, 516, 64]
2775F4k69j50N44N11l82n06j85K06M42K83n76m43J39M08K97j5o75k23M06L42M9
2796B67j76n51o2N37L06j91k96k85Q1O06R5m42k16r7K07N99j66n26j72L20K60
2817I8K35k57n98J06M63K39J3m83l74L00N44J32l35l73j24L54O33j96l93k62l1
2838c09N62L80m34m02j13L35M57N5n07m01L08L43K18j11n42k35M72L98K7k98n10
2859c07j6O37K54k94m34k64K85N81O9m53m16l1M11N46j92o50k33K79L33L52l89
2880F8n94M0M39L79n0m76l88K27N43J22l07m25j39M81M97k19l93k96R3N54K34
2901C90l43n03ML49M38R2n81l52K02M38M03l31n21k01M08N15M9m41m24J4O61K89
2923E55k63m73k00L29M81Q6m05m41J20M38L58k31n51j91L87M02J69m79m50J02
$$ y = [64, -205, -355, 189, 700, 318, -188, -373, -167, 275, 558, -18, -461, -322, 86, 383, 368, -307, -530, -124, 218, 267, 91, -460, -522, 15, 321, 130, -166, -451, -370, 236, 331, -111, -327, -424, -217, 382, 216, -310, -482, -162, 98, 333, 76, -522, -416, 47, 286, 299, -184, -558, -258, 286, 418, 83, -290, -414, -60, 573, 377, -16, -278, -309, 253, 633, 199, -203, -316, 19, 476, 531, 24, -377, -69, 274, 492, 381, -161, -396, 76, 474, 501, 203, -307, -323, 314, 568, 274, -160, -424, -139, 442, 511, 58, -358, -389, 22, 568, 376, -274, -507, -228, 105, 457, 68, -526, -486, -47, 332, 282, -194, -582, -355, 188, 310, 3, -422, -561, -80, 417, 198, -195, -491, -398, 156, 390, 47, -456, -452, -103, 335, 427, -154, -506, -304, 134, 537, 206, -315, -516, -108, 407, 456, 15, -409, -395, 266, 555, 292, -181, -381, -52, 429, 515, 110, -331, -211, 227, 585, 354, -197, -388, -1, 401, 570, 91, -359, -257]
2943b57M22M54k74m91l05L69N07J16m10n07o8M93M41j41n69l44L44M89K39m61
2963D7n52qM37M99r0o29l23K06N50K54l56n33k8M03M61q4m71l86J78O74J87l26
2985A10o28l6N16M30pn34m10K41N22L59l72n50j51M47N67o0m77l91P0N74L24k54
3007B90n33k41N04M74N2m89m80J49N31L28k30n88k08M16N13P9m69n18J75M94M11
3028F60k80o12k93M75M86P3l70n97L8N85L75k13n22l38L86N06J20m46n29M4M88
3049C6M12j87o29j93K97N39K07m87m98q2N94M51k24n82k78K65O05J51l52n29r6
3070e80N32M35j10n79l20K64O04L00m72n21JL67N84j5o12l90K44N67K97l36n80
3091c20j70N43N00n4m90m68K69M96K73k64n67j95M60N00P7o12l48O6N56M06l72
$$ y = [-257, 165, 619, 345, -146, -451, -82, 425, 541, 131, -376, -444, 49, 490, 349, -220, -564, -220, 269, 508, 47, -505, -513, -76, 423, 333, -296, -619, -413, 137, 391, 35, -498, -526, -123, 338, 254, -217, -603, -425, 249, 436, 110, -518, -554, -38, 392, 385, -149, -559, -318, 204, 563, 191, -359, -510, -63, 504, 444, -33, -424, -354, 220, 544, 290, -243, -484, 20, 494, 546, 57, -423, -274, 257, 585, 355, -233, -441, -25, 488, 567, 98, -420, -245, 249, 660, 380, -232, -525, -50, 436, 509, 139, -458, -420, 165, 540, 327, -195, -533, -147, 359, 479, 33, -496, -452, 36, 448, 261, -368, -561, -264, 275, 482, -5, -503, -585, 9, 460, 236, -346, -624, -359, 246, 397, 45, -484, -580, -48, 387, 277, -302, -622, -358, 246, 546, 74, -447, -446, -79, 505, 490, -122, -512, -268, 299, 596, 260, -320, -490, 53, 553, 499, 9, -459, -190, 306, 579, 315, -252, -447, 13, 513, 590, -22, -370, -304, 252, 658, 286]
3112B86n66j02L36N04R9n89m58Q5O77K46j67n86l13M54M32J29l88n63M4N52L32
3133D44k19n59j64L05N00J69n65m29J04L35N14k20o22j64L58M86O8k97o72Q6O10
3154F8K75j33m76l97L92O13M1l73m62l7M35N55k39n33j58J81M61M01n45m92O7
3175c56M02L75J8n32m28M53M05J52k75m68j55O05L56j54m64k86J15O57K46n26
3195A40l64n1K35O10j39n84k02K19L32L89l16o36j35N53K93R3l82n84K17O02K9
3216C19j24m72k73L65N83n6n25k16o5M84M23l28n06m3J85M83J34n02m47K51L09
3237b1K94j9n38l40M86L43N7k06n54n8O03L53k04k98k28m3O69J89m71k40r3K99
3259b0M85p9n44j17J65L16K40j46n74L2L56J89J39l63m66K98M05J17k38l41j52
$$ y = [286, -280, -382, -46, 458, 557, -32, -490, -405, 272, 518, 351, -235, -548, -94, 338, 467, 79, -484, -440, 112, 444, 225, -334, -498, -193, 307, 476, -89, -518, -414, -79, 435, 215, -407, -571, -213, 273, 341, 44, -628, -542, 68, 343, 210, -266, -663, -271, 342, 383, 10, -452, -489, -54, 501, 262, -271, -429, -248, 213, 614, 69, -423, -356, 46, 421, 439, -93, -521, -68, 337, 489, 214, -254, -409, 196, 552, 398, -66, -352, -237, 420, 666, 140, -224, -275, -40, 570, 431, -153, -355, -136, 196, 585, 269, -367, -502, 51, 344, 437, 55, -529, -312, 290, 319, 195, -277, -550, -185, 398, 342, -183, -399, -464, 20, 443, 115, -391, -434, -249, 234, 368, -134, -581, -330, -21, 273, 254, -284, -624, -138, 205, 262, 56, -498, -556, 47, 400, 196, -102, -330, -373, 296, 485, 14, -226, -319, -20, 465, 386, -158, -275, -110, 206, 446, 300, -274, -242, 114, 303, 442, 79, -387, -89, 316, 433, 195, -146, -298]
3280b98K95M83j81k41k24o7M39K57l18l79l1J82K99J53m11l66K68K66R0J0m85
3301b59k11M37K03Jj62l73k6M42K84l44k16j36O2N96n2m04j33j2K56L83j96m82
3323c42j55M02J64K59k52n49J22L87K26pl95k91J97N07K5k85k31j99L73M62j41
3344B77l44k10O2N40J34k90m32O5K96K65J25m75l49K88K39K61j48n11p0K69M34
3365D26p7k37l60OM59K33k35k67k49J75M42K7l34l08RK49M16j12n53o3J69K47
3387F3L03k65n00L1L87J95K1l01l78J80M51K8k39k68j61M18K56p2k83l06J35M16
3409A11K76l24m42L2K29L44M8m17k56J17L76K44k08l70j66L10L76o2k30l42P9
3430b75M93R9j35l30j41K85M22j1l90k55Q0L53L01j78n17l0K14L55J54l96l98
$$ y = [-298, -3, 480, 299, 58, -166, -233, 206, 463, 145, -234, -265, -83, 216, 369, -42, -408, -140, 126, 216, 226, -259, -470, -33, 170, 171, 9, -364, -390, 52, 336, -8, -224, -360, -298, 298, 246, -158, -291, -303, -47, 336, 140, -342, -497, -95, 69, 328, 76, -473, -351, 36, 262, 255, -140, -431, -234, 273, 298, 13, -218, -417, -44, 418, 277, -67, -277, -215, 325, 459, 169, -263, -198, 98, 363, 488, 13, -336, -48, 191, 452, 304, -207, -277, -8, 426, 349, 112, -248, -242, 217, 450, 215, -52, -301, -126, 316, 343, 9, -299, -290, -41, 375, 263, -290, -353, -184, 63, 366, 101, -399, -368, 19, 214, 235, -66, -444, -264, 187, 215, -24, -292, -453, -35, 221, 149, -134, -440, -305, 111, 387, 63, -379, -347, -118, 226, 274, -143, -399, -282, 94, 338, 130, -240, -406, -96, 280, 218, -12, -354, -275, 218, 317, 182, -148, -289, -4, 418, 407, 17, -238, -158, 195, 496, 318, -199, -229, -15, 340, 494, 98, -300]
3451c00Q3M24K49k21l37l03L24M19K8k80m18L6L60K56r1l97k37K65L75J37l53
3472A9l75K9K70M15j05m86k14J41M96J26k62m20j31N06L38j19m66k66J86M46J88
3493C16k31m26j12L94L22M2l98l06Q7M43K36k52m17j12L22M78r8l60k94P9M90
3514B03J72j90m02j38L51L94j6l76l35J68L35L01k00m67r7K99M05M5m32l02J06
3535a76M06K18j85l79k28K25M11J21l12m18rM02K89j48l86k38K98L13R2k73l61
3556c38qL33L49j60m48j16J80M09J32m01l24l3L81L53j66l82k04K26M10J24k79
3577C8m36K5L69L28j26l86k93K09L61K90l21l87n2L25M09r5l94k62K09L88J32
3598C31j55m37r6M18K72J7l11m22K42M14J55k29l97pJ94M51l1m36k14N4M07K59
$$ y = [-300, -217, 207, 456, 235, -102, -405, -81, 338, 366, 86, -332, -296, 64, 320, 229, -168, -405, -140, 235, 372, 19, -356, -327, -57, 358, 253, -233, -447, -306, 190, 316, 54, -366, -497, 9, 347, 228, -238, -504, -318, 128, 316, 85, -341, -453, -59, 263, 305, -93, -399, -312, 131, 367, 115, -302, -414, -92, 386, 288, -72, -366, -287, 203, 375, 185, -217, -355, -4, 390, 374, -2, -337, -169, 166, 467, 267, -200, -297, 2, 407, 452, 20, -282, -176, 230, 448, 263, -116, -344, -119, 292, 413, 101, -317, -326, 76, 365, 217, -169, -407, -109, 204, 296, 23, -338, -346, -13, 336, 176, -272, -388, -208, 201, 333, -68, -392, -425, -44, 309, 143, -239, -443, -217, 193, 317, 38, -398, -373, -4, 324, 198, -188, -481, -272, 89, 379, 58, -329, -381, -56, 353, 258, -136, -398, -189, 199, 331, 176, -261, -357, 61, 333, 350, 39, -383, -141, 273, 428, 199, -198, -205, -11, 440, 409, -27, -241, -187, 220, 479]
3620D79k81l29k15L40L76K1k99m52J59L92J11q7l72k12L05L74jl09k87L6L55K69
3642C73k76l26n8P1M58N6m03k48P8K96K92j83l99j84L32L05P7j57n73J05M04K18
3664B58q7l12k93K38L97J28l41l12RK95M14j53l84j46P2M14J67l11l19mL51K57
3686C38Ml98l29L20L15J18j84l79q9L90L13j15l53j37K3M36J74l10k35j50K02
3707d6M30J9m71k13J54K94K03j27m39j15M10J31R4k87l09O1L86P0n3l43k51K47
3729a55M34n3l24j81j8K74L35k03m04q6J53L18J51l05l34J29K25K27j1l89k62
3750d79L80J96N5q4l66n6L28K44q4k27j17nL61R3k87q6p2K40K96p5l77r6K07J44
3774A33J90j52l64M9K61Q7Kk19k46J51L68M5j52k14j72K39L95k18j91j29JL01
$$ y = [479, 198, -131, -346, -6, 370, 391, 92, -360, -201, 191, 302, 215, -157, -369, -64, 310, 309, 0, -287, -251, 104, 373, 97, -229, -287, -216, 242, 298, -105, -353, -275, 21, 313, 130, -269, -453, -121, 184, 261, 104, -469, -364, 40, 258, 171, -141, -434, -196, 201, 329, -12, -324, -315, -20, 394, 241, -143, -289, -217, 197, 364, 53, -266, -270, 81, 338, 342, -56, -385, -65, 250, 368, 184, -195, -284, 106, 419, 304, -49, -186, -163, 273, 447, 137, -98, -248, -46, 384, 403, -68, -281, -127, 167, 370, 243, -196, -311, 99, 230, 324, 37, -272, -211, 175, 245, 192, -151, -402, -155, 279, 226, -98, -279, -297, -23, 312, 109, -295, -381, -228, 90, 241, -64, -398, -269, -44, 183, 172, -217, -479, -99, 97, 152, 68, -298, -354, -26, 218, 134, -93, -210, -215, 146, 239, -48, -134, -206, 34, 330, 255, -122, -218, -11, 133, 323, 171, -193, -144, 117, 204, 206, -13, -259, -108, 260, 305, 153, -61, -233, 6, 401, 183, -8, -137, -136, 165]
3796A65J93k46k46J4R7K65ol14j66J40K33P3m5l28r9L02J50j8j86k81k7M25J43
3819B38k15j84j96J70L77K4l04k01jK46K14J5m83q2K69J16K65k47l45J10K08J81
3841A75J1k93j76R5L53kj68r5j75K83L02j33k33j34N9K77K22k01l57P6R1K53J19
3864C49l93j18P0K60J55r7l22j47K96K28o8q6k95m3L69J04r6k19j03R1K92M1k11
3887E7k28P6Q8K30p0l19j3P8K19J90k31l07j9K62J67m1k17k31J81K73n4q8k17
3910b14j12K76K40j38k45q5O8K64J89j96l25PJ15K75Q1l33j57J49K19L6q4k38
3932b08n4K66J52N1k10k61J53L02P0j29k65n0J74K83J1k69k06R5J65K81j25l69
3954a43q7K85K20Oj62k81M0L51N8n6k24k44K25K45O5k00k72J6J98K44r2l22q3
$$ y = [165, 358, 112, -134, -120, -23, 242, 236, -78, -244, -104, 129, 202, 157, -171, -270, 32, 182, 164, -22, -303, -330, 95, 238, 23, -161, -357, -187, 190, 214, -90, -291, -292, -46, 168, 183, -300, -382, -113, 3, 268, 21, -324, -214, -6, 175, 186, -107, -283, -188, 165, 163, -5, -100, -275, 8, 310, 177, -56, -190, -131, 146, 368, 167, -190, -114, -23, 230, 349, -44, -162, -92, 168, 323, 226, -96, -243, 53, 281, 213, 127, -168, -211, 158, 262, 166, -53, -156, -65, 227, 268, 57, -171, -95, -7, 223, 153, -166, -179, -101, 118, 308, 77, -230, -249, 13, 180, 139, -78, -309, -128, 145, 91, 3, -214, -326, -50, 190, 52, -193, -278, -210, 54, 243, 47, -278, -271, -156, 119, 200, -133, -290, -141, 78, 114, 30, -208, -262, 4, 156, 207, -3, -264, -111, 191, 261, 132, -133, -183, -9, 274, 285, 16, -190, -95, 70, 351, 226, -143, -230, 55, 275, 281, 119, -162, -122, 229, 287, 231, 7, -237, -12, 233, 298, 98, -174, -158, 40, 284, 192, -130, -213]
3977b13R2K60J48k95k63N4K58J58m0k48k23J62K97P2k05k81m7K92K33q8k27k39
3999c43J93K46J01j83k21r7K09K92n2k57j62J09K12K08k78j82p8K66K47m4k51
4020f5j97J63K79P3j59k68p5K85K39L1l26j66M7K87J32p3l24n9J53L02K0k17k65
4043a83N9L05J37r7l46j24K35K60k1j51k90M3L07K13j77l21j00J52L30J2k78k05
4065b40K9K13K82j53l30q0J52K67O9k02k96O4K63K06j31k31k14J63L13O8k31k66
4087b85O8K17J73j00j96j35J19K96P2k58k24L8J64K76r2k25j97J21L23L7j53k34
4109a95n1K70K19j6l19j26J34K04K52k31k68n3K04K87m5k81j89L5L43J41j94k13
4131i2j12K67J96L9k92k05R3K46J01r1k98j01K85K01ml08j85R6K35K04k51j69
$$ y = [-213, -121, 139, 287, -8, -271, -217, 41, 199, 159, -89, -312, -150, 147, 219, 14, -267, -314, -22, 211, 123, -104, -343, -150, 96, 197, 14, -207, -304, -95, 197, 145, -112, -274, -165, 47, 255, -23, -205, -283, -17, 230, 186, -65, -262, -99, 180, 253, 94, -174, -249, 36, 275, 306, -20, -186, -139, 148, 280, 207, -117, -176, -23, 279, 299, 82, -183, -124, 181, 318, 221, -125, -249, -14, 246, 225, 74, -216, -173, 134, 347, 170, -151, -251, -99, 231, 243, -35, -240, -211, 2, 284, 131, -199, -279, -127, 140, 209, 7, -289, -225, 38, 244, 113, -118, -332, -169, 144, 212, -19, -285, -217, 0, 173, 73, -123, -258, -139, 157, 229, -29, -253, -215, -51, 225, 133, -92, -289, -168, 155, 192, 39, -195, -246, 24, 243, 227, -92, -218, -84, 120, 372, 141, -127, -180, 24, 311, 266, -15, -204, -169, 174, 315, 121, -92, -204, 63, 259, 298, 6, -199, -106, 140, 241, 150, -148, -249, 36, 237, 233, -75, -260, -164, 71, 275, 24, -145]
4153a45q6J18K93K8k23j98kK28J50p5k58j24K03K21Nj47k70O9J83J68l2k31j59
4176b84J23L45Rk61j15m3K13K29j06k91l2J39K31N6k36j85J9K58J59k0k62j83
4198b37J71L03L4j97k09m0K56K76j77k16q0OK69J36j98j87p0J76K09Qk16k09J46
4221d6J64R7o1k80k4J87J02O8k34j39L2K09J12j96j12n5N1L04o9k02m5k5J98J20
4245A56j31k11p4J62J81Q4k11j36M7J27J23J6l13p2K01J51Nj19j81j0K54J07j18
4268C8j26p8J18J73J8k31m6O8R0K43p6l43K9J04J45N3j07k77J09J72J86k7k14
4291B1k19J66K28K1j67r2q6J76K31j33j66r2N4K53L1j67k08R6N4J33J28l37j82
4314b57J94J85J7j8k37j08J66K08n9r8j69k5K48J26j43j47j07P1K34N0j92j73
$$ y = [-145, -231, -113, 180, 208, -15, -213, -215, 13, 163, 88, -170, -294, -91, 130, 135, -12, -282, -213, -30, 138, 106, -125, -284, -161, 184, 193, -68, -183, -226, -13, 216, 110, -181, -213, -74, 157, 213, -23, -208, -189, 69, 228, 208, -54, -237, -66, 237, 271, 74, -135, -175, 81, 357, 180, -36, -116, -110, 159, 295, 97, -90, -160, 16, 225, 233, 17, -192, -46, 118, 215, 154, -126, -150, 37, 139, 207, -27, -166, -134, 75, 187, -9, -121, -176, -125, 179, 110, -92, -137, -162, 36, 156, 25, -186, -260, -98, 83, 167, -44, -180, -133, -6, 117, 133, -180, -252, -51, 100, 105, -14, -195, -205, 49, 156, 38, -88, -166, -48, 125, 143, -88, -134, -66, 24, 267, 191, -152, -123, -19, 126, 179, 72, -205, -96, 76, 262, 235, 21, -198, -32, 196, 217, 50, -42, -128, 48, 279, 146, -20, -112, -58, 195, 226, 59, -149, -53, 1, 134, 262, -75, -257, -63, 122, 139, 121, -116, -224, -58, 150, 91, -7, -176, -201, 47, 173, 30, -117, -224, -153, 81, 131, -61, -234]
4336b34M2J33K42m8k81%J19L7J43j22k13M1J80Q9p5r6j74Q2K91m5q8q1r9J61J27
4361A31m6j51m6M8J54J35j71j95J27l4K14O9k57l4N2J69L4q1j27j39J81J28l3
4384A28m0j31l0K54l7q7p9j40J24K14L0k30q6K2J40J78r6k95M6N9J71N0j38k37
4408b10J6K80L8o2j76j18J80J97n9j06j73n1K13J96j67j42j8L7J49R8k00r7M8
4431a27J04J57nk26j08J51J78M7j15j88l7K32M2J9j22j18M1J41R9j12j71MJ06
4454hK13J1k68q2R1O9K20j07k36rJ27J79j0j31j46N1K54n9l1j83j04J91J72o2
4478A42j13j33%J86J09j64j47l8J85Q0J06k64n3kJ74O7k7k03j13J54J12M8r3k47
4502b34LK48J11q0j77r4J40K09q6q9q0m1J32J77k8k31j8O8J40R8r1k02m0K26K2
$$ y = [-234, -192, -59, 183, 135, -146, -146, -27, 10, 153, 31, -182, -141, 39, 128, 53, -43, -217, -135, 156, 111, 23, -58, -157, 4, 131, 85, -66, -112, -64, 90, 225, 54, -141, -14, -48, 166, 235, -22, -56, -4, 165, 199, 118, -9, -148, 33, 161, 128, 88, -43, -73, 181, 144, 57, -22, -162, -38, 176, 206, -24, -110, -88, 52, 230, 134, -161, -115, -56, 115, 165, 27, -210, -194, 86, 124, 62, -114, -232, -52, 145, 86, -20, -193, -244, -31, 165, -2, -144, -162, -125, 24, 122, -78, -175, -127, -23, 134, 129, -97, -205, -54, 124, 171, 56, -132, -169, 63, 105, 124, 2, -116, -75, 66, 165, 53, -118, -114, -8, 205, 216, -52, -134, -43, 26, 246, 139, -97, -106, 21, 200, 190, 59, -87, -36, 218, 159, 128, -55, -159, 32, 204, 142, 29, -104, -104, 82, 191, 27, -120, -158, 27, 107, 213, -51, -104, -106, 68, 135, 108, -95, -208, -54, 58, 106, 13, -234, -231, 17, 128, 48, -129, -223, -83, 126, 40, -49, -129, -170, -38, 139, 111, -120, -138, -70, 70, 168, 77, -125, -165, 61, 83]
4527H3P2k44m3J12J52K7p8j86m5K20J56j3k22q7mK59O1r7k40J2J13J63Lj79j19
4552a24O1K01J9q4j47j06K14J33M2j92j02LJ75P3j64j83P3P3J87j7j90p9JJ99
4576F6O3j08j36j08K05J51qj61j46O4J65Q6j02j51m5R8J30J07k27j56N5R0J96
4599A28j05j42p7J18K05j2j90j21K7K26O8l7j56j22J68J19N9j35r0m1J67J49m6
4622A60k32J5RK39oj41j72K7J66J77r7j55q3lK32K9q2j89L5J07J02j3j05j83J04
4647e9J61N6j05k16O2Q5K13l9k33p3J13J19N7q1j68m8J38J05Kj24j71R6J56Q2
4671A28q5j99j5J16J23O1k29p5J0J81J34j11j71j7P0K11l9j59o8l8J64J68j15
4694D5j37m7Q9J49L8j02j83K2J76J46q4j40j15J68J49L5j26j76nJ66J16j51q8
$$ y = [83, 155, -89, -132, -20, 132, 159, 81, -105, -150, 70, 226, 213, -9, -96, -100, 159, 220, 123, -117, -105, 8, 171, 174, -5, -124, -63, 138, 157, 73, -74, -180, 34, 167, 209, 17, -85, -82, 93, 166, 2, -181, -108, -35, 152, 135, -55, -134, -133, 66, 129, 21, -115, -223, -18, 133, 125, -36, -182, -118, 47, 133, 31, -120, -165, -67, 63, 170, -57, -213, -158, -68, 128, 23, -119, -196, -78, 127, 115, -75, -196, -169, 57, 125, 88, -68, -190, -22, 97, 156, 21, -69, -110, 57, 206, 160, -72, -57, -48, 191, 185, 44, -128, -101, 65, 242, 145, -10, -93, -96, 136, 165, 83, -106, -71, 36, 138, 125, 20, -163, -59, 102, 158, 53, -163, -101, -16, 197, 158, -75, -148, -35, 84, 141, 60, -108, -156, -18, 87, 89, -35, -206, -110, 46, 128, 43, -156, -171, -55, 68, 129, -100, -175, -165, 16, 150, 39, -132, -149, -79, 132, 93, -66, -134, -172, -8, 160, 45, -92, -139, -50, 99, 137, 35, -148, -126, 50, 196, 112, -28, -143, 25, 174, 209, 83, -93, -98, 68, 184, 33, -55]
4717e5n5O2J83Pm6j31n5J84R4j00r7j50J70N0M5m9j10j7J11Q4p2n3j28L1J93l
4743I3j06j11RR0J89j20p2j19M8J44Q2o0j96J4N0R1Q9j84r8R6J03K7n5j08p6J99
4769A9P1o5j00p3K3J83Q2j60m4o5O4J32k7j03l0L5J18J40p4k54K8Q9P7R5q6j67
4795i2P2J09J0J6j69k4M7J97o0m4n9o3R6J07j4j93OL1J03J17j89j19J39ON8L8
4821A26k47N1M7O3M3q9r1j3R4J37n5r7j05N0J52N7n0j78j4Q5J29l2j33q0P1J09
4847C0O5r2j51LQ6R2Q0j43j06Q9R7J6o3q8o6J25J29r3N7j52k8J48R7r5j30P8n2
4874f7J24L3j35o5R8J5N2M3j35o5J55O3Qn4o2m4J62K6q5p3o5O5J62K0j14j21N0
4901iO0Q9n7j36o7R5J02M9j12j84M5J23O9%m9j97L6K17j2n5j07j08J77O9N0j77
$$ y = [-55, -110, -48, 135, 142, 96, -35, -90, 94, 188, 88, -9, -159, 11, 61, 106, 57, -53, -70, 41, 125, 53, 0, -128, -97, 96, 93, -13, -124, -115, -25, 164, 44, -28, -147, -99, 45, 127, 67, -129, -115, -65, 26, 115, -69, -167, -71, 32, 59, 4, -104, -180, 19, 90, 25, -75, -148, -125, 58, 140, -20, -64, -129, -65, 67, 40, -63, -93, -58, 60, 200, 126, -128, -100, -11, 66, 161, 75, -92, -20, 89, 99, 115, -54, -78, -31, 166, 106, 62, 3, -60, 36, 143, 129, -64, -58, -27, 76, 193, 4, -115, 24, 30, 88, 126, -121, -70, -23, 40, 83, -6, -97, -110, -16, 121, 66, -31, -136, -86, 66, 123, 73, -105, -119, -34, 95, 63, -70, -150, -79, 30, 95, 3, -148, -145, -59, 33, 113, -30, -136, -47, 50, 66, 3, -85, -151, -26, 103, 10, 67, -85, -113, 35, 132, 37, -93, -15, -67, 57, 90, -45, -110, -12, 3, 55, 98, -37, -102, 53, 116, 124, 70, 8, -36, 126, 152, 67, -6, -71, -6, 156, 176, 62, -59, -9, 51, 140, 83, -53, -120, -25, 77, 126, 14, -170, -125, -2, 67, 67, 18, -179, -143, 74, 62, 7, -100, -208, -31, 38, 88, -89]
4927h9rjJ10J05j23k0m7m4J87j1r0q8J1J34N5o5l3j51J60J20m0n0k06N7J96k3
4953D5mp3o8N7P0J58j99n0K1R0P2Lj41j01R7J19M9o6j64O2P6M1N3j35j02P6J03
4980H9K9k4j83l6J18J45m2j13p3M2J45oKk02N7kK24m2j91L1m6P4N8p0o6q8J38
5007c2K7P6j03q5K8Q7J03q7j19k1R8O9N6j80l9OJ90Q0j05j26p6J25J36k9j19j03
5033a43P6J31L4rj46j9K2J48M2j00j52LJ48J23j22p9m0O5J37J0q7j71N4J38J8
5058H1J0j10p1M6J82L4o6j70PJ50N9j6j13j42J45J22m5q6p9m1J53P0j10m7p4Q
5084a03J94N0r0j65l7J79nL9j49n4R6N8N8r9j35J7J29M7J2j03p7N7O7J16j27p7
5110a02k6J43O5o6j0j45M2J79N5j09j39k3J41J10kj48p0L3J18M8n2j03rR0Q7n
$$ y = [-89, -98, -99, 11, 116, -7, -27, -74, -118, 69, 58, -32, -120, -109, 25, 80, 15, -18, -169, -9, 111, 71, 21, -185, -128, 68, 45, 41, -32, -100, -43, 27, 185, -14, -64, -43, 47, 119, 122, -19, -120, -23, 96, 145, 79, -85, -23, 53, 94, 147, 12, -90, -14, 89, 118, 94, -89, -125, -7, 138, 96, -17, -90, -48, 97, 91, 93, -109, -52, -54, 170, 128, -63, -32, -78, -4, 54, -16, -82, -170, -32, -5, 71, -32, -117, -89, -2, 101, 14, -105, -126, -28, 41, 97, -83, -122, -116, 74, 154, 49, -77, -153, -28, 108, 79, -40, -143, -67, 64, 98, 89, -57, -76, -54, 94, 136, 36, -116, -113, 35, 158, 36, -43, -83, -18, 119, 129, 42, -129, -75, 63, 81, 91, -19, -90, -44, 138, 172, 106, -64, -57, 93, 152, 136, 23, -119, 26, 148, 103, 17, -62, -103, 50, 120, 10, -37, -111, -103, 91, 141, 51, -114, -151, 28, 23, 62, -87, -141, -45, 13, 71, -28, -163, -146, -17, 30, 42, -61, -138, -81, -14, 102, -25, -102, -128, 15, 80, 14, 4, -141, -99, 80, 135, 26, -113, -136, 5, 115, 113, -35, -105, -72, 46, 94, 42, -61, -70, 20, 107, 102]
5136A02q2o7j07K55L3j04n8n5N0K29p6j11j33J07O5P2q2n1o0R0J15j0r7j11L5
5161e1J23J05q9p6j02Q7R4j9r0p2J4L0Q4nj60lM2J10K6o2j42M6J23K5m5q9j10
5188b06R6J13J27j46o1QP5P3m2r2o7O3J47k2l1j02n6J53L2K0p8j44J02J51k3n0
5214D0j27rJ07J23mo1j02o6K03J0j06k8qP2J18r9j15k9K5J34J6j2j92P2N3J02
5240A17l5q5r4Q5O7M8q7o3n6J06J16l4q8j33R9O7L3n4l9j13Q8J14K6j06n5n8J26
5267hJ23l7j45p8J54j9J1m1l6J0M9M1L2r6j02Q1J47n3q0l3l2J06J00Nj52l6J08
5294A9P9Mm4j07J8K3J23J5j14p9N1J33k5j9n6j17Q4J37j22kj3k1J49j0n1j24J0
5321e9Q7M8P3j73o6L3R2O4k4j16m7J07P3l5j8r8l2J34L0r1k8o5O0J35l8j14j9
$$ y = [102, 20, -47, -154, 101, 134, 30, -28, -83, -33, 196, 120, 9, -124, -17, 48, 120, 38, -13, -73, 17, 132, 122, 25, -86, -51, 72, 177, 88, 12, -90, -3, 91, 72, -18, -90, -76, -46, 38, 33, -127, -130, -88, 22, 48, -14, -156, -110, 13, 38, -7, -96, -206, -110, 3, 130, -16, -77, -69, 6, 79, 37, -55, -122, -59, 88, 66, 35, -67, -123, 30, 62, 82, 4, -140, -38, 113, 90, 40, -87, -96, 11, 134, 130, 69, -33, -99, 104, 114, 8, -20, -28, 44, 162, 63, -52, -81, -56, 78, 94, 82, -110, -38, 15, 117, 82, -3, -97, -12, 55, 103, 16, -47, -103, 3, 119, 85, -3, -136, -37, 30, 63, 9, -30, -143, -55, 59, 85, -21, -76, -134, -8, 115, 78, -67, -145, 9, -10, 1, -40, -76, -66, -17, 24, 56, -40, -142, -61, 86, 33, -47, -80, -112, -6, 94, 99, -53, -89, 19, 98, 102, 58, -49, -31, -8, 115, 130, 16, -63, -12, 121, 96, 77, 21, -96, -12, 125, 3, 1, -12, -33, 116, 106, 55, -69, -59, 28, 76, 149, -24, -90, -57, 35, 99, 75, -41, -88, 19, 92, 57, 39, -59, -91, 43, 73, -18, -46, -111, -51, 84, 46, -68, -87]
5348h7L0N0P7o0j22K9N1K2J08j04j29M3P5M9J4r8r1P9J27k2m3k2q7J46K6j2n0
5375ap9m7J28J49j00j07J9J0J62n2j40j6N0L6R5p2p3j8P6Q1k1q0q5K7R6R7j21
5402A4m8k9M3J70r5r1N5p8P8J08q3j03kjQ4J05j73l9OJ08M0m0qj01M6R8K6j17
5430b7l2m5R2J02q7l4k7j9J36L2q6o5M4K4N6o9q7lM5K7Q7L4j91p1J59M4jj4j34
5459a10O2J71k3j10J3l7J5J08L1j49P4n2L8R8q1n4j3L2P7j0k3j50P8Q5N0p7k8
5486A5r4J39J19j16L7j67L2P7L1l6rp2J3Q5J7j18K1k2M3N5k3o0n2J33J2Pp7r7
5514a07QR3J7O3j23l3K3J04l6j9l8j8L7J41kj96OpJ39P3j22q6K2N2P7o6n3m9Q7
5543a3P3mm1p1j9Q2J42p8j04l7m1J99J5p6o8J1K9Q6L0j26jm6J88m7j7q5l7P1Q9
$$ y = [-87, -57, -7, 70, 10, -112, -83, -32, -10, 98, -6, -135, -92, -17, 32, 46, -52, -143, -64, 63, 41, -2, -24, -111, 35, 61, 49, -1, -80, -127, 1, 150, 50, -57, -38, -28, 134, 82, -58, -74, -24, 12, 107, 35, -38, -56, 20, 101, 80, 0, -85, -58, 38, 135, 14, -34, -63, -20, 150, 55, -36, 19, -59, 19, 127, 44, -59, -61, -62, 22, 127, -46, -85, -79, 29, 69, 29, 21, -80, -34, 64, 90, -27, -59, -104, -12, 90, 3, -31, -58, -77, 59, 91, 5, -60, -16, 8, 64, -5, -92, -95, -50, -23, 64, 98, -93, -164, -5, 39, 38, 24, -110, -48, 123, 100, -10, 3, -34, -19, 89, 120, -29, 45, -7, 31, 129, 48, -6, -19, 13, 90, 80, 57, -93, -15, 70, 120, 43, 15, -79, 60, 179, 63, 100, -67, -35, 42, 73, 37, 28, -44, -31, 54, 71, -47, -26, -48, -5, 50, 27, -33, -85, 48, 60, 67, -10, -107, -99, -6, 11, 74, -49, -82, -59, 45, 9, -10, -48, -66, -29, 112, 110, -86, -80, -87, 52, 125, 3, -83, -61, -9, 68, 2, -51, -100, -13, 60, 56, 15, -56, -75, 7, 149, 71, -33, -70, -111, 88, 103, 27, -41, -30, -1, 85, 115, -11, -12, -58, 130, 83, 66, -19, -56, 15, 104]
5572A04J8q0j14K8O5P7r1k5n4K9N3jk3p1R4mJ07r4j14oJ6J99o2n9j70J11P8P1
5600H2m2r8l5M2Q4j3q3n7M1N4O8rj10Rn6J19M7q1l0l6J32L8J1j26n7M2Q3N1m1
5629B9p6k7P5O9O2j61n0L0R7j6l7o3L7M8J14p4k9o4K0P7P7n8j39K1J01NJ9j6r4
5658b3K8Q1l6L0r5k3O1K2P7j47n4K6N3R9j01r9Q0J5Q6k4r9n2O4O8J2rj25o4J59
5687A0J3J4n3p1LR3O4m0q8k9M8J14p4m1k0m2J42N5j32K7o8Q6P0J4j18m1J7J07
5715F0N5j6j48KK8P9M4o3j35J01j0J04q4n8J6K0Q1J1m5p9rP1O0rq4n1O0P6Qo0
5745B5n6L4J7R2k2n4n4j3J19n1l3j5p7M5Q4l3q4k4RJ53nj05k9K0rJ34n3l5m9O2
5775gn9R5k1o6m7M5R1J7n9o4N2O2L8k5l4j12M3J53m4r8o0P1J13MK3j80J7J7J14
$$ y = [104, 122, 42, -72, -44, 21, 98, 7, -18, -72, -43, 10, 9, -14, -85, 9, 5, 112, 18, -96, -102, -86, 113, 51, -8, -178, -67, 11, 82, 40, -58, -93, -51, 33, 20, -63, -120, -79, -25, 43, 34, -76, -67, -123, -4, 43, -38, -68, -104, 28, 66, 77, -49, -106, -64, 19, 70, 29, -47, -74, 1, 70, 132, -29, -79, -49, 48, 32, -5, -68, -31, 17, 131, 57, 28, -36, -16, 61, 138, 80, -59, -38, 63, 68, 87, 71, -23, 5, 86, 50, 80, -15, -38, 23, 45, 122, -25, -79, -53, 0, 99, -2, -101, -21, -6, 80, 56, -43, -95, -31, 37, 49, 40, -85, -149, 10, 23, 37, -16, -87, -84, 9, 73, 33, -55, -84, -36, 78, 4, -37, -57, -99, 43, 98, -34, -7, -75, 11, 81, 95, -23, -64, -47, 60, 115, 99, -49, -47, -19, 60, 104, 41, -94, 7, -3, 101, 17, -41, -25, -5, 76, 87, 42, -37, -46, 25, 85, 76, -8, -59, 1, 77, 85, 25, -31, 3, 20, 112, 90, 36, -18, -31, 88, 37, 4, -11, -88, -43, 41, 8, -76, -100, -91, 62, 57, -48, -77, -57, -66, 68, 15, -20, -69, -7, -66, 29, 8, -58, -105, -60, 31, 48, -11, -75, -23, 39, 77, 52, 18, -94, -51, 102, 58, -40, -100, -29, 84, 88, 111, -69, -52, -35, 79]
5804G9L4n5j09N1O2L3n7n4m9P8J16l3nj45l9Q8L2Jn4m7M1O6O0q4j8m0O8P4M5k33
5834i4J2P4k9J30m2p5n1P9N0l2J8q1q4K18m4q4%q6J23M2j9j05M6k8O6Pj2j42R6
5863d7K7K9K8l0r8rJ24j7k9l6K1j0J01l5kl2j6N1J24r9o6K4ON9J0n4q7L2M7O2
5893G8Rj57P8k2Q3N8m3j37L0O3L4o4Oo1M1P3O2j09p5J2L6R8l8q6j5M7RR5r4p9
5923f8O8l5O4O8j19m4K4P5%J3r8m2J12M8l7o1l6J8L1P9o3l8n9L1N8N7j43K7J2
5952e8N2J06o4q2o0J40M0l0J0j28K0Q2QPp6m7L1J13j6n0l3M6m9J45p4m1k8L0M7
5981D1O0m3p4J8L0O5J0q6j27J26R1q6K3m8o9Q0P9n4m0l3NJ35l1p3q5N8L3M8o0
6010gm8k8J02J2O6p1q5l3Q7O7M0p9j31M7J20l5l7nn4N8P0J7j47KLJ03mp1k3pK3
$$ y = [79, 113, 58, -51, 0, 62, 95, 38, -16, -65, 13, 129, 96, 91, -54, -93, -5, 27, 28, -26, -73, -32, 34, 94, 10, -8, -48, 20, 94, 139, -94, -82, -8, -37, 93, 51, -24, -75, 4, 54, 22, 40, -41, -125, 93, 49, -35, -35, -121, 2, 44, 25, -80, -34, -62, 4, 11, -1, -143, -47, -20, 9, 37, 7, -91, -100, 24, 7, -22, -58, -37, -47, 54, 19, 17, -15, -31, 20, 144, 45, -21, 3, 9, 68, 78, 24, -63, -31, 16, 78, 87, -70, 8, -14, 69, 127, 84, -53, -23, 40, 74, 10, 16, -45, -4, 69, 131, 22, -53, -41, -5, 93, 55, -31, -46, 1, 10, 105, 11, -68, 0, -35, 29, 97, -22, -66, -42, 33, 33, 46, -52, -94, 18, 66, 29, -32, -68, -50, -19, 60, -3, -41, -100, -69, -11, 46, -97, -70, -58, -6, 100, 36, -46, -106, 34, 74, 44, 54, -74, -54, 28, 36, 43, -33, -80, -49, 64, 48, -2, -35, 11, -38, 107, 33, -8, -36, -6, 41, 101, 58, -16, 2, 32, 97, 107, 21, -106, 20, 111, 25, 48, 0, -69, 11, 90, 36, -4, -37, -32, 103, 72, -1, -86, -28, 5, 53, -7, -55, -83, 19, 31, 97, 26, -59, -92, -5, 62, 102, 23, -108, -61, 59, 24, -13, -18, -72, -14, 56, 73, -74, -72, -69, 34, 30, -41, -64, -71, -48]
6041d8O4N0n7o5m2J44o4LK5j11O8R7k6l0r4L7O8M4j2o5OPR5K3q2r7J9N0P4K4j35
6072c0n1O0Q8O9m5j51j5J56Jk9r9k8L6J00Pl5n7k7P0mL6q3k7K4J9J23p5p5n0R5
6102CJ04q4q9k5NJ45J0l7j31PQ2N7j3r9j8M4M3K1n0l5o8Q1R9o2lj09N7Q3J7K8
6132F3r5k3N7k9N5n5l8O7L2mj2n9J9M5K4P1j29J3k0Q1K3j5p0qMQ9Kq9j4L0L6L5
6164H6j6j43NN9P1J1m3j23K5J05K2p8p1m9J07Q3Jl9l9m2Q4M6l8o0k8K1R2K1J2
6193H2j49J7O5J5k5r0oM6R2M5j01m1lL6J04q5l5l9j9N8O8l3m5n4J14lL5Kj02m
6223e5mJ15Nj62N7P8m6N6q2K4o0J16N0m1m1q7J17M4j9k4j03R3L6L2l9j00l9Q4
6251EJ7N1l0p6ON5L1K8j22j4M1L7L9q3pj2L0O4m8o8j3J8j8Q5%r2L5J1Q6Qj65j2
$$ y = [-48, 16, 66, 9, -56, -98, 46, -18, -15, 10, -101, -33, 64, 38, 8, -86, -49, 19, 63, 51, -14, -8, -1, 94, 117, 35, -62, -43, 7, 81, 105, -30, -81, -21, 67, 136, 91, -60, -75, 81, 82, 53, -46, -74, -38, 62, 69, 34, -23, -50, 20, 16, 52, -31, -58, -34, -15, 108, 33, -42, -92, 3, 107, 23, -66, -91, -86, 59, 69, 32, -99, -92, -10, 47, 34, -65, -83, -39, 4, 25, -25, -60, -128, -47, 52, -10, -13, -122, -65, 18, 35, 63, -32, -55, 2, -27, 28, -27, -65, 2, 34, 30, 18, -41, -22, 23, 47, 118, -11, 2, -18, 63, 86, 71, 1, -7, -3, 86, 88, -1, -15, 15, 51, 86, 70, -73, -68, -9, 62, 73, 30, -93, -68, 37, 59, -19, -90, -139, -32, 51, 52, 13, -26, -68, 16, 62, 24, -36, -64, -43, 49, 70, 82, -67, -50, 15, 30, 5, -85, -91, -45, 47, 92, -9, -50, -53, -17, 87, 2, -33, -72, -91, -33, 35, 2, -43, -97, 17, 14, 49, 51, -51, -55, -59, 56, 61, -101, -44, 34, -12, 44, -38, -14, -74, 42, 92, 51, 10, -77, 40, 84, 65, 41, -62, 31, 67, 99, 60, -40, -79, 5, 22, 73, 43, -33, -27, 28, 59, 87, -35, -49, -8, 29, 68, -15, -22, -34, -4, 60, 12, -56, -69, -51, -69, 16, 16, -76, -41, -30, 56, 64, -101, -113]
6283a13lJ70K7p3p2l1P2P8qo8p9%J58J1j23n9O7J9J22n8m7n4M8L2K1Mj04K9K5
6312iJ8L6r0K7k2J08J3m3J0o4L1P4K9j01ln1J00M7p5Qr6P5J6N2o5p5j0J52j1n7
6342B4j04O4J9M0M5j28K4n6J26m5k7nl0K7O2n3Mp3P3l5Q7l0o1k4K4N3O0o9q0L2
6372e6M7L2L0j57j7J02R7L4q0l0j29J69J7j2J0q9k9L5Q5k5n7PJ2P4%o6n9OQ3N
6402C9K8j07pR3Q3k6n5p1PR7k0k0j2q1R7K5k7Jnp5R9L8J4r4m1J4O2K6m4r8K3N7
6434B0O9l5q9q5J16M9n3N1q9l4N6J06m9o6o2J1R7O0j00k7m9M6J31L2j26n8KJ27
6462E1qKj34QP1O4K3j00n9K3J04l2m0N6j04Q9N0l8m5J4QLM0Rq7m2J32JL9r9j4
6493a5O3LN4k4l4j10J03NJ5n9m5k5J45J2j9j2q1jP8M2l5n0n4Q8J3J7j00OK9L9
$$ y = [-113, -116, 54, 81, 8, -64, -95, -23, 55, 47, -21, -100, -100, 58, 69, -54, -113, -46, -27, 95, 37, -10, -64, -16, 16, 37, 41, -63, -34, -9, 9, 45, -45, -18, -40, 68, 81, 38, 48, -16, 15, 89, 118, 17, 14, -37, 63, 110, 35, 43, -53, 22, 38, 90, 25, -50, -60, 92, 81, 24, -80, -16, 3, 43, 88, -40, -16, -72, 54, 9, -18, -23, -53, -26, 36, -17, -13, -86, -13, -48, 39, 9, -52, -76, -52, 1, 61, -8, -88, -56, -9, 23, 53, -104, -121, -19, 78, 112, 32, 2, -127, 42, 59, 47, 57, -32, -61, -26, 59, 34, -23, -16, -4, 70, 70, 4, -55, -49, 34, 39, 67, -40, -47, 46, 129, 103, 48, -23, -16, 81, 61, 41, 29, -52, 45, 70, 43, 44, 39, -36, 63, 101, 115, 21, -20, -6, 56, 82, 38, -60, -37, 20, 89, 54, -35, -120, -4, 45, -8, 43, -46, -80, -24, 82, 33, -33, -95, -84, 13, 73, -27, -54, -103, -57, 74, 106, -20, -78, -76, 51, 43, 45, -89, -81, -10, 54, 77, -23, -82, -59, 45, 13, -27, 29, -75, 14, 64, 26, -19, -5, 3, 6, 46, 55, -32, -74, 58, 59, 98, -1, -15, 48, 51, 105, 81, 47, -63, 40, 45, 60, 1, -44, -69, 76, 88, 69, 57, -24, -25, 53, 95, 60, 10, -44, 44, 57, 74, -26, -20, 9, 48]
6523D8m7N4j08K0O2KK0o1q8O8L0M4k7n9k5J01K3j0j04n1K0P9P9n8j13J65j21O6
6551IL2k0j27Q2M2M8k5m0n9N2R1ro9Pm8M3Q9j4r9j9M6R0l8l8k7qQ5M9j02m7rJ7
6583a6P4ok3q3K6L0N1k0k8k1K5P2K0r1p3K9M3R0p7p5M4k3Q1M9q1r4L9K7N8Lj38
6614h8L7R4K4K3q8n2p3J10K7J1k9o6K5M6J3j3m3m7M0OM6k6m4MN9O7p1j1oJ9O4
6645E8K5p2m6K1O7L0Nj31LP3j5J9l3l2kQ1J0J1j18L0O8M6J7n4j64N7Q7K4k0o9
6675b4qL6N2l6k3m1PJ01K5j2j03n4O5R3m4J2n9rM5L6m8m0KL4j5kK2j11N7M1P0
6706F9r5l9n2P3P0l2m1l2l6R3M4l8rn8N9N2l4j5m1K4NJ0M6j3o4M8M8Ol3o3L1j6
6738c3O7kjn6nO1O9Jp3n1J6R0k7j8r1J25p0N3K0j12k1O4J0N2Jj15N4J3J6m4j9
$$ y = [48, 1, 55, -53, -33, 29, 31, 51, -10, -98, -30, 0, 44, 17, -42, -67, 34, 57, 47, -57, -108, -88, -9, 70, 12, -101, 64, -57, 9, 41, 21, -106, -24, 18, 66, 41, 1, -58, -6, 85, 76, 7, 14, -34, 9, 98, 84, -15, -34, 12, 102, 64, 26, -1, -9, 76, 125, 23, -24, -33, -16, 58, 52, 29, -54, -28, 2, 53, 33, 5, -16, 9, 81, 101, 10, -63, -34, 9, 99, 22, -53, -9, -32, 49, 98, 17, -77, -38, -11, 47, 50, -88, -51, 43, 67, 90, 2, -50, -123, -13, 14, 25, -4, -70, -45, 1, 14, 1, -42, -89, -49, -43, 3, -23, -67, -63, -4, 63, -8, -19, -25, -6, 58, 83, 11, -35, -14, 53, 83, 88, -43, -40, 33, 18, 37, 4, -28, -30, 51, 61, 72, -46, -16, 52, 98, 115, 61, -103, -46, 41, 65, 45, -24, -32, 4, 56, 20, -3, -44, -37, 64, 89, 77, -26, -80, -15, 78, 34, 46, -13, -22, 23, 59, 11, -29, -27, 7, -8, -10, 12, -99, -42, -1, 69, -26, -65, -117, -44, 26, -6, -47, -79, -115, -22, 22, -16, -25, -83, -24, 28, -6, -21, -62, -38, -33, -23, 23, 10, -54, -6, 42, 48, 15, -48, -17, -33, 34, 32, 31, -25, -30, 31, 100, 101, 28, -23, -7, 83, 56, 38, -53, 72, 2, 55, 75, -37, -58, 6, 16, 68, 69, -46, 8, 21, 37, -7, -26]
6769b6LO3j1L5p0k2l8R2L8po4k5OM8J3l2j00Q7L1K8m3o0j0o8J53K4j01J8n6J26
6799C2L2l2n0j7m0R4l0Rj1m1kN1M3q1j6j0Q0M3n6l0QM1Q7p9j2j9J1M1N1j01m0
6830d4J4J16nl2l3p2N7O4M6j07%k1N6j2J00j34j5P0o8O9m3o5PN7k1N2k4m3n4J00
6860A5K3jk0o2M0P6m2k1o0PrO2Jm0Kj7Q0L7o8r5L6O3L4j0j8j17N7J52p2l9k4m0
6892g0P4j4Rjm6J8M3P0l5q5K3N0Kqr0NL0Q1Qo7j%R8on1N2j44J7N8K3K0n1n0N5
6926A7K5N9p8m9j1J08J4m2n6n4L7R1k4Kj09M1R7l8K7p6n6O3J6J1Jp0RL6M9m8K
6957fn4N3pK4k9k2l2M7J02p9m2j4P0j0N4K5r2p1R4KJ8o5q1P1Q0k3m3%nQR5L9j73
6990f6K6L8M8N1j43K4J2J2QN7q0l6O2P5n5L4j00K7QK5M6Mr7KM2M5J5j08NK8M8
$$ y = [-26, -23, 40, 29, 64, -6, -28, -66, 26, 64, 57, -7, -32, -26, 22, 35, 3, -97, -10, 21, 49, 6, -54, -64, -132, 21, 45, -56, -38, -94, 32, 64, 32, -18, -35, -75, 19, -11, -2, -13, -54, -56, -5, 38, -43, -59, -69, 11, 54, -2, -32, -24, 17, 104, 25, 13, -6, 5, 46, 97, -4, -44, -30, 86, 81, 49, 16, -56, 1, 65, 111, 4, 4, -17, 39, 27, 127, -7, -22, 48, -20, 49, 6, -59, -52, 5, -16, 36, 12, -31, -85, 15, 38, 37, 17, -45, -5, 71, 29, 8, -52, -45, -54, 8, 9, -31, -29, -46, 34, 71, 3, -92, -56, 7, 41, 31, 13, -104, -47, 105, 33, -6, -30, -70, 4, -10, -1, -2, -48, -30, 13, 83, 48, -37, -14, 36, 38, 30, -60, -55, -25, 56, 64, -3, -4, -4, 94, 88, 37, 89, -55, -38, 20, 43, 63, 12, -38, 17, 42, 101, 23, -26, -37, 71, 85, 43, -13, -67, -30, 61, 37, 39, -70, -29, 68, 30, 57, -19, -75, -12, 4, 15, 16, -54, -45, -9, 40, -8, -6, -60, -7, -14, 10, -19, -41, -73, -26, 76, -3, -45, -59, 11, 1, 55, 80, -12, -83, 11, 13, 31, -34, -115, -44, 36, 13, -30, -30, -35, -27, 68, 107, -66, -40, -2, 46, 97, -46, -22, -10, 2, 10, 67, -13, -49, 13, 88, 33, 67, -33, -6, 2, 27, 73, 77, -20, -18, 24, 69, 84, -24, -19, 9, 57]
7021E7Jn2K7o3O1M9m6o2PnL9K5k4q1L5N5l1N4r8rJ6N6m4rm6J3J7N0N4p2m2J6L8
7054a4R1r8On2M7N0O4j04q5R9MK7l1l8l4R8K4J4o6l3k8Q4P1q1l0K6p8J36pm0n5
7085c3K0Q0k7k0k3p9J45j2K1j1o4J8jjO4q1l2Q6k1j5j1m0M7mL2oj07M2K1L2J6
7116C6o3m4L2J2J12o4p4K0M0pM2j9j61P9O0J1K3j12L1n4P4N1p0L8m0K9K5L3o9
7145b9l8O3O0j0Ln6l7P6L4k0p9lKM5N6p7m3KQ5M3j3l8o6lP7K7Pq9J4Q0n2M1jp9
7179a8M9L5Pj7n0j4J0O5Mo1pl2L9M1o3J2J2PO0o7L6j14N9Q7r2N1o2m2O1mj1On1
7212f4K3J0J5P4q9k6olQ8p8J0l8O1M6m0%m1rK1J23j9j07J4K1O8J4j23j4R2N6K5
7243A04p6l7J6L0M2n9%m7k2J22K8n2q9j8O5QRk0J2Qk7J08q1rK2m9P2jn4l3jM2
$$ y = [57, 58, 6, 33, -30, 31, 80, 34, -28, -21, -26, 13, 38, 14, -67, -32, 23, -8, 46, -52, -61, -45, 11, -33, -42, -88, -75, -58, -8, 46, -26, -68, -52, -14, 77, -21, -15, -67, -20, 30, 94, -10, -95, 4, 8, 35, 4, -34, -68, 30, 54, 68, 2, -31, -59, 25, 96, 15, -15, 11, -67, 69, 62, 22, -33, -13, 67, 40, 20, -3, -82, 63, 51, 72, 61, -3, 15, 14, 13, 77, -4, -36, 50, 29, 14, 3, -37, 10, 6, 38, 32, -75, -33, -12, 20, 36, -27, -71, -39, -27, 85, 21, -53, -33, 7, 0, 42, 23, -138, -59, 1, 12, 35, -77, -46, -100, -26, 25, -45, -7, -47, -18, 7, 40, -29, -67, -4, 56, 46, 49, -7, -44, 32, 66, 46, -33, -36, -34, 11, 67, -10, -53, -51, 34, 77, 64, 26, -40, -43, 34, 61, 68, -21, -7, 73, 21, 62, 61, -18, 31, 66, 73, 56, 6, -8, 2, 67, 71, 10, 3, -29, 10, 51, -12, 0, 12, 19, 79, 12, 48, -66, -7, 80, -12, 39, -23, -65, -4, -8, -19, -13, -64, -41, -31, -16, 58, -31, -57, -63, -66, 22, -56, -46, -84, -23, 23, -17, -17, -58, -67, -46, 77, 58, -49, -35, -14, 54, 68, -55, -69, 23, 79, 104, 28, -9, 7, 37, 79, 20, 20, -27, -49, 73, 101, 49, -40, -58, 7, 15, 24, 4, 16, 24, -3, 105, 24, 15, 37, -12, 60, 59, 5, -28, -29, 13]
7275A3K6k6m5mO1N2Nm3o3MQ8J1n4o1k8Q8K5j0j2q6J6Q4J8p4l9l3M0L2K4k4J7n2
7307e0O1l4J8L9r3J9Q0J0p6ok1L8QN9j08j6R8J1j3Kp9M2J1O0k6Jq3L3N5pL4p7
7339a0K1m4O5K1q7nN4l2O8M3q7mK6m2Q3p0LL0J9l1M2k6l6NP0m1k2l1L4O3n6rl7
7372b3J1J8N6Kj03P4o9O5M2m9p8O6o3N8lm2J0n0N7l0J1Qo7R9M7o2qm4qL0O9j2
7404A2k4m7N8K0K6m6l9K0L4M1L4l3q1K8PL4k6j5j7M9J6Mlp7J9L7M1oq8k6L0N7
7436C9Nm2n1P7kk5L9p3K5K0J2L7n2n3jO0K9Pm7m4j7J09QKj27J5Q5L3l0o3j0kJ08
7469G1J1r7l9N2QL6q1Qq5J16j9Oj8qK1ok7N5j9p1K3M7Jnj7J4j7J22m8o1lJ1P5
7502E6pj8n2J2LL1MKm9mj5P5%l3l1N7lM3n1j6m7L5L9Kj4k8K7L1k5j6l5Ql7J17
$$ y = [13, 39, 13, -32, -36, 25, 77, 82, 39, -24, -20, 68, 79, 25, -36, -64, 24, 49, 39, 27, -59, -43, 41, 59, -15, -54, -87, -47, -15, 9, -15, 2, -50, 11, -23, -5, 34, -59, -40, 40, 50, -26, -32, -53, -15, -7, 52, -56, -72, 26, 37, 24, 26, -53, -11, 0, 60, 34, 35, -48, -15, 40, 33, 67, -10, 11, -33, 32, 53, -34, -39, 15, -17, 51, 94, 7, 3, 29, -13, 70, 0, 3, 33, 52, 21, 63, 37, 1, 6, 76, 35, 13, -18, 16, 79, 23, 14, -23, -12, 6, 62, 64, -39, 35, -34, 31, 73, 24, -54, 12, -51, 7, 4, -38, -28, -78, -21, -51, -40, -32, -99, 0, 47, -15, -23, -67, -75, -45, 24, 12, -12, -59, -1, 19, 45, -1, -40, -20, 14, 55, 89, 56, -25, 3, 10, 44, 18, 3, -14, 35, 51, 55, 52, -25, -6, 31, 72, 66, -22, -48, -18, 39, 44, 2, -49, 28, 26, 1, 40, -33, -8, 12, 24, 61, 9, -44, -45, 15, 44, 51, 4, -40, -57, 52, 60, 62, -65, -50, 35, 68, 38, -25, -35, -37, 71, 82, -15, -54, -2, 6, 42, -39, -31, -116, 0, -19, -13, -31, -39, -18, -24, -51, 4, -15, -86, -63, -16, -15, -20, -37, -23, -40, 82, 34, -27, -30, -19, 56, 49, 31, -21, -9, -6, 25, 29, 31, -18, -22, -37, 38, 38, 5, -26, 31, 28, 71, 20, 4, -43, -8, 31, 33, 19, -9, 18, 49, 24, 8, -27, -19, -56, 61]
7536F1k2p2pM5JL7k1j7k7mM3NNq6M1mP0j13R0r2M0J7J8m5k7L5L7J8k5l5pO4j5
7569HM9o8j21J02M0k0m8JKN7J6k2rl3M6J8m1PPl9L3P7L8j02RL4lM0oo7L5Ql5M8
7603F1n1k9K5P1o3J5j8J7m1J10j17N2j21L5Q3L5m1j15O3L9l6O9o6n8R1jQJ2j9
7632A0r6N9N8Op4Ql7N7J6K3ln4jL2P2p0m7J4K8L5k3p8J9M5M5Kp5k1M0J4M1np1
7665c1L1n6P5K0On2l6L6L0m3O8r2N3M1J2Nr2O3j4J1M8j17L0M1K3J4j03J6M0L6
7695F3pn6l9J07q3L9K2p4k4j0M7M9K9q4JK1QJ8J3m7m6M7L5l1M5o8K4k7P2nl5m1
7727c7L0M1l0j4m3M6j3O6l0k7k7L1Q1l9k1p4J5O1K8l6n7MP0j8K1p9J9OQ3m5R6
7758A08j17n6P4L4Jm9j0J6L7pK1n8j2j2L5O8j00L0KM6j8l0l0O5m9R3j5m2l9Mm2
$$ y = [61, 39, -33, -40, 5, 6, 43, 22, 5, -22, -26, 17, 22, 27, -59, -18, -22, 48, -65, 25, -67, -27, -10, 8, -37, -64, -29, 8, 26, 1, -34, -41, 23, 8, 57, -11, -132, -30, 10, -10, -58, -57, -55, 2, 18, -4, -13, -46, 0, 18, -23, -16, -9, -48, -15, 62, 100, -2, 7, 41, 38, 78, 72, 5, 40, 48, 13, 61, 10, -19, 6, 77, 14, 29, 11, 28, -13, 97, -20, 32, -89, -54, 29, 64, 23, -92, -29, 10, -26, 43, -23, -81, 10, 9, 17, 29, 10, -86, -27, 31, 37, -37, -29, -66, -9, 7, 30, 27, -27, -28, 4, 76, 6, -41, -27, 1, 36, 13, -65, -46, -1, 44, 46, -29, -50, -10, 4, 45, 40, -31, 0, -56, 19, 39, 45, -7, -43, -7, 23, -20, 48, -44, 9, 50, 62, 67, -25, 38, 24, 35, 83, -34, -4, 37, 60, 74, -29, -13, 27, 63, 56, 0, -39, 68, -15, 24, 46, -28, -52, -62, -15, 34, 63, -21, -20, 1, 9, 27, 40, -7, -53, -6, 29, -2, 43, -25, -1, -28, 44, 39, 4, -37, -7, 34, 4, -10, -53, -7, -20, 46, 16, -11, -38, -7, 74, 35, 14, -60, -45, 16, 44, 8, -49, -45, 25, 7, 28, -51, -32, -26, 57, 12, 108, -9, -65, 9, 43, 44, -5, -15, 1, 38, 31, 52, -6, -18, -30, 5, 73, -27, 3, 5, 51, 33, 3, -27, 38, -11, 82, 67, 25, -14, -10, -52]
7789e2J23k8o7j1J2R5m0j4o8K8pQ0J2j31K4PK3J4n3j4rM4P0r1R0j11M7N6jK2j32
7820h2M3J2O1k3K3k9l6kP4N9j15Nl5K6Mj8j4kN0JO8r6JK1L4k7K9K0p8M9M9p6L7
7853C3n4J9MM4rq6O4K6J1j5Ll8Oj0P0m0l8M0j9M2l6n2j5P4M6r6Q9j11JN2MJm8
7886c8j8j0P5jN5n0m6M7j2j2j6K1j8M%KM4o9J3L7K5jo8O7K3k2rk8j7MJ05n6j6
7919A5m6l0Q6j9l9L9LpK0O5m6r3N8M6o7Q9l1m1K9N7n0l2n3LM3R9j05k5j9N0J4
7950A3J9Mr3N1J1OQ8j13j7%N0m9O7l5j5J0K0N6n2j1l9RM0J7p1K1k2L7N8o7j6k8
7982e1L3N7k0kq4O1K2l0K5q9M0Q2m5L0q2OM0R4m7o1K6k9L8L2J0j21M7J4K9m0P6
8013F1j19N0K1lN6p6o2P5NK2P2r8j6j5L2M3m8jj9O0K5l8M5p0k3M1N7n4m1K5N4
$$ y = [-52, 71, 43, -24, -35, -23, 72, 32, 18, -50, -22, -29, 51, 63, -68, -44, -37, -14, 0, -53, -67, -76, -32, 38, -53, 37, -74, -27, 29, 28, 50, -82, -39, -27, 34, 11, 34, 5, -31, -33, 41, 100, -15, -10, -45, -19, -15, -33, -47, -49, 1, 2, 70, -26, -25, -4, 30, 3, 32, 52, -26, 23, 72, -4, 33, -21, -2, 2, 46, 37, -49, 15, 41, 52, 37, 40, 2, 8, -2, 68, 28, -10, 30, 11, 53, 17, -35, -50, 24, 70, -26, 63, -48, -47, 5, 9, 10, -38, -56, -66, 9, 8, 63, 13, -33, 14, 2, -10, -26, -5, -23, -19, -19, -17, 27, -42, -29, 8, 33, 32, -36, 31, 54, 32, 23, -5, -22, -18, 87, 31, 15, -31, -61, 25, 6, -33, 6, 9, 2, 22, 87, 41, -52, 6, 52, -15, 74, 43, 2, 31, 88, 38, 6, -47, -44, -1, 98, -7, -32, -51, -1, 13, 32, 36, -57, -6, 5, 11, 99, -14, -31, -31, 19, -30, 37, 2, -13, -3, 17, 73, 21, 10, -29, -20, 20, 37, -34, -13, -35, 2, 60, -7, -23, -51, -18, 39, 19, 17, -67, -6, 16, -14, 11, -78, -38, 44, -1, 29, -53, -47, -7, 87, 40, -21, 5, -24, 14, 46, 56, -65, -18, -4, 25, -15, 61, -58, -8, 13, 10, 66, -10, -72, 3, 8, 30, 102, 4, -12, -27, 5, 48, 0, -1, -20, 40, 65, 27, 72, 2, -21, 20, 77, 23, -18, 7, 61]
8044F1o7L6m6j4M5O0l3Pnn3OP1j28P3o4K9R0m6ln8J0J4K7o2J2JJ6N9K3Mj49O0
8076b4Q0k0j0k9p6N9O8l8k9J7m1O0K5Kk4m5kOM2k5KL5J8p8O0l4PK3JK2J7r0m0
8109f1J17l2J4n6OK3N5m3J0Pm8%N9r0J3QK5L9p6N6j7kJ5JM0q0L5l8K7lN2o5l9
8142d8M5K9Oq0K3N6k8O6l0l4j5nK3%r2L2J2L3Q5o3q4J1J07m7Mk7n4K9lP0m2L4
8174A3p3l0R8K7j8k3L0k0K5L1k1nm4%N3ko4
$$ y = [61, -6, 30, -16, -30, 15, 75, 42, 49, 44, -9, -3, 68, -60, 13, -51, -22, 68, 22, 19, -39, -29, -15, 12, -50, -38, -37, -21, 38, 61, 65, -84, -24, 56, 36, 26, -3, -79, -20, 48, 10, -19, -2, -43, 17, 42, 44, 20, -25, -27, -21, 21, -4, -2, 33, 51, -27, 33, -1, 6, 29, 30, 52, 69, -21, -61, 56, 24, 38, -18, -12, 11, 66, 23, 33, 40, -8, -8, 51, -39, -26, -18, 7, 46, -30, 26, 9, 7, 22, 23, 63, -17, 18, -20, 7, 4, 56, -9, -48, -3, 26, 32, -48, -25, 31, 3, 69, 39, 5, -10, -15, 8, 8, -84, -52, -40, -7, 78, 15, -69, -58, 49, 2, 6, -21, -75, -46, -49, 21, -21, 13, -60, -90, 8, 35, 17, -6, 24, 4, 29, 60, 39, 34, -10, -10, 43, 41, -23]
8191b3
$$ Imaginary data points
##PAGE= N=2
##DATA TABLE= (X++(I..I)), XYDATA
0@%%%%%%%%%%%%Qj6J6j6J6k4L2l9M7n6O4p2Q8j04J20j36J60j84K08k40K72l12
34a68L55l98M50n05N64o30P02p81Q66r60J063j175J298j433J578j737J916k110
52a105K324k565K833l131L469l858M307m830N451o204P141q340R936j2181J5593
67H840k1465L4295j11440P8245J58412k05087k4213J12476j2602p8667O5273K3246
79B7313l6065r667l097l097O5238j254r7961j0568J11024J0042p2820o423K2594
92d741j4606K3105K2288l3104r974K3439k5235J595O0858k8715p6828N2987O1615
105E2684m8998k5126K8952k2089l766N9437j3186n6272J9187J6705j8682K7586
117A6432K1006n7550j8190O4717L735n2379J5312K7012l8005j142O0971j6468
$$ y = [0, 0, 0, 0, 0, 0, 0, 0, 0, 0, 0, 0, 0, 8, -8, 8, -8, 8, -16, 16, -23, 24, -32, 32, -40, 48, -56, 64, -72, 88, -96, 112, -128, 144, -168, 187, -211, 239, -266, 298, -332, 370, -411, 455, -505, 558, -617, 681, -752, 826, -911, 1005, -1105, 1219, -1346, 1487, -1644, 1825, -2033, 2274, -2556, 2895, -3309, 3832, -4508, 5428, -6753, 8840, -12625, 21670, -89770, -11525, 146887, -58200, -82413, 30063, 17461, -61206, 4067, 27313, -8752, -18419, -21516, -24613, 40625, 39371, -58590, -69158, 41866, 51908, -20912, -27335, -4741, -19347, 3758, 26046, -7058, -17032, 6407, -18828, -17233, 43625, 14910, -61918, -8931, 52684, 3686, -21440, 7512, -14577, -18343, 41094, 27908, -28364, -9177, 7528, -11154, 16432, 37438, -20112, -38302, 26415, 30150, -22229, -6917, 20095, -17910, -19052, 41919, 25451]
129B5451p3538J9475O0303j4586k3548R797j2860r755K9434J0196k4389l698K594
142e124m596K2471R519l1628j6820J8871J9977O816q601l1533j1006L5441K1027
155B4814j8856j4991K359l266J49K2188O565k9327j1707K1344J2445n28n205k2125
169a6141q722L7374K1409l4310j9113J6030M640J784J0265n698j5797J041O882
182c56O236J1693j4678k8180J6977L6867q413l5115j980J9944L897J336M993j1044
196B177j7046N169K0854O763j0833j4551n783J5588J6070r373j6251l841P297
209c760J4597N883j6549j6517Q786J0669R97Q410o365k5262J025K9119P553k1454
223b868j0620O634P698O924j441r831q090J050J3550J3500p164k4153p037K1898
$$ y = [25451, -48087, -28612, 31691, 17105, -6443, 3354, -9506, -19261, 10173, 20369, -4020, -7718, -5124, -9720, 12751, 22270, -9358, -26178, -7307, 12670, 19486, 10885, -20648, -31654, 3787, 24814, 5958, -9033, -6674, -9940, -9791, 12397, 18962, -10365, -22072, -728, 11717, 11189, 5984, -16141, -24863, 12511, 33920, -390, -19503, -3473, 1167, 2951, 13216, 7518, -8279, -7238, -356, 5880, 17573, 2895, -25285, -8308, 28559, 20146, -14969, -16949, 2995, 6892, 8228, 13221, 2177, -14869, -9700, 11154, 17917, 7084, -7467, -13250, 2338, 18408, 9035, -7216, -11057, -3760, 10837, 16720, 171, -16346, -7560, 3109, 4106, 12516, 6151, -19111, -18086, 11033, 18586, -2868, -13488, -6854, 844, 7768, 6327, -3504, -11594, -10544, 3006, 16506, 9342, -14811, -21848, 50]
237E0J4579q834r112l826m213N320J6081P41j9539o375J1697J0167K058r585j2047
252a2838K448J5007O588p160p431o151K009J4470N059r933q087L99N116Q143L104
267A0743j3726j0566J3833J3638o414j1012k430J377M042J0802K243j4762j0187
280a2419O344J3907N491r416j1636K42J1728N407n632m347m328j259J0672R474
294A4228q863j6214J015J2546O261n52q667j0365K861J2229M425p550p136j545
308g327L241J0103K752j2201r631N640J2577M484o157j1108o441R756J3285p11
322H262q951p567j344O795J1243O1j4841n644R217P694J122n181q854k512J0561
337F1R999n233r194l613J665Q880P010n456j0826p02Q762M737r22n504o703M049
$$ y = [50, 14629, 5795, -3317, -7143, -11356, -6036, 10045, 10786, -8753, -15128, -3431, 6736, 8794, -791, -12838, -10390, 4617, 11205, 4045, -3386, -9537, -7528, 6942, 12001, 2068, -6019, -5620, -504, 7639, 10743, -2983, -13549, 284, 13922, 7508, -3504, -5934, -4557, -515, 10287, 12530, -2232, -12419, -6075, 7832, 13323, 3907, -7729, -7487, 4241, 9648, 4016, -331, -4659, -5918, 4754, 14228, 5365, -10849, -9834, 2712, 8973, 8421, -246, -10611, -7750, 4479, 8904, 1354, -5782, -7327, -4086, 6017, 8769, -3432, -13063, -7423, 5154, 9638, 3481, -7627, -14068, -4312, 8973, 8262, -689, -8256, -9600, -2805, 8438, 8499, -6342, -11986, -2769, 4925, 6047, 866, -7988, -10500, 61, 10060, 4827, -4367, -7980, -6315, 2565, 9575, 4119, -6707, -7409, 1353, 6090, 5168, -336, -7039, -2990]
353b990J0190J591q057o387Q73M848Q593K042j2226q471O257J0089K552m969p169
368c234l961O840R282k104q162m780K117Q324N514m798j1356k619R171P724J47
383H105p515q499Q60R570O760n757r209r21M529O711K079p684q287J824J0203
398B769N556m403r523o168O931J1615J386p989q770l00Q264P614j417r352n401
413i188M232Q557L948o379q551j377P141R747j009j0686o236M368R040L864m468
428C003q208k083P205N559o40m853o064K142Q419L704n221p975j633O737R209
443I301l95j0885o142M708R113L252o733o075J00K957N373L043n438r610J100
458f331J1056N693n284j1548l584J0934Q808l303p998m384J860N781M778j875
$$ y = [-2990, 7200, 8791, 734, -5653, -4780, 68, 8661, 10703, -1523, -9994, -3737, 6352, 8904, 3935, -3234, -7195, -355, 8927, 6823, -1339, -6119, -4002, 4322, 9836, 5038, -6318, -8937, 234, 7958, 8105, 590, -7909, -7049, 2521, 9281, 3524, -5685, -6606, -2077, 4634, 6713, -971, -9258, -7434, 2769, 8325, 3922, -5601, -11769, -4838, 6777, 8163, 174, -8596, -8896, -632, 6982, 5565, -3787, -9188, -4956, 3601, 7549, 1170, -7381, -8758, -1617, 8130, 7121, -3565, -9801, -5433, 3607, 7471, 3003, -5205, -7288, -83, 5476, 4836, -17, -6081, -3939, 4480, 8184, 2963, -5012, -6645, 92, 9301, 8906, -1979, -8121, -3413, 5700, 8952, 2219, -3856, -3756, -799, 4574, 7617, 2179, -7431, -6331, 4725, 10418, 5134, -6414, -9998, 936, 9744, 6441, -1557, -5941, -4081, 1700, 6478, 4603]
472D603o406n025J410J0830M942j1239r852L943J0616M832n778r380k843O561
486b786P178J667m500r027j530Q153O714j99q230p645M710J0942J724p742o039
501f610o67O085R206k215j0327l365M155O871L098m402o294j419M230O094K544
516F984p787q732O222J0126L04o213p423j8R464O109m534p209k143J892O070N398
532H510l683q132m396N812J2501q30j3907n000P999P608J182m389q545j931P775
547E74N849O66n300r430L36J0437N937m282r228m436O549J0302r19r131m933N54
563f455Q031Q234o010j0717r41N666N576L125m017r681k074Q076Q218j84j1148
578d301o827P943Q457J79n304o975o53Q312N431m175l854k472k487O730Q411m368
$$ y = [4603, -1803, -6828, -5418, 5412, 10354, -885, -10737, -6794, 3822, 8654, 2876, -6504, -9347, -2786, 4392, 6059, 1559, -7468, -8998, -845, 5869, 5670, -2560, -10205, -5495, 5447, 7171, -571, -6610, -7277, -1192, 8014, 5799, -4528, -7893, -3738, 3133, 6231, 1829, -4465, -5884, -1654, 4440, 6984, -803, -9535, -3313, 6813, 7117, 904, -6519, -6537, 2927, 9036, 4502, -2707, -4850, -2958, 3112, 8510, 4827, -3305, -7701, -1889, 10612, 9782, -4125, -9125, -1126, 6482, 7664, 3275, -5270, -7201, 574, 6423, 7089, 1789, -7641, -7305, 3132, 9069, 4787, -4441, -8877, -2328, 7974, 7055, -2076, -7009, -6455, 1576, 9810, 3800, -6917, -7858, -2192, 3384, 6509, 2492, -7189, -9263, -1187, 7031, 6847, -4301, -11128, -3185, 5272, 5451, 147, -6828, -7481, 831, 6262, 2087, -1767, -4239, -6726, 4, 8415, 4047]
594D047j0007k424Q265Q063l904r151r6N994J632Q25k57o654j941O324M698L18
610E732n524p196K518J0202K733p368n848N37O021N347l379n423j777L69O227
625C171N406n678q579P54N976M268J228o303p611L762P619K130l161p019k163
640f200O373N785j650n800m378J554P905L029o108m238j335J467P739L137p856
655e76p659K431Q170L952m484p634l22N364L259J727l681p688R24P807L669k328
671B931n701m861L401R291R29o794m395K41N553N098k967n667j817K552N301L006
687F101m685p263J006O305M324q14p263l995M641N539J656l046o080j611O153
702I68N479k133n110l681J387P370K678n031m862j515L693O653P21p263m907L265
$$ y = [4047, -5960, -8384, -119, 7944, 4040, -5111, -5207, 787, 2419, 3244, 2987, -3667, -5608, 716, 5414, 5732, 208, -6988, -4470, 5732, 8465, 1097, -4751, -4214, 1807, 7154, 3775, -1648, -3425, -3056, 3171, 8577, 2899, -5680, -4926, 1050, 5318, 6546, 243, -7368, -3606, 4013, 6143, 2982, -4037, -6200, 173, 5958, 4308, -1492, -5870, -4316, 3589, 6618, 510, -3728, -5063, -3596, 4143, 7280, -576, -8235, -5804, 2366, 6318, 1834, -5800, -6122, -758, 2501, 4228, 547, -7141, -6217, 1590, 5259, 2931, -2770, -7631, -4230, 5061, 5990, -804, -5199, -4958, 595, 5693, 2726, -2941, -4758, -2206, 3095, 6101, 1416, -5847, -4841, 1464, 5788, 4974, -2289, -6284, -1643, 3896, 5552, 2506, -3574, -5185, 968, 6447, 4314, -796, -4477, -3090, 4280, 6958, 1927, -2935, -4450, -757, 5896, 6617, -646, -5553, -2288]
718b288M844K529j787o116k012M132M702P33n139m784J718N544K571k493m763
733b609l089L572O327j19m488m066j77N328L821k734m951j224K326L842K406m132
749C3n537J427M591K827r33m807k930K504N224J366l700l997k67M457L384j785
765A857l580k390K105M741J029l132m096m34M509M269j453n629j810K940L416
780B342K271k572n174m43M392L818r98m247l017J528N384J994l425m414j183L919
796A75M425j91m167l934J105M658K516j841m729j837K962M499P33m842l407J408
812b467L642K817j547m643k382K788M901O28l548l967l29M520L203j625m183k274
828d466K395L901J396k951m420J36L825L257q49m145k462J369M430K254l308l784
$$ y = [-2288, 2556, 5085, 3298, -2818, -4830, -698, 4004, 4737, -402, -5186, -3468, 2076, 4647, 2154, -2609, -5698, -2126, 4201, 4082, -406, -4472, -4649, 679, 4500, 1766, -3185, -4409, -2083, 1759, 4165, 33, -5504, -4077, 514, 3341, 2408, -2399, -5329, -2825, 2399, 3765, 65, -3932, -4199, 258, 3642, 1857, -1723, -4113, -2008, 2733, 3762, 630, -3466, -3900, 609, 4878, 3425, -2204, -4014, -1074, 2342, 4613, 2041, -3133, -3576, 816, 4634, 3636, -611, -3628, -2100, 3284, 5278, 1853, -2561, -3744, 175, 4600, 4409, 242, -3692, -2587, 2071, 4587, 2746, -1983, -3820, -858, 3641, 4374, -468, -3875, -2467, 1175, 3992, 2445, -2198, -4580, -1792, 3109, 3737, 189, -3778, -4107, 413, 3616, 1991, -2192, -4466, -2071, 1830, 3226, 275, -4145, -4009, -184, 3073, 2224, -1921, -4383, -3014, 1416, 3670, 362, -3422]
844c422k01L120L132m90l121k732J380M169J430k263l814p78L707L427m50m057
860i63k618J874L595K084k110m126q98L141L883l01l994k746J097M443K414k702
876B073m305j287L432M041R5l444l920O93M281K772j413m602k124K876M133R04
892D205l996l551P01L407L194j311m227k494J970M735J149l234l838o43L806L357
908C230q00l998k867K143M010J457k602m123l10L351L438n12l981k472J153L958
924A075K459k643l951r59L091L821l40l720k705J473M004J421k015l630r92L329
940b82L148R0l212l336J117M067K519k240m177q90K874L920k8m032k435R77L686
957A766K597k043m099j566K993L871N80l278m224O02M551K522j434m389k276L048
$$ y = [-3422, -3623, -503, 2629, 2139, -982, -3714, -2334, 1835, 3265, 1002, -2812, -3590, 117, 3544, 3094, -963, -3581, -1707, 1888, 3972, 1862, -2264, -3162, -21, 3862, 3561, -433, -3179, -2082, 2361, 4775, 2073, -2232, -3519, -87, 3954, 4049, 605, -3315, -2622, 1659, 4431, 3018, -1584, -3708, -832, 3301, 4205, 209, -3342, -2641, 766, 3960, 2649, -1578, -4072, -2102, 2633, 3782, 548, -3290, -3933, -127, 3230, 2430, -1568, -4435, -2292, 1718, 3175, 573, -3550, -3860, -509, 2929, 2417, -1564, -4036, -2883, 1075, 3534, 891, -3060, -4019, -928, 2893, 2553, -1167, -3872, -2399, 1605, 3026, 1011, -2619, -3611, -282, 2866, 2956, -256, -3592, -2475, 1592, 4111, 1871, -2306, -3196, -322, 3598, 3570, -462, -2897, -1920, 1766, 4363, 2320, -1779, -3345, -352, 3519, 4099, 821, -3403, -2801, 1750, 4272, 2838, -1551, -3827, -779]
973g79M245K83l432l212J43L436L506j530m243k059J548M690J668l763m129K17
989c411L824K931j025m035k460K595L425Q35j904m036p41L750L342o34m094k917
1005d555J837M785J454l669k986l64K619M125q79m193j941J562L550K259k349
1020A255m665n93M097L032R2l984l677K282M400J577k115m174j422L755M225r54
1036C131l661k281K66M145L192k649m214j323K587M616P83m508l722J453L769
1051A584K399r25m775j926L429K978P39k124m225n55M534L172j904l821k194J931
1067a683M701N29l548k398n62K734L674j189m028j547J690K908J931k540m551
1082c879P87L588J703k49l439k712K479L560M06k046k837r70L435L298k018k765
$$ y = [-779, 3466, 3749, 317, -2895, -2752, 684, 4190, 2660, -1583, -3642, -2094, 2596, 4264, 501, -3628, -3411, 413, 3344, 2319, -1716, -4176, -1581, 1844, 2679, 775, -3261, -4002, -252, 3090, 2456, -1638, -4555, -2718, 2067, 3521, -148, -3134, -3498, -879, 3246, 2367, -1826, -3767, -2205, 1345, 3604, 1255, -3410, -4003, 94, 3126, 3218, -766, -4443, -2161, 2239, 3816, 1701, -2473, -3895, -140, 4085, 3131, -530, -2811, -2545, 1600, 4792, 2143, -2071, -3394, -807, 3809, 4592, 84, -3638, -2185, 1584, 3983, 3058, -1717, -3643, -214, 2764, 3503, 1379, -2846, -3401, 1133, 4305, 2401, -1420, -3614, -1683, 3018, 3547, -1, -2399, -2961, -227, 3447, 2258, -1770, -3317, -1627, 1281, 3212, 672, -3879, -3092, 496, 2199, 1950, -1489, -4201, -1722, 1838, 2244, 198, -2639, -3609, -174, 3124, 1106, -1659]
1098a659j123M80L777J816l275l171M15K771K744k57m081k221K813K707J059j609
1114A186l983p5L671K030m86k603k989J217M847J131l414k486p16K763M076j162
1130C007l995j509J048L155K386k104m463j93K996K486O96l516l726K155L676
1145B099J131j326l646j729K952L743n01k830k539l17M114K533k655k779j188
1160b938J367L822R71l792k819J097K535K338l94m504j676L056K533P38k084l489
1176c239P6L507K149j185k634k275J523M245M27k833k139o70K827L187j119l283
1192a436j392J239K678K022k066l788M39K519J912M40l010k486J830K877Q16j321
1208A273k576j268K706K936q80k290j756J91L300J564k067k376o38J687K609L42
$$ y = [-1659, -2782, -2302, 1475, 3291, 16, -3155, -2740, 31, 2775, 2518, -1563, -3784, -971, 1736, 2795, 1186, -2797, -2872, 799, 2829, 2343, -260, -3249, -2032, 2815, 3946, 532, -1954, -2670, 93, 4169, 3007, -988, -2497, -1449, 1706, 4092, 1988, -2475, -2668, 328, 2814, 3510, -6, -3732, -1577, 2099, 3230, 1904, -1742, -3471, -519, 3224, 2723, -107, -2646, -2963, 1151, 3684, 1029, -1750, -2938, -1571, 2251, 3222, -570, -3389, -2292, 243, 2581, 2187, -2317, -3993, -937, 1596, 2334, 250, -3239, -3163, 344, 2493, 1308, -1326, -3601, -2078, 2167, 2594, -239, -2378, -3048, -221, 2966, 1847, -1436, -2828, -1589, 1089, 3111, 1045, -2743, -2304, 215, 2127, 2567, -443, -2929, -1099, 1778, 2594, 1273, -1303, -2571, 135, 3071, 2191, -99, -1855, -1664, 1636, 3200, 1133, -1243, -1881, -194, 2415, 2757]
1224B757k948k003J224J960J831j018l455n73K290J860K26j842k447K49K994J204
1240B309j422j862j387J441K939k03k195j683J48K217J813j176k702o29J512J932
1256A052Q80k253k355R35J941J442o01k574j260J814K466O6j663k017m25K863
1272C11J885j239k103j269J048K780Q53k014k303K16J979J951j66k832j369J346
1288i26K231J227j664k533k40K165K099k74k156j920P58K835Q96j313k094j024
1304a933J929K380o0k258j821N58K173J756j193k732o32J426K184N42k116k011
1320a808J49K157J609p66k195j376J332K355K89j604j997m4K181J339o19k017
1336a015j193J068K057P80j730j928R2J574J838m82k267j025J017K119O53j460
$$ y = [2757, -191, -2194, -970, 990, 2821, 1803, -1652, -2225, 65, 1925, 2151, 309, -2138, -1889, 1105, 2309, 887, -975, -2362, -921, 2018, 1815, -380, -2063, -1915, 302, 2115, 939, -1763, -2392, -880, 1052, 1932, -321, -2676, -1741, 200, 1642, 1041, -1533, -2793, -979, 1487, 1553, -110, -2127, -2552, 311, 2196, 957, -1146, -2415, -1367, 1413, 2266, 252, -2051, -1835, 144, 2095, 1929, -903, -2272, -926, 1305, 2532, 868, -1665, -1905, 260, 2359, 2085, -71, -1991, -1233, 1602, 2498, 1185, -909, -1933, -4, 2376, 2316, 58, -1763, -1205, 968, 2724, 1531, -1201, -1833, -407, 1777, 2319, 203, -1808, -1659, 498, 2107, 1341, -854, -2230, -898, 1457, 1746, 142, -1855, -1899, 282, 1621, 1002, -1015, -2208, -1140, 917, 1697, -33, -1961, -1869, -295, 1543, 1061, -1206, -2231, -1214, 905, 1558, 98]
1352I8j938l38K026J766m32j916j599R73K263Q72j157k204m00J802J794R9k109
1369d00j493P49K100J286j397k049m81J539K111qj910j728N20K231J269j036k083
1386g80r71J751J993J02j772j919M05K054J468p68k453r19J336K124O00j861j929
1403a539r0K040J724p46k075j208R89K157O22j476k069k34K014J486l98k095j377
1420b275J208J956P94j499k084n3J666J858m36k179j190Q39K189R63j575k007
1436a825m53K040J903l06k064j661R16K294J044j232k269n22J911J756K10j946
1452b04j808N53K252J449j319k135o09J422K307J02k031j595L10K230J391j030
1468A285k206r02J653K004L42j797k078M90K153J334p96k366r58J417K219L67
$$ y = [98, -1840, -2178, -152, 1614, 1182, -734, -2333, -1360, 903, 1775, 618, -1586, -1986, -184, 1610, 1709, -400, -1893, -1144, 956, 2242, 845, -1204, -1685, -146, 1965, 1957, 47, -1681, -1161, 1070, 2339, 1303, -780, -1751, 0, 1993, 2095, 323, -1596, -1191, 863, 2331, 1563, -890, -1809, -473, 1651, 2251, 390, -1539, -1629, 411, 2135, 1389, -686, -1894, -905, 1252, 1874, 398, -1671, -1905, 109, 1595, 1197, -898, -2275, -1067, 889, 1683, 184, -1900, -1953, -287, 1571, 1135, -1044, -2234, -1395, 794, 1757, 182, -1825, -2278, -238, 1665, 1359, -705, -2366, -1450, 844, 1888, 656, -1613, -2135, -224, 1532, 1742, -204, -2012, -1459, 793, 2242, 923, -1212, -1821, -399, 1908, 2010, -21, -1616, -1306, 924, 2315, 1285, -921, -1823, -170, 1834, 2176, 379, -1699, -1209, 944, 2278, 1482, -884, -1842, -425, 1794, 2161]
1484B161j874j832RK046J824j035k150j035J013K292O18j825k015Q0J970J443
1500A690m18k203j397J411J955O06j375k169j64K002J770n93k148j260Q31K598
1516A136P97j994j818l10J904K231n42k359j462J035K191J209j268k659l26K142
1532i3J680J61k063j986R50K364R98j137k097p71J603K373k23j883j376L7K367
1549I04J490j364j995n32J300J937M73k105j843Q15J862J089m87k452q70J690
1565h8J717K45j433j970Q6K335J190j103j638r93R12K392J81j969j324Q7J673
1582C00J499q18k199n82J316J414O69j559k201P38J898Q88n56j944j174J540K087
1599A316n2j580j474j81K136J748j259j913p37Q18K355O80k026j829L99J676J527
$$ y = [2161, 287, -1545, -1536, 510, 2334, 1299, -851, -1886, -873, 1419, 2037, 212, -1803, -1723, 247, 1690, 1272, -931, -2328, -917, 1038, 1644, 269, -1900, -2064, -62, 1708, 1115, -1033, -2293, -1462, 1136, 1933, -61, -1879, -2189, -285, 1946, 1404, -955, -2417, -1382, 809, 2018, 750, -1909, -2235, -93, 1587, 1748, -315, -2301, -1351, 1013, 2011, 874, -1223, -1994, -391, 1982, 1759, -124, -1500, -1463, 904, 2394, 1030, -965, -1497, -197, 1740, 2213, 108, -1735, -920, 942, 2031, 1544, -908, -1778, -88, 1629, 1874, 441, -1529, -1443, 892, 2082, 979, -659, -1652, -740, 1652, 1833, -136, -1460, -1373, 300, 1799, 981, -1218, -1800, -484, 930, 1599, 40, -2161, -1423, 475, 1363, 807, -1137, -2311, -771, 1316, 1264, -316, -1790, -1971, 165, 1913, 654, -1259, -1996, -1178, 1177, 1857, -169, -1998, -1599, 77, 1604]
1616A604m6k606j259J762J582O21r50k383j77K288J460o17j593j498P04K704N31
1633B127j781j354n52J485K314n06k260r76P23J809J271j174k592N3J616J390
1649A593M81j940k125J046J977P69o38j937j179J568K223m78j289j321l45K110
1665E15J441j266j662n20P24J825N84j830j605O57J189J123j09k274p22J476J185
1682G31L72j073j776P9K038Q96q45j088j189P86K203Q5j373j049l48J300J706
1699A455n17j915m16Q03J111R07j032j814L21J287Q67J28j528j172J052J538J31
1716A206p02j205n19J628J231q27r91p92L14J781O13j392j262J30R44J294Q3j921
1734c87q76R51J031Q11o89j864j96J511J004k21j066j262K85J853L93q94r70q50
$$ y = [1604, 1558, -1048, -2307, -545, 1037, 1658, 708, -1675, -1852, 436, 1896, 1279, -314, -1812, -1108, 1596, 2127, 346, -1008, -1560, -75, 2239, 1733, -527, -1503, -780, 1029, 2300, 1126, -1466, -1413, 203, 1593, 2074, 134, -1991, -945, 1032, 1801, 1163, -774, -1953, -385, 1838, 1360, 71, -1250, -1595, 515, 1956, 690, -972, -1492, -768, 1057, 1641, -189, -1794, -1137, 52, 1175, 1066, -1208, -1930, -454, 731, 1103, 30, -1746, -1667, 371, 1267, 422, -666, -1855, -1069, 1134, 1219, -154, -1203, -1551, -251, 1455, 938, -977, -1393, -590, 521, 1428, 396, -1418, -1097, 190, 1057, 1185, -343, -1515, -463, 1075, 1206, 504, -701, -1220, 408, 1639, 812, -179, -971, -657, 1124, 1737, 345, -917, -787, 157, 1451, 1534, -387, -1263, -312, 719, 1530, 841, -1023, -1219, 292, 1296, 1075, 9, -1253, -968, 885, 1278, 384, -586, -1436]
1752a436J129J582l11j350q23K98J117J064q11j686m6Q67J044M93j431j301N67
1769a034J298P58m46j469q42J135J574j32r17j267j54J722J013p18j195p46O15
1786h05J559N17j173j246J31Q69J338r9j589p05O67J190O72p71j359k05J263R15
1804A169k09q72j167M36J525L87p41j145l71R89J313q3j297q63L52J077J006p94
1822G12j334k60P32J112K32j087j082K35J164O80m00j162p34R51J020Q2p65j143
1840a047Q4J149P66n02j148m54O04J144K66j087r55J73R27J028m23j316n34O83
1858f42J210L16q41j153k03J336Q60k44j095r24N85J311M64p21j171j81R70J071
1876I48j03j160o94L60J102P17p03j107k18Q18J162k11q90r14M17J201M69n72
$$ y = [-1436, -307, 1275, 964, -386, -1209, -911, 206, 1270, 459, -1227, -1273, -406, 638, 1131, -300, -1601, -1034, 264, 1022, 576, -893, -1735, -600, 974, 842, -75, -1342, -1496, 226, 1239, 521, -674, -1420, -805, 754, 1271, 98, -1148, -1017, -148, 1190, 1091, -498, -1203, -536, 654, 1326, 555, -804, -1009, 254, 1169, 960, 88, -1079, -643, 882, 1269, 528, -617, -988, 1, 1314, 1231, -66, -929, -577, 500, 1506, 712, -622, -882, -150, 962, 1194, 107, -975, -740, 424, 1104, 704, -458, -1192, -241, 779, 861, 96, -1047, -963, 186, 952, 450, -698, -1152, -548, 596, 862, -225, -1180, -1007, -80, 948, 525, -791, -1325, -642, 568, 884, 43, -1110, -1313, 23, 883, 639, -456, -1380, -795, 516, 980, 259, -912, -1093, -123, 948, 845, -315, -1009, -649, 453, 1170, 467, -640, -858, -40, 1122, 911, 21, -893, -476, 725, 1194, 622]
1894F22j112m27R93J018O4j108r04L12J096P65n95j215l67O93J186J47j100r46
1912h78L1J222Q02n15j154o09P87J097K39q93j139N2J130P53l41j199o12P13J140
1931F26L26j018j051M1J063J012m55j181o14N70J277L30q78j148j80J195J011
1948I26k84j106r65O67J225N49o45j295k13R75J156l4j231p86K87J242O92o79
1966D81j114l01Q54J135k7j040q99L48J244M78n47j185l66J027J001O3j076j043
1984i67M81J109O75n84j229m13P86J300k2j106r19J37J170R03o58j208m39P06
2002b78J153K09j048j073K19J083O92l55j273n41Q45J096J50r48j040O2J142R63
2020A058o12j133n81N90J364K62j131r58o6J212R61l34j290p59P40J153N12p95
$$ y = [622, -490, -917, 76, 1094, 1158, 50, -854, -542, 554, 1319, 724, -491, -858, -165, 1021, 1168, 68, -878, -847, 375, 1177, 662, -492, -1101, -314, 783, 1022, 129, -1010, -958, 172, 925, 584, -615, -1227, -514, 626, 952, -66, -1117, -1076, -13, 999, 544, -637, -1251, -681, 596, 926, 48, -1100, -1280, -85, 926, 642, -464, -1429, -762, 463, 1012, 367, -928, -1141, -166, 990, 956, -275, -1061, -774, 468, 1160, 481, -633, -934, -80, 1055, 1028, -12, -911, -563, 681, 1159, 612, -573, -939, 88, 1089, 1152, 76, -967, -486, 623, 1298, 714, -515, -928, -142, 1158, 1136, 30, -889, -752, 418, 1321, 663, -545, -984, -278, 875, 1084, 36, -1037, -818, 265, 957, 602, -671, -1212, -367, 729, 879, -69, -1109, -1047, 95, 1058, 446, -687, -1268, -678, 686, 948, -183, -1141, -1207, 5, 966, 632, -658, -1417, -677, 476, 988, 193]
2038A93j249p2J088R23n1j175q95O57J208M16q15q56l46R20J200l33j072n89K66
2057e82J252N94q69j057j18Q77R70M8j229q74O74J003M51m83j294k53J057R09
2075A076j15r92r15K72J368N75q80r06m68P69J292j28j205o58K33R65P57o04j357
2094i21j36R46P68J66j001j102N32J153M45m73j091n95R33J268k40r82p50l0J351
2113B41Q84q55j061m11O93J259K66j123j165M19R51Q33k01j417n91R51R49L45
2131I67p28j190l9J352P33m83q36p54M83J449J61r42p81j79R33J108l49j279m11
2150g85N29Q56O37p25j277J42Q37O76R7j023r30O20J001K44m05q83n64R68R63
2169I78l91p24n35j2J100O03q55q12k9M69P97J48j084o23N82N08N27k74j200j53
$$ y = [193, -1056, -1128, -40, 883, 832, -343, -1238, -581, 627, 1043, 228, -628, -974, -54, 1146, 813, -259, -848, -582, 670, 1264, 395, -662, -780, 97, 1067, 1115, -114, -988, -314, 689, 1140, 657, -637, -890, 167, 1076, 961, -31, -946, -674, 694, 1269, 389, -517, -985, -216, 1076, 948, -257, -915, -682, 283, 1040, 436, -921, -1057, -111, 657, 823, -178, -1280, -748, 405, 850, 377, -714, -1309, -376, 892, 652, -330, -1080, -1110, 241, 1125, 270, -791, -1202, -509, 750, 1016, -107, -1272, -853, 98, 931, 730, -687, -1278, -327, 622, 967, 239, -951, -990, 362, 1095, 612, -224, -978, -495, 954, 1115, 173, -608, -787, 146, 1254, 905, -374, -785, -256, 600, 1237, 512, -765, -623, 214, 890, 987, -36, -966, -346, 655, 899, 494, -389, -953, 15, 978, 587, -137, -672, -684, 416, 1019, 164, -648, -677, -208, 589, 737, -347, -970, -388, 120, 647, 373, -827, -980]
2189i80R25N36j50n03q35K41J177J94o03n14n32O84J112k49q46m44J63P24P21
2208H21n26j042L1N50N96L56q46q29M91P55L20k05q23m97P99Q19j56n23o39q8
2228f36J101N69o78o43k94L79J011K15r54p12K80O00P00j60j199k90O45O92K68
2247H94n49j014j9R55N20k65o00p58L60J124R4n82o44l04O65R25k84q93l41K11
2267e05O76O55o82r76M8N74O87R9q73o74M05P90K75j94q16n05Q03P56j57m90o57
2288g61LQ73N31m14o16k66L18P69K21q07m25J97L81O31j67p95k19L96N28K85m23
2309B40p45K2P61L57j51n47n78N42P26K9m39n92k5N54O66j97q02k87K67O36M19
2330H56o21p00N9M88N18m0o52n81M56O65J09l20o11l08P75M33j38m77n41J35P14
$$ y = [-980, -55, 481, 331, -172, -1007, -766, 411, 605, 2, -512, -1044, -360, 752, 503, -343, -787, -624, 100, 821, 295, -747, -716, -166, 430, 786, -60, -889, -398, 357, 677, 472, -351, -848, -49, 770, 614, 91, -548, -636, 465, 1034, 356, -287, -581, -202, 809, 1024, 70, -642, -362, 238, 938, 778, -421, -711, -66, 626, 894, 345, -669, -688, 267, 787, 522, -78, -836, -476, 648, 742, 160, -484, -788, -123, 802, 518, -375, -716, -505, 171, 826, 144, -832, -784, -210, 477, 576, -297, -971, -566, 224, 499, 305, -511, -1016, -213, 543, 386, -104, -761, -758, 115, 646, 232, -384, -650, -332, 437, 658, -149, -574, -377, 4, 635, 468, -327, -546, -150, 378, 663, 240, -505, -483, 278, 635, 484, -63, -641, -99, 627, 656, 217, -375, -400, 154, 820, 623, -179, -466, -199, 437, 856, 235, -465, -406, 82, 600, 560, -92, -673, -217, 448, 557, 237, -374, -682, 93, 526, 388, -89, -630, -495, 219]
2351B19L23m67n79r7L58P28o1p40m27J87N71M74l06p06l26N44P04L9n04o86Q2
2372f70P98L98k21o51m21M98O96J19n62n13m0O52O00l37o40k64K74P18K46n68
2392A12n42n1O48M64j17o55m02M14O85J38m12p11m3O73N00j10o84m75K96P36L36
2413H00n17o68o6M38P36j46o26n23J67P31L52m19p05k29N94N93K7o56o05K83O36
2434A97M38l97p72j79N68N86O7p23m78K3P82N29m55o64l42N28P25P6n93o88J08
2455f64P32M40k03p56l47M54O84K22n06p05L1O38N99k46o88k87L10P85J88n69
2475A12o04k1P66M50j98o18n36M05P84K14m63q21P2O54N62k02p18m10M09O68L17
2496H22n44p26o4N87O97j90p08m16J73Q63K22m58o86j47N47O27q3o53n92L22P10
$$ y = [219, 542, 75, -504, -601, -243, 485, 424, -316, -743, -556, 15, 489, 183, -523, -849, -305, 399, 438, -66, -752, -670, 128, 526, 305, -346, -767, -269, 427, 546, -16, -529, -569, 83, 683, 346, -294, -558, -284, 434, 680, 112, -430, -481, 167, 631, 514, -141, -543, -129, 556, 694, 282, -429, -472, 201, 701, 591, -93, -568, -272, 464, 800, 283, -385, -451, -13, 723, 577, -49, -572, -405, 326, 678, 259, -446, -675, -81, 512, 539, -117, -722, -439, 197, 635, 238, -534, -713, -145, 441, 508, -215, -693, -670, 112, 641, 186, -478, -820, -292, 433, 509, -84, -772, -664, 68, 508, 305, -451, -798, -344, 340, 562, 56, -649, -618, 20, 619, 373, -315, -602, -292, 493, 681, 112, -492, -513, 253, 703, 505, -113, -649, -244, 540, 754, 291, -530, -458, 196, 758, 556, -162, -572, -163, 505, 822, 278, -448, -512, 75, 772, 582, -126, -542, -369, 494, 716, 258, -428, -575, -28, 599, 516, -137, -729, -407, 303]
2517C03L00m03q07p8N94O57q5p11n70K68O78M65n47o42k07N16Q02j04o34n73J63
2538f15P96M11l42q09k77O01O29J95o62p30K41P63M10k24p67l24M92P85M5o01
2558A7n56qQ07N09m12o21l33M76P44J38o48o94K03O76M72j88q18l96N40O39K04
2579G51n47o95rP16N70k85o84m34L39Q51J81o48n76l8N54O28k45o68m66M05N80
2600B80L78n55q05J18O48M36k6p53n64M55P06K36n06o44k07P09P28l56n55m96
2620g73J66Q62L27n54o28n2N07O08P9p30n57L60N84L61k84q16j06O44M76N9n94
2641f1n31R0R10K41m55m75l06M42Q47j22o23l65Q4O28M88l19q15j14N03M50K70
2662G67o06o99L15N00L09j46o41l84N23N94m6l90m78j72Q30L26m27m50k30K79
$$ y = [303, 603, 200, -607, -685, -91, 566, 481, -230, -800, -532, 146, 611, 64, -578, -785, -269, 533, 429, -205, -778, -615, 181, 592, 250, -559, -836, -235, 394, 589, -73, -803, -562, 201, 611, 387, -380, -704, -212, 573, 618, 17, -539, -547, 260, 769, 357, -264, -597, -121, 623, 761, 113, -581, -378, 298, 770, 582, -236, -632, -92, 547, 751, 204, -491, -500, 216, 786, 501, -183, -617, -278, 573, 754, 106, -470, -508, 46, 674, 429, -239, -705, -300, 280, 658, 103, -702, -584, 64, 500, 474, -279, -843, -388, 318, 554, 48, -596, -803, -94, 634, 278, -277, -773, -607, 255, 582, 28, -600, -652, -145, 463, 542, -188, -745, -385, 199, 560, 276, -540, -646, -2, 474, 533, -61, -592, -502, 408, 649, 194, -281, -587, -145, 702, 580, -43, -408, -324, 304, 792, 473, -342, -456, 47, 497, 767, 161, -538, -223, 277, 586, 440, -201, -585, -62, 532, 486, 96, -382, -554, 276, 602, 175, -275, -505, -226]
2682b26O79R7o90m16J48M69M42j36q77j50N26L98K03m79p28J74P43K33j71n34
2702b95m44L84Q09n8n29l64j45N47O92l36o43j63K47M93M16m93p83K50M43M57
2722D85J0p37m29M86N81J13l15n90k16P53N51k71m93l94J20Q35L43o48n15m2K80
2743i3P45M9q42k96K14M36M64k03q70j20N57M28J08l91p15J52P08J95l04l34m97
2764f09L54P21m5l78m53j17N20N47k63o81p9J42M65M27o01n41J19M13L47Rn31
2785b34m51L43N31M2j71n26k13P16L29j56l72l37R8O10J96m10l56%K22N33m0o18
2807b64j23K20L04L30k66n40K1L76L17M1l49n04K61N46M7j81l69l16M98N14j14
2828D49m38l69J69M43L88l85n69L0K57L89K43n88m29J41M60K68j38m97l53M59
$$ y = [-226, 453, 550, -140, -556, -408, 61, 503, 367, -510, -660, -134, 264, 467, -12, -740, -566, 177, 410, 239, -295, -739, -355, 454, 396, -133, -497, -642, -95, 597, 261, -382, -545, -298, 195, 611, 118, -665, -415, 28, 485, 495, -242, -671, -185, 396, 509, 194, -396, -612, 141, 692, 421, -72, -466, -346, 489, 832, 184, -331, -373, -93, 652, 701, -141, -437, -223, 213, 677, 474, -396, -516, 41, 469, 577, 186, -529, -377, 331, 526, 222, -112, -609, -255, 466, 421, 43, -410, -527, -7, 540, 277, -404, -483, -341, 124, 551, -50, -591, -472, -59, 288, 297, -234, -685, -342, 189, 231, 60, -466, -679, 37, 366, 210, -162, -499, -401, 209, 405, -5, -361, -361, -139, 394, 354, -264, -387, -167, 137, 467, 201, -339, -318, 58, 375, 416, 67, -437, -176, 370, 417, 236, -133, -449, 49, 563, 449, 11, -358, -189, 254, 642, 257, -312, -282, -25, 364, 607, 19, -410, -269, 191, 459, 321, -176, -529, -70]
2848g0L80Kk62n00j6O56K36k56l85l00J80N71K05n31m30K4L65N48j44n92k50K31
2870c38M26L13l41n77r3N41L96m4m25n10L01N56J15k24m58j81M55M75J2n28l19
2891d48R6N21L74l75m71q4L33M84L8m63m33J36N09K98j10n98k92M85M18J01l44
2912A75n81P3N39M22k63n17k33K97N33J10m60m00K6L62M71j96n36k45K97M95O2
2933D31l85m67LN15L37j58n44l00L13N18J71m68m24p8N02M92j53n29k77J39N38
2954A76K10l60n19j09M91M88n0n16m27K41N02K66k63o20n3L91N19K3o03k56Q4
2975c85N35L91l38n14j47L26N93K0n14m15J55N81K87k63n90j55M25M76J08m95
2995H1m91J07N39L86k30o07k04L69N04J40n36l96JN37M07k78m95k99L10N74P4
$$ y = [-70, 310, 312, 50, -450, -466, 190, 426, 170, -215, -515, -335, 236, 441, -90, -520, -496, -131, 417, 273, -319, -569, -338, 88, 401, 60, -517, -610, -69, 327, 283, -142, -652, -351, 205, 320, 96, -362, -543, -88, 387, 399, -129, -448, -352, 169, 543, 168, -303, -387, -54, 430, 468, 5, -428, -292, 217, 515, 405, -193, -485, 0, 418, 519, 175, -406, -333, 206, 628, 365, -152, -385, -88, 445, 555, 95, -305, -279, 83, 554, 358, -178, -423, -126, 369, 431, 46, -421, -418, 97, 434, 276, -268, -568, -255, 263, 434, -34, -458, -536, -34, 458, 305, -224, -501, -362, 176, 386, 26, -493, -602, -111, 377, 327, -189, -616, -375, 127, 393, 130, -490, -543, -152, 367, 390, -213, -469, -385, 150, 541, 203, -311, -458, -132, 461, 481, -33, -448, -293, 288, 575, 312, -278, -433, -8, 468, 576, 81, -410, -303, 236, 622, 392, -215, -419, -50, 454, 594, 58, -338, -337, 200, 607, 329, -166, -465, -155, 419, 493]
3016D93m13m90mM70M30j41o00l04L87M21J98m31n09j3M57N59k66n79l14K48P04
3037C03J40m90m42j63N94M77j13n87l56K68N66K36l32o32m1N65M09l9o19l03K44
3058c15N43L09l99m91j84M94N30p7n16l41J14O58K73l36n92j09M71N36Rn72m87
3079d82J97N64M17k83p56j09M83M40J53n83m30O8O25L24l20m56l18L67N95K1m84
3100C3m63P3N79L58k63o43j86L60M79J55n05n11J29M73M07k08o12m00M67O18l
3121C37l88m82o1N79M21k33m50k98K48N29J48l62n03J3M66L91no84j79K91L93
3142A71K37l00n78j4N40M03j59l66l98J88O53J79m86l58j18L99N86j53n31k88
3162c93J85M92L50k97p01J1M36L47P8m91m56K82N07J38k53m49k47N53M57j85l96
$$ y = [493, 80, -410, -414, 56, 486, 345, -255, -559, -172, 249, 447, 16, -493, -506, -49, 510, 244, -335, -649, -401, 303, 443, -47, -489, -652, -58, 419, 306, -281, -637, -369, 197, 433, 101, -531, -572, -7, 402, 363, -256, -559, -315, 228, 537, 138, -353, -537, -43, 487, 410, -106, -447, -333, 325, 598, 262, -330, -439, 32, 568, 577, 5, -482, -285, 279, 696, 413, -343, -452, 31, 471, 624, 41, -389, -321, 304, 628, 308, -148, -466, -99, 496, 517, 33, -430, -357, 222, 580, 317, -326, -512, -152, 327, 482, -23, -534, -405, 68, 475, 267, -345, -745, -278, 340, 337, -51, -533, -594, -15, 406, 173, -277, -575, -327, 202, 350, -12, -515, -502, -36, 355, 350, -334, -513, -222, 171, 408, 108, -470, -484, 56, 459, 300, -66, -464, -276, 377, 556, 70, -288, -406, -7, 579, 426, -105, -393, -208, 284, 634, 337, -364, -353, 83, 430, 508, 17, -439, -157, 350, 488, 235, -214, -461, 92, 549, 364, -32]
3183c2l39K9O07L02m32m41r0L28M29J40o41l50K04L96L46j55p91l0L86L33J30
3204C29m12m91K3O31L03k97l34m00L87N81n0l76l03q0M51M50k24n50j01K77L65
3225A79K78m61m81J66L80L74o6n94k56L78M01J16k26m61k36O44L94k70k54l74
3245c69J02O59J93m51l71rK27M81L5n47k38J81K36M08k18n90l7L45K96J9k73m10
3267c31L4O12K1j90k29l50L52M36n8l98j71k7K99L68k27n14J02R4L05K73m80l39
3289d18J71K71K05k7m30l03L90K79j1j21l87n5N22J69j90k54j59J08M80J27m55
3310h8l03J08J81M47o7n32j08K41L22J90j97n28%M25K31n0k36m02K35N10kj82
3332A95l12k03L83M42j04m60j74Q5L43L30l16m77O2K17L73J00m69l18J08L53K30
$$ y = [-32, -371, -342, 265, 567, 135, -306, -396, -68, 361, 501, -140, -490, -286, 110, 456, 301, -490, -520, -134, 199, 329, -83, -574, -551, 80, 383, 86, -248, -648, -261, 320, 270, -106, -409, -489, -38, 412, 188, -362, -463, -186, 179, 457, -4, -485, -319, 61, 435, 369, -225, -481, -103, 298, 414, 188, -273, -509, 135, 529, 259, 5, -369, -267, 392, 585, 134, -237, -246, -19, 462, 497, -50, -288, -107, 129, 537, 319, -271, -308, 37, 333, 352, 79, -331, -297, 315, 336, 146, -83, -433, -81, 355, 297, -101, -272, -299, 0, 368, 141, -373, -271, -177, 128, 401, -79, -418, -247, 24, 229, 202, -228, -531, -141, 138, 127, 6, -381, -436, 86, 255, 65, -189, -348, -240, 240, 367, -88, -391, -283, -102, 345, 278, -254, -362, -121, 201, 391, 194, -334, -334, 91, 322, 272, 36, -366, -131, 379, 377, 195, -117, -320, 63, 505, 401, -59, -233, -148, 195, 525, 209, -268, -206, 11, 384, 484, 15, -303, -195, 158, 388]
3353C88j87l87k31L86L17l7k10l73JM04L24k19m02r6J15M63R1m21k32k8K86L43
3375B95m7m55k26K37L25J26j99m87M6L36K27Ql38l21J84M89P6k26l35j50L31M32
3397C28j20l72j25M4L84K23k43l15j20K21M45k6l00l81J88L25J70K8n17j36K88
3418a1L74K2k95l11j7L98K83j78l54j47J74M55J3l38k47l4M09J64q6m53j42K47
3440g4L02J28k75m46R4L28K28m7m83j91K51L85J42l14l42j15L81M39k19l49k83
3461d60J89L67J63k33m44r5M57K82J6m26k87K11L16K31j92l95j29L06M03L0m13
3482a03k67M5M87K00k83l17j48L57L90k7l80l15Q5M62K64j69m88j57L43L38J38
3503D55m34k78N6L44L45k37l88j50K25M63J2l53k85L9L46K68k21l62j65K26L93
$$ y = [388, 201, -186, -417, -31, 286, 249, 39, -334, -333, 71, 395, 176, -226, -322, -207, 256, 347, -74, -306, -334, -48, 295, 248, -207, -433, -196, 129, 255, 56, -431, -385, -49, 178, 186, -152, -473, -289, 200, 276, 50, -285, -435, -104, 328, 208, -164, -289, -245, 139, 362, 119, -196, -316, -95, 350, 324, 24, -357, -169, 156, 326, 354, -163, -299, -11, 363, 385, 90, -221, -238, 160, 443, 265, -89, -236, -62, 393, 406, 68, -179, -213, 196, 360, 274, -179, -321, -74, 228, 356, 81, -365, -271, 57, 285, 238, -245, -436, -185, 200, 342, 28, -314, -429, -48, 391, 172, -177, -460, -271, 96, 259, 26, -418, -513, -56, 226, 242, -184, -471, -260, 56, 287, 95, -300, -429, -123, 280, 310, -103, -370, -325, 162, 362, 79, -238, -386, -29, 361, 334, -46, -361, -276, 186, 450, 281, -207, -364, -21, 317, 455, 21, -257, -201, 143, 488, 251, -137, -287, -62, 401, 413, 60, -225, -186, 160, 428, 207, -155, -320, -94, 299]
3524B99Q2l34l85M0M27K78j23n06k02K45M89J5k89m06k3L79L51j23l84k06N7M89
3546A70J24l22l76l1L99K88o5l38l00J77M62R5k41m09l8L94L54r6m23k57J83L90
3568A40K64l53l52q3L00M73j09l44k96J20M67J84j78n20p5L74L53O6l81l54J13
3589a91L76K74j67l99j78K73L93L6l61k62k3M89K07k38m19r5K42M58K0m09l36
3610c10Q7L97K22j72n21k6J88L73J17l75l93N6M11K77j44m25k20K49L93Q9l22
3631d9l22o0M47K81j99l43j64J86L59J38l31l31N0K76K84m4m26j81K35L89J49
3652C44l50l14OM10K45j23k82k71J88M30J13k81m00oL89L09j33l91j24J40K72
3673A71K70k58l92M2J80L15N2m36k87J83M16Q5j77l42j37L65L62j28k96k60N7
$$ y = [299, 381, 47, -338, -298, 129, 407, 284, -222, -424, -179, 310, 325, 36, -370, -393, -14, 337, 214, -170, -376, -319, 170, 294, -28, -404, -435, -36, 252, 187, -151, -451, -274, 188, 283, 42, -367, -405, -11, 343, 247, -176, -433, -250, 140, 404, 51, -301, -384, -84, 389, 280, -64, -360, -240, 227, 411, 233, -287, -362, 12, 365, 431, 50, -304, -191, 185, 459, 292, -107, -285, -12, 381, 417, 56, -206, -229, 260, 467, 229, -190, -285, -43, 415, 435, 26, -310, -223, 174, 396, 224, -297, -323, -135, 238, 355, -20, -413, -357, 54, 331, 187, -238, -458, -209, 184, 273, -49, -371, -431, 16, 297, 98, -245, -409, -223, 136, 274, -57, -388, -338, -62, 222, 178, -248, -429, -194, 195, 344, -6, -320, -314, 96, 341, 218, -64, -335, -147, 283, 396, 115, -285, -291, 98, 407, 274, -117, -241, -101, 171, 441, 183, -209, -167, 13, 328, 380, -56, -343, -160, 256, 341, 164, -178, -315, 50, 412, 284, -12, -272, -215]
3694b15M18J89k83l83n5K17L72Q2m17l04J76K35K73j68m05j37L08K55R4k65l49
3715c62LM58J30j63k25k62J83M26jk53k22m9K99L11j25m31NO9L25J74l32k98J83
3738a57J03L18m6k73l10K36L15M0o2l06k34M33K77j41k05j90N7L51J48k87k69
3759b02R3Q7L61L8m45q9J36J86J69j66k79m6K72J42Lj70l57J40L03O7r0l05p6
3782b28K32K72q1k70j41L1K03K74j73l49N8N7K41J18k74l14J25K81N8nl35k32
3804d52L44K51j45m5k93LM18J35j02l22q1N1L95J14l35j71qJ66L86j00m24q4K07
3827i2J60K28j48m42K8L83Q6N9k57k95J40L86L1j18k05j93K11L42o9k33j01k1
3849a20J94L26k47k58p6J65L16N8l21k69J86J99P2ol35j92L69J84K7j73l11o0
$$ y = [-215, 203, 392, 109, -274, -329, -112, 260, 342, -75, -379, -203, 32, 305, 137, -268, -405, -97, 158, 252, -13, -362, -359, 99, 229, 66, -159, -421, -238, 188, 187, -66, -288, -337, -38, 273, 148, -283, -278, -209, 116, 290, -42, -340, -157, -54, 264, 218, -55, -365, -129, 186, 226, 164, -142, -376, 57, 334, 193, -12, -202, -145, 206, 354, 67, -202, -109, -22, 339, 377, -68, -157, -21, 165, 334, 168, -111, -157, 115, 257, 260, 90, -267, -127, 176, 243, 153, -152, -228, 4, 276, 195, -75, -216, -185, 18, 292, 119, -230, -172, -115, 126, 244, -30, -344, -219, 62, 120, 115, -220, -452, -108, 143, -2, -47, -340, -337, 81, 216, 114, -208, -289, -238, 157, 271, -64, -235, -243, -77, 309, 209, -215, -299, -92, 68, 296, 148, -294, -266, 117, 203, 262, 5, -290, -150, 236, 267, 149, -56, -249, -38, 304, 235, 2, -99, -120, 74, 400, 153, -105, -181, -16, 300, 358, 37, -232, -46, 153, 225, 219, -116, -308, 61, 245, 272, 99, -212, -272]
3871b72L35J73j70k13l3lL04J29l39r9j2J05K92n9k83k11J99J63J51j35l69J9
3893c28L15J38pk45k49J73L26L3k13j58l6J71L25q4k89r3j1L64J48j87k40p6K02
3916b1J83O6k81j47P2K51J45n7l02j34K35K85k0k41j58jK78J55j93k11l3J20K49
3939B40M5k16k93J20K04J79o8l32j07K11J81M9j54l53Q4K30K07n0k54j77J07L04
3961A57P8k05k49j06L05K16l1l37j16O7L32N7j66l47J36J50K01n3k56j14J16K57
3983I2P0j60l05k3L04K55n4l46r3J3M05Q8j58k76r5K46K82K1l33j21L3L48Q4p6
4007B01l36p3J97K13Q4k28k74Q3K68K03j57k45j34J61L08k0k44k14P3K51J80q9
4029B08l13j08J58K95Nj70l13P1K10J99j8l37j10J70J98P6k00k56M6J85J63j10
$$ y = [-272, 63, 236, 66, -147, -180, -183, 121, 250, -89, -188, -200, -95, 197, 138, -145, -356, -157, 6, 157, 22, -347, -328, -13, 125, 118, -127, -376, -203, 123, 156, -57, -215, -251, -80, 245, 161, -128, -221, -232, 132, 280, 93, -147, -223, -21, 162, 228, -53, -200, -128, 123, 268, 211, -91, -225, 10, 295, 275, 34, -124, -125, 153, 308, 115, -96, -129, -9, 240, 285, 69, -224, -104, 100, 279, 211, -121, -228, -17, 164, 213, 59, -294, -210, 20, 227, 177, -77, -254, -147, 157, 235, 30, -219, -325, -20, 196, 165, -172, -288, -221, 111, 168, 2, -345, -209, -59, 142, 89, -167, -281, -165, 92, 162, 2, -303, -326, -22, 233, 179, -167, -260, -247, 158, 246, 88, -188, -283, -37, 245, 266, -67, -188, -155, 193, 277, 201, -135, -208, -11, 202, 286, 58, -216, -133, 135, 338, 181, -64, -198, -37, 271, 251, 7, -207, -134, 117, 297, 208, -105, -213, -55, 240, 245, 75, -238, -167, 43, 242, 224, -113, -223, -53, 145, 221, 21, -235, -189, -4, 159, 49]
4051D9j98j37J51L25K6j58l14J5K41K28j02k89j09J12K60J09k35k78P5K00K46
4072B17p6k72j93J26L04J72k29l51L0K71K81n5l20j68J35L44P2j06l60m6K57K32
4094B65mk35j98J00K75P3j15k43q9J82K56Kl05j13lL12J77k32k28j02K40K58m5
4117B28k26k31J03K25J25q4k91o4J13K47L7k64j45%K85J25j44j68j26J78K77o7
4139A33k14j41m2K89J32p8k97j03K07K69L7k46k33K1K35K16j07k45j02J33L23
4160A87J0k03j84k2K54J67p2k29j50J14K73J07j91k55L8J31K52M6l47r1J09K08
4182A52K06l50j27k0K06J92m4j91j69Q6K87j7j28j66j31K48K05n6j71k20N6K98
4204A46J21j28k93j9J21K16M6k64j67R3J48J45j23k33o2J63J76J3j47j72M9K44
$$ y = [49, -149, -286, -135, 190, 216, 58, -256, -241, 0, 228, 126, -163, -272, -160, 100, 209, -26, -304, -229, -29, 217, 141, -131, -324, -198, 106, 278, 49, -302, -272, -1, 280, 225, -95, -263, -128, 216, 288, 182, -178, -224, 33, 265, 261, 26, -172, -72, 203, 276, 161, -82, -171, 11, 267, 269, -36, -149, -152, 160, 337, 105, -123, -225, 15, 273, 228, 2, -229, -126, 99, 224, 140, -151, -215, -102, 145, 182, -82, -227, -227, 58, 183, 39, -129, -255, -77, 200, 133, -81, -222, -264, 25, 157, 79, -218, -321, -114, 155, 192, -54, -287, -266, -31, 185, 78, -167, -269, -136, 187, 197, -6, -190, -212, 42, 209, 137, -92, -242, -128, 145, 252, 61, -194, -156, -25, 227, 273, -74, -165, -56, 152, 358, 8, -119, -139, 67, 259, 215, 24, -145, -59, 228, 211, 83, -83, -214, 34, 239, 183, 12, -208, -152, 146, 267, 139, -154, -173, -52, 164, 210, -54, -221, -128, 20, 165, 42, -191, -253, -90, 86, 99, -48, -220, -171, 73]
4226G3O0j14j17j40Q0K84J4k27j17LJ83J81p0k79N1l9K58J61k66j82N2J95O3m1
4250F6j59j29J58J93j3n0k15nJ83J66j03r8j20K7K49J09k22j48P8J09K02r4k06
4273b2j19J53J28R6p1k77l5K67J22r0j42j81R0K37O5j91j06j00J56K32j0k52r0
4296a40l9J91K32k18j38n8J04J38Q0k13j96J26K34o1oj91j49L17O3m6p5j81lJ95
4320c4K29j92j49p4P7K56R3k46j81K5J41K29l0k65j25K01Q4J47j28k15k4J79J02
4343A00j5n7j78J03J71Q4j22j36n0N3K53j9k27K1o6J97J51j40j73m5J19J05J06
4366B35j76k09J33J76k7R2l18r1K14J33o1q9q6j05K33J50j56r4q5K6K73m2k06
4389h0m1m5J17J49j3k74o6J90Q7P7j36k20J14J55O7j5j09j69R4K14P0j65j62k9
$$ y = [73, 133, 19, -98, -238, -158, 126, 140, -87, -204, -201, -18, 163, 93, -186, -135, -174, 84, 245, -21, -203, -151, 44, 107, 66, -93, -222, -64, 129, 116, 66, -149, -154, 29, 195, 92, -6, -126, -99, 150, 259, 37, -111, -33, 76, 278, 184, -22, -141, 12, 140, 236, 165, -112, -147, 120, 242, 152, 10, -171, -81, 156, 221, 30, -76, -176, -20, 212, 202, -50, -140, -179, 12, 244, 26, -112, -170, -66, 72, 152, -61, -257, -131, 103, 42, 36, -155, -304, 13, 76, 30, -45, -226, -229, -34, 195, 3, -146, -220, -143, 113, 206, -40, -221, -196, -55, 174, 144, -121, -246, -45, 39, 186, 58, -157, -181, -2, 100, 85, 28, -150, -47, 124, 208, 86, -50, -100, -47, 206, 187, -40, -19, -85, 112, 263, 123, -50, -95, 24, 129, 235, 59, -150, -17, 159, 132, 224, -94, -185, 29, 162, 101, 12, -74, -179, 54, 204, 48, -46, -131, -105, 168, 126, -80, -121, -166, -49, 100, 87, -187, -253, -63, 24, 101, -35, -255, -141, 14, 81, 66, -43, -212, -118, 96, 166, 1, -161, -190]
4413a90J57J65o4j57m5O4J79N5j85j54L0J83M8J24k15k22K13J16J06q8k10q9K22
4436D3J66q1r1p4l6K27P2j62q7j02P7K67%k02j64M1J90J31o5k74n5J66J49P0k01
4461Ej70Q8P4K02j11j11j63J31J72L6j13j67o9K68P7j20j34j26J38J28R3j80j75
4484b27M2J75J39l8k07o8P2J62R1j32k01NJ61J21n0j61j29J23K11O6j64j16j9
4507a44J57J09Mj60j05Q9J01J98j57k24nJ58J55k4j81j31N6K33J08j77j23n3J27
4530A1J69l5j61j29N8J92J09j08j91p6J25J97M1j43j70L2J55J23j76j85j1O3K34
4553A24L2j63j59J5J61J68j63j51j20J61J68j5j05j80O8J76J59j14j79j7P0R7
4575C3Q9j23j85N9J26J53r7j76r0J13J74J8o1j68oJ99J23l4j92j22J15J72M5j18
$$ y = [-190, -33, 132, 68, -89, -134, -70, 109, 164, -21, -175, -145, 38, 86, 210, -5, -227, -14, 102, 208, 120, -90, -179, 43, 209, 128, 37, -37, -73, 154, 226, 64, -23, -125, -48, 219, 219, 17, -147, -106, 84, 215, 150, -124, -179, -13, 136, 206, 5, -165, -77, -3, 199, 88, -23, -186, -55, 117, 153, 40, -127, -196, 72, 149, 29, -105, -231, -93, 35, 128, -52, -227, -185, -10, 129, 91, -116, -184, -112, 50, 141, 9, -192, -187, -26, 95, 45, -116, -245, -122, 89, 155, -9, -125, -144, 13, 122, 126, -34, -139, -50, 51, 249, 92, -132, -137, 21, 176, 152, -29, -160, -104, 129, 237, 60, -63, -116, 11, 180, 145, -16, -145, -87, 105, 214, 106, -85, -161, -36, 161, 202, 59, -111, -79, 76, 199, 23, -162, -173, -110, 124, 156, -7, -166, -151, 10, 178, 15, -136, -256, -95, 73, 58, -47, -227, -159, 17, 176, 62, -117, -134, -64, 33, 122, -1, -186, -127, -1, 152, 55, -121, -211, -98, 76, 94, 33, -135, -141, 58, 181, 147, -45, -167, -52, 120, 165, 47]
4599D7j76J7K05Q8Pk50o6J08J75Q5j89j57j4J92O1k1j77j04J41J41J14j57j84
4622a14mJ81O8k3j20j06K5J68P3q6k40JJ45J82Kk04l9p2K23M2n1j81n9J15J40
4647F6L8j64p5oJ64N0m5k31J6J58J09Kj77p6N6J26Q3k7j70m4N0K06k1j28j44P3
4673a11J54L2q4j03m9R1K14l2j07j35J2K27P7o3j64l7L3J61Q9j66j12k0K06R6
4697B09j01q7k01J38J62N3j07j86M2J57J41j01j29j25O9J61Q4j34j18k9R0J52
4719A40K9k15j20J16Q3R5j09j33m2J80L0l5r3j35J01R8P7m6j31p5J56J48nk43
4743a29Mm0J52J99k33p1J9O9M5P0j34j04M2J79J7nj21j64K11R3K2j28q3J0J02
4768B2J78j29j19k9N0J96K8j73j33Q8P7Q7J1j71q5L4K20J5j33j40k5J93P9l4q2
$$ y = [47, -129, -112, 93, 181, 188, -62, -128, -20, 155, 240, 51, -106, -120, 72, 133, 112, -65, -169, -28, 113, 227, 70, -114, -118, 63, 131, 108, -12, -118, -93, 75, 148, 62, -178, -177, -32, 150, 152, -52, -91, -163, 60, 102, 51, -130, -189, -74, 66, 104, -60, -135, -141, 23, 73, 28, -203, -187, -29, 80, 82, -95, -171, -115, 11, 94, 67, -103, -147, -97, 109, 88, -40, -184, -111, 43, 75, -9, -112, -161, -70, 144, 112, 5, -130, -118, 109, 186, 123, -41, -78, -45, 116, 205, 39, -73, -93, 113, 209, 108, 21, -180, -42, 120, 173, 66, -120, -78, 79, 220, 119, -10, -135, -66, 95, 179, 45, -73, -102, -12, 140, 169, -46, -166, -50, 33, 128, 19, -114, -156, 24, 54, 19, -74, -209, -108, -10, 67, 21, -110, -185, -29, 119, 114, -129, -125, -165, -13, 186, -47, -118, -99, -30, 15, 85, -49, -153, -111, 68, 85, 80, -41, -205, 6, 99, 121, -7, -90, -80, 22, 200, 71, -48, -77, -27, 169, 197, 24, -109, -21, 56, 143, 154, -17, -102, -68, 152, 167, 34, -106, -131, 62, 141, 107, 25]
4793B5j20O7J33L5j18j02QP6J30o0j10n4n3J85R9j34j35L9M1J33Oj39j40J31J15
4818E8j1J4j97r8K06J30o2r6j08K1J85J08j79m5m2j5J48O0j11l5k3J24M9o0q7
4843f6m7P4LJ75j10j40O2J15J4J3q1j61R5K27k2j24o2M3j2J68n5j40J1k1J45p
4869I7p0j11N4M0Q5L8j09j32J19J5Q1q6p3l4Q4R7o9m9n3n0J86O3j57n6k9O9J25
4896G5m1j41JO9N6M5l7j97J8J39M3N0j75o7N3Q7O6k0j16j11N7K33p0l1n0n3J03
4923a4J29n0j61J7N5O9Q8j64j30Q6Q9R4l7j23q9J61J08Oj07j23J1J80P0j19l8
4948Hj23R9J72Qj23q0j1P9J69q3j32p1J12nJ07n8j61O4L2M9N2p5k05J18J38k0
4974F0o1r0j5J28J12j05q4p9R0P0J03j73j28O0J09M2J7j15o8J7J10J11j14j19
$$ y = [25, -95, -28, 105, 140, 22, -80, -72, 4, 134, 74, -36, -90, -143, 42, 141, 7, -128, -89, -48, 85, 91, -48, -188, -57, 58, 47, 61, -136, -234, -28, 102, 40, -56, -164, -143, 42, 150, -29, -74, -116, -131, 17, 77, -34, -69, -92, 32, 81, 21, -66, -113, -39, -36, 139, 29, -111, -49, 66, 80, 93, 12, -149, -54, 173, 151, 27, -35, 8, -4, 164, 109, -31, -20, -41, 104, 97, 27, -84, -30, 10, 95, 133, 24, -108, 11, 26, 107, 21, -52, -86, -2, 95, 26, -23, -76, -126, 60, 123, -34, -90, -119, -50, 75, 34, -107, -106, -37, 19, 64, 27, -170, -152, -13, 30, 80, -95, -162, -109, -22, 44, 24, -92, -203, -146, 87, 17, -14, -64, -117, -14, 115, 65, -96, -79, -24, 45, 133, -31, -161, -75, 14, 108, 71, -52, -141, 20, 128, 134, 27, -96, -85, 95, 165, 46, 8, -115, -16, 156, 164, 41, -39, -50, 29, 198, 115, -17, -88, 24, 19, 126, 68, -93, -29, 3, 52, 104, 29, -176, -58, 80, 60, -1, -91, -106, 22, 134, 29, -55, -134, -44, 26, 129, -44, -172, -112, -3, 39, 56, -59, -127, -110, 0, 111, -3, -122]
4998a22m1J61R4p4pj35lJ30R0q1q2m3P9J32j8m7r7k1J06R5n6k00K3N8J27R3j17
5025D4j00LQ1L7jj26o2J32J49m2n1j22KJ18J08j13n5Rk1J29Ro3j87P5Q3N5M2j95
5053f2m9M2J40Q3j23j11l8J21J20o4j24j00J25J22k9o8j20mJ40R5j4j39n1m6J84
5078C0N6j23p3k3O2J53K2j74o5J07R7P2q5j58l0O9J31rj13pO1N2j4Qj20n4J41
5105A3R0M4j13j05L2R0N8l2o8m5L9J49o2j51k7jK22K8j04j19j5M7J53j4r5j13
5131i9O3J10P4p7j32k7M9J32J0r2q7J6J34Po0n6r4Q8J41nq8r6k8R7J44q3r6o6
5159a21N2R8Lp0q7JJ13N2M2j31r1J2J63K6q9k3m0N7Q1K3j14r5Q5J11M4o2j15M
5187g1R3N5pq8j11R6J01O1p2j40L6N1J63q4o0n5J1J27M3r7p9r7P6J30Qr7p1K2
$$ y = [-122, -163, -2, 92, 18, 11, -124, -127, 3, 93, 12, -70, -113, -34, 98, 80, 33, -64, -85, 21, 116, 60, -140, -117, -59, 68, 161, 44, -56, -53, 28, 65, 64, -62, -124, 8, 157, 115, 64, -58, -56, 62, 170, 57, 2, 11, -10, 119, 128, 65, -122, -47, 36, 91, 133, -62, -111, -69, 71, 154, 31, -80, -118, 3, 123, 59, -65, -165, -40, 82, 53, -15, -135, -139, 1, 96, 82, -57, -108, -154, 30, 86, -37, -110, -133, -71, 82, 104, -70, -135, -28, 69, 141, 56, -102, -132, -63, 68, 59, -54, -61, 0, 52, 38, 46, -74, -128, 13, 103, 147, 34, -71, -39, 51, 109, 77, 9, -36, 3, 152, 90, -61, -88, -89, 133, 161, 57, -62, -77, -30, 123, 109, 14, -99, -36, 74, 148, 71, -61, -88, -39, 93, 103, 11, -76, -60, 74, 81, 21, -35, -129, -41, 100, 95, 7, -89, -117, -20, 124, 41, -55, -121, -69, 29, 32, -38, -125, -124, -11, 41, 83, -48, -139, -127, 36, 62, -27, -50, -90, -33, 48, 71, -43, -138, -53, 58, 102, 40, -75, -71, 22, 77, 70, -18, -129, -33, 68, 129, 57, -83, -47, 4, 167, 83, 23, -32, -21, 106, 149, 52, -27, -124, -48, 82, 90, -7, -78, -56]
5215e6Q6J16p9j17j1P5K7Q1r0j07j9R4P5j4j56K1R2J7Rl9j00OJ23J2%j54n3J07
5243e4K9N1m9p2PO3J00o8r6j9K5Q0Q5j09m2q7J07J42p5r9o3P9J52lp2p2j6O7J02
5272I3J9p7r9j0K02j6q7o2M2l2J45K7j36Qp5J32J3m2o5n1Q3P2k0l8j32N9J63j00
5300A6O2q0q1N6J35j1j08m2j3N2R2p2n0k3J14l4Q0j02q0j7J15J7J4r2j54K04N
5327CLl8o5q9J64L9k4l5m9l4J66j4n9k4Nj6P4k1m8m5N2K7P8k8r1J9P0PK2o9r7
5358a17J15J00J6o7p7k1P5Q7j2r9m4k1J14J2qm3m7L1O7N0j29j07J30L2M5l4r8
5385e0m0J35M3n8K1j37K2R9P7j03p0j3j7J18O1j31j0j9R5J17p1j27J0N7n6J23
5411G6o1j44N6P1J8Or9k7oJ07N6o7n0r6J92M1j29Rj9j4O0R5q8n3rO4R3L0j40l7
$$ y = [-56, 30, 146, 67, -50, -61, 14, 41, 122, 32, -75, -94, 0, 75, 61, -95, -74, 18, 35, 44, 5, -95, -89, 34, 46, 46, -108, -161, -54, -25, 26, -23, -95, -88, -25, 75, 7, -89, -108, -83, -3, 82, -27, -69, -156, -49, 93, 18, -81, -144, -65, 87, 84, 12, -60, -76, -9, 93, 112, 35, -64, -74, 128, 112, 25, -37, 5, -27, 118, 145, 9, 17, -58, 74, 87, 45, -20, -71, 12, 84, 64, 26, -106, -47, 116, 16, 78, -2, -83, -27, 108, 97, -11, -53, -66, -14, 78, 6, -44, -67, 47, 13, 93, -9, -89, -106, 9, 26, 40, -52, -206, -2, 3, 6, -32, -97, -186, -22, 17, -7, -42, -91, -125, 41, 27, -32, -56, -51, -67, 7, -14, -62, -107, -55, -28, 50, 22, -69, -50, 20, 27, 49, -20, -117, -2, 98, 114, 47, -30, -51, 24, 111, 99, 0, -44, -65, 49, 61, 53, 10, -37, -6, 61, 111, -18, -125, 5, 37, 82, 48, -50, -90, 45, 88, 30, 51, -86, -64, 35, 112, 9, -61, -74, -91, 27, 88, -43, -53, -72, 23, 140, 69, -58, -48, 9, -47, 76, 15, -129, -73, -2, 16, 22, -77, -104, -110, -3, 53, -14, -64, -160, 32, 73, -56, -47, -66, -80, -20, 75, -13, -66, -75, -11, 82, 112, -28, -65]
5441f5J03nO6k6j14m1L8J10oqq5J7O6J23j73l8%kJ50k0o7k3RLN3Lr8k9N4O0Q0
5472A35j07n8JN7NJ0p1j2O5M7qp7k3l4J18J0k1j18k4J9J16M3p8j27O2O6N7mj08
5501e9n0L6P8O0n2j13MQ9N5m2j9p0L1J08Lr1mm2J12M3o2r2k0O3M2O2J3j78lJ38
5531D0Q3k6j05j7J0R1M5k4j83J8Q0J18m8l5q7K6J27K2j08j11M3N4N4Q5j40o9N7
5558@O9K3j21n6l3R1O0O0o1j11j1J29N1r0j29K8R8Q6o9m1p0L4JJ30n2r6j4L2J02
5587D0Nm6q6M3O7oJ7n9j18J36J3K4k8p0lJ17J2Nj13l2N5J03m2n2o1QM3J40J8j31
$$ y = [-65, 38, 33, 99, 73, -41, -82, -44, 66, 60, 52, -33, -16, 50, 173, 0, -38, -38, -40, 110, 90, 23, 0, 9, 12, 65, 68, -30, -59, -5, 55, 135, 28, -30, -29, 28, 33, 43, -28, -40, 25, 72, 64, -13, -36, -70, 48, 58, 37, -81, -105, -86, 30, 73, -5, -132, -70, -4, 53, 49, -59, -109, -73, 5, 65, 13, -100, -96, -7, 48, 6, -13, -83, -52, 56, 59, -32, -36, -78, 34, 77, 15, -77, -97, -34, 8, 70, 83, -95, -98, 40, 123, 97, -8, -25, -15, 76, 121, 97, -86, -68, 12, 130, 82, 47, -40, -14, 113, 135, 27, -84, -41, 13, 67, 152, 12, -57, 0, 69, 92, -29, -85, -118, -27, 33, 93, 32, -79, -90, 39, 90, 0, -129, -101, -3, 83, 14, -27, -97, -63, -62, 68, 16, -80, -94, -62, 40, 45, -1, -87, -44, 23, 17, 34, -25, -143, -7, 6, 30, 2, -68, -71, 46, 58, 63, -50, -82, -27, 76, 34, -18, -79, -71, -28, 112, 130, -1]
$$ [...]
8191a8
##END NTUPLES=NMR FID
##END=
