##TITLE=1H_Pr 846
 CDCl3
 8 sc, 
 17.02.2022
##JCAMPDX= 6.0         $$ Bruker NMR JCAMP-DX V2.0
##DATA TYPE= NMR FID
##DATA CLASS= NTUPLES
##ORIGIN= UXNMR, Bruker Analytische Messtechnik GmbH
##OWNER= root
$$ XWIN-NMR		Version 3.5
$$ Thu Feb 17 13:17:31 2022 Russian Standard Time (UT+4h)  she@DPX200
##.OBSERVE FREQUENCY= 200.131346
##.OBSERVE NUCLEUS= ^1H
##.DELAY= (6, 6)
##.ACQUISITION MODE= SIMULTANEOUS
##.ACQUISITION SCHEME= undefined
##.AVERAGES= 8
##.DIGITISER RES= 18
##SPECTROMETER/DATA SYSTEM= spect
##.PULSE SEQUENCE= zg30
##.SOLVENT NAME= CDCl3
##.SHIFT REFERENCE= (INTERNAL, CDCl3, 0, 15.7039)
##AUDIT TRAIL= $$ (NUMBER, WHEN, WHO, WHERE, WHAT)
$$ ##TITLE= Audit trail, XWIN-NMR		Version 3.5
$$ ##JCAMPDX= 5.01
$$ ##ORIGIN= Bruker BioSpin GmbH
$$ ##OWNER= she
$$ F:/spectra/data/she/nmr/H-F/1/audita.txt
$$ ##AUDIT TRAIL=  $$ (NUMBER, WHEN, WHO, WHERE, WHAT)
(   1,<2022-02-17 13:16:36.23 +0400>,<she>,<DPX200>,
      <created by zg, POWCHK disabled, PULCHK disabled
       configuration hash MD5:
       00 E9 B6 7A A2 85 ED C7 34 08 36 98 17 FE 4E 26
       data hash MD5: 16K
       1F BE 7D 76 F7 99 44 A3 CF 69 AB A4 66 05 A9 04>)
$$ ##END=
$$ 
$$ hash MD5
$$ 45 CD 07 33 70 59 0A 02 E9 62 3A 10 5F 79 45 44
##$RELAX= 
##$RELAX= 
##$RELAX= 
##$RELAX= 
##$RELAX= 
##$RELAX= 
$$ Bruker specific parameters
$$ --------------------------
##$DU= <F:/spectra>
##$EXPNO= 1
##$NAME= <H-F>
##$PROCNO= 1
##$TYPE= <nmr>
##$USER= <she>
##$AMP= (0..31)
100 100 100 100 100 100 100 100 100 100 100 100 100 100 100 100 100 100 
100 100 100 100 100 100 100 100 100 100 100 100 100 100 
##$AQSEQ= 0
##$AQ_mod= 1
##$AUNM= <au_zg>
##$AUTOPOS= <>
##$BF1= 200.13
##$BF2= 200.13
##$BF3= 200.13
##$BF4= 200.13
##$BF5= 200.13
##$BF6= 200.13
##$BF7= 200.13
##$BF8= 200.13
##$BYTORDA= 1
##$CFDGTYP= 0
##$CFRGTYP= 5
##$CHEMSTR= <none>
##$CNST= (0..31)
1 1 145 1 1 1 1 1 1 1 1 1 1 1 1 1 1 1 1 1 1 1 1 1 1 1 1 1 1 1 1 1 
##$CPDPRG= <>
##$CPDPRG1= <>
##$CPDPRG2= <>
##$CPDPRG3= <>
##$CPDPRG4= <mlev>
##$CPDPRG5= <mlev>
##$CPDPRG6= <mlev>
##$CPDPRG7= <mlev>
##$CPDPRG8= <mlev>
##$CPDPRGB= <>
##$CPDPRGT= <>
##$D= (0..31)
0 1.2 0 0 0 0 0 0 0 0.06 0 0.03 0 0 0 0 0.0002 0 0 0 0 0 0 0 0 0 0 0 0 
0 0 0 
##$DATE= 1645089395
##$DBL= (0..7)
120 120 120 120 120 120 120 120 
##$DBP= (0..7)
150 150 150 150 150 150 150 150 
##$DBP07= 0
##$DBPNAM0= <>
##$DBPNAM1= <>
##$DBPNAM2= <>
##$DBPNAM3= <>
##$DBPNAM4= <>
##$DBPNAM5= <>
##$DBPNAM6= <>
##$DBPNAM7= <>
##$DBPOAL= (0..7)
0.5 0.5 0.5 0.5 0.5 0.5 0.5 0.5 
##$DBPOFFS= (0..7)
0 0 0 0 0 0 0 0 
##$DE= 6
##$DECBNUC= <off>
##$DECIM= 32
##$DECNUC= <off>
##$DECSTAT= 4
##$DIGMOD= 1
##$DIGTYP= 9
##$DL= (0..7)
0 120 120 120 120 120 120 120 
##$DP= (0..7)
150 150 150 150 150 150 150 150 
##$DP07= 0
##$DPNAME0= <>
##$DPNAME1= <>
##$DPNAME2= <>
##$DPNAME3= <>
##$DPNAME4= <>
##$DPNAME5= <>
##$DPNAME6= <>
##$DPNAME7= <>
##$DPOAL= (0..7)
0.5 0.5 0.5 0.5 0.5 0.5 0.5 0.5 
##$DPOFFS= (0..7)
0 0 0 0 0 0 0 0 
##$DQDMODE= 0
##$DR= 18
##$DS= 0
##$DSLIST= <SSSSSSSSSSSSSSS>
$$ [...]
##$SUBNAM2= <"">
##$SUBNAM3= <"">
##$SUBNAM4= <"">
##$SUBNAM5= <"">
##$SUBNAM6= <"">
##$SUBNAM7= <"">
##$SUBNAM8= <"">
##$SUBNAM9= <"">
##$SW= 18.0517287032376
##$SWIBOX= (0..15)
0 0 2 0 0 0 0 0 0 0 0 0 0 0 0 0 
##$SW_h= 3612.71676300578
##$TD= 16384
##$TD0= 1
##$TE= 0
##$TE2= 300
##$TE3= 300
##$TEG= 300
##$TL= (0..7)
0 120 120 120 120 120 120 120 
##$TP= (0..7)
150 150 150 150 150 150 150 150 
##$TP07= 0
##$TPNAME0= <>
##$TPNAME1= <>
##$TPNAME2= <>
##$TPNAME3= <>
##$TPNAME4= <>
##$TPNAME5= <>
##$TPNAME6= <>
##$TPNAME7= <>
##$TPOAL= (0..7)
0.5 0.5 0.5 0.5 0.5 0.5 0.5 0.5 
##$TPOFFS= (0..7)
0 0 0 0 0 0 0 0 
##$TUNHIN= 0
##$TUNHOUT= 0
##$TUNXOUT= 0
##$USERA1= <user>
##$USERA2= <user>
##$USERA3= <user>
##$USERA4= <user>
##$USERA5= <user>
##$V9= 5
##$VALIST= <valist>
##$VCLIST= <CCCCCCCCCCCCCCC>
##$VD= 0
##$VDLIST= <DDDDDDDDDDDDDDD>
##$VPLIST= <PPPPPPPPPPPPPPP>
##$VTLIST= <TTTTTTTTTTTTTTT>
##$WBST= 1024
##$WBSW= 4
##$XGAIN= (0..3)
0 0 0 0 
##$XL= 0
##$YL= 0
##$YMAX_a= 85821
##$YMIN_a= -46308
##$ZGOPTNS= <>
##$ZL1= 120
##$ZL2= 120
##$ZL3= 120
##$ZL4= 120
##$ABSF1= 10
##$ABSF2= 0
##$ABSG= 5
##$ABSL= 3
##$ALPHA= 0
##$AQORDER= 0
##$ASSFAC= 0
##$ASSFACI= 0
##$ASSFACX= 0
##$ASSWID= 0
##$AUNMP= <proc_1d>
##$AZFE= 0.1
##$AZFW= 0.1
##$BCFW= 1
##$BC_mod= 2
##$BYTORDP= 1
##$COROFFS= 0
##$CY= 11.3945322036743
##$DATMOD= 1
##$DC= 2
##$DFILT= <>
##$DTYPP= 0
##$F1P= 2.36226072786647
##$F2P= -0.459571619588291
##$FCOR= 0.5
##$FTSIZE= 0
##$FT_mod= 4
##$GAMMA= 1
##$GB= 0.15
##$INTBC= 1
##$INTSCL= 1
##$ISEN= 128
##$LB= 0.24
##$LEV0= 0
##$LPBIN= 0
##$MAXI= 10000
##$MC2= 0
##$MEAN= 0
##$ME_mod= 0
##$MI= 1.114404
##$NCOEF= 0
##$NC_proc= 0
##$NLEV= 6
##$NOISF1= 3.799351
##$NOISF2= 2.8
##$NSP= 1
##$NTH_PI= 0
##$NZP= 0
##$OFFSET= 15.70392
##$PC= 1
##$PHC0= -16228.46
##$PHC1= 8.60078
##$PH_mod= 1
##$PKNL= yes
##$PPARMOD= 0
##$PSCAL= 0
##$PSIGN= 0
##$REVERSE= no
##$SF= 200.130013532006
##$SI= 16384
##$SIGF1= 3
##$SIGF2= 2
##$SINO= 400
##$SIOLD= 16384
##$SREGLST= <1H.CDCl3>
##$SSB= 0
##$STSI= 0
##$STSR= 0
##$SW_p= 3612.71676300578
##$SYMM= 0
##$S_DEV= 0
##$TDeff= 0
##$TDoff= 0
##$TI= <>
##$TILT= no
##$TM1= 0
##$TM2= 0
##$TOPLEV= 0
##$USERP1= <user>
##$USERP2= <user>
##$USERP3= <user>
##$USERP4= <user>
##$USERP5= <user>
##$WDW= 1
##$XDIM= 8192
##$YMAX_p= 0
##$YMIN_p= 0
$$ End of Bruker specific parameters
$$ ---------------------------------
##NTUPLES= NMR FID
##VAR_NAME=  TIME,          FID/REAL,        FID/IMAG
##SYMBOL=    X,             R,               I
##VAR_TYPE=  INDEPENDENT,   DEPENDENT,       DEPENDENT
##VAR_FORM=  AFFN,          ASDF,            ASDF
##VAR_DIM=   8192,          8192,            8192
##UNITS=     SECONDS,       ARBITRARY UNITS, ARBITRARY UNITS
##FACTOR=    0.0002768,     1,               1
##FIRST=     0,             0,               0
##LAST=      2.2672688,     0,               0
##MIN=       0,             -46308,          0
##MAX=       2.2672688,     85821,           0
$$ Real data points
##PAGE= N=1
##DATA TABLE= (X++(R..R)), XYDATA
$$ [...]
1799e8q2N2k33L06M4n7O6J36p8l6j74j95k09J88J2K6j41N9L59K62k12P3l4J73
$$ -58 -140 -88 -321 -15 29 -28 38 174 96 60 -114 -309 -518 -330 -318 -292 -433 -374 -15 247 35 108 74 247
1823B47N8j71j8J48k39j27P7JQ6j49j33J1K60j54J54j74M20j94k39K76n36L74
$$ 247 305 134 116 264 25 -102 -25 -24 62 -87 -220 -209 51 -103 51 -123 297 103 -136 140 -396 -22
1845b2k21M2n4k5L07jM86l15k88K82n4p8O3k04m83K49j69L72L2O5K77M9p3l9J97
$$ -22 -243 -201 -255 -280 27 26 512 197 -91 191 137 59 122 -82 -565 -316 -485 -113 -81 -16 261 310 237 198 395
1870C95k92Q9m65k42l4J80j42K19j16N53q4K45n4J52k08J84l06p9rq8j03J10J12
$$ 395 103 192 -273 -515 -549 -369 -511 -292 -408 145 61 306 252 404 196 380 74 -5 -14 -102 -205 -95 17
1893A7r4K94n8K21j55J67l36j59j04o3n1m03J56J89K0K83N9P7rL05k29j6K94o0
$$ 17 -77 217 159 380 225 392 56 -103 -207 -270 -321 -724 -568 -379 -359 -76 -17 60 51 356 127 111 405 345
1917C45k62p0p7J13m0M4j11j02K04k78O4N8j6K57j47k4J26l0k37Q5Q4L64m54L2
$$ 345 83 13 -64 49 9 53 -58 -160 44 -234 -170 -112 -128 129 -18 -42 84 54 -183 -98 -14 350 -104 -72
1941g2M56J8M9r6J69n02k54J32j16M0j22L9P8k5R7J50j03K50Oj46p5J77l00n8
$$ -72 384 402 451 355 524 22 -232 -100 -216 -176 -298 -259 -181 -206 -109 41 -62 188 194 48 -27 150 -150 -208
1965b08K68j56K52j15o4J93k20q8jj02K04q9j34K46JK90j78o4K79J48p9J00k85
$$ -208 60 -96 156 41 -23 170 -50 -138 -139 -241 -37 -126 -260 -14 -13 277 99 35 314 462 383 483 198
1988A98k23R1k74J74m70O5J57J96j9j34j09L36p6o2j49j5j05K77J20R8K29K7R6
$$ 198 -25 66 -208 -34 -504 -439 -282 -86 -105 -239 -348 -12 -88 -150 -299 -314 -419 -142 -22 76 305 332 428
2011D28j71K67m27N8k96K41l63J0j14L92k42J20n0M7O4K03r4j21J8m9k9Q9p6O6
$$ 428 257 524 97 155 -141 100 -263 -253 -367 25 -217 -97 -147 -100 -36 167 73 -48 -30 -79 -108 -19 -95 -29
2035b9J21J96k17K21j86l64M85j87J05q8J44m83K68l6R4k8j20J8J47k0j1rL22
$$ -29 92 288 71 292 106 -258 227 40 145 57 201 -282 -14 -50 44 16 -104 -86 61 41 30 21 343
2058C43l72j52M4K28j94k26j59K04J39j98J51K31j20J78K19k8q6k2J34l72L41
$$ 343 -29 -181 -137 91 -103 -329 -488 -284 -145 -343 -192 39 -81 97 316 288 202 180 314 -58 283
2079B83m55L7j7L5K24j42k0K26k51k7K01k91j23J55j74J98J4J08J23o4k6l8L06
$$ 283 -172 -135 -152 -117 107 -35 -55 171 -80 -107 94 -197 -320 -165 -339 -141 -127 -19 104 40 14 -24 282
2102B82J04j86K55m97M5j10Q9R3k87K01p1J05o3J90j85p6p7J86L6k13r0K04j20
$$ 282 386 200 455 -42 3 -107 -18 75 -212 -11 -82 23 -40 150 -35 -111 -188 -2 34 -179 -269 -65 -185
2125a85O2L52l93M5L32j46o9m9j40K23p2k7K97j42j67J26K2j78j17L3L4p6L48
$$ -185 -123 229 -164 -119 213 67 -2 -51 -191 32 -40 -67 230 88 -79 47 69 -109 -226 -193 -159 -235 113
2148A13k43L47j11j5k30j26L03m41J20J06J11r2K7K76RK0m2k06J86k34J62k69
$$ 113 -130 217 106 91 -139 -265 38 -403 -283 -177 -66 -158 -131 145 154 174 132 -74 112 -122 40 -229
2170b29j7n0L41k95L77J12J62j18l51MR7J64n83J00K12n6j61L56k63j24K72J15
$$ -229 -246 -296 45 -250 127 239 401 283 -68 -64 33 197 -386 -286 -74 -130 -291 65 -198 -322 -50 65
2192F5N2j07p2J98k91p4L41k14J76N4k36J16K01j68n8K2J64km46J56N3k38J74
$$ 65 117 10 -62 136 -155 -229 112 -102 74 128 -108 8 209 41 -17 5 169 167 -279 -123 -70 -308 -134
2215a34Q8q8L30j96m4O3m2J5o3L18j12j83RL9R9k40M1L38j98k17K52N1ml4j63
$$ -134 -46 -134 196 0 -44 19 -23 -8 -71 247 135 -48 -39 0 99 -141 -100 238 40 -177 75 126 122 88 -75
2240g5J3K47j44Oj89o3K58j95Q1R6n8J16j04o2K77m19J01O4n7j23M2Q8L31j69
$$ -75 -62 185 41 47 -142 -205 53 -142 -61 35 -23 93 -11 -73 204 -215 -114 -50 -107 -230 -188 -100 231 62
2264F2k30O46n80M05m7j88j50k4q5o6K39J9j49J31p5PJ59l25N4N2r0O9L27j26
$$ 62 -168 478 -102 303 256 68 -82 -106 -191 -257 -18 1 -148 -17 -92 -85 74 -251 -197 -145 -235 -166 161 35
2288C5j55J45J01P0J5k17J17K5Q8n02K51j84k8O1J71o7l3J09J36J84l58%J52j10
$$ 35 -120 25 126 196 211 -6 111 136 224 -278 -27 -211 -239 -178 -7 -74 -107 2 138 322 -36 -36 116 6
2312Fl10K07l4N7N5l8J39n3K86l28J0O6j89M7R1k75J75r8j27L87j03K00m9K5N1
$$ 6 -304 -97 -131 -74 -19 -57 82 29 315 -13 -3 63 -126 -79 12 -263 -88 -186 -313 74 -29 171 122 147 198
2337A98o4M7j56K83l27J38k36Q6j51n7N5K79p4j25R3J16K59l54J16l09J81j8P0
$$ 198 134 181 25 308 -19 119 -117 -31 -182 -239 -184 95 21 -104 -11 105 364 10 126 -183 -2 -20 50
2360E0k41J00J92KM3j0j47Q2L4l3L2l39M2j42K2J28l0j2J05R0J40oK14r0j02j12
$$ 50 -191 -91 101 103 146 136 -11 71 105 72 104 -235 -193 -335 -313 -185 -215 -227 -122 -32 108 102 316 226 124 12
2386A2r9J65k88n1J12J57m8J05j19n2m5J90O0j50k70K34k35Q1K43qL9R2J6J9J53
$$ 12 -87 78 -210 -261 -149 8 -40 65 -54 -106 -151 39 99 -51 -321 -87 -322 -241 2 -6 33 125 141 160 313
2411C13r6k2k70k0l7j1J73Q7J8k41J63r7J77j09N7lj69N4K5l03K66j8j9j74J02
$$ 313 217 195 -75 -95 -132 -143 30 117 135 -106 57 -40 137 28 85 82 -87 -33 -8 -311 -45 -63 -82 -256 -154
2436a54K78l14K15j88K52j14p6K63q0l00K57J80k25J53j69L7r4m5J97j14K39r0
$$ -154 124 -190 25 -163 89 -25 -101 162 82 -218 39 219 -6 147 -22 15 -79 -124 73 -41 198 108
2458A08j63M8o7K37j07j41L32l19QJ84k95J06J71J05j92J19l34J52n9L6J13j73
$$ 108 -55 -7 -74 163 56 -85 247 -72 -64 120 -175 -69 102 207 15 134 -200 -48 -107 -71 42 -131
2480a31J62j71J31J84q6j66J79j41nK2K4J00j28o2k3J3J85j01K6k21J28q9j45
$$ -131 31 -140 -9 175 89 -77 102 -39 -44 -22 2 102 -26 -88 -111 -98 87 -14 12 -209 -81 -170 -315
2503c15L61k81k0L09m3j8J66oq3l0k4K48k47j0k16K91k39J16K35p9J36j36oM9
$$ -315 46 -235 -255 54 11 -7 159 153 70 40 16 264 17 7 -209 82 -157 -41 194 115 251 115 109 158
2527A58k31j3J69r8r7K0K9J70k96K48r4l8J67j45l2j9J36j61M05k40Q8J02j94
$$ 158 -73 -86 83 -15 -112 -92 -63 107 -189 59 -35 -73 94 -51 -83 -102 34 -127 278 38 126 228 34
2550C4J39k54J7M1K03j50J81j89j9R0j17J10j10j38O6P6k03K54o3j41K47M2L52
$$ 34 173 -81 -64 -23 180 30 211 22 3 93 -24 86 -24 -162 -96 -20 -223 31 -32 -173 74 116 468
2573D68l66J1l7j12J64M8k81O3Mj12K0K36mj42n6K5J51J6k25r9O7K4k8L68k64
$$ 468 102 113 76 -36 128 176 -105 -42 -38 -150 -130 106 102 -40 -96 -71 80 96 -129 -228 -161 -137 -165 203 -61
2598f1K29k41J72Kj88K83j75j15J53p9j53J59n8nJ57o9J20k12J15J9j21L8J95
$$ -61 168 -73 99 101 -87 196 21 -94 59 -20 -173 -14 -72 -77 80 11 131 -81 34 53 -68 -30 165
2621A65k75k28L17KR3l42J42J91j6k04K10KJ58j09k79J31J21q1l7J79k7k74K69
$$ 165 -110 -338 -21 -19 74 -268 -126 65 49 -155 55 57 215 106 -173 -42 79 -2 -39 140 113 -161 108
2644A08j10K17O0m78O3J09J14k20J28Q9k82J09L6K22j14l21J02L56k18j93J22
$$ 108 -2 215 275 -203 -140 -31 83 -137 -9 80 -202 -93 -57 165 51 -270 -168 188 -30 -223 -101
2665a01K06j86J10p6K50k97J46P5L67m48k9k2P2L1j05j68J89j11J05j27N7m3l3
$$ -101 105 -81 29 -47 203 -94 52 127 494 46 17 -5 67 98 -7 -175 14 -97 8 -119 -62 -105 -138
2688a38J61R5l2r0Nn3L10k34j41K26l3k9j46R2J26r4K37r3J46r6j86n7J2J08j39
$$ -138 23 118 86 -4 1 -52 258 24 -117 109 76 47 -99 -7 119 25 262 169 315 219 33 -24 -12 96 -43
2713d3J66m50L72j37J13J90k03J2J5M3J13k63O2k63K44O7L8l3J98j53j51J88k33
$$ -43 123 -327 45 -92 21 211 8 20 35 78 191 -72 -10 -273 -29 38 76 43 241 88 -63 125 -108
2736a08R9M5p9K5m1R4j26o4L3lO1J20J7j23K16j19j08j3J00k15j91L68m3R3k30
$$ -108 -9 36 -43 -18 -59 35 -91 -155 -122 -125 -64 56 73 -50 166 47 -61 -74 26 -189 -380 -12 -55 38 -192
2761a92Q8M21l42J08LJ01j49M5j04J56k32nJ74k90P9j01L68k54M7K65k46k3r3
$$ -192 -104 317 -25 83 86 187 38 83 -21 135 -97 -102 72 -218 -139 -240 128 -126 -79 186 -60 -83 -176
2784a76K5M31o25L12j56P6J27kM07m54n1K78j44j6j26k92L28k17Q5N4kR2K5l9
$$ -176 -151 280 -345 -33 -189 -113 14 12 419 -35 -86 192 48 32 -94 -386 -58 -275 -190 -136 -138 -46 -21 -60
2808f0J42r2j73r2M73m04K93j04J3L8o4J89k61OR6P3k9k17J49j36J49j38J07L
$$ -60 82 -10 -183 -275 198 -206 87 -17 -4 34 -30 159 -102 -96 0 73 44 -173 -24 -160 -11 -149 -42 -39
2832c9K3o3J93K71k56r4J26l37J66J67k64J40n01K13L87k30n9J64j91K82q6p3
$$ -39 -16 -79 114 385 129 35 161 -176 -10 157 -107 33 -468 -255 132 -98 -157 7 -184 98 12 -61
2854f1r3O7K47o8j49L17j74j89K05J7p5N2j71q3K38k19L28m74J70j20J36pJ29
$$ -61 -154 -87 160 92 -57 260 86 -103 102 119 44 96 -75 -158 80 -139 189 -285 -115 -235 -99 -106 23
2877B3j84K77j92q0P1K86j90L00l95O0Lk19RL22n1j87J36n8m0J65r7O5j35K75
$$ 23 -161 116 -76 -156 -85 201 11 311 -84 -24 -21 -240 -231 91 40 -147 -11 -69 -109 56 -41 24 -111 164
2901A64k64PR5j02p4L38j18m5Q6l4j52O8J81k21j88k7LoM50l96L87j8j20J38P2
$$ 164 -100 -93 2 -100 -174 164 46 1 87 53 -99 -31 150 -71 -259 -286 -283 -289 161 -235 152 134 14 152 224
2926B24j02k38J30J81J9k76r0J5P0r3J50j7j50J92p3p5l2J68K1p2J02j12K36j35
$$ 224 122 -116 14 195 214 -62 -152 -137 -67 -160 -10 -27 -177 15 -58 -133 -165 3 24 -48 54 -58 178 43
2950D3R8l7k31K45J5O4k31k7J59k62L44k38J1qlj20J88m2j60J19K03k46J64k9
$$ 43 141 104 -127 118 133 197 -34 -61 98 -164 180 -58 -47 -55 -58 -178 10 -32 -192 -73 130 -116 48 19
2974A9j72r6M0L04j91J01L44m22L39l14Q3K43m16K33k09P5r4k4L15j73j23Q8J36
$$ 19 -153 -249 -209 95 -96 5 349 -73 266 -48 35 278 -138 95 -114 -39 -133 -157 158 -15 -138 -50 86
2997H6k3j36K0m0qL60k60J69k98J70j37RK1N5J8J51l9k14K13l37M9K53kK91m65
$$ 86 63 -73 -53 -93 -101 259 -1 168 -130 40 -97 -88 -67 -12 6 157 118 -96 117 -220 -171 82 80 371 -94
3022i4K3j35L26j13M2k09K52j33j5P3J51L3L5j51l9m0R3j58o5J84j99M7K27j04
$$ -94 -71 -206 120 7 49 -160 92 -41 -56 17 168 201 236 85 46 6 99 -59 -124 60 -139 -92 135 31
3046C1J33jl00M09k57j12Q4Q4j68N6q2L04o0j14J05k79j0N4K0n0k0L5k5K37j66
$$ 31 164 163 -137 272 15 -97 -13 71 -97 -41 -123 181 121 7 112 -167 -177 -123 -103 -153 -173 -138 -163 74 -92
3071i2K9K8J73q5K2R2M7j12n5k76L07O3o2k59J68J62j87j19J57n2n8R9J1j41K46
$$ -92 -63 -35 138 53 75 167 214 102 47 -229 78 141 79 -180 -12 150 -37 -156 1 -51 -109 -10 1 -140 106
3096A06j41K5J1q0K31Q5m6l0j37o8J46l35J97k4P7k15K12J0M4q3K01j22J00n9
$$ 106 -35 -10 1 -79 152 237 191 161 24 -44 102 -233 -36 -60 17 -198 14 24 68 -15 186 64 164 105
3120A05J9j77J22k75K38j24N9n6L13k73o6Lj09J71r6L2j50K63p3L1M7k8j66n7
$$ 105 124 -53 69 -206 32 -92 -33 -89 224 -49 -115 -112 -221 -50 -146 -114 -264 -1 -74 -43 4 -24 -190 -247
3144b47K91J68l5j81j31K99j01j20J35k15j74M51n7J03l45p3J14K90l98L67k54
$$ -247 44 212 177 -4 -135 164 63 -57 78 -137 -311 140 83 186 -159 -232 -118 172 -226 141 -113
3165a13L2J22JJ20k01O9P0j10O6L9j25r6J90j75K33k26J04n5L9rj37J58j44J58
$$ -113 -81 41 42 162 -39 30 100 -10 56 95 -30 -126 64 -111 122 -104 0 -55 -16 -25 -162 -4 -148 10
3189A0j71J1J93r2K14j19O1j22N0L3j73J27Mj26J37l4J16l8o8m9J83k80n3K12
$$ 10 -161 -150 43 -49 165 46 107 -15 35 68 -105 22 26 -100 37 3 119 81 13 -36 147 -133 -186 26
3213B6m9j11Q6K79l79q0M20j00k61J16o6K30r5J37p3l69K38K7k21P0K57q7Q3m5
$$ 26 -23 -134 -48 231 -148 -228 192 92 -169 -53 -119 111 16 153 80 -289 -51 -24 -245 -175 82 -5 78 33
3237C3p9L45j37j32M7p6J38J8l1j30lj7K65k12J13m17L28j00K9r9J58j31k0N2
$$ 33 -46 299 162 30 77 1 139 157 126 -4 -7 -24 241 29 142 -275 53 -47 -18 -117 41 -90 -110 -58
3261e8K2J57k49K00l3k57K14J62k51J05N8j87K96l5j22j35M3PJ71k82l8J14k42
$$ -58 -36 121 -128 72 39 -218 -4 158 -93 12 70 -117 179 144 22 -113 -70 -63 108 -174 -212 -98 -340
3284c40L16Q3L7j53J06J31j61j5J4j17K17m52L42J48j32m8l8L43j23j24l4l9j42
$$ -340 -24 59 96 -57 49 180 19 4 18 -99 118 -334 8 156 24 -24 -62 281 158 34 0 -39 -181
3307a81K66j97J23J5n3nj31M77l62j79J83j12J99M6nj66q7P6N8j97L44j96O0L37
$$ -181 85 -112 11 26 -27 -32 -163 314 -48 -227 -44 -156 43 89 84 -82 -169 -93 -35 -232 112 -84 -24 313
3331C13l63J88Q6p2j27J91m9j89L6N0j28K3k04l1K98n8LlJ90k35j29L65m15L25
$$ 313 -50 138 224 152 25 216 167 -22 14 64 -64 -41 -245 -276 22 -36 -33 -36 154 -81 -210 155 -260 65
3355F5K09j74j85L0K70j91J99j73k10K42k26J24Q8j90J75q9K93j78l30L40k39
$$ 65 274 100 -85 -55 215 24 223 50 -160 82 -144 -20 68 -122 53 -36 257 79 -251 89 -150
3376a50K6K36j6l3m5j90L93j51J57p0m45K77R0j95k68L70p0J43k41K00j30K63
$$ -150 -124 112 96 63 18 -172 221 70 227 157 -288 -11 79 -116 -384 -14 -84 59 -182 18 -112 151
3398A51k06L13k77P9n0J7j42J23k6J36m4L9o6q2J6j10K41M0Jo8l4M2l1J29l11
$$ 151 -55 258 -19 60 10 27 -115 8 -18 118 74 113 47 -35 -19 -129 112 152 153 85 51 93 62 191 -120
3423a20o7J63L6j47K82j33j49K58k6J05k18L85n32J58j17K41l62J95o0M9j02J75
$$ -120 -187 -24 12 -135 147 14 -135 123 97 202 -16 369 -163 -5 -122 119 -243 -48 -108 -59 -161 14
3445A4m00M08%N7m9l0j34J26n1o3L38j16k4n9o5p0P6j10M83k10k30Q6O3l7J5J29
$$ 14 -386 22 22 79 30 0 -134 -8 -59 -122 216 100 76 17 -48 -118 -42 -152 331 121 -109 -23 40 3 18 147
3471A47J44l88n7J28J07k56N7K83k25j3Q2K30l40Q7J94m39J70L36k28P5k87J76
$$ 147 291 -97 -154 -26 81 -175 -118 165 -60 -73 9 239 -101 -14 180 -259 -89 247 19 94 -193 -17
3493a7M1J42k27J4J93j30m0p6j19P7J77K04l39N2l0J21J31q1o9p8J37Nj77q9j72
$$ -17 24 166 -61 -47 146 16 -24 -100 -219 -142 35 239 -100 -48 -78 43 174 93 24 -54 83 88 -89 -178 -350
3518c50M93k10j75L58p9J8r4k2n0l4J77%l5J83l59N9RK43j02k4Q3k56k9J06m9
$$ -350 143 -67 -242 116 37 55 -39 -61 -111 -145 32 32 -3 180 -179 -120 -111 132 30 6 89 -167 -196 -90 -139
3543a39J78m1J45k76J66J3r2j43J1N7p5M10j69j98o1lK03J07l41J23J09J09j35
$$ -139 39 -2 143 -133 33 46 -46 -189 -178 -121 -196 214 45 -153 -214 -217 -14 93 -248 -125 -16 93 -42
3566d2j11J92j53Pj64J18Q9P0J87j7p3j16o3N7J07k09J49p8J9N6L3l9Rk2k07Q9
$$ -42 -153 39 -114 -107 -271 -153 -64 6 193 176 103 -13 -76 -19 88 -121 28 -50 -31 25 58 19 28 6 -201 -112
3592a12p4kO4J14j49L42m12K70oj02J70l17K87p7L0j23J10j01J3J01k02K36l1
$$ -112 -186 -188 -124 -10 -159 183 -229 41 35 -67 103 -214 73 -4 26 -97 13 -88 -75 26 -176 60 29
3615B9o9J49L6j80L38j49k59M97k32m1j11J8k82K17K8j54Q9R5j8j12K3Q3M2L9
$$ 29 -40 109 145 -35 303 154 -105 392 160 119 8 26 -256 -39 -11 -165 -76 19 1 -111 -88 -5 37 76
3639G6l7J77r5o1q7Q7RJ13P9n03K47m7J50k5k4l07P3K72P3k58N7J47k24l4K25
$$ 76 39 216 121 60 -27 60 69 182 261 -242 5 -42 108 83 59 -248 -175 97 170 -88 -31 116 -108 -142 83
3664H3j42O1n0l4r7J81o4k9J03p0l0j5R3Q2k1M1j65j43O5j06K69RL9k25L0J79
$$ 83 -59 2 -48 -82 -179 2 -62 -91 12 -58 -88 -103 -10 72 51 92 -73 -216 -151 -257 12 21 60 -165 -135 44
3690D4j49O1M8P3R5k20J88r6O6p2k18j44K68N9n3p1J35R5m42K06K35k91K36J7
$$ 44 -105 -44 4 77 172 -48 140 44 110 38 -180 -324 -56 3 -50 -121 14 109 -333 -127 108 -183 53 70
3714G0j22K12N0r7j58l8J00k9J06np7j59J17j6M5o0k64K01K86k26j78J62j71J85
$$ 70 -52 160 210 113 -45 -83 17 -12 94 89 12 -147 -30 -46 -1 -61 -325 -124 162 -64 -242 -80 -251 -66
3738f6l5K85R1k14j09J84o7k11K69j91K11k55l6J83r4MK0J15j79J33l78K74j30
$$ -66 -101 184 275 61 -48 136 69 -142 127 -64 147 -108 -144 39 -55 -51 -31 84 -95 38 -340 -66 -196
3761a96j8J82K4K5r0JK38nq9M3p1j44J75j49nJ24J3j87j37J95J72k27P8J79k93
$$ -196 -214 -32 -8 17 -73 -72 166 161 72 115 44 -100 75 -74 -79 45 58 -129 -266 -71 101 -126 -48 131 -162
3786a62J57o5Q3j08J81l75K23L21j63j67l7L61j98L2R5k15O2n0J36k23Pj19L04
$$ -162 -5 -70 13 -95 86 -289 -66 255 92 -75 -112 249 51 83 178 -37 25 -25 111 -112 -105 -224 80
3809H0r6K31k76J5J31j1j64k81K91j66M08j87n7R6J51j91O7L3j75J16j02K27j17
$$ 80 -16 215 -61 -46 85 74 -90 -371 -80 -246 162 -25 -82 14 165 -26 41 74 -101 15 -87 140 23
3832B3j06K80k50J17j31j85J45J45J8j21k07J31K30l6p5mON7j94R7n7J6O5j33
$$ 23 -83 197 -53 64 -67 -252 -107 38 56 -65 -272 -141 89 53 -22 -26 -20 37 -157 -60 -117 -101 -36 -169
3856a69O5K17k06K17K0J58l99P9q5K41J24l63O2k6R7j11K07l73K36r9J38j78J12
$$ -169 -104 113 -93 124 144 302 -97 -18 -103 138 262 -101 -39 -65 32 -79 128 -245 -9 -108 30 -148 -36
3879c6M8j44J21j47RK62j96k5J60J8J75l30M9Oj9Q5J10J80k31j1r7QN0j15J19
$$ -36 12 -132 -11 -158 -149 113 -83 -108 52 70 245 -85 -36 -30 -49 36 146 326 95 84 -13 -5 45 -70 49
3904D9nr5J82j15k29L48k74J88j35J09q7J74l23Q6k8J66J17j68J52j99J22Q4n5
$$ 49 44 -51 131 16 -213 135 -139 49 -86 23 -64 110 -213 -127 -155 11 128 -40 112 -87 35 119 64
3927F4J55r1O5k07O3J0m4p9J98j98m02N02j55J96nJ2k34M6K41k21J48p0P8k25
$$ 64 219 128 193 -14 49 59 15 -64 134 -64 -466 36 -119 77 72 84 -150 -104 137 -84 64 -6 72 -153
3951a53m1J7J26Q5k1P0j09K04m24K66m4j60J18j68J92K42n1l06L19m2M7l02J44
$$ -153 -194 -177 -51 34 13 83 -26 178 -246 20 -24 -184 -66 -234 -42 200 149 -157 162 120 167 -135 9
3974Ij07J91n2L1k82J36L8K00k43J53Q2k9nj12m8R4j71J45K58k61j20K46%l6n
$$ 9 -98 93 41 72 -210 -74 -36 164 -79 74 156 127 122 10 -38 56 -115 30 288 27 -93 153 153 117 112
3999A12m3L3m2l65L22o8M7J14j14O6l0r8P7MK04k65QK01r7j48J48j31K32p8p7
$$ 112 69 102 60 -305 17 -51 -4 110 -4 62 32 -66 11 15 219 -46 -38 163 66 -82 66 -65 167 89 12
4024A2r7p2K25r1R1o9q3P4R4M6Q5j2P2m4j46j34j1r5K18k44L7J80j18J56J7J99
$$ 12 -85 -157 68 -23 68 -1 -84 -10 84 130 215 203 275 231 85 -49 -60 -155 63 -181 -144 36 -82 74 91 290
4050B90k21R1k93J88j35R7k68M03j22k78J57J67J8K56k29j13q5J42k40j04K40
$$ 290 69 160 -133 55 -80 17 -251 152 30 -248 -91 76 94 350 121 8 -77 65 -175 -279 -39
4071c9J8R2q1j9k3L43k96n4J34j35J6K49P9l45L6J89m21n3J73L49l35Q1L23l03
$$ -39 -21 71 -10 -29 -52 291 -5 -59 75 -60 -44 205 284 -61 -25 164 -257 -310 -137 212 -123 -42 281 -22
4095b2J23ql18J54k65K04K24j46J04k91K02J06K18l52q1P8l8J14k0J49k30N4J50
$$ -22 101 93 -225 -71 -336 -132 92 -54 50 -241 -39 67 285 -67 -148 -70 -108 6 -14 135 -95 -41 109
4118A09q6j01o9NJ10K42r8j24j17K50j02k81P7J31k31Q5r1K88J07j16m10O44k49
$$ 109 23 -78 -147 -142 -32 210 112 -12 -129 121 19 -262 -185 -54 -285 -200 -291 -3 104 -12 -422 222 -27
4141b7Nk78J01K68Nn8J13n5P2r0J67l59j8J36O8k15l4J55J32j24k9L27k46n8J16
$$ -27 -22 -300 -199 69 74 16 129 74 146 56 223 -136 -154 -18 50 -165 -199 -44 88 -36 -65 262 16 -42 74
4166G4p1k46M74k52J83l10J49k50M89k59J44N6O8j00k5j08k4j30K65rl32K24O9
$$ 74 3 -243 231 -21 162 -148 1 -249 240 -19 125 181 249 149 124 16 -8 -138 127 118 -214 10 79
4189G9L3k25J13Q9j43R9q3j2J40k85Q2j20J82K55q7L0l73K08R9n4M7j32L08k18
$$ 79 112 -113 0 89 -54 45 -38 -50 90 -195 -113 -233 -51 204 117 147 -226 -18 81 27 74 -58 250 32
4213C2J76q4j67m0n7R0J91k77L44j7L6j47k36L05k92J94jl37K52j53J43J82j06
$$ 32 208 124 -43 -83 -140 -50 141 -136 208 191 227 80 -156 149 -143 51 50 -287 -35 -188 -45 137 31
4236C1l4K59k24m7J04o9J54l29r8L1L75j34k21K89J4l20M47n7r4l7JJ19k24j7
$$ 31 -3 256 32 -15 89 20 174 -155 -253 -222 153 19 -202 87 101 -219 228 171 77 40 41 160 -64 -81
4260h1q7J29K5j50J71J70k3m7K7j47j29K16o6k5P6l47J88oJ34j77j3K47K60l52
$$ -81 -168 -39 -14 -164 7 177 154 107 134 -13 -142 74 8 -17 59 -288 -100 -106 28 -149 -162 85 345 -7
4284gN6j33Q7l7R0j30p4J96J59j35J63m05J46p1J01k1J9p3K08m13J52L32j61k38
$$ -7 49 -84 3 -34 56 -74 -148 48 207 72 235 -170 -24 -95 6 -15 4 -69 139 -274 -122 210 49 -189
4308a89K6K88j58K40k04J26l15J98j43J49J15j88k29Q6q6L46j56m0N49n15K57
$$ -189 -163 125 -33 207 3 129 -186 12 -131 18 133 -55 -284 -198 -284 62 -94 -134 415 -100 157
4329A57k82K05m6j35J09n9Q0o4j1l1m5Q1O2j6j70L1Q6J17j59J13j23RJ13k18Q6
$$ 157 -125 80 34 -101 8 -51 29 -35 -46 -77 -122 -41 21 5 -165 -134 -48 69 -90 23 -100 -91 22 -196 -110
4354a10J75J02k5q1O5q2j57j44N28j91j32k44M69k4k14J55j73O8j0O3j34J19l6
$$ -110 65 167 142 61 126 44 -113 -257 271 80 -52 -296 173 149 -65 90 -83 -15 -25 38 -96 23 -13
4377a3J29j22l77K73l9K01J7N5l51l2J7J39K01q5M9j57J23k09K21J09j48lJ2k19
$$ -13 116 -6 -383 -110 -149 52 69 124 -227 -259 -242 -103 98 13 62 -95 28 -181 40 149 1 -2 10 -209
4401b09K28P5K23k96M0nj04N2j25j15K25k83L91k08J62m5J69j89O3j31M09k64
$$ -209 19 94 317 21 61 56 -48 4 -121 -236 -11 -294 97 -111 51 6 175 -14 49 -82 327 63
4423F3j57J88j99K13n7k23M03l23J03K47k70J44j11M9Q4j93M1q0p4M70m47J06
$$ 63 -94 94 -105 108 51 -172 231 -92 11 258 -12 132 21 70 154 -39 2 -78 -152 318 -129 -23
4445b3J41j91j47J07J54J46l00j71J34K56r9K04k02j16n3L40j20k18K69k70K3
$$ -23 118 -73 -220 -113 41 187 -113 -284 -150 106 7 211 9 -107 -160 180 60 -158 111 -159 -136
4466a36J54j17J63k12j21L36j71j0J44O8l46O2mJ36K2m2L71k90J65j16K5j0k37
$$ -136 18 -99 64 -148 -269 67 -104 -114 30 98 -248 -186 -190 -54 -32 -74 297 7 172 56 81 71 -166
4489a66K50j12P3j52J05j80J02J45j80nK73j32n2K0K60j72n2l7j69K16L5l4M5
$$ -166 84 -28 45 -107 -2 -182 -80 65 -115 -120 153 21 -31 -11 249 77 25 -12 -181 35 70 36 81
4512H1l04J42M8J30j01j50Q8K16j82J06N8j32J81j12Q2k91m4L5l7K14j31K96k40
$$ 81 -223 -81 -33 97 -4 -154 -66 150 -32 74 132 0 181 69 151 -140 -184 -149 -186 28 -103 193 -47
4535d7J01j03O5N2m14J15K36r6p4K40mk18J44L5Q6p6k59M79l38K51j53n6J8K1
$$ -47 54 -49 16 68 -346 -231 5 -91 -165 75 71 -147 -3 32 118 42 -217 262 -76 175 22 -34 -16 5
4559EL5J07Qj28m0N9q0j47Q7nJ12j91L18k2j96J30L4o6Lj1j5M5q3j67K45j87K2
$$ 5 40 147 155 27 -13 46 -34 -181 -94 -99 13 -178 140 118 -78 52 86 20 23 12 -3 42 -41 -208 37 -150 -128
4586a28M2M2j21R6l8k1J0L35l67J23J63J42k94k81J75L1J96k63l5N5J11J9j6J6
$$ -128 -86 -44 -165 -69 -107 -128 -118 217 -150 -27 136 278 -16 -297 -122 -91 105 -158 -193 -138 -27 -8 -24 -8
4610hq1O2J74j93J55m0O0j79K87k08j06O0mj64L31j97J72l7k40K92m8j00j28K17
$$ -8 -89 -27 147 -46 109 69 129 -50 237 29 -77 -17 -21 -185 146 -51 121 84 -156 136 88 -12 -140 77
4634G7Pl23L10j20K93l52j19M53m37n0K22m5N3L19k00j60L31k6j60J03J6k83J85
$$ 77 84 -239 71 -49 244 -108 -227 226 -211 -261 -39 -84 -31 288 88 -72 259 233 73 176 192 -91 94
4657I4l04L56m55K69K11j67j22J99K02m76n6L64k22M2q7K44m9L0K02j80l09L65
$$ 94 -210 146 -309 -40 171 4 -118 81 283 -193 -249 115 -107 -65 -152 92 43 73 275 95 -214 151
4679A51j32l5K31j74J47O8k52j50j74L43K45l77J16J26j39M7r8L22k76K13j99
$$ 151 19 -16 215 41 188 256 4 -146 -320 23 268 -109 7 133 -6 41 -57 265 -11 202 3
4700CJ81j24J26J1R0j30m3Q1l15K60m58J99O2j27K01o5Q8k15L85l47L34k25o9
$$ 3 184 60 186 197 287 157 114 195 -120 140 -318 -119 -57 -184 17 -48 40 -175 210 -137 197 -28 -97
4723i7J92m4M0P8k06J15k55K25j57qO9O7k07K00j4j83J84N6j52Q2Kk9n4m1J49
$$ -97 95 51 91 169 -37 78 -177 48 -109 -117 -48 19 -188 12 -2 -185 -1 55 -97 -15 -13 -42 -96 -137 12
4748A2J79J08l52j63K44J42j95J29k47lQ7J31m2K62k31k64J20J98j10N6m6J17
$$ 12 191 299 -53 -216 28 170 -25 104 -143 -146 -59 72 30 292 61 -203 -83 115 5 61 15 132
4770A32k24K13k41K60j44m5j06J68lJ70O5l05J75k05K4k06M41j60k93L57J2r6
$$ 132 -92 121 -120 140 -4 -49 -155 13 10 180 245 -60 115 -90 -66 -272 169 9 -284 73 85 -11
4792a1L6K0o2rK17j20k3k10K34J20j69J00j41J00j39M50m72L36l82J25m2J68j01
$$ -11 25 45 -17 -26 191 71 48 -162 72 192 23 123 -18 82 -57 393 -79 257 -125 0 -42 126 25
4815B5rJ50l29M1Q3J68j65K7l21N2L54J02k08m7J26M0m2k27K34j76L51l76k0J84
$$ 25 16 166 -163 -122 -39 129 -36 -9 -330 -278 76 178 -30 -77 49 89 47 -180 54 -122 229 -147 -167 17
4839A7J85k17j94N46l98l6K39j31j68K29k83K27j60R8j66R9J98j44l4j09L33j85
$$ 17 202 -15 -209 337 -61 -97 142 11 -157 72 -211 16 -144 -46 -212 -113 85 -59 -93 -202 131 -54
4861e4J55k16Q2k8M9J44j08j55K56q5j19M6k24L16o3O8j98K17j01L8j52O4K0J37
$$ -54 101 -115 -33 -61 -12 132 24 -131 125 40 -79 -33 -257 59 -4 64 -134 83 -18 20 -132 -68 -48 89
4885H9l0k3j31J47l2j45K35k37O2J41j30j00J66K48l29Q9O7j7J77l23PK1J55k17
$$ 89 59 36 -95 52 20 -125 110 -127 -65 76 -54 -154 12 260 -69 20 87 70 247 -76 -69 -48 107 -110
4909a10L59n30K84k10J54J04k16J40J16j05j95K73k12L31j78L4j80K4K5K14j91
$$ -110 249 -281 3 -207 -53 51 -165 -25 91 -14 -209 64 -148 183 5 39 -141 -117 -92 122 -69
4930f9P7Q4o5J04j19l1J49k17j17K04J74j58O1m0J4k2j96K79j18Q1l8j89Q4M0
$$ -69 8 92 27 131 12 -19 130 -87 -204 0 174 16 77 37 51 29 -167 112 -6 75 37 -152 -68 -28
4954b8j13K35J59o9q1r4R3k8k33J54L7l5M7Q5k44J4J97k40J74J9r2J90M1k79N7
$$ -28 -141 94 253 184 103 9 102 74 -159 -5 32 -3 44 129 -115 -101 96 -144 30 49 -43 147 188 -91 -34
4979c4k94j1K42J58j44J76j16K04j24k33M53k74J35k52O3J62o9L3k02J62R9LR
$$ -34 -328 -339 -97 61 -83 93 -23 181 57 -176 277 3 138 -114 -51 111 42 75 -127 35 134 137 146
5002A46j38j35J80J32k03K1J6j7Q0k44M5J08r2N4R6oQ0QL6r5j03P2K7k55J47n1
$$ 146 8 -127 53 185 -18 3 19 2 82 -162 -117 -9 -101 -47 49 43 123 131 167 72 -31 41 68 -187 -40 -91
5028i1j69K26K8J02m3J14l6k66mL44j86j69j9J96k2j08J44j15J72k6P7l04j91
$$ -91 -260 -34 -6 96 53 167 131 -135 -139 205 19 -150 -169 27 5 -103 41 -74 98 72 149 -155 -346
5051c46J37P4K47j28j2N6k5K70k7j77J53Kl66K9J86r1j94J63P5l35K60K02k16
$$ -346 -209 -135 112 -16 -28 28 3 273 246 69 222 224 -142 -113 73 -18 -212 -49 26 -309 -49 153 -63
5074f3J83j92K07l40L83k84l1J91J0j67K24j46J8Q1j53J38k51K28j2j18n9Q0L60
$$ -63 120 -72 135 -205 178 -106 -137 54 64 -103 121 -25 -7 74 -79 59 -192 36 24 -94 -153 -73 287
5097B87l71J06N8j19P0j37o8J69qk19L07j67q3K17k69L42J1J21k51O9O0j47n8
$$ 287 -84 22 80 -39 31 -106 -174 -5 -13 -232 75 -92 -175 42 -227 115 126 247 -4 65 125 -22 -80
5120h0J6k39J55K57O4k76K44j22r7R3J7o2K41k76r9J09j18o6O8K65j1n9J02k36
$$ -80 -64 -303 -148 109 173 -103 141 19 -78 15 32 -30 211 -65 -164 -55 -173 -239 -171 94 83 24 126 -110
5144a10K4p2lJ59j71O7j00K73Q1j97Q3J0N8qOo8j98J99J19l72J20oj57K83n0L9
$$ -110 -86 -158 -161 -2 -173 -106 -206 67 148 -49 34 44 102 94 100 32 -166 33 152 -220 -100 -106 -263 20 -30 9
5170IN3J22j66K23m0r3J7K8oJ8j03n7J89j81k0j43K90j63L03j95K1k38J77k13
$$ 9 62 184 18 241 201 108 125 153 147 165 62 5 194 13 -7 -150 140 -23 280 85 106 -132 45 -168
5194a68m3K57l72K91Q7j50R0j45R5n0J80l7j85M0K97n2J24j90n56M85n4mo0O6
$$ -168 -211 46 -326 -35 52 -98 -8 -153 -58 -108 72 35 -150 -110 187 135 259 69 -487 -2 -56 -60 -120 -54
5218e4o5K97K6m47K45l9J40j42K45k65l0n1K82j94k56K51o5K2J57j70J21J49n6
$$ -54 -119 178 204 -243 2 -37 103 -39 206 -59 -89 -140 142 -52 -308 -57 -122 -100 57 -113 8 157 101
5241A01j84L8J58k60O3L6K98k64N7J26l18J90j24J20J72k22J75m32L17k09L83
$$ 101 -83 -45 113 -147 -84 -48 250 -14 43 169 -149 41 -83 37 209 -13 162 -270 47 -162 221
5262B21j93J2j79J31Nj0J18j63j7k55L24J58j1k16J70o8kk30J81N8j43K93k10
$$ 221 28 40 -139 -8 -3 -13 105 -58 -75 -330 -6 152 141 -75 95 27 25 -205 -24 34 -109 184 -26
5285b6j8j3K59o68M80o1K62j17j45Q1J23k25n0Q3RL34k29j28Q4kj12j04J84q1
$$ -26 -44 -57 202 -466 14 -47 215 98 -47 34 157 -68 -118 -35 -26 308 79 -49 35 33 -79 -183 1 -80
5309h0m1j30J87J0J28k1J3q3k11M16l80K54L8o1J11k19L8j36K83K8N0o3k62j1
$$ -80 -121 -251 -64 -54 74 53 66 -17 -228 188 -192 62 100 39 150 -69 -31 -167 116 144 194 131 -131 -142
5333a42L5P2J96j55k10L51K3j57J29k21j0K90l63J21J87QO9o7j31l3j8Q7j6j63
$$ -142 -107 -35 161 6 -204 147 170 13 142 -79 -89 201 -162 -41 146 154 223 156 25 -8 -26 61 45 -118
5357a18P5m7k0J35K9j52R8l2o5J39J30j11R0l37Q1K80r8j10K72k71O3j03kq4J12
$$ -118 -43 -90 -110 25 54 -98 0 -32 -97 42 172 61 151 -186 -105 175 77 -33 239 -32 31 -72 -74 -158 -46
5382d6o6L23m62K73J58j76k33M8Q8Q4lL72l24j95R1M05l33l53J1K70P6N0r4N3
$$ -46 -112 211 -251 22 180 4 -229 -181 -93 -9 -12 360 36 -159 -68 337 4 -349 -338 -68 8 58 -36 17
5406A7J27m03K13l9J43k49L35j54j0j42K54P0k48Q5L18m42L93l36J03j58J90m1
$$ 17 144 -259 -46 -85 58 -191 144 -10 -20 -162 92 162 -86 -1 317 -125 268 -68 35 -123 67 26
5428B6J36j98o0J20J56k78j5L00j79r4Q0q4J11r8r%km0j8j11N41k41l26M23q4
$$ 26 162 -36 -96 24 180 -98 -113 187 8 -86 -6 -90 21 -77 -86 -86 -88 -128 -146 -257 284 43 -283 140 56
5453E6k66K83M7n4n8J21M1l54L96j82Q0p2k31K16p4J14J23q6k3J6O8k91j79N67
$$ 56 -210 73 120 66 8 129 170 -184 212 30 110 38 -193 23 -51 63 186 100 77 93 161 -130 -309 258
5477B58k63K4J44k66K71q4j95P1Mp3K14q2J06%l38Q7N5J9Q0j50J27L4M0Oj66K35
$$ 258 -5 19 163 -103 168 84 -111 -40 -36 -109 105 23 129 129 -209 -122 -67 -48 32 -118 9 43 83 89 -77 158
5503A58k20L46j24k84K77k24J88m2j25K9M3k4OP0Q1k92J99j36J12J43k39O9j66
$$ 158 -62 284 160 -124 153 -71 117 75 -50 -21 22 -2 4 74 155 -137 62 -74 38 181 -58 11 -155
5526a55j65P5P6L77l86J51J56l95M91j38l75K54J15l4M2k01K6J39q6j04J40Mj83
$$ -155 -320 -245 -169 208 -178 -27 129 -266 225 87 -288 -34 81 47 89 -112 -86 53 -33 -137 3 7 -176
5549a76R3MJ33n0K5J4r8j42K53q8pJ5n1K4J27q4N2m9P7j9j39k71N05n1o0n2k31
$$ -176 -83 -79 54 4 29 43 -55 -197 56 -32 -39 -24 -75 -51 76 -8 44 -5 72 53 -86 -357 148 97 37 -15 -246
5576b46L26k92K04j13J31j97J87KP0m8j9o7J01J1j48J66%j05J78j36J36j8l72
$$ -246 80 -212 -8 -121 10 -187 0 2 72 24 5 -62 39 50 -98 68 68 -37 141 5 141 123 -249
5599b49L61L8j93j0K93j97k37J94o8j36K59q2p1L02j3j28j25K27n7KK53m54oL73
$$ -249 112 150 -43 -53 240 43 -194 0 -68 -204 55 -27 -98 204 191 63 -62 165 108 110 363 -91 -97 276
5623B76l84J65L5j14j4J19j06m5J26p5J43k87n0K67k23K77o6r7%J99J5j95%J18
$$ 276 -108 57 92 -22 -36 83 -23 -68 58 -17 126 -161 -211 56 -167 110 44 -53 -53 146 161 -34 -34 84
5647H4q1q8K77j83R4p1L0O5k53J61K5J38j99K04l4j96l12K86q5K43k6m5j08J5
$$ 84 3 -85 192 9 103 32 62 127 -126 35 60 198 -1 203 169 -27 -339 -53 -138 105 79 34 -74 -59
5671e9km0LJ96r6L0Q7j6k75O0K22o3j31O9J57K1k5j72l8J06o6M1j74J95l1k11
$$ -59 -61 -101 -98 98 2 32 119 103 -172 -112 110 47 -84 -15 142 163 138 -34 -72 34 -32 9 -165 30 -1 -212
5697b12L00l28K23j26j57L48K22l34j26J69R1j5k0j0q6JJ47p4j41J05L5J88j85
$$ -212 88 -240 -17 -143 -300 48 270 -64 -190 -21 70 55 35 25 -61 -60 87 13 -128 -23 12 200 15
5720A5k00L27k35J62j23R5k18P2J33K7j71J60P1j27j40J03J65j75K1M2k3p0q3
$$ 15 -185 142 -93 69 -54 41 -177 -105 28 55 -116 44 115 -12 -152 -49 116 -59 -38 4 -19 -89 -172
5743a72j9K19m9J70j4Kl21K6L18k18J3l0J86j98O3m0k2L9m57L05L26j02L9m8Q4
$$ -172 -191 28 -21 149 135 137 -184 -158 160 -58 -45 -75 111 -87 -24 -64 -86 -47 -504 -199 127 25 64 16 100
5768A00K02j34k01j44J10J71j4J19l46K57J25m57J83JJ63l13l1K40J1J45j88J10
$$ 100 302 168 -33 -177 -67 104 90 209 -137 120 245 -212 -29 -28 135 -178 -209 31 42 187 -1 109
5790A09l4j1j25j59L86j79j21Q7j30K81o8p0O5j91O4J8MO9j8m7R9j87K76k40R5
$$ 109 75 64 -61 -220 166 -13 -134 -47 -177 104 36 -34 31 -160 -96 -78 -74 -5 -23 -70 29 -158 118 -122 -27
5815b7P9j05r0K62j28K08k04K55j20l03J03j01K12j53K77k21J85r8N6q9q8J11
$$ -27 52 -53 -143 119 -9 199 -5 250 130 -173 -70 -171 41 -112 165 -56 129 31 87 -2 -90 21
5837B1l2o4J89k74M26l87l0L66j25K0K02j34k81J17k24N4k4K39j56M28l42M3j7
$$ 21 -11 -75 114 -160 266 -121 -151 215 90 110 312 178 -103 14 -210 -156 -180 59 -97 331 -11 32 15
5860A5n2k6j7R0k4ML2j78J28r8J01M7n0L05j12j49j76L71l41mQ2m2J2J03Q7K0
$$ 15 -37 -63 -80 10 -14 -10 22 -156 -28 -126 -25 22 -28 277 165 16 -160 211 -130 -134 -52 -94 -82 21 108 128
5886A28n1l1q0K24j93r9L19k27O4k06M63n48K93n3PJ58l37K96k35J03j4LP8o0
$$ 128 77 46 -34 190 -3 -102 217 -10 54 -152 311 -237 56 3 10 168 -169 127 -108 -5 -19 -16 62 2
5910Bk0j2j2N5P6k6j41j29K43P9p4J6P8Lj1p5j03L08l38P3r5k5K00k02P7K9P9
$$ 2 -18 -30 -42 13 89 63 -78 -207 36 115 41 57 135 138 127 52 -51 257 -81 -8 -103 -128 72 -130 -53 -24 55
5937E5m9J45j54o8J05k53J96Q2L0j40k10M36l50M1J11J00j17q4K43m05L55k20
$$ 55 6 151 -3 -71 34 -219 -23 59 89 -51 -261 175 -175 -134 -23 77 -40 -124 119 -286 69 -151
5959a51J42m2K92j94R9k11Q9k37L84j13j91rj13M16k72r7R1L39k31R6l1n5K9L7
$$ -151 -9 -51 241 47 146 -65 24 -213 171 58 -133 -142 -255 161 -111 -208 -117 222 -9 87 56 1 30 67
5983F7j02r2k91M56j07J43j68m5J11k7J08j46M6O7pR6j03o6O8J5Q8J9j06oJ5o1
$$ 67 -35 -127 -418 38 -69 74 -94 -139 -28 -55 53 -93 -47 20 13 109 6 -60 8 23 111 130 24 18 33 -28
6009b8l16L62j69J33J8j54J15J33k84K95NL4j85K46k68k12M37N5j13J44o7k07
$$ -28 -344 18 -151 -18 0 -154 -39 94 -190 105 110 144 -41 205 -63 -275 162 217 104 248 181 -26
6031b6N6nj07K68o8Q0j45K8m3j86OJ33j68O7j6Q8L4O6M5l0J11m2j09m7n2J43q3
$$ -26 30 25 -82 186 118 198 53 81 38 -148 -142 -9 -177 -110 -126 -38 -4 62 107 77 188 146 37 -10 -62 81 -2
6058bL7J59m31J05K85nl71K75o6j50J47QJ65k27r1J75ql57K39j71J21K50o1l05
$$ -2 35 194 -237 -132 153 148 -223 52 -14 -164 -17 -9 156 -71 -162 13 5 -352 -113 -284 -163 87 26 -279
6082b79M54p3j41M8k96L58j61J55r1J05j53K56j97k37M44k70J53MN0j49j83J94
$$ -279 175 102 -39 9 -287 71 -90 65 -26 79 -74 182 -15 -252 192 -78 75 79 129 -20 -203 -9
6104im1K12L3k32r8K73K36l30k24K61k72K73J92l41R6j42M3j29OK46J25k67j8
$$ -9 -50 162 195 -37 -135 138 374 44 -180 81 -191 82 274 -67 29 -113 -70 -199 -193 53 178 -89 -107
6127a07k2j22K86J01j11J84j39m7k45J96mn2J53L2j72K64l77J92j7J82k43J56
$$ -107 -129 -251 35 136 25 209 70 23 -222 -26 -30 -82 71 103 -69 195 -182 10 -7 175 -68 88
6149H8j09j97L40q7J48m5j02j16J42k72L69l03R4j32R9K58j35Q0l4j10J43k10
$$ 88 -21 -218 122 35 183 138 36 -80 62 -210 159 -144 -50 -182 -83 175 40 120 86 -24 119 -91
6171i1M5J36l57L02l92L48J26q1q1K41n06K59J75J33k27L0O6p1k89N24l06P1j31
$$ -91 -46 90 -267 35 -357 -9 117 36 -45 196 -310 -51 124 257 30 60 126 55 -234 290 -16 55 -76
6194g6j46J40J44Rj67L38m43K46ML1k23K1J51n3k1r8O4m5Q7R9j52m8K71j92K10
$$ -76 -222 -82 62 71 -96 242 -201 45 49 80 -143 -122 29 -24 -45 -143 -79 -124 -37 62 -90 -138 133 -59 151
6219A51l04J64j58R2j52R9j30J86j3%j13M39l30M4K03l11N7J4J68k48j27L22K
$$ 151 -153 11 -147 -55 -207 -108 -238 -52 -65 -65 -178 261 -69 -25 178 -133 -76 -62 106 -142 -269 53 55
6242E5o0M8N0k34L42o6j6l9j18J15m9N7l47K77Q3l61K01k8L05o2j04q7Q5m7j4
$$ 55 -5 43 93 -141 201 135 119 80 -38 77 28 85 -262 15 98 -263 -62 -90 215 153 49 -38 47 0 -14
6267a4J81j92Mj50j2J4K04P4k15j0J50L0j77j02R3k94M16p9j42K36N6J70m03J33
$$ -14 167 -25 -21 -171 -183 -169 35 109 -106 -116 34 64 -113 -215 -122 -416 0 -79 -221 15 71 241 -162 -29
6291b9L9R0j04mm7Q9r4L4J23J18l9q7m28K39O2J05p1j2j88K61k28R0J88k86P0
$$ -29 10 100 -4 -8 -55 34 -60 -26 97 215 176 89 -339 -100 -38 67 -4 -16 -204 57 -171 -81 107 -179 -109
6316a09K66J1j6K6N4m28K13O7j95q9J84K06l74RM8M4J80j16J7M4j30r6K81j87
$$ -109 157 168 152 178 232 -196 17 84 -111 -200 -16 190 -184 -175 -127 -83 97 -19 -2 42 -88 -184 97 -90
6340i0J08J29l1O9j99R4k43K99j45j35q5K51J3q1r7q0m2N16p7j47R2q3j79K29
$$ -90 18 147 116 185 -14 80 -163 136 -9 -144 -229 22 35 -46 -143 -223 -265 251 174 27 119 36 -143 86
6364H6j18K43k85o1j6K13O4j2k48J25k1R7J01o8j52M08k05l24O1n6R8K56J45m09
$$ 86 -32 211 -74 -135 -151 62 126 114 -134 -9 -30 67 168 100 -52 356 151 -173 -112 -168 -70 186 331 -78
6388g8J46k71N9J75m0k09K62R4j97jL3j48j0O2J30J31p6J16l84J6J60N8j01r7
$$ -78 68 -203 -144 31 -9 -218 44 138 -59 -60 -27 -175 -185 -123 7 138 62 178 -206 -190 -30 28 -73 -170
6412a70L1J08O1n0r8l1n0M6J99k2J5J58j61k65K34m9L5k04K02n3j69K62nj74J87
$$ -170 -139 -31 30 -20 -118 -149 -199 -153 46 24 39 197 36 -229 5 -44 -9 -213 -11 -64 -233 29 24 -150 37
6437C7k16O0j43O9Q9P7Q4P8O7k61j0J37l6%k4K8j28P0k3Q4j57L71k36j45Q3K69
$$ 37 -179 -119 -262 -193 -104 -27 57 135 202 -59 -69 68 32 32 8 36 -92 -22 -45 39 -118 253 17 -128 -45 224
6463B24m50J91lj04J05r2P6O1J4j68J52O1p8L8j04l6O9p1J63R9Jj32K68l25J68
$$ 224 -226 -35 -38 -142 -37 -129 -53 8 22 -146 6 67 -11 27 -77 -113 -44 -115 48 147 148 16 284 -41 127
6488A27j52j67K23O7j47N6M4j03L8r8m6J05P4o0r9J28k13K42l3j56M1L61j38j60
$$ 127 -25 -192 31 98 -49 7 51 -52 -14 -112 -158 -53 21 -39 -138 -10 -223 19 -14 -170 -129 232 94 -66
6512f6K1J6k6Pk79K42m4kN6J07k76J05j07K95N8J17j12j05%q2J21j3j94J53Q2
$$ -66 -45 -29 -55 -48 -327 -85 -129 -131 -75 32 -244 -139 -246 49 107 224 112 7 7 -75 46 33 -161 -8 74
6537G4l42L26j88M9q4K08m2J8K6Q4j59j53K31n0J85j13L2o5j21j34K01K98j79
$$ 74 -268 58 -130 -81 -165 43 1 19 45 129 -30 -183 48 -2 183 70 102 37 -84 -218 -17 281 102
6560A02k08J26j13K09jj85k14J29K30p6n1j88j24L81k09L53o8q7k1j53R5o1J45
$$ 102 -106 20 -93 116 115 -70 -284 -155 75 -1 -52 -240 -364 17 -192 161 93 6 -15 -168 -73 -134 11
6583A1j13j22L63k79J54j53K23k21j67L74k34M4J26o1R1J17m20J86K72k4l59J24
$$ 11 -102 -224 139 -140 14 -139 84 -137 -304 70 -164 -120 6 -55 36 153 -267 -81 191 167 -192 -68
6605f8l2L23l69L70j67l08K38r0J22p4K67k76J05m3qK4J06k04K92k71J1J85j22
$$ -68 -100 223 -146 224 57 -251 -13 -103 19 -55 212 -64 41 -2 -10 14 120 -84 208 -63 -52 133 11
6628A1J70k82j51M16j10L4P0j11j83J94N1L8l29J39J4K92m85J86J73j25J43k29
$$ 11 181 -101 -252 164 54 88 158 47 -136 58 109 147 -182 -43 -29 263 -222 -36 137 12 155 -74
6650g4kK20l07L08p6L5Q8l03K94k22k11L12m1k3j36O0K09l57N37k97j29J1K54
$$ -74 -76 144 -163 145 69 104 192 -111 183 -39 -250 62 21 -2 -138 -78 131 -226 311 14 -115 -104 150
6673A50j3k13j0m1J86K6N0k77K99j70j5o8L52m15K27R2m12K03m3J39m6J1j15K71
$$ 150 137 -76 -86 -127 59 85 135 -142 157 -13 -28 -96 256 -159 68 160 -252 -49 -92 47 1 12 -103 168
6697A68j40l76M52Q3l24K71j6n5j2m0l39L92j50K85P8j46P7n67L00R5j03J85O9
$$ 168 28 -348 104 187 -137 134 118 63 51 11 -328 64 -86 199 277 131 208 -359 -59 36 -67 118 187
6720A87j44J92m0k55o6K16j31K77l88Q0j15K8L4N6m4k2J31N0j33K13l14N24k67
$$ 187 43 235 195 -60 -126 90 -41 236 -152 -72 -187 -159 -125 -69 -113 -135 -4 46 -87 126 -188 336 69
6743F9j53kL07jl05j12L60k6Qq6k13J14n6K8n6K83J8k02J06l58J12n7P0K46l2
$$ 69 -84 -86 221 220 -85 -197 163 137 145 59 -154 -40 -96 -68 -124 159 177 -25 81 -277 -165 -222 -152 94 62
6768F2Nk44J36q2N0K76q0j45o6j5K40K2k10K14l2k9J15j72J2j68J17J0o1N9j01
$$ 62 67 -177 -41 -123 -73 203 123 -22 -88 -103 137 159 -51 163 131 102 217 45 57 -111 6 16 -45 14 -87
6793h7j64J78J32q8RJ12N9r0j74J19j42J25P6l06J12k7L0L27r3K4j83J2J23j9
$$ -87 -251 -73 59 -29 -20 92 151 61 -113 6 -136 -11 65 -241 -129 -156 -126 201 108 132 -51 -39 84 65
6817F5q3O3k69oK36O8q7j68J16j47L86j9j77j25K24J2j32j00K70l6r9j05oM9J6
$$ 65 -18 45 -224 -230 6 74 -13 -181 -65 -212 174 155 -22 -147 77 89 -43 -143 127 91 -8 -113 -119 -70 -54
6842e4J64k78K62N8k86K37j08j87K70k8L0j29Mk39L73j70o7L9J26m1O3J07j52
$$ -54 110 -168 94 152 -134 103 -5 -192 78 50 80 -49 -45 -284 89 -81 -148 -109 17 -24 39 146 -6
6865fM3J15k48j40M49k64J88q6K3k1M8k73J64K9j82J41j36Q6J2p6N6J1k95N46
$$ -6 37 152 -96 -236 213 -51 137 51 74 53 101 -172 -8 21 -161 -20 -156 -70 -58 -134 -78 -67 -362 184
6889A84j51%k94J34J51r8J39j30N1J03k8k38K65k9l8j99K55O6j48K00k31j38L03
$$ 184 33 33 -261 -127 24 -74 65 -65 -14 89 61 -177 88 59 21 -178 77 143 -5 195 -36 -174 129
6912A29m6k01O6O7K19k44O6N6j13K06l42R1M3J5n8K7r4R1k2M2k55J19K29J5k44
$$ 129 83 -118 -52 15 234 -10 56 112 -1 205 -137 -46 -3 12 -46 -19 -113 -22 -44 -2 -257 -138 91 106 -138
6937a38K76j93J53j21O9n9O5J73k37m6L4M2K19j40k01K7J79kj36QP7K42l36k4
$$ -138 138 -55 98 -23 46 -13 52 225 -12 -58 -24 18 237 97 -104 -77 102 100 -36 -28 49 291 -45 -69
6961f9J3J8kJ80l82K55Q2j4p9P1k12j0r1K70n5j28K34j68L07j84p2N8R6N6k20
$$ -69 -56 -38 -40 140 -242 13 95 81 2 73 -139 -149 -240 30 -25 -153 81 -87 220 36 -36 22 118 174 -46
6986d6r2lJ24r3j13K14q9M3o2L34l16J92l18J11J43R0l13K84Oo7J44l47J1R8p
$$ -46 -138 -141 -17 -110 -223 -9 -98 -55 -117 217 -99 93 -225 -114 29 119 -194 90 96 29 173 -174 -163 -65 -72
7011g2K81k73L9K46j98p1O9k33K51J66q6l59O1J30J19k06M7O0m7Q1L1j28m3J58
$$ -72 209 -64 -25 221 23 -48 21 -212 39 205 119 -240 -179 -49 70 -136 -89 -29 -76 5 36 -92 -135 23
7035B3j90K39O8m5l00K65r6J60k82Q0k2K15R0n2m4k32K65j56q7P0J00k39J75r9
$$ 23 -167 72 140 95 -205 60 -36 124 -158 -78 -100 115 205 153 109 -123 142 -14 -101 -31 69 -170 5 -94
7059i4P1j05K74n47L29L2j85P1K53k27K46j89P3Jm24N93k99K79k41J49P2l01J43
$$ -94 -23 -128 146 -401 -72 -40 -225 -154 99 -128 118 -71 2 3 -421 172 -127 152 -89 60 132 -169 -26
7082b6j61L72j12j6j35k25L38q3Q1J91j96n7o9L6J54Q0j38QK7j70k00K01J87N8
$$ -26 -187 185 73 57 -78 -303 35 -48 33 224 28 -29 -98 -62 92 172 34 42 69 -101 -301 -100 87 145
7106A45J10l77o2K30Q3k93R6L6Q0j20j10J69O3R8m4l86M13J03l74J78k52L10k31
$$ 145 255 -122 -184 46 129 -164 -68 -32 48 -72 -182 -13 50 148 104 -282 131 234 -140 38 -214 96 -135
7129a35J50M6j30J74k15L14j64j60J65J53j43N0n5j07j42N2J52O5j78P7JK04l38
$$ -135 15 61 -69 105 -110 204 40 -120 45 198 55 105 50 -57 -199 -147 5 70 -108 -31 -30 174 -164
7152a64K09k00L32R3j88j29o8K0j46J34K12R3j12j77P7k87M39k57L3J05J16k58
$$ -164 45 -155 177 270 82 -47 -115 -95 -241 -107 105 198 86 -91 -14 -301 138 -119 -86 19 135 -123
7174a23J36k0J63m7p5n4NK66n02J95J69k12K68k31L7j7J44k2m7Nn4j17m2K15J36
$$ -123 13 -7 156 109 34 -20 -15 251 -251 -56 113 -99 169 -62 -25 -42 102 80 33 38 -16 -133 -175 40 176
7199A76j40l2k0k1J98j76nM0L9j48p6N4J3k8J91k66k2O9K18o4J50J4k41O7J09
$$ 176 36 4 -16 -37 161 -15 -20 20 59 -89 -165 -111 -98 -126 65 -201 -223 -154 64 0 150 164 -77 -10 99
7224I9j72P0JK7k7j58J53K7K2j28J04Q0k38n4J85k78L16J75j1o9J9kq8k05J41
$$ 99 -73 -3 -2 25 -2 -160 -7 20 42 -86 18 98 -140 -194 -9 -287 29 204 193 124 143 141 53 -152 -11
7249a1k5j31J93O1j62O9o8m3J18j7m3p1J78L8l55K46M1j17K5O3j44K14k8k57O0
$$ -11 -36 -167 26 87 -75 -6 -74 -117 1 -16 -59 -130 48 86 -269 -23 18 -99 -74 -11 -155 59 31 -226 -166
7274a66Q8J17M5j52q4n8L58o1k66P1J23Q6k58K03k84L83j88k3K4L4j2p5J33q4
$$ -166 -78 39 84 -68 -152 -210 148 87 -179 -108 15 101 -157 46 -238 145 -43 -66 -42 -8 -20 -95 38 -46
7298d6j90K16m7N9q1J16J2mm1J93l19n6q0L71j76M3O0No3J02j02J30J8r9j07J47
$$ -46 -236 -20 -67 -8 -89 27 39 35 -6 187 -132 -188 -268 103 -73 -30 30 35 -28 74 -28 102 120 21 -86 61
7324F1M2p9MK7r7QL09k40k18K96m0j53J32p3n5K62k64JK12k88Q2J6K50p5k36J9
$$ 61 103 24 28 55 -42 -34 275 35 -183 113 73 -80 52 -21 -76 186 -78 -77 135 -153 -71 -55 195 120 -116 -97
7350i7K09l68K83n5R7j70R1K5j47j34L36L2j15k42K15N1j81K36o2Q1J5r7l4J71
$$ -97 112 -256 27 -28 69 -101 -10 15 -132 -266 70 102 -13 -255 -40 11 -170 66 4 85 100 3 -31 140
7374A40m65N02j12l46K75N0j78J19ON9J65l35N1k66K63J01P0o0R1j82M5%J23k22
$$ 140 -325 177 65 -281 -6 44 -134 -15 -9 50 215 -120 -69 -335 -72 29 99 39 130 -52 -7 -7 116 -106
7398a06L00r8L39l38o6n3J58oj44pJ4J05J5k53J79J14j93K20k03j2N7j19M2P9
$$ -106 194 96 435 97 31 -22 136 130 -14 -21 -7 98 113 -140 39 153 -40 180 -23 -35 22 -97 -55 24
7422B4K01k98J5K01k53Q1O4j5O8p3o1K72k05K9l87M29m56L12K84m90J54L11K3
$$ 24 225 -73 -58 143 -110 -29 35 20 88 15 -46 226 21 50 -337 92 -364 -52 232 -258 -104 207 230
7445B30j49J33l31L8l4j6J06J19K93m16j03P5J79q8j39Q5J42p0K7J91m19K51j54
$$ 230 81 214 -117 -79 -113 -129 -23 96 389 -27 -130 -55 124 36 -103 -18 124 54 81 272 -147 104 -50
7468e0q0L63n41K30l3K03j64K12j41N8N9n4J17m01J17J18k1l2P7J12k72J62j1
$$ -50 -130 233 -308 -78 -111 92 -72 140 -1 57 116 62 179 -222 -105 13 -8 -40 37 149 -123 39 28
7491B8j20K37J36j55l30K59j45K13J3j24J58o1L1k87L69j46K8j7Q1n09L50p0r
$$ 28 -92 145 281 126 -204 55 -90 123 136 12 170 109 140 -147 222 76 104 87 168 -341 9 -61 -70
7514g0Q3m9J69j23p9N7K82m30J05J59ml1j37J55J1p1j37M44l73K91j72j59N3j18
$$ -70 13 -36 133 10 -69 -12 270 -160 -55 104 100 69 -68 87 98 27 -110 334 -39 252 80 -79 -26 -144
7538a44L66k45K03m20L25p0K46k95PK49j01o2l22J64L8Q6j78O4l6J21J97l03J4
$$ -144 222 -23 180 -240 85 15 261 -34 -27 222 121 59 -263 -99 -61 25 -153 -89 -125 -4 193 -110 -96
7561i6Q9J0M1K3K10m46J07J78l16J22k4M8j02K60r6J10j94MK09M0l73J79j07J6
$$ -96 -7 3 44 67 277 -169 -62 116 -200 -78 -102 -54 -156 104 8 118 -76 -72 137 177 -196 -17 -124 -108
7585a08L28j78j5k39L33O5k30K44k74m0J52J2J06l47K45q6J24j16J4j10rJ17n4
$$ -108 220 42 27 -212 121 186 -44 200 -74 -114 38 50 156 -191 54 -32 92 -24 -10 -120 -129 -12 -66
7608f6K63l01n3K17k50J04M8j44L61k14j22J5K37j21J70m6K4o4m7qn7k85L70n4
$$ -66 197 -104 -157 60 -190 -86 -38 -182 179 -35 -157 -142 95 -26 144 98 122 58 11 3 -54 -339 31 -23
7632b3K35n99M36j05J80Q0j25qN3j24K59m62J13K88n64L88P8r2J46r7L2Q8j43
$$ -23 212 -387 49 -56 124 204 79 71 124 0 259 -203 -90 198 -366 22 100 8 154 57 89 177 34
7655C4j86J72O7j94L11l06J46k46k4K8K10K79j90L7R3j35j01r1J11Lp3j64K15
$$ 34 -152 20 87 -107 204 -102 44 -202 -226 -198 12 291 101 138 231 96 -5 -96 15 18 -55 -219 -4
7678dl3J32j45K15k61Q9J23k4K1j70J48J98m40K25N9k05O0j03K47j50m5J31j2
$$ -4 -37 95 -50 165 -96 -7 116 92 113 -57 91 289 -151 74 133 -72 -12 -115 132 -18 -63 68 56
7701E6j93L55l47M6NJ06j70J33J05o9K33k62J62j48n2J91k65L3K28n3k34J78M9
$$ 56 -137 218 -129 -83 -78 28 -142 -9 96 27 260 -2 160 12 -40 151 -114 -81 147 94 -140 38 87
7724H7k77L03j8Q5n5k91K31LL1n9N3r2k18K32nK68n54L05Q1k47j29K61J46l39
$$ 87 -190 113 95 180 125 -166 65 68 99 40 93 1 -217 15 10 278 -276 29 110 -137 -266 -5 141 -198
7748a98K17j0k56J69L47l74J55k04mL06k30r6K26j79L74j74o7j80J29K25L2q3
$$ -198 19 9 -247 -78 269 -105 50 -154 -158 148 -82 -178 48 -131 243 69 2 -178 -49 176 208 125
7770A25j27R1j01r0K95k64J7m8J41J33M8j25K59m54o9J74P0k17J89mm7J69j03
$$ 125 -2 89 -12 -102 193 -71 -54 -102 39 172 220 95 354 -100 -169 5 75 -142 47 43 -4 165 62
7793F2l9j12J00K78l74J19k93J75j29J95J09p5p1J37J00k62j9J67j89R4Q5k60
$$ 62 23 -89 11 289 -85 34 -259 -84 -213 -18 91 16 -55 82 182 -80 -99 68 -121 -27 58 -202
7815b02n6M15k58M5K1J75r0j8l15K02j66K28j74J89k45K84j45J1P3J51op8j01
$$ -202 -258 157 -101 -56 -35 140 50 32 -283 -81 -247 -19 -193 -4 -249 35 -110 -99 -26 125 119 41 -60
7838f0J02o6J22Q0j9k07o1K04j76m8l5K71Rj29J14k20j77K27o1R7J05L25l49j84
$$ -60 42 -24 98 178 159 -48 -109 95 -81 -129 -164 107 116 -13 101 -119 -296 -69 -130 -33 72 397 48 -136
7862a36Q1p6J89k2k4p2J25J39j47j41K21j0k41J27J46p0k29J53P2j93O2j00Q6
$$ -136 -55 -131 58 36 12 -60 65 204 57 -84 137 127 -114 13 159 89 -140 13 85 -108 -46 -146 -60
7885f0k0K3J0q3J39j48J34j25J74m8m3P7m3j89L39k41J89k24J93q8J58rl77K38
$$ -60 -80 -57 -47 -130 9 -139 -5 -130 44 -4 -47 30 -13 -202 137 -104 85 -139 54 -34 124 115 -262 -24
7909b4l5J3Q0q4q1R2R2j27J34q0k33L43j45J0J66l3j27Q1j79L00k93J11k4j30
$$ -24 -59 -46 34 -50 -131 -39 53 -74 60 -20 -253 90 -55 -45 121 88 -39 42 -137 163 -130 -19 -43 -173
7933a73M2M4K21j15j22O2J64k49L01j23k89K61J02k99K53k89L69j18j81L6K12
$$ -173 -131 -87 134 19 -103 -41 123 -126 175 52 -237 24 126 -173 80 -209 160 42 -139 -103 109
7954A09q2P4mj31J88l40L79k02j3J29j72R4j04M3P7j2o0K7j65J28J06j36J55J0
$$ 109 27 101 97 -34 154 -186 193 -9 -22 107 -65 29 -75 -32 45 33 -27 0 -165 -37 69 -67 88 98
7978I8o5l4j29R4J4m1J49o6M8LJ87j59O2l4q2%j83j9L3j9J70j22J93j65R4q3k5
$$ 98 33 -1 -130 -36 -22 -63 86 20 68 71 258 99 161 127 45 45 -138 -157 -124 -143 27 -95 98 -67 27 -56 -81
8005h1J08o7J81k26J0k48M55l82M73l46M5J53m0K49k32R7ok37P2M23m26K02k12
$$ -81 27 -40 141 -85 -75 -323 132 -250 223 -123 -78 75 35 284 52 149 143 -94 -22 401 -25 177 -35
8028c5p6O9Q4q1j21N1j39K98l0MJ12k35K39l3l10L07k35O7K03k44J90Q7j25k15
$$ -35 -111 -42 42 -39 -160 -109 -248 50 20 24 136 -99 140 107 -203 104 -131 -64 139 -105 85 172 47 -168
8052a68J54j91qM02k47J39k66L74k16j3N9J50k13oJ10q5j2O0K40l00J17q9J92
$$ -168 -14 -205 -213 189 -58 81 -185 189 -27 -40 19 169 -44 -50 60 -25 -37 23 263 -37 80 -9 183
8075A83l26J25K68m30O0J74p7O0J02k55p9K20N6q2O2%j18K10j50p4j93M64p8N8
$$ 183 -143 -18 250 -180 -120 54 -23 37 139 -116 -195 25 81 -1 61 61 -57 153 3 -71 -264 200 122 180
8099A80N1k61J07j59M1RO5j68NK16j87J3r3R7J14l65K89J27o7p5J37J70k35J05
$$ 180 231 -30 77 -82 -41 -32 33 -135 -130 86 -101 -88 -181 -84 30 -335 -46 81 14 -61 76 246 11 116
8123A16J66k96l3J20J91j01q9P8j8l31O0j7J41k49K12N0K85m35K92j32k56J02
$$ 116 282 -14 -47 73 264 163 74 152 134 -197 -137 -154 -13 -262 -50 0 285 -150 142 10 -246 -144
8145a44J75q8J02j81j12J77J13J04j93M0n3K5o6KJ43j19J48Oj49J56j29n7K90
$$ -144 31 -57 45 -136 -248 -71 42 146 -47 -7 -60 -35 -101 -99 44 -75 73 79 -70 86 -43 -100 190
8168A90j80L7J72k94KK94l99J46j7j15p9K11K30j61k51J45P6pN3p0nJ03J9
$$ 190 10 47 219 -75 -73 221 -178 -32 -49 -164 -243 -32 198 37 -214 -69 7 0 53 -17 -22 81 100
8191A00
$$ Imaginary data points
##PAGE= N=2
##DATA TABLE= (X++(I..I)), XYDATA
0@%%%%%%%%%%%%%%%%%%%%%%Qj6J6j6J6j6J7k4L1l2L3m0M7n0N7o4P2q0Q8j01J12
$$ 0 0 0 0 0 0 0 0 0 0 0 0 0 0 0 0 0 0 0 0 0 0 0 8 -8 8 -8 8 -8 9 -15 16 -16 17 -23 24 -26 31 -33 39 -41 47 -54 58
43E8j22J35j49J65j82K01k22K43k68K96l27L60l99M46m94N50o20P02q02R23j080
$$ 58 -64 71 -78 87 -95 106 -116 127 -141 155 -172 188 -211 235 -259 291 -329 373 -429 494 -586
64e86J295j600K071k909M836j6231j955M0412J9267J1144Q912O829j1601j3763
$$ -586 709 -891 1180 -1729 3107 -13124 -15079 25333 44600 55744 64656 71485 59884 46121
78D6121j0681j3672j9692j0541n274o313m673J507Q66k074j691J553M6k054K717
$$ 46121 35440 21768 2076 -8465 -13739 -20052 -24725 -23218 -22352 -24426 -26117 -24564 -24518 -26572 -23855
93b3855O629N806P878J1917J1912P560N891N748N14o253o751p470j1914j2190
$$ -23855 -17226 -11420 -3542 8375 20287 27847 33738 39486 40000 33747 26996 19526 7612 -4578
107d578p896p448q124l401J548J57J631P204P829N024Q722R947O151M415N255
$$ -4578 -12474 -19922 -28046 -31447 -29899 -29742 -28111 -20907 -13078 -8054 668 10615 16766 21181 26436
122B6436J772k805l724m314p455q153o625n532m508j890k97J742J930K600K468
$$ 26436 28208 25403 21679 17365 9910 1757 -4868 -10400 -14908 -16798 -17095 -15353 -13423 -10823 -8355
137h355K078J323J359J219J595K117K688M365L207L253L404P81j929l174l961
$$ -8355 -6277 -4954 -3595 -2376 -781 1336 4024 8389 11596 14849 18253 19034 17105 13931 9970
152I970o842o859n266m307l636k40J924K148L009M282K811J547J912Q22n99Q05
$$ 9970 3128 -3731 -8997 -13304 -16940 -17180 -15256 -13108 -10099 -5817 -3006 -1459 453 1275 676 1481
168A481J408J357J859K798K273J116L61j343l116l893m521m897l660k396n61J194
$$ 1481 2889 4246 6105 8903 11176 12292 12653 11310 8194 4301 -220 -5117 -8777 -11173 -11734 -10540
184a0540K890L033K804K939J323n04r38j650k625j538j97M82K360L281M341L283
$$ -10540 -7650 -4617 -1813 1126 2449 1945 1007 -643 -3268 -4806 -5003 -4521 -2161 1120 5461 8744
200H744K264J678r30k698l367m776m797l111k218q45Q50K065K864K919K519J424
$$ 8744 11008 12686 11756 9058 5691 915 -3882 -6993 -9211 -10056 -9206 -7141 -4277 -1358 1161 2585
216B585K94N0j086j272j066k50n26P06J398J151O63O07j53j255p98q60k028r16
$$ 2585 2879 2929 1843 571 -495 -745 -1271 -565 833 1984 2647 3254 3101 1846 1048 188 -1840 -2756
234b756j88J22K61Q09P96L16O20Q89l38J13Q23K09R34P06Q55K75k37j036j710
$$ -2756 -2944 -2822 -2561 -1752 -956 -640 -20 869 531 644 1467 1676 2610 3316 4171 4446 4209 3173 1463
253A463k393k701k581j975p84K95J917K583K943L375K812K326M98p79j339k095
$$ 1463 -930 -3631 -6212 -8187 -8971 -8676 -6759 -4176 -1233 2142 4954 7280 7778 6999 5660 3565
269C565k567j576o12l00P32J666J178J164K59o04j661k836k379k687k058m53M27
$$ 3565 998 -578 -1190 -1490 -758 908 2086 3250 3509 2905 1244 -1592 -3971 -6658 -8716 -9169 -8742
286h742J811L404L137L339K736J790M86p35j509k122k263j431j400l66K29N20
$$ -8742 -6931 -3527 -390 2949 5685 7475 7961 7226 5717 3595 1332 -99 -1499 -1865 -1636 -1116
302a116N59O45L32m36l57q66q92j077j0N43M96J222J459O89P94P76n22n20p65
$$ -1116 -557 88 420 -16 -373 -1239 -2131 -3208 -3218 -2675 -2179 -957 502 1191 1985 2761 2239 1719 954
321I54m51q31l48N96j09Q8O18k69p60l46m82q15P9L21J052J476J735J657R63O9
$$ 954 503 -328 -676 -80 -189 -101 517 248 -512 -858 -1340 -2155 -2076 -1755 -703 773 2508 4165 5128 5197
341E197l25j520k130k418k864k004q30j52O99J942K325K219K227J325N47p24r89
$$ 5197 4872 3352 1222 -1196 -4060 -6064 -6894 -7046 -6347 -4405 -2080 139 2366 3691 4238 3514 2525
358B525j621j306q22k87L40J607K101J532J409L85k60j995k427k649l072k296
$$ 2525 904 -402 -1224 -1511 -1171 436 2537 4069 5478 5863 5603 3608 1181 -1468 -4540 -6836
374f836j492l21P33J843K405K378K741K234Q12L59R6j127q17q78r10m12j4l62
$$ -6836 -8328 -8649 -7916 -6073 -3668 -1290 1451 3685 4497 4856 4952 3825 3008 2130 1220 808 794 432
392D32J10j83J83m90p64l89n80p05k7J49J0Q43M75O46L88J69j28L96k39M43M04
$$ 432 542 359 542 52 -712 -1101 -1681 -2386 -2413 -2264 -2254 -1411 -936 -290 98 267 139 535 296 739 1143
413A143K92P64K18k06k93p02j286j382j168r29o37k15J097J291J720J866J388
$$ 1143 1435 2199 2417 2211 1918 1216 -70 -1452 -2620 -3549 -4186 -4401 -3304 -2013 -293 1573 2961
430B961J376P06n49o38j384j429j344j174n67m80M96K94L61K95K69l07p52l45
$$ 2961 4337 5043 4494 3856 2472 1043 -301 -1475 -2042 -2522 -2026 -1732 -1371 -1076 -807 -1114 -1866 -2211
448b211p69n87P17J092J030J747J785J487J327J6J2q97j186j354j894q14p79p88
$$ -2211 -2980 -3567 -2850 -1758 -728 1019 2804 4291 5618 5634 5646 4749 3563 2209 315 -499 -1278 -2066
466b066k07P5m01k44m77o57n44n88j12P88J275K019K502K598K567J574P73j62
$$ -2066 -2273 -2198 -2599 -2843 -3320 -3977 -4521 -5109 -5221 -4433 -3158 -1139 1363 3961 6528 8102 8875 8713
484H713j055k436k595k927k757k065r19n52Q25J020J534J404J368R32k8j38k82
$$ 8713 7658 5222 2627 -300 -3057 -5122 -6041 -6593 -5768 -4748 -3214 -1810 -442 490 462 324 42
501D2k96J2K64M05J144J041J032O32L66m14r88j553j990k107j891j386n88k94
$$ 42 -254 -242 22 427 1571 2612 3644 4276 4642 4228 3240 1687 -303 -2410 -4301 -5687 -6275 -6569
519f569R98J329J391J961K301J794J863J184O39j84o83j100j516k099k302k044
$$ -6569 -5571 -4242 -2851 -890 1411 3205 5068 6252 6891 6707 6024 4924 3408 1309 -993 -3037
535c037j722j127p53L0M12J445J507J784K043J306J001O48Lj32r32k63l68K63
$$ -3037 -4759 -5886 -6639 -6609 -6197 -4752 -3245 -1461 582 1888 2889 3537 3540 3408 2476 2213 1845 2108
553B108K72L29L57L58k56q77j331k177k088k333j757r95j08P79J707K662L126
$$ 2108 2380 2709 3066 3424 3168 2291 960 -1217 -3305 -5638 -7395 -8390 -8498 -7719 -6012 -3350 -224
570b24L000K772J413J044k85j061j512k276k007j847j414m91j53K74L90N44N34
$$ -224 2776 5548 6961 8005 7720 6659 5147 2871 864 -983 -2397 -2888 -3041 -2767 -2377 -1833 -1299
587a299K74p4J5l08mmM45N83R17P99J157J95J70j26n81o79j028j063n64o22J9
$$ -1299 -1025 -1099 -1084 -1392 -1396 -1400 -955 -372 545 1344 2501 2696 2866 2740 2159 1480 452 -611 -1175 -1797 -1778
608a778j67K57l3M80J05N60L23J2O92N59N94O85O2K47j67k38m91j216j194j192
$$ -1778 -1945 -1688 -1721 -1241 -1136 -576 -253 -241 451 1010 1604 2289 2351 2598 2431 2193 1702 486 -708 -1900
628a900o38p67j91J72N25Q11R67J306N94P53K20k29J53m95m59M8K38l69K19J11
$$ -1900 -2538 -3305 -3496 -3324 -2799 -1988 -1021 285 879 1632 1852 1623 1776 1281 822 870 1108 739 958 1069
648A069j37k58l73l18o52l01n22n14K39K6M86L59M89J18L03J89o2%Q3l5K83J64
$$ 1069 932 674 301 -17 -669 -970 -1492 -2006 -1767 -1741 -1255 -896 -407 -289 14 203 141 141 224 189 472 636
670F36M15j03M10K8N0n57k86p12o20l10k03P5L84M87L81N89M18j11k24r39l57
$$ 636 1051 948 1358 1386 1436 879 593 -119 -739 -1049 -1252 -1177 -793 -306 75 664 1082 971 747 -192 -549
691e49p19m75m72k28O22O10J216M77J048M97J93N2m96p90o47l90o50N3m9K57K57
$$ -549 -1268 -1743 -2215 -2443 -1821 -1211 5 482 1530 2027 2220 2272 1776 986 339 -51 -701 -648 -697 -440 -183
712a83J65M82J03n40K3l69n96k07l51N0L25N33l0R57L58L6L08p4l94n7k54J4m09
$$ -183 -18 464 567 27 50 -319 -915 -1122 -1473 -1423 -1098 -565 -595 362 720 756 1064 990 596 539 285 299 -110
735a10o1K95j0l13J30J5k54M08n8j7J81K56J85Q3p8r2k84m20m56l38k97m63m51
$$ -110 -171 124 114 -199 -69 -54 -308 100 42 25 206 462 647 730 652 560 276 -144 -600 -938 -1235 -1698 -2149
758b149N74M85J08O70P34M26K92J02J48k18k35k80j99j49K36J62O1J1L66o73k36
$$ -2149 -1575 -1090 -982 -312 422 848 1140 1242 1390 1172 937 657 458 309 545 707 768 779 1145 472 236
779B36o73o41o51n95k66qM19L41R82O72J141R07K97K08k65k71j34o77n96n54m47
$$ 236 -437 -1078 -1729 -2324 -2590 -2598 -2179 -1838 -856 -184 957 1864 2161 2369 2104 1833 1699 1022 426 -128 -575
800e75J67k45k38M31k73K70n4j31n6J68j08M3K32M55P8P7M76j53O4R9j39q4J6
$$ -575 -408 -653 -891 -460 -733 -463 -517 -648 -704 -536 -644 -601 -369 86 164 241 717 564 628 727 588 504 520
823E20n43k03m13oj32k54k03L35Jj9P04L23O24R46K26M01L7l52l17p00q41j085
$$ 520 -23 -226 -639 -645 -777 -1031 -1234 -899 -898 -917 -213 110 734 1680 1906 2307 2344 1992 1675 975 134 -951
845i51p72m22o05M22K15O39K99O52M11O32K99p5k10j84l7j49J08P48N6L55K00
$$ -951 -1723 -2145 -2750 -2328 -2113 -1474 -1175 -523 -112 520 819 744 534 350 313 164 272 1020 1076 1431 1631
866A631J41J55n40m75o85r17l90p77n82m68L79K67N26Q10O50Q53N69O00N0L15
$$ 1631 1772 1927 1387 912 227 -690 -1080 -1857 -2439 -2907 -2528 -2261 -1735 -925 -275 578 1147 1747 1797 2112
886B112n15j19k85l13m40l1l89k04m65k7pL1k60N43k48K26n1K38J01j20K59JO6
$$ 2112 1597 1478 1193 880 440 409 20 -184 -649 -676 -683 -652 -912 -369 -617 -391 -442 -204 -103 -223 36 37 103
909A03k59J45K60L36k99M6J0Q2Q7%n52k43m63Nl24J6L62K26M64P0P59K35L09L24
$$ 103 -156 -11 249 585 286 332 342 424 511 511 -41 -284 -747 -742 -1066 -1050 -688 -462 2 72 831 1066 1375 1699
933A699J5l47l39k04p07o10j17n52k72l8R1J82K64M91p0L32L97L61n5qO36m48
$$ 1699 1714 1367 1028 824 117 -493 -610 -1162 -1434 -1472 -1381 -1199 -935 -444 -514 -182 215 576 521 513 1149 701
955G01k53K08j11K8k20J57l6p5j3J19j44n88j16j91n0o64N0l23k73J89N55M48
$$ 701 448 656 545 573 353 510 474 399 386 505 361 -227 -343 -534 -584 -1248 -1198 -1521 -1794 -1605 -1050 -602
977f02O03Q20N31M69K5j30k71n19m16n79r80J85k05N9j29O96L22N47J14L50o8
$$ -602 1 821 1352 1821 1846 1716 1445 926 510 -69 -1049 -864 -1069 -1010 -1139 -443 -121 426 540 890 822
998H22n28j11o48l75R6j23j70n9N51M34L01K94J4K16l49K94m18m50J01j70l72
$$ 822 294 183 -465 -840 -744 -867 -1037 -1096 -545 -111 190 484 498 714 365 659 241 -209 -108 -278 -650
1019f50K23j0L00N16L3L67q3K02r3j19l76q4n62l40k19q0j35J14R2J58M54L33
$$ -650 -427 -437 -137 379 412 779 696 898 805 686 310 226 -336 -676 -895 -975 -1110 -996 -904 -746 -292 41
1041D1L59K70J04l2J34j30k8m34k11k75p0r6N7P7L36j85L73k3l9j3j04m8l66j74
$$ 41 400 670 774 742 876 746 718 284 73 -202 -272 -368 -311 -234 102 -83 290 267 228 215 111 63 -303 -477
1065d77j55k79L39J29K92J52J27L07K2J87k4j01k60k61j77k35L58j38k35J67K33
$$ -477 -632 -911 -572 -443 -151 1 128 435 457 644 620 519 259 -2 -179 -414 -56 -194 -429 -262 -29
1086b9K27O5K86j8J13k93j17r0Kj14o08k43J5m4J43q1J65Q1N12K85K1J72J69L5
$$ -29 198 263 549 531 644 351 234 144 146 32 -576 -819 -804 -848 -705 -786 -621 -540 -28 257 278 450 619 654
1110F54P3k21k55Q7M8M5l1m21J48J11j60m4p1r9j73l7l53j23J31j27P1J86J47
$$ 654 727 506 251 338 386 431 400 -21 127 238 78 34 -37 -136 -309 -346 -699 -822 -691 -818 -747 -561 -414
1133d14M32J35J62L51J29L2o6k47j53l84R3j53l34K57N3k66K26K44k43J67J13
$$ -414 18 153 315 666 795 827 761 514 361 -23 70 -83 -417 -160 -107 -373 -147 97 -146 21 134
1154A34Q7j50j7N9l57r4Q6N3j32K73J5L2pJ00K7j93J81p9M6j30n8J63K99k62R1
$$ 134 221 71 54 113 -244 -338 -252 -199 -331 -58 -43 -11 -18 82 109 -84 97 18 64 -66 -124 39 338 76 167
1179A67M06K3j13k4n5%k62l2j22k63k17k23R4j05ml3N10j21M14k25M47R0o6J49
$$ 167 573 596 483 459 404 404 142 110 -12 -275 -492 -715 -621 -726 -730 -763 -253 -374 40 -185 262 352 286 435
1203D35L03k15J06k71O2k12O4k69o3O6j06j42j29Q7J6L5j68r7K77J48j15J25K82
$$ 435 738 523 629 358 420 208 272 3 -60 6 -100 -242 -371 -284 -268 -233 -401 -498 -221 -73 -188 -63 219
1226B19O9J33j52L40k54P4l58r4Rj83j75j22J40Q3J75j15K32L41r8K76K7j49q7
$$ 219 288 421 269 609 355 429 71 -23 -14 -197 -372 -494 -354 -271 -96 -211 21 362 264 540 567 418 331
1249C31j08k69J39k32l1j39p1o8J79j34M9J44p7pj9l0Q5L59J61J75mJ80L73m30
$$ 331 223 -46 93 -139 -170 -309 -380 -448 -269 -403 -354 -210 -287 -294 -313 -343 -258 101 262 437 433 613 986 556
1273E56K75k24j31k39m3k02l98p3k24Q4k17k88O94P3l9K03k2K13J08R9K46K54
$$ 556 831 607 476 237 194 -8 -406 -479 -703 -619 -836 -1124 -430 -357 -396 -193 -215 -2 106 205 451 705
1295G05k26J40k88p7j54k45K89k13l4K22k20m1L0K38k16j24K63k84K14j57P5k83
$$ 705 479 619 331 254 100 -145 144 -69 -103 119 -101 -142 -112 126 -90 -214 49 -235 -21 -178 -103 -386
1317c86N40o9j09K64R3n1k86l3N2j26L0j04k05K72k4J01j07J91M36j42P7L3O1
$$ -386 154 85 -24 240 333 282 -4 -37 15 -111 -81 -185 -390 -118 -142 -41 -148 43 479 337 414 447 508
1340E08Mm6k63l21M3J13m35M5k23j33J65J79j37J79J09M16J5R9J48j45L0k28n
$$ 508 512 466 203 -118 -75 38 -397 -352 -575 -708 -543 -364 -501 -322 -213 203 218 317 465 320 350 122 117
1363A17R3k74j37K23j7K39K54k88L1N2J31m42j78j0n07o9K30k49N08kK39K48J45
$$ 117 210 -64 -201 22 5 244 498 210 241 293 424 -18 -196 -206 -713 -782 -552 -801 -293 -295 -56 192 337
1386C37K22K12l98j30k09p5nk25N5k09K41K52L13J67J00l18J63j1m81j27J03m30
$$ 337 559 771 373 243 34 -41 -46 -271 -216 -425 -184 68 381 548 648 330 493 482 1 -126 -23 -453
1408d53j24k57M7K70j39N85K07K5p4K10L5K65m17n8j35J3l7j93J18L67k65Q4J04
$$ -453 -577 -834 -787 -517 -656 -71 136 161 87 297 332 597 180 122 -13 0 -37 -230 -112 255 -10 74 178
1431A78K52K2q1j62r4l16Q9l76j00J58k03J04J56P07m54O47R1J3j0k10R1l45l86
$$ 178 430 452 371 209 115 -201 -112 -488 -588 -430 -633 -529 -373 334 -120 527 618 631 621 411 502 157 -229
1454b29j82p9n4r9L09L18jR7K47P4Q1j22j85on8j5q4k11J04o9M4l7J22k19K01
$$ -229 -411 -490 -544 -643 -334 -16 -17 80 327 401 482 360 175 169 111 96 12 -199 -95 -164 -120 -157 -35 -254 -53
1479e3k47op1K07k17K73J56J82l5J34r0J83K4Pk8n22O10m94jM7p7Ol13K1r3k20
$$ -53 -300 -306 -377 -170 -387 -114 42 224 189 323 233 416 440 447 419 -103 507 13 12 59 -18 -12 -325 -304 -397 -617
1505f17r6j9J71R7L72J56K2L29J06K60P8j49Qm90K53o58K98k31K09m18oJ68J5
$$ -617 -713 -732 -561 -464 -92 64 86 415 521 781 859 710 718 228 481 -177 121 -110 99 -319 -325 -157 -142
1528a42N1P0k12%q0J97j91N4K8J91J61J19P1r2J34p5P9j23j05j83j13l10L09k56
$$ -142 -91 -21 -233 -233 -313 -116 -307 -253 -225 -34 127 246 317 225 359 284 363 240 135 -48 -161 -471 -162 -418
1552d18J75j30j57M79k6M8K23J32K41k7J49r9l13j85m53K94l13l54K46j68M5J8
$$ -418 -243 -373 -530 -51 -77 -29 194 326 567 540 689 590 277 92 -361 -67 -380 -734 -488 -656 -611 -593
1574e93M20M7N8L19J07k04j30P5k5Q2j51K29J13J6L99m17J59k9l11n4k02k51k88
$$ -593 -173 -126 -68 251 358 154 24 99 74 156 5 234 347 363 762 345 504 475 164 110 -92 -343 -631
1597f31l67L6KJ79M35K26K12k9J02K65J84j56J18j25j44m6L7j23p8L7q4j45l4
$$ -631 -998 -962 -960 -781 -346 -120 92 63 165 430 614 458 576 451 307 261 298 175 97 134 50 -95 -129
1620a29j66N8j40k2J9J72k19J09L62Lj11N0l7O8J43J3NK49l36j5LM2k12L17l03
$$ -129 -295 -237 -377 -399 -380 -208 -427 -318 44 47 -64 -14 -51 17 160 173 178 427 91 76 79 121 -91 226 -77
1645g7n34K40K40L3q1O9J41M6L50j16J40k15k61l9J93j19l91L07J91j55P1p5J14
$$ -77 -611 -371 -131 -98 -179 -110 31 77 427 311 451 236 -25 -64 129 10 -381 -74 117 -38 33 -42 72
1668G2j1l82J79k42K31q1P9j1M9L74J21L1q3K98kj07m47J36l01J0p5j73N0q6N8
$$ 72 61 -321 -142 -384 -153 -234 -155 -166 -117 257 378 409 326 624 622 515 68 204 -97 -87 -162 -335 -285 -371 -313
1693c13K26j54L9J01J73k11JM7j3J53j3K74p4K5J48m3k02j69K09p9k15J66l31
$$ -313 -87 -241 -202 -101 72 -139 -138 -91 -104 49 36 310 236 261 409 366 164 -5 204 125 -90 76 -255
1716b55J79k60r9J25n7K28k69J17R2J29J56M2J33M2Q7p0M8n07P6J28m11Q5K39
$$ -255 -76 -336 -435 -310 -367 -139 -408 -291 -199 -70 86 128 261 303 390 320 368 -139 -63 65 -346 -261 -22
1739b2m1J28r0j54J64K56n2k18r6J13k35O7K09k63J23Q3q7K99Km7mrl19K20j99
$$ -22 -63 65 -25 -179 -15 241 189 -29 -125 -12 -247 -180 29 -234 -111 -28 -115 184 186 139 135 126 -193 27 -172
1764a72jK7M9K61m6O2J06l15J32K10j13k4j77kr2J31j64J04N8K05l67K54m58k6
$$ -172 -173 -146 -97 164 118 180 286 -29 103 313 200 176 -1 -3 -95 36 -128 -24 34 239 -128 126 -332 -358
1788c58P3n2J76k8J15J31l42N50K92m23j2K42k95j95j43K82n2Q6LM8J09k29K20
$$ -358 -285 -337 -161 -189 -74 57 -285 265 557 134 122 364 69 -126 -269 13 -39 47 50 98 207 -22 198
1811A98k28Q7q5r2k25j7J55l1j72L0J33K45R8L17k26J02l84J25O2lN2q7Pk4j79
$$ 198 -30 57 -28 -120 -345 -362 -207 -238 -410 -380 -247 -2 96 413 187 289 -95 30 92 89 141 54 61 37 -142
1836a42N1K70pq6j43J70q1po4j50p3K62k83O7j14J31j8K88O3k54M14j21j3k3K33
$$ -142 -91 179 172 86 -57 113 32 25 -39 -189 -262 0 -283 -216 -330 -199 -217 71 134 -120 294 173 160 137 370
1861C70m18J68m97J73J24k56P8L67LJ15J75j51L0Q5l92j00Lp3j73m8J00J67L72
$$ 370 -48 120 -377 -204 -80 -336 -258 109 112 227 402 251 281 366 -26 -126 -123 -196 -369 -417 -317 -150 222
1884B22j96N5K2L75m83M6n4j91m6O9J96k0K90K03P8L2r9o6j74Pj03l52k83J79
$$ 222 26 81 103 478 -5 41 -13 -204 -250 -181 15 -5 285 488 566 598 499 433 259 266 163 -189 -472 -293
1908b93r6o3K25l0J18J26N3J23m1R1q1J26Jk36L54n67L31j69j2J0J60pk66L37
$$ -293 -389 -452 -227 -257 -139 -13 40 163 122 213 132 258 259 23 377 -190 141 -28 -40 -30 130 123 -143 194
1932A94l70L24j97q9n4pN2J46n5j48J48J86k01K54j36J51J73l56L7j03%j17j27
$$ 194 -176 148 -49 -138 -192 -199 -147 -1 -56 -204 -56 130 -71 183 47 198 371 15 52 -51 -51 -168 -295
1955b95J05J3J25L10j74J47jj92J16j46J76l6j75J13l0%J9j09J26j82J13Ok95
$$ -295 -190 -177 -52 258 84 231 230 38 154 8 184 148 -27 86 56 56 75 -34 92 -90 23 29 -266
1978b66j21nO0J48N4K96l8R8J60k13J47j66L61ql61j92O7l80K06K33l9j24J5k6
$$ -266 -387 -392 -332 -184 -130 166 128 226 386 173 320 154 515 507 146 -46 21 -359 -153 80 41 -83 -68 -94
2002i4J59l44l6j4j23J21L3K36k24M56J47o7J71K07l27j37O6k56J79j27l13K02
$$ -94 65 -279 -315 -329 -452 -331 -298 -62 -286 170 317 250 421 628 301 164 230 -26 153 26 -287 -85
2024h5l04J57K24K0j10R7J43j58J52l56K22R5Jj59J17NK31j99j28J45n6j61j2
$$ -85 -389 -232 -8 12 -98 -1 142 -16 136 -220 2 97 98 -61 56 61 292 93 -35 110 54 -107 -119
2047a19K72k39R8j24J99J20k97j60J39L01j98J30K89k23J10jp1n5m1l22R9k51
$$ -119 153 -86 12 -112 87 207 -90 -250 -111 190 -8 122 411 188 298 297 226 171 130 -192 -93 -344
2069c44p1J05n6K67j11r5K51M9J15J10l17q8J62K06k38L1K30n4o9J59R1j82p3
$$ -344 -415 -310 -366 -99 -210 -305 -54 -5 110 220 -97 -185 -23 183 -55 -24 206 152 83 242 333 151 78
2092G8Q2j18m16j46L45j50O6j08L01l06L36J00P7J92k34Oj21j01q1K25n5k5K11
$$ 78 160 42 -374 -520 -175 -325 -259 -367 -66 -372 -36 64 141 333 99 105 -16 -117 -198 27 -28 -53 158
2115A58l2k42n2p3K25p6l3J48o1K58k63N9Q9j7k2m49K58M9J14L8k06J65j2J5M7
$$ 158 126 -116 -168 -241 -16 -92 -125 23 -38 220 -43 16 105 88 66 -383 -125 -76 38 76 -130 35 23 38 85
2140H5J64l23J07j19j2j1n7K60q2K8j7J29m2m0J7O9k26J25j55o1K5K55j69J50
$$ 85 249 -74 33 -86 -98 -109 -166 94 12 40 23 152 110 70 87 156 -70 55 -100 -161 -136 119 -50 100
2164A00o5K40k81J39jmk39J45j86J4n7K55L4k11K28N7k5k90M88l36j28K98k73
$$ 100 35 275 -6 133 132 128 -111 34 -152 -138 -195 60 94 -117 111 168 143 -147 341 5 -123 175 -98
2187i8j09N7j9o6R8J0Q6P4k40M6nK76l61R9K96k89L69k16Q2o7J53kj24K03k67
$$ -98 -207 -150 -169 -235 -137 -127 -41 33 -207 -161 -166 110 -251 -152 144 -145 224 8 90 23 176 174 50 253 -14
2212a4n8j6K02j65R3j92P4R1k38Q1J01k80M10M9n4j56J1J45J21l77J51j33Q7K33
$$ -14 -72 -88 114 -51 42 -150 -76 15 -223 -142 -41 -321 89 138 84 -72 -61 84 205 -172 -21 -154 -67 166
2236A66l28K51r1K58l64K07L4Nk59p3J40K17k69J34K2k43L25m4j30NJ04k93K46
$$ 166 -162 89 -2 256 -108 99 133 138 -121 -194 -54 163 -106 28 50 -193 132 88 -42 -37 67 -226 20
2259B0k12J67l92M07k13L34k26l7K38m1J23J22j07k8j7j68l7J91k29K02K93j11
$$ 20 -192 -25 -417 -10 -223 111 -115 -152 86 45 168 290 183 155 138 -30 -67 124 -105 97 390 279
2281B79j87J9l8q2L6j72q0K2j36n1N8K81L19r5j96K07Q3j73%q6O0k50J27rl01
$$ 279 92 111 73 -9 27 -145 -225 -203 -339 -390 -332 -51 268 173 -23 184 267 94 94 8 68 -182 -55 -64 -365
2306c65N52k00O6K31k81J37lj57J44k01j38J42j44L0%J69n2K53k50K45P2k36K19
$$ -365 187 -13 53 284 3 140 137 -20 124 -77 -215 -73 -217 -187 -187 -18 -70 183 -67 178 250 14 233
2329B33k31o7r5J81q9L4j17K61k80L11j93M77n94M24p5K70l67k53M7j50L51k90
$$ 233 2 -65 -160 21 -68 -34 -151 110 -170 141 -52 425 -169 255 180 450 83 -170 -123 -273 78 -212
2351b12j5j9M21l07j02M49l93j3J88r2p6j4K54j06K16O3p7L13l98J97L0j52K1
$$ -212 -227 -246 175 -132 -234 215 -178 -191 -3 -95 -171 -185 69 -37 179 242 165 478 80 277 307 155 176
2374A76j48j00p0m6k3n1K55p2k15M10j7J11l05L69j59j5j56j15J98p3m6K58o5
$$ 176 28 -72 -142 -188 -211 -262 -7 -79 -294 116 99 210 -95 274 115 100 -56 -171 27 -46 -92 166 101
2397A01K83l98J50j16J5n1k36L74q8j20j40N2J99r2P0J12j91M3N0J2J2M7l32K98
$$ 101 384 -14 136 20 35 -16 -252 122 34 -86 -226 -174 25 -67 3 115 -76 -33 17 29 41 88 -244 54
2421E4j53j41K32L55m41p1J15j13N58m45N1k04K90O6m9k24L40j54J67n8k20J9
$$ 54 -99 -240 -8 347 -94 -165 -50 -163 395 -50 1 -203 87 153 104 -120 220 66 233 175 -45 -26
2443b6J32ml51k1K20o5m3K28M4n0j79k2J98j01j66J92L62l22R6nj01J21J04k65
$$ -26 106 102 -249 -270 -50 -115 -158 70 114 64 -115 -137 61 -40 -206 -14 348 26 122 117 16 137 241 -24
2467b4J30l9L9r7kr2L9K14j55j01m6j69J26J94j15j92J54L17j31K78J14j56k47
$$ -24 106 67 106 9 7 -85 -46 168 13 -88 -134 -303 -177 17 -98 -290 -136 181 50 328 442 286 39
2490C9r3O8M5Q5k00PJ52o8LM8k73K29jr1k92L36P6j74O0j55L43k66J97Q0Q1k30
$$ 39 -54 14 59 144 -56 -49 103 35 38 86 -187 42 41 -50 -342 -6 70 -104 -44 -199 144 -122 75 155 236 6
2516FK58l46J47m3j59K75j60p0j49K09J5J32o5r5K70l49J83j67R5P3K20k46MM7
$$ 6 264 -82 65 22 -137 138 -22 -92 -241 -32 -17 115 50 -45 225 -124 59 -108 -13 60 280 34 38 85
2540H5p1k67O6J75j47M12l29MLm3J31m4p8K37k5j44K11j68k6K07j11j18L85l32
$$ 85 14 -253 -187 -12 -159 253 -76 -72 -69 -112 19 -25 -103 134 109 -35 176 8 -18 189 78 -40 345 13
2564A3N8k40K26l47L29k20J27j2J52j55N6K65j98k59J48K1O5O1r1Q0q3o4K57j59
$$ 13 71 -169 57 -290 39 -181 -54 -66 86 -69 -13 252 54 -205 -57 -36 29 90 -1 79 -4 -68 189 30
2588C0P8K12j50q8K27l40O9j15J77m8j19N9p0L5O1P9O4l17L33O4j33k12J59l6
$$ 30 108 320 170 82 309 -31 38 -77 100 52 -67 -8 -78 -43 18 97 161 -156 177 241 108 -104 55 19
2612A9J7M8j25p0O5J70j4k7l31M29j19j78N9J20l0j8J5j08J20k51J09Mm4J48Q6
$$ 19 36 84 -41 -111 -46 124 110 83 -248 181 62 -116 -57 63 33 15 30 -78 42 -209 -100 -96 -140 8 94
2637I4R9k42o1J83k13J08P4J37j09j66J88j31J41o2j01L3n5J39j25K5j15j03O8
$$ 94 193 -49 -110 73 -140 -32 42 179 70 -96 92 -39 102 40 -61 -28 -83 56 -69 -44 -159 -262 -194
2660a94K39q8j86K44j19J63k16K26j54o9K26m4l30L39K4j58k1L00L2j4L1j59k02
$$ -194 45 -43 -229 15 -104 59 -157 69 -85 -154 72 28 -302 37 61 -97 -118 182 214 200 231 72 -130
2683a30L80j96k22O8K2J50k13p1J50rO7j11J0L8J07Nk09J97n1N7j5j29J01J72
$$ -130 250 54 -168 -100 -78 72 -141 -212 -62 -71 -4 -115 -105 -67 40 45 -164 33 -18 39 24 -105 -4 168
2707A68m3k35M40k44K03l24J17o0O7j18o0j2J17n3R7o5J9q4o5J53l9O7k91J01
$$ 168 125 -110 330 86 289 -35 82 22 89 -29 -89 -101 16 -37 60 -5 14 -70 -135 18 -21 46 -245 -144
2731a44Q1j09o9j7J98j30J71J20K8l24L62k05N0P3k75J48r7J23p5O8M9j80K2L22
$$ -144 -63 -172 -241 -258 -60 -190 -19 101 129 -195 167 -38 12 85 -190 -42 -139 -16 -91 -23 26 -154 -132 190
2755A90l01L71k34L9j21n2n1K12k72K26l2J23j35Q9M9l2P3k17J38j7n3J00J19
$$ 190 -111 260 26 65 -56 -108 -159 53 -219 7 -25 98 -37 52 101 69 142 -75 63 46 -7 93 212
2778B12P6j71P3m08J46n8K1j2N8j40K9j21K73LN5Qk87N97j00l34J38J17k56N5
$$ 212 288 117 190 -218 -72 -130 -109 -121 -63 -203 -174 -295 -22 -19 36 44 -243 354 254 -80 58 175 -81 -26
2802b6J2r3p9J26q1J28rK80l85L58k48J7J36k71J19j76q1K03J34l4o7no9op4L09
$$ -26 -14 -107 -186 -60 -141 -13 -22 258 -127 231 -17 0 136 -135 -16 -192 -273 -70 64 30 -37 -42 -111 -117 -191 118
2828A18q5k52M37k49P6l26J88J11M1j33P6J43J26j42m0o0N1l3O7j01J1j34K80
$$ 118 33 -219 218 -31 45 -281 -93 18 59 -74 2 145 271 129 89 29 80 47 114 13 24 -110 170
2851A70k15J98m08K52J78j57M7J44k80J08n7nJ36k64K66J19k76J68n6j15N2k04
$$ 170 -45 153 -255 -3 175 18 65 209 -71 37 -20 -25 111 -153 113 232 -44 124 68 -47 5 -199
2873a99K85J3q5j96K52j57R0k4p9J42K22m23K58l9K6j75Q1n2o3n5R6O6j02L0M70
$$ -199 86 99 14 -182 70 -87 3 -21 -100 42 264 -159 99 60 86 -89 -8 -60 -123 -178 -82 -16 -118 -88 382
2898C82n25J11K52m16K10l2j5j49K34j19l9M17j12J02j87k91J06J63K0m19K21
$$ 382 -143 -32 220 -196 14 -18 -33 -182 52 -67 -106 311 199 301 114 -177 -71 92 112 -307 -86
2919h6J30q3j23K61k45J59J01P0j50l7l8J21J6K48j06l91J13K45p1j06o6l17L09
$$ -86 44 -39 -162 99 -146 13 114 184 34 -3 -41 80 96 344 238 -153 -40 205 134 28 -38 -355 -46
2942d6J76j84q4J87r5o8L4J5k00J96J16j1P1kq7J16r5J50j66LJ01m9j33M6K5J11
$$ -46 130 -54 -138 49 -46 -114 -80 -65 -265 -69 47 36 107 105 18 134 39 189 23 26 127 78 -55 -9 16 127
2968A27j96o1M7K27k18K3J19j32Q3r7J97j81J39k97M42k44j20ll0L64j78m9M1
$$ 127 -69 -130 -83 144 -74 -51 68 -64 19 -78 119 -62 77 -220 222 -22 -142 -145 -175 189 11 -38 3
2991CN7Q8Pj9k47J36m7J02n4K98j24k61j47K29j04N3jl78O16k52R0m7j0r9m4J19
$$ 3 60 148 155 136 -111 25 -22 80 26 324 200 -61 -208 21 -83 -30 -31 -409 207 -45 45 -2 -12 -111 -155 -36
3017c6K17l36J4J0J00J72o1k90L35O0P2Ok55j75L25k8p8p8J54l60L61j76L2J13
$$ -36 181 -155 -141 -131 -31 141 80 -210 125 185 257 263 8 -167 158 130 52 -26 128 -232 129 -47 -15 98
3041I8o3j25J58rk40MK6L09p7N6l09J56K72j86L6j08P6j5J14j22l2j12L31n6l49
$$ 98 35 -90 68 59 -181 -177 -151 158 81 137 -172 -16 256 70 106 -2 74 59 173 51 19 -93 238 182 -167
3066a67K30q7K7j19j8J21q7Qj81L43r5r3L81k10J30j87j60R0K80j58k47J46J26
$$ -167 63 -24 3 -116 -134 -13 -100 -92 -273 70 -25 -118 263 53 183 -4 -164 -74 206 48 -199 -53 73
3089G3K8j08oj1R0O7M6j57M9k95K45l50N09l1Q3j25M9j66K23k95j88M09j84M8
$$ 73 101 -7 -13 -24 66 133 179 22 71 -224 21 -329 180 149 232 107 156 -10 213 -82 -270 139 -45 3
3113Cr2J53k44N2K77l45K23Q7j5P9j75lj79P8J40j58rJ15l2J14o9L06k69j50J33
$$ 3 -89 64 -180 -128 149 -196 27 114 99 178 3 0 -179 -101 39 -119 -128 -13 -45 69 0 306 37 -113 20
3138B0k14J04J0K5L8N7L9j2P1J62k69j46N3J31k03M9R4M5R0Oj56Q3j71K6q7Q1
$$ 20 -194 -90 -80 -55 -17 40 79 67 138 300 31 -115 -62 69 -134 -85 9 54 144 150 -6 77 -94 -68 -155 -74
3164g4R3l0J46k80L19l59L33k90r9L44J3P2j72R7K2R7m33J34M2M7Q8j60J22r0
$$ -74 19 -11 135 -145 174 -185 148 -142 -241 103 116 188 16 113 135 232 -201 -67 -25 22 110 -50 72 -18
3188a8J86k13K04m3j4K40m46J88k20N3M4J0M1L22l74n4O6J50j74K17R5k49l4J9
$$ -18 168 -45 159 116 102 342 -104 84 -136 -83 -39 -29 12 334 -40 -94 -28 122 -52 165 260 11 -23 -4
3212dJ7QJ93k63M6K01r8M2q5m4O7j85K86l15rJ89l0k07K04m6j28k9q8M88j61l90
$$ -4 13 21 214 -49 -3 198 100 142 57 13 80 -105 181 -134 -143 46 16 -191 13 -33 -161 -190 -278 210 49 -341
3238c41L64q8q2J69J22j26J95k36K34O6m64J81l7J66j91K52l36J73J02j30j47
$$ -341 23 -65 -147 22 144 18 213 -23 211 277 -187 -6 -43 123 -68 184 -152 21 123 -7 -154
3259a54O2J40j48m9J05P3j14Q7K6P4O5rn9j18J59o9L1l18R8o4K10j7m5k83J82
$$ -154 -92 48 -100 -149 -44 29 -85 2 28 102 167 158 99 -19 140 71 102 -216 -118 -182 28 11 -34 -317 -135
3284a35J25j90K64j74N1n9J68nj11k95K22P9J71j26J74k20J85l7L6k93J06L39
$$ -135 -10 -200 64 -110 -59 -118 50 45 -66 -361 -139 -60 111 -15 159 -61 124 87 123 -170 -64 275
3306B75j41Q6k23O7j42O5L2p3o2L74l53K25J5M9r1k46J10J9L8k96L97p6q8m13
$$ 275 134 220 -3 64 -78 -13 19 -54 -116 258 -95 130 145 194 103 -143 -33 -14 24 -272 125 49 -39 -452
3330d52J29M66j76R5r7L38k11j40J86M4j11L0m0K9l6j10K22m1j18j20M9j5%K2
$$ -452 -323 143 -33 62 -35 303 92 -48 138 182 71 101 61 90 54 -56 166 125 7 -113 -64 -79 -79 -57
3354e7j57J79j09J66j03j20K81J08j19J23j02j80L3R7K2j99m9J19RK7n0K72l75
$$ -57 -214 -35 -144 22 -81 -201 80 188 69 192 90 -90 -57 40 62 -137 -186 -67 -58 -31 -81 191 -184
3377a84J61k69N2N43j10j02j81J67k1j21N9j01Q1l4n1J00K01l62J91k4o1J44P7
$$ -184 -23 -292 -240 303 193 91 -90 77 56 -65 -6 -107 -26 -60 -111 -11 190 -172 19 -5 -66 78 155
3400A55l35K37K04j91O2O8k63J6m8n6j19L29M8k73NO2Q9J45r0K2M1j52J28l14
$$ 155 -180 57 261 70 132 200 -63 -47 -95 -151 -270 59 107 -166 -161 -99 -10 135 45 67 108 -44 84 -230
3424b30L32l7N7j70P1k9r5J51j26K22J2qk33P7j69K00j31L2k4J78k66M8J63M8
$$ -230 102 65 122 -48 23 -6 -101 50 -76 146 158 150 -83 -6 -175 25 -106 -74 -98 80 -186 -138 25 73
3448G3nj76o6L25j94J26j14o6J21j26PJ81l3L6P8J03k52j06MM12k73j54J76j88
$$ 73 68 -108 -174 151 -43 83 -31 -97 24 -102 -95 86 53 89 167 270 18 -88 -84 328 55 -99 77 -111
3472a11L23k85J2K27k53Nq5L3k5J57k62J47K01j02o2K9J57k63L25j33q0Q1j12
$$ -111 212 -73 -61 166 -87 -82 -167 -134 -159 -2 -264 -117 84 -18 -80 -51 106 -157 168 35 -45 36 -76
3495g6J32k2j09l3p0N3K66l0M2k13l8p0K68j20J77J61m61J85J13k2l60K02J15
$$ -76 56 34 -75 -108 -178 -125 141 111 153 -60 -98 -168 100 -20 157 318 -143 42 155 133 -227 -25 90
3518I0j84rP1oK08oR6k73l0O1k21J43J16j05k6O9O7L0Q1j04J9o5K8L0J18l07J03
$$ 90 -94 -103 -32 -38 170 164 260 -13 -43 18 -203 -60 56 -49 -75 -6 61 91 172 68 87 22 50 80 198 -109 -6
3545fj07n7J28P9%k7j89O6L05k83J06k2j27j39K80J39k27R1j37M63k65l2k33K22
$$ -6 -113 -170 -42 37 37 10 -179 -113 192 -91 15 -7 -134 -273 7 146 -81 10 -127 336 71 39 -194 28
3569B8j34J99j70mJ27r6q7q2K76m3k8o6k3J54k09J47L6o0L68k95K44j45j97o0
$$ 28 -106 93 -77 -81 46 -50 -137 -219 57 14 -14 -80 -103 51 -158 -11 25 -35 333 38 282 137 -60 -120
3593a20K87l12l2J16r3J38R2j64O9o7K09%J32k83l0J23K2R0j30L10n66J12m0N9
$$ -120 167 -145 -177 -61 -154 -16 76 -88 -19 -86 123 123 255 -28 -58 65 87 177 47 357 -209 -97 -137 -78
3617g8J53n2M5k63K84j77K19J97m35J67K23k06L5j01lR9k81L8J93m54J73M33j34
$$ -78 75 23 68 -195 89 -88 131 328 -107 60 283 77 112 11 8 107 -174 -136 57 -397 -224 209 75
3640G5l32L75k21j3N0k1rK70j79j57K46o6j03K20Q4j11O6o4P9j40L0j48K14n8
$$ 75 -257 118 -103 -116 -66 -87 -96 174 -5 -162 84 18 -85 135 219 108 174 110 189 49 79 -69 145 87
3664H7j43j47j8j1n3J35J3J66J57j54%k02J11K20r2r1Q4j24M8n7r0J28j07J53
$$ 87 -56 -203 -221 -232 -285 -150 -137 29 186 32 32 -170 -59 161 69 -22 62 -62 -14 -71 -161 -33 -140 13
3688A3k7o6k9OR8J20K78m48L2J99J83k06k46J72q6J0k3K31j85r9P2k56j8K9M95
$$ 13 -14 -80 -109 -103 -5 115 393 -55 -23 176 359 153 -93 79 -7 3 -20 211 26 -73 -1 -257 -275 -246 249
3713B49m01j39N46l18R1L2M0j9k6J45k13J49l01K01Q0m6j63J23n4j8k4M0p2p7
$$ 249 -152 -291 255 -63 28 60 100 81 55 200 -13 136 -165 36 116 70 -93 30 -24 -42 -66 -26 -98 -175
3737a75J05Q1j04m4J55r7K93k22P0j73K03jJ11k15J12m7oL50n14J52l66J52J93
$$ -175 -70 11 -93 -137 18 -79 214 -8 62 -111 92 91 202 -13 99 52 46 396 -118 34 -332 -180 13
3760A3k8J21r4n3l7OJ98j93j18Q6K39j16Q5n5k3J36j6j93L7j28K07m4K3j84J00
$$ 13 -15 106 12 -41 -78 -72 126 -67 -185 -99 140 24 109 54 31 167 151 -42 -5 -133 74 30 53 -131 -31
3785c1k41L07j1N0j14R8m5L7m11M60k82J25K8l66K79j20L67m62N68j62l7qK01
$$ -31 -272 35 24 74 -40 58 13 50 -361 99 -183 -58 -30 -396 -117 -237 130 -332 236 74 37 29 230
3808B30k82k9J37j33J62j97R1j75L51j25j61M14k08j45O6j73o5J08q3j32L95L4
$$ 230 -52 -81 56 -77 85 -112 -21 -196 155 30 -131 283 75 -70 -4 -177 -242 -134 -217 -349 46 80
3830H0L1j33O4R0k63N8L48k97q5j32J64p8J82L26k46q9j30J61l4K42j77j45l3
$$ 80 111 -22 42 132 -131 -73 275 -22 -107 -239 -75 -153 29 355 109 20 -110 51 17 259 82 -63 -96
3853i6J57k05m9l2L67p9K02%l85J29q8j0J05l52J72K82k36K75j19o6J18l7P7k13
$$ -96 61 -144 -193 -225 142 63 265 265 -120 9 -79 -89 16 -336 -164 118 -118 157 38 -28 90 53 130 -83
3877h3p4P4l2K63j30R0k15k07K32P1r6L11j11J2k4k14Q0q5P6J54q3n1k3J28L0
$$ -83 -157 -83 -115 148 18 108 -107 -314 -82 -11 -107 204 93 105 81 -133 -53 -138 -62 92 9 -42 -65 63 93
3902I3O5j58K36l82J20J8l1q3KK79l30N4J13N0k69K07nj39O4q8J65p8J88j73L22
$$ 93 158 0 236 -146 -26 -8 -39 -122 -120 159 -171 -117 -4 46 -223 -16 -21 -160 -96 -184 -19 -97 91 -82 240
3927B40k20p8K19q7O8k00K27j69j37j13L56k78M9K30j28M3o0L5J72l19L07k63
$$ 240 20 -58 161 74 142 -58 169 0 -137 -250 106 -172 -123 107 -21 22 -38 -3 169 -150 157 -106
3949a06J55J31j07j06q7m3J95l6r8%J80k62l6J80K38j51l6M4j19O2O1k6J2J71
$$ -106 49 180 73 -33 -120 -163 32 -4 -102 -102 78 -184 -220 -40 198 47 11 55 -64 -2 59 33 45 216
3973B16m09K03R2O1j32N1r2J36j80j18L68k80K72k34j48K09k20K38j36K82j41
$$ 216 -193 10 102 163 31 82 -10 126 -54 -172 196 -84 188 -46 -194 15 -205 33 -103 179 38
3994C8N8k60J45J05j78K04j96K41l59L00j07p9M0J69K6k07K15k81J91j03lk0K71
$$ 38 96 -164 -19 86 -92 112 -84 157 -202 98 -9 -88 -48 121 147 -60 155 -126 65 -38 -41 -61 210
4017B10m02L06j31ln1K4J68j6o7k0j22J41l6O8j60K12j35k80M22l63L20M3j02
$$ 210 -192 114 -17 -20 -71 -47 121 105 38 18 -104 37 1 69 -91 121 -14 -294 128 -235 85 128 26
4040B6r6P9N4J07j38L4j35L13n65L74k00J47J42p7Kk79N63k76j41n5J05j96J12
$$ 26 -70 9 63 170 32 66 -69 244 -321 53 -147 0 142 65 67 -212 351 75 -66 -121 -16 -212 -100
4063a00m2J30L63j30n76L58j03k2m1R7m1J27OM3j53n1L2J92l85K25l8M24m08J18
$$ -100 -142 -12 351 221 -355 3 -100 -122 -163 -66 -107 20 26 69 -84 -135 -103 89 -296 -71 -109 315 -93 25
4087B5k22R8Q1rOn5R5J36K4q6P4o9J9j83K8J39R0k36j52N0J26L3J41k66J42j32
$$ 25 -197 -99 -18 -27 -21 -76 19 155 179 93 167 98 117 -66 -38 101 191 -45 -197 -147 -21 12 153 -113 29 -103
4113a03oK33j8j18j18J42J69l99L00k66K56K2p5j6J46j20j2K82k76J54l40K09
$$ -103 -109 124 106 -12 -130 12 181 -218 82 -184 72 94 19 3 149 29 17 299 23 177 -163 46
4135D6Q0m51L1L9M35j81J69k52n8M58l03j34l6J37Q7J60j08J68k10R3k20Q6N9
$$ 46 126 -325 -294 -255 180 -1 168 -84 -142 316 13 -121 -157 -20 67 227 119 287 77 170 -50 36 95
4158I5L7k22K30j97K05j45j62J08K26l09j5J68k41L51j83n3K5J44m13K50K17l2
$$ 95 132 -90 140 -57 148 3 -159 -51 175 -134 -149 19 -222 129 -54 -107 -82 62 -351 -101 116 84
4180H4j82j21M77k60j7K31k50r8M48m88K42j48NJ50J13k99K27PJ31k27Q1j9j28
$$ 84 -98 -219 258 -2 -19 212 -38 -136 312 -176 66 -82 -77 73 186 -113 114 121 252 25 106 87 -41
4203d1Q7Q4q2l44K31J68l2R3p0N8j13L5l3J41m3k91jl1J38L69l26o5J62P3k32
$$ -41 46 130 48 -296 -65 103 71 164 94 152 39 74 41 182 139 -152 -153 -184 -46 323 -3 -68 94 167 -65
4228f5K04j18p1R2k99M2K85Q9k72l6J38j01J22K04J65k56l37O5K48j29k3k9l94
$$ -65 139 21 -50 42 -257 -215 70 159 -113 -149 -11 -112 10 214 379 123 -214 -149 99 -30 -53 -82 -476
4251d76K66J95K8m8k03L87Om2n9j95q2K77N0k73L44j19j68J08J6l3K90Lj20j84
$$ -476 -210 -15 13 -35 -238 149 155 113 54 -141 -223 54 104 -169 175 56 -112 -4 12 -21 269 272 152 -32
4275c2j57L78j55J19R0l31K01m4oo0l1l0J1k02L22j62J8k92M68j41j14P6P9m0
$$ -32 -189 189 34 153 243 -88 113 69 63 3 -28 -58 -47 -249 73 -89 -71 -363 105 -36 -150 -74 5 -35
4299c5O0r5n0K41j12q9j95L93l90L59J33q4p1l9jr0K66k83J74p6K20k66R3p3l2
$$ -35 25 -70 -120 121 9 -80 -275 118 -272 87 220 136 65 26 25 -65 201 -82 92 16 236 -30 63 -10 -42
4324d2K4O8k25K61l97L60j43k4o7J13K29k02m2L98m53J01K10k55j10l2L15O0k31
$$ -42 -18 50 -175 86 -311 49 -94 -118 -185 -72 157 -45 -87 311 -142 -41 169 -86 -196 -228 87 147 -84
4347h4k43J81J42J34q9l7L62k06k36OJ83j76K29L4k16Q3k49j05P9L09j30K60l10
$$ -84 -327 -146 -4 130 41 4 366 160 -76 -70 113 -63 166 200 -16 67 -182 -287 -208 101 -29 231 -79
4370g9J93j34j72L50k7j63J14J20k22j1k00M8k4J65Q1j14J69J16j99l1j0j04P7
$$ -79 114 -20 -192 158 131 -32 82 202 -20 -31 -231 -183 -207 -42 39 -75 94 210 11 -20 -30 -134 -57
4393e7J12j44J32j12m3J06L1K82k19k06J40k26K18lP5k36J82j04K15j59P5m9P4
$$ -57 55 -89 43 -69 -112 -6 25 307 88 -118 22 -204 14 11 86 -150 32 -72 143 -16 59 10 84
4416H4l24L32j81K74l54J19k09J19kqN5J21k57J64q3K59P6n1j01J61n4k9J33k47
$$ 84 -240 92 -89 185 -169 -50 -259 -140 -142 -150 -95 26 -231 -67 -150 109 185 134 33 194 140 111 244 -3
4440ck75M29P8j55j98o5M9L31k2j45J47k17J50o5o7Jm6q8J45j7J68j18M1k57J66
$$ -3 -278 151 229 74 -124 -189 -140 191 169 24 171 -46 104 39 -28 -27 -73 -161 -16 -33 135 17 58 -199 -33
4465c3r5P3J76P4o5l04K80j45K32l12k5K07k62J87N5J03j40k9n8Q2n8N5J0J90
$$ -33 -128 -55 121 195 130 -174 106 -39 193 -119 -144 63 -199 -12 43 146 6 -23 -81 1 -57 -2 8 198
4489A98j52P7q6n0J29q5k06K82j32L4K30k83j54N4K76l37L35L1r6j3O0J46l50
$$ 198 46 123 37 -13 116 31 -175 107 -25 9 239 -44 -198 -144 132 -205 130 161 65 52 112 258 -92
4512i2L8J57m29L56j65P1n8k39M23k7r2P4J43k04o7J39K17l67J07J93j33j40R9
$$ -92 -54 103 -326 30 -135 -64 -122 -361 62 35 -57 17 160 -44 -111 28 245 -122 -15 178 45 -95 4
4535Do7N46m27M0j99j2K57k64J40m2j10N9J08j15R1j34K13k0M0l01L88o2q7o9
$$ 4 -63 483 56 96 -103 -115 142 -122 18 -24 -134 -75 33 -82 9 -125 88 68 108 -193 195 133 46 -23
4559b3P3k06j18K27J31Q9l40J74Q0l1M1j23J84l45K06j01K8r1RP3j48K40J81k74
$$ -23 50 -156 -274 -47 84 173 -167 7 87 56 97 -26 158 -187 19 -82 -54 -145 -136 -63 -211 29 210 -64
4583f4J42R9k57J03l4J51k18P7K3j02O5j70J42OJ88k96J11j8L56l86J65k3o5j74
$$ -64 78 177 -80 23 -11 140 -78 -1 22 -80 -15 -185 -43 -37 151 -145 -34 -52 304 -82 83 60 -5 -179
4607a79K14q8K18j56K06k34k1r4K18J90k04n5k06J32q0J34m7J14j2J44j61j63
$$ -179 35 -53 165 9 215 -19 -40 -134 84 274 70 15 -191 -59 -139 -5 -52 62 50 194 33 -130
4629a30L03j32p2J65N5k91J74l3n8J64k71M58k61k45L58l52j09J62J23K75k63
$$ -130 173 41 -31 134 189 -102 72 39 -19 145 -126 332 71 -174 184 -168 -277 -115 8 283 20
4650B0j0L3L12n06L60k10l10J07L30p5p4nJ22o4j45N7J25m1n9k9K2n9p3P1M8j24
$$ 20 10 43 355 -151 209 -1 -311 -204 126 51 -23 -28 94 30 -115 -58 67 26 -33 -62 -40 -99 -172 -101 -53 -177
4676a77o5N72j55j95P0O4P3j08p4p1P2J4qj71R1L20k96o5J65Pl3j54n5K52l28
$$ -177 -242 330 175 -20 50 114 187 79 5 -66 6 20 12 -159 -68 252 -44 -109 56 63 30 -124 -179 73 -255
4701b55J48M1j68K47N4j10M1j66O8K78k86R7r9j00J6P0m7K17p4j01J82Jo5J0p0
$$ -255 -107 -66 -234 13 67 -43 -2 -168 -100 178 -108 -11 -110 -210 -194 -124 -171 46 -28 -129 53 54 -11 -1 -71
4726g1J05j0r6P3Q4j97M5J25k03J24N2k95J71J12k59M05j52%N6j67R1j78K36n8
$$ -71 34 24 -72 1 85 -112 -67 58 -145 -21 31 -264 -93 19 -240 165 13 13 69 -98 -7 -185 51 -7
4750gJ14k79K95J98l27P4Loj51l6J81j55J18jj4j12L4pJ52j4o7m2qJ27l52L38
$$ -7 107 -172 123 321 -6 68 71 65 -86 -122 59 -96 22 21 7 -105 -71 -78 74 60 -7 -49 -57 70 -282 56
4776E6L4j59M9k9mJ39O0k57J70M4j93k7K36n4p7J08l77K79j2p5J24j78O5Q3p5
$$ 56 90 -69 -20 -49 -53 86 146 -111 59 103 -90 -117 119 65 -12 96 -281 -2 -14 -89 35 -143 -78 5 -70
4801g0P4M1J90j12km38M39J94m11J23N1J33k54J27j06L2m6k7J56k22p2L17r1k42
$$ -70 4 45 235 123 121 -317 122 316 -95 28 79 212 -42 85 -21 11 -35 -62 94 -128 -200 117 26 -216
4825b16J53J49J76j52k70L12l95L33l18K27J26k6k0j14P5k17O4l4K28J9j63n7
$$ -216 -63 86 262 110 -160 152 -243 90 -228 -1 125 99 79 -35 40 -177 -113 -147 81 100 -63 -120
4847a20K17j14O5q5n3J40k0J51l8j67Q0j72k7lK16L0k08J99o2L0j33K18k21m4
$$ -120 97 -17 48 -37 -90 50 30 181 143 -24 56 -116 -143 -146 70 100 -108 91 29 59 -74 144 -77 -121
4871a21J39j1j60K88l40J08J66p0nK8N3K7J35m34K5Q8J19J14k25Rm2K51p0J30
$$ -121 18 7 -153 135 -205 -97 69 -1 -6 22 75 102 237 -197 -172 -84 35 149 -76 -67 -109 142 72 202
4895B02l05J2P6K58j42l9L8j63J7J26%p9k00J14k1m0M1O0J23k15L1J15m2J60k02
$$ 202 -103 -91 -15 243 101 62 100 -63 -46 80 80 1 -199 -85 -106 -146 -105 -45 78 -137 -106 9 -33 127 -75
4920g5p7J05L7Pj49K57k78o3K65K13k87K72k02J07j89OR0J49j22n1q2j42J33P2
$$ -75 -152 -47 -10 -3 -152 105 -173 -236 29 242 -45 227 25 132 -57 -51 39 188 66 15 -67 -209 -76 -4
4944dJ21j25J32o7l05J52R2r7J02Rr3k13K25J99k76N3m1J77k31M21k66J42J14
$$ -4 117 -8 124 57 -248 -96 -4 -101 1 10 -83 -296 -71 128 -148 -95 -136 41 -190 231 -35 107 221
4967B21j29k14j03M09R7k97p4J18J90j26j10J02m9o4R9p8k0L71m18j68K78j56
$$ 221 92 -122 -225 184 281 -16 -90 28 218 92 -18 84 35 -29 70 -8 -28 343 -75 -243 35 -121
4989a21J8K27k95J93J96J2k36oo6q2Q6R3l0l49K42J21j23nj01L35k15P3J96j8
$$ -121 -103 124 -171 22 218 230 -6 -12 -78 -160 -74 19 -11 -360 -118 3 -120 -125 -226 109 -106 -33 163 145
5013A45j23j08r3K46J1lj16j3J19K99m23J2J10j62OK53l30K48J04j46J98m19L61
$$ 145 22 -86 -179 67 78 75 -41 -54 65 364 -59 -47 63 -99 -93 160 -170 78 182 36 234 -185 176
5036A76p5l7K31k47P5n1J8j91o9J75P5J03k44J96j47P0m2K2k87K83j45J03K35
$$ 176 101 64 295 48 123 72 90 -101 -170 5 80 183 -61 135 -12 58 16 38 -249 34 -111 -8 227
5059B27o50O32j34j80J28n4j00J36Q8P7p7p7N3k10M63o19L18o9J34j73L8j65M0
$$ 227 -423 209 75 -105 23 -31 -131 5 93 170 93 16 69 -141 322 -297 21 -48 86 -87 -49 -214 -174
5082a74K64J66j97j82O7J50N1k44K00k74K70l10J96PO7J02J4j87j21L4O3l2O4
$$ -174 90 256 59 -123 -56 94 145 -99 101 -173 97 -213 -17 -10 57 159 173 -14 -135 -101 -38 -70 -6
5105fk57J01R3l4j78l7L97l56L40J04r5n6J37k04M5n0P4L1o6j36K47j02n6M2j75
$$ -6 -263 -162 -69 -103 -281 -318 79 -277 63 167 72 16 153 -51 -6 -56 18 49 -17 -153 94 -8 -64 -22 -197
5130a97K09J55m13J8M84k73j89M17k52L8J30m2k35J30j41K73J74l28R8o0j4m7
$$ -197 12 167 -246 -228 256 -17 -206 211 -41 -3 127 85 -150 -20 -161 112 286 -42 56 -4 -18 -65
5152f5J65q3j39j35J31J45k63K34O2K5k22J88k2K61k31k2j33P7k08K02k50J79
$$ -65 100 17 -122 -257 -126 19 -244 -10 52 77 -145 43 21 282 51 29 -104 -27 -235 -33 -283 -104
5174a04J41J0k11L11J44m26J57M3N6r1J17k23p1J93K6K23L0l25j52J27K56j37
$$ -104 37 47 -164 147 291 -135 22 65 121 30 147 -76 -147 46 72 295 325 0 -152 -25 231 94
5196I4j04O5m7k10J19o0j11L81k03j0K37j2j43m9j05J91N8k09j01L63J06l77K67
$$ 94 -10 55 8 -202 -83 -143 -254 127 -76 -86 151 139 -4 -53 -158 33 91 -118 -219 144 250 -127 140
5219A40l38J0O8p4J17O9N8j59j8L27j78K2n2j65J32J77m1p5J5K84k33j20K24j19
$$ 140 -198 -188 -120 -194 -77 -8 50 -109 -127 200 22 44 -8 -173 -41 136 95 20 35 319 86 -34 190 71
5243G1P6J36j25k47J88l01K48o1k04L09l39N52l08j90L82j52k78N07k49J2Q6L0
$$ 71 147 283 158 -89 99 -202 46 -15 -219 90 -249 303 -5 -195 187 35 -243 264 15 27 113 143
5265A43j29n5k02L31j42K3M6N3J2J85m23K69j14j04J33j03j9K51j55j87N8J89
$$ 143 14 -41 -243 88 -54 -31 15 68 80 265 -158 111 -3 -107 26 -77 -96 155 0 -187 -129 60
5287F0j92J00l62N36j58O9k21K25j19K4k34K26K28j91J03k89K78j31r2J28R8j84
$$ 60 -132 -32 -394 142 -16 53 -168 57 -62 -38 -272 -46 182 -9 94 -195 83 -48 -140 -12 86 -98
5309i8J35k18L74m63L17n5J04j01Q5M7l24L28j20k79L18m3j36L9M2k5MP5j11J49
$$ -98 37 -181 193 -270 47 -8 96 -5 80 127 -197 131 11 -268 50 7 -129 -90 -48 -73 -69 6 -105 44
5333D4M4j65L1k98K15J10Q5P2k61J34J92k73J95j55Qj7j2L15k25k85K17q8q1K05
$$ 44 88 -77 -46 -344 -129 -19 66 138 -123 11 203 -70 125 -30 -22 -39 -51 264 39 -246 -29 -117 -198 7
5357Gj66J00Q5j39L25j68n9j99J00j1K63j31K93p7k67M5J24k45%Q7J5m9N2j33
$$ 7 -159 -59 26 -113 212 44 -15 -214 -114 -125 138 7 300 223 -44 1 125 -120 -120 -33 -18 -67 -15 -148
5381a48k1O9Q3K46m47K01k24J28J32K0R3l70P8J68mp3J8J83q6K9k4j05N2J81j25
$$ -148 -169 -100 -17 229 -218 -17 -241 -113 19 39 132 -238 -160 8 4 -69 -51 132 46 75 51 -54 -2 179 54
5406E4k26L95m05L72k86J53J87j2l19J00J30l55L97p8k54J86l0J76j32Ok01R9
$$ 54 -172 223 -182 190 -96 57 244 232 -87 13 143 -212 185 107 -147 39 9 185 53 59 -142 -43
5428d3PK49j52j1k96K51j66J75N4j90J74p0j12J46k0P6k14n3N8N4J85j13k7m0
$$ -43 -36 213 61 50 -246 5 -161 14 68 -122 52 -18 -130 16 -4 72 -142 -195 -137 -83 102 -11 -38 -78
5452g8R4m9J72m05K28K2J23k02M78k90k3J43K5l01Q6k46M8K04K4J84l01K18k28
$$ -78 16 -33 139 -266 -38 -16 107 -95 383 93 70 213 238 -63 23 -223 -175 29 53 237 -64 154 -74
5475g4J93L9k61J32j41J20o6J04q2Q7j57J09m7O6K04j30J37k36R8j02m7P3o4j15
$$ -74 119 158 -103 29 -112 8 -58 46 -36 51 -106 3 -44 22 226 96 233 -3 95 -7 -54 19 -45 -160
5499a60K54K82l50l7j29K14N5k12J2K97k43k3J51J56k99M1j79J48j18R4R7k1J39
$$ -160 94 376 26 -11 -140 74 129 -83 -71 226 -17 -40 111 267 -32 9 -170 -22 -140 -46 51 30 169
5522A69j70j13O7O9q6K15j78J11j81J51j33j31K57kj56L76l26Q1k52J85O5k03
$$ 169 -1 -114 -47 22 -64 151 -27 84 -97 54 -79 -210 47 45 -111 265 -61 20 -232 -47 18 -185
5544a85M2K09J2o2j06N3L26k67q6m7P2O1j62K24N5j22J27L5l08j5N7j10J77r6
$$ -185 -143 66 78 16 -90 -37 289 22 -64 -111 -39 22 -140 84 139 17 144 179 -129 -144 -87 -197 -20 -116
5568a16n0J73pj18K48k81N6L85m18o1K56j46J28o0M4n9J95k44L2K12k65K18J2
$$ -116 -166 7 0 -118 130 -151 -95 290 -128 -189 67 -79 49 -11 33 -26 169 -75 -43 169 -96 122 134
5591A34j24k0k23J63L7o7k02M50l23R0J66l86N27l43K79N4m33K99m6m5k70J62
$$ 134 10 -10 -233 -70 -33 -100 -302 148 -175 -85 81 -305 222 -121 158 212 -221 78 32 -13 -283 -121
5613a21J76k07N8J43j82K05k61L77k18k5j57m7K73j56K64j59L0j0n3m1L83l31
$$ -121 55 -152 -94 49 -133 72 -189 188 -30 -55 -212 -259 14 -142 122 -37 -7 -17 -70 -111 272 -59
5635e9K84k62k4J04K0k23L7Pj3L7J8r5P4j05K01mj55J99O4LJ7k7j93K09l61M67
$$ -59 225 -37 -61 43 63 -160 -123 -116 -129 -92 -74 -169 -95 -200 1 -3 -158 41 105 108 125 98 -95 114 -247 220
5661B20k04P6j04n3J3O1L8k6j77q9J78j9L23J0j84L1k45R7K9j8Q2k9J63o0j00
$$ 220 16 92 -12 -65 -52 9 47 21 -156 -245 -67 -86 237 247 63 94 -151 -54 -25 -43 39 10 173 113 13
5686A3o5N1j30L7M0Q7J41j13j48k7M56m75J98J16l40J12n9J52JM2p3j38J81j7
$$ 13 -52 -1 -131 -94 -54 33 174 61 -87 -114 342 -133 65 181 -159 -47 -106 46 47 89 16 -122 59 42
5710D2j03J85J10p5l09M6L12l48q7%K11j00n0K63l58L13M1k24J84J26j86j12Q8
$$ 42 -61 124 234 159 -150 -104 208 -140 -227 -227 -16 -116 -166 97 -261 52 93 -131 53 179 -7 -119 -31
5733c1P6j01p0R9K15j76q3lJ09L9M3n9J45k62QP8j5K71k67j29J78L9k7K2j59K05
$$ -31 45 -56 -126 -27 188 12 -71 -74 35 74 117 58 203 -59 -51 27 12 283 16 -113 65 104 77 99 -60 145
5759A45J21l80jK20n0Q0q3J87j51J40m20M56k97R0k05K68p7K0j05K4K58l69K14
$$ 145 266 -114 -115 105 55 135 52 239 88 228 -192 264 -33 57 -148 120 43 63 -42 -18 240 -129 85
5782H5nJ99l46K28j42K69n3k59o5J40l8q7J29k52L41k34J36J6k10J04J19o4j17
$$ 85 80 279 -67 161 19 288 235 -24 -89 51 13 -74 55 -197 144 -90 46 62 -148 -44 75 11 -106
5805a06K44k83K13o7K3j8j58K40k2J84j90K30k58j04J08k0M6N7k89J31N7k69J18
$$ -106 138 -145 68 1 24 6 -152 88 66 250 60 290 32 -72 36 16 62 119 -170 -39 18 -251 -133
5828a33K85p8k42O7J39j3k31L45j1j37o6P3N9J08j32q5j82J64MK16L8j21L85m54
$$ -133 152 74 -168 -101 38 25 -206 139 128 -9 -75 -2 57 165 33 -52 -234 -70 -66 150 188 67 452 -2
5852bq1R9J48l8m4l0o9k19K41j34J13K52p9J70n15J17J13m1r5Q6j23J2L2J05N2
$$ -2 -83 16 164 126 82 52 -17 -236 5 -129 -16 236 157 327 -188 -71 42 1 -94 -8 -131 -119 -87 18 70
5877G0k7j22j6K46p2j84K10j39P5J50k46q7JK61k99m1J53P7j48K8J87k44K89r6
$$ 70 43 -79 -95 151 79 -105 105 -34 41 191 -55 -142 -141 120 -179 -220 -67 10 -138 -110 77 -167 122 26
5901B6q5l5J34o5q4o3O2L02l15J05J93j06L2M1j90J1J77j18lp2n1N5M8R7k46J89
$$ 26 -59 -94 40 -25 -109 -172 -110 192 -123 -18 175 69 101 142 -48 -37 140 22 19 -53 -104 -49 -1 96 -150 39
5927C9K3J0j45K13j65o0k0m7RJ04K07k33p4J60N7K10k10j29M0j00M5J17n2J37
$$ 39 62 72 -73 140 -25 -85 -105 -152 -143 -39 168 -65 -139 21 78 288 78 -51 -11 -111 -66 51 -1 136
5951A36j25j09N5l3kL46k28j0O2J71k95k8L45j73o8j77J35J6p6M1o6O8J46o8l43
$$ 136 11 -98 -43 -76 -78 268 40 30 92 263 -32 -60 285 112 44 -133 2 18 -58 -17 -83 -15 131 63 -280
5976b80M02l53M00rp1m72M24J84l42J08lk3q9o8Q4K33k0j96J33J3j23J25j26J32
$$ -280 122 -231 169 160 89 -383 41 225 -117 -9 -12 -35 -124 -192 -108 125 105 -91 42 55 -68 57 -69 63
6000F3m1j6q6l3K13o0N8j05o3M1j32Q5k4J48j54j3J96j71P0K4l3PJ57k97K19l28
$$ 63 22 6 -80 -113 100 40 98 -7 -70 -29 -161 -76 -100 48 -106 -119 77 -94 -24 0 -33 -26 131 -166 53 -275
6026b75M87l91L31k38KJ01o2K2J11n4j94j79M12L5k97M19k58p3L4J24n4Om2K63
$$ -275 212 -179 152 -86 -84 17 -45 -23 88 34 -160 -339 73 108 -189 230 -28 -101 -67 57 3 9 -33 230
6050B30l22J01K0j20rJ15k55J87J15J27k26j56L1J16K45k46j1l01N63k34r6J36
$$ 230 -92 9 29 -91 -100 15 -240 -53 62 189 -37 -193 -162 -46 199 -47 -58 -359 204 -30 -126 10
6072A0J2l8J6k0J80j22o7Q3j94K11k2k32L4K69P2Q8j87k1o1m6j6J8j22O8j4N8
$$ 10 22 -16 0 -20 160 38 -29 54 -140 71 49 -183 -149 120 192 280 93 72 11 -35 -51 -33 -155 -87 -101 -43
6098d3j63P3J55o0P3k0K8O6p3k20L82j79N8m36M12j81j40L26L9M3j3J29m01mJ55
$$ -43 -206 -133 22 -38 35 15 43 109 36 -184 198 19 77 -359 53 -128 -268 58 97 140 127 256 -145 -149 6
6123Fj10j06K62l27K63l24L38J74p3p6j61K08p7O2l9J16k83j26J94J68k43J58
$$ 6 -104 -210 52 -275 -12 -336 2 176 103 27 -134 74 -3 59 20 136 -147 -273 -79 89 -154 4
6145DK25n69K17j31K45o1oJ91rj53K73j86k1Mj97M65l86K90m37L37l53K62k73
$$ 4 229 -340 -123 -254 -9 -70 -76 115 106 -47 226 40 19 23 -174 291 -95 195 -242 95 -258 4 -269
6168b69L19j66J59j4J07k01L6J13j81K69k29k38O7M17k3k51J2j08J98j12m0J52
$$ -269 50 -116 43 29 136 -65 -29 84 -97 172 -57 -295 -228 189 166 -85 -73 -181 17 -95 -135 17
6190A7l3N8RM7o3k3q7N8k28M64m73J65J03q6K65j14p0r4N9K21j63j23K25j34O5
$$ 17 -16 42 51 98 35 12 -75 -17 -245 219 -254 -89 14 -72 193 79 9 -85 -26 195 32 -91 134 0 65
6215F5M4p8p8K50n7J36k20q0L8N2k99N92k49l59L14j74OR1P0j86J00K7j28P0P9
$$ 65 109 31 -47 203 146 282 62 -18 20 72 -227 365 116 -243 71 -103 -97 -6 64 -122 -22 5 -123 -53 26
6240B6M8r2k0J87k9j52k23L73j05j50L18k3l59J26N4j72J61J73l7k03P8N3j16
$$ 26 74 -18 -38 149 120 -32 -255 118 13 -137 181 158 -201 -75 -21 -193 -32 141 104 -99 -21 32 -84
6263h4J08r8j91J90Mj01O8PK27j62J11j21p7J15N6j97K12J7o0O5j16J87j41N5
$$ -84 24 -74 -265 -75 -71 -172 -104 -97 130 -32 79 -42 -119 -4 52 -145 67 84 24 89 -27 160 19 74
6287G4j67O3j20Q0K8n3Q3l5j33P0p0J72P7r6k5N2J57k60J82q2p8JJ32l0N5rKj28
$$ 74 -93 -30 -150 -70 -42 -95 -12 -47 -180 -110 -180 -8 69 -27 -52 0 157 -103 79 -3 -81 -80 52 22 77 68 70 -58
6315e8LQ5j5Q6j34J66q6P4J57n23L66j50J94j47N7j3r3L2j11J06K7K24k85R8L
$$ -58 -55 30 15 101 -33 133 47 121 278 -245 121 -29 165 18 75 62 -31 1 -110 -4 23 247 -38 60 63
6340F3l05K01k22J7N2J39J63j82r4L75l42K75k05K08p3j96P9P3o1j07K46q2J80
$$ 63 -242 -41 -263 -246 -194 -55 108 -74 -168 207 -135 140 -65 143 70 -126 -47 26 -35 -142 104 22 202
6363B02k15l70N59Jj89p0m2N8J7j6J00j42k8K67p7J22k66J79j99M2K56l14K76
$$ 202 -13 -383 176 177 -12 -82 -124 -66 -49 -65 35 -107 -135 132 55 177 -89 90 -109 -67 189 -125 151
6386A51l04J62n6j6L5j02J08j59J95K3o6j1M8K98m84K14j7j51J82p9O0J09J06
$$ 151 -153 9 -47 -63 -28 -130 -22 -181 14 37 -29 -40 8 306 -178 36 19 -132 50 -29 31 140 246
$$ [...]
8191F4
##END NTUPLES=NMR FID
##END=
