##TITLE=1H_Pr 83-6
 CDCl3, 8 sc, 
 30.6.2020
##JCAMPDX= 6.0         $$ Bruker NMR JCAMP-DX V2.0
##DATA TYPE= NMR FID
##DATA CLASS= NTUPLES
##ORIGIN= UXNMR, Bruker Analytische Messtechnik GmbH
##OWNER= root
$$ XWIN-NMR		Version 3.5
$$ Tue Jun 30 10:58:41 2020 Russian Standard Time (UT+4h)  she@DPX200
##.OBSERVE FREQUENCY= 200.1315
##.OBSERVE NUCLEUS= ^1H
##.DELAY= (6, 6)
##.ACQUISITION MODE= SIMULTANEOUS
##.ACQUISITION SCHEME= undefined
##.AVERAGES= 8
##.DIGITISER RES= 18
##SPECTROMETER/DATA SYSTEM= spect
##.PULSE SEQUENCE= zg30
##.SOLVENT NAME= DMSO
##.SHIFT REFERENCE= (INTERNAL, DMSO, 0, 15.7039)
##AUDIT TRAIL= $$ (NUMBER, WHEN, WHO, WHERE, WHAT)
$$ ##TITLE= Audit trail, XWIN-NMR		Version 3.5
$$ ##JCAMPDX= 5.01
$$ ##ORIGIN= Bruker BioSpin GmbH
$$ ##OWNER= she
$$ F:/spectra/data/she/nmr/H-F/1/audita.txt
$$ ##AUDIT TRAIL=  $$ (NUMBER, WHEN, WHO, WHERE, WHAT)
(   1,<2020-06-30 10:57:25.28 +0400>,<she>,<DPX200>,
      <created by zg, POWCHK disabled, PULCHK disabled
       configuration hash MD5:
       00 E9 B6 7A A2 85 ED C7 34 08 36 98 17 FE 4E 26
       data hash MD5: 16K
       6C 81 A3 36 92 05 9C A7 EC DF 6D 16 F8 96 6C 9D>)
$$ ##END=
$$ 
$$ hash MD5
$$ BE F3 DD 24 3A 22 04 FC 53 61 40 89 F0 A4 12 62
##$RELAX= 
##$RELAX= 
##$RELAX= 
##$RELAX= 
##$RELAX= 
##$RELAX= 
$$ Bruker specific parameters
$$ --------------------------
##$DU= <F:/spectra>
##$EXPNO= 1
##$NAME= <H-F>
##$PROCNO= 1
##$TYPE= <nmr>
##$USER= <she>
##$AMP= (0..31)
100 100 100 100 100 100 100 100 100 100 100 100 100 100 100 100 100 100 
100 100 100 100 100 100 100 100 100 100 100 100 100 100 
##$AQSEQ= 0
##$AQ_mod= 1
##$AUNM= <au_zg>
##$AUTOPOS= <>
##$BF1= 200.13
##$BF2= 200.13
##$BF3= 200.13
##$BF4= 200.13
##$BF5= 200.13
##$BF6= 200.13
##$BF7= 200.13
##$BF8= 200.13
##$BYTORDA= 1
##$CFDGTYP= 0
##$CFRGTYP= 5
##$CHEMSTR= <none>
##$CNST= (0..31)
1 1 145 1 1 1 1 1 1 1 1 1 1 1 1 1 1 1 1 1 1 1 1 1 1 1 1 1 1 1 1 1 
##$CPDPRG= <>
##$CPDPRG1= <>
##$CPDPRG2= <>
##$CPDPRG3= <>
##$CPDPRG4= <mlev>
##$CPDPRG5= <mlev>
##$CPDPRG6= <mlev>
##$CPDPRG7= <mlev>
##$CPDPRG8= <mlev>
##$CPDPRGB= <>
##$CPDPRGT= <>
##$D= (0..31)
0 1.2 0 0 0 0 0 0 0 0.06 0 0.03 0 0 0 0 0.0002 0 0 0 0 0 0 0 0 0 0 0 0 
0 0 0 
##$DATE= 1593500244
##$DBL= (0..7)
120 120 120 120 120 120 120 120 
##$DBP= (0..7)
150 150 150 150 150 150 150 150 
##$DBP07= 0
##$DBPNAM0= <>
##$DBPNAM1= <>
##$DBPNAM2= <>
##$DBPNAM3= <>
##$DBPNAM4= <>
##$DBPNAM5= <>
##$DBPNAM6= <>
##$DBPNAM7= <>
##$DBPOAL= (0..7)
0.5 0.5 0.5 0.5 0.5 0.5 0.5 0.5 
##$DBPOFFS= (0..7)
0 0 0 0 0 0 0 0 
##$DE= 6
##$DECBNUC= <off>
##$DECIM= 24
##$DECNUC= <off>
##$DECSTAT= 4
##$DIGMOD= 1
##$DIGTYP= 9
##$DL= (0..7)
0 120 120 120 120 120 120 120 
##$DP= (0..7)
150 150 150 150 150 150 150 150 
##$DP07= 0
##$DPNAME0= <>
##$DPNAME1= <>
##$DPNAME2= <>
##$DPNAME3= <>
##$DPNAME4= <>
##$DPNAME5= <>
##$DPNAME6= <>
##$DPNAME7= <>
##$DPOAL= (0..7)
0.5 0.5 0.5 0.5 0.5 0.5 0.5 0.5 
##$DPOFFS= (0..7)
0 0 0 0 0 0 0 0 
##$DQDMODE= 0
##$DR= 18
##$DS= 0
##$DSLIST= <SSSSSSSSSSSSSSS>
$$ [...]
##$SUBNAM2= <"">
##$SUBNAM3= <"">
##$SUBNAM4= <"">
##$SUBNAM5= <"">
##$SUBNAM6= <"">
##$SUBNAM7= <"">
##$SUBNAM8= <"">
##$SUBNAM9= <"">
##$SW= 24.9337058887773
##$SWIBOX= (0..15)
0 0 2 0 0 0 0 0 0 0 0 0 0 0 0 0 
##$SW_h= 4990.01996007984
##$TD= 16384
##$TD0= 1
##$TE= 0
##$TE2= 300
##$TE3= 300
##$TEG= 300
##$TL= (0..7)
0 120 120 120 120 120 120 120 
##$TP= (0..7)
150 150 150 150 150 150 150 150 
##$TP07= 0
##$TPNAME0= <>
##$TPNAME1= <>
##$TPNAME2= <>
##$TPNAME3= <>
##$TPNAME4= <>
##$TPNAME5= <>
##$TPNAME6= <>
##$TPNAME7= <>
##$TPOAL= (0..7)
0.5 0.5 0.5 0.5 0.5 0.5 0.5 0.5 
##$TPOFFS= (0..7)
0 0 0 0 0 0 0 0 
##$TUNHIN= 0
##$TUNHOUT= 0
##$TUNXOUT= 0
##$USERA1= <user>
##$USERA2= <user>
##$USERA3= <user>
##$USERA4= <user>
##$USERA5= <user>
##$V9= 5
##$VALIST= <valist>
##$VCLIST= <CCCCCCCCCCCCCCC>
##$VD= 0
##$VDLIST= <DDDDDDDDDDDDDDD>
##$VPLIST= <PPPPPPPPPPPPPPP>
##$VTLIST= <TTTTTTTTTTTTTTT>
##$WBST= 1024
##$WBSW= 4
##$XGAIN= (0..3)
0 0 0 0 
##$XL= 0
##$YL= 0
##$YMAX_a= 517200
##$YMIN_a= -507452
##$ZGOPTNS= <>
##$ZL1= 120
##$ZL2= 120
##$ZL3= 120
##$ZL4= 120
##$ABSF1= 10
##$ABSF2= 0
##$ABSG= 5
##$ABSL= 3
##$ALPHA= 0
##$AQORDER= 0
##$ASSFAC= 0
##$ASSFACI= 0
##$ASSFACX= 0
##$ASSWID= 0
##$AUNMP= <proc_1d>
##$AZFE= 0.1
##$AZFW= 0.1
##$BCFW= 1
##$BC_mod= 2
##$BYTORDP= 1
##$COROFFS= 0
##$CY= 11.3945322036743
##$DATMOD= 1
##$DC= 2
##$DFILT= <>
##$DTYPP= 0
##$F1P= 16.9975609425685
##$F2P= -3.02152046262296
##$FCOR= 0.5
##$FTSIZE= 0
##$FT_mod= 4
##$GAMMA= 1
##$GB= 0.15
##$INTBC= 1
##$INTSCL= 1
##$ISEN= 128
##$LB= 0.24
##$LEV0= 0
##$LPBIN= 0
##$MAXI= 10000
##$MC2= 0
##$MEAN= 0
##$ME_mod= 0
##$MI= 1.114404
##$NCOEF= 0
##$NC_proc= 0
##$NLEV= 6
##$NOISF1= 3.799351
##$NOISF2= 2.8
##$NSP= 1
##$NTH_PI= 0
##$NZP= 0
##$OFFSET= 15.70392
##$PC= 1
##$PHC0= -9795.814
##$PHC1= 20.00087
##$PH_mod= 1
##$PKNL= yes
##$PPARMOD= 0
##$PSCAL= 0
##$PSIGN= 0
##$REVERSE= no
##$SF= 200.130013532006
##$SI= 16384
##$SIGF1= 3
##$SIGF2= 2
##$SINO= 400
##$SIOLD= 16384
##$SREGLST= <1H.CDCl3>
##$SSB= 0
##$STSI= 0
##$STSR= 0
##$SW_p= 3612.71676300578
##$SYMM= 0
##$S_DEV= 0
##$TDeff= 0
##$TDoff= 0
##$TI= <>
##$TILT= no
##$TM1= 0
##$TM2= 0
##$TOPLEV= 0
##$USERP1= <user>
##$USERP2= <user>
##$USERP3= <user>
##$USERP4= <user>
##$USERP5= <user>
##$WDW= 1
##$XDIM= 8192
##$YMAX_p= 0
##$YMIN_p= 0
$$ End of Bruker specific parameters
$$ ---------------------------------
##NTUPLES= NMR FID
##VAR_NAME=  TIME,          FID/REAL,        FID/IMAG
##SYMBOL=    X,             R,               I
##VAR_TYPE=  INDEPENDENT,   DEPENDENT,       DEPENDENT
##VAR_FORM=  AFFN,          ASDF,            ASDF
##VAR_DIM=   8192,          8192,            8192
##UNITS=     SECONDS,       ARBITRARY UNITS, ARBITRARY UNITS
##FACTOR=    0.0002004,     1,               1
##FIRST=     0,             0,               0
##LAST=      1.6414764,     0,               0
##MIN=       0,             -507452,         0
##MAX=       1.6414764,     517200,          0
$$ Real data points
##PAGE= N=1
##DATA TABLE= (X++(R..R)), XYDATA
$$ [...]
2379C569o98m523l110L161L975N51l369k499J072K482O52j502q52J148N71j747
2395a119m12K152J932j328l752j071L894M079j555n486k076M192N452p63n577
2410a438k873K589M945Q20m023k749J518L048K81j679q51P68k2q02J4J862J565
2427B973k009l509J69L887L064j777n272j533M220M778j007n832k199L004M438
2442C395Q25m488k709J665L727l05k330m97J267K33j306n20J443J822r59l435
2458b172l85L311L279j999m581j734M101M329j011m819k400K626M019K56l660
2473h40j642R76K511J18j386p63J052P0j259l93J570J808j033l119j057L265L487
2490C365j113n034k128L652M503P0n115k832K333M851M32l610k241J093K616K17
$$ y = [3569, 2871, -1652, -4762, -1601, 2374, 2925, -444, -2943, -1871, 611, 1263, -239, -1091, 57, 628, -1119, -1531, 621, 2553, 1225, -2527, -3598, 296, 4375, 2820, -2666, -4742, -550, 4902, 4139, -1438, -4311, -1722, 3223, 4043, 20, -2729, -1211, 1837, 2118, 439, -412, 356, 334, -468, -454, 1408, 2973, 964, -2545, -2376, 1511, 4575, 2798, -2474, -4007, 213, 4991, 3984, -1848, -4047, -1043, 3395, 4220, -268, -2977, -1312, 2415, 2110, -220, -717, 550, 783, -523, -1043, 400, 2222, 1263, -2172, -2557, 754, 4033, 2034, -2547, -4281, -180, 4149, 3138, -1681, -4081, -1455, 2564, 2820, -840, -2482, -1506, 1005, 1123, -263, -1026, 26, 96, -1163, -1556, 14, 1822, 789, -2330, -3387, -122, 3365, 2252, -2782, -4910, -1258, 3245, 3315, -1800, -4632, -2299, 2552, 2984, -626, -2867, -1774, 842, 1059]
2506A059j437q32J011N77j464l61J834J794j478l219o89L257L532j067n315j913
2522d711L852M898o48m822k800K577M324P83l627k326R33K782N28j645n87R57
2538D68K91j490k54J407K219j486l196o20L368L263j080m917j606L017M652N00
2554D536n363k855K459M206P73l410k488J230K452N96j860m99R02Q4j286j47J431
2571G61J564r30l124p44L201L057j180m397j873L320L622K04m532k783K290M143
2587B599K24l012k244R79K372L49j488q88Q98O59j105r84J691J791o53k900j269
2604b981K572L718j018m334k293L150L986J12l943k546J465L749Q13k975j948
2619b473P58K212J5o83m08N91o0j245l53J349K305j093l140j228K921L503q03
$$ y = [1059, -378, -1210, -199, 378, -1086, -1447, 387, 2181, 703, -2516, -3205, 52, 3584, 2517, -2798, -4711, -859, 4039, 3391, -1431, -4231, -1654, 2670, 3453, -174, -2500, -1567, 1215, 1743, 98, -489, 468, 759, -731, -985, 422, 2641, 1155, -2041, -2661, 707, 3970, 2890, -2027, -3633, -616, 4036, 4536, -827, -3682, -1223, 2983, 3756, 346, -2142, -912, 1540, 2136, 276, -223, 679, 763, -523, -670, 761, 2325, 1395, -1729, -2473, 728, 3785, 2605, -1792, -3665, -345, 3277, 3481, -1051, -3834, -1544, 2599, 2823, -189, -2433, -1454, 918, 1267, -221, -1109, -211, 448, -657, -1641, 50, 1841, 1188, -1712, -2981, -409, 3309, 2291, -2043, -4336, -1186, 2800, 2912, -1031, -3577, -2112, 1637, 2450, -525, -2473, -1715, 497, 512, -171, -579, 12, -48, -1293, -1646, -297, 2008, 915, -2225, -3453, -532, 2971, 2168]
2636B168m158k335K371M828K22l613l606J600M271J639k970k794M07K316J045
2651A391j184j097Q32K48n71p01J293J701m83l118j304L178L099r34m376k157
2667d183L617M198j92m407k688K404L971O61l393j852J030K286J16j471p39J265
2683F23J83j059m15J628J502q16k745j023K572K707m36l820k124K898L405J94
2699C274l420k536J738L183K52k147j909J156J458j08n55l16N51l27q26m62J192
2716A98J914o14k810j316K017L360l50l655k533K037M127Q82l464l096R04L601
2732A202J693k409k470k18K140J208r56p31K50J86o32n73J054J446l56k736j272
2749c174K694L133k56m060k588K200M614L11l584l101J559M007N68k232k964Q80
$$ y = [2168, -1990, -4325, -1954, 2874, 3096, -517, -4123, -2523, 1748, 3387, 417, -2377, -1970, 346, 1391, 207, -890, -58, 190, -381, -1082, 211, 1912, 1429, -1689, -2993, 185, 3284, 2350, -2026, -4183, -566, 3632, 3440, -967, -3655, -1251, 2720, 3381, -12, -1864, -834, 1452, 1568, 97, -642, 623, 806, -253, -668, 960, 2462, 1646, -1099, -2122, 450, 3157, 2721, -1099, -3223, -325, 3080, 3274, -146, -2682, -944, 2239, 2491, 344, -1565, -409, 1049, 941, 386, 70, 621, 294, -532, -994, 198, 2112, 1498, -1312, -2628, -611, 2749, 2399, -1256, -3789, -1752, 2375, 3257, -207, -3303, -2399, 1202, 2895, 486, -1984, -2202, -62, 1146, 190, -541, -291, -105, -737, -1310, -256, 1190, 834, -1902, -3174, -480, 2653, 2397, -1663, -4251, -2051, 2563, 2874, -710, -3811, -2252, 1755, 2323, 91, -2873, -1993]
2765a993K471N91j441p24R16O26p64r36J182J586m21k772j048K097L445l04m011
2782a500k059K461M037j6l322k651J501L447M62k460j725J176J487%q63n61J206
2799F20O6r75m09J249J469l54k558j431K304K976k62l191k180J652L557O42k592
2816E83k637M09K978J090j350k049n01J868P22k86p06K93J67n84q20R69J687k09
2834A624k325j585J913K880N00l621k309J336M128O33l092l397J162L447J200
2849B494k135k007J54J723Q53j068n71M45K10p83m12J065J673k86k732j357J877
2866h57L304l13l295k308J698L394J274l337l045J209L411J064k528j595L45J782
2882B03P5l95p79N50L03p93r17J519J752l37l030p77J943K764o36k610k086J713
$$ y = [-1993, 478, 1069, -372, -1096, -180, 446, -318, -1254, -72, 1514, 1093, -1679, -2727, -630, 2815, 2511, -1500, -3559, -1098, 2939, 2923, -399, -3050, -1549, 1898, 2360, -100, -1825, -649, 838, 838, -25, -586, 620, 686, -289, -698, 551, 2020, 1666, -892, -2323, -19, 2957, 2695, -496, -2676, -1024, 2533, 3175, 583, -2054, -1645, 1333, 2423, 1073, -976, -1477, 391, 1113, 827, 121, 414, 581, -3, -823, 146, 1833, 1624, -701, -2286, -373, 2507, 3007, -614, -2923, -1587, 2541, 3174, 82, -3315, -2153, 1294, 2494, 359, -1648, -1494, 229, 1082, 14, -557, -112, 98, -685, -1097, -32, 1641, 1355, -1377, -2734, -857, 2447, 2134, -1161, -3469, -1771, 1623, 2897, -440, -3485, -2276, 1135, 2199, -329, -1924, -1579, 203, 278, -117, -896, -346, -43, -836, -1753, -234, 1518, 1181, -1849, -2626, -683, 2081, 1445, -1165, -3251, -1538]
2900a538L172Q70k478k792R40K910R92j825j805L61J370Q35p62n58J65K54l75
2917b64p45J071J606j17k124j390J511K462M20k753k159J030L502J064k813k518
2933b217N69K682J512j474k267J71J604P61r44q61R58J1p94m34R69J945m78k134
2951d21j653J749K875Q8k643k815J568L204J110k759k623N13L019J083j314k015
2967a034l18J717Q37n34r58L46P02r39q96J154J579rk601j480J604L088k4l115
2985h81k162J628L300O93k737k732J009K587J282j897j859K69J572O35q84o19
3001g96L89N38p88o66R97J375k92j743j112J135K318L19k599j807J061K914O93
3018A936j712k437M76K273J081j236j966J15J879L08j150l76Q66J68o07j098J039
$$ y = [-1538, 1634, 2504, 26, -2766, -1826, 1084, 2076, 251, -1554, -1193, 177, 1012, 250, -308, -143, 111, -264, -1009, 62, 1668, 1551, -573, -1963, -452, 2010, 2430, -323, -2482, -1452, 2050, 3114, 301, -2217, -1648, 1034, 2546, 1072, -1195, -1024, 580, 1341, 397, -464, 494, 505, -289, -723, 246, 2191, 1713, -421, -2074, -325, 2550, 2638, -5, -2820, -1252, 1952, 3062, 303, -2320, -1807, 1212, 2295, 981, -1034, -1352, 365, 1202, 668, -290, 56, 758, -181, -1077, 77, 1656, 1647, -954, -2434, -830, 2258, 2234, -881, -3043, -1415, 1885, 2578, -159, -2891, -1882, 705, 1987, 90, -1769, -1500, 72, 707, -177, -796, -407, 131, -657, -1323, -326, 1049, 757, -986, -2098, -963, 1355, 1674, -925, -2732, -1671, 1243, 1936, 224, -2213, -1737, 536, 1617, 381, -1585, -1470, 409, 717, -433, -809, 57, 225, -382, -1480, -441]
3035d41J801L19k643j607J707K382R00k754k455J129L221Q55j612k857L00K752
3051I97R67q48j725m87J341P05o17k76P23l82o05o11Q12J749j22j902j777J593
3069d65K528O21k865j922P66L099J126k029k841K47K682J829j568k198j0J244
3085B44O15m53o30O59R1m45o16Q05J050j92j551j290J127K498N29k691k016J165
3103a101K619R84k002k208j38K651J192j646j218k04J394M59p17n05L77O85q31
3120b09q12M98J533K72j878j436N72K651O60k022k442P75K663R50j055k784j25
3137b189K669R73j224j435k28J239M35p13k28Q18k3p87l42K38J794J26j912j456
3155b245J252K545P9j829k175M07K710J795k080k318m08K328J489r72j051l71
$$ y = [-441, 1360, 1679, -964, -2571, -864, 1518, 2418, -336, -2791, -1662, 1559, 2414, 802, -2055, -1755, 997, 1964, 1116, -609, -1096, 245, 950, 333, 57, 780, 398, -207, -818, -6, 1743, 1621, -281, -2058, -465, 2063, 2684, -181, -2103, -1337, 1762, 2888, 859, -1982, -1735, 947, 2776, 1208, -990, -1000, 244, 859, 406, -224, 435, 526, 81, -535, 270, 1320, 1128, -423, -1713, -586, 1912, 2441, -250, -2266, -1101, 1518, 2502, 500, -1708, -1846, 805, 1997, 351, -867, -1071, 323, 782, 65, -440, -63, 622, -209, -1021, -523, 1010, 1282, -596, -2032, -1460, 1191, 1851, -171, -2613, -1838, 825, 1775, 720, -2064, -2189, 480, 1453, 229, -1206, -1434, -195, 240, -473, -701, 117, 94, -693, -1035, -797, 997, 1123, -789, -2245, -993, 1552, 1631, -198, -2373, -1966, 744, 2539, 459, -1859, -2267, 61, 1550, 578, -473, -844]
3171h44O12N36J2r12O58O29p96o95Q79J024N6j327j762R56K610P51k334k055Q69
3190a133K610P96j450k305o5K368J120j261r82m86J173O78p16k05lO49o88o48
3208e48Q15Q71O48j849j432R46K022O09j497k393K45K549J561j620k139l44J807
3225B51J603r30j727k81J364Q05r18n54K31N24n18n77M58J359J43j569j792J025
3243a103K051J138j855k346O37K216J356j522k098k30J701J314n47j740l15J173
3259a70L94l14m42O79ro09n83N74J272L97j784j575Q20K217Q27j397k581O21K057
3278C94J360j202k330k52K108J254p35j532N7O18P54m33l49L15K71j078jN99J132
3297I50L21j807r67K47K333Q43j834j973J66K629J022j142k315J56J757J356p67
$$ y = [-844, -232, 304, 316, -596, 62, 691, -105, -800, 79, 1103, 1159, -168, -1930, -974, 1636, 2387, 53, -2002, -1133, 1477, 2273, 823, -1482, -1547, 821, 1941, 680, -302, -788, 385, 1063, 347, 142, 139, 788, 100, -548, 267, 1138, 1786, -63, -1495, -549, 1473, 2082, 585, -1808, -1563, 986, 2547, 927, -1212, -1556, 251, 1854, 924, -803, -1084, 280, 1085, 167, -387, -156, 368, -150, -727, -269, 1090, 1233, -336, -2128, -1103, 948, 2086, 231, -2115, -1478, 738, 2094, 572, -1526, -1756, -55, 1259, 712, -1028, -1343, -170, 224, -90, -532, 147, 138, -471, -1054, -480, 792, 1189, -595, -2170, -1350, 867, 1694, 297, -2284, -1663, 394, 1754, 552, -1778, -2030, 78, 1332, 597, -935, -878, -260, 494, 61, -288, 27, 298, -780, -781, -182, 950, 1271, -536, -1503, -1256, 1077, 1920, 86, -1887, -1721, 908, 1930, 788, -1527, -1371, 386, 1742, 975]
3314I75j617k99R90Q01n44k35J63J82l30l65K11J061K17j169j275N43J960Q77
3332B146j830j865L26K074J641j249j911p99J883J293o70j344m76R41O83m17n79
3349a53K19N03m59p77M23P24J003j299j615J38K046J446j706k050Q1J829J627
3366A980j076k019n52J499J470n52j189o39P45P33m22l00Q15l19m15q40P03J160
3384G82J99j730j252P72J957Q06j590j949K81K173J250r89k310j48J345J538q38
3401B97r63m79O94N15k4k38MK81k19q72O12J143J12j460r52M26J730P58j640j023
3421a298m8J623J402j182j642l33J421J431j110q56l58P57L81k09j88J56N46l38
3439A55n60J30Q30N83j005j034j98K061J122j425j591m38J774J792q92j857o68
$$ y = [975, -642, -941, 49, 850, 306, 71, 234, 416, 86, -279, -68, 993, 1210, 41, -1234, -691, 1269, 2146, 316, -1549, -1223, 851, 2492, 1243, -668, -1467, 416, 1709, 1039, -305, -781, 160, 843, 426, -153, 66, 569, 110, -667, -244, 480, 1483, 184, -1431, -1293, 753, 2199, 493, -1557, -1476, 353, 1980, 904, -1115, -1667, -168, 1302, 750, -439, -1078, -333, 400, -22, -322, 493, 174, -241, -1081, -378, 782, 981, -749, -2001, -1229, 728, 1534, -56, -2005, -1724, 449, 1699, 710, -1600, -1748, -403, 1135, 297, -666, -1145, -451, 64, 40, -198, -194, 87, -132, -1004, -392, 751, 863, -597, -1549, -1123, 607, 1365, -275, -1298, -1346, 277, 1679, 497, -1145, -1478, -57, 1374, 264, -592, -950, -193, 188, -21, -209, -53, 493, 155, -405, -275, 555, 1138, 133, -901, -1099, 962, 2084, 659, -932, -1370, 404, 2196, 1304, -553, -1221]
3456a221J314J444m06j170o77Q88L16j79m06P01K43r75o02L40J426N43j081j740
3474a242N59J757Q49j092k393O21J513J291p51j752n88J294J506r34j044l41P61
3491A4K59j92l03K68M12k89r60M33J377Q0j427j302N75J678J336j696j944RK140
3510D68R93r87j719m98J393J403n09j174j93K79L22R9l00L15j28k02m95L07R14
3529B88L90j191r67K13J583R10j075j670j23J460J456p67j528k95J157J232k41
3546H32j128o80O47M52j85P4j66K10n3n97J39P72P32q82j478R1J620J072q39j801
3566a168k10J539J232n32j751l38J129J272k85p97n01N72Q0K64o58M14K54m99
3584A7n86L08R60N41n96j481J5J688J100j062j721p07J635J569o48j388q97J160
$$ y = [-1221, 93, 1537, 1131, -39, -716, 172, 488, 309, -97, 604, 847, -128, -730, -390, 1036, 1579, 498, -1242, -683, 1074, 1923, 831, -1562, -941, 572, 1863, 1112, -640, -1228, 66, 1572, 638, -406, -747, 14, 273, 81, -222, 46, 458, 169, -791, -358, 1019, 1099, -328, -1630, -1055, 623, 1959, 263, -1681, -1672, 468, 1461, 474, -1245, -1743, -350, 1053, 544, -630, -823, -544, -222, -123, -423, -108, -236, -438, -933, -626, 288, 678, -513, -1480, -1267, 316, 1226, 151, -1519, -1642, -182, 1274, 507, -1021, -1316, -159, 1073, 832, -296, -976, -329, 123, -62, 12, -154, 56, 3, -594, -455, 317, 1049, 167, -1311, -1220, 400, 1472, 633, -1168, -1378, 161, 1393, 861, -890, -1228, -99, 1173, 888, 91, -410, 162, 242, 506, -152, 262, 516, 17, -569, -261, 699, 1240, 644, -837, -822, 866, 1966, 904, -817, -1524, 111, 1680, 1032, -356, -1253, -93]
3602i3Q93R3j111p2L35L32m1m27K11K19k43o50N21P91K89j051j053J13J443J294
3622A793j010k060LJ582J128n32j822k9O93J156j95j116k92M17L26J70m79Q8J28
3641e1k90j78LO11P67p24j745O44J280Q97p36j857k24J718J310q69j700n05J213
3660d36J186l75j041l13M41O66k32n39O83L75m49j035O78Q42P45j114j273l6J479
3679B52P63o97j233k73J287J033j94j619n78J302P99M4j127q7J62M40o04M12j23
3698d1N01j81p73N3P73O50n30j127k91J518J140q49j852j54J457J148k51j522
3716c31p91R33J217pj048l51O00J17J40n96L84K88o05n6mR41M34q25j638K51J611
3737F64R35p84j612l51J096J218k93j474j76N32J281o9r01n05J23Q13r7o16N11
$$ y = [-93, 800, 893, -218, -290, 45, 377, 336, -91, 120, 339, 96, -554, -33, 758, 1047, -4, -1057, -944, 499, 1793, 783, -1277, -1274, 308, 1436, 904, -918, -947, -254, 902, 707, -409, -701, -284, 42, 212, -267, -179, -51, -341, -519, -516, 95, 862, 138, -1607, -963, 317, 1214, 478, -1379, -1603, 115, 1425, 556, -1144, -1649, -436, 750, 375, -666, -979, -538, 128, -104, -643, 40, 415, -34, -1069, -391, 451, 1196, 82, -1191, -1227, 252, 1015, 318, -915, -1188, 99, 1132, 938, -681, -1259, 43, 842, 886, -241, -328, -166, 274, -330, 82, -41, 460, 279, -494, -441, 332, 982, 452, -675, -966, 552, 1692, 843, -1009, -1163, 294, 1442, 1191, -331, -1122, -189, 1028, 1021, -27, -378, 222, 339, 479, -117, 267, 555, -50, -106, -110, 831, 1265, 440, -1198, -947, 664, 1599, 815, -797, -1148, -52, 1166, 873, -601, -777, -245, 1036, 967, 66, -439, -316, 497, 400, -216, 295]
3756B95l92p6k82j45J112N42r22r44n8J039J088o64j346q42J500J184n17j557
3774i85m52J445M22j64n49m46O10q3K72p38J93M02k24m50l0J077M52p84j178R3
3794a117Q93J287n59j067q22J006J437l89j134q07P04J458n46n32k13O1O99j88
3812A71k43K08L25l01m96m18J081O54r95q43k72J381J382n68j670n91J463P60
3830A028k11j170o89Q04Q83N73j375j25N13J3p3J14J39K34n14m87J85O63N20o06
3850D19r49j91J369P59l87j269p25P97J552k18j398n17N42N72M41r41j81K72O56
3869F03m08o9j12O46k64r48J77Q44M28q45q46m55J280J283q84p11p93Q62R76j38
3889F26j001o58N94P07Q7m54k86j3L09q4L0N6j49L59p94J03O99M83k64j296k66
$$ y = [295, -97, -173, -455, -600, 512, 1054, 132, -812, -870, 169, 1257, 593, -753, -1595, -95, 1089, 572, -985, -1437, 8, 430, 266, -283, -729, -119, -202, 70, -668, -475, -73, -297, -747, -777, 300, 752, -32, -1210, -1117, -224, 1063, 504, -563, -1385, -379, 1058, 669, -465, -1272, -568, 890, 344, -188, -401, -340, 359, 171, -72, 136, 461, 160, -336, -754, 327, 981, -14, -857, -1129, 252, 1634, 1066, -604, -1195, 268, 1028, 817, -353, -1042, -238, 645, 1218, -157, -282, 231, 244, 171, 285, 424, 658, 144, -343, -158, 505, 1025, 419, -530, -721, 648, 1407, 1020, -249, -974, -177, 1375, 1157, -241, -758, -216, 356, 797, -144, -325, -53, 603, 195, 126, 14, 660, 396, -552, -375, 469, 897, 52, -794, -1249, 31, 1314, 430, -281, -1074, -212, 764, 626, -375, -1033, -439, 268, 355, -99, -385, -398, -89, -173, -143, -87, -236, 123, -671, -568, 131, 614, 350, -946, -1212]
3910a212J230P28l8j335p63J004J110k89j057l49L31J028J87p85p8j37K21J73
3928c1k65M30j51k50k04o0O62M80l41j274MQ28J092l03j640j76R24J244k19j020
3948b70p24P77O47N4q2q62J19O41p0r9P1J88k87n57J16M09P56m53n78o00J312
3969E08Q09n49j074p22J107R46J0j005q44O49Q60J42o31q3J21M5K60m04l0L61
3989D76n16j42j19P37N40m65j116o8R16P16l75r73o03P64J135k11p49o43L90N86
4009B80J66l23m95J60N80m46q0L35k52M23j048kQ86N43m86q82j90P11R61j90j132
4030d81p44N54J221K45j226n01J97P93L22o80l29P7L35K74k05q8M88o54J40l07
4050e69N43N66m53j082j80J081O13m48o75o42J033R38k22o19n75J08J077o0o78
$$ y = [-1212, 18, 746, 708, -627, -1390, -386, 724, 435, -622, -971, -640, 388, 575, -210, -288, -425, -204, -31, -296, 134, -17, -267, -471, -531, 131, 611, 270, -1004, -1000, -172, 920, 617, -1023, -1199, -275, 969, 750, -270, -994, -217, 430, 484, 402, -460, -341, 300, 230, 131, 202, 390, 103, -454, -338, 71, 827, 374, -204, -804, 508, 1317, 768, -306, -1028, 79, 1025, 1035, 30, -814, -165, 695, 837, 206, 123, 244, 289, 549, 145, 115, 476, -40, -182, -301, 436, 976, 511, -605, -673, 243, 959, 584, -389, -992, -228, 907, 696, -53, -696, -306, 280, 446, 123, -372, -212, 368, -78, -158, 177, -75, 348, -700, -702, 184, 727, 241, -641, -831, -120, 841, 651, -481, -1225, -671, 550, 795, -431, -932, -735, 58, 380, -300, -629, -552, -217, 57, -148, -236, 252, -402, -262, -569, -26, 540, 87, -995, -1175, -94, 519, 71, -604, -1246, -213, 725, 503, -116, -691, -583, 494, 434, -244]
4069b44m26M82K49j2j02J49L68k93l55m26Q66M17l17o96o29P66J100Q6j678k96
4089i91P52R52K16j007l01J67P48L68n69m17j7M87l34K0M7L79l99l94j91O97O13
4110H26m83p48j56P32Q18l81r94n00M59J261J75p26q06L77M27N12k84p66K12L09
4130B64k62lj77M29J8n87j5O06M10m51o40k44Q83O28j68j051n28K40J082L74p93
4151A5j031Q18M13L58p04k14k89M84J70l63K24J11n3n27J36J75M25R4j165M8M53
4172d22J077J6j442l58Q01Q79K97j260p22P50P43L08q50l17L65J4J43j91kL31
4192A60O0p79K08P56J26k68r64k64O67R46j28r71m22M94P82N67p95o23K49L16
4212A17M38k70n77N61j82J09J33j61J31q4k17k89M00Q08o5j074m49P03J052l58
$$ y = [-244, -670, -188, 61, 49, -53, 96, 464, 171, -184, -610, 256, 673, 356, -340, -969, -203, 897, 983, -695, -991, -239, 713, 929, -78, -379, -212, 536, 904, 335, -82, -99, 388, 54, 74, 121, 500, 101, -293, -484, 213, 826, 343, -405, -561, 171, 989, 608, -386, -886, -427, 834, 1009, 283, -523, -146, 281, 793, 509, -257, -45, 264, 2, -1, -178, 251, 269, -318, -333, 273, 683, 232, -408, -652, 231, 859, 691, -360, -888, -648, 434, 808, 15, -1016, -198, 215, 573, -131, -345, -634, -150, 20, -343, -119, -8, -61, -588, -452, -277, 148, 242, -923, -875, -422, 655, 671, -771, -1129, -328, 551, 848, -412, -1134, -384, 359, 667, -183, -500, -135, -121, 22, -169, -171, 160, 220, -559, -351, 405, 531, 263, -701, -965, -298, 648, 520, -451, -873, -379, 403, 970, 175, -448, -199, 117, 555, 285, -292, 269, 87, 196, 329, 168, 299, 215, -2, -291, 109, 917, 852, -222, -671, 32, 1084, 726]
4232G26p62n86K58J346j03k13q52j10M10O44m73k09P2J02Q0m05k1N22r0p46K19
4253a91J74O97k31n64o71P00P64j86k85j011K45Q69N17q86n12J33P20L71m62R
4273B00k17q2J38k66K05K56m05j76k52O30L3L43q80m04N38O39M9m25q91N40N60
4294A33K02m43n62M22L88J93n83nj35L14j12R7p4L6K44n92l06Q47J23J00n35n73
4316h21M71P74J57j073l20M26Q75R7p16n56J29N75K28j23p18L57j3J2L18J17M7
4337B43P6m65m9J99O32j83p38k98O16R18j23j047j99r1Q39N45p90k95j24Q27J21
4358F14J83q14q2J77K75k98J43J83K9l63l63M14N83R0q53n20P14N65r7l96o65
4379d81j94J069K58k07q32j05Q57K72j77n40j10L67J41l67J2K44L2l13j51L45
$$ y = [726, -36, -622, -364, 982, 879, 666, -186, -296, 114, 758, 285, 76, 148, 250, 330, -75, -96, 426, 336, -410, -191, -17, 680, 449, -115, -786, -86, 678, 492, 207, -804, -559, 310, 827, -59, -571, -438, 282, 653, 191, 200, -17, -99, 39, -227, -22, 234, -171, -347, -599, 31, 64, 407, -473, -877, -339, 300, 349, -76, -967, -427, 133, 335, -108, -670, -248, 140, 333, -250, -255, -390, -76, -188, -91, -165, -129, 115, -477, -783, 64, 187, 287, -248, -821, -350, 424, 581, -492, -812, -386, 489, 586, -130, -686, -557, 18, 246, 123, -595, -238, -251, -239, 79, 196, 243, 319, -146, -195, 4, 636, 453, -285, -583, 33, 951, 828, -219, -418, -509, 330, 875, 85, -210, -334, 493, 614, 797, -17, -99, 78, 353, 55, 198, 381, 410, 47, -316, 98, 681, 771, -82, -602, 112, 677, 580, 184, -481, -675, 394, 652, 445, -387, -492, 365, 637, 460, -80, -190, 177, 318, -49, -37, 207, 239, -74, -225, 120]
4399A20M87k84j68p88K15R29J44p39l81R8O29J31m24m07j10N90P2J7l89o1J19
4420b00J07j88J78Q4K06l42l39j0J051l47p36j53J84Q95J03o45o91K02O80N33
4440E72l86q90P8O35n2L20m03R0P3n55N50r5K36j37k02n22N98N63ko99j45J67
4462b06M91J17J3r01k1O31J75r8p86L52M61J81j51j84j57j68J33R0M30m09P0k11
4484a48k31O95J61J5j55n23K80J63O07n86o44q5R24J31l42p36J96K75O13o47J6
4505b1L42j65R7j79J88j25J26m71p5K34N19j70n67J8r3Q22J34m27n61J5N23L89
4527E53m98m75K08L75o3l5q7k41L83l6P4n80L72J90m88n7L84L60j27l34p89P98
4549a13L82K69o96l79j57P83L42m62o44K15J83M59j82l54J58K38J06k78O8j80
$$ y = [120, 607, 323, 155, -633, -418, 511, 655, -84, -465, -367, 262, 393, -31, -438, -548, 42, 114, 131, -258, -319, -200, -93, -281, -103, -19, 187, -155, -494, -504, 547, 200, -536, -689, -505, 390, 493, -152, -843, -641, 39, 572, 186, -704, -626, 9, -43, 277, -126, -36, 37, -518, 32, -63, 173, 36, -166, -688, -90, 473, 471, -228, -373, -206, 285, 402, 415, -486, -507, 124, 299, 201, -585, -233, 228, 409, 258, 74, -83, -251, -118, -28, 402, -7, 63, -148, -379, 316, 477, 492, 337, -186, 94, 257, 864, 278, -366, -451, 473, 604, 262, -474, -278, -3, 610, -37, -21, 321, 156, 253, 74, 262, 137, 263, -208, -283, -49, 470, 300, -267, -249, -342, 480, 614, 187, -374, -359, 164, 553, 55, -420, -212, 163, 100, 65, -22, -263, 120, 84, 158, -422, -50, 140, -348, -405, -21, 339, 212, -122, -911, -113, 269, 538, -158, -537, -694, 89, 431, -31, -675, -460, -277, 182, 0, -354, -196, 42, 148, -130, -62, -242]
4569b42K21k30j05j55N62K34p86r0K02N61K02l84q32L50O73J71m02k04p4J75P35
4590E82o19K9j5J3K76qL3q9J77n58p8L94L02K50j036j34K77M51N21m90n66J07
4612a81M05L10j55p05J7M79N4P3P7m48R3K2L5J95j37J34k70m18M61N13k57j35
4634A62o46K27O19P2j89o42K10N65L9j69m99J57J55K97k45M9l80K51j12J69M0
4655A30j47K86o39P6Q4M24J46l46n85m7R29L08p64l63p4P26K87k45p86J31L62
4676a07M51k43l53q9K85K49m55j03K00J50l24O8RM11R9k27o27N9P47K26o45l26
4698e45J97O24J59m78k73k66K48P08k99k69J13O6j92k17M76m9lj69r8r2Q29j96
4720B74j53l06j63N29K79k57n90P1J35N73j17n73J53L5L31J19k71J53l38J50K73
$$ y = [-242, -21, -251, -356, -511, 51, 285, -501, -591, -389, 172, 374, -10, -842, -492, 181, 352, -50, -254, -328, -153, 582, -37, -8, -23, -10, 266, 258, 291, 202, 379, -179, -257, 137, 439, 689, -347, -481, -204, 247, 768, 278, -288, -181, 224, 534, 379, -326, -309, 170, 224, 297, 374, -74, 19, 41, 76, 271, 134, 268, -2, -420, 41, 554, 297, 162, -484, -257, 362, 434, 245, -397, -187, 378, 417, 248, -251, -94, 61, 358, 113, 162, -218, 33, -79, 90, 130, -17, 269, -370, -294, -210, 214, 360, 14, -571, -618, 311, 619, -145, -508, -582, 144, 431, 186, -600, -469, -107, 344, 101, -252, -341, -56, 193, -262, -365, -165, -15, -339, -271, -262, 149, 248, 21, -606, -547, 200, 426, -219, -545, -348, 276, 435, -43, -316, -582, -334, 374, 75, -194, -81, -15, -207, -424, 52, 3, 0, -169, -267, -359, 470, 274, 121, -185, -348, 181, 460, 203, -387, -316, -181, 392, 275, -298, -145, -110, 221, 340, 69, 222, -116, 34, 307]
4741C07k37J39n2o0k35L36L05j12l77k45K05L31J52lq58J43K36N53m42j88q6K28
4763D0M91q3l84o1R1l46M57l27L78j81j69m0j71M43M06n11l15k18Q61Q9k16m54
4785b20k18N42K61rp33J27K36J75q5n3qM1j3J3M0q0K81o21l19K45O13L58p52l57
4809e36J66O88J41n20k50N4K05M29j57m78l71N10L33k91L5j81n4K94j38J82K45
4830C06N3k94l22J2O7J95J0n35j36R65j1l35j52k43J09N06o5o10J26M25L71q2
4852C60l16j27L36l73J61k71L31R8j47l25O1L62K74O0j084L35K12O36k84m48J43
4873fJ87L97p9m06k10K01L69J60o51k52L68k05L04j81K81o7l9l77O3N23J10n61
4895g1k60J6M31L13j20o15P2M06J9L3k59k36K36M09k25k53K04Q5J05l84j05J41
$$ y = [307, 70, 209, 157, 97, -138, 198, 503, 391, 14, -231, -26, 305, 457, 454, -404, -261, -25, 528, 86, -102, -188, 40, 531, 448, 64, 3, 94, -252, 205, -122, 256, 75, -94, -134, -305, 138, 544, 33, -282, -500, 361, 450, 234, -220, -438, 104, 365, 356, -377, -250, -14, 161, 76, 23, 15, 56, 43, 56, 96, 16, 297, -324, -643, -398, 215, 573, -179, -536, -370, 318, 459, -61, -311, -257, -52, 377, 220, -258, -629, -119, 214, -77, -42, -223, -277, 17, -121, 61, 306, 359, 65, -257, -245, -178, 17, 27, -508, -644, 321, 310, -25, -177, -420, -311, 195, 130, -480, -354, 71, 442, 360, 44, -83, 253, -120, 41, -230, 101, 199, 52, -273, -212, 150, 424, 484, -600, -265, -53, 583, 299, -149, -6, 181, 578, 499, 93, -117, 84, 453, 613, -38, -290, 78, -127, 177, -4, 277, 210, 171, -206, -143, 380, 490, -71, -331, -315, 116, 429, 309, -306, -234, 172, 191, 224, -35, -271, -35, 374, 149, -104, 100, 185, 290, -94, -199, -58]
4917e8K14j57n49K20N96j22n42n7j56N32K54j71o2j87p8N14o3m88q0O28J94o99
4939c17M70k69k4j39N4K04j1M6p4m68K81L90J38m00k76j49N39L23k79k58k49K70
4961a98N76k47n25J08J34K15J98k40k90J22M1NJ3L74k52m0r0j5R3L13On82k26
4984e07M54M71j12k15o17L07O01j2m69l03L28K65k1l23Q4M3J14k73R5L62J81m18
5006C5l60O20j16K78k14j91j89L62L48j08o08K99J25k80M21k69k40k5L36J57l73
5027HL66m45K12Q6n35K90M79n72k69K32M86j33j20m75L06J56L33n85RJ84n8L9
5049fJ84p6k15P6l7P1r7P0J50j01J2J8j78K36l52j27J61K50r5j46l20K03K73J71
5073A25j4m35r6J20m9Q89q65j92M69j26J00j24J08L75l36M8k06M62j17l61J38
$$ y = [-58, 156, -1, -550, -330, 266, 144, -398, -455, -611, -79, 175, 4, -58, -245, -323, 191, 128, -360, -440, 188, 382, -317, 153, -116, -140, -279, -225, -21, -32, 14, -60, -528, -247, 143, 281, -119, -395, -544, -5, 318, 39, -219, -468, -198, 378, 131, -394, -286, -152, 63, 261, 21, -269, -147, -106, -101, -88, 286, 34, -6, -96, -111, -18, 295, 301, -281, -507, -53, 418, 306, 91, -526, -219, 382, 370, -99, -402, -74, 191, 170, -153, -69, -26, 88, -185, -90, 272, 453, 35, -325, 295, 179, 457, 243, 52, -137, 225, 573, 465, -143, 156, 281, 1, 422, 153, -87, -112, 224, 381, 8, 374, -71, 141, 227, -308, -18, 461, -111, -380, -148, 338, 205, 85, -390, -84, 72, 405, -180, -171, 13, -45, -6, 178, 102, -113, -37, -74, -3, -100, -30, 120, 19, 31, 49, -129, 107, -245, -372, -211, 39, -56, -202, -522, -319, -46, 125, 111, -324, -420, -300, -349, 540, -325, -517, -48, -174, -74, -198, -90, 285, -51, -3, -209, 253, 136, -225, -87]
5094h7j7j31K45M6l9j95O6P1j26L00l77J61K48K35m63j07k67P60j76m24L93n8
5116E8n8K4k99N59j4p3k30j04J99L53k22l01l81L71N92r6n06oj09M47J8j95k2
5139EJ10M37m08P7J67j57J39m59K55j69K03J97k73L4L32m53K63m31P1R7M38l91
5161H4j79QJ11L10j84O6k25lK59L5l79m8L6K7J78l89M36OL1m62L32k69M40j74
5185D7l3l34J32L36r5j77k28J94O02l87l32K6K6M3J18p3k61K70k98J51K53L41
5207C21o28M15k06J10J15k25M13m34k25J01K43J13l61m50Q74j21k9j76L0P4rK21
5229A66J75n36l5K54J57m15K51%j10o7oN65p9k32j86k44L52K70m7n55M9M75o7
5252A35J87l34j14K27j27J10J10K16l52J21l5k80K16J00K0m93M46j26L50j02m46
$$ y = [-87, -104, -235, 10, 56, 17, -178, -112, -41, -167, 133, -244, -83, 165, 400, -63, -170, -437, 323, 147, -277, 116, 58, 0, 24, -275, 284, 270, 197, -33, -137, 62, 415, 193, -108, -489, -118, 474, 378, -128, -134, -243, 204, 222, 27, 5, 115, 552, 144, 221, 388, 231, 370, -89, 166, -3, 200, 397, 124, 158, 490, 37, 300, -131, -60, 37, 475, 84, -95, -87, 24, 334, 150, 216, -9, -12, 247, 282, -97, -145, -109, -82, 96, -293, 143, 149, 180, -282, 50, -219, 221, 47, 14, -320, -188, 148, 53, -124, -352, -158, 444, 57, -275, -249, -223, -180, -62, -135, -396, -126, -424, -273, -20, 321, -307, 108, -98, 12, 127, -98, 315, -119, -344, -243, 0, 113, -248, -698, 176, 55, 26, -150, -120, -46, -55, 166, 341, -195, -230, 24, 181, -234, 17, 17, -93, -160, -166, 399, 320, 88, -98, -342, 10, 280, 233, -322, -273, 202, 135, 322, -12, -126, 101, -26, 84, 194, 410, 58, 179, 144, -136, 80, 180, 200, -293, 153, 27, 377, 275, -171]
5273a71N2L7L30J37m33r7J77K14j26M6l18J65p6J56Q7r1R3j73m3P1j21K86j41
5296F1R2j2k16L66N2p74J13L56L23k26m58q3J45O52k53l64k8r1K53j6J8P8K28
5319B16m26m7K68qK24K0o98kM19K32k84j66k1m2L69l6k35L6K27M8j3j77j95k3
5343c14L54J16o1p9k81K67j07J88l1O9j02j09l31L24K04J36m13k5P9Q5M12k15
5365A66n5j27K65J80k66k77k1J89l1j33o9n0L46rj16R6J0p8l3J06O0J29j62q8
5389C2m7K67r7J74l63j31K60L4M8Q5j56k70K56J54m12L27Q9k31n9k74M21K01m17
5412a09J79j05J15K62q5o2o51L96M91l41l4k11J2O69qj80l81J25J07k58P8K6l52
5435c17K7J99J65NJ90m64j13K72k2N99m60j52j48K38J13K93l77k64J04K48L1l09
$$ y = [-171, -119, -82, 248, 385, -48, -145, 32, 246, 120, 166, -152, 13, -63, 93, 180, 89, 182, 9, -34, 37, -84, 202, 61, 153, 141, -75, 291, 343, -431, -318, 38, 361, 135, -323, -406, -261, 391, 138, -226, -254, -345, -92, -108, -90, -12, 216, -210, -257, 11, 3, 227, 247, -451, -453, -34, 198, -86, -252, -273, -315, 54, 18, -217, -181, 46, 94, 81, -96, -291, -314, 40, 156, 95, 16, -265, 2, -105, 83, 52, 121, 19, -90, -421, -97, 107, 243, -170, -195, -116, -31, 381, 166, 111, -16, 249, 429, 163, -114, -135, 54, 23, -110, -179, -229, 117, 108, -8, 88, 98, 20, -13, 93, 153, 282, 120, 32, -15, 252, 155, 329, -34, -165, 95, 129, 177, 262, 106, -164, 92, 246, -166, 161, 250, 19, -40, -314, 107, 308, -109, 70, -35, 80, 342, 257, 195, -456, -60, 431, 90, 56, -155, -143, 526, 518, 338, -43, 82, 189, -69, 9, 35, -317, -290, -91, 74, 79, 269, -195, -308, -36, -58, 541, 81, -71, -219, 19, 132, 425, 48, -216, -112, 136, 167, -142]
5457a42O5k86K30M24k99j01J97j3l02J64K5J54k21o3K55j64K57j11L7k46J16L44
5479C20K41o32j75n1J42J89j53k58L28n0J95j02J10l98L06J22o6l5p6L29k63l6
5501a3K38J10k96j20m30L78M61J29k82m73L90k00r1K47j61l10M04J33J59o9j93
5522A1lK50k7o7m7J26l52J8K91P8J30n00K38k29J34M30m38j90m5J57n6J92k64
5545a63mL39J14J91l00j51o2mj13J98k22L33j81l28L31N7J12m42K28j41P1J49
5567A2P1k83L49J79j15k72j40N2PnJ03K01k19p3R8l9j66K85k40R3k83L91M1J35
5591A82k34o51K43L55J02L7k75M62k10k00K27l54J18j28L70j19j05j32L47j78
5611a43K16j5r1M6j27oj06P46k89j58k08M8L35j18j08k33l6L42J49K2n01J06K80
$$ y = [-142, -77, -363, -133, 291, -8, -109, 88, 75, -227, -63, -38, 116, -105, -168, 87, -77, 180, 69, 106, -140, -24, 320, 561, -71, -246, -297, -155, 34, -119, -377, -49, -99, 96, -6, 104, -294, 12, 134, 68, 33, -43, 286, 23, -13, 225, 335, 39, -81, -511, -133, 328, 457, 175, -298, 92, -108, -199, 48, -113, -423, -19, 114, 273, 204, 11, 8, 258, 231, 164, 117, 243, -109, -91, 200, 278, 408, -92, 146, -83, 51, 481, 43, -147, -192, -35, -91, 101, -163, -167, 172, 286, 477, 177, 26, -36, -40, -153, 45, -177, 156, -25, -353, -22, 35, 147, -295, -67, -208, -137, 12, 83, -200, 149, 328, 213, -59, -199, -147, -140, -145, -42, 159, -60, -133, -35, -74, -240, 45, -195, -102, -385, 6, 47, 182, -52, -703, -460, -105, -3, 34, -241, 221, 11, -189, 38, -316, -198, -326, 44, -75, -180, -312, 35, -143, 73, 58, -33, 13, -114, -120, -226, 520, 231, 73, -135, -87, 248, 130, 22, -211, -247, 95, 244, 266, -235, -129, 151]
5634A51n5j17r8K78j14j28N5K14P9k63M3J84k80K6K48j91j70J53P3K29o84J56
5656b11r0N04J45l35P1n1k04L88j59k3L7o3K8J34J87n65K84r8O7k32L53J79m26
5679h0j67K74PO7j76q6p3K81J67j05J73o20M61q0R0j90R1k39J1J40OP4k5k78J85
5704i2J4j2M78o68k67J83M27J6k34j82J9K90J77K6l50QJ52j10L96m87p4K70j27
5727a47JJ30L6P0j66j10J43J47rm08j46L58J50J75l63n5n0N36j85k47L51m19K29
5750B1l7L9m7J39m04J62L41m88L61j67J0l6Q4J99J02om85L6K48J08N9n14K72j07
5774a10M95j79j28J9l0J04k9J94m24J00M0j23L63q6n3k58m1L12qJ86k57o7k75
5797b55L14o7j93J99k16K64N59l03o71L17M89m52K2O9j64j9K78k92l2L01k10R5
$$ y = [151, 96, -21, -119, 159, 45, -83, -28, 186, 265, 2, 45, 229, -51, -25, 223, 32, -138, 15, 88, 317, -367, -211, -301, 203, 348, 13, 84, 33, -171, 217, 58, 35, 72, 9, 37, 171, 358, -207, 77, -21, 46, -186, 167, 346, -80, -247, 27, 34, 101, -75, -161, -234, 47, 214, 109, 282, -338, 123, 43, 133, -57, 34, -205, -194, -54, -48, 26, 1, -277, -92, -78, -90, 388, -280, -547, -364, 63, 79, -155, -337, -318, -28, 149, 175, -175, -167, -15, -125, 271, -216, -290, -20, -147, -146, -16, 20, 90, -76, -186, -43, 104, 95, -313, -459, -101, 49, 224, -139, -194, -244, 292, 107, -140, 211, -208, 21, -16, 23, -24, 115, -289, -127, 214, -274, 87, -80, -70, -106, -22, 177, 279, 273, -212, -176, 72, 180, 239, -275, -3, -110, 385, 206, 78, 97, 67, 171, 142, 336, -88, 12, 52, -71, 292, 206, 153, -105, -146, 166, 158, 344, 87, 20, -255, 59, -8, -201, -2, -218, 46, 605, 302, -369, -52, 437, -15, 7, 76, -88, -107, 171, -121, -153, 148, -62, 33]
5819C3q0J90j49j05j41J9Q8K32J70j38m93L98L32l22j56k48K85M4K57l75M1K54
5841A36j26j63J61J7j78M6J07j25l42K70k9J62K56m61M37N0k92k32L92j34K43
5862A95m1m16q5J30M24m51J56J12K12j03O8l56rp7L96l46L20J3r6l74J91J39J94
5885A96l8j69o6j54M96k30k30K03Q7n6k55N01j55j77Q9l6l9O6J02j71L18m38P0
5908h6J49M9J6k96J46J52M6L4L8n15K03K68k16K38l27R2J44j25J70J81n5k97l3
5931b4j69J83L29l12j0J65K55k05k50N1k36K08K4J42l42P0oJ35kj05O1k44M0L61
5955A19l15m8N61q3m98M45L3l18p6L31o2q6J3p3l51O3M34J14j35j99K3J41p3J98
5979A58j70j44J51k82L83j20l60M45K9j7m4j06K66M8l16j85L21k74L42j74l07
$$ y = [33, -47, 143, -6, -111, -252, -233, -145, 87, 257, 119, -374, 24, 356, 34, -122, -370, -85, -41, 216, -159, -118, 136, 10, -153, 8, 25, -153, -107, 0, -125, -467, -197, -226, -64, 192, -269, 168, 218, -74, -306, 86, -48, 195, 154, -262, -347, -217, 207, -244, -88, 24, 236, 133, 201, -155, -164, -241, 155, -191, 129, 142, 46, -328, -137, 2, 196, 158, -11, -77, -231, 265, 35, -195, 8, 95, 39, -216, 285, 130, -47, 42, 6, -33, 33, 135, -36, 282, -156, -86, 63, 112, 128, -168, -22, 130, 176, 210, 248, -267, -64, 204, -12, 226, -101, -9, 135, 10, 180, 361, 306, 9, -24, -193, -10, 319, 7, -3, 162, 417, 212, -38, 13, -223, -15, 9, 151, -191, -121, -127, 8, 6, -99, -38, -282, -242, 119, -196, -244, 317, 234, -264, 181, 214, -104, -180, 151, 89, 3, 16, -57, -408, -345, 89, 203, 68, -131, -108, 33, -40, 158, -12, -156, -5, -287, 96, -24, -384, 61, 90, 73, 29, -77, 189, 237, -79, -264, 57, -217, 125, -49, -356]
6000c56L38L83m37k31J71K53j46J2J58J18o2l38J65k07J39j34J30p4J6J87J97
6021B82l47l32N51n1k20K51j57j85L81l11N3k42m7M57J85p5r0j67K57j67m56J02
6043c28K70P4k97K91K50O9j34l06m9J75K73O7j77j90q0L56O1j57j88J37k42K50
6065A25K4ql38O8J58M4j19o0N2J40l27L6J68q2K52n67M69J94j41p3l76KJ76R4
6089h9J8m2p3Q5J37j10K83k48R6p7J59j28j61o5O9j70M39k16R6j33j20L4L94j10
6113F8l00n4J37J00K96k29n6J84l70P6L42m46K41j67K89j44n2L60n79R1J94j17
6135a36K05j52J11m04K76M9l1P7p9K14j81R7M2K33m15R9L2o6n4k54J87L58o4j73
6159b9K75O0j42Oj66k3L8M8l03K74Q4J71l38J13k29o1K79J14k04K82j23J83l94
$$ y = [-356, -18, 365, -72, -303, -132, 121, -25, -13, 145, 263, 201, -137, 28, -179, -40, -174, -44, -118, -102, 85, 282, -65, -397, 154, 103, -117, 134, -23, -208, 173, -138, -85, -327, -374, 83, 268, 193, 103, -64, 193, 26, -430, -328, -58, 16, -281, 10, 260, 329, 195, -111, -160, 15, 288, 355, 178, -12, -92, 264, 325, 168, -20, 117, -125, 125, 149, 141, -197, -129, 29, 73, -46, -106, -54, 86, -241, -205, -37, -119, 133, -434, 35, 229, 88, 15, -361, -359, -183, -89, -71, -113, -186, -101, 36, -74, 209, -39, 57, -20, 139, 11, -150, -215, -146, -316, 123, -93, 3, -130, -250, -216, 178, 68, -232, -286, -149, -49, 247, 18, -38, 146, -224, -148, 194, -252, -11, -178, 111, -33, -85, 275, -304, -213, -19, -136, 69, -83, 28, -376, -100, -51, -82, -5, -84, 130, -51, 46, 88, 321, -94, 5, 37, -29, -83, -337, -150, 208, 144, -29, 246, 306, 164, 170, 4, -19, 19, 67, -236, 38, 122, 293, -45, 68, -161, -222, 57, 171, -33, 249, 126, 309, -85]
6182h5mJ79j32K43j1j76l0L3j66R0K54j65j02r0r0n1L31J55J3l55N42m71M54l55
6206A1j10q4j06L25j43J59l16L47q8N5j19J49n10K93l4K12N5j30J99j63j3l08
6228c19L21N2l13l1J77j99K22j6P4l75M61rk40J43l7K11p2j76K07j40M5j46K46
6251H6j43K10n17K26n9J31K51k15J49k71n2M36k6l35OL47l29J79k0j99k2J9K56
6274A08k47L20l0j13j76K81k11J16OR9l10K21L07l25R8n5K3J00Rl05Q7l5K80l19
6298g1l6K30m68K91P8J27j86M1K29l23l48M17L9M9j32Q7K23l43L77j5m53L52J17
6321B82j08m22j6N66l9k18K9r6k7K80k38Ln1K13k98K87m67M73j68k5L3k23M17
6344A87M5l39q4J79j69L42K2k05J88k44J0K77j78r4K12p3k05j76N85k58mq4M5
$$ y = [-85, -89, 90, -42, 201, 190, 14, -16, 17, -149, -59, 195, 30, -72, -162, -252, -303, 28, 183, 196, -159, 383, -88, 366, 11, -99, -183, -289, 36, -107, 52, -264, 83, -5, 50, -69, 80, -430, -137, -171, 41, 96, -34, 165, 2, -11, -319, 2, 54, -259, -290, -113, -312, -90, -106, -32, -407, 54, 45, -195, -52, -89, 122, 50, -126, 81, -59, -14, -160, 86, -57, 153, -364, -138, -197, -66, 185, -30, 119, -152, -204, 232, 206, -129, -123, 224, -105, 74, 54, -145, -167, -148, 108, -139, 181, 151, 38, -138, 143, -68, 48, 54, 153, -157, 64, 371, 46, 144, 89, 112, 212, 221, -84, 3, -32, 248, -71, -107, 123, -345, -54, 24, 151, -35, 6, 235, -88, -436, -19, 20, 69, -63, 24, 247, -96, 281, 266, -187, 165, 282, 174, -248, -264, 302, 263, 45, 74, -22, -49, 231, -7, -4, -55, 158, -140, 147, -320, 153, -15, -40, -7, -230, 187, 232, -107, -191, -12, -181, 161, 183, -22, 166, -78, -68, 209, 31, -63, 149, 76, -129, -305, 280, 22, 18, -66, -21]
6367b1K08k36M8Q2k34r5K39l36O40l68j79K30J08n6n9k38N10k76q8L86m37N23
6389C51j55O3l34L2K07j07J08j05M1J65k34p3Q2M09m35j44K37J55l43R6L8J91
6411B45k03K52m64J53j87K88K7l25J64J28J42j60L5j53K00n3M5L0Q8r0P1k40J90
6434A83j35j46M45o6r9k01J62k72K69K84n30K32M0j74L75k77j19J34j40J19o0
6455B4n6p4j94Q1K45J72l70o3J97j20Q4J43k03Q3M2R6k29J1O2NJ1L2L2j7k91L77
6481H0k88Q5k2j41O43k08k0j47N5n3P8l72K73k9J36l04l9O3n4K90Kl73K09L17
6505A81k83k0k0L15O9l10J47j6q9J56l02K07J4J47k41K22m44K95J2l1J09j76K55
6528A97K6k48J49j23mP2j12J04r6n8L53jL0k75O9J3j4k81p1K55P6p2J96q5K35
$$ y = [-21, 187, -49, -1, 81, -153, -248, -9, -345, 295, -73, -252, -22, 86, 30, -29, -267, 243, -33, -121, 265, -172, 351, 196, 259, -75, -43, 164, 57, 165, 60, 101, 266, 32, -41, 41, 450, 15, -129, 108, 263, -80, 16, 54, 245, 42, 294, -170, -17, -204, 84, 111, -214, -50, 78, 220, 60, 95, -58, 142, 89, 134, 164, 252, 162, 233, -7, 183, 48, -98, 347, 281, 182, -19, 143, -129, 140, 424, -106, 126, 166, -8, 367, 90, -29, 105, -35, 84, 24, -32, -106, -300, -219, 26, 198, -172, -235, -38, -158, -74, 69, -134, -51, -9, 87, -142, -131, -69, -64, -53, -21, 11, -6, -297, 80, -208, -123, -145, -286, 357, 149, 129, -18, 37, -16, 62, -310, -37, -66, 70, -234, -273, -210, -264, 26, 28, -345, -136, 181, -102, -122, -142, 173, 242, -68, 79, 63, -26, 130, -172, 35, 49, 196, -45, 177, -267, 28, 40, 9, 118, -58, 197, 223, -25, 124, 1, -3, 69, -43, 61, -35, -93, 260, 259, 289, 14, 83, 96, 82, -199, -270, -15, 61, -11, 185, 100, 335]
6553C35k20n9q8M5K50j59m1k81j32K48L48l13J6K46l9k92L47k93M06n40L00rP5
6576A50k9j29l43J03L45j90J73l46N83k62O9k44L65m98j52M14J46j22M6P4M8j84
6598A7j32j54K95K33l49K25j6j38qJ40k61K03J6r5k9j43J28M6J14M4j06J04j88
6621e4mj01L39j3j64k69N11l01o1L48k77j81r5L85l2J4k43K46J62L1m2o35N02
6644F6m60M40j43j40O0K41j62L4J43J20j2j34L29j05q5j35n41L98j5L00P2k17
6666E4J06l82M10l12j50L71k25N7L35k60k70J30L00l02M00k35j4N6N5l35J20K07
6688A16j8m13L43K40j97O3l73J35M3K53j16k1k34j0J94r0J27LN9k6j1N9k19J67
6712G4j85j16L90k78pK53k98K48k97K53K59k14J02l80M26j14j16J74k58O2O2R9
$$ y = [335, 115, 56, -32, 13, 263, 104, 63, -218, -350, -102, 246, -67, -51, 195, 156, -136, 211, -82, 324, -216, 84, 75, 150, 121, -8, -351, -248, 97, -93, 80, -266, 317, 55, 124, -120, 245, -253, -405, 9, 155, 33, 79, 153, 201, 17, -115, -269, 26, 259, -90, 135, 119, -19, -27, 113, -148, 55, 71, -24, -53, -196, -68, -22, 92, 136, 30, 134, -54, -58, -159, 180, 167, 3, -266, 245, -56, -117, 231, -46, -227, -322, 63, 31, 45, -198, 48, 210, 241, 199, -436, 66, -394, 46, -97, -237, -177, 64, -98, -64, 79, 199, 187, 53, 382, 277, 192, 57, -484, -86, -101, 199, 271, 54, 160, -222, 188, -124, -274, 97, -128, -71, 264, 4, -266, -136, 164, -138, 262, 27, 13, 69, 124, -211, -91, 116, 98, -315, 28, 268, 71, 134, -239, -104, -61, 192, 76, 55, -179, -189, 5, -85, 42, 45, 104, 78, 67, 126, -93, 74, -111, -227, 163, -115, -122, 131, -167, 81, -216, 37, 296, 82, 184, -196, 230, 116, 0, 174, -84, -22, 40, 139]
6734A39J4r5j77J73j51j22L87k07j13P1J44L08m23k10j1K22k66J56qM1r3L53l36
6757b04M72n28p0K39k49L10j69M02l18p3Kp2J65J25j14k88L0N56q4k21L5M60j88
6780B18M1m90r0J27J65L41k19k24R1J96j25J50j52K12p1j28J29l10O7m9L72j84
6802F7k6L6k12K08K64l70K07k45L60j79k44J01J16j27K49k36J1K97k39J6j79K35
6824A10J85k22j04L82j05k77J68J30j58J98n61M28n5P0rRl57j10K68L38l89j91
6846b52M21P1k06j26j04J55K14j05K46m42j00J09K25j00J40r6J11k61K57k20J86
6867A23O7m62L41o2J51m24J71K41l15L8K84l47K31o7K53j99p3K83j77j91J84k73
6889b23k82Q05k88K9k15J66L6M9l9n47K36L70P9o1o5j09k74N35J5j11Nk37L42
$$ y = [139, 153, 58, -119, 54, -97, -219, 168, -39, -152, -81, 63, 371, -52, -262, -273, -51, -317, -161, -169, -128, -221, 132, -204, 268, -260, -330, -91, -340, -30, -199, 203, -115, -188, -186, -258, -93, 32, -82, -370, -340, 216, 132, -89, -54, 406, 218, 259, -231, -321, -194, -29, 312, 93, -131, -40, 156, 31, 181, 29, 241, 170, 42, 171, -139, -72, -121, 251, 67, 41, 77, -135, 73, 337, -33, 174, -71, 289, 110, -134, -33, 83, -44, 205, -31, -20, 277, 38, 54, -125, 110, 295, 73, -31, 351, 246, -31, 137, 267, 109, 307, -254, 174, 119, 189, 180, 189, -168, -278, -10, 328, -61, -252, 169, 240, 34, -92, -196, -41, 173, 68, 314, -128, -228, -119, 106, 6, 146, 50, 161, -100, 157, -63, 123, 190, -272, 69, 7, 158, -266, -95, 146, -169, -131, 153, -194, 37, -30, 223, 24, -49, 234, 57, -134, 50, -223, -505, 300, 12, 41, -174, -8, 28, 77, 38, -509, -273, 97, 176, 115, 50, -59, -333, 202, 217, 106, 111, -126, 216]
6912B16k50Q8k01m7J32O9k76M82L3k08J76n08O71l40o8M6k03J21J59K33k40n24
6934d39N21KJ10k40R7J80k24J7Q3k24J35j66J2L52M1l40k79M70r4o5J97k47J03
6957Bo4M37m60L06k90L93n13L76jk51M58q67L14L9J58K7j93J2J74j24J8N1k07
6980b05%J97J63m1J1k84K38k22J34K35k29j98J26O1n8L64k68o4Q6J17j57m9K65
7003B22k42M7j58J59m9K6n5J3J41j08N7l11J89j15K56k34J73o1m2K38j19L7q9
7026b5K23k75o9K41r9k08J40q8R9j1K02j14J92l67L56J81l32l8j5j9J45k16M2
7049e5j21j60M32R7l6j35lJ84J93k92J60k19L8l54P4K93j89O2K25k75J73K04k77
7072A9Q7k6O4l20L45k96L74l72L41j92m32M21l01N37l63J00J54l33L60j11K15
$$ y = [216, -34, 54, -147, -194, -62, 7, -269, 213, 246, 38, 214, -294, 377, 37, -31, 15, -188, -67, 92, 325, 85, -439, 82, 84, 194, -46, 51, 231, 7, 24, 107, -117, 18, -148, -136, 216, 257, -83, -362, 108, 14, -51, 146, -101, 2, -62, 375, -85, 221, -69, 324, -189, 187, 186, -65, 393, -474, -160, -121, 37, 64, -129, -117, 57, -67, -49, 2, -205, -205, -8, 155, 114, 125, -159, 79, -143, -9, 226, -3, -201, -75, -14, -72, 292, 24, -40, 46, 163, 6, -43, 222, -20, 27, -131, 28, -21, 5, -50, -37, 104, -4, 53, -258, -69, -184, 72, -162, 11, -50, -92, 146, 27, 64, -25, 198, -77, -146, 95, -4, -212, -72, -160, -61, -72, 130, 16, 208, -159, 197, 378, 46, 8, -7, -26, 119, -97, -55, -176, -336, 96, 193, 157, 22, 19, 203, 396, 104, 264, 45, 83, -271, -197, 96, -93, -31, 194, -81, 92, 296, 19, 106, 80, 144, -176, 169, -127, 247, -125, 216, 24, -408, 13, -288, 249, -114, -14, 140, -193, 167, 56, 271]
7093B71j77K39k0k56J62k83K63O0P5k90j70J45L86l87k90L04M44m93k24J45K42
7114A46j86o9N2n3J18Q6l08J2P8K15O3q6k43J55L18k29j34j78K42J21j60o7p4
7137a81K20n1K8N6j86j03M19k52M2M06n11J09l33M34l58K43Oj31J22J3l7n2K4
7160g3K14p7j31K05o63N42J02k45l6k63M34p7qk02L40J99l04K75k39K55k01j17
7182g0Nj47J14K87k07J17M1r4l12L21P7k61M63j04j96j2k7m8K23k30K78k30L1
7205A9P9m60K67l8L58L2j48o0k50K63P1k7J40l16o0K50Q7k50J66J14j78j43J76
7228I2J06J9k32ko1K28Q2l04K33l10K50k4L05l98n9L16R2m25O6j66N84l17j08
7251c3K6j22R4L9o5J97k16J01n1L1M30l34J6J07r3M1O1m03J92J41j93J53J13j13
$$ y = [271, 94, 333, 313, 57, 219, -64, 199, 259, 334, 44, -126, 19, 405, 18, -272, 32, 476, -17, -241, -96, 146, -40, -109, -57, -110, 8, 94, -214, -202, -124, 91, 154, 68, -175, -20, 298, 69, -65, -243, -1, 120, -40, -107, -181, 39, -12, 16, 72, -114, -217, 202, -50, -8, 398, -113, -4, -337, 97, -261, -18, -12, -143, -21, -8, -45, -97, -73, 141, 64, -67, 138, -525, 17, 119, -126, -162, -425, 9, -68, -76, -278, 62, 261, -43, 232, -7, 248, 47, -70, -65, -212, -98, 189, -18, 99, 140, 46, -266, 55, 132, -129, 334, 230, 34, 22, -5, -53, 170, -60, 218, -12, 19, 98, -362, -95, -133, 225, 257, 109, 49, -201, 62, 133, 106, 246, -70, -130, 120, 207, -43, 123, 237, 59, -84, 92, 198, 217, -15, -17, -78, 150, 232, -72, 161, -149, 101, 77, 382, -16, -75, 241, 333, -92, -26, -192, 392, 75, -33, -7, -129, -35, 4, -61, 136, -80, 21, -30, 1, 431, 97, 113, 220, 127, 168, 229, -174, 18, 159, -34, 119, 232, 119]
7275A19m80L71j72R6m5p1K81o7r4J17L1j37j0o4J46j22K33K70m97JK76j71J25
7298A36j34j05J6K21l07L14k1j69K38K64j94l74J79p3o1j41J45N4o3j0k8J96L4
7321A17N8j25n5J79j98J41j04j16j05Q1L69k27j53L34k42L0P8j8Q1k36K25n0j51
7344h7J60n7K62l76J07L92l0j05l47L30j91k9k15M2J41O9k35K16j51K23j67J20
7366G2K43l30q7K23Rl49J67J0j25R6K53k11L61n00j4J99m9J41J51l06K1J13k5
7389F3k52L01l08K43K12k93J57J63j16j77K09j41J7l67J01J07R7j7k6J17j83J35
7411D2q2L6J00N1j24j49J9L73n6k91k07L73J32j21k19N0j20M22j51k58J97K5j47
7434a05J98J33k86K98k05j75K02J57l10J53l22L09J09Km70M01K3l72RJ18K56K5
$$ y = [119, -361, 10, -162, -66, -111, -182, 99, 32, -62, 55, 86, -51, -61, -125, 21, -101, 132, 402, -95, -94, 182, 11, 136, 2, -103, -87, 134, -173, 141, 120, -49, 189, 453, 259, -115, 64, -9, -70, -211, -66, -12, -75, -85, -113, 83, 117, 175, 50, -5, 174, -24, 117, 13, -103, -208, -127, 242, 15, -138, 196, -46, -16, 62, 44, 125, -111, 114, 64, -87, 73, 16, 278, -98, 9, 401, 371, 266, -81, 249, 58, 29, -186, -144, -3, 66, -169, 47, -104, 119, -48, 72, 315, -15, -102, 121, 130, -219, -52, -42, -167, -71, 182, -29, 332, -168, -182, 17, -32, 109, 260, -46, -25, 88, 63, -189, 112, -196, 47, 259, -34, 123, 286, 170, -7, 202, 61, 78, -289, -188, -81, 16, -1, -27, 90, -93, 42, -40, -4, 96, 147, 23, -126, -107, 266, 210, -81, -288, 85, 217, 96, -123, -73, -193, 229, 78, -180, 17, 42, -105, 93, 226, -60, 238, 33, -142, 60, 217, -93, 60, -262, 47, 156, 158, -312, 89, 112, -260, -251, -133, 123, 148]
7456A48l26K10K00j66Q4j90K09k77L3j3kq4J59J4L60r9j74jj64J68N8qJ18l51
7480i4R4J7Rl44K6L05J73j3k5J34k81k50J82k34J73K96n8p4O2j33j91M42n4j82
7504b0m9J90l64J32r6J32J16K58m04k52K00p6L27l14L42k70L08%J7l88J09O1Q9
7527D8p6J24J4k60K86j59o9p3L69n9k19j26K09J09n7k1L3m2K00k84J85l2K16k73
7551D3j7p9J31q0j06K68j02j58O4j43j42L74m2J77k31k79K46J24J11N4%j20k19
7574a26K61j70K86P0n33K29Q2J50j72k42k9L12l93K91l17L59L15m10k5l7M62n64
7596b01J82J89l42M6K64n64N17N2l09K95J10j37l83K46K4j09J17j60M1R0J57j2
7618A13nk66K69m3M7j48j79K83J56l41j8K07J14k08L65l00j91J75J15l4l09M55
$$ y = [148, -178, 32, 232, 66, 150, -40, 169, -108, -75, -88, -90, -174, -15, -1, 359, 260, 86, 85, -79, 89, 147, 139, 257, -94, 0, 17, 26, -318, -292, 13, 186, 173, 148, 282, 1, -249, -67, -301, -128, 168, 110, 36, 98, -35, -226, 216, 162, -20, -69, 121, -243, -111, -207, -75, 41, 299, -105, -357, -157, -233, 94, -220, 122, -148, 160, 160, 177, -211, -102, -41, 48, -28, 96, 110, -150, 136, -23, -92, -165, 204, 145, -74, -200, 9, 118, 61, 40, 73, 31, 231, -53, 132, 100, 316, 43, 26, -53, 78, -2, -108, 160, 58, -100, -36, -179, -321, 53, 11, 188, -43, -322, -76, 48, 159, 213, 213, 93, -126, 135, -35, 251, 321, -212, 17, 99, 249, 77, -165, -194, 118, -275, 16, -301, 58, 373, -37, -62, -99, 363, -201, -19, 170, -172, -126, 138, -426, 91, 143, -166, 129, 239, 102, -281, -35, -11, -120, -3, -163, -122, -32, 125, 113, 108, -158, 111, 68, 115, -33, -212, 71, 227, -114, -132, 75, 189, -19, 346, 46, -145, 30, 145, 111, -198, 257]
7640B57l59j04j88M75k37K12O6j87n5J10K7J40l58L36k15k09M72l99m8Q3J38R3
7662E0q8nN0k94rK84R3j37q5j71L90J07k09r8O8M3O5M5m0k98J70j04J44j09j35
7687b73M58k56j35Q2mQ6L09l62K88j4K0k58J22J18M8k71J04O5p9m6K56k97j42
7710a81K63j89J98P7j20K06j66o6n5K23j97j05K66j54j76K60M3J09n84L40j11
7731a19K72m0k71M11l05L87k64j87R4q0J72j23Q9K1M9Kj95O9J02k7j93K69j32
7754AJ97Q2j21m5j63J28j18J54q6R5k69J58K11k54m9J8k5K45Q3j59j88L6J26k31
7778a74J13o1k5J21q8n0K58k40N7J96j5j86O2K76l41R9j9J39l91J65J72j67L6
7801f3K12j61Q0J20k12r2O0R2MLL8rk55K28q9Q9l7p0M9L2j62Q3J74lj15J12L0
$$ y = [257, -102, -206, -394, 81, -156, 56, 122, -65, -120, -10, 17, 157, -201, 135, -80, -289, 183, -216, -264, -181, -43, 50, -38, -43, 7, -287, -296, -12, 81, -56, -141, -312, 78, 185, -24, -122, -54, -11, 54, 99, 59, -239, -69, -173, -29, -138, -273, 185, -71, -206, -124, -128, -42, 267, -95, 193, 179, 199, -59, 63, 181, 229, -42, 62, 127, 48, 2, 258, -39, -181, 82, -107, 91, 168, 48, 254, 88, 22, -33, 190, -7, -112, 154, 0, -176, 84, 127, 236, -348, -8, -119, 153, 113, -158, 253, -52, 335, 71, -116, -22, -102, 70, -53, 36, 57, 106, 108, -87, -18, 84, 57, -136, 133, 1, 198, 280, 159, 114, -49, 79, -39, 115, 29, 124, -145, 13, 224, -30, -79, -61, -86, 159, 242, 83, -105, -69, 57, -174, -61, -122, -147, -26, -114, -164, 94, -146, -89, 107, 92, -94, -32, 244, -97, 2, -17, 122, -269, -104, 68, -99, -63, 149, -12, 68, 188, -24, -116, -56, 36, 40, 43, 81, 72, -183, 45, -44, 45, 8, -62, -13, 19, -143, -60, 114, 111, -4, 108, 138]
7828A38j72k2K53k28R4k8J36n55M23j89K45Q0K7k01k01N4J39N11l06P0j91j12
7850c5rJ82l18O24j63m32Q7Pj0lK49j42m9m6L5K72o4N7m11J33M84n79j93K85j41
7875a80J26QJ61j7j46J1PJ68j35k55K53Q8r2j3k72M43j62r8J49j0k25J40Q1j95
7899a65j60K06M7r0K5K44m28K21K62l91M41m26M40l35J15j73P2L32k95j32M78
7920B88j14k99J81N0R6j59o2r5L08l10J6k06L79l17nP6M06M6k16k27n2N14l00
7943bl6o3M1P2j12K45o6o8J61J01pk30J29l88J35L1L67k05N6M4k18lL63k69l60
7968b82L94p0K33k54R0k95K42j22P0K92k81K8r4J90n01M01j09j39J22k46L38j46
7990a39k44N89l07Q5j4j2p5O6J51j22J73j07J22l79J08J13J8J49l6l8k20L9k09
$$ y = [138, -34, -56, 197, -31, 63, 35, 171, -384, 39, -150, 95, 175, 202, 1, -200, -146, -7, 504, 198, 268, 77, -35, -44, 138, -180, 444, 281, -151, -64, -57, -67, -70, 179, 37, -12, -58, -23, 249, 185, 242, -169, -36, 448, -131, -324, -39, -180, -54, -46, 115, 98, -48, -37, -30, 138, 3, -252, 1, 89, -3, -16, -288, 155, -7, -105, 44, 34, -191, -51, 30, -165, -325, -119, -72, -162, -137, 107, -321, -100, 162, -229, 212, -214, 226, -109, 6, -167, -95, 237, -58, -190, 288, 174, -125, 56, 106, 202, 43, -19, -114, 194, -116, -100, -306, 73, -244, -249, -173, 233, 279, 63, -164, -216, 298, -2, -38, -101, -60, 12, -100, 145, 79, 11, 172, 273, 266, 36, 165, -223, -88, -57, 310, 105, 161, 205, -13, -16, 347, 78, -282, 112, 42, 275, 21, 111, -184, 58, -64, 6, 298, 17, 45, -49, 141, -360, 41, -68, -207, -85, -331, 7, -139, -383, 206, -101, -16, -30, -42, -117, -51, 100, -22, 151, 44, 166, -213, -105, 8, 26, 175, 139, 101, -119, -80, -289]
8013b89L59L1p0m8k40M94l51MO8J18n1J0R9m35K55K96J10l68P2L6l0j36L18l39
8037h7J54l48M03L05m32j89L2J67K57j98q2R8l11L63j86l40M07k22J33N3J82M4
8059B03j17m0J23M3l28L23j69J39Pm34M51j63k64P18l73K15n65J79J58o1m8K47
8081B44k82m2J78J42k17j33k17M65l14L05Rk90L75n92L08j4J69J43j45k71K3M50
8103B94l83j0Q8O4j2L2q6R1j68k0L1K93l41L4J70N9k17J56J70J25k68j4n4l52
8127c18K67j70J64L67k26j78J22J63l61K13l03O8M9kJ60j37J06q5Jn22L31J53
8149a38K64j28R8l26K46j03j99M51l26L62l87J94R4k35qL22l32l6J48l4O9j35
8171a39J9j83L89Q6J1j98pL8J26j7r9k51J03O8k7J49j54j97L39k69
$$ y = [-289, 70, 101, 31, -17, -257, 237, -114, -110, -42, 76, 25, 35, 134, -301, -46, 250, 360, -8, 64, 100, 70, -66, 252, -87, 67, -281, 122, 427, -5, -194, -162, 5, 262, 64, -18, 80, -231, 132, -54, -394, 13, -209, -76, -23, 159, 203, 86, 46, 169, 212, -116, 207, 38, 177, 184, -250, 201, 38, -226, 492, 119, 334, -231, -52, 106, 45, -3, 244, -38, -80, 98, 240, 23, -110, -327, 138, -176, 129, 138, -152, 223, -369, -61, -75, 94, 237, 92, -179, -156, 294, -89, -99, -11, 53, 41, 73, -13, 78, -90, -110, -79, 214, -127, -93, 77, 136, -81, 75, 245, 370, 102, 88, 34, -318, -51, -221, -57, 310, 84, -94, 28, 191, -170, 43, -260, -192, -143, -145, 15, -122, -16, -101, -100, -622, -291, -138, 126, -2, 96, -230, 16, -87, -286, 165, -161, 201, -186, 8, 102, -133, -141, 181, -151, -187, -39, -73, -4, -139, -120, -303, 86, 172, 183, -15, -22, 16, 142, 125, 26, -225, -122, -54, -81, 68, -86, -283, 56, -213]
8191b13
$$ Imaginary data points
##PAGE= N=2
##DATA TABLE= (X++(I..I)), XYDATA
0@%%%qJ6qQk4L2l2M0n6P2q8J05j28J56j88K22k58L03l54M10m74N45o25P16q14
28d32R20j041J175j321J482j659J854k066K298k556K837l144L484l855M267m727
44b484N236n805O446p176Q014q983J0119j1477J3134j5206J7891k1521K6729l4893
58a9976M9607q4337L08754K52078p04434l09144L40508N57756m3786m65220k80223
69c98417K56386L50656L8347k60796j62564O9874J81480P2576n7407j22171o0924
80i2960M2572J12323L7674r1541j22113J8090J28536N9362r3977q6637N5373J08633
92G5335p312r1431j9254Q1899L6995p3981o6507M7135O9840l3876q3596O844Q2001
105B4092J8256o8706k6948O9574N4878m8517o7957K7048P5513k841p5904l1889
$$ y = [0, 0, 0, 0, -8, 8, 0, 8, -16, 16, -16, 24, -32, 40, -48, 57, -71, 85, -103, 119, -139, 164, -190, 220, -254, 291, -334, 382, -432, 488, -553, 622, -699, 783, -876, 978, -1088, 1210, -1346, 1491, -1653, 1831, -2024, 2243, -2484, 2752, -3053, 3393, -3783, 4231, -4752, 5367, -6110, 7024, -8182, 9709, -11812, 14917, -19976, 29631, -54706, 254048, 506126, -198308, -507452, -166944, 390812, 347026, -118194, -398417, -142031, 208625, 246972, -13824, -176388, -106514, 74966, 147542, 90135, -32036, -92960, -50388, 61935, 99609, 8068, -114045, -95955, 32581, 91943, -2034, -88671, -33298, 75335, 68023, -23408, -42662, 39237, 76232, 2251, -64256, -17121, 52719, 18843, -64753, -57909, 24092, 42348, -26358, -53306, 16268, 71146, 22629, -45328, -18280, 57233, 54392, -21512, -53401]
117e3401M3909L0207k8252k8567J7641J9684j9517j5196L8725M6477k5119o8890
129d2299k688P8779M3311o1346q0043Q423O6156K0525l9137k6366J2209L657r193
142b8012L0625N4711j5370q8879k7277R9570Q9675o4539j37031j2382J25359O7861
154I4311q8067j00790L8366R7534l585p6161K085Q5813J6108r7398n0422J00992
166A8786J08338o8198j66572k2774J62558J11989j03035j71883k66J63892R9645
177A32480q4770j30353K786J10650O1005m7469p1119j2923L6658L0997l583l1012
189f653k5856Q196L3559J4619k8825k6109L1117N2421j1046o9154j8501P5113
201B8881O2096n5420j06593p644J04507O7565o8171j08438K331J03382N8478n1204
$$ y = [-53401, -9492, 20715, -7537, -36104, -18463, 1221, -18296, -33492, 5233, 51710, 26591, -42299, -44987, 33792, 77103, 15757, -64286, -55863, 10293, 30818, -8319, -34685, -22476, -18819, -28012, 2613, 57324, 41954, -46925, -74202, 25368, 115043, 50504, -86527, -98909, 26450, 94311, 6244, -94546, -56180, 41354, 37769, -38392, -36307, 49506, 65614, -31784, -82206, 18786, 127124, 58926, -107646, -130420, 32138, 144127, 41092, -130791, -131057, 32835, 132480, 47710, -82643, -79857, 30793, 91798, 44329, -26790, -39713, -3055, 27942, 24359, -6653, -32509, -24313, 9246, 23865, -4960, -31069, 48, 52469, 41423, -27731, -46232, 28881, 90977, 35557, -71036, -78680, 25827, 93392, 25221, -83217, -80886, 22496, 80974, 29770]
213B9770p1287L656N5158K6282j9848k1299k989p067j2788J2965L1292j826m7534
226b5515l0025L5992N7267L970m9501l1427K6747M5163P670k9430k6819k730J4783
239c855J7122O69k3321k3276J0568L2591P623k9212j7461L1164L7132j8669n3367
252c2292j206O4819L3574o1926q0184K0133R7959L5299q5731r0628L5546J15105
264E0468L6322q6995q0405L4751R1740K3558o2732n3888J6543M4204P588k5314
276d160j6065N439M846j265N234J1396L712q048q860K920J3078J0472k957j5865
290a23j6538K5J9246J6168j3699k9061n264K6930K2854p767k0391o87J6873M882
304A3448j2426m48J9078J274l6024k6711L2262N4427o894p2386m0520N8164Q6789
$$ y = [29770, -41517, -37861, 17297, 43579, 23731, 2432, -557, -7624, -20412, -7447, 23845, 22019, -25515, -55540, -19548, 37719, 41689, -7812, -39239, -12492, 32671, 40341, 10911, -15908, -18638, -3855, 13267, 13936, -9385, -32661, -22093, 10498, 18121, -11091, -28552, 2612, 39744, 21075, -32292, -33498, 31321, 64895, 2969, -77215, -57082, 40877, 76176, -9555, -100183, -64637, 50468, 86790, -205, -80610, -45859, 45881, 69439, 6707, -47181, -30638, 13566, 21154, -4160, -20225, -14786, -9940, -11205, -5971, 5425, 9137, 1089, -7771, -4851, 8227, 18699, 15742, -123, -16661, -16636, 2610, 18778, 5079, -23982, -29246, -2316, 20538, 12771, -7620, -8307, 8566, 13448, 1022, 574, 19652, 20926, -15098, -41809, -9547, 44880, 37986, -34400, -74920, -16756, 70033]
317G0033m306r1542n1494N9943Q8464L35q1017n3313L4631O6839J0857n0663m1068
330d2301J2970L9904J6250j7585k0438K731J7887O198r497m166J0298N042j5306
343A987k0556M988K8118J3058k8077l7756P011M9020K7148l2345m6712M606M9868
356B0358K5842l2883m0809Q038L5422L408l0798j1588K4299J5392k4853k5996
368c4168K0645M4854L105m8272l1488L4551N5876Q36n6355m2073K4896N6385J3493
381D2285m5040m4579R620M6940K4436k1573l3579l743K6872K0893q312j8800l922
394h502Q667J020r721j818J2948P380j8053k4232R895M0426J7221l4748m0682
407d0199J2645N2828K2411l9258m8089P055M6477J8716k9669l1852O050K5474
$$ y = [70033, 65727, -25815, -77309, -17366, 71098, 71433, -9584, -62897, -28266, 38573, 49430, -1233, -42301, -29331, 10573, 26823, 9238, -11200, -8469, 9418, 15616, 6119, 1953, 12251, 17293, 1987, -18569, -13581, 14537, 27595, -482, -38238, -31227, 17793, 44941, 12596, -34116, -29510, 20358, 46200, 13317, -27492, -19454, 15968, 19376, -11422, -23010, 1289, 16681, -8172, -34168, -13523, 31331, 34436, -13836, -45324, -10773, 45103, 45939, -10416, -52489, -27593, 28792, 42285, -2755, -47334, -37714, 9226, 33662, 12089, -21490, -25233, 1639, 22532, 14220, -4580, -8502, 165, 1185, -8536, -10354, 2594, 9974, -8079, -32311, -22416, 18010, 35231, 483, -40199, -27554, 25274, 47685, 8427, -39662, -32607, 13870, 32586, 2917, -28935, -22885, 2589]
419B589P113j2915m718J2848N819j4874j0047J7349K5309o511l6782j9570K6516
432g874L8958j172m3871k9937K3971M6669J0822l5163l3032J0241L9602J7986
444C7200k4083l0766J962K5283R305j7901j5041J0076J4999q234k0795M430L2047
457A8482J2874l0683l2723J6133M8414J4380m2192m5855J2097N2701K1677l8587
469F718m5342N667M4614K3711k3062l2401J374K7945J2781j3154j2912N808P293
482I040q216j1316N977J7563J096k3765j8659J5551L3619P901k9768k9382J0672
495a9687L9126J7912k8106l6947K081L4471J7269k1595k6994K169K2744P813j4812
508d556q690J3399J3016j1459j9092O563K7447R421k7543l1262Q453M0744J7948
$$ y = [2589, 9702, -3213, -7931, 4917, 10736, -4138, -14185, 3164, 28473, 21962, -14820, -34390, -7874, 31084, 29912, -13959, -43896, -19925, 26744, 37566, 2403, -30629, -20388, 19214, 37200, 13117, -17649, -15687, 9596, 18901, 1000, -14041, -3965, 11034, 2800, -17995, -13565, 18482, 31356, 673, -32050, -15917, 32497, 46877, 4685, -41170, -29073, 23628, 45305, 6718, -38624, -32957, 11657, 35368, 12306, -20095, -18721, 9224, 22005, 8851, -4061, 1747, 9040, 824, -10492, -4515, 13048, 14144, -9621, -28280, -12729, 20890, 28791, -977, -30359, -19687, 19439, 37351, 9245, -27702, -25621, 8850, 26119, 4524, -22470, -20301, 2443, 10256, -4556, -13246, 153, 13169, 1710, -17382, -10819, 16628, 26049, -1494, -32756, -24303, 16441, 34389]
521C4389l3350m1169N526M4599K5656k3110l8704l782L2645K4347j0972k5395
533i320p049J1654R661k195n271R56M73q913p442J1914K3964J768k9530k3281
547c2611J8506M2865J1332m0659m2251J2581N2707K1982l7897m7827M026M7619
559A0373K7695k4264l9460M23L3620J8050j6841k0842O217J6439k897j7382j129
572i998J9906R408k2308k3677J2815L4890R344k9807k8760J2528L7204J3049k6974
585G620k9774N007K8158J2216j6359k0088J273J4558N252p806l332Q304K852j0162
599b281p235J1480J7416j718k2660j6566J3156K8053M719k7329k5580R243L2649
612A3347J4522k0720k9594J942K9703J8098j5661k5134k065J9266J1848j0257
$$ y = [34389, 1039, -40130, -34604, 9995, 35651, 12541, -26163, -29945, 2700, 27047, 16075, -9320, -16369, -4715, 4946, 2751, -2520, -1564, -1091, -10004, -17446, -5532, 18432, 20200, -9330, -32611, -14105, 28760, 40092, -567, -42818, -30237, 22470, 44452, 6555, -41272, -37246, 10373, 38068, 13804, -25656, -25233, 8387, 26437, 9596, -11246, -5029, 11410, 8513, -8869, -9998, 9908, 19316, -2992, -26669, -13854, 21036, 30380, 573, -28187, -15659, 21545, 34594, 7620, -22154, -17147, 11011, 23227, 6868, -13220, -11947, 2611, 7863, 57, -3275, 5029, 7881, -2281, -9516, 1964, 19380, 17662, -4998, -21564, -8408, 19645, 24364, -2965, -28545, -19302, 13347, 27869, 7149, -22445, -20503, 9200, 27298, 11637, -13497, -15562, 3704, 15552, 5295]
624E295j6098N42J3628L711j2586p801J1183J5618l517k0655q479J9185K3391
637B3417p437l0920j2283K2467K6579o353k9792j2374J9368K1119n126j8629j792
650a1756J4209L994j2405m290J6509J2985j7752k9847M283M0711K1561l5248m9409
663d6455P098N9005L3284l8951o0234n23O0260M0084k9457n6262r721M1081L4547
676C3756j1944l5623j3116J7462J8088M97o543k630l755p023L370J8325J2569
689B3433j5254k8339m776K9769K6474j3366l7436j3469K7606L1774k694l1016
701g294j8865J5453K8146N632j9464j6973M431J6074O766r473j0832J217Q289
714C107K198o427k757N313O806k623r310l327J0285J2759l661j8266q808J3425
$$ y = [5295, -10803, -10261, 3367, 7078, -5508, -13309, -2126, 13492, 9975, -10680, -19159, 26, 23417, 15980, -14940, -27223, -4756, 21823, 15470, -14322, -26696, -7328, 13791, 8665, -9964, -11756, 2453, 6447, -5958, -10248, 6261, 19246, 1494, -28353, -24070, 16641, 38202, 2954, -46455, -39357, 19648, 52932, 13981, -46253, -46776, 13484, 53568, 24111, -32151, -41872, -791, 33756, 21812, -13811, -26927, -9465, 8623, 9120, 2577, -53, -3808, -10831, -7461, 10864, 23433, 8179, -20160, -24936, 4833, 31307, 17941, -19495, -32964, -5358, 26416, 23722, -7294, -26159, -10706, 17440, 23072, 3608, -13365, -8934, 7140, 13906, 4433, -6399, -5182, 3107, 5305, -1122, -3879, 1434, 8240, 5617, -3693, -7020, 3265, 16024, 12363, -5903, -14711, -1286]
728a286J8305j499k1890j3362J3796K1533j100j9296q338J2110J3023n332j2015
741e351K442J2605p04j7044p709J8415J9454j1839l1348o603L2109K8310j6619
754A6118m0613q025L7128L0752j7445l8820p541L0734K3596j5173k8263j469K2811
767C790R464j6107j2359J1789J7211o642k2729k629K5761J8305j8626l2959r19
780b6650L4486K2456k0759l5778l904L0986K4003j1606k7692p369J7282J6044
792A1499j123j0266o087j77J007K830P660M163r136j7247j295K1126J9006r333
806A2627k7998j1361K1474K9593J53k9273k2039J1010K9400J2441j8522k7228
818a9723l074K4022K0148p253k3749q774J4851J7619j447j5128o383R815P922
$$ y = [-1286, 17019, 15520, -6370, -19732, -5936, 15597, 14497, -4799, -13137, -1027, 11996, 6664, -5351, -2909, 9696, 8992, -8052, -15761, 2654, 22108, 10269, -21079, -27682, 4427, 32737, 16118, -24495, -32520, 4608, 35360, 17915, -20905, -28446, 2288, 25884, 10711, -17552, -19021, 3790, 13254, -2853, -15212, -3423, 13788, 7146, -15583, -18212, 7549, 25854, 7228, -25731, -26650, 7836, 30292, 9533, -26245, -30149, 837, 24840, 13234, -14458, -21827, -4545, 11499, 10376, 110, -5977, -6154, -5147, -2317, 5343, 9506, 370, -16877, -18172, 2954, 21960, 12627, -15371, -26732, -5258, 24335, 24488, -4785, -26824, -15814, 13586, 26027, 7505, -19723, -22797, 1225, 21373, 14120, -9629, -18403, -3552, 14067, 12620, -2508, -8891, 924, 8846]
831H846o556q296N231J0475l073j5362n196J6172J7681q412k4971o273K3644K1817
845B5727j0054k7678p473K1423J9107q611k2148l971J6673R417r780j0500N500
858b368J1667j363j3739l963J5039J2956r549k1765l382K1018J7826j1008k6750
871a5381o837K2392K2017q095k4647q904J6681J8173l044j6734o203R547P734
884F699n251o318M405O364n687j1893J545J6813R498j4256k1756L391K5385J4152
898B3091j7425k5302K63K3854J5467j2335k1867l126J5565J2283n204j1118k333
911h187O265L626k422j735M193L252o709q907K694J4663O858j2841j8669k1K1713
926C773J6703j0912k6311p081K2626K3155n475k6679j2883J7111K2217j399k0132
$$ y = [8846, 2290, -6006, -775, 9700, 6627, -8735, -13931, 2241, 19922, 11510, -13461, -19734, 3910, 25727, 15673, -12005, -19478, 1945, 21052, 12441, -9707, -13678, 2995, 12412, 2632, -7868, -2368, 9299, 7936, -5803, -9766, 5273, 18229, 8680, -13085, -16467, 4551, 22377, 11369, -15381, -22218, 174, 22191, 14096, -10551, -19455, -2774, 15399, 12355, -4379, -10582, -1035, 6699, 1448, -4870, -465, 5899, 212, -11681, -10136, 6677, 16175, 1919, -19837, -16446, 8939, 23091, 5666, -19636, -19373, 4481, 19948, 7613, -14254, -17380, -1815, 10468, 5264, -5854, -8187, -1922, 1704, -718, -2453, 1740, 4992, -1717, -10624, -7930, 6733, 13591, 750, -17919, -17940, 3773, 20476, 9564, -16747, -23828, -1202, 21953, 16478, -10201, -23084, -5973, 16244, 14845, -5287]
939e287j0022J0676J1565k541p377R70N900k751q500J825J4485O720j4527j8111
953a6975M703K3090J2131j7316k4827J7K5367J7341j2539k4193n227J9167J7814
966A8553n452j9012o641J2401J1600l936j1265j256P784L715o452o644N510J1084
980I989j265j4244o221J2498J5678m161j8778q799J3660J7597k974j8163q236
993a3419J0538J2047j173r662k680M724K350m116m46P245L332r082j1429M159
1007g612J7354O703j5206j9274K188K2920J4046j3965k3722l105K1277J8274p192
1020A2686k2730q742J4485J7429k117j5650q095Q112R540j756p334K5O921k86
1034B488r206k677J1989J0835q880j8295l564J9614J6845r476k4865p167K0548
$$ y = [-5287, -15309, -4633, 6932, 4391, -2986, -2016, 3884, 1133, -7367, -5542, 8943, 15663, 1136, -16975, -12272, 10818, 22949, 5633, -19194, -19177, 6190, 23531, 10992, -13201, -18428, 739, 18553, 13101, -5911, -12552, -151, 11449, 7513, -3752, -5008, 2776, 6491, 39, -6605, -1095, 9989, 8724, -5520, -11741, 757, 16435, 12274, -6504, -15303, -1643, 15954, 12980, -5183, -13419, -2881, 9166, 7993, -1669, -4349, 375, 2725, -1391, -1837, 5408, 8740, -342, -11771, -7612, 9742, 16445, 1239, -18035, -15847, 7073, 21119, 7154, -16568, -19673, 1604, 19878, 12686, -10044, -18786, -4301, 13128, 11011, -4639, -12734, -4622, 4918, 3162, -4172, -4147, 2774, 2488, -6718, -9395, 2594, 13429, 4549, -13746, -17310, 2304, 19149, 9673, -15192, -22359, -1811]
1047a811J9847n821k2390r499J4360J8019j462j5921p172Q080R493k383o104K35
1061b529M016j071n875m11Q430O553p020j2482m35J4219J0610o668j6957m405
1075a4025J4104J4245m311j6799o940J1471J2812k820j1524l621P749O197m618
1088A920o005L964Q022k704j0870k770J1630J1700o986j8296n373J7299J7607
1101A9138o321k1940q871J5817J9398j693j9556j0431J0148J5047M24j0930o565
1114f335L420O095J19l441Q59L560k526o780K45J0201O938p676j4704j917J5623
1129C681J3228p490k0437n590J5870J6161l852j7836q129J0117J4177k87j1957
1142b344n639N906O384k666m665J245N500j682q848k246J1017R843p044j6751
$$ y = [-1811, 18036, 12215, -10175, -19674, -5314, 12705, 11243, -4678, -11850, -3770, 5723, 3340, -2764, -2529, 1487, 416, -5459, -5870, 2560, 9113, 2093, -10389, -10824, 3395, 14005, 7337, -9620, -14025, 79, 14324, 10013, -6786, -13726, -2255, 10557, 7737, -3787, -7408, 341, 6538, 1920, -4085, -121, 7901, 5197, -5673, -8443, 3187, 14887, 7901, -10395, -15768, 1531, 19138, 12817, -9123, -17994, -2177, 17221, 15528, -4028, -14459, -4311, 10736, 11160, 230, -6335, -2915, 3180, 3299, -142, 717, 4277, 1751, -5029, -4784, 5417, 12355, 4679, -10025, -11942, 3681, 16909, 9419, -11018, -16608, -738, 15423, 11571, -6265, -14394, -4277, 9900, 9613, -2344, -7983, -2077, 4307, 1641, -3024, -1779, 3721, 2039, -6809, -9055, 1962, 11805, 4761, -11990]
1156a1990k909J6283J4664o309k0847p626J5564J8493k888j9849j0300J0751J6136
1169I173P87j3010q059O409Q612j012n580J81L895o00n629j570P632O857n003
1184C083j2932k149J2781J1328n487j5950n103J2184J4417k324j4989p406R098
1197c449J1633o68r684m502M855N153k084l949K028M891k163p589p32R600P804
1212A1144n709j3843l435J3416J3647n719j7522o594J3130J5361j763j6050q808
1225a2745R108J3605j50j0745n869N251O828r31n465j66M557J308o391l821O131
1240E05Q968k637j1596n832R602J3718q07j5389r707Q633J5805J956j3797j0537
1254a1115N155J2651K535q962o661M414N867k100m638K581O427j730j0812l536
$$ y = [-11990, -14899, 1384, 16048, 9739, -11108, -18734, -3170, 15323, 12435, -7414, -17714, -6963, 9173, 9960, -3050, -11109, -4700, 3912, 2900, -2680, -2499, 1396, 796, -4833, -6403, 1229, 8086, 3083, -9849, -11998, 783, 12111, 6624, -9326, -14429, -2245, 12172, 9848, -5141, -12547, -3449, 8184, 7516, -2168, -6670, -1815, 3338, 1254, -2695, -667, 4224, 2061, -5528, -6260, 3340, 11144, 5435, -8408, -11843, 1573, 15220, 9501, -8021, -14615, -1485, 13876, 12113, -3937, -12745, -3637, 9968, 9818, -927, -6796, -1545, 5283, 4352, -1113, -1279, 3278, 4586, -1805, -5626, 505, 9473, 6836, -4760, -10592, -990, 12728, 11921, -3468, -13175, -4542, 11263, 13219, -578, -11115, -5960, 6691, 9226, 264, -6397, -1983, 3884, 1784, -2854, -273, 6154, 4424, -6388, -9924]
1268i924J1727J2609o597j9248n753J7576J7297n916k2165q868J5541J8887k045
1281A3121j8729r507R506J3475J032j0290o290L616N168N5k313J583J202l999
1295b370m064K410Q144L310p468j0209J118J2005Q310p292j3332l388J1469J1440
1309A0083k274j3333o669P770J1184J56r028m873L660O051J49m657o35L375J338
1324B297m637k981N053O262j721q525m743P069J0779Lj1401q308N986J2198K902
1339A0233r714r806K753J0701M553o272p432J303O153J393m135j315M199K408
1353E022n922o095N877J1422k35j4934r169J0697J7671N14j9102j2895J1524K0769
1367A5144L78j8320j1807R800J5909M8j3170o134P573P469m148o918L245O971
$$ y = [-9924, 1803, 14412, 7815, -11433, -17186, 390, 17687, 11771, -10394, -19262, -3721, 15166, 13121, -5608, -15115, -5609, 7866, 8898, -1392, -7682, -4066, 1102, 1157, -1156, 427, 1629, -2370, -6434, -4024, 4120, 7430, -38, -10247, -9129, 2876, 11186, 3894, -9438, -12826, -1357, 10083, 7809, -5524, -12193, -4423, 6761, 6917, -2111, -6984, -3324, 2727, 2876, -1781, -2416, 959, 2297, -2340, -5321, -268, 5994, 4273, -4252, -8995, -1926, 8853, 8856, -2545, -10853, -4867, 7331, 10233, 519, -9287, -6534, 4167, 8720, 2448, -4984, -3681, 2472, 3865, -270, -1585, 2614, 5022, -900, -6995, -1118, 10304, 10069, -4865, -14034, -3337, 14334, 14848, -4254, -17149, -5625, 15144, 15522, -2798, -14605, -4805, 11104, 11152, -2018, -8152, -579, 6890, 2742, -4176, -931, 6040]
1381F040j811r513k312J0255R054o030j4424j957J2924J0355n541j4209l954R658
1395a465J0378j789r291n539M196P009N87l575l096J072J098k80j55K389J574
1410C113l117n736l40P888O250m103j1100m286R477J2294j522j4163q508Q091
1424e762J3892K331j1163j0633L001J1867M320o668p174M40M952K716j331j960
1438a172K47K28j881p95L501M452j825p371m237O569J0181J81j1622q823O212
1453f155J4129L328j1964j0785M695J2874L931j0266q270N015Q446p13p526r31
1467d192P488K777p518o705N882J2044r98j3641p047J0410J4054k097j4861p763
1481a2167R332J3559p65j2018o463O102Q084l44n385j809K350J790j893j246K883
$$ y = [6040, 4229, -5284, -7596, 2659, 11713, 5683, -8741, -10698, 2226, 12581, 7040, -7169, -11123, -1465, 8913, 7124, -2167, -7706, -3510, 3499, 4086, 511, -2585, -1513, -415, -695, -850, 1539, 3113, -4, -5740, -6080, 1808, 8058, 3955, -7145, -11431, -1954, 10340, 8818, -5345, -13853, -5762, 8130, 10461, -702, -11335, -8334, 3533, 7853, 1185, -5989, -5549, -597, 2119, 788, -1172, -925, -697, -2578, -3373, 128, 4580, 2755, -4616, -8853, -2284, 7897, 8078, -3544, -12367, -6155, 7974, 11302, -662, -11447, -6752, 6122, 10053, -213, -8483, -3468, 4978, 4265, -3261, -4192, 3296, 6073, -1445, -8150, -2268, 9776, 8778, -4863, -11910, -1500, 12554, 10457, -4404, -12167, -2835, 10724, 9959, -2059, -8522, -2420, 5664, 5320, -65, -1874, 476, 2266, 373, -873, 2010]
1496B010K946k968o098n25O890N913k738r679m433P547J0837n75j1358p921N822
1511d330J1786L036r564r214K497J0088L386o421n797J877M901k11l167l6M131
1526B962k71n719k907O419P045k259j0800m940Q036J1248k48j2099p837O080J1861
1541F571K459q949q886J860R111L880m715n988M92M095J367k233n76K328M72m145
1557b857k491L904P227n15r846o224P123J1894P28j2535r198O384J3838J993j0410
1572i85r100L928J0470K030o856m842K930M438r89l166J037L946r59n397j931
1587e446N752O789k428r407m285P499R961p69j0544o487N146J0693K663q094q232
1602g189J791Q741L674m766n987N11M816J701l081j188K791J444l895l754M052
$$ y = [2010, 4956, 1988, -4110, -4635, 2255, 8168, 5430, -4249, -8682, -1135, 9702, 9127, -2231, -10152, -4330, 7456, 10492, 928, -8286, -5789, 4299, 7685, 1264, -4533, -2656, 2245, 2034, -1133, -1169, 2962, 2691, -3028, -5935, 484, 7529, 5270, -5530, -10470, -2434, 8814, 8566, -3533, -11370, -5290, 6571, 9030, 81, -8805, -6945, 2166, 6046, 1331, -4657, -4165, -70, 1297, -936, -1512, 816, 1288, -2857, -5348, -1444, 5783, 5268, -4578, -10802, -3679, 8215, 8943, -3592, -12790, -6406, 7432, 9425, -985, -10085, -6157, 4313, 6343, -513, -5355, -2425, 2013, 1024, -2142, -1105, 2841, 1882, -3515, -5446, 306, 7095, 4667, -4740, -9025, -1526, 8435, 7666, -2878, -9365, -4219, 6474, 9137, 1043, -7189, -5398, 3343, 7017, 2251, -3736, -3225, 1591, 3292, 211, -977, 1814, 3258, -637, -4391, -339]
1617c39O787r4q754o106O460J1004K50j1327p537N833J1528K229r554p761L333
1632d048R252J372o422l495K469L482j119l052J048L603L30n420l445N246O768
1647F569l42q900n432M952R561K604r346r115L440J1054L961p451q691P65Q039
1662A668M293l986n644M76L790J94k274O74K825n45m972k746N282P662j200j0322
1678d825n848P713J0792J76j1280q005N665J1273K533q677p966K183Q100L119
1692D953l892n167L00L681J213j833m01J448K29l104j312L148M782l24p032m831
1708h142N180R303J213r318p610M208R893L757p600q395K271Q440L061n381n046
1723d166K097M664k49m165j56M617J117n279m019M252P559o2q458n484N030R580
$$ y = [-339, 6448, 6354, -2400, -8506, -2046, 8958, 9208, -2119, -9656, -3823, 7705, 9934, 380, -7381, -4048, 5204, 6576, 154, -3341, -872, 2610, 1491, -1561, -513, 3090, 3420, -2000, -5445, -199, 6569, 6227, -2673, -8105, -3153, 6408, 9012, -334, -9449, -6009, 5045, 9006, 1555, -7136, -6371, 1668, 5961, 1975, -3669, -3193, 597, 791, -1483, -809, 2016, 1471, -3501, -6247, -965, 6697, 5497, -4825, -10673, -2960, 7832, 8008, -3272, -11277, -5612, 5661, 8194, -483, -8449, -6266, 1834, 4953, 1061, -4106, -3806, -125, 1088, -745, -1146, 302, 531, -2573, -3885, -737, 4045, 3721, -3311, -8142, -2962, 6341, 7554, -1764, -9374, -5166, 4727, 8484, 884, -7511, -5240, 3200, 6261, 880, -4166, -2069, 2595, 2346, -1819, -1975, 2642, 3759, -1520, -5539, -1287, 6272, 6210, -2248, -7732, -2702, 6878]
1739F878J724r088p366L521Q725L883o541o584K67O542L460l011l658j57K508
1754A103M2j023N32K113l5m298l014L993O944k63p864o117M944J0056K160r411
1770a38q707L352J1247L890p896q546J298P959L571m277m582M54L156M00j851
1785f70K57K590n90m158j912M326N663j055p545m547M891Q683J021q034o980K746
1801e314R066L379o154p895J247P365L595m136m934K41L637J500k586j390K958
1816E79J337l291m121L080O414J449p480o441M005R717K447q543p991L315R379
1831C855L109o593o982J668O698K756m066l223P17L006n90j880P09K740j05l690
1847a871k755L399O205K32p219n023M076Q240K358p304p702K043Q861M178n182
$$ y = [6878, 8602, -486, -7852, -4331, 4394, 8277, 1736, -4848, -4581, 1961, 5421, 2410, -1248, -1405, 1103, 1145, 122, 654, 2767, 2732, -1566, -4580, -587, 6357, 6094, -1770, -7887, -2943, 7113, 9273, -138, -8845, -5493, 5754, 9644, 1748, -6798, -5500, 2459, 6030, 1753, -2829, -2375, 781, 1181, -670, -413, 2177, 1587, -2571, -4483, -157, 5506, 4451, -3094, -7641, -2750, 5933, 6954, -1080, -8060, -5314, 3752, 7131, 977, -6918, -5671, 1694, 5289, 1153, -3781, -3540, 97, 1597, -989, -2379, 579, 1916, -1375, -5496, -2416, 3998, 5447, -2033, -8474, -4469, 5248, 7695, -848, -8839, -5524, 3855, 6964, 371, -6611, -4943, 1755, 4511, 445, -2778, -2061, 945, 355, -1525, -816, 1924, 1819, -1871, -4626, -1227, 4978, 5210, -2009, -7032, -2956, 5284, 7642, 338, -7364, -5321, 3540, 7718, 2536]
1862B536p670O8O532M159l213m930P77L279M7k091r1L051Q05l832l460K850P201
1879F018M06p418o287M599Q762J922p344p558K081Q794L940n254p405K74O053
1894A583L230k287l706q73K313R18j128K53J986l12l814j930L469N176n07n824
1910a453n184L399Q630J974p221p726J989R140M129n921p440p3O838L585k904
1925A762m668j16K806J507j474j129J642J075k880k322J779N249L83n524m566
1940f476K465P592K384o071p118J339Q202L629n125o280L16O018L478l427m630
1955c704P31L744J99k703n39L345J292k978m221K008O236K030o303o106K430Q351
1971C812L124o081p919J527P930M296m335o731K13M786L032k030l204O62J780
$$ y = [2536, -5134, -5066, 1466, 5625, 2412, -2518, -1741, 1538, 1585, -506, -597, 2454, 3259, -573, -4033, -1183, 6018, 6424, -994, -7281, -2682, 6080, 8002, 658, -6900, -4819, 3975, 7915, 2661, -4744, -4470, 1583, 4813, 2526, -1180, -2053, 260, 1178, 50, 303, 2289, 1977, -1837, -3767, -298, 4878, 4371, -1453, -6637, -3238, 5392, 7366, 145, -7581, -5592, 3548, 7677, 1756, -5684, -5757, 1081, 4666, 1762, -2906, -3022, -216, 1291, -183, -1312, 330, 1405, -1475, -3797, -2018, 3231, 3614, -1910, -6476, -4011, 3581, 5965, -106, -7224, -5885, 2317, 5946, 821, -5459, -5143, 875, 4353, 926, -3704, -2973, 771, 970, -1733, -2272, 1073, 2365, -613, -4834, -2826, 3410, 5440, -863, -6969, -4539, 3812, 6936, 855, -7064, -5537, 2393, 6689, 2354, -4377, -4164, 622, 3654, 1624, -1580, -918, 862]
1986H62o03j641R62L478j63m484l212L522O552K67o842n774M090Q747K099p008
2002H52p365J915P848L967m674o343q8M826L597k077k803n57J247N71k01N83P77
2019B075q67k662q44K747L540p0m660m350K561O615K160n208o086N05O356M728
2035F540l445o559j433N160M502k029m873j034L326J923j862k028J780K231j693
2050E06l876K89N543K514m617o574J353P706L912n885p270L98P678M494m500o356
2066d685j62N193K915k416l268L88K225J67k818R21K728J034l589l869K392O330
2082C486J560o052n952K321P638L489n545p444O08P364M742m050o464p63N339
2097B77L108j679l163j92J573K14j215P28K264p0l603k445L270N172L5n753m193
$$ y = [862, 259, -1382, -420, 3058, 2895, -1589, -4801, -1279, 5273, 5540, -1302, -7076, -2986, 5761, 7860, 852, -6513, -4598, 3250, 7217, 2543, -3800, -3888, 938, 4535, 2458, -345, -902, 345, 916, 715, 1298, 2075, 1208, -1454, -2298, 449, 3989, 3919, -741, -5091, -2530, 4085, 6245, 1037, -5049, -4544, 1812, 6540, 3095, -3464, -4897, 263, 4765, 2736, -2137, -3171, 155, 2078, 216, -1812, -32, 2199, 506, -3370, -3081, 2462, 4976, 359, -6215, -4862, 2844, 6756, 871, -6399, -6001, 1677, 6171, 1671, -4685, -4847, 346, 3261, 845, -2423, -2035, 190, 357, -2461, -1540, 1188, 2222, -1367, -5236, -2844, 3486, 5046, -1006, -6958, -4637, 3001, 6490, 945, -6499, -5891, 1473, 6215, 2165, -4299, -5062, 277, 3385, 1706, -1457, -1649, -76, 138, -1077, -349, 1915, 1845, -1758, -4203, -933, 4239, 4274, -1479, -5672]
2114e672L014O981J478n237n619R73N738L890k939n084j197L882L524p02l193
2129a63j806J711J312M7j068M69J035q11k615K81M167K335l879m803J10O298M171
2146F791l872p343r03O815N115l151o455j223M911L776k475l474j81L135l04k064
2162i02m09L402J017l341l826K302N315J320n063n272J776O946K828m607o391
2177d905K2N815M122k581n650j093L875L184j018l117r47K057N34j045m73J735
2193E15J142k173l130R33M897K493n011n582J103P221L597n568o000O8O533L862
2209D900l023n402p94L999K588j340k326lR94K55j041P69J394L72k784k193K094
2226a541M215O54l812l883O62N651L332l471o142p70N680M780k105n716k408M132
$$ y = [-5672, -2658, 4323, 5801, 564, -5055, -4082, 1656, 5546, 2607, -2477, -3674, 208, 3732, 3030, -163, -1969, -258, 1054, 1101, 33, 502, 1537, 726, -1889, -1608, 2559, 4894, 1015, -3788, -3678, 2620, 6791, 2919, -4424, -5327, 1488, 6603, 3452, -3003, -4226, 685, 4461, 1986, -1488, -1669, 1466, 1162, -902, -1311, 2091, 3108, -233, -4059, -1757, 3558, 4878, -185, -5457, -3681, 3265, 6093, 1486, -4905, -4883, 932, 5054, 2473, -3177, -4270, -395, 2789, 1771, -1346, -2293, -236, 298, -747, -1220, 515, 1657, -516, -3646, -2713, 2184, 4677, -334, -5916, -4813, 2408, 6005, 437, -5563, -5495, 1038, 4900, 1877, -3525, -4319, -320, 2268, 928, -1398, -1401, -407, -152, -1193, -424, 970, 1342, -1442, -3635, -1541, 2674, 3328, -484, -4367, -3705, 1946, 5278, 1807, -4335, -5105, 575, 5355, 3250, -2466, -4874, -742]
2242g42M340j064l809j078K335J719j557r86J445J806j988l323P38N458J963m546
2258G11n623J295O739L398m822o298N88N980L649l209m904k36L390K744j487k601
2274f86k49K030k88r96m2J751O52j981k283P39L567J963l225m593M1N159M044
2291E603l112n506j886N120M707j852n066j777L150L133o98k910k89J737L11j954
2307a289n1K224J470k766l567J674M841K013m404n269J076N996L286l693n835
2322d294n39M622M332j580m910j967K832L662m90k444j422R63J033k22j38Q12
2338B50N24j523k054O83L731J715l290m693N15N724L613l552o325n99N831M274
2354D824k559n129j290L772L345j432l291j06K446J33j494p5J827J192j835l308
$$ y = [-742, 3598, 2534, -1275, -2353, -18, 1701, 144, -842, 603, 2409, 421, -2902, -2164, 3294, 5257, 711, -4912, -3617, 3122, 6520, 1698, -4600, -4012, 1968, 5617, 2408, -2496, -2732, 658, 3402, 1915, -686, -935, 1095, 807, -189, -231, 1520, 2172, 191, -2092, -1353, 2214, 4177, 952, -3641, -3600, 1559, 5603, 2491, -3015, -4901, 219, 4926, 3074, -1992, -3769, -619, 2514, 1816, -1094, -1383, 354, 665, -1289, -1340, 884, 2354, -412, -3979, -2305, 2536, 4549, 145, -5124, -4048, 1948, 5234, 1541, -4294, -4833, -211, 4121, 2541, -2369, -4336, -1504, 2158, 1668, -776, -2198, -1235, -202, -424, -562, 250, 774, -749, -2803, -2120, 1611, 3326, 36, -4657, -4142, 1582, 5195, 1643, -4682, -5281, 550, 4824, 2265, -2864, -4154, -382, 2963, 1531, -1760, -1866, 580, 713, -781, -856, 971, 2163, 328, -2980]
2370b980J052L877J877l102m369P69M477L094k728m777p43L954L522j200l776
2385a053j494K277K431k61k208l61P62R11j270j18J753J261k003l394N06M368
2401B107L089l443n070o23N748L966l167n659j320M550M300j186m877j515K707
2416c93L065n07k349r64J032P17m55l95J205J117k548k331J047M030J539l458
2432C52m497L40N083L739l029n617j202M797L833j140m589j785K674L343o64l001
2448a363l65J478N78r53m22J468J053j926k472N44L869K010l487l848L76M292
2464H32K786k106m938q78L816L446j258l899r32K317K123k16j689o96O53Q33j060
2481h66o1J398J001j491k603K96L354K357k370m634j66M573L430j766m949j794
$$ y = [-2980, -1928, 1949, 3826, 724, -3645, -2876, 1601, 4695, 1967, -2810, -3553, 401, 3923, 2723, -1053, -2547, -270, 2161, 1900, -308, -669, 93, 1004, -266, -384, 1369, 2630, 627, -2767, -2261, 2107, 5196, 1753, -3317, -3940, 1808, 5774, 2607, -3052, -4372, 178, 4478, 3292, -1585, -3100, -393, 2672, 2165, -184, -1148, -116, 601, 146, -249, 956, 2073, -475, -2806, -1759, 2271, 3810, 352, -4145, -3805, 1278, 5017, 1988, -3629, -4831, -34, 3799, 2659, -1930, -3715, -1041, 2302, 1638, -1363, -1728, -250, 328, -625, -1047, 421, 1474, -452, -2924, -2380, 1489, 3499, 12, -3836, -3460, 832, 3618, 1512, -3426, -4304, -488, 2958, 1700, -2199, -3131, -814, 1309, 1093, -596, -1292, -639, 194, -866, -927, 471, 1472, -19, -2622, -2326, 1028, 3385, 1015, -3619, -3785, 788, 4218, 2452, -2497, -4291]
2497d291L645M571j108l875k376K744K927l85j747j205J324Q30j326m71J737J232
2513B226j773k637K45L780K042k244m845l8M777L376k129n411q69L679M034q09
2529C404m564j621K676K353k02k053n58Q28L76m92o91J633J240j814k672J4M135
2546A992J756k541m307m27M379L498j678n468j162L696M062j094m172j812K457
2561h21K710j91k075r40J315L58o67m78J377O55j359k368K37L183K314k442l959
2578c151n54M016L135j390m683j632M048L262r17l821j538J837K689p39j446r78
2594a862J391L57m27o15J129J650j552k315M6L106K147k121m225k04L830K802
2610C137j097m539j276L225L300o72l161j851J708K621k91j405l28O53R9m81k34
$$ y = [-4291, -646, 3925, 2817, -1058, -3434, -690, 2237, 1852, 105, -1100, 224, 1054, -272, -743, 994, 2226, 453, -2184, -1939, 1841, 3883, 1639, -3206, -3244, 1533, 4909, 2780, -2631, -3500, 179, 4213, 3404, -1160, -2781, -105, 2248, 2046, -7, -565, 263, 639, 147, -544, 1089, 2329, 515, -2157, -2143, 1992, 3748, 1207, -3100, -3527, 852, 4350, 2672, -2796, -3958, -262, 3800, 2706, -1466, -3278, -821, 1889, 1698, -377, -1317, -2, 356, -311, -789, 588, 1243, -116, -2484, -2247, 936, 3250, 808, -3151, -3705, 311, 3446, 2056, -2627, -4259, -211, 3051, 2134, -1687, -3225, -1388, 1301, 562, -884, -1862, -471, -114, -541, -1156, -27, 1623, 71, -2244, -2198, 908, 3055, 934, -3291, -3495, 335, 3137, 2040, -2499, -3775, -550, 2750, 2078, -1083, -2934, -1226, 1395, 1104, -301, -629, 24, 123, -358, -592]
2627e92J249P40r84k349j67K915K598j457m490q17L750L838j187m639j917K709
2643h00M029q1l485k480J747L106J55j934j182Q98O53m44k66P28J078r53k217
2660a448k63L352K501k340m630n9L919L134j601m936j191L803L220q09l786j559
2676b693K531K231n86j870o38J500N62j260o19J304J060j051k528Q1K836J793
2692B653j405l581o90L515K623j272l704j422K777K713j39l403j151J534J574
2707F22j49j399j26M78N82p15o34K044N73j422k089L5K723K201j720l483j300
2724c779K960L856q57l928j858K229L574L72l272k173J085K681O52j770p93L66
2740f55O17k27n17J036Q58o57k670m1K968K316j862l626j044L435L603q19m687
$$ y = [-592, 657, 1397, 413, -1936, -2103, 812, 3410, 1953, -2537, -3354, 396, 4234, 3047, -1592, -3509, -800, 3229, 3148, -337, -2817, -1070, 2036, 2191, 257, -925, -27, 626, 182, -84, 644, 1722, 769, -1448, -1711, 1641, 4142, 1802, -2828, -2887, 1032, 4166, 2565, -2371, -3562, 241, 3461, 2652, -1134, -2693, -162, 2069, 1483, -387, -1025, 475, 1037, -223, -842, 462, 1522, 471, -2057, -1976, 860, 2653, 1248, -2333, -3023, 492, 3115, 1843, -1861, -3283, -506, 2207, 2068, -1335, -2486, -952, 622, 473, -926, -1052, -574, 8, -707, -1341, 703, 1276, -146, -2235, -2200, 523, 2724, 1004, -2479, -3779, -819, 3037, 2180, -1748, -3606, -1377, 2197, 2569, -703, -2876, -1791, 890, 1542, -228, -1021, -655, -38, -265, -782, 254, 1112, 455, -2215, -2256, 712, 3028, 1166, -2460, -3504, -69, 3534, 2715, -1972]
2757a972j581K958L613k47l576j917J838K677Mk205o07J353O28p33r35J102J399
2774A799p82k528k16K792K450j959l520p88L382L046j319l745j640K860L119l56
2790B595l108j494J710K138k73j450k75N98J82q58l73J733O91j122k187j25K541
2807I23J695j330l008j153K893L087p35l835j470J851L047K71k424k164J131K174
2823I53J41j116j008Q32M59n76p66R43J377p37k286o69K682K172r87l440j591
2840c617K922L227k0l600k747K186L622K61k837j827R77J869P77j489r61O20R31
2857B94q98j50Q02J078p61k221m23K623J973r32l553j122K792L316p12l555k045
2874c494K509K760N03k799j601J150K091K50j447q45Q83N88o01p11J123J004q01
$$ y = [-1972, -3553, -595, 3018, 2771, -805, -2722, -884, 1793, 1797, -408, -1015, 338, 966, 233, -702, 400, 1799, 1017, -1511, -1727, 1065, 3515, 1556, -1964, -2752, 630, 3676, 2357, -1388, -3028, -168, 2951, 2595, -513, -2007, -297, 1841, 1568, 118, -157, 441, 623, -235, -608, 1125, 1816, 694, -1493, -1618, 923, 2618, 1288, -1720, -2873, 20, 3107, 2372, -1463, -2933, -1082, 1965, 2236, -188, -2352, -1221, 953, 1094, -22, -1030, -198, 261, -315, -1081, -138, 1239, 502, -1784, -2453, 229, 2401, 1414, -2026, -3617, -695, 2532, 2512, -1088, -3835, -1649, 1973, 2234, -603, -2430, -1453, 416, 1193, -296, -1257, -637, 294, -604, -754, 48, 1126, 365, -1856, -2279, 344, 2317, 1385, -2168, -3290, -498, 2818, 2106, -1449, -3494, -985, 1775, 2278, -521, -2122, -972, 1119, 1369, -78, -923, -40, 548, -53, -764, 359, 1363, 562]
2891E62k081N4K298J991j279l361p60K848K824q53l073j627J510L334R7k383j249
2908a148L52J860N53r46r92M78L70k18m83R13O18l87k053k13J895J983n56l120
2926a094j602K356L142k22l351j794J883K853L59k059k280J175J764L4j099n83
2942e18O53K68p63o07J014J396q22k035p63K153K091n06l235j403K544K760Q8
2959B315k784k497J645K954N27k361j812M43J819N86r30n67L33K90m00q5N53J316
2977A345j068k191l32K352K128r02l478j000K507L156o55k957k363K090K793J21
2993A546k055j938J053K319J28j053n66m9P14o14n8P28J096q41j553o51K136J471
3011A813o44k658j051J695K835Q2k357j640P76K574P73j922j992J040J815r5j172
$$ y = [562, -1519, -1465, 833, 2824, 1545, -1816, -2576, 272, 3096, 2243, -830, -2457, -947, 2387, 2484, 101, -1148, -796, 1064, 1617, 671, -321, 157, 527, 309, -174, 739, 1357, 970, -1083, -1296, 599, 2582, 2026, -1094, -2696, -340, 2802, 2580, -771, -2565, -682, 2171, 2530, 471, -1809, -634, 1130, 1164, 65, -518, 135, 403, -360, -967, 47, 1443, 621, -1414, -2177, -24, 2067, 1561, -1674, -3077, -533, 2227, 2315, -469, -2966, -1321, 1633, 2160, -201, -2013, -1570, 249, 835, -95, -662, -329, -39, -439, -524, 29, 1345, 277, -1914, -2246, 106, 2234, 1332, -2146, -3146, -639, 2517, 1862, -1095, -3458, -1368, 1425, 1546, -509, -2447, -1394, 925, 1053, 0, -566, -615, 99, -515, -573, 155, 1251, 410, -1143, -1794, 342, 1813, 1169, -1489, -2540, -845, 1990, 2072, -285, -1925, -1149, 1425, 2198, 276, -1716, -676, 1139, 1044, -128]
3028a28l13P64K56m00n94O01J188k26k018r49K213K003l60k845j687J655L240
3045B400K78l056j950J608K469M55j584j792J80J637L84o14n06J94J33l70m94
3062f28J154P92m28j725r37K021K146r09k503j559J766L166J35k931k355J525
3078a270K840J022k280k319P89K011J97j236n91O11K95j97o02O18J219n83j883
3095a359l97J707J500L8k921j225J826K552n5k515j892J339K448N81j747j639
3111a759M92J707L63q42p84K62M80m19k65L66J292l30j895q28J622K125R2k473
3129g94j722J408K807O12k803j868R16K489J071j870j601N56J345L08j043l0M76
3146B57J48n61m00J111P86k13j915r69J795J934j72k709j291J349K817O03k549
$$ y = [-128, -441, 323, 579, 179, -415, 186, 1374, 1148, -870, -1819, 394, 2397, 2037, -808, -2495, -840, 2400, 2678, -378, -2328, -720, 1749, 2204, 620, -1172, -992, 645, 1029, 415, -91, 103, 236, -134, -628, 526, 1318, 890, -835, -1772, 249, 2395, 1486, -1017, -2576, -810, 2356, 2491, -440, -2795, -1270, 1570, 2592, 312, -2007, -1218, 793, 990, -246, -837, -226, 69, -128, -730, -112, 1107, 524, -1359, -1756, -49, 1451, 1489, -1432, -2657, -831, 1721, 1666, -849, -2741, -1402, 1046, 1627, -120, -1759, -1267, 440, 803, -39, -823, -561, -81, -500, -765, -399, 893, 563, -1332, -2160, -538, 1587, 1679, -794, -2516, -1108, 1699, 2311, -492, -2360, -1444, 1045, 2116, 246, -1355, -799, 546, 854, -189, -219, 257, 405, -156, -556, 555, 1341, 1128, -787, -1756, 39, 1973, 1801, -908, -2199, -850, 1967, 2570, 21]
3163B1k235J103K387Q07j563j574J74J415O89n05q23M33L31n24m34P22O85k34
3181H75j758n03J456K228l16k575j524J369K562N18k633j572Q84K375P87k061
3197A12j252K53J387O0m51l35j5L01l20j27N78P81l76j641m09J312J607Kk056
3216e89j403R06K668M53k250j674N46K076Q12j263j975K98J429N67o82p30N16
3233b95J89o0l73J47J083J03j882q43J305J965j09j987j570J134K355P16k284
3250d06j915R69K139P50j324j553L12J054Q36j074m43N81M03q74m12J097R53m22
3268F71j524r94J457K297m30j914j884J604K707L04k396j942P97K407O90j476
3284C74j208j2R86O37l83l83J17L08n09k66N68J201n64j741m09J120J992J63k271
$$ y = [21, -2214, -1111, 1276, 2083, 520, -1054, -880, 535, 1224, 719, -104, 329, 660, 136, -298, 424, 1109, 875, -883, -1386, 70, 2298, 1982, -593, -2117, -748, 1814, 2332, -301, -1873, -989, 1386, 2173, 112, -1140, -887, 500, 560, 109, -226, -241, 60, -260, -387, 191, 972, 596, -1045, -1454, -142, 1465, 1467, -589, -1992, -1086, 1582, 2035, -215, -1889, -1343, 733, 1545, 282, -1693, -1395, 34, 601, -81, -811, -295, -106, -166, -539, -392, 691, 794, -1088, -1931, -626, 1339, 1230, -757, -2327, -1193, 1162, 1878, -406, -2321, -1352, 787, 1537, 213, -1340, -1028, 26, 862, -212, -655, -74, 329, -545, -957, 140, 1093, 671, -853, -1847, -390, 1907, 1477, -437, -2321, -717, 1990, 2294, -102, -2044, -1247, 1160, 1850, 374, -834, -846, 140, 777, 394, 11, 128, 436, -73, -339, 229, 1430, 866, -875, -1284, -164, 1828, 1991, -280]
3303b80j269Q77K413L33j665j773K78K157Q74j256j611j82J434O29k73p59q7M82
3321C22j44n61N89Q76K7j563j009R99K002R3k075j525R12K545L98j738j939M52
3339a339J934P03r65j516J41J456M76q55q75N54J41j61o26L77J296L5j436j577
3357b237J551K112k19j841j401Q13J956J036j874j883L03J931J009j315j164J84
3373a039Q28Q16o03o24O02J10o39n45O98J180l8j632p26Q44K079J00k133j601
3391b323J528K224M15j939j528M31J733J311j316j752K96J188M85l37l30j00L47
3408C33m27k53N45P00l27q98n34N33J890n0j957j232J317J546Q49j693j935M85
3426a108J756J328j274j313k05J423J27m3o74j22M88o18p6J94J135k19r95j080
$$ y = [-280, -1549, -672, 1741, 2074, 409, -1364, -1086, 1071, 1945, 689, -922, -1104, 330, 959, 686, -73, -160, 322, 178, -383, 206, 1082, 1109, -454, -1463, -464, 1538, 1631, -444, -1969, -1057, 1488, 1886, 148, -1791, -1339, 595, 1298, 333, -1183, -1042, 414, 890, 35, -840, -286, -145, -306, -932, -555, 741, 776, -660, -2237, -686, 1426, 1207, -634, -2035, -1222, 734, 1770, -104, -1987, -1684, 247, 1256, -59, -1223, -1039, -211, 605, 2, -622, -20, 90, -549, -1094, -396, 784, 746, -886, -1612, -768, 1311, 1411, -722, -2323, -795, 1429, 1844, -95, -1623, -1192, 541, 1852, 536, -1216, -920, 268, 753, 416, 86, -14, 333, -94, -347, 198, 898, 571, -327, -861, -328, 1562, 1512, -445, -1677, -360, 1186, 2035, 342, -1593, -1108, 648, 1976, 702, -611, -816, 607, 734, 691, 17, -105, 383, -235, -311, -117, 1018, 799, -196, -1276]
3444a276J015J516J93j463j282K53K190N71j239j582l46K232Q18j243j212j80
3460a035J100N97l22r28L44N16k89q73O45Q77J99j212j291J013J721M00j542j965
3478b045Q41J934O58j234j743J5J713R81j054j217M6J068L69m84j92K46K63p33
3496e68j72O81N58j30j039r79Q04J725J39j453j695Q69K258M85j382j631J05J709
3514B84J061j002j330m3J079O14m05m50l8L33m10j47O2J271l22o59j301J253J154
3533A004J26j136j331M78J779P47j135j812K20J267J071o78j319m4Q84R52p27
3550C46k38L7J99k86K8j17P50K67j059o72N69J776l9j176j770L37K107Q53j046
3569H66k002M34J156Q93n29j519K52P50O05q55o05M80M80n00j55J78J033K69j361
$$ y = [-1276, -261, 1255, 1448, -15, -1297, -1044, 1146, 1717, 478, -1104, -1450, 782, 1600, 357, -855, -1035, 65, 662, 340, -588, -244, 272, -17, -890, -245, 632, 831, -381, -1672, -659, 1062, 1462, -80, -2045, -1204, 730, 1388, 154, -1589, -1574, 139, 1120, 66, -1151, -1105, -37, 332, -152, -344, -98, 165, -568, -740, -59, 499, 369, -670, -1649, -845, 880, 1019, -434, -2129, -1260, 998, 1483, 101, -1530, -1425, 284, 1345, 343, -987, -1030, 49, 663, 258, -192, -230, 103, -307, -454, -392, 879, 557, -102, -1403, -150, 1004, 1130, -6, -1337, -859, 920, 1667, 532, -1280, -1060, 207, 1278, 600, -719, -763, 121, 1073, 346, 108, 145, 344, 58, 86, -31, 719, 986, -73, -745, -176, 1600, 1561, 385, -1385, -1048, 1059, 1912, 866, -1136, -702, 454, 1347, 818, -701, -449, 301, 906, 51, -554, -74, 406, -94, -249, -71, 962, 1231, -130]
3588a30j015N39J604N37j127k059P89J354J005j502j071l90J526J043n19j091
3604e07m09J135m6J9k52J68J12l19n48K45R49J94j168r79O84J142O44j656r52
3623a544K73J835P22j354j152K1Q09J127k56j185l19N77O11k12l39L81K6l35l91
3642g05K40Q74l8o85r99O98J340N20j443j185J86J696J021o61k238L99J156J083
3660A259o34j239m62J402M24l67n17Q6P74m95n29L75Q81L6j285r13M55J747P75
3679A773j163j760K04J960O23q64j386k63J145R52n94q68k29P56K21N5k18m6M8
3698C46l87l22K28J048k14o97p41N19J285L99j141j424J76J453J286j144j303
3715f33n04J125J052l87p68o24O46L73J32l92j9r9Mn11N22P59k01q97q45L07J655
$$ y = [-130, -1145, -606, 998, 1535, 408, -1651, -862, 492, 1497, -5, -1076, -1466, 60, 1103, 584, -507, -916, 219, 173, 192, -60, 108, 220, -99, -647, -402, 547, 741, -427, -1406, -722, 420, 1064, -592, -1544, -1271, 564, 1286, -68, -1220, -1199, -390, 737, 481, -704, -1023, -446, 165, -47, -386, -5, 21, -314, -705, -465, 409, 371, -314, -1313, -615, 725, 1245, -198, -1383, -1197, 499, 1520, 859, -1379, -980, 176, 1259, 625, -614, -1076, 326, 750, 383, -134, -48, 726, 231, -298, 77, 958, 994, -291, -1204, -749, 998, 1773, 610, -1150, -946, 1014, 1637, 773, -613, -876, 269, 1221, 627, -241, -470, 286, 507, 562, 344, 298, 346, -41, -363, -135, 913, 699, 2, -739, -220, 1065, 1464, 323, -1101, -925, 528, 1814, 670, -633, -1137, -12, 1040, 653, -115, -739, -93, 280, 412, 20, 1, -98, -94, -605, -83, 676, 475, -422, -1267, -960, 695]
3736F95N29j370j183k4J750N62o35r58o41J208P97p8j239l87O33M08r7p80O91
3755a19K75l13m37K70N22M38r99o25K8J618J96r05j317J81J515R11j036j564L8
3774a323J449P46m75q36m54O07N84j74k18j6k2K47n22M2P96P2l90j176P85J043
3794G65K53q09r75j09J551N74l02j370o46J188Q72K6q66m64K44O65l20n6L4J89
3814D44l70l62P8J022K09p09j265M30J149O29n05j812K03J303J031r31j139l99
3832i94J161J007j92j138m78P74J63%l12o6K40l25k15K08P17Km24j213L35J451
3852G01M11p13j442j66J589Q62q19j308o53J341J022l10j313QN08N19k73O2l44
3871c18L45k73m78N04M65L37r38q69M48J106M41r06q08J9O65J231p06j077k34
$$ y = [695, 1224, -146, -1329, -1353, 397, 959, 324, -634, -1275, -67, 730, 652, -587, -974, -341, 67, -30, -810, -119, 156, -157, -594, -324, 198, 636, -363, -988, -960, 658, 854, -51, -1368, -1187, 328, 1239, 203, -1361, -1323, 126, 872, 397, -439, -893, -286, 298, 124, -94, -110, -132, 115, -407, -365, 431, 503, 113, -1063, -278, 765, 1018, 209, -766, -875, 676, 1250, 948, -422, -1068, 120, 992, 1018, 152, -312, -68, 597, 277, 221, 255, 444, 74, -288, -210, 812, 1021, 312, -953, -523, 626, 1255, 750, -1062, -859, 444, 1475, 544, -595, -994, 167, 1174, 982, -156, -634, 140, 303, 303, -9, -75, 165, -160, -375, -167, 550, 552, 128, -1085, -750, 701, 1112, 399, -1043, -1209, 380, 1242, 423, -885, -1538, -197, 825, 515, -798, -790, -282, 237, -36, 26, -318, 27, -246, -724, -220, 245, 582, -356, -1225, -777, 329, 770, -136, -944, -925, -260, 971, 265, -812, -1046]
3890a046Q71Q66l58p32m27M43K22l5L6J79R7m60l41M27P87J50o63j012Q4J368
3910D56P96q62j453r7J348R89m89r83n57O15J182l12o44n45K31O45o0l53L85j95
3930I7J36o00K67L75N66p65o14Q8J387L48o54j419r4J171J134k98j546k64P81
3949I6Q35n1o94p46O63M30j80j40n7J35Qp48K07P81M65r39p52J06J323L63q75
3970B30j037j29J322P68m73j080m54Q88N95k51o83k69L40M57k21O0l09M81k59
3989b4l62J31N47L26n68r86J24J017N26p14q08l43P80J099n20q45p90J027O74
4008B91j67l29m90N7N33K5k69K79K78n80J7j49O90M63q86p28Q6J029Q68p25r73
4029f80n18J090J039o79o46n47L35R87K87p81l48J63N85l79K15l22K98j44l23
$$ y = [-1046, -175, 691, 333, -399, -826, -383, -161, -196, -160, 19, 116, -344, -685, -258, 529, 679, 16, -996, -912, 456, 1252, 390, -1063, -1160, 188, 1177, 688, -295, -852, -237, 945, 633, -11, -556, -325, 320, 260, -93, 292, 97, 233, -367, -100, 275, 841, 76, -538, -450, 937, 1285, 631, -788, -882, 289, 1423, 1125, -421, -685, 96, 931, 880, 186, -560, 103, 533, 353, 213, 156, 291, 299, -449, -242, 539, 1004, 65, -687, -581, 742, 1105, 230, -807, -936, 386, 1154, 681, -399, -853, 35, 630, 379, -304, -573, -233, 224, 3, 63, -246, 235, -24, -386, -255, 292, 618, 50, -936, -812, 205, 731, 17, -791, -1134, -354, 745, 225, -620, -1410, -383, 291, 124, -205, -695, -638, -105, -80, -349, -70, 208, -372, -355, -504, 186, 649, -237, -965, -879, 150, 1018, 293, -680, -1198, -108, 931, 252, -394, -941, -606, 381, 668, -113, -461, -298, 287, -92, 123, -199, 99, -45, -368]
4048c68N28N1M77n48j046M09R15M90k51j332pP95Q84l12j197k17O64Q38K23j010
4068a4l98L56O19j57k66J97K63l52m61J33P29R0l64q51j64J186Q01q88q78l53
4088g72J161O83o90q02j45P54R40m16q24K1j82M91J43j41j59J83n1o06J15Q58
4108E61Mn94n28n8Q87L46n2r51q45J157O77r7j116p7M78N17J1p35P5N68j67J3
4130G4l68L20j35j11k82r8P48J73j19q27j52N78Q77l89j080n57J007J063k85r86
4150e49q92J026Q37J74p80l15k82O28L11j7j76J87n6l13R8J46M21n56n74j0M67
4171b25J171m15j123j53P51P83k19q43m49P55P55j33o86m24O43j79J80j26L14
4190C77j36N2m46J65N66J31j77r82K7P48O62o36o12k62O32P06n5m32n53M00M59
$$ y = [-368, 160, 211, 688, 140, -906, -497, 418, 908, 657, -675, -682, 113, 997, 685, -512, -729, -65, 773, 996, -14, -412, -56, 563, 406, 140, 337, 600, 248, -213, -80, 649, 739, 375, -476, -640, 546, 1347, 459, -419, -772, 389, 1072, 382, -420, -565, 189, 1129, 713, -111, -90, -272, 219, 362, 221, 62, 245, 194, -412, -297, 561, 565, -29, -557, -615, 272, 618, 566, -385, -1230, -73, 604, 507, -609, -686, -208, 309, 320, -415, -340, 228, 61, 74, -294, 26, -109, -220, -502, -600, 148, 321, 202, -625, -777, -199, 678, 289, -791, -1348, -341, 722, 437, -549, -1441, -415, 422, 596, -184, -499, -781, -153, 158, 141, -35, 152, 96, -217, -119, 27, 448, -108, -682, -692, -225, 946, 531, -592, -745, 6, 789, 570, -273, -722, 33, 788, 655, -31, -455, 188, 9, 189, 63, 377, 241, 293, -153, 12, 578, 709, 532, -450, -423, 325, 987, 351, -261, -523, 109, 815, 760, 328, -225, 175, 634]
4211F34N4l62l63J05L37l15j67N56k22n1l29l55M73Q30o02n00j13L59Q49j58r72
4232c12k48M05Q00j84p50m39M46N53L48n83m85L3R13m04j11J50k21R8j70r4J72
4253h3M16l45m15l41P15Q53p58q99k05J091M68j70q86n96L28J096L8n09m10J89
4273d23K70K93q6kj60j33m37L23J96N42l52n15lL05J036k81j334n4R15M74k84
4294B90o78l48N96L84J9k97l01K21K38P2k05M3K67k83l59o5R56J27l05j031L7
4315f22Q03Q01n28q10k17K42Q04j13m79k94L74N74k5k97n95J80P15l46RK36J84
4336E96n48j99m2M79K25k28m08o7L09L30K19j094m89Q78P46L4q76n06M25Q16Q0
4357F80o61j21O1K38J48o55M03J14j11k80R6L86pM5q52k22O42P19j9p94o25L32
$$ y = [634, 688, 326, -37, 68, 405, 90, -77, 479, 257, 206, -123, -478, -5, 825, 223, -277, -390, -31, 818, 660, -312, -560, -155, 645, 461, -289, -728, -282, 271, 619, 36, -449, -416, 497, 93, -18, 132, -89, 9, -161, -255, -83, 333, -12, -427, -768, -53, 800, 42, -857, -1062, 29, 497, 327, -559, -1155, -827, 269, 307, -202, -612, -423, -153, 140, 54, 52, -108, -241, -678, -355, -159, 383, 31, -484, -487, -182, 854, 573, -761, -815, 100, 574, 290, -388, -736, -140, 244, 263, -34, -335, -114, 124, 196, -9, 34, 301, 18, -341, -406, 550, 677, 372, -659, -622, 181, 982, 454, -356, -573, -331, 473, 360, -119, -413, -39, 535, 510, 213, -382, -202, 513, 167, 176, 412, 596, 48, -151, -193, 286, 511, 283, -125, -192, 117, 447, 666, -428, -917, -39, 707, 741, -135, -641, -216, 600, 680, 19, -102, -41, 197, 345, -310, 93, 207, 96, -184, -88, 298, 291, 336, -516, -738, -96, 623, 604, -190, -815, -483]
4379d83P73K07o09n68J94R15j05k86k23k56L50Q9j6j58K15N4l78J25K17K62m06
4400h7n94L03K39O73k70q70p7N87O06k08o03l37L16N00L29n78l16J71J72J17l51
4421b78l7M17J19l99k6M26J6k99k18N3J8N84J63q68m80M18J052j43n27o72M99
4442a82J39N07l03k91P3O5l5P3k38M34j4Lm15L81N05j96q30l7M63L19J61o32n08
4465e58K74R18Mn69k19j29O29L82p48j64N6J59M11k22K6k38L43n84K52J97R6K01
4487E17r61o0N00L56q1p07l72P82J44M05p89r0l5O05K59n52l38J30L23j43M9N1
4509gK79n39Q9J3J64J85K2j94r12O29L80l6l44l32Q5P18K76n58l88J45K81N9q6
4532g1k20J98J11O1k81J68rJ32k84J33j07N58m34n27L8J97R15j84p09k10J29P39
$$ y = [-483, 290, 497, -112, -680, -486, 429, 324, 38, -185, -441, -91, -2, -18, -176, 39, 93, -285, -160, 57, 319, -87, -681, -378, -139, 534, 264, -606, -683, -96, 510, 302, -301, -638, -322, 178, 507, -71, -387, -216, -44, 73, -278, -315, 102, 221, -178, -204, 222, 238, -61, -279, -226, -208, 376, 539, -329, -809, -391, 661, 518, -9, -681, -182, -43, 464, 161, -130, -57, 8, -27, 46, -192, 242, 228, 231, -184, 197, 702, 506, -324, -361, 102, 421, 582, -50, -558, -284, 634, 638, 69, -150, -279, 350, 732, -16, -180, -124, 35, 446, 224, 250, 12, 355, -229, 23, 220, 316, 517, -444, -504, -4, 352, 271, -436, -808, -26, 118, 523, -266, -356, -391, 214, 473, -79, -417, -287, 36, -107, -58, -7, 272, -267, -178, -165, -1, 184, 206, 12, -900, -271, 109, 73, -271, -603, -518, 200, 476, -82, -470, -325, -44, 15, -71, -291, -93, 18, 79, -202, -34, -43, 89, -195, -62, -169, 389, -45, -572, -534, -337, 578, 394, -315, -525, -396, 343]
4554C43L70r28m79M15N92N1l71j25K5L2M6p0n9N36n4n53q9N83L05k58o04k37P36
4577B07M57m43l33m68L79P34r6q6o27L99R1M34k86m33K12N4K81m03K16p0j88j7
4599A4oL89J07j17m55k95N55L73n1o81l51N16L22K33n73k82m90P54K62m6k51J83
4621A10j37K09j74j43J83J2q2r3k19N72J57p49j05K87M74l38k26k10J1N77K04
4642C20l80o28K02M81J76Op40J71M82j25k09J80J12j03l00R1M3N47k23n90J42
4663c45J84K83L05n61j31l75J207q9n17q34L70N46K7q9l46K14K6K91k26K81k21
$$ y = [343, 713, -215, -694, -279, 313, 364, -7, -132, -107, -75, -29, -99, -158, 378, 324, -229, -318, 265, 570, 312, -292, -529, 207, 664, 221, -112, -580, -201, 533, 437, 351, -276, 123, 214, 648, 362, -71, 141, 195, 476, 73, 289, 219, 31, 14, 8, 397, 504, 387, -68, -363, 192, 565, 514, -167, -518, -2, 320, 553, -20, -302, -792, -38, 224, 178, -73, 110, -27, 182, 8, -135, 48, 60, -22, -115, -334, 238, 395, -354, -459, -172, 302, -36, -262, -472, -461, 116, 320, -60, -688, -486, -5, 171, 177, -563, -392, 90, -35, -244, -64, 48, -55, -355, -264, -221, 326, 103, -487, -345, -161, 122, 427, -134, -265, -640, 567, 478, -39, -873, -503, 43, 70, -19, -365, -151, -125, 166, -60, 221, 0]
$$ [...]
8191E3
##END NTUPLES=NMR FID
##END=
