##TITLE=1H_Pr 82-M
 200.13MHz, CDCl3,
 8 sc
 
 11.3.2025
##JCAMPDX= 6.0         $$ Bruker NMR JCAMP-DX V2.0
##DATA TYPE= NMR FID
##DATA CLASS= NTUPLES
##ORIGIN= UXNMR, Bruker Analytische Messtechnik GmbH
##OWNER= pz
$$ XWIN-NMR		Version 3.5
$$ Tue Mar 11 14:03:18 2025 Russian Standard Time (UT+4h)  she@DPX200
##.OBSERVE FREQUENCY= 200.1313
##.OBSERVE NUCLEUS= ^1H
##.DELAY= (6, 6)
##.ACQUISITION MODE= SIMULTANEOUS
##.ACQUISITION SCHEME= undefined
##.AVERAGES= 8
##.DIGITISER RES= 18
##SPECTROMETER/DATA SYSTEM= spect
##.PULSE SEQUENCE= zg30
##.SOLVENT NAME= CDCl3
##.SHIFT REFERENCE= (INTERNAL, CDCl3, 0, 14.3821)
##AUDIT TRAIL= $$ (NUMBER, WHEN, WHO, WHERE, WHAT)
$$ ##TITLE= Audit trail, XWIN-NMR		Version 3.5
$$ ##JCAMPDX= 5.01
$$ ##ORIGIN= Bruker BioSpin GmbH
$$ ##OWNER= she
$$ F:/spectra/data/she/nmr/H-C/1/audita.txt
$$ ##AUDIT TRAIL=  $$ (NUMBER, WHEN, WHO, WHERE, WHAT)
(   1,<2025-03-11 14:01:46.56 +0400>,<she>,<DPX200>,
      <created by zg, POWCHK disabled, PULCHK disabled
       configuration hash MD5:
       00 E9 B6 7A A2 85 ED C7 34 08 36 98 17 FE 4E 26
       data hash MD5: 16K
       2D 07 A8 1D 9A 6A 1D EF 77 49 82 E0 69 06 7C 15>)
$$ ##END=
$$ 
$$ hash MD5
$$ 89 1F 4F E4 7D 65 DE DA E9 61 D7 28 95 DB 11 95
##$RELAX= 
##$RELAX= 
##$RELAX= 
##$RELAX= 
##$RELAX= 
##$RELAX= 
$$ Bruker specific parameters
$$ --------------------------
##$DU= <F:/spectra>
##$EXPNO= 1
##$NAME= <H-C>
##$PROCNO= 1
##$TYPE= <nmr>
##$USER= <she>
##$AMP= (0..31)
100 100 100 100 100 100 100 100 100 100 100 100 100 100 100 100 100 100 
100 100 100 100 100 100 100 100 100 100 100 100 100 100 
##$AQSEQ= 0
##$AQ_mod= 1
##$AUNM= <au_zg>
##$AUTOPOS= <>
##$BF1= 200.13
##$BF2= 200.13
##$BF3= 200.13
##$BF4= 200.13
##$BF5= 200.13
##$BF6= 200.13
##$BF7= 200.13
##$BF8= 200.13
##$BYTORDA= 1
##$CFDGTYP= 0
##$CFRGTYP= 5
##$CHEMSTR= <none>
##$CNST= (0..31)
1 1 145 1 1 1 1 1 1 1 1 1 1 1 1 1 1 1 1 1 1 1 1 1 1 1 1 1 1 1 1 1 
##$CPDPRG= <>
##$CPDPRG1= <>
##$CPDPRG2= <>
##$CPDPRG3= <>
##$CPDPRG4= <mlev>
##$CPDPRG5= <mlev>
##$CPDPRG6= <mlev>
##$CPDPRG7= <mlev>
##$CPDPRG8= <mlev>
##$CPDPRGB= <>
##$CPDPRGT= <>
##$D= (0..31)
0 0.7 0 0 0 0 0 0 0 0 0 0.03 0 0 0 0 0 0 0 0 0 0 0 0 0 0 0 0 0 0 0 0 
##$DATE= 1741687305
##$DBL= (0..7)
120 120 120 120 120 120 120 120 
##$DBP= (0..7)
150 150 150 150 150 150 150 150 
##$DBP07= 0
##$DBPNAM0= <>
##$DBPNAM1= <>
##$DBPNAM2= <>
##$DBPNAM3= <>
##$DBPNAM4= <>
##$DBPNAM5= <>
##$DBPNAM6= <>
##$DBPNAM7= <>
##$DBPOAL= (0..7)
0.5 0.5 0.5 0.5 0.5 0.5 0.5 0.5 
##$DBPOFFS= (0..7)
0 0 0 0 0 0 0 0 
##$DE= 6
##$DECBNUC= <off>
##$DECIM= 32
##$DECNUC= <off>
##$DECSTAT= 4
##$DIGMOD= 1
##$DIGTYP= 9
##$DL= (0..7)
0 120 120 120 120 120 120 120 
##$DP= (0..7)
150 150 150 150 150 150 150 150 
##$DP07= 0
##$DPNAME0= <>
##$DPNAME1= <>
##$DPNAME2= <>
##$DPNAME3= <>
##$DPNAME4= <>
##$DPNAME5= <>
##$DPNAME6= <>
##$DPNAME7= <>
##$DPOAL= (0..7)
0.5 0.5 0.5 0.5 0.5 0.5 0.5 0.5 
##$DPOFFS= (0..7)
0 0 0 0 0 0 0 0 
##$DQDMODE= 0
##$DR= 18
##$DS= 0
##$DSLIST= <SSSSSSSSSSSSSSS>
$$ [...]
##$SUBNAM0= <"">
##$SUBNAM1= <"">
##$SUBNAM2= <"">
##$SUBNAM3= <"">
##$SUBNAM4= <"">
##$SUBNAM5= <"">
##$SUBNAM6= <"">
##$SUBNAM7= <"">
##$SUBNAM8= <"">
##$SUBNAM9= <"">
##$SW= 18.0517328524113
##$SWIBOX= (0..15)
0 0 2 0 0 0 0 0 0 0 0 0 0 0 0 0 
##$SW_h= 3612.71676300578
##$TD= 16384
##$TD0= 1
##$TE= 0
##$TE2= 300
##$TE3= 300
##$TEG= 300
##$TL= (0..7)
0 120 120 120 120 120 120 120 
##$TP= (0..7)
150 150 150 150 150 150 150 150 
##$TP07= 0
##$TPNAME0= <>
##$TPNAME1= <>
##$TPNAME2= <>
##$TPNAME3= <>
##$TPNAME4= <>
##$TPNAME5= <>
##$TPNAME6= <>
##$TPNAME7= <>
##$TPOAL= (0..7)
0.5 0.5 0.5 0.5 0.5 0.5 0.5 0.5 
##$TPOFFS= (0..7)
0 0 0 0 0 0 0 0 
##$TUNHIN= 0
##$TUNHOUT= 0
##$TUNXOUT= 0
##$USERA1= <user>
##$USERA2= <user>
##$USERA3= <user>
##$USERA4= <user>
##$USERA5= <user>
##$V9= 5
##$VALIST= <valist>
##$VCLIST= <CCCCCCCCCCCCCCC>
##$VD= 0
##$VDLIST= <DDDDDDDDDDDDDDD>
##$VPLIST= <PPPPPPPPPPPPPPP>
##$VTLIST= <TTTTTTTTTTTTTTT>
##$WBST= 1024
##$WBSW= 4
##$XGAIN= (0..3)
0 0 0 0 
##$XL= 0
##$YL= 0
##$YMAX_a= 240920
##$YMIN_a= -326310
##$ZGOPTNS= <>
##$ZL1= 120
##$ZL2= 120
##$ZL3= 120
##$ZL4= 120
##$ABSF1= 10
##$ABSF2= 0
##$ABSG= 5
##$ABSL= 3
##$ALPHA= 0
##$AQORDER= 0
##$ASSFAC= 0
##$ASSFACI= 0
##$ASSFACX= 0
##$ASSWID= 0
##$AUNMP= <proc_1d>
##$AZFE= 0.1
##$AZFW= 0.1
##$BCFW= 1
##$BC_mod= 2
##$BYTORDP= 1
##$COROFFS= 0
##$CY= -3
##$DATMOD= 1
##$DC= 2
##$DFILT= <>
##$DTYPP= 0
##$F1P= 0
##$F2P= 0
##$FCOR= 0.5
##$FTSIZE= 0
##$FT_mod= 4
##$GAMMA= 1
##$GB= 0.15
##$INTBC= 1
##$INTSCL= 1
##$ISEN= 128
##$LB= 0.25
##$LEV0= 0
##$LPBIN= 0
##$MAXI= 10000
##$MC2= 0
##$MEAN= 0
##$ME_mod= 0
##$MI= 1.114404
##$NCOEF= 0
##$NC_proc= 0
##$NLEV= 6
##$NOISF1= 3.799351
##$NOISF2= 2.8
##$NSP= 1
##$NTH_PI= 0
##$NZP= 0
##$OFFSET= 14.38212
##$PC= 1
##$PHC0= -471.4417
##$PHC1= 16.19222
##$PH_mod= 1
##$PKNL= yes
##$PPARMOD= 0
##$PSCAL= 0
##$PSIGN= 0
##$REVERSE= no
##$SF= 200.129724274929
##$SI= 16384
##$SIGF1= 3
##$SIGF2= 2
##$SINO= 400
##$SIOLD= 16384
##$SREGLST= <1H.CDCl3>
##$SSB= 0
##$STSI= 0
##$STSR= 0
##$SW_p= 3205.1282051282
##$SYMM= 0
##$S_DEV= 0
##$TDeff= 0
##$TDoff= 0
##$TI= <>
##$TILT= no
##$TM1= 0
##$TM2= 0
##$TOPLEV= 0
##$USERP1= <user>
##$USERP2= <user>
##$USERP3= <user>
##$USERP4= <user>
##$USERP5= <user>
##$WDW= 1
##$XDIM= 8192
##$YMAX_p= 0
##$YMIN_p= 0
$$ End of Bruker specific parameters
$$ ---------------------------------
##NTUPLES= NMR FID
##VAR_NAME=  TIME,          FID/REAL,        FID/IMAG
##SYMBOL=    X,             R,               I
##VAR_TYPE=  INDEPENDENT,   DEPENDENT,       DEPENDENT
##VAR_FORM=  AFFN,          ASDF,            ASDF
##VAR_DIM=   8192,          8192,            8192
##UNITS=     SECONDS,       ARBITRARY UNITS, ARBITRARY UNITS
##FACTOR=    0.0002768,     1,               1
##FIRST=     0,             0,               0
##LAST=      2.2672688,     0,               0
##MIN=       0,             -326310,         0
##MAX=       2.2672688,     240920,          0
$$ Real data points
##PAGE= N=1
##DATA TABLE= (X++(R..R)), XYDATA
0 0 0 0 0 0 0 0 0 0 0 0 0 0 0 0 0 -6 8 -8 8 -8 8 -9 16 -16 16 -22 24 -28 32 -36 40 -45 52 -60 68 -75 83 -91
38 -91 101 -113 127 -139 154 -169 188 -207 229 -251 277 -305 335 -371 409 -453 501 -558 623 -699
58 -699 790 -901 1037 -1209 1440 -1754 2215 -2941 4224 -6923 14829 -83852 -326310 18225
72 18225 214682 -24308 -8534 219366 88216 -72658 96637 132057 -86810 -87936 35306
83 35306 -49939 -100813 15785 -25858 -141268 -24755 79320 -32656 -37973 97238 54439
94 54439 -53256 6524 35505 -44824 -11210 61270 660 -1546 91678 20731 -96022 -7569
106 -7569 51624 -53105 -20553 103179 -60 -106300 38969 84970 -88692 -70411 86527
117 86527 3541 -101295 25269 43863 -113402 -59780 95213 11326 -63357 79186 104785
128 104785 -32390 -2038 82996 -16897 -57452 69501 58105 -68337 -39269 17504 -57881
139 -57881 -70061 5953 -23378 -53579 40820 47524 -58840 -23065 74888 17576 -26417 64879
151 64879 67472 -23993 8869 62013 -22051 -58408 15751 -1040 -56582 8140 31408 -61787
163 -61787 -46625 48247 1222 -54020 43174 73245 -34790 -34704 44066 -8197 -60015 18829
175 18829 38335 -32680 -1937 54820 -12354 -42900 36729 32813 -38818 -1110 49002 -5943
187 -5943 -23626 26761 349 -45067 1099 19158 -36999 -22677 26452 -22983 -58926 12777
199 12777 37544 -16830 4332 60247 25905 -11850 20371 18613 -17809 5808 25814 -19346
211 -19346 -28445 11338 -5674 -38303 -6895 6854 -29719 -15553 28707 7213 -21462 7270
223 7270 14988 -8729 10499 31911 1171 -5757 24532 4475 -30729 -3228 16117 -16508 -13874
236 -13874 21928 -203 -31881 347 19947 -11475 -8598 22932 3193 -23096 3740 17546
248 17546 -13260 -19267 5256 8660 3943 13821 7449 -6429 3204 7974 -8706 -6828 12114 4948
262 4948 -9974 -1436 3305 -7195 -5409 3149 -1333 -3170 595 -12051 -18166 4248 13867 -4702
276 -4702 -3262 19940 16569 -1269 4160 8076 -8783 -14904 -859 2593 -3460 -182 2236 -3534
290 -3534 -2780 2574 -1809 -6835 71 6230 720 -7872 -5777 8491 15633 6286 241 9547 9300
305 9300 -8691 -14671 -71 629 -14083 -12283 3907 7686 328 -2604 -2197 -1698 291 654 249
320 249 5023 8274 4159 563 2363 4061 5432 4939 -1557 -6841 -6100 -9902 -14698 -6225 2420 -5058
336 -5058 -7581 6826 11206 193 1508 11015 5193 -796 7604 8511 -570 2126 5958 -5464 -10344
351 -10344 -1454 -2025 -8862 -1463 3759 -7599 -12081 -2487 854 1197 7685 4219 -4222 3705 12072
366 12072 2574 -3133 3882 1539 -3871 2898 2720 -8261 -1701 8859 -4030 -11297 8738 12487
380 12487 -9001 -8820 7600 -1703 -17019 -6875 3991 -116 -43 1659 -4154 776 10671 1888
394 1888 -3988 11382 12902 -4252 592 16102 5363 -7339 2088 2330 -12148 -9554 -3378 -15129
408 -15129 -14564 -93 -7060 -16075 6978 22467 3077 -903 18406 13281 -4184 4545 12986 -485
422 -485 -4980 1433 -5693 -7866 4080 -2917 -18990 -5980 7137 -6960 -11633 5110 5375 -3765
436 -3765 6699 10199 -3055 1926 14638 682 -9747 4273 814 -15460 -1012 15896 -1720
449 -1720 -10012 10285 7880 -8989 4324 14351 -8523 -13915 7274 1537 -15397 -1829 5725
462 5725 -13779 -12297 8106 1237 -8665 7084 10519 -3631 4384 16138 2491 1465 19598
475 19598 9085 -12437 -465 8118 -13285 -16229 872 -8538 -19839 -1234 3501 -13915 -1767
488 -1767 18892 1257 -9247 15766 18309 -4926 1830 16834 -1006 -11644 5013 4112 -7559
501 -7559 3209 2897 -18436 -10116 13282 -2260 -18221 4320 12258 -10196 -4841 15083 134
514 134 -11379 7884 6570 -12093 749 13058 -8043 -9625 15485 6505 -12603 8586 21032
527 21032 -5771 -7994 14336 1336 -19537 -2826 5152 -12460 -7070 5577 -13254 -16550 11939
540 11939 9964 -14316 137 19541 2399 -2167 17830 9475 -7243 9767 14800 -10652 -7468
553 -7468 11725 -7819 -25026 -2348 1194 -22049 -8728 16100 -2977 -14370 12277 14313 -7799
566 -7799 4804 20370 -2415 -7728 17543 8102 -17135 -1144 14639 -6207 -10425 7054 -3104
579 -3104 -14303 5218 6308 -16913 -6417 14550 -2031 -9740 13929 8212 -16667 -1673 15576
592 15576 -6671 -12022 13054 5988 -13605 3513 14331 -6407 -2463 18409 163 -17488 7317
605 7317 12929 -16342 -13816 8969 -2472 -13176 4934 4244 -12794 2000 14890 -7932 -12148
618 -12148 13891 10151 -7909 6217 13916 -7857 -5548 15394 2489 -13776 3038 5383 -16146
631 -16146 -7183 10435 -8457 -14777 12597 9918 -15094 -999 19158 -1313 -10323 9908 4740
644 4740 -12307 4447 14345 -9190 -9780 12027 1031 -14770 4729 11570 -10770 -7913 11077
657 11077 -456 -10897 6401 8221 -7173 1664 9809 -8738 -9454 11813 2253 -16868 549
670 549 13425 -6609 -8170 12923 6050 -9003 4596 8828 -8310 -2016 12939 -3598 -15228
683 -15228 4682 7520 -10291 -3086 10919 -4099 -10580 6743 4065 -10530 559 9946 -4588
696 -4588 -4289 10692 1918 -8894 6745 10210 -8735 -6204 9304 -885 -9883 3606 4339 -9956
710 -9956 -1665 9926 -3148 -7124 8530 3705 -11529 -499 10082 -3483 -6280 8332 3742
723 3742 -7404 2357 6783 -5416 -2617 8655 -2026 -10921 3025 6818 -6699 -3656 6445
736 6445 -854 -4651 5348 3161 -5665 1068 4834 -6656 -3910 9493 2053 -8827 2786 8069
750 8069 -5194 -5961 5800 1636 -6085 1836 3020 -6061 -1546 6454 -680 -4425 5112 3138 -6541
765 -6541 -486 7212 -1971 -6701 1864 3482 -2400 481 2920 -2215 -865 3371 -2889 -5554 4081
780 4081 4139 -5901 -3891 4821 86 -4634 2357 5038 -1181 -905 1982 -1398 -557 4770 963 -4541
796 -4541 563 5127 -1099 -3405 1477 -348 -5184 -2186 746 -2585 -2573 1371 170 -1626 2039 3331
812 3331 964 2260 5078 1640 -714 746 927 -1368 141 588 -2662 -3343 -698 -1070 -3470 -1603
828 -1603 109 -2423 -2164 2203 3628 751 644 3223 2800 947 1624 1992 166 -123 -453 -3188 -3489
845 -3489 693 1411 -2280 -3201 824 1073 -2321 -1982 1397 656 -1173 -341 990 1920 1915 237 -1131 1132
863 1132 3929 46 -2458 1880 3514 -1294 -2585 1523 462 -1294 646 642 -2835 -3042 -1277 -3491
879 -3491 -2412 1847 27 -4476 732 6315 2107 -1287 3626 4449 99 1163 3312 -458 -1392 926
895 926 -2361 -4550 61 855 -5427 -3460 2411 -1315 -5782 94 3616 68 1941 4806 621 -150
911 -150 5137 1840 -3603 684 3236 -3631 -4646 2604 602 -5294 -148 3093 -3124 -1239 5363
926 5363 681 -4226 1724 2416 -4619 -1630 5047 -264 -4077 1835 1620 -3779 503 4470 -1577 -1889
942 -1889 5165 1751 -2735 3281 4442 -3587 -2455 5065 -756 -6683 -595 762 -5516 -2274 2467
957 2467 -3260 -3431 6195 4377 -4399 1360 6878 -1048 -2704 6224 4074 -4419 -664 2625 -2929
972 -2929 -1551 3281 -3633 -7038 2792 3261 -6800 -3111 5538 -352 -4569 3750 4738 -2654 761
987 761 5194 -2180 -2519 4209 -19 -5225 3579 5241 -5172 -3489 6300 1086 -5275 2016 3680
1002 3680 -4680 -2999 2956 -2779 -4546 3554 1182 -6487 679 6143 -2197 -3628 5159 2575 -4035
1017 -4035 2229 6313 -885 -642 4479 -1433 -4962 2977 1720 -7204 -2883 3614 -3983 -6407 3728
1032 3728 3243 -5001 539 6396 -994 -1253 6070 1940 -4665 2763 5614 -4111 -3637 4756 0 -5041
1048 -5041 1501 1097 -6511 -1342 5581 -1949 -4766 3346 2022 -4155 2170 6110 -2635 -2768 5366
1063 5366 1251 -4849 1457 3599 -4092 -1115 4592 -1953 -5087 4616 3124 -6537 -1776 5734 -1495
1078 -1495 -4804 2755 2230 -3978 831 3872 -3667 -1233 6201 -57 -6119 1988 4715 -4250 -2220
1093 -2220 5901 93 -4826 2336 2726 -3318 -160 3028 -3298 -3064 4860 116 -6398 2240 6135
1108 6135 -3545 -4155 5350 2190 -3801 1732 2416 -4528 -1408 4636 -1251 -4120 3143 1858 -5011
1123 -5011 557 4983 -3120 -4331 4610 2449 -4716 -61 3815 -2122 -665 4436 -1096 -4544 3197
1138 3197 3469 -5144 -2015 4168 -1626 -4766 3127 2706 -4160 345 4255 -3011 -3346 4868 1877 -4714
1154 -4714 1488 4009 -2748 -1863 4881 -219 -4062 2160 2227 -4972 -1956 3607 -2108 -4357 3263 2063
1170 2063 -4673 702 5543 -1166 -2887 3061 885 -3101 2360 3128 -3595 -1450 4836 -841 -5113
1185 -5113 2811 3381 -4450 -1964 3866 -1377 -3799 3019 2469 -2792 636 3417 -2410 -1812 4445 -48
1201 -48 -5632 996 4325 -2860 -2882 3740 1016 -3250 1629 2562 -2739 482 4231 -2026 -3592 3422
1217 3422 1372 -4811 -207 4062 -2056 -3970 2495 912 -3654 687 3041 -2385 -896 4086 292
1232 292 -2461 2695 2673 -3734 -1070 3817 -808 -3989 1142 1205 -3322 -800 2059 -1602 -1632 3192 657
1249 657 -3449 1229 3566 -1618 -1554 3508 542 -2628 1595 2366 -2367 -925 2280 -1726 -2628 2241
1265 2241 1922 -3177 -777 2850 -746 -2158 2060 838 -2572 150 1194 -2674 -1737 2847 56
1280 56 -2497 1898 3119 -1072 -244 3184 926 -1264 1425 723 -1735 -266 1322 -2508 -2666 1086
1296 1086 -211 -3475 -530 2139 -1094 -2037 2070 2015 -695 1632 2875 201 326 1906 -415 -1626
1312 -1626 1326 882 -3016 -1963 1082 -1045 -2954 -226 807 -1380 -229 1213 -155 106 1892
1327 1892 654 -913 1207 2178 -138 -429 1518 384 -1556 -649 387 -1159 -596 641 -626 -1208
1343 -1208 495 515 -826 -193 1217 -673 -1423 476 912 -479 -330 639 372 311 1084 896 199 603
1361 603 861 -292 -831 732 313 -1346 -1051 -161 -1157 -1264 -544 -163 -378 184 468 -83 551 1729 935
1380 935 292 866 1643 448 -323 209 362 -851 -1444 -712 -787 -922 -69 -247 -960 109 618 31 -79
1399 -79 1116 983 -646 -177 1082 691 -406 -320 186 -847 -163 298 -472 -545 483 283 -676 554 1372
1418 1372 -404 -810 925 436 -1006 -644 134 -685 -697 -104 -538 -1118 704 1312 -694 426 1775 187
1436 187 -1016 905 1336 -576 -668 749 -959 -827 897 -124 -1747 -324 719 -1244 -1220 1067 620
1453 620 -996 395 1304 58 129 1360 76 -950 946 830 -1676 -578 1684 -546 -1524 940
1469 940 854 -1365 -271 1252 -338 -1015 1129 102 -1558 951 1820 -1210 -1186 1865 533 -1696 778
1486 778 1395 -1333 -728 1251 -130 -870 1234 263 -1902 -6 1855 -764 -1491 1131 874 -1887 -296
1503 -296 1554 -613 -817 1533 125 -1224 1183 1353 -1579 -161 2348 -216 -2150 994 1440 -1578
1519 -1578 -309 1445 -950 -1429 1121 459 -1737 431 1537 -1376 -974 2258 477 -1599 821 1502
1535 1502 -1027 -675 1463 -324 -1579 856 381 -2057 -129 2021 -953 -1797 1195 941 -1687 239
1551 239 1877 -580 -663 1876 395 -1402 1033 1563 -1616 -852 1796 -780 -2515 616 1190 -1735
1567 -1735 -477 1584 -296 -1044 1574 854 -1129 511 2189 -1004 -773 2470 289 -1971 476 1511
1583 1511 -1058 -1161 971 -810 -1697 658 899 -1675 30 2086 -485 -1277 1686 907 -1740 202
1599 202 2338 -488 -1085 1282 104 -1125 878 963 -2011 -798 1851 -327 -1963 608 1195 -1634
1615 -1634 -711 1539 -725 -1104 1282 -66 -1434 411 1657 -1293 -643 1892 450 -1636 421 1700
1631 1700 -1205 -782 1123 -494 -1912 704 463 -1833 -143 1583 -805 -1213 1565 1036 -939 634
1647 634 1533 -350 -672 1444 63 -1232 392 831 -1342 -823 1045 -402 -1540 316 286 -1688 -130
1664 -130 1652 -419 -561 1419 511 -856 662 1497 -1252 -894 1465 399 -1718 240 1054 -912
1680 -912 -505 1009 -509 -730 1064 867 -1447 95 1300 -557 -1323 1411 454 -1483 -146 899
1696 899 -496 -711 1010 -74 -836 738 1024 -1184 -41 1733 -98 -1186 597 391 -1315 -458
1712 -458 719 -736 -1019 609 -45 -949 132 906 -665 -660 1307 296 -603 824 1079 -741 -180 955
1730 955 -351 -598 729 211 -1293 -86 777 -666 -1008 704 373 -788 32 822 -446 -165 670
1747 670 -208 -666 227 563 -829 -73 948 -474 -763 1060 604 -800 -22 431 -205 -578 718 -232
1765 -232 -1045 284 623 -1005 -653 465 -110 -484 328 800 -332 403 1307 191 -275 1074 382 -985
1783 -985 262 448 -963 -1162 175 16 -870 -60 477 -293 -186 566 -86 -37 603 1005 -318 294 1310
1802 1310 62 -704 549 433 -465 -485 183 -583 -531 288 64 -618 290 454 -443 -76 652 13 -446 111
1822 111 619 -278 -12 432 -24 56 330 -154 -357 87 754 -659 -599 236 32 -568 17 -231 -394 -16
1842 -16 406 -16 -203 243 203 -195 261 385 81 -155 469 401 -196 245 127 -228 13 138 -7 -573 138
1863 138 27 -422 -284 581 372 -283 323 322 163 47 442 118 16 -63 -42 -243 56 263 -170 -424 -89
1884 -89 -60 -84 90 165 -44 189 121 -152 35 124 195 -342 -37 331 92 -40 75 95 456 -123 -65 -38 -165
1907 -165 24 -297 122 176 213 -235 -184 64 53 -59 -213 -75 199 -26 -364 -111 105 270 19 150 -12
1928 -12 -71 -15 -66 -154 46 149 -110 2 210 114 -268 15 39 -157 118 -276 101 19 -65 -153 -225 169 50 -66
1952 -66 72 320 208 -270 -265 63 190 -202 -78 59 -13 190 5 -65 -53 308 -26 -262 200 198 -384 -105 130
1975 130 -315 72 312 26 -72 345 187 -266 -299 318 103 -358 -167 329 -247 154 373 83 -244 43 129
1996 129 -421 -241 345 4 -440 62 217 -223 -178 193 -124 -12 -25 -11 -181 164 250 -342 -153 323 -81
2017 -81 -192 281 206 -181 -172 327 -304 -409 233 -182 -381 378 424 -26 -377 168 52 -311 42 330 -245 -151
2039 -151 108 -109 -199 260 231 -260 -19 597 -199 -240 479 -39 -336 61 112 -83 -159 132 -12 -362 -261 -52
2061 -52 -272 84 484 225 -341 -23 218 -315 -22 422 -29 -422 368 12 -287 54 552 -237 -423 506
2081 506 191 -409 0 365 -269 -291 451 238 -251 190 114 -303 -45 591 -210 -224 147 7 -114 -93 460
2102 460 -29 -302 108 76 -463 -106 465 -473 -147 658 264 -398 -14 166 -208 -214 263 25 -115 399 179
2123 179 -390 73 537 -122 -284 316 252 -297 -229 -25 71 -242 511 -44 -291 -109 -32 -349 76 335 -82
2144 -82 -378 38 484 -374 -135 569 -270 -209 326 160 -311 -202 123 -62 61 334 30 -201 -46 245 -110
2165 -110 131 356 -108 -437 195 -41 -312 -127 158 -126 -155 88 198 -296 90 287 -255 97 119 45 -16
2186 -16 167 -57 -64 103 149 46 -169 -76 -92 -69 -116 280 289 -158 222 258 -333 74 364 5 44 146 146 -256 233
2211 233 125 -152 44 261 93 -164 -159 -2 -29 -47 136 -183 -223 292 96 -360 -355 543 -107 -159 308 53 317
2234 317 -146 36 -161 -447 73 153 -142 287 19 26 21 83 -219 -56 145 -30 -13 -254 242 -324 -223 82
2256 82 285 -52 -136 125 -37 -219 -72 -80 -54 212 303 -12 -66 253 -66 -114 -39 165 -309 -172 -46 50 -110
2279 -110 -42 -172 36 296 -233 -79 -121 36 106 -221 300 -16 70 -127 84 9 17 -18 -121 -314 -217 -97 35
2302 35 10 -58 125 68 101 -4 -297 51 181 -58 56 65 20 261 89 -89 20 60 -56 46 -111 86 239
2325 239 155 49 45 155 79 225 18 80 -65 22 92 50 -165 -100 50 27 10 90 -262 -8 -123 -33 24 -24 293
2350 293 157 -100 41 -321 97 63 60 0 63 -30 -217 362 114 -17 18 -72 43 17 -127 91 281 198 -196
2373 -196 -177 -14 178 17 -136 103 84 79 -63 -17 123 37 -5 -232 -6 175 307 42 92 148 -73 51 -48
2396 -48 -140 7 -85 -1 77 48 149 -4 -313 11 133 -103 38 184 50 103 -64 83 -167 -34 -258 -155
2418 -155 74 -61 26 36 177 -61 43 -44 292 36 100 9 -24 -266 -229 237 187 -135 -4 116 -235 -113 -11
2441 -11 379 3 41 11 54 1 60 89 80 -107 -68 172 190 -5 33 -67 -213 -76 205 36 -32 153 -39 36 148
2466 148 -189 362 210 -44 272 16 219 66 236 131 -101 -227 65 6 20 -43 -210 86 -58 175 177 -46
2488 -46 349 106 -35 198 159 190 -19 112 -77 -98 57 46 -102 -183 81 173 -175 -39 188 139 -21 -155 258
2511 258 -210 -173 7 -47 95 107 146 -28 -172 166 113 -145 -79 -48 162 118 -217 22 264 35 13 -79 -7 -12
2535 -12 20 -4 -151 34 365 151 -50 142 -12 -9 -363 -164 89 355 -91 136 87 -48 56 -14 195 -80
2557 -80 15 35 -78 -37 -88 -38 112 331 51 -336 -300 -99 23 29 -216 -250 -61 100 -76 -55 151 -73 -126 151
2581 151 228 -8 -222 48 -1 315 -190 64 180 -136 -226 85 -155 -44 188 -143 130 196 -72 18 -4 -58
2603 -58 -87 -77 75 -99 -302 -19 256 -60 -35 39 -88 159 56 -49 143 -47 -1 79 62 133 20 34 46 -40
2627 -40 90 -38 226 -60 106 -7 -8 -189 -186 219 21 -59 137 67 -72 -51 273 -16 192 394 1 114 316
2650 316 161 -271 -245 156 -149 64 238 187 -200 -78 234 24 293 239 31 -131 1 165 98 -86 -52 321
2672 321 120 247 121 -166 59 194 -70 14 63 284 -277 -138 118 -66 -119 140 280 -284 -22 24 -29 -271
2694 -271 108 84 13 160 -23 40 -84 142 134 -169 124 13 -70 -290 247 32 -52 144 86 -123 -8 26 -233
2717 -233 38 134 22 -332 64 79 -148 43 98 21 -227 -71 -17 75 116 179 22 -224 -65 139 201 305 165
2740 165 -185 -325 369 -149 -122 42 -49 6 -7 163 -148 12 143 196 -352 -90 -39 23 -277 141 -91 -315
2762 -315 -174 90 103 -306 -91 -277 -61 -40 405 0 -172 44 -286 13 229 114 -16 52 -141 147 236
2783 236 2 30 206 -15 -59 148 88 165 -139 99 -134 188 -29 16 130 57 -64 -35 94 -229 -142 -5 -152
2806 -152 -439 -47 116 -121 -112 81 -95 93 -44 -206 -253 333 16 35 33 311 -93 -82 200 -71 -284 -28
2828 -28 437 154 -52 119 85 -75 82 165 6 136 -19 185 -306 121 -2 -18 -224 60 -1 -11 120 136
2850 136 -38 -26 1 -298 -147 13 137 -19 -30 160 1 -46 30 394 -117 70 5 -82 85 -111 -232 -23
2872 -23 -27 114 -6 194 -62 -13 -39 -159 208 12 210 139 -207 -179 213 119 -7 171 -37 -271 -96 -217 219
2895 219 96 239 -3 58 -232 86 -202 -48 -149 276 180 76 -13 -4 -11 91 -71 32 150 113 -22 -31 60 -30
2919 -30 -257 74 -90 -95 -150 -294 -10 104 -28 10 -79 -17 50 -50 28 56 23 25 7 -133 254 -212 -153 17 25 65
2945 65 9 -49 -58 -13 88 -77 -93 -25 3 97 111 -110 277 -66 8 40 224 -37 -55 178 -266 106 -41 33 -76
2970 -76 -136 80 195 168 63 -125 19 450 -171 -112 35 -21 -84 36 -1 -41 -73 -158 50 -347 -366 -1 10 122
2994 122 -184 106 -1 25 -85 183 119 -15 146 -282 252 -79 -543 -143 75 -26 15 149 -38 69 -226
3015 -226 -35 86 -55 152 186 -2 -28 -104 -127 -168 -110 105 138 -483 104 178 -268 -160 1 -110 158 163 -246
3038 -246 135 -25 197 38 16 -81 -255 56 -177 -264 -109 -112 156 -309 -101 168 10 -57 46 -51 -208 396
3060 396 395 -248 -184 -34 252 -136 -193 -129 -211 2 246 -101 -203 132 -15 -169 -44 -6 -139 -122 86 175 -87
3083 -87 81 -64 -69 -152 52 56 -119 -91 -131 -367 149 200 15 -70 -31 -83 -84 -23 -144 -298 -143 74 147 -226 -61
3108 -61 81 110 94 -16 148 7 261 -73 -25 -347 5 -32 -301 182 10 -140 169 33 -73 -50 314 59
3130 59 23 -5 -120 -271 -143 166 -170 -248 -188 287 -153 21 -130 -216 -92 378 -44 -211 -80 -78 -15 119 301
3153 301 154 -214 -21 -42 -74 -27 311 165 -315 294 -251 78 80 210 48 -210 145 -198 161 325 238 79
3175 79 95 -38 -100 251 -126 107 -205 161 155 -225 -48 127 -228 -145 126 139 -222 -304 133 -175 -406 66 259
3198 259 -67 265 -113 190 -185 -8 66 -176 -156 280 -333 -57 338 2 -218 145 250 -85 -185 99 20
3219 20 -100 225 -54 106 62 -54 -250 -268 73 38 -195 -365 -6 -83 -339 199 28 -99 -207 147 -111 -14
3241 -14 12 -73 -71 454 334 -79 -36 205 -49 99 220 105 -34 211 54 27 168 77 43 -68 -38 297 188
3264 188 53 18 -71 -142 25 -182 -263 -43 10 -176 114 403 -11 -230 -249 192 -249 -183 283 95 -240 91
3286 91 52 -228 189 206 18 -192 60 139 -171 -162 51 156 11 96 28 -329 189 -123 4 -68 109 -144 -145 74
3310 74 -191 -332 -51 163 -149 -269 56 61 -327 127 106 -50 50 186 155 -89 -58 266 -142 -149 166 163 -109
3333 -109 209 -7 -94 -98 -20 -111 -51 -120 120 -87 38 154 36 -478 63 110 -272 -80 -103 -292 -414 256 -172
3356 -172 155 -18 -3 -184 -284 -21 -251 -52 284 54 -13 141 241 35 -27 -152 -98 7 -49 -53 103 -77
3378 -77 38 91 -14 -9 -248 -215 -92 43 -226 21 184 113 -56 -15 33 340 295 -99 -38 33 -20 236 -145 173
3402 173 -162 -1 -223 -79 92 -30 -232 365 57 -92 40 168 -167 -55 135 199 -6 235 0 -336
3422 -336 -71 -17 -37 -292 -88 -88 -127 -46 129 -336 -216 -180 -63 221 2 230 159 -103 28 -90 -29 -65 51
3445 51 -149 -14 32 77 217 84 -120 50 -21 12 -119 -70 -62 153 42 -180 -2 -67 -340 334 -73 34 24
3468 24 143 70 178 -30 -272 54 -126 4 -268 -114 -20 194 187 138 -117 -180 239 50 0 -140 -266 130 -113
3491 -113 -5 79 183 6 -238 51 -73 -220 -96 149 52 -68 81 216 -46 2 110 -328 14 212 262
3512 262 216 143 -125 -16 67 135 33 -154 29 -129 -266 -40 -230 -328 -375 48 -123 -52 -50 -225 135 174 -45
3535 -45 256 -274 -193 228 -10 -103 175 -4 69 157 33 -200 92 87 -240 14 192 -76 56 -35 129 -171 -199
3558 -199 121 318 -158 -70 103 -92 -161 38 103 104 175 311 78 313 127 -255 -228 300 -38 137 90 -43 -38
3581 -38 -46 -12 62 40 80 156 -159 -169 159 34 -71 43 -4 82 -208 206 -157 -88 257 328 -176 21 250 -74
3605 -74 -99 118 171 -173 168 3 9 3 138 126 -66 127 126 -56 24 128 -72 -44 404 -25 -137 167 -52 -133
3629 -133 118 49 -96 -416 142 221 -260 -48 -261 -65 44 3 -73 -227 -210 94 -108 192 41 165 51 238
3651 238 356 118 -170 -18 -8 -354 121 -118 -93 -136 -158 -268 146 137 256 -484 -10 -23 227 -309 80 264
3673 264 -42 -74 162 -174 166 25 -121 1 -110 -155 -278 121 -18 92 -165 -218 78 -32 7 195 108 81
3695 81 125 -184 129 7 67 -155 276 417 -137 22 265 63 -119 14 280 50 -205 172 10 -135 371
3716 371 63 -156 124 100 48 -262 45 93 133 221 -148 115 -36 -18 -117 62 -186 154 -95 -210 413 55
3738 55 -11 -222 -100 -31 -145 -6 -43 56 -2 -72 -65 -25 -52 3 -7 167 -10 -121 178 122 -24 -46 -160 159 -45
3763 -45 -29 86 -173 46 413 -54 -64 196 327 111 -156 84 -114 -93 221 -211 -151 -25 -117 -154 59 177
3785 177 -60 -34 -28 21 -157 369 -35 106 -195 -64 59 -250 -153 68 141 202 229 138 -39 -86 -203 171 66
3808 66 203 167 -217 -19 95 60 -195 21 97 117 -66 -140 -252 104 -84 -285 70 118 -123 -280 184 15
3830 15 -190 115 176 158 154 118 130 -267 -20 81 -7 -74 70 166 -248 66 118 -106 -65 31 -43 203 -7 295 -271
3855 -271 263 107 -56 -94 -188 99 -237 -221 198 263 -335 277 -126 -86 -35 -51 -44 84 86 -169 188 84 -77 5
3879 5 -193 48 41 55 33 100 -57 -17 86 -107 -219 182 -135 -207 -8 -125 108 -228 -65 -18 37 70 115 -146
3903 -146 30 -140 29 94 -170 -113 -171 3 -97 -138 -142 -129 293 -336 -34 91 241 76 21 -15 353 -102 38
3926 38 -116 49 -11 -122 -3 -206 72 151 330 113 -92 -266 333 43 120 91 220 -78 -84 9 52 -107 -154
3949 -154 -55 -18 262 -143 -233 -86 -5 377 -63 194 -35 -20 222 53 -199 -138 306 -123 -142 -133 189 -80 -171
3972 -171 203 -71 -134 -101 40 93 -290 -101 -158 -33 259 75 -38 -227 -22 375 -67 -361 -65 29 269 71
3994 71 142 128 -68 101 -34 104 64 -107 -104 -16 172 106 -106 82 -92 113 104 159 -32 -178 126 -35 -14 4
4018 4 64 -272 271 8 91 -79 136 -78 -121 158 -47 39 -39 -42 -137 88 -3 96 213 -314 227 -71 193 149
4042 149 212 445 26 -99 85 -398 209 -99 -57 106 11 18 5 172 -205 102 -49 -55 80 -43 91 -52 -37
4065 -37 107 106 -39 74 216 125 -189 -100 -183 -145 -150 115 4 -37 -194 357 97 -240 -72 -176 87 -68 -47 17
4089 17 -36 34 -43 -177 -22 -78 12 -103 183 159 109 250 107 274 170 29 42 -76 -159 84 -81 -249 192
4112 192 -50 -302 -14 -170 -62 -321 9 160 -47 60 124 -304 -144 -68 59 32 -88 118 -228 -108 91
4133 91 -64 -48 271 -101 -121 62 366 -42 -45 11 8 19 -64 50 -92 -131 291 -36 -50 121 173 -18 -22 166 -64
4158 -64 -157 -143 -210 -57 307 207 134 66 166 -131 57 14 105 -180 11 -103 -77 24 3 61 -32 -149 -95 -175 -118
4183 -118 95 9 -65 26 246 -98 -7 86 155 -221 -268 53 -33 235 -69 0 -90 55 -68 17 -208 -19 38 -182
4207 -182 12 261 217 119 -23 -189 -62 230 91 221 181 164 -101 8 111 109 -91 65 -114 -208 159 28
4229 28 -199 -124 59 66 80 35 205 -38 105 -116 -27 32 77 -16 62 366 -141 -6 -60 -52 -71 -13 112 74 241 88
4255 88 80 62 68 62 29 -122 115 140 -15 -97 -79 137 -116 8 363 -1 -147 50 25 -94 -22 208 -209 -165 12
4280 12 -155 48 63 31 -99 -292 -191 28 235 -117 231 55 -47 -44 -110 9 308 -72 167 83 151 -410 21
4303 21 66 84 -2 8 -31 119 64 108 -223 -13 76 123 178 40 -124 -42 4 33 286 -176 164 -98 -161 63 374
4328 374 -363 -175 -62 -2 -232 -61 152 -144 -61 41 -120 94 -8 177 -94 93 -182 -127 -273 8 25
4349 25 -161 -110 -76 68 -149 -7 25 -79 -46 105 1 -29 98 82 -70 22 39 -37 -135 -40 -150 244 -197 -124
4373 -124 255 -192 -8 24 112 143 -213 -122 40 29 45 238 -156 -92 253 -15 179 3 34 211 151 -111 223
4396 223 205 71 -94 -28 -125 -286 -70 116 -315 35 235 -159 0 162 196 -185 208 -126 -150 -28 1 -48
4418 -48 315 -232 24 -126 174 -51 -134 122 24 -123 15 92 49 -177 89 -15 186 -4 -11 -48 56 221 -81
4441 -81 -68 -70 266 -233 190 15 -27 -107 -165 39 -15 226 -1 -56 -42 185 130 59 206 25 -283 -308 169 -126
4465 -126 -205 20 68 228 -40 212 356 132 53 -64 -118 116 10 -41 -87 -184 -136 -43 34 -149 158 -55 -52 -51 -120
4490 -120 23 27 37 -249 35 42 -122 -112 -154 -152 160 -67 -180 71 199 -109 -405 -419 -148 125 109 -467 -115 -44
4514 -44 -62 26 77 7 -89 -21 -145 87 -290 -52 -19 -110 -154 -83 30 -110 35 -90 -177 74 -91 100 -10 37
4538 37 89 244 136 -87 139 91 -112 57 -228 -6 16 -17 177 -17 97 208 121 -84 -98 59 -42 -276
4560 -276 50 196 -5 -38 129 95 -174 -114 106 -40 -121 -8 -32 -120 212 -12 -70 273 -178 -142 163 -119 -58
4583 -58 30 298 111 120 11 208 -138 -39 73 209 91 -68 154 -142 160 -156 22 -242 -35 -57 -36 37 -44
4606 -44 213 -68 278 150 6 140 -2 -204 -5 -196 -96 -76 -59 91 -59 99 170 -130 -14 -91 -23 254
4628 254 -157 -92 128 170 -38 -95 151 27 -28 72 45 -220 171 191 254 113 97 -12 178 1 39 149 -126
4651 -126 22 69 -184 -4 -38 -130 -20 -139 -124 104 20 -66 -192 21 -9 -357 51 -75 138 212 72 -78 -125
4674 -125 56 386 -88 -112 0 64 -17 108 -346 -186 -52 299 92 -59 -34 43 -68 115 109 -15 -179 33
4696 33 76 52 -136 307 -152 54 289 38 -159 138 -221 -135 -21 12 135 -261 55 64 31 -110 -92 -71 -51 -26
4720 -26 10 63 -6 -64 93 162 54 41 -37 -70 115 -31 -272 -218 107 339 166 52 183 49 190 238 146 20
4744 20 -96 191 245 173 38 182 159 178 52 44 113 -197 -105 100 -155 -68 14 -128 13 -110 87 22 153 -214
4768 -214 -117 -71 139 156 -103 -72 -36 181 41 -95 -103 -86 26 -85 -68 -63 -8 214 -154 -56 -37 -81 -209 -183 93
4793 93 -57 -248 -81 -89 363 33 -102 -93 -126 -176 -63 -16 68 -280 -316 59 -143 -190 -46 51 245 292 141 -43
4817 -43 -108 158 -30 48 -43 -5 71 -87 -105 151 -208 -94 94 -31 -44 53 17 -21 -11 -41 -256 -12 -75 -58 16
4842 16 184 -100 -111 152 127 266 -66 -190 -181 52 135 201 124 -75 37 -19 -52 -104 292 78 -202 115 -106 -396
4866 -396 187 -22 -13 170 -27 -61 11 -331 171 56 -152 47 96 57 53 -85 115 -123 9 -72 70 242 95
4889 95 3 -126 249 31 -273 100 -5 -107 45 283 -171 221 -254 -171 23 202 -86 59 245 -297 -63
4910 -63 18 -82 -23 -105 -119 -19 30 9 -148 -169 333 -206 153 -290 -20 48 -101 -74 88 48 69 226 -34 239
4934 239 -99 -79 -246 49 91 -131 -161 -54 42 43 -197 -23 -80 -429 7 198 -170 -95 76 221 283 176 155
4957 155 -96 1 -21 -332 -30 -109 84 5 -109 51 31 -17 53 -95 167 -274 -112 -152 200 98 50 288 -14
4980 -14 126 110 -89 -154 320 -126 102 199 41 -135 -11 227 -97 87 -14 -141 259 -28 84 19 -90 -160
5002 -160 76 -5 137 139 207 225 115 19 2 -24 51 -54 170 48 -93 208 -48 234 64 357 68 100 132 -179
5026 -179 -178 47 -91 32 20 -253 42 48 59 -85 -40 -70 22 57 351 85 62 -127 -242 137 -147 -90 -204 -434
5050 -434 33 -63 -24 -203 -50 147 -32 -235 -81 -152 -91 -286 -8 194 130 72 -76 -263 242 134 -102 179
5072 179 -160 179 75 -374 101 147 12 -237 154 16 -205 76 -240 376 -37 121 160 -177 126 -291 -631
5093 -631 154 89 -132 125 109 2 -114 -156 92 36 -55 159 108 10 -111 252 94 -43 157 -10 206 255 -31
5116 -31 -89 -64 -59 -75 -32 157 62 179 191 63 7 -21 -182 247 165 115 -132 0 -85 -84 39 -57 31 -16 -201 54
5142 54 50 -152 165 -127 -110 145 -39 81 75 -16 -82 -142 -21 282 -132 -309 -238 123 -137 -129 74 158 -37 113
5166 113 -117 -115 -229 51 -107 226 86 94 23 -107 -138 -326 -56 -17 -95 -316 -89 148 -237 189 -64 73 13
5189 13 98 177 -87 27 -112 269 -73 188 -80 253 238 259 -37 -129 -60 225 -319 -40 -71 55 12 -167 -131
5212 -131 120 -119 -233 134 -27 122 163 12 -193 -112 -215 -124 -312 -184 -18 -10 233 -21 157 157 -42 231
5234 231 137 -38 -400 -148 -92 -85 95 -85 106 216 -195 135 21 -84 -177 18 133 -53 101 -349 199 100
5256 100 39 -86 -28 188 -180 -36 -27 224 342 -100 -92 120 124 161 148 -64 3 -183 -19 -123 -255 76 127 57
5280 57 -7 -159 7 12 -139 72 165 158 43 -42 91 79 228 -172 -8 106 -20 -91 69 20 52 -188 -20 -42
5304 -42 -16 -103 62 172 -145 94 74 6 21 94 -38 -215 -262 55 -206 -20 -30 265 -5 3 174 -212 -394 -353
5328 -353 -46 49 -93 -197 63 -405 -13 -177 -134 -261 -108 120 -82 144 -265 57 -165 -119 -104 224 64
5349 64 -236 41 182 -49 -55 105 -166 -110 -49 53 -203 -252 269 -197 42 -159 -112 301 134 38 250 72 495
5372 495 -304 -123 12 183 74 -92 6 -247 -75 9 -70 96 157 30 156 246 101 93 -91 -234 35 7 -146
5395 -146 -295 -42 -36 -151 -132 111 17 -233 -115 3 2 37 176 35 42 17 -92 -168 74 -56 -397 -61 125 -203
5419 -203 161 -28 -260 -149 -22 179 137 86 29 7 -187 -5 91 -40 -255 61 100 -214 -39 -261 -14 -104
5441 -104 -61 194 -261 -75 -4 134 -196 -93 -194 24 26 100 43 12 -192 -102 -87 -59 -46 -75 -67 -68 -15 80 192 -127
5467 -127 -158 -57 -22 -141 -93 -358 107 38 195 70 -142 -260 65 -66 130 66 -30 -3 3 -11 -162 -49 1 -164
5491 -164 -336 -116 27 -10 175 -76 30 95 164 -112 55 -82 227 6 175 146 32 151 -15 -166 7
5512 7 128 -123 160 -147 -37 22 118 127 26 309 -72 51 -8 -152 -158 128 -133 99 -72 -3 130 34 119 -31
5536 -31 120 33 40 45 50 81 205 -70 185 -154 -24 110 14 17 -204 -272 -108 -138 -3 -49 111 30 -250 -158 -76 -47
5562 -47 -121 162 -68 -72 -133 75 -118 -295 49 98 167 -88 -114 -72 -102 -135 147 60 216 -82 10 67 -154 -68 165
5587 165 53 96 -41 -13 -406 -72 -368 23 85 253 37 120 55 39 24 -171 -126 100 38 -80 -3 -374 418
5610 418 -103 80 -83 270 -181 7 -95 199 111 244 84 -371 -46 -96 -45 -118 129 18 -158 -4 -82 -33
5632 -33 197 -241 -64 -246 -296 -136 -145 7 -382 168 -151 -104 -123 202 -157 -310 74 -120 -167 -96 -48 -13 113
5655 113 45 209 -9 150 248 81 -17 9 -114 -26 -166 29 160 -130 165 162 -75 19 -277 48 153 -9 255
5678 255 -79 12 -129 65 67 44 124 268 54 -5 -112 26 43 -122 -26 -172 215 264 117 39 -99 -120 -22 49
5702 49 120 27 62 -11 19 45 176 121 -24 -143 34 -24 -171 216 -120 -53 -53 271 143 -126 180 -239 -163 -428
5726 -428 151 39 -230 -56 113 -82 243 105 16 -80 41 -187 -56 126 187 109 18 -102 -137 226 148 142 -79
5749 -79 -87 138 -38 -83 -262 214 -273 67 141 242 100 -81 -38 9 201 -28 -226 68 216 -114 -408 4
5771 4 -41 -253 211 205 -61 -277 181 94 -82 276 59 43 -212 59 49 70 46 15 -178 77 295 -395 -304 -58
5795 -58 137 -103 -76 -117 -102 0 176 -67 127 -134 8 -10 -89 -161 -108 193 167 154 93 116 77 93 133 40 103 26
5821 26 -47 421 -215 -362 196 -75 160 301 100 177 20 -117 -57 181 -19 37 -5 -285 72 19 -17 -191 113
5844 113 -20 -43 -78 28 144 349 -132 -51 -201 96 -22 -39 -170 124 124 -9 -78 -113 131 -169 -74 82 224
5867 224 -137 76 159 30 56 32 119 46 -209 -40 155 44 68 21 -404 -182 130 -2 -206 39 -11 -179 -8
5890 -8 15 70 -88 -172 -175 -76 48 -118 -7 -144 37 -68 -51 -183 85 -111 -196 48 155 -167 187 -125 -230
5913 -230 88 -3 -108 74 -59 31 -219 -403 167 69 -54 -37 40 108 -83 62 -260 -36 -188 68 -113 193
5935 193 246 -310 119 65 -188 -140 -140 44 127 171 22 100 -139 54 234 178 62 -81 99 13 155 135 -344 -91
5959 -91 146 13 -103 157 -56 -32 82 -154 89 -163 102 150 210 65 -10 -214 -165 323 -244 314 359 -5
5981 -5 275 105 137 -11 240 -192 62 -15 178 -226 114 -92 36 281 49 125 309 -186 -145 -18 29 -39 78
6004 78 -5 -88 -112 54 136 158 156 -2 190 -66 377 -128 5 210 -1 107 114 100 127 -17 133 -139 -49 30 -31
6029 -31 119 284 331 -43 167 147 -176 -113 -81 -25 -43 -190 144 13 -16 -88 -268 58 -115 26 -73 156 242 -121
6053 -121 -175 102 -388 -378 -41 -93 52 11 120 235 -245 86 -284 -109 -28 -227 -274 -4 55 64 126 -41 205
6076 205 -158 -15 -78 81 118 11 -91 -27 310 -162 -269 292 -40 -51 -49 37 181 -230 10 -225 39 196
6098 196 -87 -404 -54 287 11 125 -205 76 -373 176 296 -172 -155 7 -163 8 138 -6 -23 9 164
6119 164 -190 -40 48 -2 149 69 319 51 -10 -132 28 -53 146 37 -93 -42 140 -255 -51 -119 253 -50
6141 -50 26 200 52 189 236 -130 130 -105 -191 -147 -274 -81 31 207 -18 258 -5 -238 200 -189 42 -38
6163 -38 -176 -149 -61 46 28 -110 -164 -59 10 328 48 273 101 78 -48 -20 88 82 -96 -48 31 -88 -389 -199
6187 -199 14 144 -112 284 -74 108 206 -110 56 79 211 410 -69 -71 -36 -60 -365 115 75 -3 23 -52 -171
6210 -171 48 79 21 -18 38 -42 8 7 141 -21 102 12 -242 -124 -171 -344 -192 -115 95 -11 -238 140 108 109 36
6235 36 142 69 199 87 143 -159 309 4 -20 194 -101 -230 -153 19 -177 76 82 -114 5 118 -6 90 -208
6258 -208 216 172 -29 -165 51 -6 150 52 -228 -127 -224 244 -242 41 -95 46 -234 57 298 0 126
6279 126 210 -29 -14 -21 199 -3 -201 -12 146 -76 -115 218 176 311 256 -57 -386 53 -81 42 -318 21
6301 21 187 75 -38 -83 152 -101 94 -91 -78 -44 151 -506 39 47 -52 20 -271 -114 -278 59 100 -162 -60
6324 -60 -115 9 -2 119 4 144 -206 52 -8 8 75 130 -338 67 248 186 170 59 -79 88 71 -91 332
6347 332 -125 198 49 292 139 -75 -118 86 143 -88 187 -59 -176 -261 -152 43 -220 20 68 -117 -110 176
6369 176 -103 113 -105 -28 -206 79 271 237 -85 322 -318 231 57 190 40 -26 -145 -1 -11 -59 22 -223
6391 -223 196 -22 -140 124 40 -2 -25 183 206 137 88 188 -65 -88 -81 18 78 30 -112 -225 29 65 -47 54
6415 54 97 367 -50 -101 161 68 122 -157 135 -215 19 35 45 117 98 -41 -208 -41 -79 239 -70 -110 158 14
6439 14 42 -91 -26 169 141 52 16 259 171 -166 -225 -107 -207 56 -38 327 -4 131 59 -24 -123 -164 150 53 174
6464 174 -11 -8 186 -42 -173 144 -203 32 -128 -69 -226 -224 105 -9 -83 -96 -56 -63 -141 124 272 331 -163 -314
6488 -314 -26 -84 -64 15 107 -39 -148 -51 -20 -177 167 168 -147 70 -69 53 -160 104 -65 94 92 48 113 149
6512 149 -36 -269 -305 -143 250 97 -245 16 74 66 -63 252 181 -32 50 93 36 3 -302 1 65 -25 -43 -25
6536 -25 -13 175 112 -48 146 -187 -154 232 98 9 151 13 -226 -144 109 -182 33 42 -250 -170 93 81 16 -120
6560 -120 157 -70 -79 -11 -157 -329 -5 91 7 12 42 -162 311 194 29 -131 141 156 -130 34 -232 265 -24
6583 -24 -135 -29 121 -79 -1 111 11 -32 -10 -48 -116 -204 108 20 -94 383 234 153 143 -150 126 89 -179 26
6607 26 -15 21 -170 1 -93 -51 163 -34 67 86 124 -209 -14 50 -240 17 -170 -15 16 11 236 157 59 -49
6631 -49 -306 170 160 303 82 -155 359 91 124 -45 18 241 -213 -86 -128 -85 124 -137 -48 -32 376 153 -28
6654 -28 2 -210 -255 213 -220 174 100 128 389 170 -371 80 217 -76 188 -32 -276 63 140 34 -89 -154
6676 -154 -51 -146 -1 -107 56 244 126 -25 -137 234 18 -91 254 -169 -238 32 -76 -64 101 -282 54
6697 54 45 129 -135 89 -299 31 14 -110 -60 30 -141 -175 -271 54 58 -72 -243 281 -142 -89 86 84 145 -110 67
6722 67 15 -43 14 -27 -7 15 118 193 95 61 -151 354 -174 -32 -220 109 178 30 -133 43 -132 -138 -82 178 138
6747 138 -153 55 222 -191 21 146 111 4 103 -233 137 -5 92 332 72 88 9 -288 -251 69 -114 381
6769 381 136 40 13 -134 90 314 21 -11 206 337 143 95 70 135 -135 -27 -108 -48 18 -97 17 -63 -52 -114
6793 -114 45 -183 -64 -161 -302 105 49 136 17 -27 160 -194 91 -171 -40 40 -144 -307 -68 -89 -36 -34 -46
6816 -46 70 -266 27 54 -76 -95 207 257 30 98 186 -201 -69 85 25 -262 132 38 23 -189 -7 219 28
6839 28 -134 -42 111 -4 -234 -194 -141 -298 -27 -474 -213 -85 -107 -10 -44 253 -128 -67 -16 154 -212 126 274
6862 274 -193 276 -88 43 -121 -54 -80 -113 -9 -14 80 20 -74 179 15 36 214 -174 16 -56 71 250 231 371
6886 371 -132 92 54 -264 70 5 33 -39 45 153 -43 -134 -79 -208 -218 -9 35 -40 75 -334 28 -36 493 325
6910 325 -85 277 46 25 188 -27 -71 -70 38 247 -17 -277 -77 -66 -368 169 -159 -124 -103 5 -115 -35 51
6933 51 18 -174 111 20 -51 146 -30 57 124 -88 -87 105 65 13 89 142 -88 -142 43 177 60 -100 -21 224 -79
6958 -79 -181 -131 56 -138 -71 -61 -136 -59 29 -27 -50 -171 16 -171 1 114 -102 7 -22 20 -74 -199 -223 -214 121
6983 121 -102 100 7 -17 -49 -188 -17 -110 -99 322 265 -63 -31 -198 140 -37 105 -82 242 -132 -169 14 68
7006 68 -126 -270 45 -166 18 -103 49 113 180 -85 -137 -12 -310 -161 -195 11 163 -173 94 61 110 118 168
7029 168 208 -143 -285 38 141 -66 -99 135 327 -96 175 243 139 -138 -120 176 -19 138 -66 191 27
7050 27 11 75 26 -126 58 -54 111 243 108 122 69 -106 165 -210 -77 88 33 65 143 100 77 174 -35 -11
7074 -11 -25 -86 -208 100 192 221 38 37 30 -261 -233 52 368 141 -26 -88 242 -81 -81 -59 -49 7 55 50 73 -174 -49
7101 -49 149 14 -249 12 62 141 -174 -142 226 86 52 124 281 -29 165 215 113 -98 193 39 43 -38 42 126
7125 126 3 -156 -33 35 -153 57 160 28 238 -67 76 48 21 156 3 185 -63 180 74 -71 93
7146 93 -74 -85 53 169 187 -97 95 -23 21 -168 482 117 150 -277 32 -8 147 70 -137 68 37 -169 -89
7169 -89 19 66 -93 87 -99 -41 15 -1 34 -142 144 73 -10 -151 261 -95 75 19 34 -88 -90 -263 -114 -217
7193 -217 -75 -235 -152 172 99 -195 160 274 -99 107 -69 91 -9 55 -150 96 -17 -254 -113 20 -20
7214 -20 38 101 -170 -65 245 81 87 237 157 -76 -109 123 81 -41 30 131 -40 -54 105 -54 -9 131 -112 -70
7238 -70 62 -119 -84 -49 115 -73 339 -93 -132 -78 -22 -50 -186 67 -222 -12 123 19 -100 -107 62 -407 107
7261 107 -102 219 136 15 -131 -114 218 -55 128 -178 -21 342 35 -56 31 132 84 251 117 193 3 282
7283 282 128 -71 -6 12 332 16 -70 -5 -16 74 105 183 51 59 -57 -178 -311 -39 278 -82 17 302 -38 -158
7307 -158 -38 37 184 -124 -96 148 79 -29 134 -43 -158 -64 -82 205 161 267 -37 -200 -41 -17 34 -122 310
7330 310 -73 218 -88 92 135 -225 -154 94 41 35 -94 67 25 -251 -10 -59 55 -2 -56 -13 -153 34 302
7353 302 -170 -83 -125 -272 203 371 73 -140 84 -86 -206 -182 118 168 176 -83 106 -389 -201 -150 259 -156
7375 -156 -137 161 19 167 -179 -48 -85 -169 -8 207 96 -25 -176 159 -40 111 186 84 240 11 -97
7396 -97 -50 198 170 -138 -69 -310 -70 27 199 -36 104 -180 37 74 36 -100 -229 -55 181 -132 277 173
7418 173 143 103 -67 123 -24 -28 101 110 -2 -107 3 -114 -87 -111 -92 -240 -59 0 -98 -126 63 -174 -174 66 -90
7443 -90 -56 -186 -114 162 -103 -223 165 83 89 28 -152 -98 -136 102 19 -77 154 51 34 154 103 -234 -136 39 -13
7468 -13 -28 19 308 7 -91 -66 -81 87 -18 -109 294 -161 76 -14 -192 57 -80 -107 -33 -3 183 -133 19 -7
7492 -7 -93 94 -42 84 86 30 -20 216 235 -142 -40 -289 32 6 16 403 102 31 110 -172 -78 -35 301 301 -147
7517 -147 225 -79 -302 -90 286 -393 187 -190 -127 -112 -11 187 68 -194 41 114 168 -130 -284 14 177
7538 177 -88 63 25 97 50 152 268 68 134 -212 -446 -35 -61 -25 -137 -10 170 -71 5 -55 70 87 -49
7561 -49 -82 -12 179 -93 26 -84 -17 134 177 -69 162 -8 159 -8 -70 -1 -83 -213 97 -101 -74 79 124
7584 124 -21 212 231 9 94 -21 -240 -201 205 104 -104 91 269 -85 76 125 280 -89 134 1 78 124
7606 124 319 -249 -90 61 -21 74 -119 92 -83 -30 -18 -158 201 -235 88 96 14 134 -228 257 -139 34
7628 34 -1 160 -77 74 -71 -68 -61 151 -234 68 -189 -117 -103 -130 365 -81 227 193 -65 -79 345 -278 -130 -125
7652 -125 209 -171 -121 101 8 -29 197 120 99 -420 -7 93 -144 -218 126 58 -247 53 122 17 336 -149 -218
7675 -218 8 367 243 222 242 4 -47 64 -56 -147 258 -425 -1 89 -243 -89 -45 25 79 60 5 -6 -47 61
7699 61 -109 165 -315 -37 36 192 50 -80 114 -154 25 199 -166 -312 184 -117 -11 -260 23 162 15
7720 15 -68 89 100 -66 104 130 1 63 -31 -25 -88 -201 86 159 47 118 3 128 -22 141 -152 17 -28 298
7744 298 37 -15 66 167 -179 -111 -92 102 -187 51 124 260 -113 171 0 169 17 18 14 54 -22 38 150 -173
7768 -173 -177 -106 219 -272 -217 -243 -197 81 113 57 99 -74 230 167 -16 -56 188 -29 -105 157 39 207 185 121 -4
7793 -4 18 137 -68 -58 -84 49 6 -55 -127 -82 88 62 144 108 -15 160 -252 201 58 3 255 -165 -342 -7
7817 -7 -314 -247 143 51 -185 137 100 74 -13 35 83 -31 -100 -33 -75 -243 101 -147 -55 -40 25 42 51 371 -88 149
7843 149 125 28 -186 -267 -139 -116 -15 -101 233 85 71 76 44 277 -182 32 -100 -110 -1 106 32 -20 -15 -117 151
7868 151 -31 92 141 228 -161 118 -163 71 161 -92 17 97 -26 -1 420 -208 170 -255 -188 -55 -163 -45
7890 -45 292 -90 46 -20 -21 -287 101 -169 136 113 -195 32 -210 -38 42 356 -193 78 -180 4 15 29 -147
7913 -147 -113 58 -169 230 118 254 120 -98 -63 -63 -58 227 -36 173 20 93 348 28 -28 -77 -54 -126 47 -95
7937 -95 -104 -97 -91 -165 -126 17 212 -81 -84 128 -158 -78 -122 8 85 1 154 170 -267 -120 -58 -47 67 -175 25 180
7963 180 -344 166 -192 -133 -152 16 128 -173 163 -78 -1 162 -20 -67 -188 174 9 -289 -77 77 -13 -325
7985 -325 22 -45 115 -78 -126 -168 254 74 -28 94 114 -63 -249 -12 -209 117 -134 108 258 -93 126
8006 126 109 -301 -9 -3 200 -124 -62 -97 -208 -43 269 -155 -60 30 -8 -137 217 174 -33 -21 13 29 -51 4 111
8031 111 163 194 -185 -310 121 -41 -16 -211 -318 6 -165 206 -146 204 11 128 118 54 -233 45 -34 -134
8053 -134 29 28 -49 -142 -8 -236 -46 92 -53 -4 -188 -90 264 -193 -260 92 107 140 11 261 34 -33 184
8076 184 -2 107 222 -28 13 -155 -210 219 -1 -97 132 68 -167 -133 -32 100 -40 171 132 45 -83 94
8098 94 -45 -290 81 -72 60 -308 13 343 92 -104 48 -88 -234 -59 22 82 -1 -193 132 19 -66 -129
8120 -129 116 141 -167 -70 -116 24 71 -261 -169 -60 -215 -111 -280 -84 77 189 -189 -12 -137 -85 300 113
8142 113 -67 -38 -219 116 -45 -21 84 11 -235 228 -56 97 155 -251 16 -47 -226 77 -44 122 139 100
8164 100 36 -43 278 -102 283 17 238 -183 -68 213 -35 -60 116 76 98 90 -96 -156 223 -184 8 170 75
8187 75 51 -22 81 7
8191G
$$ Imaginary data points
##PAGE= N=2
##DATA TABLE= (X++(I..I)), XYDATA
0 0 0 0 0 0 0 0 0 0 0 0 8 -8 8 -16 16 -16 24 -32 39 -45 56 -64 73 -88 104 -120 143 -162 189 -216 247 -281
32 -281 320 -362 408 -462 519 -580 648 -724 806 -895 992 -1100 1215 -1344 1482 -1635 1802
49 1802 -1985 2187 -2410 2655 -2929 3236 -3583 3976 -4430 4956 -5577 6319 -7232 8380
63 8380 -9877 11921 -14883 19597 -28262 49518 -218276 -144457 240920 -98000 -146749 117662
75 117662 101573 -124974 46924 171943 -8005 -67209 119003 84338 -23130 31519 41137
86 41137 -73072 -15571 63722 -30370 -77367 20288 -17161 -106952 -38178 22362 -39163 7733
98 7733 91018 18191 -17945 75462 11880 -121985 -21806 90300 -27792 -50635 95526
109 95526 37220 -107450 20591 128473 -36513 -77654 93794 58054 -93752 -15461 55326
120 55326 -77633 -79739 68049 17127 -93509 1156 48601 -66869 -53303 48749 -79
131 -79 -25791 94031 91019 -30705 2930 75353 -4323 -32747 47105 7547 -65821 8764
143 8764 23102 -104728 -86624 46935 3665 -78782 18086 70181 -28444 -21116 72357 25245
155 25245 -37557 34035 57276 -11886 2227 32912 -37199 -49482 29089 6684 -50676 15968
167 15968 46177 -46101 -47303 35482 825 -46310 30019 49182 -33573 -13291 49194 -22579
179 -22579 -64628 28475 37227 -52906 -16415 63044 6342 -36276 35304 40590 -24703 6793
191 6793 52683 -4935 -31138 16602 -7445 -59624 -12805 26833 -22302 -31823 16648 3620
203 3620 -31552 -5144 13512 -566 20925 36663 267 -636 37437 14074 -23220 10091 20660
216 20660 -31125 -24056 24617 -8275 -53272 -11428 16832 -19265 -10073 32662 8230 -20505
228 -20505 14460 21231 -18973 -7035 29369 8029 -12407 12576 9920 -19944 -5215 18080
240 18080 -1107 -9684 8705 -1721 -18752 1209 9582 -12527 -10788 10032 5752 825 9696
253 9696 -4396 -22418 -1978 12151 -12078 -10618 22357 16116 -12675 168 20414 2452 -9126
266 -9126 7782 8747 -9394 -12076 -7524 -9146 -1623 7096 -983 -5487 4965 6163 -4182 -4862 -2051
281 -2051 -4958 -117 8964 9305 8475 11120 2787 -6700 1131 5018 -10015 -14073 1443 3267 -11783
296 -11783 -12214 1846 8381 6021 3504 1390 760 751 -3088 -4343 2560 7526 2473 203 6172 8979
312 8979 2642 -9146 -14500 -6776 -3 -7181 -11062 2161 7951 -3952 -5592 8758 12140 4040
326 4040 5767 9504 758 -4428 1042 3435 902 1519 -984 -5921 -4296 -3522 -8350 -9487 -5757 -5365
342 -5365 -2615 5482 4054 1795 10005 11329 -1190 -137 13326 6221 -6402 3297 7867 -12071
356 -12071 -17120 1784 3821 -7726 -1830 3100 -8666 -7694 8406 4697 -8678 -2618 7311 3235
370 3235 542 2794 923 2289 5849 -1144 -4004 9030 8751 -7870 -4784 8235 -313 -9573 3071
385 3071 8942 -875 -804 -151 -11818 -9904 4515 -5507 -18444 -424 10922 -8022 -7405 17997
399 17997 15425 -3770 5787 18289 5255 -1920 6460 2243 -6893 -3054 -5892 -14609 -4081 3695
413 3695 -12738 -17709 -1097 -743 -9060 2994 13987 4807 5593 15156 7012 3397 15569 6669
427 6669 -15137 -4035 12529 -8003 -21082 621 5146 -12367 -5524 8251 -2922 -6272 9729
440 9729 5165 -9908 -490 6357 -5538 -863 12647 -266 -11137 3128 5505 -7715 1791
453 1791 11157 -5713 -8165 13706 9527 -7451 5380 12878 -9667 -10723 10108 -1195 -20557
466 -20557 -4993 2593 -17006 -11975 9429 630 -6684 14863 16313 -5377 3455 22016 6044
479 6044 -5541 9504 7083 -9115 -2144 3080 -13066 -10821 3510 -9603 -20789 1024 7162
492 7162 -12299 -4145 14727 1465 -6301 14617 15482 -1759 6380 10434 -12648 -9957 16554 3047
506 3047 -21749 -402 16346 -9433 -12632 12853 4455 -15433 1074 10006 -9306 -6445 9277
519 9277 -4348 -12266 7995 6318 -12751 1638 16265 -5441 -9527 13911 7721 -9957 7207
532 7207 17992 -1712 -1835 10772 -8133 -17817 7584 4978 -26634 -15935 10353 -6262 -17908
545 -17908 7710 9933 -9474 5720 22707 1503 -3040 19972 10257 -12406 4068 13659 -9665
558 -9665 -9192 10798 -5067 -23187 -2881 4118 -15846 -7996 10721 -4810 -9993 15253 11807
571 11807 -11931 4422 22694 168 -8972 11303 3794 -13512 3812 10481 -15486 -10226 16127
584 16127 2102 -15296 6601 10060 -16810 -7887 15509 -1819 -15712 6851 8372 -13246 -3293
597 -3293 12697 -3512 -6085 13262 2679 -14134 7497 17409 -8780 -9007 15317 6110 -9989
610 -9989 5430 6001 -14534 -4557 10401 -11962 -20002 8996 9833 -13997 -2517 14590 -4414
623 -4414 -7525 17205 10953 -11381 2612 13333 -7200 -7022 12236 -364 -13867 6557 9153
636 9153 -16259 -8896 12707 -2941 -15584 4536 6691 -9393 3893 15961 -5403 -8995 14002
649 14002 5458 -13819 2989 12716 -10858 -11920 11343 2551 -13252 4395 12346 -6501 -3337
662 -3337 10588 -3978 -10761 9512 6763 -15000 -3094 14336 -3112 -12274 7730 6116 -10855
675 -10855 -1639 8323 -4872 -3271 11787 198 -11560 6836 12789 -6563 -3329 10727 -3006
688 -3006 -12657 4738 4949 -12660 -3373 10469 -4204 -8595 9090 4459 -10793 2615 12076 -7082
702 -7082 -8564 10416 5271 -9007 1983 8399 -5837 -3357 9530 -474 -8818 3485 3291 -10802
716 -10802 -2728 9333 -2088 -6850 6546 4201 -7778 812 7493 -4565 -3743 8732 89 -10143
730 -10143 3670 9904 -5344 -5472 7984 1299 -7518 2511 4338 -7047 -2972 5346 -2886 -4578
744 -4578 8031 4540 -8105 -290 8393 -2712 -7117 4805 3593 -5350 -624 3572 -3567 -1353
758 -1353 6105 -429 -5057 3644 2864 -6780 -1298 7164 -1775 -7576 3207 5702 -2569 -592 4046
773 4046 -1624 -2553 3519 -623 -5247 2853 6007 -4671 -4996 5048 2518 -5225 -434 3965 -1945
788 -1945 -4545 -229 -764 -1050 2828 1154 -2737 2201 6203 611 -1874 2884 1859 -2879 403 2826
804 2826 -1460 -3010 532 -1375 -4674 -827 899 -2717 -2283 1585 308 -2750 1445 4407 2336
819 2336 2190 3991 2242 -368 1094 1706 -1538 -2677 -897 -2608 -3801 -1007 202 -2350 -3234 -229
835 -229 1010 300 625 1386 1749 1815 1699 147 1234 3884 2915 -1432 -2322 999 287 -2895 -2460 274
853 274 -638 -1980 -1057 -310 460 726 -714 -2554 142 3192 -415 -3523 1283 4116 -1183 -2551 3033
870 3033 4260 358 1133 3202 -424 -2090 422 -252 -1286 343 -1193 -5257 -2162 2102 -1811 -5077
886 -5077 -689 1663 -1383 280 3551 1683 1079 4200 2401 311 4202 4150 -3293 -2963 2913 -1639
902 -1639 -7697 -2288 2351 -3018 -3117 1334 -1176 -2824 2889 3146 -2573 527 5597 -27 -2651 4246
918 4246 3516 -3251 -767 3268 -2362 -3136 2597 -57 -5268 167 2939 -3022 -532 6277 1191 -4453
934 -4453 1072 1897 -4601 -1672 2988 -2799 -4556 2939 2399 -3744 1686 6139 -1392 -1793 6842 3337
950 3337 -4406 550 4442 -2363 -2909 2443 -1743 -5245 2220 1545 -7633 -3690 3984 -1723 -3934 4803
966 4803 4765 -3114 530 6361 792 3 5195 -321 -5691 2975 4600 -6840 -4808 4949 -32 -6685
982 -6685 1278 4014 -4136 -2827 3776 -1439 -3836 3854 2523 -4095 2051 5761 -3647 -4261 5935
997 5935 2617 -5030 971 5412 -2650 -2473 4868 452 -3300 2904 1837 -6330 -1257 4956 -3663
1012 -3663 -7019 2499 2043 -6564 -625 6318 -710 -2223 4910 1832 -2980 4406 5872 -3392 -1975
1027 -1975 5358 -903 -6669 1762 3115 -6367 -3567 3430 -2329 -5048 2846 1214 -4861 2137 6657
1042 6657 -2007 -2451 6472 3094 -3588 1894 3124 -4416 -1313 5487 -1607 -7194 1870 2369 -5019
1057 -5019 -608 5061 -2816 -5298 4091 3034 -4874 272 5039 -1915 -1816 5060 850 -4232 3388
1072 3388 4151 -5560 -2600 5874 141 -5637 2147 3306 -3931 -516 3624 -2888 -2784 4941 578
1087 578 -7095 1189 5610 -3528 -3088 5785 1685 -5278 1638 4482 -2795 -1912 3679 -1469 -3469 3586
1103 3586 1252 -5914 273 5861 -3056 -5478 4104 3066 -4375 -91 2966 -3023 -1571 5326 602
1118 602 -4158 2728 3011 -4532 -781 4994 -2439 -5219 3632 3351 -4921 -1298 4885 -1028 -2540 3796
1134 3796 395 -4706 2481 5160 -4037 -2717 5206 841 -4521 2151 3606 -3709 -1879 3590 -2197
1149 -2197 -4322 3566 2175 -4985 -244 4745 -1721 -2595 4620 1350 -3646 2139 4081 -3501 -1801
1164 -1801 4701 -673 -4649 2489 2705 -5041 -1617 4536 -1501 -4945 1614 2184 -2850 963 3745
1179 3745 -2003 -1763 4663 1147 -4483 1698 4165 -3832 -3304 3762 -424 -4163 1809 2876 -3267
1194 -3267 -1179 3182 -1581 -2535 3828 921 -5195 939 5302 -1998 -3810 3612 1539 -4453 90
1209 90 2805 -2322 -904 3680 -826 -3706 3275 3552 -3175 -431 4994 -863 -4313 1866 1992 -4060
1225 -4060 -1103 2403 -2545 -2540 2788 595 -3402 1367 3064 -2832 -1126 4703 782 -3360 1749 2735
1241 2735 -2550 -1083 3113 -874 -3016 1727 468 -4345 -807 3418 -1603 -2528 2826 1228 -2560
1256 -2560 981 3058 -1553 -1079 2387 -69 -2376 2132 2268 -3074 -1168 3214 37 -2229 1770
1271 1770 1619 -2360 -105 1663 -1782 -1971 2170 482 -3711 -197 2111 -2481 -2255 2396 1192 -1818
1287 -1818 1206 2746 -262 896 2862 73 -1318 2036 1282 -3078 -968 1364 -2194 -3541 56
1302 56 593 -1913 -566 1274 -624 -404 1999 720 -379 2549 2354 -1006 -390 3010 606 -2033
1318 -2033 -11 1184 -1623 -1542 -99 -1170 -1824 448 -134 -1845 583 2160 -388 -804 2056 1279
1334 1279 -1237 -311 1540 -73 -334 572 41 -1148 565 785 -697 -436 1037 -311 -1446 254
1350 254 526 -1102 -997 3 -180 -971 268 -128 -984 25 1121 377 269 1983 1376 -148 119 1357
1368 1357 394 -742 -193 -111 -663 -1326 -878 -1106 -926 8 -75 -878 313 1232 622 -102 961 1562 528
1387 528 121 384 287 -92 135 -244 -1310 -697 27 -929 -1222 182 36 -1152 -646 949 930 -492 135
1406 135 808 98 338 522 -622 -860 440 274 -903 -169 1055 -615 -936 1060 928 -488 -259 1093
1424 1093 88 -304 274 -463 -1115 427 581 -1418 -892 971 -141 -1437 715 1718 -293 -483 1232
1441 1232 703 -7 1316 317 -1170 64 1207 -864 -1421 788 478 -1729 -744 1171 -580 -1099 1041
1458 1041 464 -886 701 1195 -854 -455 1998 256 -1221 983 1069 -1053 -760 1321 -564 -1226 734
1475 734 419 -1327 417 1832 -1190 -1361 1214 624 -1924 171 1434 -1104 -1528 1303 869 -880
1491 -880 1058 951 -1623 -147 1853 -499 -1998 1169 1378 -1945 -416 1514 -383 -1472 678 328
1507 328 -1553 500 1249 -1167 -641 2206 645 -2009 1122 2158 -789 -824 1676 -144 -1435 1004
1523 1004 659 -1609 -337 1462 -1244 -1592 1658 724 -1956 38 1691 -518 -981 1974 602 -1163
1539 -1163 909 1104 -1531 -584 1725 -490 -2206 441 1125 -1841 -550 1677 -519 -1349 1238 585
1555 585 -1217 714 1899 -998 -963 1953 395 -1902 629 1494 -1462 -1251 1317 -326 -1800 588
1571 588 662 -1925 -207 1675 -700 -1073 2062 1452 -1635 154 1736 -197 -705 1295 -237 -1741
1587 -1741 430 881 -1695 -1005 1992 -727 -1890 1145 1084 -1438 -533 1876 -266 -1332 1204 953
1603 953 -949 328 1241 -1660 -706 2015 172 -2086 422 1777 -1237 -875 1312 217 -1097 648
1619 648 800 -1442 40 1656 -499 -1375 1500 604 -1303 319 1697 -802 -704 1220 409 -1338 749
1636 749 939 -1210 -450 1422 -802 -1761 700 805 -1676 -569 1130 -473 -983 1288 997 -1186 902
1653 902 1821 -420 -471 1686 264 -1280 236 730 -1550 -1038 1196 -656 -1276 759 380 -1272 225
1670 225 1579 -891 -1115 1566 1199 -1293 309 1404 -612 -835 1011 -93 -1140 479 904 -1387
1686 -1387 -213 1727 87 -1113 904 819 -1172 -577 1179 -394 -1033 510 -40 -1263 211 673
1702 673 -831 -270 1697 236 -1136 635 1396 -496 -382 1089 198 -955 374 64 -860 0 575
1719 575 -1184 -1028 604 133 -1287 24 1384 -333 -300 940 608 -478 677 696 -709 -212 880
1736 880 -460 -1134 634 407 -965 122 555 -501 -493 868 -32 -639 336 877 -728 -187 815 -176
1754 -176 -1003 218 686 -747 -204 886 -123 -418 619 571 -701 96 846 -439 -794 636 172 -1169
1772 -1169 -382 359 -978 -342 826 -207 -365 843 760 -189 425 1063 -233 -618 662 728 -504 -267
1790 -267 197 -38 -706 202 -424 -841 313 417 -667 -5 1302 250 -481 352 732 48 77 609 300
1809 300 106 221 164 -671 177 575 -722 -816 425 165 -487 134 386 -341 -301 373 -79 -186 98 413
1829 413 -570 66 414 -140 -461 528 332 -362 66 484 17 -408 51 -63 -436 -80 -293 -509 266 328
1849 328 -33 -500 132 308 -377 245 241 288 409 480 123 -316 233 195 -276 -408 -149 160 -463 -271 117 -245
1871 -245 -60 87 -83 -120 310 290 -49 31 37 170 -244 170 -15 -57 -77 -163 -56 -207 -96 -114 -431 21 -38
1894 -38 -180 -48 236 134 -278 -262 35 157 69 -193 -41 179 -25 -120 -101 369 321 17 -240 45 384 213
1916 213 -294 -12 143 146 -137 -79 83 -134 -323 -176 128 138 93 -413 -184 139 200 -360 73 269 151 -330
1938 -330 145 296 173 -131 -157 67 -301 -140 -393 -70 197 153 -77 -348 181 210 -69 -48 167 -56 -237
1959 -237 -139 270 76 102 214 -91 127 395 -136 -231 28 -61 -61 163 32 153 65 312 208 -319 259 93
1981 93 -172 -296 364 333 -82 120 216 -62 48 134 -312 -247 167 130 -401 266 339 -35 -419 250 259 -162 17
2004 17 156 25 -171 244 259 -46 91 349 -370 -328 847 78 -603 72 271 -185 -430 11 36 -158 337
2025 337 290 -391 11 664 151 -341 333 187 -531 -114 343 -65 -279 -7 -112 -436 137 98 -227 -142 555
2046 555 -15 -213 187 422 -486 -366 408 32 -535 339 21 -236 123 223 -164 -71 691 147 -454 -123
2066 -123 198 -465 -184 465 249 -366 -30 595 -483 82 432 -70 -398 314 173 -346 -204 352 -335 69
2086 69 288 135 -315 -61 159 -42 54 377 -130 -134 276 245 -210 -83 354 -25 -264 117 175 -283 -3 190
2108 190 -277 -134 223 301 -487 -53 320 -154 -333 291 203 -274 75 290 -138 -105 483 37 -188 562 -70
2129 -70 -152 -33 250 -165 -268 161 216 -260 -46 166 -395 137 389 62 -475 268 392 -80 -232 359 138
2150 138 -440 194 143 -510 5 277 -141 -338 359 184 -142 194 354 -18 -131 214 30 -384 -85 288
2170 288 -110 0 156 79 -229 183 662 -423 -168 257 174 -495 103 187 -171 64 9 -95 -35 271 102
2191 102 -261 319 -18 -387 -237 262 77 -147 48 276 -135 3 -13 -230 -260 56 23 -62 -31 -5 -145 -82
2213 -82 -124 -236 -64 -26 408 20 -180 153 122 -178 214 31 10 -152 137 -265 -285 -101 157 -97 -96 15 144
2236 144 -143 211 71 -390 95 142 -286 -6 423 -110 -52 197 -25 43 -174 20 -191 234 -73 25 -228
2257 -228 194 -5 -159 -2 26 254 -154 154 -8 -275 -77 203 76 -156 34 244 -166 26 97 221 -50
2278 -50 182 104 -241 50 -36 27 -164 -42 77 -53 -19 -91 -68 135 -64 -136 -85 -82 262 133 34 273 -384 -70
2302 -70 23 24 -159 -102 211 -208 -7 36 9 -141 -2 47 137 -124 205 -55 7 -292 32 -90 -16 -232 -74 71
2326 71 -24 222 3 147 1 -94 -132 76 14 -85 -53 30 -112 181 -44 -2 -138 -60 170 -25 1 -189 13 141
2350 141 -243 78 -17 235 126 45 -124 -131 -238 -40 -56 -22 -172 -178 160 -189 145 -1 -66 -121 317 -57 17 -195
2374 -195 207 -112 31 96 -113 154 -2 147 -102 -58 202 -107 -167 -156 -167 184 -150 132 155 64 164 -184
2396 -184 71 116 -76 12 54 12 -131 -68 -237 8 94 -35 11 -1 -89 -9 -129 39 -113 -100 -21 -36 -245 177
2420 177 81 -76 256 5 -52 -156 -63 -277 -18 -89 -178 227 -29 54 25 143 -32 -252 15 -65 342 -73 92
2443 92 -126 157 270 -119 -74 -15 -201 -85 -110 -52 138 131 -16 20 7 129 -39 98 100 60 -120 68 -71 -109
2467 -109 115 103 191 80 -80 58 -55 -419 -184 -148 239 12 99 -63 42 206 -124 -32 -190 -45 -138 -159
2489 -159 179 -282 -188 35 -98 128 -364 -7 13 -126 187 55 21 -91 -106 -72 170 -191 -104 -59 9 61 94
2512 94 -132 -79 -251 66 107 78 25 -2 -22 -91 142 33 -25 34 45 111 44 -51 -112 -34 135 139 -6 226 -211 -5
2538 -5 51 -70 138 66 163 -61 -96 -175 -30 93 -139 107 -37 165 20 89 -66 119 123 60 -239 -124 -57 92
2562 92 -188 81 -109 137 -167 15 -76 116 -50 -166 -112 -147 135 -66 421 9 -34 -73 42 -310 -161 92
2584 92 145 123 106 255 191 208 234 94 184 398 -4 -131 -39 -33 -139 -101 207 20 23 51 -86 -24 -227 -112 124
2609 124 -48 3 128 -1 -126 -61 121 -473 9 -26 -304 -6 140 104 145 170 -82 -88 190 216 -2 -156 -93
2632 -93 52 -74 -251 -46 -2 -28 -315 -140 95 3 -108 168 44 352 -242 -20 262 259 -243 -166 108 -55
2654 -55 -33 68 277 24 -61 240 202 176 233 90 -249 31 82 209 -15 57 -30 -93 280 -109 -194 65 -135 -115
2678 -115 -253 19 63 39 -104 0 -33 -56 -162 125 -341 223 -3 -141 -54 140 265 -93 62 129 280 -144
2700 -144 81 173 -94 297 127 -188 -91 -20 -205 -39 -54 111 -326 16 352 -138 -168 26 78 -89 -119 -369
2722 -369 -52 -158 117 107 -238 213 613 -188 -51 243 -147 -46 28 28 -111 37 -228 -234 354 133 173 -252
2744 -252 -52 5 87 -82 39 61 -143 108 162 -151 23 67 -34 -207 93 19 156 -145 308 -154 -39 113
2766 113 -176 -239 -8 39 -443 -200 -287 -41 162 -351 249 -141 -246 128 -127 -93 -43 -23 -349 34 121 -35
2788 -35 -232 -175 172 -50 -51 29 244 -195 -364 -81 50 -183 86 255 265 450 38 -76 14 153 -79 98
2810 98 205 -219 24 74 -73 37 -23 40 -2 -278 111 -49 -238 8 -210 -78 -5 40 131 -114 -215 27 -22
2833 -22 0 138 -94 -82 75 48 -14 16 -74 -58 -109 -77 191 -38 75 -157 138 200 258 86 115 2 0 -271 -93
2858 -93 100 6 -210 -133 146 -164 43 -77 -23 293 -158 -173 -237 53 464 27 -292 -97 -1 84 77 82 22 99 -98
2883 -98 -26 212 31 -253 98 45 68 70 34 200 -47 84 91 140 206 -243 -87 -218 -19 34 -89 4 21 75 -33
2908 -33 -138 -174 -137 -45 34 -52 -255 -169 183 98 -110 177 150 204 -191 40 327 36 -134 -121 76 34 46 -152
2932 -152 150 127 140 82 -61 -82 84 -76 -6 -44 286 93 -93 -29 261 -90 -176 -63 41 51 125 -19 293
2955 293 145 107 -189 -271 0 238 173 193 221 56 164 -28 206 -137 10 127 82 -124 -14 -338 -2 -27
2977 -27 -58 -134 94 -128 -201 42 -132 240 162 104 187 25 -199 200 -340 47 15 -224 -108 85 222 -204 -16
3000 -16 377 216 24 -231 299 67 -182 -12 206 -22 -47 -17 -93 56 -123 -221 46 188 228 6 277 44
3022 44 -34 -234 92 211 111 229 47 -195 -12 11 -186 2 63 109 -1 -67 99 107 -91 175 211 -26 -414
3045 -414 -87 -25 28 -80 -98 73 375 141 -201 9 -213 -54 -8 -532 128 -163 -403 -47 112 -91 -35 397
3067 397 -106 56 78 101 -94 162 72 -73 -276 49 -141 -13 345 -14 5 214 127 171 218 418 -31 -62 -90
3090 -90 239 124 -108 -39 -59 237 53 9 -144 114 -7 112 175 273 -93 182 75 -7 -56 -127 128 -30 -76
3113 -76 112 63 -154 -144 186 -184 -377 -52 -50 -39 163 -54 113 179 14 -3 -204 144 -103 -132 -172 8 32 56
3137 56 61 548 -2 -138 196 -204 195 13 -135 -251 229 317 -308 277 25 -92 -199 183 23 90 -70 -43
3159 -43 -252 10 287 47 -187 -34 -4 -82 -278 3 -98 14 116 -269 -7 -74 -184 196 -151 -17 -339
3180 -339 -145 -137 122 -105 -90 96 -36 -201 265 259 -324 -144 321 -149 -77 102 149 -51 149 311 214 -240 295
3203 295 87 -111 149 -208 -159 -123 366 179 -181 68 60 -67 237 179 42 -206 276 291 -146 199 140 -26
3225 -26 27 117 -46 -279 -106 326 1 -39 -11 276 -135 -32 63 -189 -81 187 151 9 -16 103 39 -126 261
3248 261 185 -26 206 95 5 -115 42 -251 -139 104 27 -361 -155 229 -165 153 165 55 -180 89 -77
3269 -77 -227 155 -70 -120 78 285 -300 -88 -128 70 -211 -44 15 -55 -35 163 21 -340 47 214 63 -144
3291 -144 217 -38 -353 -149 166 134 -77 -41 67 76 -87 -109 -258 -244 -49 161 93 166 172 -147 55 -244 115
3314 115 -102 121 285 -168 -42 238 80 -282 277 73 -278 -361 272 8 -257 65 -251 -183 165 6 87
3335 87 18 79 256 -234 153 -38 54 -173 -118 -108 -149 275 166 -63 -53 -183 -109 -220 169 306 -181 -13 74
3358 74 139 7 116 11 88 85 13 22 8 72 68 -94 65 -91 -278 -311 13 -59 -7 -49 110 49 -118 120 180 1
3384 1 93 227 -315 -9 92 -88 36 -159 221 55 -30 122 -10 -37 362 145 15 10 -57 -38 72 52 226
3407 226 223 77 25 -334 17 -19 -107 -70 225 4 24 102 -221 273 193 64 31 51 237 98 -23 93 -55 175
3431 175 -68 -73 73 8 131 -113 -282 58 -41 162 -242 26 226 98 -256 -303 -50 322 121 -7 264 -36
3453 -36 -9 -9 -47 -11 285 -14 -35 323 61 128 -7 4 135 261 82 -141 -153 156 71 -146 -190 187 158 291
3477 291 -162 213 25 90 -145 27 -90 65 91 -146 -114 -120 -115 -3 -145 -206 44 -59 144 326 -45 282 -141
3500 -141 107 -178 -48 41 -61 37 -50 -313 59 144 -160 303 74 70 -8 40 -31 29 1 -125 182 169 179 -39
3524 -39 83 57 -120 73 73 14 -9 202 -63 26 298 -75 27 79 -293 -428 169 261 -165 113 -23 -99 35
3547 35 43 100 113 102 -89 -238 159 315 -71 -117 -120 72 -109 -49 175 171 143 10 169 83 271 -30 -43 13 8 -58
3573 -58 -81 261 120 41 94 -104 195 -316 -172 95 157 47 -35 -220 -179 204 -96 -164 -9 154 -114 -46 -49 61
3597 61 137 -6 -43 -71 127 184 98 -131 -54 39 -186 40 393 158 -191 -49 126 110 -116 21 -108 -21 -19 7
3621 7 -231 126 -20 7 63 -108 -101 105 212 334 -118 158 64 -45 -35 115 126 -118 -50 -24 90 -349 -190 -249
3645 -249 -129 350 216 -104 191 206 462 86 -31 -121 23 -26 220 -246 -175 -119 21 36 143 190 -138 179
3667 179 224 -68 -20 369 65 197 -27 239 34 107 -83 -140 96 -6 36 -171 -26 -41 -66 -25 103 -35 -145
3690 -145 -80 -105 62 -268 206 -79 -292 108 81 59 21 39 16 5 243 114 -182 112 31 -169 96 122 -10
3713 -10 -42 149 -45 -14 -94 95 105 -98 87 128 -235 48 27 -141 -7 82 -127 -171 231 62 113 -179 1
3736 1 5 -245 -55 30 -91 -6 -86 -186 -171 2 61 10 -229 227 -83 271 -47 74 -109 96 20 27 -126 412
3760 412 75 -80 24 344 -318 74 -17 382 -47 -17 37 -115 55 25 242 -118 -87 224 -152 -146 262 -114
3782 -114 75 -12 -169 228 -101 -24 -177 4 203 -40 -148 117 10 -138 -122 167 -27 -117 85 38 70 -199
3804 -199 121 -47 208 -114 -2 -129 253 352 -247 -329 164 -80 -176 16 -43 81 -40 2 -28 -165 42 -55
3826 -55 -210 84 273 -125 30 24 71 -87 79 -189 -224 -91 -227 213 -450 262 187 -157 -52 -154 55 29
3848 29 -196 -168 12 -200 -226 159 143 96 121 -130 -144 303 101 -234 266 156 -86 -106 19 -259 50 22 34
3871 34 -148 18 -157 -123 104 265 75 -192 238 179 -263 -162 58 -211 -49 134 294 191 66 -74 -205
3892 -205 60 -109 -48 -37 164 -97 176 69 -176 -204 29 -106 -301 47 157 160 -217 -216 -87 -11 3 141 -230
3915 -230 -177 -40 -86 230 34 -113 -20 28 107 -39 14 -109 -5 152 92 281 296 -42 -66 14 42 -139 191 0
3939 0 -133 -21 -75 -73 80 63 200 80 159 -117 -72 196 65 69 -22 -47 -59 -18 21 0 -15 -30 -8 -164 137 -14
3965 -14 219 -141 190 50 4 -61 -207 252 119 116 -127 -204 119 -33 101 117 -117 -252 -249 119 -54 141 -119
3988 -119 -26 -120 -28 34 222 -116 117 -264 -361 73 -194 88 -81 -176 -76 81 8 55 197 4 40 -27 -47 70
4012 70 -79 -77 71 168 -111 -75 5 -134 56 73 -69 -304 254 -63 46 31 161 -152 246 263 4 -57 -225
4035 -225 71 120 -8 119 33 -14 187 -85 261 251 59 43 128 126 147 -139 125 -91 -7 0 -102 194 -167 -28
4059 -28 -254 -45 -204 23 258 -169 57 -21 -226 -73 -1 54 135 -29 81 59 -197 263 165 -50 -21 -81 -154
4082 -154 -158 -206 -42 201 -42 33 28 143 -15 -147 91 478 16 5 23 -74 -29 5 62 272 -276 -141 2 -172
4106 -172 -68 -69 212 -73 -188 -68 -133 119 123 -116 -23 -230 -197 207 69 190 -179 -49 295 -79 7 125 -53
4129 -53 -21 -49 -108 -66 86 -32 45 59 -19 -197 -108 202 -6 -4 -1 157 -156 7 212 127 -72 107 1 66 32
4154 32 -16 -57 -66 -155 294 118 -10 47 2 -26 -61 336 -62 -44 -80 -92 194 60 25 142 -48 25 78 79 -118 112
4180 112 -48 -190 331 188 -39 51 -60 -54 -145 131 -18 -115 -183 181 40 -243 77 -143 -111 129 232 100
4202 100 -84 -130 -92 71 -6 270 163 199 -63 -71 24 70 -66 -233 23 132 -123 -76 42 -185 42 -149 -126
4225 -126 56 -262 139 3 -156 69 73 -11 -68 -109 160 -74 215 -17 81 -33 123 -63 -266 209 -315 141
4247 141 295 84 -124 80 -37 186 18 -107 145 -134 8 103 191 -118 39 -23 119 325 223 165 33
4268 33 169 -90 -29 159 337 245 266 -244 23 234 103 145 -199 70 117 -46 124 271 41 -77 -37 -73 -16
4291 -16 47 96 -233 -175 52 147 -110 96 282 -54 70 -152 -165 -123 52 164 92 21 161 -55 41 63 212 55
4315 55 -467 -248 -32 99 122 95 -28 14 254 -232 12 -10 162 -146 78 75 95 -98 -118 46 -82 186 -168
4338 -168 -119 -93 -26 -4 106 90 232 -127 -171 276 429 30 247 172 -58 -73 26 281 -109 115 136 -49 -131 -107
4362 -107 -175 -110 -269 148 1 -96 8 88 169 27 -19 147 -147 -84 48 89 94 -239 20 -43 -51 -104 -4 -335 -178
4387 -178 149 -49 -99 -176 -74 98 29 -86 22 -18 71 115 -144 -23 34 278 -305 -104 -185 -125 86 124 -72
4410 -72 122 43 260 308 -15 216 87 -153 89 33 -80 -49 149 -148 191 -35 187 -233 -33 -96 -196 93
4432 93 154 -167 -24 -88 -108 -156 -222 115 9 130 16 171 116 -14 -13 -19 -138 -108 -109 -37 214 101 -116 -115 -74 -275
4458 -275 -12 17 269 -22 -100 170 29 -32 52 -7 -121 -277 140 42 -16 -54 116 37 -88 -69 -107 73 115 -102
4482 -102 -170 -5 -159 -111 -59 75 -11 204 91 -107 -206 -270 25 -49 -84 -330 107 75 107 3 62 43 182 -206
4506 -206 66 21 118 72 12 -88 -158 -54 171 28 -315 -355 -40 -101 294 10 -74 -74 103 99 -45 43 31 44 41 -22
4532 -22 65 -88 -11 184 -85 52 226 62 -70 175 28 -167 -70 -104 15 -29 -127 -64 215 -74 -58 58 -15
4555 -15 86 100 -117 -154 121 -83 12 -157 201 -51 -75 -187 199 -102 -35 161 -121 -35 146 -161 91 -50
4577 -50 29 20 15 -138 91 176 -125 -129 162 -162 207 202 -200 67 149 123 -100 250 -60 14 240 29 -8 -33 24 -293
4603 -293 -142 2 242 20 -229 239 152 49 -185 96 -72 347 -54 -81 235 247 -92 -160 94 -17 -88 -59
4625 -59 -203 8 83 30 31 -71 182 -255 137 -175 -109 89 107 27 215 1 152 39 184 -82 0 78 58 -45
4649 -45 77 132 -157 -119 222 -8 -218 270 347 18 -41 -47 103 -230 -261 18 -4 -34 -125 -73 -72 118 -63 -22 63
4674 63 -136 225 50 -90 69 28 82 -236 -84 -158 79 113 -54 -67 -126 -230 8 248 -252 -110 -173 -127 96
4697 96 -332 -22 -81 -155 128 -204 -149 110 115 -137 -26 29 -3 -156 -101 6 130 -132 121 120 84 -12 -13 158 -80
4722 -80 -245 -135 6 90 -138 177 35 83 -359 -96 -86 -132 -6 -18 -315 -106 -11 -77 -16 -96 -126 237 7 201
4746 201 158 -4 -177 249 -147 213 287 98 82 -128 43 -185 -10 56 21 -72 -173 -150 165 27 27 -119 -113 127
4770 127 19 49 116 276 -35 -126 -177 99 -132 -74 -144 68 -99 92 94 109 -237 69 21 23 -26 -13 -17 -91 -29 -90
4796 -90 -77 85 4 -52 -8 -22 41 -68 22 -28 52 27 -58 -201 130 169 -159 -106 -226 -15 -248 317 94 13 147
4821 147 -257 -96 -27 204 18 181 -73 -15 -40 103 -103 503 -128 -70 227 87 183 -84 -25 142 45 54 -132
4844 -132 -354 27 66 43 -14 -103 233 91 -120 102 -14 28 -117 257 29 -30 -24 -206 55 141 -24 110 -28
4867 -28 9 60 -265 -21 -253 -175 153 177 -136 218 15 115 349 -34 -42 22 120 110 125 -7 211 79 76 -133
4891 -133 -226 -109 -25 -176 109 -84 -64 32 133 -150 -248 41 -38 -64 -25 39 -208 -54 -103 76 238 54 2 5
4915 5 162 -8 -209 -137 -24 200 -193 -13 -157 -31 226 63 59 -57 283 3 -35 98 59 238 -153 9
4937 9 -96 66 55 52 -133 -121 255 -374 37 -245 -296 -2 -92 305 -19 162 117 195 92 138 62 94 334 -168
4961 -168 -111 -196 78 -364 0 -184 -438 -91 -376 94 199 104 -43 109 225 73 -181 250 50 98 2 -19
4983 -19 -41 -142 -124 263 -233 -67 -211 79 -13 137 178 -13 98 -161 -269 -17 130 -56 139 -298 -313 -44
5005 -44 -92 40 330 21 5 -31 -236 -1 -105 -181 -268 -3 -236 -96 -47 -255 31 29 109 39 -117 120 42 96
5029 96 -43 -39 166 -247 -140 -153 -8 -150 -4 -47 28 -12 48 -4 95 -131 140 -111 -28 54 -49 236 200 183 138
5054 138 -84 206 305 67 -52 -33 46 -160 45 -173 -154 15 -27 -265 -1 46 -40 -252 -421 -204 193 -99
5076 -99 -32 -10 -68 -43 -1 -137 -31 297 -192 -189 68 191 189 42 43 10 74 -65 310 105 117 -136 216 -33 -100
5101 -100 -433 -53 223 50 73 124 51 65 -116 30 -114 1 13 170 52 -217 62 -72 79 -9 -29 210
5123 210 153 32 75 29 178 -109 -85 -104 -3 17 167 142 9 -16 77 -44 -223 63 69 94 170 101 171 392 -133
5148 -133 117 227 -149 -290 79 -176 -209 118 20 -50 -254 -61 46 -162 -323 -101 27 247 -17 -119 180
5169 180 -86 53 46 -2 -88 -229 34 337 85 -5 -47 -246 -214 -21 122 -110 127 99 -33 -244 95 136 127 156
5193 156 -209 78 -121 -52 64 -219 111 -148 -232 20 169 13 97 74 75 -236 -70 22 258 103 -18 -258
5215 -258 -82 -39 114 -208 89 108 -129 260 -38 -55 168 11 -268 -66 -119 -118 124 198 116 -261 130 51 325
5238 325 44 -264 154 24 -39 87 -199 22 -100 34 283 249 -22 308 -102 -96 -271 -77 173 33 -119
5259 -119 373 -160 98 119 53 82 -86 -27 229 222 -104 263 57 -143 -69 355 137 -251 65 48 -218 -279 -90
5282 -90 -94 -172 -93 -116 -152 -105 277 6 -202 228 -59 -241 -118 268 48 -124 214 45 23 28 24 -440 -15 -110 135
5307 135 -326 57 394 -121 -209 -373 -71 -54 58 16 234 -39 115 -18 156 149 20 165 134 42 142 -87
5329 -87 119 72 -50 60 17 71 -1 -12 -276 -177 -28 378 184 77 -37 16 154 175 -101 -67 -93 -127 60 21
5353 21 -58 18 127 104 -26 -358 121 154 115 172 -62 27 -95 -1 -63 -69 112 -111 114 -27 -282 -171 -171 -23 -4
5378 -4 116 -47 -39 -114 -30 184 1 -237 190 -102 115 23 99 16 186 102 60 -331 -257 -370 -35 -113 113 16 72
5403 72 81 -61 138 21 67 -81 59 -71 172 126 27 -22 74 291 221 -12 16 -55 -136 129 -158 224 83 160
5427 160 -166 22 84 -307 -185 197 65 -161 -29 -42 178 5 -105 -59 182 124 97 -54 106 126 51 -50
5449 -50 -53 -96 -130 -14 46 -72 17 57 67 -171 279 130 -208 99 -14 -56 -45 125 144 98 36 67 -77 411 218
5474 218 -21 173 -24 55 163 48 -90 99 -58 -126 -157 -270 -234 -5 120 26 -45 -349 -211 -74 7 -26 41
5497 41 -94 45 211 -135 206 -61 33 122 -145 89 4 70 -236 -121 51 42 -126 -116 292 -30 109 -277 -143
5520 -143 -48 127 -138 80 -65 325 181 223 29 -311 97 -252 -184 125 -175 9 -13 -96 -50 -211 -194 202
5542 202 -197 102 371 108 -18 -151 -172 105 14 101 85 -11 -6 -31 27 364 -1 -52 171 -201 222 5 -124
5565 -124 -35 49 -97 87 -303 167 163 95 -7 -79 -137 -71 -73 262 -56 -168 140 -274 -102 48 321 14 -97
5588 -97 61 -22 239 -88 -107 147 -30 -3 12 -1 -164 -132 98 208 -207 -102 -120 -102 -120 71 -1 27 -69 173
5612 173 287 31 75 126 238 -324 98 100 141 -6 -49 81 -189 -38 41 28 -55 28 231 -60 -61 16 -39 137 -78
5637 -78 -241 84 -28 -85 -114 12 11 -87 -231 -180 73 66 -240 -8 -103 257 12 221 -381 110 141 -73 -85 -178
5661 -178 76 89 52 135 -101 -308 122 -189 195 -120 -191 -39 -112 -271 163 197 -205 -84 -161 1 -41 -106 42
5684 42 191 -12 126 -124 102 180 -198 -124 223 -19 43 -179 212 250 -228 10 -384 207 202 57 194 -17
5706 -17 16 4 358 -195 -30 -136 -117 119 41 -197 -184 -15 85 -137 -154 39 -250 -15 -140 352 292 -129 -91
5729 -91 -155 54 -191 149 204 23 -153 -79 18 122 143 10 204 -104 79 87 123 58 -222 34 190 -82 -319
5752 -319 52 -30 -33 159 236 230 -12 -182 -60 -37 50 -178 76 -171 90 -116 123 99 -62 -46 241 102 -108
5775 -108 -103 115 -117 -291 197 34 -107 143 45 -203 165 -31 2 -8 230 -81 -52 0 198 188 200 125 -21
5798 -21 -73 -279 -60 79 36 34 191 -132 -6 -38 -85 109 82 -27 219 -28 4 8 169 170 172 -207 75 230 12
5823 12 -79 72 -128 -88 1 106 -191 12 -50 65 -131 -222 132 73 -9 114 -44 -161 190 -359 -57 -225 56
5846 56 -39 144 -120 168 33 3 -35 -59 -52 173 38 29 211 218 -372 -92 -17 -170 12 101 87 -4 230 -70 -21
5871 -21 0 -58 133 -16 -106 18 -102 1 -226 -131 -414 -46 45 4 63 -45 43 -342 -42 -220 -80 84 284
5894 284 24 -173 -2 -93 117 -2 11 -84 -9 -258 45 -156 206 72 68 182 132 -45 23 -116 -212 -57 -45
5917 -45 -20 122 -144 -71 145 -27 176 -18 185 137 -42 101 -128 152 -29 -184 44 105 -299 -143 -68 -87
5939 -87 -111 92 -70 -176 -186 30 112 53 146 33 84 -204 113 249 -310 6 -156 110 -23 192 230 -131 145
5962 145 -95 -38 -15 -83 -107 40 -85 140 107 -255 -201 37 170 182 117 129 253 -65 -46 58 -63 126 137 -97
5986 -97 6 34 34 -134 103 117 17 -96 116 198 96 132 -228 337 253 -29 367 -12 123 -164 95 41 298
6009 298 179 -201 -242 430 112 152 26 -24 63 -64 -69 -89 62 47 -30 -45 42 70 -188 63 73 -9 78 50 236
6034 236 152 123 -17 -178 -244 256 66 -96 89 -6 -41 154 197 122 66 92 -56 -5 50 63 55 -135 63 145 -46
6059 -46 -23 184 -133 -289 -22 8 -89 62 233 -100 -137 -175 40 -136 -80 -32 182 132 -78 135 0 -6 252 -192
6083 -192 228 -114 -39 -69 356 -64 29 -66 222 -20 -190 -33 -6 -13 -5 -157 160 102 -213 -24 -1 5 64 33 136
6108 136 -58 41 154 -126 113 -14 -309 127 90 12 42 -40 0 63 -82 0 -55 -163 29 -157 171 97 -4
6131 -4 31 165 25 -69 58 1 206 238 88 158 -73 -274 -140 30 -143 150 39 8 -95 -195 283 130 -182
6154 -182 -241 216 -65 -17 -396 -95 -37 -22 12 -172 25 127 81 -146 129 45 90 -287 -149 134 104 36 107 147
6178 147 12 176 -55 -152 51 81 -162 -85 -155 -22 -145 -75 -149 -188 68 182 117 -94 18 -73 -116 -6 22 -120
6202 -120 62 249 226 -107 -5 -142 -50 -104 -71 26 7 48 108 -21 -23 -96 137 146 63 -216 148 185 -383 -122 -125 101
6228 101 -153 50 371 48 -177 4 153 163 -179 191 -155 149 330 -89 184 70 123 -13 77 275 -120
6249 -120 130 -15 -66 -339 -7 68 -142 39 150 145 -242 -10 -100 191 -95 -60 142 -128 -56 339 134 17
6271 17 30 106 -84 -268 -270 184 0 70 -75 -39 219 -10 89 -69 53 88 267 16 -4 2 102 38 93 -3 270
6296 270 15 -78 -64 368 48 -7 -85 -55 75 -182 -42 62 77 -117 -211 -77 -89 77 -121 59 85 -207 -203 151
6320 151 -164 -112 200 370 27 -26 -150 191 7 149 176 -35 -122 327 22 -93 208 24 -115 -90 266 488
6342 488 75 184 88 93 -1 166 -394 -96 -341 -293 -222 -64 231 -129 -349 19 -27 -74 119 151 -143 29 109
6365 109 128 -39 28 -56 -71 -89 -83 -84 -151 -79 218 -1 221 201 225 105 -9 -54 -71 15 -2 -98 -109 89 111 64 43
6392 43 -26 -136 200 412 -8 59 453 113 62 -185 260 8 -104 -94 158 -138 -61 53 -171 -239 -17 170
6414 170 -134 -65 -114 -35 289 -28 -100 100 173 -61 -100 49 185 62 -31 -80 17 -96 101 -217 55 203 50
6437 50 -143 -138 54 48 -133 29 204 -31 -226 -11 -122 31 95 21 -151 37 263 58 -17 19 203 -87 140
6460 140 309 -27 204 10 20 -95 -70 205 -130 -113 205 35 5 -293 -8 -151 -170 -46 -121 -49 230 306 16
6483 16 113 -85 -76 -172 91 42 -2 210 53 -55 10 -138 -60 -28 8 -142 198 -246 -70 -11 -189 -11 -43 79
6507 79 272 -225 -4 321 294 -27 202 -142 243 33 -231 190 13 -117 -18 131 3 -28 172 -117 189
6528 189 193 -53 -177 -44 -20 167 116 -180 -88 -243 25 -87 -30 -112 -158 -124 152 70 -231 16 -170 46 85 -241
6552 -241 93 1 -25 -203 -66 -37 -280 -222 -177 195 59 -254 0 -70 -381 85 132 25 -2 -4 29 127 129 152 128
6577 128 100 38 -198 111 -3 345 -165 -31 -45 129 158 148 26 38 -68 18 -249 -114 1 -112 -2 31 -60
6600 -60 177 -117 42 -145 -32 -118 -2 135 -41 46 66 115 -175 282 121 139 -94 113 -132 302 169 -69
6622 -69 113 -84 -83 255 -204 24 52 -24 -33 82 -100 134 -85 163 -54 -327 30 47 -205 113 -40 54 136
6645 136 -88 -3 97 -14 -193 62 -245 216 -47 23 155 -8 -78 135 -141 69 58 -62 100 2 88 -75
6667 -75 86 -57 3 5 108 141 220 62 -55 66 49 -329 -124 157 39 -465 6 80 64 135 -71 -84 -49 48
6691 48 267 -57 -65 -37 57 108 151 -152 136 211 17 54 24 -153 69 115 -57 -49 143 -298 109 36 -135 197 188
6716 188 -5 -3 241 151 81 178 116 -39 -29 -11 120 -68 98 -48 378 -224 214 67 261 185 249 94 -177
6739 -177 21 128 -357 98 -205 85 -179 -115 -148 -185 -142 269 51 21 -142 -36 95 129 -130 188 237 -211
6761 -211 57 147 65 -25 64 170 237 96 110 -300 106 -57 77 -202 130 55 -99 104 135 -27 -112 102 -291
6784 -291 38 193 -3 -52 107 5 108 288 151 -31 124 243 -3 187 -9 -161 104 54 168 -139 177
6805 177 -106 52 58 228 -227 186 -2 -61 63 75 -6 71 -72 109 178 -235 123 46 161 31 -88 297 300
6828 300 -55 102 124 -217 -112 -192 -46 -277 41 144 95 50 -21 19 -204 129 69 220 195 102 146 132 311 -209
6852 -209 -17 494 -85 29 83 117 -102 -7 25 -253 15 77 -2 174 270 -13 -45 185 -61 112 20 -118 8
6875 8 195 88 120 -161 232 6 -6 -138 -35 313 -108 -213 -384 -72 125 10 -54 -233 47 -190 136 -17
6897 -17 220 -103 4 163 -156 -9 136 -21 -450 119 71 -135 -93 219 -13 -140 10 198 72 -175 153
6918 153 81 96 -249 88 -133 9 -136 258 -54 1 72 142 -156 -16 13 -142 -412 203 -258 69 182 62
6940 62 83 103 68 -302 -120 99 -119 105 160 -46 6 -118 174 47 15 -58 103 90 -96 -127 -243 135 -183
6963 -183 41 -117 -187 -9 -125 59 172 57 81 111 9 -52 -34 -52 140 5 -399 -85 -136 -43 250 -72 36
6986 36 -151 -51 -75 113 108 15 -44 1 184 82 103 -98 120 82 213 -189 -53 -77 -129 -131 49 332 311 184 98
7011 98 179 146 47 224 119 -423 88 97 226 34 -79 144 -156 164 117 -6 31 163 -210 184 -81 66 53
7034 53 25 309 -113 -67 138 -26 -191 -84 -110 39 51 -58 0 -89 127 174 -210 131 79 -49 -36 -111 145 -161
7058 -161 -51 -22 -121 -27 -30 -283 92 -262 -42 0 -111 -79 184 10 -104 102 164 -478 11 -92 -179 -40 -189
7081 -189 74 -42 -227 -1 -158 -65 292 -58 -88 -212 8 -16 -119 110 250 -116 118 -44 -134 190 11
7102 11 -97 123 -67 -268 -141 11 239 -159 -53 159 269 40 164 -102 -82 -300 131 -146 66 -2 148
7123 148 -162 288 -8 -38 22 28 -125 189 -14 199 59 -166 -142 96 138 -9 146 -255 25 -17 -106 -52 -216
7146 -216 -105 -67 -41 248 -160 325 -227 87 220 17 -67 259 95 180 21 9 22 -282 157 -167 107 -128
7168 -128 107 -55 -100 -279 -157 356 110 -279 119 129 208 4 85 13 229 77 -130 155 -69 -178 128 -39
7190 -39 56 77 12 8 64 156 -253 20 50 -153 48 38 36 -153 -155 -80 286 183 80 -120 148 110 -85 -84 -167 -110 60
7217 60 42 116 10 161 3 75 13 -90 124 132 173 -157 149 220 -95 -118 -108 -236 179 25 130 196 -178 224
7241 224 -137 209 141 -114 49 -192 -90 -18 -163 -58 61 9 -131 -82 97 417 -201 148 55 -35 -83 155
7263 155 89 -325 -83 9 75 78 197 -153 -122 -105 240 73 34 -302 -4 93 205 38 -213 -100 35 69 -196
7286 -196 -56 -86 299 -74 -69 -81 24 97 -148 126 8 -50 30 -343 120 3 -226 -80 -31 -103 -16 44 -123 -92
7310 -92 148 -471 58 156 183 101 -48 157 10 -31 47 -49 -237 146 -86 209 -62 13 43 -215 -80 51 -57
7333 -57 -411 -147 105 95 244 -115 -31 308 235 165 181 311 86 -178 75 129 -98 -308 19 -275 -110 -141 156
7356 156 68 -117 121 17 153 -32 154 51 -230 47 -45 -129 -103 38 234 12 -118 -57 154 17 -112 201
7378 201 126 24 101 354 27 121 102 -15 20 -90 -111 -54 -151 -33 50 3 265 -48 29 -183 -110 67 -13 65 -83
7403 -83 43 156 -92 10 -119 344 233 9 114 50 133 -46 174 173 -206 83 -127 -101 -166 243 217 -281 58
7426 58 27 -92 -107 -217 641 10 129 -110 20 -205 303 56 2 28 -122 -215 -23 122 335 -73 -23 159
7448 159 -242 -26 99 -173 -67 0 -142 320 -128 -42 -300 59 -75 95 -132 18 -210 38 -51 -27 83
7469 83 -158 -31 315 54 350 234 140 125 349 252 -152 -10 60 -120 -95 -141 -206 -94 0 138 -89 24 10
7492 10 -4 -127 -157 10 -120 -235 141 -161 -23 -212 -61 105 -103 -11 194 -247 145 -186 -11 -21 -23 39 132
7515 132 -347 -227 -47 -226 116 -219 16 45 97 -144 40 28 -17 157 -254 -288 114 -86 83 -62 -128 88
7537 88 -58 -93 100 23 -7 58 112 -54 -311 -192 73 124 -69 38 -87 -169 -8 308 42 -179 136 -66 108
7560 108 228 33 37 193 197 -126 -11 -212 111 123 222 10 -10 62 -48 -34 -141 -144 -314 -226 52 32 -194 -119 -100
7585 -100 -214 -92 -75 36 -64 166 -179 -115 -12 -82 107 82 272 -120 12 156 245 215 48 -63 -236 -158
7607 -158 159 -212 217 -98 56 132 -86 206 -63 4 -78 -62 17 -142 -204 -253 206 25 104 42 -167 -330 70
7630 70 -281 113 124 241 -162 -111 122 -174 -189 -226 311 97 -2 177 -26 108 194 -23 240 -70 165 -199
7652 -199 -12 201 -137 -141 -51 136 -108 -195 -87 -172 246 -265 44 -12 -19 286 103 -273 -95 53 133 124 -13 33
7676 33 -216 -9 -58 494 -340 60 -110 131 -89 173 -34 54 12 96 -130 85 -83 110 -304 127 2 -347
7698 -347 -283 1 -32 -16 178 142 -174 -60 149 -181 69 118 143 73 208 -7 245 62 322 161 -164 73
7720 73 -261 251 -234 173 115 -102 -26 148 251 -273 -127 349 23 -8 142 -131 -130 -109 228 -317 -79 -4 162
7743 162 65 84 102 381 64 210 591 -299 116 -205 -323 185 -311 200 69 -58 -177 -247 -70 286 -94
7764 -94 119 -242 28 372 -5 -72 11 8 -182 -7 -189 29 45 -36 -169 -4 -99 5 59 84 83 -153 -210 -7
7788 -7 77 157 19 11 23 -23 55 -223 -39 195 76 -182 39 -20 157 143 -2 121 77 25 -60 73 118 135 -173
7813 -173 16 53 193 -49 88 31 -63 -32 -41 22 109 -299 -1 -151 -238 -158 -44 -201 -80 206 138 23 -111 -3
7837 -3 -92 61 61 62 178 291 -78 27 137 48 195 -152 -10 17 -51 -31 219 62 241 34 58 -62 4 -150
7861 -150 49 -110 -285 -313 35 24 -117 108 -105 -201 -44 -96 -171 -90 136 132 303 140 7 245 -124 -105 112
7884 112 -188 117 65 -108 -257 126 72 175 24 -20 -48 -4 153 -76 109 232 83 -121 112 163 -57 -36
7906 -36 151 -6 -121 -37 -190 72 -113 67 85 6 -296 39 -12 167 107 217 -3 82 -41 -326 126 -130
7928 -130 11 152 -209 -150 26 47 37 109 117 -144 163 72 -16 -389 82 246 -60 -18 285 125 69 331 269 332
7952 332 121 -10 259 -152 212 -75 178 123 49 -59 224 60 -53 -137 42 93 172 358 51 -206 130 170
7974 170 58 -2 38 -20 -61 -98 -69 64 -93 -7 -141 -78 -21 -133 68 -128 41 -69 -104 48 -38 -13 -183 19
7998 19 139 -333 -78 164 -190 -106 152 73 85 108 -207 384 76 138 -45 129 120 157 -86 116 77 15 -3 -66
8022 -66 132 -152 197 -18 33 -135 266 -139 0 20 99 113 -181 -33 -330 -217 -21 -335 -232 -96 17 -159
8044 -159 207 -172 -63 210 -113 -104 283 74 136 -62 271 -155 156 110 199 126 244 50 25 -41 -268 174 78
8067 78 -132 34 -142 -98 168 -133 -169 -379 242 -239 -135 218 -52 -177 -102 4 -172 83 135 -123 -89 179
8089 179 187 308 301 31 28 29 127 -107 138 82 -51 -48 -32 -142 35 416 29 -203 -39 21 -5 -52 24 -32 43 -55 182
8116 182 -64 -176 -42 -1 18 -219 -114 -5 30 -252 -167 -409 17 -161 -77 141 -154 -94 139 78 340 34
8138 34 81 14 -55 85 161 222 -206 285 83 101 247 93 92 176 110 -195 -197 44 165 -32 -217 -41 -82 9 195
8163 195 246 -159 -116 84 68 -43 -78 -35 -175 -115 25 -191 54 180 -180 -207 -1 -71 38 165 19 175 -256
8186 -256 -123 95 -314 -52 -134
8191a34
##END NTUPLES=NMR FID
##END=
