##TITLE=1H_Pr 82-DM
 200.13MHz,CDCl3 ,
 8 sc
 
 13.3.2025
##JCAMPDX= 6.0         $$ Bruker NMR JCAMP-DX V2.0
##DATA TYPE= NMR FID
##DATA CLASS= NTUPLES
##ORIGIN= UXNMR, Bruker Analytische Messtechnik GmbH
##OWNER= pz
$$ XWIN-NMR		Version 3.5
$$ Thu Mar 13 14:22:03 2025 Russian Standard Time (UT+4h)  she@DPX200
##.OBSERVE FREQUENCY= 200.1313
##.OBSERVE NUCLEUS= ^1H
##.DELAY= (6, 6)
##.ACQUISITION MODE= SIMULTANEOUS
##.ACQUISITION SCHEME= undefined
##.AVERAGES= 8
##.DIGITISER RES= 18
##SPECTROMETER/DATA SYSTEM= spect
##.PULSE SEQUENCE= zg30
##.SOLVENT NAME= CDCl3
##.SHIFT REFERENCE= (INTERNAL, CDCl3, 0, 14.3821)
##AUDIT TRAIL= $$ (NUMBER, WHEN, WHO, WHERE, WHAT)
$$ ##TITLE= Audit trail, XWIN-NMR		Version 3.5
$$ ##JCAMPDX= 5.01
$$ ##ORIGIN= Bruker BioSpin GmbH
$$ ##OWNER= she
$$ F:/spectra/data/she/nmr/H-C/1/audita.txt
$$ ##AUDIT TRAIL=  $$ (NUMBER, WHEN, WHO, WHERE, WHAT)
(   1,<2025-03-13 14:20:49.73 +0400>,<she>,<DPX200>,
      <created by zg, POWCHK disabled, PULCHK disabled
       configuration hash MD5:
       00 E9 B6 7A A2 85 ED C7 34 08 36 98 17 FE 4E 26
       data hash MD5: 16K
       45 51 8E 5D F7 09 56 19 80 C5 11 A0 C8 09 27 2A>)
$$ ##END=
$$ 
$$ hash MD5
$$ 24 86 9C B6 44 27 2B BB B3 7F B4 EB A0 19 0D 87
##$RELAX= 
##$RELAX= 
##$RELAX= 
##$RELAX= 
##$RELAX= 
##$RELAX= 
$$ Bruker specific parameters
$$ --------------------------
##$DU= <F:/spectra>
##$EXPNO= 1
##$NAME= <H-C>
##$PROCNO= 1
##$TYPE= <nmr>
##$USER= <she>
##$AMP= (0..31)
100 100 100 100 100 100 100 100 100 100 100 100 100 100 100 100 100 100 
100 100 100 100 100 100 100 100 100 100 100 100 100 100 
##$AQSEQ= 0
##$AQ_mod= 1
##$AUNM= <au_zg>
##$AUTOPOS= <>
##$BF1= 200.13
##$BF2= 200.13
##$BF3= 200.13
##$BF4= 200.13
##$BF5= 200.13
##$BF6= 200.13
##$BF7= 200.13
##$BF8= 200.13
##$BYTORDA= 1
##$CFDGTYP= 0
##$CFRGTYP= 5
##$CHEMSTR= <none>
##$CNST= (0..31)
1 1 145 1 1 1 1 1 1 1 1 1 1 1 1 1 1 1 1 1 1 1 1 1 1 1 1 1 1 1 1 1 
##$CPDPRG= <>
##$CPDPRG1= <>
##$CPDPRG2= <>
##$CPDPRG3= <>
##$CPDPRG4= <mlev>
##$CPDPRG5= <mlev>
##$CPDPRG6= <mlev>
##$CPDPRG7= <mlev>
##$CPDPRG8= <mlev>
##$CPDPRGB= <>
##$CPDPRGT= <>
##$D= (0..31)
0 0.7 0 0 0 0 0 0 0 0 0 0.03 0 0 0 0 0 0 0 0 0 0 0 0 0 0 0 0 0 0 0 0 
##$DATE= 1741861249
##$DBL= (0..7)
120 120 120 120 120 120 120 120 
##$DBP= (0..7)
150 150 150 150 150 150 150 150 
##$DBP07= 0
##$DBPNAM0= <>
##$DBPNAM1= <>
##$DBPNAM2= <>
##$DBPNAM3= <>
##$DBPNAM4= <>
##$DBPNAM5= <>
##$DBPNAM6= <>
##$DBPNAM7= <>
##$DBPOAL= (0..7)
0.5 0.5 0.5 0.5 0.5 0.5 0.5 0.5 
##$DBPOFFS= (0..7)
0 0 0 0 0 0 0 0 
##$DE= 6
##$DECBNUC= <off>
##$DECIM= 32
##$DECNUC= <off>
##$DECSTAT= 4
##$DIGMOD= 1
##$DIGTYP= 9
##$DL= (0..7)
0 120 120 120 120 120 120 120 
##$DP= (0..7)
150 150 150 150 150 150 150 150 
##$DP07= 0
##$DPNAME0= <>
##$DPNAME1= <>
##$DPNAME2= <>
##$DPNAME3= <>
##$DPNAME4= <>
##$DPNAME5= <>
##$DPNAME6= <>
##$DPNAME7= <>
##$DPOAL= (0..7)
0.5 0.5 0.5 0.5 0.5 0.5 0.5 0.5 
##$DPOFFS= (0..7)
0 0 0 0 0 0 0 0 
##$DQDMODE= 0
##$DR= 18
##$DS= 0
##$DSLIST= <SSSSSSSSSSSSSSS>
$$ [...]
##$SUBNAM0= <"">
##$SUBNAM1= <"">
##$SUBNAM2= <"">
##$SUBNAM3= <"">
##$SUBNAM4= <"">
##$SUBNAM5= <"">
##$SUBNAM6= <"">
##$SUBNAM7= <"">
##$SUBNAM8= <"">
##$SUBNAM9= <"">
##$SW= 18.0517328524113
##$SWIBOX= (0..15)
0 0 2 0 0 0 0 0 0 0 0 0 0 0 0 0 
##$SW_h= 3612.71676300578
##$TD= 16384
##$TD0= 1
##$TE= 0
##$TE2= 300
##$TE3= 300
##$TEG= 300
##$TL= (0..7)
0 120 120 120 120 120 120 120 
##$TP= (0..7)
150 150 150 150 150 150 150 150 
##$TP07= 0
##$TPNAME0= <>
##$TPNAME1= <>
##$TPNAME2= <>
##$TPNAME3= <>
##$TPNAME4= <>
##$TPNAME5= <>
##$TPNAME6= <>
##$TPNAME7= <>
##$TPOAL= (0..7)
0.5 0.5 0.5 0.5 0.5 0.5 0.5 0.5 
##$TPOFFS= (0..7)
0 0 0 0 0 0 0 0 
##$TUNHIN= 0
##$TUNHOUT= 0
##$TUNXOUT= 0
##$USERA1= <user>
##$USERA2= <user>
##$USERA3= <user>
##$USERA4= <user>
##$USERA5= <user>
##$V9= 5
##$VALIST= <valist>
##$VCLIST= <CCCCCCCCCCCCCCC>
##$VD= 0
##$VDLIST= <DDDDDDDDDDDDDDD>
##$VPLIST= <PPPPPPPPPPPPPPP>
##$VTLIST= <TTTTTTTTTTTTTTT>
##$WBST= 1024
##$WBSW= 4
##$XGAIN= (0..3)
0 0 0 0 
##$XL= 0
##$YL= 0
##$YMAX_a= 620794
##$YMIN_a= -675882
##$ZGOPTNS= <>
##$ZL1= 120
##$ZL2= 120
##$ZL3= 120
##$ZL4= 120
##$ABSF1= 10
##$ABSF2= 0
##$ABSG= 5
##$ABSL= 3
##$ALPHA= 0
##$AQORDER= 0
##$ASSFAC= 0
##$ASSFACI= 0
##$ASSFACX= 0
##$ASSWID= 0
##$AUNMP= <proc_1d>
##$AZFE= 0.1
##$AZFW= 0.1
##$BCFW= 1
##$BC_mod= 2
##$BYTORDP= 1
##$COROFFS= 0
##$CY= -3
##$DATMOD= 1
##$DC= 2
##$DFILT= <>
##$DTYPP= 0
##$F1P= 0
##$F2P= 0
##$FCOR= 0.5
##$FTSIZE= 0
##$FT_mod= 4
##$GAMMA= 1
##$GB= 0.15
##$INTBC= 1
##$INTSCL= 1
##$ISEN= 128
##$LB= 0.25
##$LEV0= 0
##$LPBIN= 0
##$MAXI= 10000
##$MC2= 0
##$MEAN= 0
##$ME_mod= 0
##$MI= 1.114404
##$NCOEF= 0
##$NC_proc= 0
##$NLEV= 6
##$NOISF1= 3.799351
##$NOISF2= 2.8
##$NSP= 1
##$NTH_PI= 0
##$NZP= 0
##$OFFSET= 14.38212
##$PC= 1
##$PHC0= -467.5168
##$PHC1= 8.792211
##$PH_mod= 1
##$PKNL= yes
##$PPARMOD= 0
##$PSCAL= 0
##$PSIGN= 0
##$REVERSE= no
##$SF= 200.129724274929
##$SI= 16384
##$SIGF1= 3
##$SIGF2= 2
##$SINO= 400
##$SIOLD= 16384
##$SREGLST= <1H.CDCl3>
##$SSB= 0
##$STSI= 0
##$STSR= 0
##$SW_p= 3205.1282051282
##$SYMM= 0
##$S_DEV= 0
##$TDeff= 0
##$TDoff= 0
##$TI= <>
##$TILT= no
##$TM1= 0
##$TM2= 0
##$TOPLEV= 0
##$USERP1= <user>
##$USERP2= <user>
##$USERP3= <user>
##$USERP4= <user>
##$USERP5= <user>
##$WDW= 1
##$XDIM= 8192
##$YMAX_p= 0
##$YMIN_p= 0
$$ End of Bruker specific parameters
$$ ---------------------------------
##NTUPLES= NMR FID
##VAR_NAME=  TIME,          FID/REAL,        FID/IMAG
##SYMBOL=    X,             R,               I
##VAR_TYPE=  INDEPENDENT,   DEPENDENT,       DEPENDENT
##VAR_FORM=  AFFN,          ASDF,            ASDF
##VAR_DIM=   8192,          8192,            8192
##UNITS=     SECONDS,       ARBITRARY UNITS, ARBITRARY UNITS
##FACTOR=    0.0002768,     1,               1
##FIRST=     0,             0,               0
##LAST=      2.2672688,     0,               0
##MIN=       0,             -675882,         0
##MAX=       2.2672688,     620794,          0
$$ Real data points
##PAGE= N=1
##DATA TABLE= (X++(R..R)), XYDATA
$$ [...]
285 -61206 196912 94166 -179108 -126826 151118 140755 -141160 -168164 117228 182664 -98787
296 -98787 -196862 79425 211674 -48693 -213113 23308 213903 4958 -209905 -33028
306 -33028 205457 68911 -184123 -87918 171725 107453 -165144 -140789 136001 150108 -124978
317 -124978 -171153 103620 186899 -77673 -192677 56923 203464 -22501 -194875 2600
327 2600 195960 29247 -182018 -50104 175498 76648 -165943 -106130 142592 112621 -147692
338 -147692 -150790 116451 158652 -101261 -169627 86053 187341 -49815 -177889 38466 192763
349 192763 2590 -177332 -19999 178381 47885 -174894 -79633 157213 89934 -162326
359 -162326 -127130 133421 129788 -129186 -149738 108331 164225 -76075 -158840 63690 175862
370 175862 -24124 -166856 4206 171931 25495 -170296 -51982 162925 68284 -164602
380 -164602 -93391 151552 105692 -143411 -121942 126507 134491 -104141 -143085 79325 150467
391 150467 -54707 -161887 21839 162190 -464 -169773 -22041 175490 46477 -168473
401 -168473 -54502 175364 82299 -152233 -85507 144205 106020 -120847 -124260 86819 126349
412 126349 -75581 -157994 31997 150803 -29564 -174930 3712 178849 16336 -165573
422 -165573 -11153 180426 48003 -146394 -47059 143342 78577 -115177 -98875 89955
432 89955 112499 -84364 -151089 49719 148526 -55424 -173753 34324 170783 -26803 -166625
443 -166625 18945 167675 13834 -139773 -24181 136313 59998 -118452 -89573 104913
453 104913 114702 -97079 -134691 91288 148798 -84667 -153426 73933 149055 -61614 -145138
464 -145138 36330 131396 -16197 -133992 -26273 121119 51662 -124433 -82884 125458
474 125458 107128 -120252 -110940 129434 131258 -100612 -107777 105034 119243 -73874 -116575
485 -116575 38635 106045 -25568 -134736 -28224 122032 32641 -152814 -67926 150804
495 150804 79606 -144381 -72280 153267 94404 -114845 -74851 110140 97097 -66171 -94845
506 -94845 43870 108562 -26768 -140840 -13554 135662 6378 -165489 -29273 158974
516 158974 29841 -153732 -34176 142508 51572 -108077 -52700 93639 80452 -62922
526 -62922 -98157 45981 121982 -31331 -138482 26599 151925 -23463 -158750 15288
536 15288 149333 -10968 -138924 -4247 120535 21356 -107364 -53145 84319 73697 -79193
547 -79193 -104663 69407 124790 -64018 -133994 67299 147827 -47885 -127878 53110 131232
558 131232 -27427 -114711 4288 98091 12220 -102194 -51504 87367 64080 -102244 -97351
569 -97351 94791 104529 -96445 -109214 96785 118245 -72127 -101241 64567 107721 -27390
580 -27390 -92776 8039 96224 16018 -106510 -47235 102726 51985 -120565 -70067 120174
591 120174 73445 -119607 -78161 108388 81978 -86985 -82265 64641 90879 -34285 -96021
602 -96021 9303 105394 12599 -112054 -24251 121444 33532 -125161 -36670 124435 40694
613 40694 -114686 -43082 102666 52292 -85144 -69532 56575 77174 -43346 -101515 18610
624 18610 111127 -8842 -121718 3378 130611 7933 -119716 -1736 121643 15798
634 15798 -103396 -22218 91516 38259 -78130 -61154 60264 76163 -57580 -104597 39791
645 39791 109906 -40841 -121182 34350 121895 -23548 -109300 20621 107004 870 -88307
656 -88307 -12205 83039 35815 -75493 -58424 68499 74100 -69893 -91488 64761 96089
667 96089 -65384 -101951 55059 96543 -45470 -92189 30187 88918 -7804 -82166 -11104
678 -11104 84267 34312 -83803 -50599 88051 64607 -88587 -72362 86884 75491 -80453
689 -80453 -75612 68481 73807 -54082 -77260 31667 77826 -13920 -85076 -6047 91912 22915
701 22915 -96991 -33161 102491 43198 -98499 -45560 93529 50170 -81239 -53102 66000
712 66000 58063 -49890 -66887 32158 75465 -20424 -88895 6303 96270 1813 -102387 -8782
724 -8782 105051 16712 -98189 -21757 91289 31506 -77437 -40808 64926 52389 -53442
735 -53442 -66219 42179 77239 -35491 -89169 27796 94791 -23005 -98594 14876 96921
746 96921 -5012 -89668 -4594 84260 20779 -73050 -33358 66168 48585 -59573 -61889 53974
758 53974 70717 -51838 -80469 44603 81968 -39668 -84684 28921 83224 -17010 -80357
769 -80357 3409 79744 14787 -73265 -25228 74713 41030 -71063 -50885 68238 57093 -66069
781 -66069 -65778 57297 67104 -51697 -73448 37824 74581 -24842 -76223 11809 80125 4492
793 4492 -78339 -14318 80826 27308 -76795 -34140 75391 41333 -71253 -49548 61818
804 61818 53801 -55053 -61964 42969 66877 -31742 -72631 19914 76962 -8286 -78959 -1408
816 -1408 80141 10362 -79625 -19787 76414 27737 -72217 -35414 67489 45497 -59697 -52664
828 -52664 52661 62481 -41991 -67501 33333 73076 -23152 -77550 11180 76290 -4936 -79344
840 -79344 -8382 74771 15715 -73638 -25463 70583 36586 -62750 -41635 60715 54574 -49230
852 -49230 -58305 42503 64622 -32536 -69579 21203 70405 -14124 -75485 913 72455 4752
864 4752 -74315 -15275 72185 24770 -67678 -31344 65289 42409 -56251 -47637 50837 57224 -40774
877 -40774 -62805 31815 67216 -23249 -71251 14473 73502 -6559 -74313 -2465 72480 10165
889 10165 -71575 -20788 65180 28630 -61482 -39818 53017 47768 -46257 -55363 39866 63637
901 63637 -29869 -64502 26954 71057 -16101 -68345 11168 69880 -1488 -68451 -11075 61862
913 61862 16405 -64501 -33755 54818 39159 -53502 -49865 48993 57321 -40696 -57498 40439
925 40439 66018 -27102 -61267 23246 65221 -10865 -64191 -1192 61641 10168 -65449 -26712
937 -26712 58794 31147 -61540 -42850 55935 47459 -50465 -48750 46362 54208 -34672 -52212 27828
950 27828 57188 -14450 -58168 3665 61251 6527 -64356 -17317 65100 24108 -65784 -30752
962 -30752 60954 33764 -57634 -38423 48938 41147 -40007 -46248 29655 51713 -19688 -57842
974 -57842 10394 64868 -868 -66772 -3454 71392 11789 -67903 -14783 64611 20530 -57787
986 -57787 -27056 47034 30883 -41545 -42686 29712 48060 -25218 -57932 18574 64511 -12925
998 -12925 -66566 10577 69951 -2215 -62987 -754 59923 10579 -52237 -18872 44858 27886
1010 27886 -41527 -40186 34840 46485 -35494 -56080 31736 60210 -28513 -61785 24677 61561
1022 61561 -16323 -57285 8039 53706 4057 -49072 -15227 46780 26453 -45331 -36132 45334
1034 45334 43353 -44890 -47060 43577 49629 -39416 -49597 32176 48319 -22981 -48903 9577
1046 9577 46986 1548 -49636 -14294 50616 22983 -52019 -28026 54676 34345 -51817 -33835
1058 -33835 50788 36838 -42814 -37218 34085 39286 -24581 -44268 11437 46959 -3631 -54124
1070 -54124 -6863 56605 11474 -59988 -15447 60818 19409 -55632 -19682 51478 25265 -41215
1082 -41215 -28413 33014 35185 -23407 -42650 14602 48532 -9272 -55865 3746 58600 -2040
1094 -2040 -60276 -1474 57350 4826 -52733 -9800 46641 18259 -37734 -25495 32294 35629
1106 35629 -25845 -43029 21869 50038 -19895 -54021 17287 54916 -15657 -54758 11073 50781
1118 50781 -5461 -47603 -3576 43065 13627 -39369 -23662 37198 34188 -33883 -41248 33055
1130 33055 46400 -30493 -47363 27731 46797 -23462 -44892 16478 41843 -8707 -41083 -1610
1142 -1610 40599 11411 -41325 -21381 42467 29599 -42590 -34489 42356 37447 -38637 -37561 33796
1155 33796 37160 -26708 -37137 17636 37071 -9270 -39716 -235 42552 7554 -46622 -14321
1167 -14321 49115 19329 -49469 -22332 47966 25458 -42364 -26888 35856 29494 -26795 -32170
1179 -32170 18246 36124 -11126 -41142 3361 44851 650 -49492 -5399 50316 7758 -49744
1191 -49744 -10985 46524 15066 -39839 -18197 34399 25066 -25928 -29817 21153 36725 -15673
1203 -15673 -42734 12016 46126 -10367 -50108 5981 48259 -3557 -47403 -1539 43393 7663
1215 7663 -37721 -13702 34174 22862 -28432 -28442 26944 35875 -23959 -40528 21741 42710 -19749
1228 -19749 -44821 14999 42497 -10764 -41664 2991 38557 4711 -35701 -12137 34680 20494
1240 20494 -32627 -25937 32142 30939 -31183 -34079 29157 35618 -25723 -36628 20984 37035 -13841
1253 -13841 -36976 6593 37660 1524 -37770 -8955 38438 14820 -39183 -20555 37726 22562
1265 22562 -37486 -26292 33601 27821 -29344 -29688 23793 32992 -15215 -33974 9754 38240 -1808
1278 -1808 -39184 -3433 40611 7734 -41627 -12594 39086 14214 -38264 -18733 33581 20933
1290 20933 -29239 -25313 24558 30139 -18154 -33184 13944 37905 -7904 -39250 4213 41037
1302 41037 -32 -41044 -3827 39418 7337 -37601 -12096 34348 16505 -31171 -21609 27114
1314 27114 26594 -24085 -32015 19418 34883 -15871 -37397 11247 38707 -6709 -37623 2795
1326 2795 37832 3454 -34995 -7030 34312 13621 -31974 -18542 29192 22992 -27529 -28773
1338 -28773 22457 29755 -21265 -34598 15313 34466 -11094 -34960 7406 36872 -300 -34014
1350 -34014 -2148 35883 9309 -33286 -12976 33141 17561 -31852 -23454 26741 24708 -25649
1362 -25649 -30168 19321 30486 -16043 -33034 11156 34447 -5402 -33781 2414 35742 3993
1374 3993 -33736 -7146 33870 12659 -31982 -17324 28895 21074 -26720 -25678 22016 27424 -18836
1387 -18836 -30690 14860 31543 -11169 -32867 6688 33466 -2243 -33472 -2066 33306 7542
1399 7542 -32155 -11891 31445 17058 -28670 -20738 26869 24474 -23561 -26476 19836 28196 -16532
1412 -16532 -30111 10987 30038 -7511 -32151 1392 32173 3274 -32228 -8032 32650 13335
1424 13335 -30203 -16027 29379 20143 -25671 -21810 23059 24164 -19124 -26240 14199 27427 -10074
1437 -10074 -30375 4877 31549 -955 -33027 -3554 33836 7285 -32649 -9885 31454 13832
1449 13832 -28068 -16542 25117 19416 -21172 -22811 16649 25471 -13440 -28852 9435 31396
1461 31396 -6188 -33043 3033 33743 806 -32850 -3958 30890 7587 -28203 -11812 24529
1473 24529 15691 -21809 -20357 18773 24309 -15824 -27144 14133 30202 -11278 -30960 9020
1485 9020 31649 -5328 -30528 1111 28503 3117 -27393 -8940 24476 12775 -23943 -17895
1497 -17895 22365 21518 -20956 -24559 20177 26743 -17194 -26971 15082 27958 -10164 -27079 4735
1510 4735 26540 399 -26558 -6568 25871 10859 -26103 -15267 25494 17737 -25330 -20079
1522 -20079 23711 21170 -20569 -22192 17256 23515 -11525 -23896 6468 25429 -792 -26655
1534 -26655 -3933 27641 7329 -29070 -10158 28679 11504 -28270 -13431 25920 14831 -22115
1546 -22115 -16829 18099 19953 -12842 -22368 8414 25758 -4290 -28079 836 29909 1533
1558 1533 -30569 -3725 29346 5028 -27579 -7760 24600 10350 -21387 -13672 17663 18208 -13873
1571 -13873 -22430 10923 26011 -8155 -28234 6256 29576 -4565 -29191 2564 27664 -336
1583 -336 -25196 -3784 22720 7355 -20590 -12197 18314 17248 -16908 -21130 15986 24844 -14336
1596 -14336 -26242 13404 26563 -10491 -25429 7745 24564 -3505 -22934 -1623 21397 6122
1608 6122 -21405 -11606 20596 15382 -21398 -18971 20643 20662 -19055 -21454 16963 21880 -13117 -20665
1622 -20665 9802 21482 -4318 -21228 -489 22212 4759 -23605 -9339 23797 11468 -25344
1634 -25344 -14392 23339 14816 -22173 -15565 19230 16853 -14625 -17072 11059 19757 -5838 -21161
1647 -21161 2618 23669 1189 -25676 -4096 26471 5438 -27160 -7688 24711 9050 -21919
1659 -21919 -11288 18159 13438 -13880 -15789 11106 19282 -7297 -21750 5339 24472 -3304
1671 -3304 -26145 1330 26337 -273 -25774 -2400 23619 5105 -20715 -7967 17841 11843
1683 11843 -15045 -15490 12541 18540 -11547 -21496 10056 23493 -9185 -24303 7563 24363 -4944
1696 -4944 -22886 2180 21665 2716 -19305 -6376 18351 11057 -17044 -14695 15952 16954 -15679
1709 -15679 -19368 14178 19871 -13187 -20668 10613 20416 -7303 -19962 3525 20080 994 -19212
1722 -19212 -4849 19983 9102 -19660 -11846 19536 13517 -19024 -15271 17894 16149 -15594 -16661
1735 -16661 12462 17382 -8987 -18391 5075 19381 -1217 -20687 -2599 21262 5374 -21867
1747 -21867 -7454 21747 9041 -20415 -10084 18971 12052 -15810 -13255 13220 15321 -9709
1759 -9709 -17815 6448 19338 -3729 -21570 396 21857 988 -22761 -2998 21884 4946
1771 4946 -20000 -5989 18963 8951 -15656 -10458 14164 14226 -11687 -16651 9767 18802 -8020
1784 -8020 -21141 4981 20871 -4128 -21444 1274 20348 559 -19027 -3349 18321 6748
1796 6748 -16096 -8924 15599 12895 -13752 -15207 12374 17078 -11147 -18865 8563 18804 -6921
1809 -6921 -19542 3857 18465 -1344 -18239 -2033 17730 4832 -17260 -7826 16792 10563
1821 10563 -15975 -12412 15307 14523 -13604 -15862 11729 16500 -9146 -17274 6383 17473 -3519
1834 -3519 -17939 669 18212 2029 -18541 -4757 18323 6894 -18024 -9253 16846 11331
1846 11331 -15095 -12810 13088 14389 -10304 -15476 8124 16495 -5174 -17534 3189 18075 -871
1859 -871 -18616 -1886 18282 3826 -17965 -6312 17243 8553 -15812 -9965 14341 12403 -11939
1872 -11939 -13682 9962 15083 -7810 -16358 5969 17152 -3619 -17678 1719 17900 791
1884 791 -17898 -2808 17488 5465 -16513 -8100 15322 10144 -14056 -11916 12021 13334 -9954
1897 -9954 -14787 7955 15691 -6268 -16399 3983 16981 -1574 -17431 -570 17682 3475
1909 3475 -17056 -5605 16492 7671 -14841 -9773 13587 11159 -11756 -12704 9940 13918 -8179
1922 -8179 -14822 6021 16271 -3980 -16675 1776 17624 443 -16865 -2291 16924 4983
1934 4983 -15959 -6300 14035 8613 -12994 -10594 11063 11804 -9849 -13989 8234 14905 -6572
1947 -6572 -16026 4427 16612 -2438 -16340 232 16335 2121 -15302 -4478 14300 6714
1959 6714 -13652 -8660 12346 10444 -11733 -12054 10364 13727 -9099 -14426 7217 14854 -5246
1972 -5246 -15274 3272 15445 -312 -14913 -2222 14686 4575 -14416 -6799 13882 8503
1984 8503 -13324 -9922 12376 10820 -11447 -12212 9225 12843 -7035 -13345 4505 14189 -1907
1997 -1907 -14427 -623 15042 2971 -14899 -4530 15053 6034 -14653 -7207 13249 8381 -12038
2010 -12038 -9656 10240 10736 -8196 -12246 5867 13564 -3577 -14438 1723 15451 264 -15566
2023 -15566 -1057 15370 2427 -14696 -3750 13683 5558 -12284 -7340 10701 8901 -8988
2035 -8988 -11398 6722 12925 -5609 -14315 4033 14998 -2639 -14970 1770 14927 357 -13886
2048 -13886 -1529 13227 3769 -11888 -5940 10665 8243 -9862 -10511 8933 12136 -8091 -13432
2061 -13432 6900 13856 -5569 -13579 4145 13288 -2093 -12381 234 12301 1928 -12010
2073 -12010 -4516 11080 6579 -11533 -8764 10540 10016 -10484 -11139 9340 11487 -7866 -11464 6078
2087 6078 11610 -3368 -11235 1254 12136 1213 -12211 -3648 12526 5350 -13201 -6700 12477
2100 12477 7196 -12083 -8310 10284 8651 -8341 -9667 6486 10046 -4308 -11017 2310 11994
2113 11994 -665 -12907 -1055 13569 2038 -13652 -3191 13281 4200 -12499 -4888 10574
2125 10574 6415 -8763 -7810 7127 9157 -5339 -10439 3650 12275 -2781 -13163 1769 13148
2138 13148 -866 -13207 -385 12787 1904 -11601 -3329 10244 5110 -8722 -7003 7988
2150 7988 8719 -6716 -10361 5905 11381 -5583 -12031 4303 12283 -3441 -11971 2031 11303 -354
2164 -354 -10734 -2120 10133 3894 -9459 -6147 9374 7666 -8776 -8818 8690 9643 -7741 -9823
2178 -9823 7327 10318 -5546 -10100 3124 10397 -1264 -10091 -1297 10578 2874 -10658 -4839
2191 -4839 10755 6248 -10329 -6935 9880 7672 -9100 -7819 7908 8358 -5989 -8859 4191
2204 4191 9870 -2294 -10225 133 10915 960 -11410 -2818 11456 3142 -11236 -4077 10753
2217 10753 4952 -9310 -5735 8358 7090 -6249 -7656 5050 9099 -3483 -10610 2118 11016
2230 11016 -919 -11549 -66 11351 794 -11074 -1839 9948 3004 -9149 -4388 8203
2242 8203 5994 -6987 -7396 6189 8728 -4924 -10150 4387 10662 -3441 -10827 2485 10830 -1178
2256 -1178 -10197 35 9656 1031 -9238 -3081 8714 4462 -8335 -6363 7725 7641 -6897 -8718
2270 -8718 6292 9315 -5628 -9181 4076 9500 -2567 -9312 1139 9122 622 -8889 -2249 9262
2284 9262 3336 -9309 -4952 8944 5896 -8529 -7041 7516 7617 -6369 -7609 5004 8305 -3700
2298 -3700 -8562 2292 8708 -692 -9237 -928 9803 1843 -9446 -3082 9407 4004 -9197 -4531
2312 -4531 8297 5494 -6903 -6372 5709 7022 -4748 -7885 3189 8479 -2165 -9689 834
2325 834 9312 -148 -9787 -1491 9546 2414 -9179 -3151 8347 4589 -7451 -5267 6273 6482
2339 6482 -5319 -7557 4418 8225 -3681 -8817 2430 9001 -1659 -9149 568 9316 402 -8946
2353 -8946 -1817 8568 2901 -7884 -4290 7040 5365 -6315 -6247 5624 6913 -5026 -7880 4118
2367 4118 7953 -3351 -8529 1963 8748 -895 -8385 -695 8452 1939 -8057 -2937 7525 4293
2381 4293 -7180 -5049 6526 5733 -5764 -6720 4980 7031 -4040 -7652 2892 8076 -1896 -8276
2395 -8276 533 8146 577 -8089 -1581 8086 2823 -7647 -3564 7014 4407 -6371 -5230 5628
2409 5628 5818 -4920 -6658 4158 6847 -3104 -7572 1904 7515 -1031 -7752 -228 7793 1288 -7366
2424 -7366 -2174 7078 3407 -6666 -4206 6081 4932 -5713 -5557 4804 5968 -3799 -6614 3225
2438 3225 7167 -2032 -7475 1104 7230 77 -7211 -890 7153 1970 -6946 -2831 6846 3359 -6233
2453 -6233 -4211 5327 5032 -5195 -5534 4016 6036 -3020 -6539 2209 6982 -1028 -7097 335 7193
2468 7193 748 -7086 -1305 6880 2121 -6424 -2995 5761 3584 -5219 -4580 4389 5074 -3689 -5898
2483 -5898 2881 6459 -2117 -6633 1269 6779 -802 -6425 -418 6670 739 -6147 -1791 5682 2486
2498 2486 -5260 -3318 5004 4230 -4335 -4974 3709 5485 -3326 -5827 2425 5938 -1596 -5991 1170
2513 1170 6013 -66 -5459 -774 5815 1717 -5588 -2503 5184 3428 -5088 -4137 4615 4475 -4034
2528 -4034 -5171 3479 5286 -2763 -5284 1970 5333 -1065 -5668 87 5395 733 -5820 -1604 5952
2543 5952 2362 -5529 -2974 5270 3164 -4831 -3631 4109 4201 -3422 -4005 2709 4422 -1687 -5154 777
2559 777 5505 -234 -5771 -419 5928 974 -5826 -1576 5135 1869 -4972 -2675 4249 3160 -3506
2574 -3506 -3811 3183 4000 -2207 -4584 1664 5487 -973 -5248 600 5567 -354 -5682 -259 5070
2589 5070 821 -4816 -1367 4378 2157 -3991 -2944 3345 3393 -3119 -4663 2968 4715 -2619 -4712
2604 -4712 2208 5160 -1478 -4734 627 4799 43 -4469 -886 4294 1662 -4226 -2280 3965 2975
2619 2975 -4138 -3484 3590 3889 -3142 -3767 2838 4304 -2076 -4194 1422 4267 -828 -4436 -452 4382
2635 4382 822 -4874 -1665 4210 1731 -4553 -2237 4162 2477 -4051 -2593 3090 3041 -2447 -3543
2650 -3543 1872 3995 -879 -4518 431 4490 201 -4380 -569 4642 746 -4908 -1152 4222 1560
2665 1560 -4076 -2031 3124 2628 -2681 -3187 2313 3969 -1716 -4361 1495 4599 -1017 -4649 606
2680 606 4553 -567 -4621 -130 4051 604 -3950 -1324 3412 2091 -2962 -3018 3105 3289 -2833 -3829
2696 -3829 2428 3794 -2036 -3861 1893 3967 -1407 -4121 460 3780 81 -3666 -859 3730 1241
2711 1241 -3441 -2120 3671 2657 -3439 -2888 3265 3085 -2699 -3411 2312 3309 -1605 -3638 766 3535
2727 3535 -448 -4013 -234 3675 959 -4167 -1544 4046 1649 -3942 -2166 3757 2356 -3086 -2491
2742 -2491 2803 2830 -1997 -2776 1463 3402 -870 -3800 419 3962 102 -4428 -699 4030 1063 -3795
2758 -3795 -1174 3671 1949 -3000 -1889 2778 2583 -2281 -2608 1716 3239 -1577 -3539 1013 3954
2773 3954 -843 -3867 192 3935 177 -3711 -575 2956 1455 -2963 -1665 2733 2150 -2522 -2403
2788 -2403 2265 2865 -2027 -3273 1847 3103 -1352 -3421 944 3478 -596 -3373 -57 3182 682
2803 682 -3039 -870 2780 1677 -2883 -1834 3069 2350 -2536 -2444 2144 2552 -2055 -2706 1113 2632
2819 2632 -1067 -3117 459 2795 299 -3143 -479 3234 861 -3110 -1269 3110 1604 -2880 -1860
2834 -1860 2450 1654 -2317 -2174 1905 2242 -1247 -2762 1045 2948 -306 -2872 305 2940 267 -2939
2850 -2939 -394 2893 706 -2995 -846 2382 1571 -2334 -1747 1947 2067 -1639 -2495 1335 2289 -936
2866 -936 -2903 617 2769 -466 -2908 234 2603 214 -2533 -662 2518 1020 -2201 -1674 2161
2881 2161 1895 -2030 -1998 1646 1860 -1501 -2398 1274 2470 -801 -2468 428 2463 -500 -2351 91
2897 91 2353 458 -2340 -890 2234 1049 -2092 -1286 2014 1678 -1877 -1943 1256 1846 -1577 -2135 801
2914 801 1845 -857 -2399 377 2074 142 -2340 -328 2584 400 -2129 -787 2198 975 -2109
2929 -2109 -1625 1469 1529 -1725 -1727 1187 1763 -1159 -1899 846 2059 -513 -1891 336 2197 -180 -2131
2946 -2131 -276 2138 608 -1977 -974 1762 1158 -1865 -1277 1546 1216 -1432 -1753 1103 1950 -980
2962 -980 -1924 540 2034 -350 -1981 421 2256 -29 -1918 -234 2062 634 -2073 -741 1552
2977 1552 1074 -1553 -1153 1296 1677 -1143 -1584 1107 1528 -729 -1739 794 1827 -301 -2061 252
2993 252 1920 22 -1977 -217 1907 597 -1638 -725 1758 683 -1384 -1175 1274 1468 -1088 -1419
3009 -1419 1160 1677 -863 -1565 662 1885 -332 -1827 120 1585 44 -1808 -381 1573 359
3024 359 -1796 -874 1760 1219 -1405 -1192 1508 1313 -1193 -1175 833 1476 -731 -1496 429 1463 43
3041 43 -1500 184 1775 264 -1851 -462 1740 638 -1809 -515 1529 1224 -1320 -1296 1121 1251
3057 1251 -916 -1493 674 1779 -509 -1674 240 2050 -246 -1548 110 2016 130 -1704 -355
3072 -355 1816 778 -1451 -1064 1226 965 -1068 -1030 887 1490 -870 -1736 635 1484 -293 -1741 550
3089 550 1743 -148 -1586 -96 1516 275 -1719 -645 1583 938 -1371 -1103 1206 998 -973 -1297
3105 -1297 982 1492 -819 -1367 578 1541 -409 -1833 47 1585 149 -1541 -283 1592 313 -1293
3121 -1293 -695 1518 948 -1270 -1150 1262 1147 -1354 -1060 1034 1240 -736 -1645 325 1704 -167 -1592
3138 -1592 48 1686 211 -1810 -346 1487 460 -1642 -715 1346 990 -1278 -1000 1201 1023 -998
3154 -998 -1403 214 1287 -602 -1809 517 1372 -134 -1657 -58 1626 62 -1350 -507 1329 503
3170 503 -1159 -667 1496 862 -1134 -1048 960 1287 -866 -1527 481 1673 -638 -1509 464 1292 -132
3187 -132 -1397 -250 1212 407 -1059 -544 1061 661 -1139 -809 929 888 -920 -983 735 1311 -625
3204 -625 -1347 465 1099 -580 -1177 204 1308 113 -1214 -365 1315 641 -1278 -712 1136 590 -970
3221 -970 -1040 1095 766 -585 -918 536 775 -542 -941 297 956 -114 -1262 0 1223 210 -1087
3238 -1087 -227 1363 203 -960 -447 1192 433 -1356 -557 908 1068 -655 -873 510 906 -204 -945
3255 -945 207 1111 -322 -1328 123 1075 106 -1256 -141 1045 199 -946 -453 902 209 -761 -297
3272 -297 706 756 -870 -877 874 902 -611 -725 648 899 -593 -1224 186 675 -42 -1004 -127 947 280
3291 280 -1215 -422 1234 357 -677 -640 926 446 -963 -685 674 647 -634 -810 501 628 -430 -836
3309 -836 106 1127 -127 -777 28 849 299 -1169 -439 1130 396 -687 -273 716 423 -596 -484 503
3327 503 684 -598 -1109 308 902 -392 -1161 209 1036 -65 -895 175 839 -74 -820 -298 793 179
3345 179 -946 -456 902 540 -641 -450 814 758 -722 -1071 686 886 -423 -1030 356 1098 -183
3362 -183 -929 60 1496 -215 -1217 -357 961 251 -743 -713 998 435 -821 -410 832 710 -420 -843
3380 -843 641 1020 -549 -1152 637 975 -121 -1287 145 983 -159 -1397 -89 1226 199 -1127
3396 -1127 -512 1028 601 -983 -812 991 768 -813 -1070 437 688 -368 -1115 310 994 -338 -1365
3413 -1365 342 980 -103 -1397 -346 1145 447 -883 -469 981 718 -1028 -782 730 1232 -865
3429 -865 -865 1101 1059 -480 -1260 623 1229 -182 -1294 112 1298 366 -1231 -302 1185 310 -1441 -547
3447 -547 933 561 -1129 -939 895 917 -1023 -1128 534 1353 -642 -1247 485 1399 -114 -1309 87
3464 87 1508 137 -1224 -299 1412 609 -1564 -784 1181 1279 -1089 -1029 970 1408 -871 -1415 593 1277
3482 1277 -728 -1247 266 1488 -161 -1504 -215 1281 296 -1556 -522 1285 600 -1073 -976 1087
3498 1087 1108 -1000 -1118 915 1144 -698 -1452 267 1577 -583 -1628 4 1376 -82 -1483 88
3514 88 1510 288 -1579 -430 1582 682 -1367 -941 1054 744 -1006 -1203 1091 1455 -785 -1484 429
3531 429 1669 -392 -1656 121 1746 -7 -1628 -427 1326 485 -1266 -664 1356 889 -875 -1101
3547 -1101 1251 1165 -856 -1433 928 1409 -345 -1539 184 1457 -137 -1306 -165 1703 357 -1692
3563 -1692 -667 1586 491 -1378 -1021 1159 1193 -1278 -1189 998 1060 -796 -1439 653 1686 -425 -1421
3580 -1421 221 1811 75 -1691 -290 1311 449 -1595 -674 1665 755 -1418 -719 1327 1130 -971
3596 -971 -1437 814 1317 -715 -1393 586 1709 -423 -1743 -76 1706 148 -1747 -596 1610 576
3612 576 -1632 -830 1294 967 -1282 -1051 989 1289 -1040 -1681 588 1590 -618 -1802 356 1744
3628 1744 -472 -1481 171 1418 84 -1362 -469 1467 917 -1275 -871 1341 1372 -1120 -1316 1054
3644 1054 1477 -1325 -1849 790 1692 -620 -1686 306 1546 -83 -1652 -220 1438 399 -1570 -476
3660 -476 1645 1074 -1175 -984 1241 1190 -1243 -1404 944 1415 -1084 -1535 788 1729 -360 -1768 287
3677 287 1918 411 -1573 -434 1829 674 -1908 -547 1700 888 -1532 -1064 1273 1367 -1105 -1380
3693 -1380 925 1657 -841 -1860 367 1894 -215 -2071 -144 2036 62 -1851 -467 1827 494
3708 494 -1762 -992 1529 1159 -1300 -1183 994 1384 -1129 -1748 401 2034 -499 -2057 489 1935
3724 1935 -107 -2163 -88 2264 377 -2067 -408 1953 1005 -1646 -1221 1611 1556 -1617 -1865 925
3740 925 1653 -721 -2052 757 1976 -686 -2137 269 2010 217 -1891 -392 1885 479 -1850
3755 -1850 -959 1753 1167 -1883 -1578 1616 1547 -1432 -1942 1058 1742 -901 -2149 871 2026 -142 -1806
3772 -1806 -198 2103 309 -2049 -606 1945 785 -1816 -1167 1827 1469 -1515 -1580 1207 1759 -1146
3788 -1146 -1747 760 2114 -420 -2006 131 2243 -30 -2227 -328 2151 493 -2077 -579 1961
3803 1961 1064 -1752 -1352 1589 1498 -1421 -1703 997 1960 -898 -2366 660 2222 -445 -2529 -123
3819 -123 2465 210 -1899 -530 2261 1165 -1829 -939 1699 1264 -1631 -1594 1504 1689 -1125 -1993 663
3836 663 2231 -592 -2330 242 2294 -291 -2595 4 2248 414 -2207 -815 2152 1116 -1840
3851 -1840 -1503 1785 1664 -1873 -2119 1287 2133 -1123 -2275 609 2109 -337 -2180 224 2229 306
3867 306 -2295 -676 2470 784 -2285 -1137 2088 1187 -1884 -1904 1636 1751 -1688 -2252 813 2292
3883 2292 -644 -2397 439 2551 113 -2321 -106 2299 488 -2180 -894 2290 934 -1991 -1263
3898 -1263 1820 1886 -1761 -1752 1281 2298 -898 -2149 660 2290 -190 -2557 63 2613 123 -2533
3914 -2533 -427 2376 638 -2232 -1172 2278 1140 -1777 -1857 1613 1812 -1522 -2353 1137 2207 -885
3930 -885 -2256 646 2352 -147 -2350 -4 2532 625 -2616 -930 2448 1351 -1855 -1588 1910
3945 1910 1807 -1510 -2254 1383 2204 -1288 -2578 630 2524 -531 -2515 184 2685 156 -2334 -519
3961 -519 2445 804 -2422 -1180 2280 1827 -1975 -1558 1723 1900 -1398 -2402 1030 2409 -909 -2365
3977 -2365 637 2595 -178 -2796 -257 2424 334 -2231 -713 2283 1109 -2135 -1430 2001 1891
3992 1891 -1657 -2084 1601 2364 -1118 -2459 670 2641 -484 -2460 243 2346 272 -2408 -426
4007 -426 2332 768 -2394 -1482 2144 1455 -2167 -1587 1800 1836 -1550 -2332 1199 2413 -821 -2520 565
4024 565 2513 -122 -2718 34 2467 450 -2500 -1034 2325 984 -1925 -1329 1997 1781 -2113 -2019
4040 -2019 1557 1723 -1299 -2361 942 2538 -319 -2493 394 2540 92 -2388 -457 2389 895
4055 895 -2523 -1281 2141 1267 -2182 -1798 1995 1865 -1716 -2221 1286 2507 -754 -2586 592 2590
4071 2590 -211 -2576 -479 2532 475 -2421 -876 2331 1195 -2144 -1654 1995 1886 -1752 -1964 1468
4087 1468 2166 -1489 -2426 813 2319 -576 -2566 324 2465 -6 -2324 -576 2431 731 -1986
4102 -1986 -1166 2261 1438 -1971 -1840 1897 2030 -1552 -2076 1344 2173 -884 -2344 431 2419 -227
4118 -227 -2560 -1 2329 197 -2177 -730 2540 1148 -2361 -1548 1944 1764 -1886 -1923 1411 2271
4134 2271 -1396 -2240 869 2605 -429 -2450 229 2382 135 -2712 -381 2592 1029 -2451 -989
4149 -989 2125 1454 -2026 -1484 1857 1963 -1579 -1918 1064 2265 -746 -2397 469 2539 -293 -2677
4165 -2677 127 2756 386 -2534 -615 2766 848 -2172 -1345 1822 1418 -1470 -1910 1319 1820 -1023
4181 -1023 -2001 799 2479 -601 -2484 379 2624 -117 -2680 -423 2365 800 -2343 -1052 2137
4196 2137 1246 -2029 -1801 1876 1801 -1695 -2155 1487 2468 -1082 -2408 720 2648 -258 -2431 -208
4212 -208 2609 428 -2498 -484 1995 1089 -2251 -1410 2201 1914 -1632 -1966 1745 2060 -1423 -2324 1231
4229 1231 2449 -669 -2565 467 2497 119 -2555 -588 2502 994 -2282 -1231 2102 1263 -2152
4244 -2152 -1524 1900 2117 -1474 -2156 1502 2277 -881 -2121 496 2531 -164 -2454 -61 2648 748
4260 748 -2480 -1041 2390 1010 -2256 -1473 2305 1430 -1738 -1747 1616 2052 -1322 -2235 1046 2398 -256
4277 -256 -2521 438 2446 -20 -2765 -328 2457 565 -2293 -1035 2264 1267 -1890 -1406 1677 1726
4293 1726 -1441 -2074 1253 2474 -982 -2573 719 2586 -413 -2595 228 2756 516 -2612 -714
4308 -714 2516 1081 -2274 -1321 2121 1786 -1815 -1816 1549 2037 -1370 -2499 1135 2076 -466 -2368 246
4325 246 2703 -348 -2438 -210 2453 691 -2339 -1270 1953 1342 -1955 -1622 1989 2065 -1887 -2234
4341 -2234 1313 2263 -1200 -2544 917 2570 -576 -2531 -45 2643 401 -2281 -630 2606 916
4356 916 -2599 -1471 2186 1911 -1901 -1771 1818 2052 -1244 -2113 995 2405 -670 -2537 245 2696
4372 2696 224 -2498 -125 2651 547 -2565 -728 2377 1379 -2123 -1282 2069 1820 -1649 -2130 1456
4388 1456 2051 -837 -2647 820 2570 -345 -2822 1 2739 364 -2729 -586 2615 851 -2258
4403 -2258 -1358 2110 1596 -1867 -1847 1498 1910 -1258 -2231 1029 2337 -582 -2382 796 2655 -267
4419 -267 -2412 -261 2596 551 -2325 -840 2192 1541 -1903 -1602 2175 1926 -1709 -2248 1323 2408
4435 2408 -1142 -2500 676 2605 -521 -2908 -134 2786 366 -2764 -865 2595 1128 -2330 -1402
4450 -1402 2404 1665 -2041 -1938 1329 2048 -1666 -2325 980 2242 -772 -2493 275 2629 -13 -2570
4466 -2570 -600 2576 801 -2539 -1210 2544 1413 -2309 -1975 1805 1976 -1546 -2106 1393 2437 -1096
4482 -1096 -2384 1107 2466 -168 -2832 117 2642 282 -2630 -792 2468 1108 -2506 -1314 2241
4497 2241 1609 -2123 -2086 1726 2216 -1621 -2426 1369 2437 -726 -2417 511 2819 235 -2565 -237
4513 -237 2449 625 -2239 -971 2522 1248 -2028 -1627 1976 1841 -1487 -2137 1370 2382 -953 -2602
4529 -2602 490 2547 -280 -2540 10 2728 105 -2814 -751 2524 1208 -2250 -1234 1931 1496
4544 1496 -2108 -1648 1665 2162 -1559 -2226 1148 2507 -695 -2818 408 2603 61 -2437 -278 2488
4560 2488 473 -2516 -1182 2377 1293 -2029 -1544 1978 1987 -1781 -2058 1443 2207 -981 -2598 975
4576 975 2707 -317 -2396 9 2719 572 -2315 -673 2524 1258 -2199 -1702 1968 1521 -1921 -2185
4592 -2185 1710 1968 -1583 -2017 1082 2646 -876 -2568 373 2595 31 -2570 -355 2435 647
4607 647 -2343 -1254 2632 1343 -2152 -1668 2029 1845 -1728 -2355 1211 2170 -1290 -2295 982 2445
4623 2445 -177 -2411 111 2445 216 -2454 -620 2738 956 -2468 -1486 2160 1568 -2091 -1920 1611
4639 1611 2404 -1700 -2332 1007 2284 -548 -2674 608 2514 -62 -2529 -48 2522 611 -2500
4654 -2500 -893 2244 1378 -2376 -1556 1679 1892 -1777 -2066 1385 2500 -870 -2435 1069 2697 -372
4670 -372 -2729 96 2658 -44 -2796 -459 2569 743 -2256 -1067 2035 1267 -2147 -1894 1843 1978
4686 1978 -1542 -2418 1107 2596 -1016 -2514 488 2520 -294 -2620 -202 2686 404 -2346 -619
4701 -619 2254 1326 -2300 -1313 2030 1763 -1713 -2219 1740 2172 -1433 -2326 1088 2426 -977 -2333 121
4718 121 2384 130 -2704 -720 2366 940 -2358 -1205 2450 1209 -2048 -1674 1731 1774 -1752 -2349
4734 -2349 1360 2349 -807 -2238 796 2577 -75 -2593 -135 2563 565 -2943 -803 2498 956
4749 956 -2211 -1134 2249 1424 -2166 -2125 1687 2148 -950 -2148 1037 2624 -515 -2407 263 2839
4765 2839 346 -3011 -311 2791 610 -2696 -805 2464 1346 -2276 -1456 2060 2116 -1564 -2199 1499
4781 1499 2399 -1121 -2439 823 2782 -288 -3255 144 2696 329 -2535 -555 2478 1058 -2429
4796 -2429 -1484 2229 1746 -1660 -2126 1966 2173 -1525 -2565 954 2491 -787 -2745 377 2414 134
4812 134 -2646 -139 2549 746 -2603 -1171 2563 1161 -2275 -1844 2192 1721 -1965 -2133 1859 2318
4828 2318 -1062 -2297 755 2484 -637 -2867 -113 2567 322 -2918 -959 2753 1400 -2594 -1500
4843 -1500 2367 1645 -1919 -1856 1756 2083 -1507 -2359 1398 2625 -747 -2705 720 2764 151 -2718
4859 -2718 -407 2687 555 -2714 -954 2462 1282 -2281 -1669 2266 2017 -1882 -2217 1695 2468 -1152
4875 -1152 -2892 951 2809 -495 -3152 217 2520 -109 -2796 -841 2499 703 -2574 -1165 2381
4890 2381 1923 -2135 -2186 1874 2092 -1485 -2550 1307 2652 -860 -2874 535 2613 306 -2652 -165
4906 -165 2701 650 -2504 -921 2498 1483 -2203 -1658 2211 2033 -1896 -2297 1626 2582 -1623 -2375
4922 -2375 1058 2628 -615 -2763 101 2562 90 -2951 -602 2248 1086 -2470 -1425 2256 1710
4937 1710 -1990 -2004 1998 2334 -1573 -2195 1167 2492 -930 -2405 236 2801 -48 -2761 -291 2641
4953 2641 883 -2931 -737 2443 1514 -2626 -1634 2161 1899 -2023 -2238 1240 2365 -1444 -2627 969
4969 969 2739 -409 -2529 9 2749 189 -2986 -599 2699 1004 -2632 -1106 2370 1646 -2040
4984 -2040 -1641 1707 2241 -1618 -2471 1535 2626 -717 -2426 571 2797 -444 -2719 -120 2816 513
5000 513 -2804 -677 2314 1326 -2212 -1242 2448 1807 -1770 -2048 1781 2239 -1327 -2472 1113 2502
5016 2502 -491 -2803 348 2722 161 -2726 -686 2367 841 -2549 -1206 2287 1634 -1831 -1502
5031 -1502 2219 1875 -1633 -2326 1168 2251 -1002 -2748 602 2863 -487 -2744 63 2740 394
5046 394 -2691 -1096 2660 973 -2375 -1385 1902 1980 -1796 -1999 1930 2180 -1247 -2549 1058 2463
5062 2463 -859 -2492 274 2700 -6 -2621 -296 2467 875 -2318 -993 2317 1246 -2178 -1740
5077 -1740 2103 2016 -1865 -2137 1282 2238 -821 -2311 666 2372 -482 -2276 98 2637 156 -2617
5093 -2617 -641 2500 1224 -2397 -1355 2188 1703 -2022 -1690 1653 2034 -1196 -2374 1124 2192 -908
5109 -908 -2524 420 2683 -311 -2836 -338 2687 537 -2329 -793 2481 1223 -2110 -1503 1824
5124 1824 1651 -1501 -2268 1380 1946 -1373 -2432 485 2644 -326 -2673 -200 2351 121 -2150 -554
5140 -554 2346 1066 -2362 -1454 2123 1421 -1907 -1704 1663 1916 -1635 -2407 1253 2380 -411 -2742
5156 -2742 497 2410 -301 -2674 97 2646 347 -2337 -706 2409 1011 -2127 -1386 1933 1627
5171 1627 -1491 -1905 1517 2264 -1344 -2461 865 2066 -358 -2047 359 2442 228 -2387 -207
5186 -207 2480 804 -2271 -1182 2086 1390 -2092 -1547 1994 1768 -1508 -2254 1486 2166 -911 -2029
5202 -2029 677 2211 -238 -2546 109 2651 130 -2674 -403 2541 1190 -2305 -1135 2176 1451
5217 1451 -1928 -1744 1482 1662 -1263 -2346 994 2305 -500 -2525 379 2538 -119 -2514 -437
5232 -437 2287 792 -2415 -811 2126 1099 -1680 -1686 1742 1591 -1486 -2179 1645 2283 -989 -2384 819
5249 819 2372 -209 -2237 41 2270 567 -2175 -596 2214 731 -1914 -1229 1924 1804 -1672 -1793
5265 -1793 1347 2013 -1471 -2303 1278 2571 -681 -2731 175 2186 -66 -2202 -285 2213 448
5280 448 -1999 -805 2088 1180 -1919 -1510 1892 1877 -1616 -1583 1606 2044 -1193 -2495 931 2326 -488
5297 -488 -1991 362 2560 451 -2305 -423 2224 811 -2268 -1361 2180 1250 -2180 -1711 1922 1910
5313 1910 -1359 -2126 1017 2423 -516 -2079 290 2221 -45 -2246 -42 2611 384 -2324 -490
5328 -490 2342 1147 -1969 -1381 1791 1643 -1499 -1831 1085 1963 -986 -2157 1174 2698 -408 -2361
5344 -2361 173 2396 85 -2617 -395 2234 701 -2408 -1094 1926 1345 -1876 -1441 1666 1735 -1457
5360 -1457 -2000 1177 2088 -853 -2180 565 2256 -81 -1798 -44 1978 302 -2081 -930 1926
5375 1926 1046 -2019 -1122 1717 1646 -1725 -1756 1250 1965 -1242 -2136 758 2273 -702 -2197 263 2256
5392 2256 111 -2237 -373 2044 620 -1993 -820 1771 1385 -2001 -1415 1584 1460 -1143 -1964 1187
5408 1187 1945 -588 -1977 541 2095 -146 -2327 -91 2159 246 -2393 -455 2149 1155 -1638
5423 -1638 -1113 1890 1410 -1355 -1582 1138 1634 -938 -1995 604 2203 -671 -1903 286 2138 -68
5439 -68 -2453 -187 2162 733 -1807 -1011 1840 746 -1860 -1522 1302 1409 -1109 -1557 928 2089
5455 2089 -864 -1702 637 2056 61 -2090 182 2072 249 -1887 -347 1959 784 -1651 -1133
5470 -1133 1808 1480 -1546 -1459 1257 1604 -1164 -1567 984 1758 -738 -1949 461 1863 101 -1831
5486 -1831 -306 1990 388 -1882 -681 1570 959 -1741 -1177 1545 1399 -1174 -1454 1158 1780 -1096
5502 -1096 -1532 991 1998 -158 -1706 -104 1918 112 -1755 -535 1695 551 -1505 -533 1438
5517 1438 929 -1678 -1117 1117 1374 -1211 -1755 901 1581 -569 -1800 455 1540 -308 -1994 -255
5533 -255 1786 531 -1923 -360 1538 636 -1517 -1024 1379 1195 -1282 -1334 1300 1455 -766 -1602 381
5550 381 1591 -458 -1596 103 1559 76 -1743 -342 1825 410 -1137 -719 1786 862 -1505 -1154
5566 -1154 1299 1533 -1173 -1503 901 1730 -655 -1767 391 1492 -214 -1430 -44 1795 168 -1486
5582 -1486 -106 1740 572 -1594 -643 1350 837 -1396 -1197 1201 1201 -847 -1609 647 1773 -670 -1389
5599 -1389 239 1669 -44 -1403 -293 1541 269 -1563 -333 1337 665 -1257 -638 1282 1112 -955
5615 -955 -1281 858 1508 -624 -1418 493 1421 -448 -1374 199 1331 -130 -1789 -131 1408 461 -1266
5632 -1266 -650 1288 879 -1275 -1302 1098 1190 -1020 -1258 945 1437 -530 -1387 661 1480 -163 -1458
5649 -1458 -107 1250 292 -1557 -435 1613 681 -1304 -706 1124 902 -1201 -1237 1113 1371 -767 -1219
5666 -1219 581 1333 -436 -1472 212 1514 202 -1413 -309 1332 172 -1293 -403 983 715 -979
5682 -979 -877 1043 1120 -778 -1241 698 1124 -553 -1519 515 1264 -138 -1533 79 1408 65 -1241
5699 -1241 -236 1233 589 -1010 -475 1060 660 -889 -985 903 665 -908 -1603 660 1418 -466 -1302
5716 -1302 326 1254 -5 -1090 17 1302 218 -1217 -337 1439 360 -1452 -625 966 931 -1071
5732 -1071 -884 830 1084 -1051 -1068 535 1019 -216 -1167 337 1443 -232 -1313 -312 1322 537 -1110
5749 -1110 -438 1080 845 -756 -744 821 844 -1076 -947 867 948 -719 -1338 250 1453 -36 -1217
5766 -1217 19 1375 284 -1265 -201 1338 401 -1112 -663 965 753 -891 -934 593 918 -649
5782 -649 -870 373 1200 -513 -1128 184 1464 120 -1245 -269 1118 25 -1301 -145 773 785 -937
5799 -937 -765 887 687 -806 -979 660 905 -664 -1109 342 862 -211 -1029 27 930 321 -690
5816 -690 -216 1158 240 -1017 -738 774 769 -788 -837 764 888 -682 -1243 558 840 -361 -990 166
5834 166 838 -134 -1262 -262 750 230 -917 -569 1132 695 -757 -448 781 767 -943 -1097 529
5851 529 716 -268 -886 184 689 -132 -1145 223 1210 62 -945 66 887 461 -890 -546 774
5868 774 288 -970 -489 854 593 -618 -580 383 709 -445 -953 18 1086 -124 -885 172 886 110
5886 110 -1068 -219 1035 561 -811 -294 726 543 -489 -602 448 718 -337 -750 327 823 -295
5903 -295 -851 199 839 -1 -1019 -171 632 46 -1012 -239 843 465 -890 -397 751 547 -820 -647
5921 -647 660 804 -458 -590 317 904 -30 -859 51 649 81 -832 65 868 176 -713 -182 265 452
5940 452 -655 -403 527 280 -240 -625 459 824 -265 -662 293 557 -231 -864 65 559 -164 -727 -339
5959 -339 261 312 -626 -144 693 276 -571 -392 553 438 -439 -561 377 634 -242 -519 101 741 107 -805
5979 -805 14 535 330 -528 -248 600 75 -616 -397 336 480 -597 -392 502 453 -296 -443 161 465 82
5999 82 -524 -32 330 32 -652 101 626 113 -402 -15 646 373 -403 -355 696 233 -92 -207 176 610
6019 610 -314 -284 59 480 -262 -438 -88 393 53 -341 68 500 135 -506 -248 244 313 -395 -141 493 154
6040 154 -384 -231 227 504 -436 -411 94 571 -143 -688 -218 400 -99 -480 52 599 157 -390 97 393
6060 393 125 -326 -542 299 319 -661 -525 5 497 -254 -438 330 74 -136 -569 -260 333 -10 -504 -66
6080 -66 370 186 -206 -100 324 314 -177 -234 378 218 -434 -274 211 509 -314 -243 -27 588 -97 -742 30
6101 30 223 285 -559 219 135 160 -280 9 535 -165 -343 -208 296 178 -388 -117 238 433 -296 -375 32 -16
6123 -16 -96 -359 217 164 -136 -219 112 248 44 -460 -152 390 -33 -324 -271 96 112 -44 -324 -36 103 -267
6145 -267 -240 259 255 -15 -549 110 360 -18 -597 122 323 47 -548 -143 -96 84 -383 -28 237 -61 45
6166 45 -335 148 294 41 -81 114 406 -54 -318 329 352 140 -408 11 535 92 -256 163 488 393 -432
6187 -432 -51 7 107 -249 -26 19 242 -64 -216 345 174 -18 -296 -76 178 -163 -198 97 226 138 -273
6208 -273 -297 459 40 -332 6 323 343 -536 -544 304 369 -159 -98 77 278 -194 -350 18 105 67 -118 -5 520
6231 520 154 -428 19 249 -3 -169 -139 65 281 -132 -146 222 -23 -165 -311 203 85 -201 -219 -6 -32
6252 -32 4 -169 29 258 95 -297 -157 140 8 -339 -148 216 5 -287 -94 10 273 -438 -422 244 122
6273 122 -190 -260 45 42 -90 -172 -1 168 38 -247 -72 313 -124 -96 -102 279 214 -263 -109 494 -44 -149 52
6296 52 213 478 -19 -352 -145 78 310 -549 -69 272 -171 -317 -110 122 94 -412 -6 98 174 -311 -298
6317 -298 292 110 -299 -391 100 159 -247 -117 -107 83 -152 -331 -42 299 245 -252 173 264 48 -437 -119 51
6339 51 270 -385 -557 -177 280 -224 -248 259 221 -94 -267 -56 445 40 -135 -95 203 -15 -505 -45 269
6360 269 12 -520 -5 399 252 -214 -470 314 433 -311 -148 263 325 -371 -719 332 333 -90 -27 -155 344
6381 344 -15 -287 81 380 256 -431 -154 371 -1 -186 -243 253 209 -270 -147 243 88 -340 -220 164 386
6402 386 5 -447 -97 334 -29 -381 -283 514 25 -335 99 54 348 -421 -282 456 577 -162 -275 138 337
6423 337 -29 187 120 308 291 -438 -71 349 -63 -414 -106 537 -38 -321 -304 259 80 -269 25 104 598
6444 598 -110 -240 -39 359 -132 -201 111 539 -23 -438 -19 322 433 -298 -101 227 183 -297 -183 364 59
6465 59 -366 -293 399 470 -48 -306 2 513 -196 -347 25 469 -277 -342 85 567 26 -655 -42 463 -104
6486 -104 -505 -262 487 226 -223 -313 397 538 -319 -332 363 765 5 -425 15 264 48 -393 -123 479 -10
6507 -10 -508 -62 175 109 -161 -408 530 362 -291 -378 83 284 -279 -428 155 332 -56 -751 -288 294 -281
6528 -281 -238 -35 203 172 -508 -500 448 422 -624 -434 213 161 -547 -416 4 759 -367 -759 408 574 46
6549 46 -493 134 382 154 -177 -181 424 94 -554 -464 361 473 -328 -433 262 540 -172 -353 71 565 -227
6570 -227 -504 77 632 -113 -387 -25 541 409 -597 -399 274 308 -442 -472 331 515 -421 -460 317 776 -139
6591 -139 -549 -82 491 -108 -679 -117 420 -30 -625 -264 539 379 -567 -371 299 342 -238 -385 381 703
6611 703 -150 -595 494 402 -254 -834 -75 402 -101 -613 -129 525 265 -491 -213 540 277 -475 -448 552
6631 552 389 -269 -662 535 636 -167 -389 4 421 -33 -743 -63 602 -88 -480 -144 711 294 -670 -641
6651 -641 554 350 -669 -342 452 425 -117 -671 131 594 -51 -486 498 626 -31 -693 37 654 149 -453
6671 -453 -309 593 333 -195 -423 253 508 -494 -607 322 654 -254 -445 303 708 -77 -529 -54 759 150
6691 150 -654 -420 451 385 -598 -508 571 124 -556 -530 326 495 -347 -524 -20 450 -237 -380 153 336 70
6712 70 -634 -125 722 65 -486 63 418 333 -682 -509 335 452 -329 -633 381 440 -248 -254 67 921 -117
6733 -117 -614 -68 434 -101 -654 -287 586 111 -420 -332 467 473 -310 -116 361 724 -378 -560 352 681 -308
6754 -308 -629 -148 588 58 -762 -77 504 87 -893 -243 653 349 -349 -498 450 544 -379 -585 227 568
6774 568 -133 -561 482 391 -172 -621 -43 628 42 -664 -93 549 348 -711 -182 373 321 -418 -676 -33
6794 -33 744 -212 -583 483 611 -235 -841 51 339 251 -750 -62 593 321 -726 -225 462 238 -518 -69
6814 -69 409 384 -725 -289 403 451 -38 -586 307 601 -182 -843 -91 465 -70 -535 146 712 392 -711
6834 -711 -276 687 285 -323 -471 558 278 -351 -644 199 603 -157 -635 42 868 -111 -554 -89 466 -160
6854 -160 -771 -235 804 260 -611 -308 494 115 -550 -262 644 473 -369 -526 89 601 -48 -572 254 755
6874 755 180 -589 129 713 -40 -530 -238 286 319 -792 -512 439 167 -237 -458 280 450 -182 -399 389
6894 389 381 -258 -641 -139 622 294 -746 -65 546 380 -546 -383 359 260 -544 -239 472 228 -373 -454 565
6915 565 395 -309 -666 74 491 -95 -605 -29 781 88 -749 -306 745 450 -639 -494 469 327 -320
6934 -320 -175 474 678 -104 -406 381 541 45 -797 95 512 57 -745 -295 642 283 -856 -87 694 222
6954 222 -412 -499 299 563 -404 -413 315 310 -303 -712 23 735 55 -513 -2 990 82 -531 -271 462 408 -374
6976 -374 -163 409 376 -453 -500 323 752 -333 -793 426 727 -126 -834 47 687 84 -580 -213 599 187
6996 187 -785 -601 601 359 -474 -730 378 732 -361 -528 495 457 -130 -553 219 687 36 -927 -73
7015 -73 649 375 -602 -99 686 287 -422 -525 855 632 -468 -539 249 850 -257 -769 401 689 -106
7034 -106 -940 -67 756 549 -624 -191 691 142 -801 -251 358 508 -482 -765 433 767 -358 -462 344
7053 344 541 -385 -654 171 724 136 -613 -59 777 11 -684 -238 587 636 -519 -729 642 301 -561 -396
7073 -396 234 596 -247 -834 -137 554 52 -798 56 627 -102 -827 -261 705 532 -329 -569 563 413 -564
7093 -564 -508 567 593 -285 -563 77 723 84 -818 -38 750 148 -737 -189 567 235 -814 -602 448 465
7113 465 -498 -295 417 447 -482 -387 508 630 -430 -611 30 564 75 -1030 -5 394 -181 -490 -176 809
7133 809 222 -596 -316 411 556 -400 -606 400 544 -397 -620 142 708 28 -600 223 557 100 -887 -402
7153 -402 566 334 -709 -204 553 428 -612 -446 503 768 -220 -918 157 585 -208 -910 -25 698 25
7172 25 -720 50 709 389 -405 -256 743 308 -510 -461 504 484 -572 -443 251 784 -271 -422 -165 599
7192 599 6 -860 2 765 382 -536 -51 883 538 -736 -272 606 416 -583 -500 444 448 -480 -653 321 348
7213 348 -231 -597 -201 672 23 -828 144 590 55 -772 -146 341 378 -479 -337 771 570 -439 -530 439
7233 439 599 -299 -486 202 536 271 -925 -140 721 41 -643 -7 725 352 -474 -279 604 140 -532 -559
7253 -559 283 375 -337 -709 377 363 -45 -726 -27 773 -124 -810 -92 659 189 -180 -248 802 398 -210
7273 -210 -196 496 627 -503 -619 192 664 -376 -520 -29 718 -56 -845 97 637 90 -696 -97 303 370
7293 370 -374 -25 559 528 -571 -430 440 607 -322 -572 242 523 -199 -523 40 498 74 -653 -65 627
7313 627 104 -651 114 687 397 -513 -203 679 525 -493 -521 297 551 -205 -557 470 806 -187 -709 81
7333 81 863 263 -1055 74 818 330 -589 -160 500 115 -553 -669 477 458 -296 -507 530 561 -228 -876
7353 -876 281 729 -144 -580 209 691 -25 -696 -3 689 83 -678 -523 526 402 -453 -604 525 654
7372 654 -557 -849 145 772 144 -681 304 614 17 -801 47 711 272 -442 -253 560 325 -237 -374 527
7392 527 483 -329 -495 281 695 -511 -521 -2 754 -131 -622 -95 593 130 -763 -183 670 239 -662 -56
7412 -56 631 299 -628 -823 43 558 -349 -482 279 596 -144 -737 113 707 114 -847 -75 486 252 -609
7432 -609 -271 873 489 -633 -633 273 548 -292 -436 293 479 -436 -562 97 575 -152 -432 -49 767 -19
7452 -19 -906 -266 582 166 -499 -372 538 501 -655 -679 607 736 -287 -715 228 520 -29 -673 -183 692
7472 692 113 -585 -668 781 282 -628 -468 788 398 -531 -628 694 746 -245 -721 497 631 -153 -702 53
7492 53 834 -80 -629 -371 928 134 -717 -576 722 558 -555 -381 743 393 -468 -630 532 553 -34
7511 -34 -526 294 703 -425 -510 48 842 129 -924 39 906 252 -710 -394 565 339 -420 -694 380 644
7531 644 -600 -727 316 971 -393 -711 77 562 312 -770 126 734 157 -516 -173 937 601 -474
7549 -474 -421 677 521 -820 -870 538 857 -368 -698 67 1035 -22 -807 -114 645 34 -563 -261 865
7568 865 319 -866 -564 529 328 -486 -503 443 492 -309 -829 369 691 -284 -747 224 839 13 -781 -56
7588 -56 692 45 -640 -328 967 266 -578 -382 201 731 -708 -640 249 622 -302 -929 291 938 31 -921
7608 -921 -36 731 -296 -737 4 726 314 -556 -219 686 494 -779 -650 549 639 -483 -509 341 721
7627 721 -143 -812 -24 671 227 -996 -17 663 452 -690 -496 513 603 -588 -139 733 714 -325 -605
7646 -605 423 691 -279 -798 290 681 221 -715 -41 807 175 -662 -190 821 105 -660 -327 553 165
7665 165 -379 -619 369 404 -271 -574 158 803 -78 -658 184 434 264 -489 311 719 202 -755 -365 396
7685 396 431 -264 -605 626 370 -487 -584 406 757 -226 -742 398 578 93 -613 -79 1000 214 -915
7704 -915 -135 837 236 -993 -360 779 337 -773 -388 537 663 -159 -523 394 655 -259 -759 155 704
7723 704 -43 -551 -40 813 110 -648 -245 410 341 -310 -225 698 830 -350 -708 646 793 -405 -324 101
7743 101 809 -210 -608 131 613 -72 -716 -223 760 134 -644 -393 582 374 -502 -268 201 307 -132 -559
7763 -559 271 831 -218 -289 208 705 -83 -984 30 880 152 -612 -323 578 254 -222 -466 638 587 -370
7783 -370 -258 253 654 -445 -802 410 739 -286 -631 186 822 230 -750 77 794 53 -687 -46 551
7802 551 365 -645 -433 436 737 -528 -515 629 428 -291 -557 9 888 -200 -769 -159 742 268 -666
7821 -666 -269 765 322 -428 -535 644 571 -367 -618 409 723 -194 -267 386 725 -270 -515 131 974 174
7841 174 -800 -352 634 -65 -692 -303 812 429 -530 -415 320 427 -376 -499 175 610 -253 -800 38 664
7861 664 -207 -929 196 672 -199 -278 19 744 446 -684 -386 584 664 -457 -676 334 658 -433 -623
7880 -623 430 571 -476 -785 259 786 -191 -759 48 794 167 -659 -324 694 141 -440 -430 758 705
7899 705 -583 -351 461 781 -479 -861 252 782 -168 -789 19 863 -32 -842 -350 400 584 -404 -398 757
7919 757 216 -757 -443 472 364 -287 -817 255 758 -137 -883 447 512 -142 -826 -82 788 278 -734
7938 -734 -274 696 496 -867 -515 916 459 -573 -608 833 437 -232 -539 47 739 -62 -713 66 589
7957 589 -187 -838 -180 976 128 -508 -152 482 582 -599 -655 538 521 -434 -762 402 734 -421 -959
7976 -959 161 847 49 -917 -218 662 59 -809 -208 830 379 -727 -217 765 577 -428 -614 373 917
7995 917 -71 -735 451 754 -24 -782 107 624 72 -736 41 655 485 -740 -204 314 394 -798 -374
8014 -374 661 448 -506 -570 228 418 -569 -827 189 401 -54 -760 -212 672 -88 -740 -268 830 209
8033 209 -539 -320 517 287 -810 -665 505 578 -248 -544 127 703 -173 -730 213 743 35 -833 -115 882
8053 882 143 -685 -255 668 439 -750 -395 456 549 -542 -643 297 698 -262 -614 53 719 -235 -641 83
8073 83 727 144 -622 -87 469 339 -509 -120 512 603 -334 -403 602 787 -352 -772 283 580 -296 -830
8093 -830 1 554 9 -651 162 607 48 -753 -4 570 110 -836 -419 475 227 -581 -334 446 860 -246
8113 -246 -540 87 567 -91 -665 182 433 272 -534 117 503 337 -449 -318 568 346 -466 -506 547 508
8133 508 -602 -583 557 433 -28 -1062 88 623 -103 -690 -51 567 145 -781 -85 656 305 -516 -301
8152 -301 756 462 -504 -580 463 591 -366 -827 126 747 171 -610 204 865 -24 -727 -145 537 25 -567
8172 -567 -249 829 396 -710 -304 465 321 -412 -694 220 609 -236 -612 -58 675 -228 -480 227 823
8191H23
$$ Imaginary data points
##PAGE= N=2
##DATA TABLE= (X++(I..I)), XYDATA
0 0 0 0 0 0 0 0 0 -8 8 -8 8 -16 16 -17 25 -32 40 -49 62 -73 89 -105 127 -147 171 -202 236 -271 312 -360
30 -360 413 -469 531 -603 682 -765 861 -966 1081 -1202 1339 -1490 1652 -1827 2021 -2237
46 -2237 2466 -2717 2994 -3301 3635 -4004 4414 -4872 5383 -5958 6616 -7367 8240 -9270
60 -9270 10508 -12024 13930 -16415 19801 -24708 32487 -46742 81354 -346985 -120868 620794
72 620794 -118773 -517221 48881 488345 3157 -310571 -53944 293136 179693 -144962
82 -144962 -191762 238494 347661 -185438 -413000 206394 459666 -172421 -472840 103621
92 103621 351166 -167934 -447166 -14404 338573 101154 -258410 -94202 335554 221970
102 221970 -340737 -300990 318319 305264 -331343 -297945 327658 292020 -272881 -244196 234012
113 234012 266092 -91641 -210480 22630 230995 50446 -312438 -184725 324539 242141
123 242141 -353358 -280466 337265 225573 -406617 -294558 302837 237886 -238596 -176626
133 -176626 244271 268038 -83946 -212377 87019 320533 33715 -327032 -82550 323477
143 323477 55469 -410205 -156370 325265 113915 -330349 -155968 254687 149846 -223000
153 -223000 -195619 175151 273264 -65010 -245538 97627 348962 -22372 -349567 13212
163 13212 356315 -11588 -368011 -31528 307085 14657 -306902 -78793 246970 126801
173 126801 -187253 -165073 154441 220594 -125902 -278112 87981 300537 -73706 -311834
183 -311834 66442 314574 -49489 -296991 33639 287684 21771 -235525 -43254 229330
193 229330 112483 -196825 -166149 174544 210339 -167507 -264547 125410 247426 -156334
203 -156334 -300423 98032 269441 -80677 -249275 66464 267228 16091 -214312 -26855
213 -26855 245604 114759 -212262 -146051 212187 175220 -225546 -226397 187027 212119 -191953
224 -191953 -237994 138278 208046 -124406 -220683 71596 224767 -4978 -201905 -10926
234 -10926 242913 82159 -231371 -103615 244906 130972 -245046 -155284 217642 150236
244 150236 -205119 -167096 163821 172875 -122597 -187132 74459 195050 -44496 -224270 3999
255 3999 245928 35164 -245343 -46375 257139 70778 -245882 -89663 222307 106129
265 106129 -191261 -124277 158745 149140 -121642 -170319 94180 197010 -69625 -225017 36814
276 36814 226484 -30966 -242393 7547 241795 23697 -217038 -39903 202880 70406
286 70406 -181140 -102974 158142 134994 -134820 -158185 122632 183393 -108267 -202008 89793
297 89793 207545 -76083 -219880 42517 209932 -16992 -203637 -12354 203407 57414
307 57414 -183098 -81806 176066 107745 -167974 -131316 156884 151220 -139421 -162987 119711
318 119711 170737 -102317 -188917 63345 186055 -40179 -195634 5475 195977 26109
328 26109 -185128 -38017 193586 74484 -171883 -84576 164326 105454 -149661 -127509 126793
339 126793 141742 -112766 -170051 76629 169260 -69951 -193369 36703 192812 -13564
349 -13564 -185592 1175 194044 39568 -166769 -46853 171599 84493 -152663 -108162
359 -108162 137240 123714 -134317 -154760 106545 154927 -101961 -174268 70196 169017 -49645
370 -49645 -167637 25552 172198 14182 -158007 -32385 165389 67276 -158540 -87129
380 -87129 156044 104148 -152940 -121084 138960 129132 -122182 -136165 98103 143211 -68066
391 -68066 -149831 36705 155744 -9093 -167693 -22191 167488 33695 -182117 -58748
401 -58748 175704 68584 -167335 -75585 160689 100578 -122451 -97846 112194 130223 -69927
412 -69927 -138704 46889 151832 -34329 -178531 1525 168865 -8738 -189910 -20332
422 -20332 168493 20786 -162437 -37417 150931 72381 -109981 -73957 111782 121084 -74675
433 -74675 -131203 68584 153555 -60194 -173263 39517 162822 -46757 -177016 19456
443 19456 158337 -7954 -150638 -19546 136085 48687 -121584 -74913 117502 111162 -100270
454 -100270 -124980 99784 142539 -92264 -149146 82684 149206 -66333 -140259 50490 138729
465 138729 -20117 -130373 -8966 127558 37961 -132672 -77873 118721 83469 -136313
475 -136313 -114761 121302 116031 -113215 -111703 108330 122500 -73591 -104583 67628 126760
486 126760 -19214 -115281 2777 131104 23770 -148985 -60130 137313 54714 -162678
496 -162678 -89233 134258 74500 -135349 -85276 116224 98645 -74395 -84383 70615 117710
507 117710 -25777 -116537 15765 140817 7175 -152461 -23171 151091 20139 -165070
517 -165070 -44008 138764 39240 -130354 -57263 102602 69598 -78331 -85247 61637 113615
528 113615 -35611 -124290 31153 143972 -22781 -154045 16999 155331 -8734 -143089
538 -143089 4256 135529 15497 -115969 -35905 97441 59357 -85945 -91423 67190 105342
549 105342 -71693 -135267 57313 138456 -56768 -139987 52028 137447 -34296 -118027 27263
560 27263 117982 10863 -91958 -23105 96111 56084 -95794 -86761 87459 93181 -103756
571 -103756 -119560 87243 110016 -90831 -114659 71334 108996 -43782 -93130 27870 99725
582 99725 9276 -92202 -27198 105751 53628 -109828 -65230 117743 70623 -126756 -82950
593 -82950 112957 77274 -103600 -82415 77932 84721 -49597 -89347 22140 99556 4819
604 4819 -107587 -22181 116416 30694 -126067 -36929 128624 40188 -119996 -37036 114478
615 114478 48197 -91900 -55820 72124 72562 -48230 -90638 25769 103956 -16194 -124205
626 -124205 -393 124187 -2243 -130971 -4579 122129 7600 -109030 -11433 102142
636 102142 34992 -75904 -43414 71431 73009 -56292 -93592 46178 106649 -45522 -122969
647 -122969 34005 117566 -35989 -119787 21306 105529 -11129 -94455 -4999 86718 29089
658 29089 -73969 -45114 75781 71719 -67721 -82468 69787 93714 -68564 -100499 59442
669 59442 96172 -52873 -94724 35918 87596 -19155 -85965 -3680 83768 23873 -85513
680 -85513 -42853 87769 58330 -88580 -66462 90204 74536 -82475 -73518 74548 74453 -59539
692 -59539 -75913 41588 77985 -22543 -83528 2273 88580 12560 -97291 -28496 99116
703 99116 36307 -100402 -43599 95834 48412 -85280 -50855 74443 58357 -56131 -62935
714 -62935 42092 72039 -27515 -82988 13387 91385 -4091 -99907 -5891 101934 12141 -101600
726 -101600 -20396 94465 28094 -83813 -36231 72976 48264 -58916 -58158 49975 72302
737 72302 -39082 -82610 31157 90229 -25944 -97950 16932 96913 -9699 -94751 -1393
748 -1393 87711 12703 -79545 -26216 71260 41810 -61905 -52792 57829 66715 -51193 -74552
760 -74552 47649 81178 -41966 -85906 32183 83566 -24977 -85319 8859 79954 3913
771 3913 -76886 -18420 74426 33925 -70229 -43645 70552 56671 -64463 -60974 62536 67879
783 67879 -55354 -72115 44242 72436 -35193 -77798 17416 75639 -5542 -78938 -9571
794 -9571 79071 22653 -76918 -30164 77969 40658 -72536 -45314 68447 52444 -59830
805 -59830 -57576 49654 62959 -38612 -69894 25169 73634 -13899 -77875 2646 80161 7154
817 7154 -80191 -15471 79125 23537 -75652 -31800 69552 38532 -64785 -48971 55702 56973
829 56973 -45913 -63901 38639 72611 -25940 -74741 18548 79105 -7511 -78817 -1847 76352
841 76352 9069 -76516 -22385 69191 28132 -68164 -40562 60265 48687 -53632 -55751 47717
853 47717 65314 -35045 -65052 30008 72365 -16883 -71878 7822 72549 374 -74563 -12376
865 -12376 70576 18324 -71730 -30280 65800 36992 -61602 -45184 55098 53371 -45894 -58563
877 -58563 37488 65174 -26782 -68064 18974 72623 -9342 -73789 1605 74364 7066 -72318
889 -72318 -14664 69520 24200 -64595 -34309 56029 41941 -51111 -53579 40139 57204 -36194
901 -36194 -65705 27440 68666 -20012 -68350 16633 72845 -3258 -66344 -897 67747 14732
913 14732 -61903 -24772 57756 34260 -56911 -48659 46929 50461 -48476 -61586 38651 61507
925 61507 -34253 -62996 28064 65769 -13848 -60031 9123 65615 8701 -61496 -18110 61692
937 61692 28815 -62115 -40178 56511 42802 -56640 -50784 46963 49794 -41757 -52870 31829
949 31829 55205 -19565 -55727 10161 61279 3973 -61843 -11473 66109 21529 -65675 -27575
961 -27575 63848 31997 -60353 -35854 52921 39136 -44587 -43857 33625 47713 -25129 -56236
973 -56236 13524 60759 -6541 -67269 -1767 69952 7515 -69165 -11155 68018 19049 -58870
985 -58870 -21606 53379 29972 -42771 -36634 34942 45021 -28932 -55607 19950 59364 -18575
997 -18575 -68003 10537 67391 -7202 -65999 1819 62530 7481 -54046 -12729 50262 25191
1009 25191 -42052 -33393 38579 43315 -35909 -52460 32388 57041 -31601 -62004 25868 60878
1021 60878 -21158 -59452 12035 55637 -1346 -50974 -9458 48480 21242 -46071 -31399 45632
1033 45632 39494 -45107 -45019 44474 48841 -41165 -49140 36607 50155 -26472 -48334 16322 48148
1046 48148 -4505 -49267 -8657 49144 17196 -52441 -26936 51948 30312 -53574 -34256 51563
1058 51563 36353 -45762 -35530 40268 40120 -28231 -40609 19257 46151 -7597 -50654 -2338
1070 -2338 54186 8005 -59903 -15431 58960 16609 -59232 -20502 54005 22794 -45982 -25677
1082 -25677 38193 32786 -27000 -37364 19688 46218 -10705 -51886 6264 57163 -2940 -60454
1094 -60454 -848 58448 2608 -56507 -8149 49493 13267 -42493 -21346 35263 30598 -28615
1106 -28615 -38756 23903 47409 -19912 -51852 18844 55451 -16357 -54956 13620 53110 -8909
1118 -8909 -49877 1013 44662 7682 -41282 -19107 37285 28993 -34948 -38120 33422 44881
1130 44881 -31357 -47348 29857 48148 -25470 -45245 20824 43415 -12900 -41121 3316 39822
1142 39822 6333 -40942 -17311 41291 25468 -43021 -32675 42721 36503 -40662 -37553 36917
1154 36917 37567 -30305 -36325 22658 36930 -13463 -38195 4754 40926 4193 -44979 -11818
1166 -11818 47704 16560 -50293 -21676 48806 23721 -45694 -25446 39466 27934 -30999 -29972
1178 -29972 23006 34435 -13657 -38167 7606 43741 -665 -47598 -3373 49929 5988 -51210
1190 -51210 -10000 47454 12129 -44023 -17124 36895 21324 -29815 -26765 24174 34781 -17480
1202 -17480 -39181 14843 45657 -10693 -47775 8513 48965 -5780 -48584 608 44128 3209
1214 3209 -41580 -11199 35201 18084 -31389 -25408 28456 33311 -24713 -37213 24004 42407
1226 42407 -20219 -43278 17524 43879 -12985 -42840 6157 39554 189 -37763 -8842 35175
1238 35175 16344 -34096 -23210 32892 28997 -31598 -32478 30472 35215 -27631 -36268 23037 36881
1251 36881 -17939 -37430 10302 37369 -2046 -37623 -4960 38739 12619 -38317 -17281 38943
1263 38943 21469 -37977 -24931 34952 25926 -32505 -29494 25608 30827 -20120 -33813 12757
1275 12757 36404 -5070 -37872 -51 41336 7006 -40090 -9551 41038 14040 -38744 -16764
1287 -16764 35168 18976 -32407 -24088 26175 26694 -22049 -31930 15711 35458 -10781 -38428 6513
1300 6513 40914 -1743 -40928 -1330 40632 5479 -38421 -9447 36264 14505 -32569 -18954
1312 -18954 29097 23971 -25650 -29239 21463 33193 -17538 -36818 12795 37456 -9545 -39369
1324 -39369 3867 37362 -53 -36662 -4859 35462 11114 -31919 -14947 31833 22055 -27189
1336 -27189 -24983 25861 29724 -22392 -32868 17189 33156 -14678 -36592 7861 34401 -5049
1348 -5049 -35852 -950 35096 6300 -33594 -9927 34723 17102 -30974 -19374 30445 24816
1360 24816 -26203 -27819 22013 29520 -18961 -33169 12123 32445 -9609 -34814 3264 34532
1372 34532 901 -34556 -5350 34698 10969 -32015 -14172 31437 19854 -27426 -22925 24313
1384 24313 26306 -20914 -29510 16464 31001 -13522 -32869 8548 33093 -4835 -33631 343
1396 343 33736 4465 -33139 -9651 31752 14438 -29827 -18609 28061 22976 -24467 -25224 22359
1409 22359 28236 -17601 -28885 14081 30465 -9616 -31394 4084 31538 111 -32919 -6325
1421 -6325 31737 9896 -31830 -15136 30113 18572 -27070 -20557 25145 23701 -20216 -24303 16765
1434 16765 27250 -11899 -29048 7324 30593 -3419 -32914 -1850 33258 4908 -33389 -8909
1446 -8909 31964 12101 -29729 -14900 26944 18104 -22741 -20547 19030 23957 -14923 -27205 11331
1459 11331 30168 -7898 -32409 4410 33942 -804 -33350 -2155 32204 5951 -29209 -9562
1471 -9562 26423 13701 -23273 -18446 19648 21917 -17798 -26104 14735 28517 -13118 -30880 10363
1484 10363 31751 -7197 -30611 3954 30357 1373 -27663 -5629 25934 10883 -24250 -16209
1496 -16209 22673 19471 -22075 -23530 20540 25439 -19281 -26806 16180 27733 -12381 -27285 7919
1509 7919 27298 -1691 -25858 -3329 26256 9017 -26305 -13166 25956 16010 -25991 -19357
1521 -19357 24149 20399 -22603 -22061 18658 22589 -14123 -23385 9006 25074 -3362 -25798 -1616
1534 -1616 27645 6083 -28358 -8456 29015 11021 -28874 -12904 27298 13891 -24550 -16162
1546 -16162 20293 18162 -15576 -21076 10791 24337 -6056 -26861 2578 29406 917 -30142
1558 -30142 -2462 29917 4407 -28961 -6279 25754 8452 -23209 -12416 19369 15896 -15539
1570 -15539 -20384 12561 24114 -9160 -26915 7639 29283 -5262 -29227 3791 28650 -1179
1582 -1179 -26617 -1770 24285 5254 -21781 -10347 19235 14843 -18043 -19428 16440 23008 -15325
1595 -15325 -25789 13766 26688 -11658 -25941 9392 24975 -5631 -23509 1628 22479 4116
1607 4116 -21269 -8855 20983 13561 -20940 -17657 20336 19366 -20148 -21570 17855 21221 -15519
1620 -15519 -21657 11709 21179 -6712 -20859 2681 22329 3201 -22232 -6856 24175 10681
1632 10681 -24612 -13155 23848 14114 -23847 -15752 20012 15730 -17354 -17231 12624 18411 -8388
1645 -8388 -20101 4755 22915 189 -24326 -2178 26705 5335 -27000 -6880 25628 8269
1657 8269 -23927 -10488 19888 11811 -16541 -14776 12340 17467 -8999 -20407 6398 23863 -3782
1670 -3782 -25187 2530 26640 -861 -26203 -1154 24440 3652 -22053 -6534 19174 10123
1682 10123 -15955 -13290 13975 17213 -12230 -20341 10653 22266 -9804 -23866 8073 24008
1694 24008 -6391 -24334 3182 22236 166 -20853 -4405 19168 8912 -17325 -12542 16837
1706 16837 16292 -15310 -18094 14997 19643 -13887 -21011 11714 20260 -9528 -20151 5014 19740
1719 19740 -1401 -19961 -3185 19734 7423 -19401 -10142 19935 12743 -19216 -14182 18456
1731 18456 15523 -16917 -16231 14196 16932 -10790 -17903 7078 18749 -3058 -20134 -836 20901
1744 20901 3650 -21961 -6450 21837 8320 -21203 -9504 19877 11121 -17413 -12332 15039
1756 15039 14637 -11227 -16043 8670 18727 -4767 -20127 2185 21825 62 -22667 -2316
1768 -2316 22002 3209 -21365 -5584 19237 7035 -17309 -9444 15258 12905 -12308 -15106 10891
1781 10891 18236 -8258 -19477 6707 21040 -4417 -21717 2351 20604 -815 -20440 -2381
1793 -2381 18187 4406 -17681 -8009 16212 11155 -14379 -13527 13295 16658 -11372 -17675 10033
1806 10033 19200 -7988 -19426 5585 18977 -2707 -18811 -661 17854 3099 -17588 -6339
1818 -6339 16830 9057 -16605 -11558 15611 13484 -14481 -15288 12896 16139 -10501 -16887 7770
1831 7770 17497 -4937 -17463 2200 18105 870 -18325 -3619 18529 5479 -18395 -8289
1843 -8289 17465 9771 -16160 -12116 14131 13672 -12072 -14992 9255 16259 -6706 -16872 4236
1856 4236 17574 -1611 -18328 -651 18490 2798 -18620 -5133 17526 7169 -16818 -9528
1868 -9528 15140 11467 -12998 -12935 10943 14605 -8878 -15583 7102 17217 -4913 -17494 2859
1881 2859 17961 -331 -18078 -1922 17784 4144 -17156 -6675 16117 9129 -14662 -10932
1893 -10932 13391 12780 -11348 -14254 9164 15006 -7224 -16253 4806 16566 -2849 -17563 143
1906 143 17562 2270 -17296 -4527 16676 6977 -15267 -8480 14466 10667 -12465 -11682 10732
1919 10732 13106 -9119 -14666 6958 15446 -5517 -16863 2898 17105 -606 -17391 -1205
1931 -1205 16806 3600 -15968 -5638 15075 7905 -13321 -9434 12256 11568 -10406 -13031 8641
1944 8641 14467 -7552 -15903 5531 15951 -3526 -16509 1543 16448 1009 -15311 -3075
1956 -3075 15046 5753 -14099 -7506 12925 9623 -11772 -11557 10779 12846 -9749 -14013 8120
1969 8120 14374 -6534 -15189 4205 14922 -1724 -15329 -912 15201 3420 -14094 -5672 13999
1982 13999 7778 -13505 -9063 12974 10560 -11909 -11572 10164 12400 -8511 -13290 6022 13926
1995 13926 -3334 -14570 796 14590 1777 -15196 -3490 15274 5507 -14595 -6625 13888
2007 13888 7745 -12607 -8881 10852 9834 -9082 -11440 7022 12704 -4927 -13797 2321 14976
2020 14976 -858 -15230 -819 15754 1787 -15213 -3157 14601 4779 -13233 -5982 11208
2032 11208 8237 -9730 -10147 8052 12070 -6340 -13774 4503 14530 -3478 -15149 2075 14965
2045 14965 -733 -14326 -697 13858 2716 -12459 -4656 11447 7400 -9985 -9366 9269 11165
2058 11165 -8266 -12963 6869 13556 -6639 -13662 4783 13418 -3254 -13009 1453 12528 1326
2071 1326 -11709 -3245 11979 5958 -11403 -7670 11111 9772 -10736 -10608 9614 11031 -8506
2084 -8506 -11671 6804 11512 -4526 -11446 2391 11800 17 -12129 -2161 12656 4522 -12739
2097 -12739 -5806 12951 7118 -12388 -8414 11118 8381 -9657 -9292 7503 9799 -5391 -10607
2110 -10607 3331 11631 -1504 -12488 -395 13222 1628 -13615 -2524 13635 3793 -12749
2122 -12749 -4602 11567 5837 -9947 -7091 7895 8477 -6083 -9901 4897 11706 -3252 -12582
2135 -12582 2171 13487 -1557 -13556 156 13097 763 -12012 -2574 10730 4306 -9651
2147 -9651 -6241 8108 8182 -7025 -9557 6253 10751 -6016 -11907 4977 12448 -4217 -12319 2811
2161 2811 11887 -1015 -11284 -572 10319 2974 -9698 -4960 8960 6501 -9065 -8634 8539
2174 8539 9022 -8285 -10000 7304 10061 -5967 -10080 4535 10368 -2290 -10062 137 10452
2187 10452 2149 -10586 -4003 10699 5078 -10648 -6732 9967 7281 -9679 -7766 8173 8141 -6938
2201 -6938 -8573 5022 9461 -2953 -9801 1412 10962 538 -11218 -1701 11280 2911 -11362
2214 -11362 -4042 10936 4179 -10186 -5521 8894 6042 -7455 -7325 5646 8371 -3933 -9646
2227 -9646 2928 11090 -1354 -11600 446 11837 271 -11309 -1353 10626 2252 -9746 -3906
2240 -3906 8648 5276 -7642 -6511 6273 8062 -5602 -9462 4619 10308 -3651 -10606 2918
2253 2918 10768 -1928 -10479 846 9916 649 -9049 -2502 8613 3926 -8231 -5539 7750 6941
2267 6941 -7368 -8237 6753 8788 -5893 -9284 4904 9395 -3531 -9186 2092 9109 -357 -9255
2281 -9255 -1692 8950 2886 -9132 -4322 9170 5543 -8680 -6722 8077 7050 -6790 -7604 6080
2295 6080 8197 -4143 -8318 2669 8833 -1279 -8950 -108 9467 1321 -9607 -2620 9633 3458
2309 3458 -9375 -4399 8664 5275 -7674 -5852 6678 6725 -5054 -7343 4011 8289 -2488 -8910
2323 -8910 1540 9403 -489 -9696 -459 9963 1590 -9393 -2637 8694 3969 -7605 -4838 6858
2337 6858 6035 -5764 -6842 5051 7967 -3872 -8529 3074 8658 -2205 -9516 1175 9108 -450
2351 -450 -9181 -1456 8563 2477 -8080 -3312 7666 4887 -6687 -6053 6150 6690 -5351 -7329
2365 -7329 4871 7656 -3978 -8453 2593 8362 -1517 -8563 109 8286 1006 -8456 -2686 7862
2379 7862 3613 -7149 -4500 6853 5765 -5936 -6057 5443 6928 -4527 -7140 3620 7676 -2565
2393 -2565 -8110 1344 8045 -85 -8497 -1270 8067 1819 -7825 -2971 7544 4173 -6417 -4739
2407 -4739 6219 5899 -5309 -6065 4589 6861 -3644 -7376 2484 7258 -1540 -8000 345 7814
2421 7814 383 -7876 -1852 7306 2556 -7086 -3287 6313 4606 -6038 -5110 5349 5955 -4511 -6505
2436 -6505 3574 6998 -2786 -7258 1522 7424 -274 -7404 -599 7251 1236 -7093 -2364 7063 3109
2451 3109 -6390 -3904 6011 4458 -5200 -5577 4332 5851 -3632 -6469 2373 6684 -1688 -7105 372
2466 372 6746 275 -6780 -1015 7017 1745 -6712 -2537 6197 3357 -5370 -4296 4791 4819 -3836 -5696
2482 -5696 3058 6277 -2592 -6403 1588 6519 -858 -6939 167 6811 600 -6330 -1266 5931 2199
2497 2199 -5704 -3103 5360 4053 -4377 -4735 4078 5463 -3778 -5874 2753 5962 -2241 -6144 1340
2512 1340 5985 -683 -5975 -169 5898 1204 -5232 -2177 5425 3259 -5396 -3687 4696 4572 -4257
2527 -4257 -4971 3299 5291 -3013 -5350 2112 5164 -1444 -5320 563 5572 218 -5619 -975 5966
2542 5966 2014 -5538 -2510 5410 3506 -4897 -3535 4510 3857 -3820 -3955 2922 4434 -2291 -5012
2557 -5012 1390 5149 -558 -5901 -112 5766 602 -5809 -1391 5495 1652 -5147 -2497 4541 3117
2572 3117 -4003 -3428 3186 3675 -2902 -4433 1910 5144 -1758 -5463 1129 5654 -406 -5641 296
2587 296 5216 656 -5080 -1224 4218 1740 -3961 -2738 3682 3157 -3465 -3978 2916 4163 -2605 -4717
2603 -4717 2462 4884 -1741 -4880 1050 5049 -582 -4797 -329 4164 1303 -4061 -1950 4118 2724
2618 2724 -4056 -3256 3654 3664 -3842 -4005 3378 4133 -2716 -4012 1578 4448 -1014 -4278 -85 4417
2634 4417 466 -4571 -1111 4313 1618 -4381 -2477 3855 2544 -4074 -2536 3794 2926 -3177 -3315
2649 -3315 2208 3623 -1488 -4097 609 4414 -169 -4571 -54 4853 536 -4724 -1100 4770 1205
2664 1205 -4372 -1924 3453 2343 -3286 -2886 2449 3542 -2083 -4162 1412 4540 -1241 -4666 831
2679 831 4707 -536 -4535 129 4223 120 -4108 -927 3615 1911 -3371 -2625 3122 2922 -3066 -3411
2695 -3411 2331 3875 -2205 -3937 2130 4230 -1397 -4034 1134 3886 -330 -3852 -376 3643 1087
2710 1087 -3771 -2058 3650 2591 -3352 -2958 3199 3027 -2910 -3346 2415 3191 -1868 -3358 1297 3253
2726 3253 -475 -3955 -96 3699 329 -4134 -1310 3828 1429 -4087 -2050 3742 2142 -3148 -2417
2741 -2417 2559 2826 -2147 -3074 1846 3238 -1256 -3831 835 3714 -226 -4288 -337 4362 506
2756 506 -3944 -1428 3597 1653 -3271 -1886 3135 2256 -2398 -2798 1933 3151 -1412 -3241 1313 3569
2772 3569 -1049 -4101 434 3952 33 -3674 -346 3415 439 -3224 -1327 2854 1825 -2570 -2348
2787 -2348 2661 2505 -2233 -2878 1997 3051 -1498 -3371 1285 3287 -896 -3332 192 3061 323
2802 323 -3195 -679 2948 1446 -3025 -1876 3040 2040 -2695 -1970 2702 2439 -1845 -2874 1769 2764
2818 2764 -1590 -2973 416 3134 -72 -3174 -389 2941 646 -3234 -1162 3043 1454 -2813 -1743
2833 -1743 2505 1739 -2585 -2208 2020 2398 -1499 -2458 1152 3078 -726 -2966 387 2904 -204 -2981
2849 -2981 -412 3030 676 -2766 -860 2854 1597 -2440 -1482 2220 1824 -1873 -2419 1184 2498 -1380
2865 -1380 -2541 662 2791 -712 -2917 137 2905 53 -2596 -364 2492 916 -2737 -874 2128
2880 2128 1715 -1718 -1588 1888 2032 -1637 -2208 1255 2282 -947 -2460 636 2216 -492 -2729 -77
2896 -77 2239 171 -2165 -708 2171 1118 -2381 -1130 2195 1618 -1906 -2075 1492 1868 -1258 -2204
2912 -2204 1156 2158 -802 -2128 432 2145 -100 -2487 -134 2226 345 -2243 -956 2103 940
2927 940 -1906 -1308 2044 1201 -1578 -1798 1386 1502 -1324 -2052 851 2103 -452 -2232 637 2348
2943 2348 22 -2078 -343 2052 412 -1808 -800 1972 1189 -1588 -1369 1623 1240 -1474 -1670 1073
2959 1073 1375 -1032 -2022 911 1996 -286 -1978 454 2189 246 -2088 -207 1909 525 -1719
2974 -1719 -553 1809 796 -1584 -1126 1441 1311 -1381 -1717 1413 1560 -988 -1845 827 1795 -455
2990 -455 -1908 21 2020 144 -1828 -181 1723 463 -1530 -498 1729 673 -1483 -1053 1261
3005 1261 1092 -1245 -1381 984 1608 -942 -1914 747 1685 -327 -1416 230 1817 -105 -1657 -232
3021 -232 1795 382 -1904 -659 1832 844 -1418 -1179 1431 1211 -1328 -1432 817 1761 -952 -1554 881
3038 881 1589 -336 -1662 68 1906 108 -1669 -396 1793 595 -1841 -754 1735 750 -1573 -932
3054 -932 1344 1188 -934 -1370 569 1420 -646 -1730 404 1760 -345 -1508 -45 1897 10 -1851
3070 -1851 -308 1779 607 -2038 -608 1576 720 -1330 -1039 1313 1366 -807 -1359 689 1666 -708
3086 -708 -1582 359 1760 -453 -1639 -59 1501 31 -1864 -335 1494 632 -1351 -890 1475 1267
3102 1267 -1284 -1316 1194 1550 -994 -1707 951 1321 -681 -1684 320 1941 -12 -1537 -383 1304
3118 1304 282 -1523 -805 1520 750 -1424 -878 1319 1188 -1202 -1312 994 1205 -823 -1164 496 1412
3135 1412 -164 -1509 188 1335 209 -1386 -399 1410 369 -1618 -596 1495 774 -1355 -909 1367
3151 1367 1409 -819 -1100 762 1278 -293 -1380 491 1491 -301 -1613 70 1393 349 -1446 -325
3167 -325 1535 375 -1518 -588 1375 925 -775 -1179 782 1087 -971 -1551 464 1560 -496 -1585
3183 -1585 353 1458 -168 -1293 177 1333 198 -1124 -466 1401 743 -1548 -967 927 704 -1080
3199 -1080 -1385 734 1134 -632 -1435 756 901 -339 -1179 7 1239 -37 -905 -117 1201 425 -930
3216 -930 -546 1358 639 -992 -861 993 695 -944 -931 621 796 -791 -1069 607 912 -331 -1240 -181
3234 -181 1055 161 -1054 34 1362 169 -1243 -298 1202 415 -741 -658 825 725 -949 -868 637
3251 637 784 -402 -989 95 920 -304 -1216 484 1195 108 -1126 -7 960 174 -806 -403 820
3268 820 360 -1021 -618 688 597 -692 -683 551 992 -662 -1097 611 811 -509 -692 -4 1215 100
3286 100 -970 -185 998 285 -1063 -87 1111 462 -1004 -596 683 657 -983 -731 402 706 -733
3303 -733 -694 618 739 -231 -1142 218 1043 13 -1022 -145 1176 103 -892 -179 963 337 -797 -580
3321 -580 954 516 -484 -647 684 781 -654 -751 566 996 -525 -932 295 990 -301 -920 315 1018
3339 1018 -69 -1011 -157 901 284 -869 -224 806 537 -692 -805 1109 653 -579 -709 297 791
3356 791 -587 -854 360 1056 -459 -1218 -254 937 -99 -910 -36 1346 236 -1061 -253 1136 546
3373 546 -949 -521 828 642 -574 -703 620 1209 -302 -810 459 1175 -166 -976 134 1190 -60
3390 -60 -1027 -41 1341 278 -940 -387 1144 517 -1165 -641 796 619 -800 -725 715 1218 -627 -985
3408 -985 285 1238 -436 -1220 334 1231 5 -980 -13 967 110 -1201 -341 962 478 -1128 -836 1233
3426 1233 929 -987 -946 657 1041 -321 -1119 559 1397 -417 -1271 312 1106 -138 -1219 -80 1118
3443 1118 462 -1129 -737 1201 676 -1288 -875 925 1039 -937 -761 577 1166 -737 -1110 347 1242
3460 1242 -445 -1624 339 1470 346 -1496 -263 1197 516 -1119 -490 1402 790 -1281 -879 1051
3476 1051 1392 -643 -1347 832 1336 -723 -1149 257 1221 -256 -1418 147 1549 504 -1456 -523
3492 -523 1383 530 -1421 -866 1046 798 -977 -1144 979 1350 -667 -1233 378 1397 -563 -1518 277
3509 277 1298 -35 -1231 67 1256 170 -1464 -579 1269 977 -1435 -832 1059 1243 -840 -1062
3525 -1062 951 1504 -533 -1659 571 1356 -365 -1863 156 1603 191 -1453 -244 1547 401
3540 401 -1393 -528 1237 871 -1515 -958 1045 1349 -1445 -1444 903 1493 -537 -1457 488 1711 -120
3557 -120 -1598 -77 1653 187 -1746 -627 1475 741 -1530 -949 1515 1055 -1343 -1226 1089 1332
3573 1332 -950 -1491 784 1596 -358 -1299 179 1788 -303 -1605 -152 1860 189 -1522 -568 1424
3589 1424 827 -1372 -917 1286 1204 -1446 -1120 1056 1296 -885 -1447 586 1685 -406 -1583 112 1799
3606 1799 81 -1533 -304 1707 440 -1777 -848 1277 1022 -1367 -1076 1067 1085 -1311 -1315 695 1612
3623 1612 -635 -1713 462 1622 -420 -1882 103 1969 10 -1606 -167 1658 447 -1566 -873
3638 -873 1515 1115 -1250 -1301 886 1610 -1190 -1722 691 1717 -799 -1555 481 1639 -347 -1762 -61
3655 -61 1582 278 -1742 -713 1580 669 -1614 -1052 1595 1301 -1322 -1443 1027 1536 -941 -1690 500
3672 500 1687 -414 -1848 181 1641 111 -2006 -300 1950 396 -1687 -702 1758 906 -1383 -1105
3688 -1105 1466 1292 -1323 -1501 1038 1418 -786 -1633 473 1617 -125 -1738 43 1869 223 -1952
3704 -1952 -272 1609 358 -1965 -724 1621 987 -1598 -1357 1401 1505 -975 -1966 872 1861 -732
3720 -732 -1792 497 2060 -113 -2084 318 1948 45 -2007 -372 1717 1035 -1488 -1103 1318 1411
3736 1411 -1221 -1520 1184 1554 -660 -1747 933 1730 -940 -2095 239 1695 -304 -2103 4 1947
3752 1947 526 -1708 -1007 1795 1220 -1507 -1279 1635 1363 -1424 -1485 1356 1790 -1033 -1798 751 1963
3769 1963 -337 -2196 -123 2186 297 -2055 -595 2115 886 -1936 -1194 1862 1245 -1595 -1355 1594
3785 1594 1716 -1127 -2124 1132 1677 -725 -2199 326 2256 -222 -2278 -361 2137 411 -2093 -655
3801 -655 2076 642 -1896 -902 1650 1401 -1710 -1814 1253 1991 -1047 -2181 611 2233 -407 -2491
3817 -2491 -8 2457 25 -2308 -372 1994 684 -2213 -631 2130 1586 -1675 -1554 1305 1780 -1235
3833 -1235 -2086 1193 2289 -826 -2336 598 2042 -316 -2312 87 2123 552 -2047 -803 1979
3848 1979 890 -1932 -1140 2017 1648 -1750 -1978 1354 1957 -1330 -2029 834 2323 -385 -2505 168
3864 168 2155 215 -2054 -270 2157 556 -1991 -802 2279 1267 -1941 -1434 1531 1738 -1373 -2034
3880 -2034 1202 2021 -759 -2055 403 2245 -425 -2216 -127 2272 466 -2396 -642 2275 769
3895 769 -2465 -1231 2126 1380 -1766 -1612 1761 1723 -1306 -2284 986 2593 -667 -2272 49 2622
3911 2622 209 -2638 -458 2627 942 -2334 -854 2310 1332 -2054 -1640 1809 1720 -1577 -2064 1015
3927 1015 2158 -984 -2253 443 2255 -299 -2325 34 2465 420 -2411 -690 2357 1065 -1778
3942 -1778 -1230 2217 1826 -1884 -2039 1419 2186 -1230 -2396 1066 2375 -993 -2415 281 2674 -24
3958 -24 -2526 -221 2502 634 -2190 -1157 2205 1362 -2209 -1414 1633 1823 -1456 -1959 1393 2187 -1013
3975 -1013 -2252 979 2467 -452 -2564 14 2509 238 -2588 -703 2343 1035 -2171 -1226 2177
3990 2177 1617 -1713 -1855 1696 1961 -1357 -2103 802 2503 -789 -2568 203 2595 -123 -2452 -37
4006 -37 2550 649 -2220 -1027 2083 1329 -1861 -1781 1987 1820 -1609 -1902 1326 2257 -1067 -2434 725
4023 725 2551 -381 -2358 14 2416 315 -2252 -576 2439 1036 -1933 -1340 1996 1666 -2176 -1774
4039 -1774 1395 1933 -1419 -2387 1132 2331 -743 -2563 309 2288 96 -2750 -286 2843 744
4054 744 -2359 -1022 2202 1245 -2283 -1845 1916 1979 -1913 -2249 1288 2310 -1097 -2750 915 2846
4070 2846 -156 -2784 181 3040 528 -2310 -702 2485 828 -2176 -1290 1950 1605 -1770 -1810 1577
4086 1577 1902 -1371 -2236 778 2688 -509 -2498 246 2394 -92 -2643 -253 2174 587 -2550
4101 -2550 -1094 2048 1228 -2346 -1597 1919 1911 -1864 -2241 1412 2251 -756 -2167 841 2552 -154 -2566
4118 -2566 50 2307 147 -2335 -794 2562 832 -2210 -1173 1910 1483 -1959 -1971 1793 2056 -1005
4134 -1005 -2146 1040 2519 -707 -2248 405 2359 241 -2678 -266 2262 615 -2388 -1248 2351
4149 2351 1390 -2112 -1529 1859 1652 -1542 -2327 1385 2267 -1137 -2151 681 2736 -288 -2542 32
4165 32 2826 319 -2614 -655 2585 775 -2306 -1132 2230 1264 -1817 -1657 1457 1846 -1454 -2187
4181 -2187 925 2429 -781 -2500 -63 2608 50 -2620 -78 2443 702 -2679 -989 2343 1337
4196 1337 -2028 -1628 1919 1805 -1745 -2019 1538 2339 -1099 -2373 775 2598 -361 -2558 269 2429
4212 2429 54 -2187 -646 2316 917 -2303 -1194 2067 1364 -1827 -1867 1721 2272 -1164 -2088 1315
4228 1315 2300 -814 -2231 500 2487 -83 -2330 -398 2505 617 -2501 -1026 2194 1409 -2154
4243 -2154 -1499 2111 1844 -1979 -2203 1303 1853 -1130 -2236 829 2353 -356 -2676 21 2529 406
4259 406 -2564 -671 2324 958 -2610 -1366 2362 1493 -1892 -1760 1499 1907 -1494 -1942 1233 2580
4275 2580 -1027 -2174 338 2792 -465 -2480 -173 2556 478 -2592 -921 2276 1256 -2195 -1366
4290 -1366 1968 1892 -1589 -1905 1450 2262 -1150 -2570 924 2584 -445 -2741 -59 2661 276 -2810
4306 -2810 -243 2510 757 -2150 -1266 2405 1698 -1989 -1760 1641 2140 -1613 -1991 1303 2327 -812
4322 -812 -2256 624 2433 -250 -2533 -217 2351 410 -2368 -1061 2194 1229 -2073 -1573 1980 1777
4338 1777 -1719 -1788 1418 2155 -1445 -2294 965 2603 -746 -2315 338 2614 54 -2614 -847 2335
4354 2335 1111 -2294 -1058 2442 1430 -1995 -1443 1869 2014 -1549 -2280 1375 2392 -912 -2301 374
4370 374 2205 57 -2812 -196 2580 278 -2762 -791 2342 1225 -2229 -1533 2194 1718 -1804 -2076
4386 -2076 1728 2420 -1238 -2219 1051 2804 -122 -2613 94 2772 -79 -2700 -355 2457 853
4401 853 -2319 -941 2042 1499 -2258 -1777 1858 1952 -1306 -2211 1156 2431 -1069 -2680 439 2634
4417 2634 -204 -2712 -181 2809 216 -2612 -928 2260 1194 -2284 -1657 1986 1895 -1820 -2271 1488
4433 1488 2268 -1355 -2269 1166 2464 -408 -2718 8 2962 250 -2550 -664 2568 946 -2337
4448 -2337 -1314 2061 1744 -2148 -1838 1699 2198 -1518 -2116 1245 2271 -955 -2329 405 2673 -252
4464 -252 -2691 -145 2680 515 -2373 -938 2535 1483 -2248 -1435 1970 1863 -1704 -2091 1701 2156
4480 2156 -1149 -2427 856 2600 -570 -2580 300 2878 -19 -2634 -616 2488 877 -2705 -1575
4495 -1575 2305 1517 -2003 -1771 1693 1741 -1812 -2340 1348 2341 -767 -2777 632 2632 -279 -2712
4511 -2712 -236 2496 508 -2520 -926 2190 1284 -2438 -1563 2046 1849 -1849 -1998 1327 2261 -1326
4527 -1326 -2418 866 2555 -435 -2746 245 2906 106 -2584 -630 2541 778 -2368 -1295 2342
4542 2342 1530 -1864 -1731 1952 2086 -1420 -2264 1060 2276 -647 -2773 224 2919 -17 -2604 -170
4558 -170 2664 680 -2534 -896 2252 1050 -2330 -1372 2085 1714 -1907 -1872 1715 2128 -1117 -2196
4574 -2196 761 2582 -534 -2509 -124 2469 4 -2603 -273 2254 817 -2515 -1244 2225 1419
4589 1419 -2206 -1900 1743 2061 -1440 -2152 1389 2208 -668 -2601 938 2495 -557 -2395 162 2599
4605 2599 315 -2702 -884 2231 1068 -2257 -1347 2306 1741 -2109 -2080 1443 2291 -1215 -2355 647
4621 647 2660 -494 -2377 488 2576 -63 -2629 -365 2471 719 -2490 -1118 2566 1173 -2244
4636 -2244 -1533 1898 1725 -1779 -2238 1360 2265 -916 -2621 353 2583 -269 -2694 87 2878 444
4652 444 -2114 -669 2655 1140 -2631 -1190 2307 1739 -1637 -1875 1739 2008 -1457 -2086 901 2549
4668 2549 -561 -2573 280 3006 69 -2617 -138 2553 638 -2371 -828 2750 1254 -2045 -1732
4683 -1732 2144 2047 -1783 -2178 1211 2427 -1232 -2528 664 2604 -490 -2181 58 2404 225 -2572
4699 -2572 -437 2580 926 -2364 -1511 2080 1655 -1727 -2068 1830 2050 -1408 -2281 957 2322 -824
4715 -824 -2633 411 2893 -80 -2631 -464 2635 739 -2470 -1203 2573 1247 -2310 -1666 1750
4730 1750 1765 -1633 -1800 1254 1975 -1035 -2695 743 2559 -528 -2732 236 2275 90 -2665 -558
4746 -558 2506 842 -2367 -1371 2261 1259 -2025 -1638 1721 1670 -1337 -2180 964 2447 -924 -2645
4762 -2645 509 2784 -211 -2852 -288 2919 539 -2287 -937 2483 1227 -2338 -1440 2058 1715
4777 1715 -1606 -2106 1004 2509 -1186 -2354 903 2457 -753 -2708 262 2587 266 -2542 -462
4792 -462 2384 1085 -2311 -1420 1994 1564 -2059 -2009 1697 1892 -1622 -2557 1175 2681 -1269 -2430 709
4809 709 2700 -397 -2716 -256 2991 424 -2513 -1125 2348 1022 -2341 -2028 2137 1954 -1881 -1938
4825 -1938 2096 2398 -1324 -2449 910 2654 -516 -2793 86 2811 -49 -2812 -663 2299 966
4840 966 -2835 -1568 2324 1340 -2192 -1791 1806 1980 -1507 -2201 1220 2426 -1027 -2301 571 2743
4856 2743 -190 -2699 -344 2616 574 -2670 -891 2486 1229 -2337 -1548 2258 1663 -1934 -1945 1587
4872 1587 2271 -1365 -2581 941 2963 -653 -3011 382 2841 236 -2670 -333 2618 849 -2497
4887 -2497 -1307 2300 1456 -2030 -1866 1874 2207 -1493 -2552 1303 2699 -963 -2922 694 2780 -522
4903 -522 -2586 95 2755 326 -2671 -607 2689 1269 -2563 -1652 2148 1815 -1900 -2214 2182 2379
4919 2379 -1305 -2747 1082 2599 -822 -2728 358 2676 -173 -2767 -421 2492 646 -2598 -990
4934 -990 2480 1401 -2302 -1910 2034 2087 -1732 -2101 1457 2408 -1010 -2477 754 2670 -396 -2509
4950 -2509 -92 2840 534 -2739 -679 2388 755 -2597 -1389 2196 1713 -2009 -2209 1788 2390 -1440
4966 -1440 -2285 1164 2499 -886 -2489 695 2911 -65 -2886 -347 2782 538 -2750 -978 2541
4981 2541 1255 -2159 -1756 2045 1878 -1591 -1861 1372 2358 -1028 -2531 686 2731 -524 -2638 109
4997 109 2824 145 -2791 -1008 2495 1009 -2213 -1279 2144 1828 -2138 -1904 1729 1974 -1439 -2198
5013 -2198 1027 2366 -987 -2774 374 2676 -320 -2781 -258 2700 693 -2468 -1046 2686 1302
5028 1302 -2070 -1711 1802 1759 -1687 -1933 1406 2247 -1361 -2367 819 2683 -352 -2660 83 2621
5044 2621 52 -2369 -705 2436 814 -2331 -1218 2218 1649 -1866 -1754 1784 2000 -1536 -2134 1332
5060 1332 2654 -922 -2648 469 2451 -108 -2557 -386 2477 679 -2229 -884 2241 1131 -2215
5075 -2215 -1520 2026 1791 -1640 -2166 1649 2055 -1248 -2480 967 2383 -670 -2442 448 2471 -84
5091 -84 -2556 -390 2757 731 -2276 -1228 2313 1268 -2218 -1774 2050 1926 -1504 -2112 1300 2491
5107 2491 -760 -2405 428 2380 -211 -2617 -164 2559 432 -2518 -646 2500 1013 -2364 -1445
5122 -1445 2512 1633 -1441 -1939 1441 1813 -1210 -2645 963 2307 -917 -2536 471 2438 -30 -2688
5138 -2688 -213 2605 687 -2438 -794 2531 1537 -2251 -1596 1628 1813 -1671 -1985 1282 2083 -992
5154 -992 -2242 496 2398 -562 -2441 38 2186 254 -2390 -544 2422 1217 -2303 -1237 2400
5169 2400 1888 -1749 -1731 1565 1929 -1629 -2348 1172 2386 -766 -2363 322 2280 78 -2459 -211
5185 -211 2325 713 -2504 -873 2436 1320 -2049 -1466 2268 2138 -1884 -1961 1525 2105 -1019 -2349
5201 -2349 837 2405 -370 -1992 313 2683 330 -2206 -492 2504 945 -2441 -899 2206 1321
5216 1321 -1733 -1343 1711 1707 -1668 -2057 1180 2028 -735 -2422 551 2431 103 -2460 -100 2456
5232 2456 464 -2484 -682 2410 1424 -2056 -1199 1744 1927 -1575 -1751 1756 2016 -1225 -2285 1033
5248 1033 2351 -752 -2570 545 2532 93 -2510 -332 2150 864 -1955 -1125 2205 1277 -1856
5263 -1856 -1584 1495 1865 -1710 -2114 1337 2289 -1188 -2428 755 2307 -426 -2157 -8 2100 585
5279 585 -2189 -651 2096 1070 -2242 -1505 1830 1547 -1899 -1798 1539 1884 -1203 -1944 923 2127
5295 2127 -712 -2556 275 2262 279 -2412 -218 2393 471 -2315 -986 2106 1112 -2122 -1285
5310 -1285 1769 1661 -1761 -1841 1192 2037 -889 -2213 296 2407 -322 -2165 -146 2365 335 -2096
5326 -2096 -413 2177 966 -2188 -1305 1961 1480 -1720 -1707 1506 1742 -1198 -2015 1068 2363 -680
5342 -680 -2246 480 2330 -75 -2557 -237 2383 574 -2329 -491 2271 1030 -1945 -1561 1472
5357 1472 1616 -1565 -1942 881 2012 -836 -2081 894 2060 -279 -2308 230 2122 172 -2298
5372 -2298 -512 2389 732 -2101 -990 1847 1340 -1665 -1565 1753 1936 -1287 -2108 1050 2067 -930
5388 -930 -2045 317 2206 110 -2273 -201 2237 575 -2090 -836 1792 1019 -1788 -1371 1863 1571
5404 1571 -1353 -1759 1229 1819 -847 -1776 753 2177 -604 -2236 127 2101 143 -1911 -387 2140
5420 2140 519 -2122 -1219 1805 1489 -1681 -1470 1126 1707 -1199 -1662 875 2139 -581 -2167 447
5436 447 2243 -290 -2134 -69 2167 591 -2026 -749 2046 779 -1597 -1057 1733 1709 -1118 -1765
5452 -1765 1037 1533 -701 -1811 980 1896 -369 -1977 292 2054 362 -1872 -499 1967 521
5467 521 -1777 -1057 1503 1109 -1573 -1269 1221 1204 -1382 -1388 900 1616 -620 -2046 174 1867 171
5484 171 -1835 270 1918 546 -1812 -674 1729 721 -1544 -1148 1684 904 -1464 -1663 1374 1518
5500 1518 -757 -1675 639 1716 -838 -1740 272 1876 93 -1862 -179 1904 490 -1841 -627
5515 -627 1562 810 -1569 -1037 1292 1456 -954 -1400 1077 1635 -855 -1823 575 1509 -203 -1978 11
5532 11 1728 297 -1675 -241 1597 664 -1559 -955 1357 1156 -1457 -1438 1149 1443 -746 -1338 401
5549 401 1576 -623 -1529 283 1802 -4 -1566 -283 1413 356 -1924 -785 1591 748 -1520 -1110
5565 -1110 1188 1026 -1451 -1064 1159 1257 -832 -1584 901 1484 -400 -1623 399 1693 -20 -1618
5581 -1618 -279 1630 582 -1562 -742 1384 818 -1382 -1081 1161 1114 -1076 -1080 717 1282 -531 -1453
5598 -1453 623 1515 -193 -1696 26 1522 81 -1398 -216 1738 912 -1503 -843 1252 978 -862
5614 -862 -1373 908 1404 -749 -1418 702 1474 -554 -1195 327 1533 -92 -1620 -224 1302 564 -1330
5631 -1330 -742 1184 837 -1267 -864 1076 980 -1158 -1413 785 1242 -804 -1430 312 1340 44 -1520
5648 -1520 194 1413 28 -1332 -378 1402 697 -1347 -609 1317 888 -1253 -1164 1175 1127 -875 -1052
5665 -1052 418 1348 -204 -1256 459 1464 -96 -1385 60 1384 318 -1256 -341 1185 836 -1459
5681 -1459 -679 1170 795 -848 -1125 784 799 -669 -1192 498 1044 -72 -1495 135 1523 117 -1437
5698 -1437 -316 1009 272 -951 -797 1094 761 -1163 -605 766 1310 -690 -892 747 1245 -541 -1221
5715 -1221 562 1231 -280 -1453 -125 1170 270 -1296 -410 931 701 -1222 -749 920 774 -850
5731 -850 -924 614 1127 -619 -1296 515 1440 -332 -1336 197 987 -37 -1464 -71 1387 292 -1250
5748 -1250 -416 1212 755 -945 -646 1053 1076 -847 -1069 620 1095 -648 -1313 278 895 -392 -1326
5765 -1326 23 1171 67 -1024 -483 1315 515 -1352 -607 1011 983 -989 -906 870 700 -604 -1178
5782 -1178 475 1216 -452 -1189 139 1483 66 -1210 -116 1241 212 -889 -570 1231 126 -1049
5798 -1049 -566 791 683 -813 -986 887 856 -370 -1171 329 1186 20 -919 179 1259 -108 -1271
5815 -1271 -303 1216 428 -1053 -543 1002 593 -805 -728 836 858 -768 -1092 519 1044 -312 -908 491
5833 491 1149 161 -913 143 729 4 -985 -343 1120 254 -858 -606 710 780 -1156 -915 628 909
5851 909 -612 -863 143 698 -208 -922 183 896 -5 -700 -80 859 164 -970 -160 1036 326 -868
5869 -868 -351 759 783 -500 -644 11 832 -418 -771 274 1036 -125 -734 138 1123 20 -743 -366
5887 -366 668 110 -980 -361 533 417 -656 -658 509 640 -571 -634 436 708 -388 -643 135 664 -38
5906 -38 -527 120 491 -12 -794 -66 577 307 -601 -475 803 565 -503 -492 477 635 -328 -785 398 662
5926 662 -386 -619 328 783 -26 -725 -260 645 540 -717 -301 812 633 -307 -335 571 534 -458 -722 338
5946 338 738 -281 -530 201 578 -187 -526 -22 829 45 -589 -272 495 275 -696 -393 735 286 -472
5965 -472 -511 645 553 -474 -681 193 561 -380 -410 330 630 -104 -847 86 414 274 -350 -292 419 76 -630
5986 -630 -209 372 481 -227 -721 474 433 -169 -414 388 419 -479 -685 269 584 -257 -479 108 608 74
6006 74 -391 -47 693 172 -613 -265 355 454 -304 -478 129 479 -206 -426 -19 450 -178 -417 204 532 40
6027 40 -215 159 457 158 -365 -184 196 -30 -393 -86 428 122 -339 -449 395 297 -333 -337 257 500 -237
6048 -237 -638 126 250 125 -419 -320 129 220 -452 -282 550 18 -381 -253 584 283 -140 -297 79 182 -76
6069 -76 -335 81 371 -217 -449 9 446 6 -449 -15 219 -23 -324 -402 231 84 -162 5 21 515 -401
6090 -401 -358 422 55 -119 -290 270 408 -7 -232 172 346 178 -272 272 259 168 -14 25 528 292 -166
6111 -166 124 299 257 -190 -374 423 530 -250 104 167 371 77 -318 -187 231 57 -348 418 397 -94 -258
6132 -258 62 514 201 -469 -114 219 28 12 -278 435 368 -310 -420 30 328 -239 -233 104 409 -61 -142 204
6154 204 184 65 -377 -183 303 -227 -276 -115 172 269 -280 -408 152 504 -242 -159 234 395 -201 -284 -33 355
6176 355 -87 -224 136 390 -7 -219 128 270 -47 -358 -10 242 -179 -176 -283 204 -21 -244 -280 239 20
6197 20 -413 -177 334 254 -194 -158 -79 420 98 -337 91 698 120 -157 63 372 -1 -168 -372 312 145
6218 145 -217 -183 61 284 37 -277 -52 283 -204 -467 -212 241 -33 -96 -198 438 73 -413 -338 261 5
6239 5 -323 -275 253 225 -368 -440 -66 323 -470 -96 39 326 -85 -273 44 518 24 -197 -48 372 -80 -304
6261 -304 -293 161 142 -311 -188 441 209 -505 -305 144 226 20 -241 163 283 204 -180 245 262 135 -381 -218
6283 -218 362 195 -155 1 142 19 -170 -329 134 82 -130 -154 265 299 -269 48 147 104 -40 -73 -46 420
6305 420 -82 -231 -215 498 -56 -192 -198 311 -74 -134 -26 -174 158 -511 -252 86 319 -372 -260 157 329
6326 329 22 -274 -50 426 -132 -446 147 538 -2 -145 -111 126 159 -168 -337 278 522 -119 -373 182 195
6347 195 -177 -107 49 257 -44 -60 -16 5 -52 -687 -238 232 -157 -285 55 222 24 -75 -321 183 82 -265
6369 -265 -191 13 384 -80 -375 419 346 24 -548 -4 247 -68 -368 -223 280 -219 -396 -49 216 267 -207
6390 -207 -210 125 67 -454 -378 172 238 -199 -392 34 228 -14 -383 185 226 -31 -429 192 572 9 -272 -9
6412 -9 206 359 -505 -104 335 302 -125 -350 26 412 -157 -355 110 271 261 -612 -282 397 -157 -491 -52
6433 -52 235 47 -597 -367 -13 398 -352 -213 278 105 -262 -509 344 408 -515 -381 217 531 -83 -333 136
6454 136 467 162 -452 271 344 210 -301 -331 152 458 -468 -201 233 249 -334 -322 177 413 -487 -391 -69 586
6476 586 -71 -114 -95 164 140 -650 58 565 -25 -621 -270 394 171 -216 -248 197 207 -1 -336 121 390 -136
6498 -136 -517 167 409 -22 -476 12 364 -39 -253 -137 444 560 -374 -354 496 190 -271 -387 65 407
6518 407 -89 -432 255 685 16 -293 257 362 117 -539 -426 559 -7 -503 -581 465 312 -263 -444 257
6538 257 582 -169 -290 103 532 -110 -234 21 330 -161 -448 87 581 283 -622 -409 343 223 -378 -314
6558 -314 333 294 -455 -372 389 348 -139 -727 313 407 25 -630 55 332 -121 -834 -312 609 152 -436 -203
6579 -203 591 364 -120 -421 536 306 -227 -524 385 358 -137 -320 54 524 -62 -583 -84 583 59 -526
6599 -526 -33 587 234 -662 -480 557 279 -474 -555 330 169 -123 -669 44 520 -303 -699 238 616 -36
6619 -36 -519 -254 580 143 -623 -134 614 287 -537 -207 462 270 -446 -549 362 662 -401 -427 182 629
6639 629 -303 -538 -143 598 67 -648 -50 669 112 -484 -475 303 800 -319 -570 443 397 -286 -420 -83
6659 -83 578 -72 -687 220 564 -227 -515 -57 582 55 -482 -317 330 109 -773 -438 545 437 -505 -523 457
6680 457 300 -233 -486 364 679 -6 -538 117 739 144 -1015 -80 554 246 -661 -409 388 372 -365 -463
6700 -463 382 522 -259 -490 357 545 -217 -933 360 493 48 -511 -156 769 172 -493 -277 311 59 -495
6720 -495 -228 707 276 -499 -504 179 515 -186 -563 267 472 -153 -440 -96 540 119 -529 -193 648 115 -400
6741 -400 -316 606 352 -457 -73 454 581 -248 -729 237 402 11 -511 203 626 -52 -523 65 337 161
6761 161 -780 -208 620 386 -564 -248 623 296 -478 -347 41 498 -554 -622 79 597 -396 -621 71 328
6781 328 75 -506 -182 443 92 -416 -346 440 444 -720 -489 532 473 -511 -560 46 540 -23 -663 151 416
6802 416 -78 -669 -70 534 67 -614 -200 646 139 -678 -468 421 434 -504 -418 310 558 -57 -306 186 608
6823 608 -373 -403 -57 687 -16 -730 120 702 -240 -468 -231 489 439 -413 -372 502 286 -209 -287 304 495
6844 495 -296 -424 220 700 -6 -710 -2 677 14 -337 -394 518 164 -410 -392 769 449 -457 -676 265
6864 265 461 -250 -237 106 492 -649 -804 31 419 -59 -295 -74 706 -13 -648 28 632 267 -447 -466
6884 -466 301 486 -328 -542 385 599 -270 -507 180 524 -207 -650 -84 619 -51 -447 -185 653 106 -449
6904 -449 -224 656 246 -320 -306 507 545 -442 -572 97 388 -91 -648 18 643 -56 -672 27 662 81 -633
6925 -633 -100 560 212 -615 -294 358 438 -531 -351 486 672 -342 -418 597 737 -45 -782 -98 746 32
6945 32 -555 -124 690 316 -859 -24 299 371 -534 -522 158 330 -645 -704 369 713 8 -714 177 880 -37
6966 -37 -543 -206 504 -160 -546 -321 764 174 -414 -287 277 571 -508 -622 331 362 -219 -582 -3 741
6986 741 -67 -448 267 679 24 -678 -73 854 -95 -732 -177 674 388 -744 -518 238 372 -569 -426 131
7006 131 641 -323 -470 260 644 -76 -377 -272 634 351 -798 -221 824 340 -499 -392 646 630 -548
7025 -548 -276 552 617 -612 -688 312 417 -38 -870 -80 686 -97 -635 -198 659 373 -417 -622 505 471
7045 471 -410 -509 684 422 -547 -438 410 550 -286 -678 -82 620 28 -878 -222 514 203 -572 -159 689
7065 689 256 -879 -439 572 647 -43 -631 426 479 -186 -795 218 788 -16 -789 123 365 132 -898
7084 -898 -190 363 134 -659 -385 487 340 -734 -643 396 350 -387 -692 359 701 -93 -654 115 566 -148
7104 -148 -866 -70 726 173 -554 -259 366 449 -489 -746 456 524 -474 -687 255 535 -26 -697 235 760
7124 760 -229 -667 -184 518 365 -805 -137 600 101 -504 -537 540 626 -486 -298 287 646 -303 -714 410
7144 410 864 0 -615 -172 720 44 -742 25 455 249 -569 -372 720 326 -366 -160 575 560 -270 -328
7164 -328 84 431 -14 -668 -41 881 -40 -667 -33 427 -44 -635 -72 485 457 -462 -513 554 403 -424
7184 -424 -503 362 545 -393 -822 360 669 -119 -795 -209 697 85 -746 -521 810 264 -641 -514 283 411
7204 411 -644 -204 530 758 -51 -674 455 854 -16 -463 117 470 -144 -730 -15 577 -38 -361 -218
7223 -218 725 325 -638 -255 420 605 -262 -623 595 402 -249 -574 246 633 3 -750 57 553 -7 -705
7243 -705 -65 648 93 -520 -311 507 313 -417 -426 646 552 -684 -717 570 610 -109 -880 271 603 -111
7263 -111 -655 9 887 347 -594 -333 445 306 -610 -399 410 654 -362 -494 67 302 -439 -605 261 584
7283 584 -234 -730 183 1008 151 -468 81 464 219 -545 -477 437 268 -578 -400 540 470 -332 -451 473 587
7304 587 -517 -540 393 616 -146 -459 -127 560 60 -548 -319 579 55 -480 -176 572 213 -402 -615 476
7324 476 482 -660 -409 314 685 -34 -698 4 766 -87 -614 -178 254 -49 -431 -7 666 266 -581 -367
7344 -367 350 425 -340 -494 328 727 -544 -730 216 657 -208 -707 -29 630 153 -946 -198 853 -190
7363 -190 -449 -307 711 279 -393 -551 260 683 -366 -582 210 568 -306 -355 90 805 -129 -619 -18 804
7383 804 -19 -873 -407 755 325 -628 -447 386 495 -407 -553 265 528 -400 -883 -48 646 -113 -645 -141
7403 -141 741 -202 -1004 -270 391 64 -568 -275 562 400 -775 -387 478 771 -671 -702 388 321 78 -666
7423 -666 223 530 3 -591 -177 287 218 -773 -389 608 358 -317 -222 668 675 -508 -594 313 443 -348 -516
7444 -516 381 524 -152 -766 -98 615 147 -701 -293 703 109 -697 -523 512 544 -409 -370 407 530 -408
7464 -408 -689 519 604 -127 -736 181 750 46 -610 39 725 135 -773 -327 693 482 -580 -371 506
7483 506 672 -371 -777 186 746 -65 -847 107 879 -230 -756 -134 910 -58 -901 -132 756 395 -450
7502 -450 -6 605 609 -239 -550 469 747 -343 -875 273 1149 -144 -479 139 729 -284 -762 6 719
7521 719 342 -611 -269 659 588 -771 -644 691 704 -567 -845 378 668 -239 -662 -22 889 -153 -1030
7540 -1030 -305 783 155 -767 -387 668 342 -813 -365 630 393 -716 -605 339 646 -143 -729 429
7558 429 503 -189 -731 272 774 135 -805 99 777 278 -634 -515 636 718 -492 -538 532 834 -431
7577 -431 -830 520 796 -96 -625 49 588 32 -897 -247 645 47 -697 -421 727 369 -720 -394 647
7596 647 581 -518 -901 191 880 -135 -803 500 713 -162 -1049 64 785 159 -696 -379 832 14
7614 14 -753 -350 733 525 -556 -358 550 542 -308 -747 317 839 56 -465 283 548 98 -941 -93 787
7634 787 212 -698 -164 655 504 -551 -384 374 529 -509 -596 677 834 59 -541 380 928 -59 -746
7653 -746 131 694 -59 -555 -12 526 193 -537 -484 639 507 -779 -851 246 1057 -326 -397 309 775 -196
7673 -196 -678 203 822 127 -999 -111 671 96 -622 -113 918 338 -633 -292 361 437 -544 -187 538 547
7693 547 -280 -583 260 630 132 -892 -25 656 -222 -645 -179 744 15 -672 -60 796 644 -482 -480 324
7713 324 937 -334 -830 367 675 -230 -768 92 511 -235 -647 98 858 39 -665 -187 535 181 -725
7732 -725 -393 553 494 -465 -346 443 679 -375 -632 126 810 224 -860 65 793 -11 -736 -124 593 154
7752 154 -955 -402 613 314 -372 -666 571 368 -647 -369 149 576 -116 -433 204 806 -127 -962 59
7771 59 662 44 -477 -181 823 365 -576 -243 832 157 -682 -571 622 479 -753 -393 53 650 -35
7790 -35 -798 208 733 250 -663 -165 672 211 -732 -219 523 -134 -671 -536 576 480 -558 -700 551
7809 551 802 -275 -489 103 865 -42 -744 -26 651 -66 -628 63 696 232 -708 -531 447 411 -571 -594
7829 -594 470 698 -574 -553 387 621 -177 -901 42 672 84 -676 -74 887 26 -866 -172 504 215 -598
7849 -598 -281 541 404 -579 -619 409 723 -194 -646 315 626 -114 -663 160 764 154 -944 -70 654 236
7869 236 -661 -288 460 403 -744 -376 528 401 -350 -728 335 684 -304 -463 91 657 67 -516 -120 605
7889 605 103 -837 -259 891 417 -657 -616 578 761 -346 -481 434 685 -644 -836 240 696 -317
7907 -317 -754 -17 665 68 -679 -179 485 379 -813 -367 582 404 -716 -687 951 871 -461 -804 357
7926 357 563 -376 -828 388 621 -308 -565 219 883 172 -771 -129 922 103 -679 -217 772 465 -619
7945 -619 -945 540 567 -157 -526 324 792 -90 -941 -92 698 -312 -658 -366 864 206 -874 -241 615
7964 615 312 -368 -499 584 194 -465 -308 241 926 -299 -747 55 744 -138 -780 204 531 -183 -960
$$ [...]
8191a76
##END NTUPLES=NMR FID
##END=
