##TITLE=1H_Pr 82-D
 200.13MHz, CDCl3,
 8 sc
 
 11.3.2025
##JCAMPDX= 6.0         $$ Bruker NMR JCAMP-DX V2.0
##DATA TYPE= NMR FID
##DATA CLASS= NTUPLES
##ORIGIN= UXNMR, Bruker Analytische Messtechnik GmbH
##OWNER= pz
$$ XWIN-NMR		Version 3.5
$$ Tue Mar 11 14:28:39 2025 Russian Standard Time (UT+4h)  she@DPX200
##.OBSERVE FREQUENCY= 200.1313
##.OBSERVE NUCLEUS= ^1H
##.DELAY= (6, 6)
##.ACQUISITION MODE= SIMULTANEOUS
##.ACQUISITION SCHEME= undefined
##.AVERAGES= 8
##.DIGITISER RES= 18
##SPECTROMETER/DATA SYSTEM= spect
##.PULSE SEQUENCE= zg30
##.SOLVENT NAME= CDCl3
##.SHIFT REFERENCE= (INTERNAL, CDCl3, 0, 14.3821)
##AUDIT TRAIL= $$ (NUMBER, WHEN, WHO, WHERE, WHAT)
$$ ##TITLE= Audit trail, XWIN-NMR		Version 3.5
$$ ##JCAMPDX= 5.01
$$ ##ORIGIN= Bruker BioSpin GmbH
$$ ##OWNER= she
$$ F:/spectra/data/she/nmr/H-C/1/audita.txt
$$ ##AUDIT TRAIL=  $$ (NUMBER, WHEN, WHO, WHERE, WHAT)
(   1,<2025-03-11 14:27:37.93 +0400>,<she>,<DPX200>,
      <created by zg, POWCHK disabled, PULCHK disabled
       configuration hash MD5:
       00 E9 B6 7A A2 85 ED C7 34 08 36 98 17 FE 4E 26
       data hash MD5: 16K
       43 8A A9 8A 3C B7 57 E4 C2 76 6C DA E5 BE 81 50>)
$$ ##END=
$$ 
$$ hash MD5
$$ EA 76 DD FE DE 49 87 43 82 AB 80 AD 61 AB AC 85
##$RELAX= 
##$RELAX= 
##$RELAX= 
##$RELAX= 
##$RELAX= 
##$RELAX= 
$$ Bruker specific parameters
$$ --------------------------
##$DU= <F:/spectra>
##$EXPNO= 1
##$NAME= <H-C>
##$PROCNO= 1
##$TYPE= <nmr>
##$USER= <she>
##$AMP= (0..31)
100 100 100 100 100 100 100 100 100 100 100 100 100 100 100 100 100 100 
100 100 100 100 100 100 100 100 100 100 100 100 100 100 
##$AQSEQ= 0
##$AQ_mod= 1
##$AUNM= <au_zg>
##$AUTOPOS= <>
##$BF1= 200.13
##$BF2= 200.13
##$BF3= 200.13
##$BF4= 200.13
##$BF5= 200.13
##$BF6= 200.13
##$BF7= 200.13
##$BF8= 200.13
##$BYTORDA= 1
##$CFDGTYP= 0
##$CFRGTYP= 5
##$CHEMSTR= <none>
##$CNST= (0..31)
1 1 145 1 1 1 1 1 1 1 1 1 1 1 1 1 1 1 1 1 1 1 1 1 1 1 1 1 1 1 1 1 
##$CPDPRG= <>
##$CPDPRG1= <>
##$CPDPRG2= <>
##$CPDPRG3= <>
##$CPDPRG4= <mlev>
##$CPDPRG5= <mlev>
##$CPDPRG6= <mlev>
##$CPDPRG7= <mlev>
##$CPDPRG8= <mlev>
##$CPDPRGB= <>
##$CPDPRGT= <>
##$D= (0..31)
0 0.7 0 0 0 0 0 0 0 0 0 0.03 0 0 0 0 0 0 0 0 0 0 0 0 0 0 0 0 0 0 0 0 
##$DATE= 1741688857
##$DBL= (0..7)
120 120 120 120 120 120 120 120 
##$DBP= (0..7)
150 150 150 150 150 150 150 150 
##$DBP07= 0
##$DBPNAM0= <>
##$DBPNAM1= <>
##$DBPNAM2= <>
##$DBPNAM3= <>
##$DBPNAM4= <>
##$DBPNAM5= <>
##$DBPNAM6= <>
##$DBPNAM7= <>
##$DBPOAL= (0..7)
0.5 0.5 0.5 0.5 0.5 0.5 0.5 0.5 
##$DBPOFFS= (0..7)
0 0 0 0 0 0 0 0 
##$DE= 6
##$DECBNUC= <off>
##$DECIM= 32
##$DECNUC= <off>
##$DECSTAT= 4
##$DIGMOD= 1
##$DIGTYP= 9
##$DL= (0..7)
0 120 120 120 120 120 120 120 
##$DP= (0..7)
150 150 150 150 150 150 150 150 
##$DP07= 0
##$DPNAME0= <>
##$DPNAME1= <>
##$DPNAME2= <>
##$DPNAME3= <>
##$DPNAME4= <>
##$DPNAME5= <>
##$DPNAME6= <>
##$DPNAME7= <>
##$DPOAL= (0..7)
0.5 0.5 0.5 0.5 0.5 0.5 0.5 0.5 
##$DPOFFS= (0..7)
0 0 0 0 0 0 0 0 
##$DQDMODE= 0
##$DR= 18
##$DS= 0
##$DSLIST= <SSSSSSSSSSSSSSS>
$$ [...]
##$SUBNAM0= <"">
##$SUBNAM1= <"">
##$SUBNAM2= <"">
##$SUBNAM3= <"">
##$SUBNAM4= <"">
##$SUBNAM5= <"">
##$SUBNAM6= <"">
##$SUBNAM7= <"">
##$SUBNAM8= <"">
##$SUBNAM9= <"">
##$SW= 18.0517328524113
##$SWIBOX= (0..15)
0 0 2 0 0 0 0 0 0 0 0 0 0 0 0 0 
##$SW_h= 3612.71676300578
##$TD= 16384
##$TD0= 1
##$TE= 0
##$TE2= 300
##$TE3= 300
##$TEG= 300
##$TL= (0..7)
0 120 120 120 120 120 120 120 
##$TP= (0..7)
150 150 150 150 150 150 150 150 
##$TP07= 0
##$TPNAME0= <>
##$TPNAME1= <>
##$TPNAME2= <>
##$TPNAME3= <>
##$TPNAME4= <>
##$TPNAME5= <>
##$TPNAME6= <>
##$TPNAME7= <>
##$TPOAL= (0..7)
0.5 0.5 0.5 0.5 0.5 0.5 0.5 0.5 
##$TPOFFS= (0..7)
0 0 0 0 0 0 0 0 
##$TUNHIN= 0
##$TUNHOUT= 0
##$TUNXOUT= 0
##$USERA1= <user>
##$USERA2= <user>
##$USERA3= <user>
##$USERA4= <user>
##$USERA5= <user>
##$V9= 5
##$VALIST= <valist>
##$VCLIST= <CCCCCCCCCCCCCCC>
##$VD= 0
##$VDLIST= <DDDDDDDDDDDDDDD>
##$VPLIST= <PPPPPPPPPPPPPPP>
##$VTLIST= <TTTTTTTTTTTTTTT>
##$WBST= 1024
##$WBSW= 4
##$XGAIN= (0..3)
0 0 0 0 
##$XL= 0
##$YL= 0
##$YMAX_a= 120663
##$YMIN_a= -149200
##$ZGOPTNS= <>
##$ZL1= 120
##$ZL2= 120
##$ZL3= 120
##$ZL4= 120
##$ABSF1= 10
##$ABSF2= 0
##$ABSG= 5
##$ABSL= 3
##$ALPHA= 0
##$AQORDER= 0
##$ASSFAC= 0
##$ASSFACI= 0
##$ASSFACX= 0
##$ASSWID= 0
##$AUNMP= <proc_1d>
##$AZFE= 0.1
##$AZFW= 0.1
##$BCFW= 1
##$BC_mod= 2
##$BYTORDP= 1
##$COROFFS= 0
##$CY= -3
##$DATMOD= 1
##$DC= 2
##$DFILT= <>
##$DTYPP= 0
##$F1P= 0
##$F2P= 0
##$FCOR= 0.5
##$FTSIZE= 0
##$FT_mod= 4
##$GAMMA= 1
##$GB= 0.15
##$INTBC= 1
##$INTSCL= 1
##$ISEN= 128
##$LB= 0.25
##$LEV0= 0
##$LPBIN= 0
##$MAXI= 10000
##$MC2= 0
##$MEAN= 0
##$ME_mod= 0
##$MI= 1.114404
##$NCOEF= 0
##$NC_proc= 0
##$NLEV= 6
##$NOISF1= 3.799351
##$NOISF2= 2.8
##$NSP= 1
##$NTH_PI= 0
##$NZP= 0
##$OFFSET= 14.38212
##$PC= 1
##$PHC0= -467.181
##$PHC1= 8.992218
##$PH_mod= 1
##$PKNL= yes
##$PPARMOD= 0
##$PSCAL= 0
##$PSIGN= 0
##$REVERSE= no
##$SF= 200.129724274929
##$SI= 16384
##$SIGF1= 3
##$SIGF2= 2
##$SINO= 400
##$SIOLD= 16384
##$SREGLST= <1H.CDCl3>
##$SSB= 0
##$STSI= 0
##$STSR= 0
##$SW_p= 3205.1282051282
##$SYMM= 0
##$S_DEV= 0
##$TDeff= 0
##$TDoff= 0
##$TI= <>
##$TILT= no
##$TM1= 0
##$TM2= 0
##$TOPLEV= 0
##$USERP1= <user>
##$USERP2= <user>
##$USERP3= <user>
##$USERP4= <user>
##$USERP5= <user>
##$WDW= 1
##$XDIM= 8192
##$YMAX_p= 0
##$YMIN_p= 0
$$ End of Bruker specific parameters
$$ ---------------------------------
##NTUPLES= NMR FID
##VAR_NAME=  TIME,          FID/REAL,        FID/IMAG
##SYMBOL=    X,             R,               I
##VAR_TYPE=  INDEPENDENT,   DEPENDENT,       DEPENDENT
##VAR_FORM=  AFFN,          ASDF,            ASDF
##VAR_DIM=   8192,          8192,            8192
##UNITS=     SECONDS,       ARBITRARY UNITS, ARBITRARY UNITS
##FACTOR=    0.0002768,     1,               1
##FIRST=     0,             0,               0
##LAST=      2.2672688,     0,               0
##MIN=       0,             -149200,         0
##MAX=       2.2672688,     120663,          0
$$ Real data points
##PAGE= N=1
##DATA TABLE= (X++(R..R)), XYDATA
0 0 0 0 0 0 0 0 0 0 0 0 0 0 0 0 0 0 0 0 0 -4 8 -8 8 -8 8 -8 12 -16 16 -16 20 -24 24 -29 32 -37 40 -45 50 -54 61
41 61 -68 76 -83 91 -103 111 -123 134 -148 163 -179 200 -220 243 -272 303 -339 384 -437 503 -585
62 -585 697 -847 1068 -1415 2020 -3297 7009 -39110 -149200 10289 91522 -27348 -10291
75 -10291 120663 68637 -21640 55488 79523 -47913 -63838 29190 2038 -64408 -28313 -28303
87 -28303 -80096 -23754 48225 -2499 -17304 59851 45224 -32327 -12834 12316 -28270 -7269
99 -7269 47197 16215 127 43352 7274 -46841 10636 29850 -45933 -15876 60000 -19720
111 -19720 -75705 37850 57814 -59617 -27232 77140 2096 -73713 4349 4122 -88747 -29305
123 -29305 72511 9136 -33663 59310 70123 -12031 9244 52042 -12840 -32911 38793 21061
135 21061 -57647 -33160 13878 -23647 -36081 7585 -8296 -41580 709 21402 -28730 -22393
147 -22393 38904 30927 4551 43947 51126 -4609 -1320 33639 -9472 -45902 -2762 3880 -39923
160 -39923 -18445 14097 -23763 -24352 30844 9768 -33329 16220 39004 -26519 -22792 38816 5810
173 5810 -34043 24316 37581 -27549 -12472 37145 -7677 -37177 16041 15691 -26837 8095 34815
186 34815 -17721 -18946 34716 5652 -40933 1775 21207 -32381 -28706 19957 -3911 -33963
198 -33963 10772 31521 -5952 -1723 31142 13338 -7251 14946 14736 -11267 129 15988 -10057
211 -10057 -21652 2977 -2971 -27873 -10594 8507 -14325 -17585 13570 9025 -14502 6065 26186
224 26186 3245 -581 22671 9392 -11692 8318 11775 -18261 -9701 14850 -8661 -23380 7509
237 7509 5633 -24507 -3071 22079 -7965 -15925 19267 10768 -19376 1991 18879 -9377 -8839
250 -8839 18644 3258 -15756 7495 12124 -12410 -3590 14583 -3907 -11153 9033 3179 -14827
263 -14827 -198 11347 -6007 -7238 8407 749 -11223 87 4302 -6924 -2804 8880 3378
276 3378 -2303 5249 5990 -1887 876 5817 -1027 -5261 1156 709 -7308 -4342 3137 -1095 -4730 3300
292 3300 4527 -5350 -3843 4415 -775 -4850 4918 7043 -1682 1523 8055 -274 -4284 3316 415
307 415 -7860 -1474 2406 -7350 -6430 3615 -142 -4182 4294 4726 -3281 365 6039 -145 -1845 4809
323 4809 3943 927 4054 2607 -2960 -2523 -1466 -5127 -5323 -4460 -6146 -3934 336 -1463 -970 4784
339 4784 4525 2915 7113 6413 366 2801 6114 -26 -1152 3144 -1764 -6544 -925 -2290 -10543 -6314
355 -6314 -300 -6018 -5814 3815 2065 -2363 6167 9611 1906 3869 8456 1075 -2620 4337 1392
370 1392 -6542 -590 3360 -5361 -5415 2915 -1898 -8634 -173 4293 -4107 -3998 4634 1459 -4451 2230
386 2230 5619 -2575 -2727 5292 1341 -5234 1828 5904 -1409 614 10445 4254 -4437 3876 5792
401 5792 -7977 -7227 3272 -5026 -12797 -485 780 -11853 -5008 7014 -2656 -4534 11184 8209
415 8209 -3742 8240 14955 -1570 92 15367 3423 -9999 3737 2957 -17699 -11713 2541
428 2541 -11014 -15646 5126 3877 -11662 1959 13601 -2502 -2491 16479 8234 -6351 8018
441 8018 12621 -7907 -6048 10454 -802 -12278 3579 4834 -13438 -7740 6866 -4658 -10675
454 -10675 7988 9125 -6910 651 10540 -5005 -10184 6612 2822 -11671 552 10856 -5297
467 -5297 -6836 11439 5818 -6857 8543 14808 -5579 -5123 10772 -2574 -15682 2302 5700
480 5700 -13580 -6273 8712 -9605 -17501 5997 4968 -13257 3023 19549 258 -2383 19266
493 19266 8828 -9764 8904 16379 -9909 -9672 9114 -6703 -21336 -88 3556 -17111 -4627
506 -4627 15023 -3995 -13727 9409 8549 -10570 3316 17334 -1698 -4012 15928 5556 -13743
519 -13743 1627 11065 -8754 -8005 9195 -2520 -14320 4350 7903 -12080 -4241 14975 623
532 623 -11678 4792 3422 -14865 -3862 11087 -5895 -10009 13130 9727 -9841 2608 14534
545 14534 -3653 -3950 16199 4311 -14027 3990 11441 -13052 -11531 8919 -3441 -16000 3286
558 3286 3743 -18612 -6623 14524 -2162 -9539 15181 14608 -5309 6901 17265 -5593 -7342
571 -7342 14934 3461 -17135 -632 7637 -13663 -10834 7403 -5447 -14466 7598 8911 -13265
584 -13265 -4075 13804 -485 -6806 12409 8884 -7852 4970 14309 -7183 -11098 9176 3320
597 3320 -12480 696 7620 -9094 -5988 11134 -882 -13132 5184 10333 -9158 -6224 8655
610 8655 -3281 -10473 8114 7503 -10564 -3 14965 -1364 -9200 8630 5877 -9040 3154
623 3154 11408 -7466 -8114 11010 1347 -14401 521 6933 -10157 -6430 9037 -4324 -12237 8015
637 8015 9713 -8385 368 14517 -374 -5882 10223 4038 -11196 2006 10288 -8042 -8869 7922
651 7922 -69 -11753 2104 6033 -9436 -3907 10595 -901 -9565 6320 8156 -6282 -67
664 -67 10275 -1968 -6646 7150 3358 -10433 -1017 8200 -4495 -6656 6869 2089 -8061 2696
678 2696 7396 -6228 -4584 8537 900 -8719 2935 5729 -6753 -2258 8409 -1962 -7920 5550
692 5550 4988 -8276 -1207 8109 -2687 -5392 7674 3344 -8204 1780 7934 -5533 -5431 6837
706 6837 346 -8453 2494 5252 -6998 -2698 8033 -1077 -6573 5102 4538 -6611 -510 6970
720 6970 -2585 -5058 6130 2754 -6269 999 5783 -4089 -3933 5179 89 -6299 2203 4222 -5091
735 -5091 -2154 5750 -381 -4823 3621 3633 -4632 -826 5115 -1847 -4119 3913 2602 -4613 110 4516
751 4516 -2960 -3731 3847 1013 -4855 1256 4449 -3119 -2247 4811 597 -4168 2528 3639 -3790 -1542
767 -1542 4030 -1334 -4486 2259 2161 -4300 -450 4135 -1920 -3148 3542 1383 -3669 1333 4191 -2008
783 -2008 -1517 3990 209 -3489 1588 2537 -3203 -1282 2776 -1108 -2996 1807 1228 -2582 338 2805
799 2805 -971 -1692 2221 623 -2517 624 1915 -1511 -1118 2324 525 -1505 1191 1816 -1002 -246
815 -246 2026 298 -1336 791 786 -1687 -985 461 -1239 -2201 -126 -186 -2009 -932 1072 166 2 2067
833 2067 2320 869 1611 2498 720 -60 715 -93 -1357 -1101 -803 -2269 -2261 -1129 -1499 -1884 -765 187 -165
852 -165 882 1559 1492 1454 1897 1863 1972 1604 768 343 -117 -1129 -1605 -1080 -1746 -1698 -686 -714 -1481 -363 396
873 396 -628 -149 1540 745 -517 1415 1674 -521 55 2065 329 -674 1563 1199 -1686 -132 1254
890 1254 -1282 -1465 1430 -148 -2326 111 740 -2567 -2015 857 -597 -2327 1158 1704 -1392 371
906 371 3341 926 -157 3426 2863 -790 647 2168 -1873 -2520 527 -714 -3948 -1235 513 -3198
922 -3198 -2992 1238 -198 -2396 1728 3716 -270 677 4356 1305 -1245 2953 2732 -2485 -874 2339
938 2339 -2174 -4542 464 271 -4557 -650 3141 -1861 -2367 3075 1136 -3280 1386 3696 -1781 -1004
954 -1004 4103 65 -3660 1861 2866 -3383 -843 3868 -1109 -3339 2874 1860 -3827 259 4235
969 4235 -1679 -3073 3132 202 -5112 101 2654 -3450 -2315 4268 619 -3564 2556 3780 -2374
984 -2374 -175 5288 66 -3072 3214 2411 -4373 -1050 3581 -2301 -4309 2411 459 -5526 -493
999 -493 3401 -2874 -2809 4758 1750 -3052 2663 4580 -2768 -1244 5028 -49 -4389 2256 2907 -4609
1015 -4609 -1635 4073 -1813 -4151 3441 2028 -5023 -305 4302 -2665 -3517 4166 1185 -4608 1971
1030 1971 4496 -3807 -2506 4931 360 -4406 2816 3653 -3871 -389 5296 -1217 -4309 3778 2473
1045 2473 -5020 -1019 3563 -3405 -4207 3720 670 -5291 1231 4790 -2673 -2306 4977 903 -3678
1060 -3678 3143 4045 -3839 -1288 5150 -870 -5102 2137 1834 -4884 -1120 3519 -3244 -4553 3682
1075 3682 2062 -4760 745 5240 -1733 -2046 4939 990 -4526 2222 4526 -3819 -2472 4519 -538
1090 -538 -4704 2247 2286 -5038 -903 4817 -2183 -4702 3436 2685 -4202 631 4814 -2288 -2585 4908
1106 4908 1040 -5200 1276 4166 -3172 -2342 4163 -443 -4505 2578 2779 -4925 -1446 4792 -1057
1121 -1057 -4184 2612 2130 -3865 575 4477 -2247 -2997 4224 1771 -4524 614 3449 -2854 -2078 4060
1137 4060 -311 -4559 2009 3365 -3695 -2007 3928 -608 -3508 2762 2265 -4144 164 4661 -1567
1152 -1567 -3378 3583 1744 -4115 618 3497 -3188 -2651 4254 426 -4564 1251 3183 -3171 -1657
1167 -1657 3693 -683 -3564 2800 2715 -3636 -369 4571 -909 -2723 3360 1737 -3553 649 3500
1182 3500 -2608 -3009 2987 464 -4093 720 2401 -3060 -1565 3486 -353 -3249 2564 2984 -2470
1197 -2470 -347 4137 -458 -2201 2988 1551 -3767 -142 2881 -2596 -3242 2078 130 -3973 619
1212 619 2592 -2365 -1645 3534 457 -2653 2048 3168 -1984 -263 3465 -583 -2690 2218 1379 -3279
1228 -3279 -531 2594 -1601 -2608 2040 611 -3094 616 2889 -1982 -1576 2757 408 -2625 1183
1243 1183 2242 -2171 -916 2713 -298 -2545 1823 1860 -2386 -45 2753 -891 -1902 2115 850
1258 850 -2799 129 2027 -1888 -1873 1687 -199 -2598 467 1726 -1719 -526 2619 406 -1350 1855
1274 1855 2033 -1401 -3 2251 -447 -1845 1017 261 -2531 -671 1194 -1526 -1924 1463 314 -1940
1290 -1940 649 1992 -776 -381 2041 650 -1042 1148 1338 -1249 -563 1404 -526 -1627 967 643
1306 643 -1672 -154 1235 -721 -1287 977 329 -1404 102 1034 -912 -1037 769 99 -1107 569
1322 569 1236 -572 107 1642 418 -459 1031 1017 -602 -64 837 -702 -1309 -30 -537 -1559 -897 -31
1340 -31 -945 -1029 404 133 -285 805 1299 537 775 1553 851 98 595 375 -485 -536 -281 -596 -1001 -774
1360 -774 -584 -1040 -624 -99 -190 -100 394 699 442 526 945 725 461 490 555 53 -108 -75 -73 -460 -232 -182 -225
1383 -225 -384 -275 -147 -358 -422 -35 40 -365 -154 181 38 -261 395 494 -56 514 697 72 47 748 197
1404 197 -446 240 457 -566 -662 53 -497 -1138 -163 -158 -937 -370 819 -62 -272 1025 1126 -184 599 1478
1424 1478 84 -245 911 275 -1130 -138 440 -1189 -951 362 -491 -1423 -69 590 -937 -231 1486
1441 1486 230 -448 1197 1165 -841 140 1360 -226 -877 829 389 -1535 -243 909 -949 -1004 954
1458 954 99 -1264 269 1162 -987 -520 1374 -36 -1150 785 991 -1138 -497 1390 -555 -1356 1041
1475 1041 891 -1556 -123 1650 -625 -1079 1316 664 -1527 391 1401 -1236 -982 1420 -147 -1710
1491 -1710 894 1237 -1404 -700 1824 -191 -1543 1246 1058 -1612 -169 1591 -661 -1171 1454 740
1507 740 -2009 264 1725 -1228 -1256 1681 180 -2014 764 1654 -1506 -648 1961 -350 -1841 1140
1523 1140 1267 -1905 -424 1892 -544 -1630 1595 998 -1887 328 1849 -1103 -1530 1858 372 -2005
1539 -2005 502 1711 -1431 -937 2008 -14 -2221 1059 1343 -1963 -491 1876 -275 -1900 1545
1554 1545 983 -2118 74 2231 -1075 -1677 1781 475 -2120 801 1793 -1678 -1025 2257 20 -2261
1570 -2261 830 1344 -1957 -638 2097 -520 -1939 1487 1365 -2046 -45 2092 -842 -1528 1568 521
1586 521 -2230 410 1836 -1443 -1251 1933 299 -2073 1016 1645 -1689 -471 2637 -121 -2079 1221
1602 1221 1379 -2017 -377 1823 -1235 -1812 1386 596 -2407 293 2211 -1067 -1354 2338 497 -1849
1618 -1849 1150 1950 -1702 -907 2090 -293 -2187 808 989 -2253 -727 1744 -1102 -2000 1525 1067
1634 1067 -2007 297 2180 -776 -886 2202 625 -1937 616 1904 -1628 -1249 1727 -369 -2066
1649 -2066 808 1081 -2089 -531 2108 -667 -1852 1258 1093 -2023 66 2328 -865 -1393 2079 794
1665 794 -1909 622 1867 -1161 -1099 1772 -256 -1986 918 1433 -1701 -836 1576 -565 -1910 1169
1681 1169 700 -1961 -30 1894 -665 -1225 1955 1048 -1477 608 2082 -807 -918 1861 226 -1949
1697 -1949 483 1230 -1986 -1226 1244 -657 -1927 715 774 -1667 -48 2076 -202 -810 1922 1275
1713 1275 -1140 541 1732 -846 -975 1486 53 -2038 75 970 -1612 -1022 1461 -356 -1615 811
1729 811 1266 -1242 -60 2015 -257 -954 1252 783 -1245 -189 1412 -952 -1089 1141 174 -1577
1745 -1577 288 1155 -1174 -622 1283 2 -1386 501 935 -1092 -586 1346 -455 -1209 907 879 -1140
1762 -1140 130 1454 -353 -727 1150 633 -1078 322 1196 -725 -914 1016 -187 -1292 124 731
1778 731 -1124 -544 1001 -87 -1008 891 942 -703 222 1285 -213 -657 883 492 -1229 27 659
1795 659 -778 -950 640 -31 -1176 369 649 -600 -186 982 85 -765 482 565 -732 -124 718 -281
1813 -281 -797 522 398 -773 -140 690 -373 -438 822 310 -534 204 607 -575 -712 513 -201 -753
1831 -753 95 258 -581 -276 660 107 -539 518 573 -222 229 869 41 -158 353 296 -621 -89 305 -531
1851 -531 -644 278 -257 -766 68 170 -218 40 444 257 20 491 305 -21 150 426 73 -93 146 115
1871 115 -395 -224 11 -266 -399 157 66 -186 70 9 -135 -211 153 61 -9 134 135 -31 -6 82 156 39 157
1894 157 153 69 0 -29 42 99 -38 -341 156 -92 -190 -42 -12 -45 -86 184 -4 58 289 124 33 139 103 -119 -89
1919 -89 -36 -1 -275 10 -114 -507 -158 -15 -243 -369 113 214 -334 161 530 -57 -49 402 40 -197 121 304
1941 304 -345 -249 385 -30 -573 133 81 -441 -87 397 87 -447 302 495 -194 61 498 -44 -290 599 111
1962 111 -576 99 231 -365 -418 484 -281 -835 58 453 -527 -119 603 29 -521 395 578 -264 -103 652
1982 652 -380 -363 483 186 -524 -45 370 -433 -640 490 239 -711 293 538 -503 -127 813 80 -629
2001 -629 461 613 -436 -29 724 -300 -690 586 310 -740 -44 848 -495 -732 733 241 -641 257
2019 257 807 -653 -376 933 122 -779 544 685 -683 -88 885 -231 -844 507 368 -894 -145 834
2037 834 -431 -618 495 460 -880 -6 622 -471 -372 918 186 -858 453 886 -813 -512 944 -18
2055 -18 -787 486 563 -1031 -267 711 -354 -926 583 506 -1104 84 920 -611 -681 1019 197 -807
2073 -807 449 865 -935 -336 973 -275 -994 409 590 -1014 -308 988 -432 -832 1018 433 -936
2090 -936 40 1130 -525 -791 912 209 -942 305 862 -1094 -609 904 -130 -1032 442 703 -792
2107 -792 -75 1115 -163 -643 651 640 -1069 -64 953 -398 -863 802 256 -969 317 763 -844
2124 -844 -633 929 82 -918 626 1014 -716 -30 1080 -90 -880 809 536 -1081 -163 714 -692
2141 -692 -907 676 217 -1195 103 987 -665 -503 1075 194 -945 401 862 -988 -516 1038 -152
2158 -152 -882 623 722 -1055 -220 859 -475 -847 547 478 -976 -69 925 -607 -732 680 199 -1165
2176 -1165 359 906 -817 -297 1138 276 -928 590 714 -731 -179 941 -323 -947 651 424 -1088
2193 -1088 -228 789 -546 -830 870 190 -684 327 1037 -319 -358 1190 20 -792 638 753 -881
2210 -881 -454 798 -407 -1006 190 404 -1127 -228 840 -264 -582 850 404 -705 125 1114 -356
2227 -356 -492 818 109 -1007 312 720 -769 -510 757 -214 -896 342 373 -770 -288 885 -375
2244 -375 -626 476 368 -762 -47 758 -300 -566 570 130 -743 141 720 -484 -343 657 -53 -751
2262 -751 391 449 -714 -153 714 -298 -825 361 405 -576 142 728 -361 -611 652 158 -631 192 599
2281 599 -271 -295 533 -84 -630 236 349 -457 -359 585 -197 -619 344 345 -473 16 741 -140 -466 413 158
2302 158 -488 60 540 -343 -470 351 -80 -421 122 315 -404 -241 522 -151 -565 76 325 -519 -18 229
2322 229 -103 -393 397 204 -511 -48 472 -118 -388 537 2 -415 122 445 -256 -86 467 -41 -392 266
2342 266 250 -488 -141 98 2 -397 193 -63 -456 27 432 -132 -203 506 90 -196 43 323 -35 -94 362
2363 362 96 -221 158 81 -299 -122 111 -29 -263 70 67 -115 134 190 -305 163 8 84 -189 108 193 -97
2385 -97 -82 104 -74 -221 -13 104 -35 -114 34 -127 -157 -8 57 29 -67 115 -6 -78 128 34 -131 23 59
2408 59 41 -61 -40 128 -72 -40 -82 -115 107 -66 -20 -140 -130 46 168 30 -36 102 -12 -61 -127 210 -9 -15
2432 -15 134 90 148 98 67 -195 81 -77 -191 -186 -45 3 -51 -4 192 97 -127 272 165 -151 147 -36 13 -115
2456 -115 -162 -18 -88 -170 86 -316 -236 -15 85 -11 134 345 -101 -50 271 137 -228 -15 196 -147 -76 187
2478 187 31 -213 171 229 -373 -229 187 -237 -277 6 176 -2 -2 329 -13 -72 225 163 -83 61 188 -164
2500 -164 -336 173 -57 -393 -105 249 -359 -191 248 24 -377 282 260 -225 82 254 -225 -330 352 271 -424
2521 -424 -66 289 -154 -299 237 -102 -457 69 215 -209 -364 308 -163 -379 53 343 -285 -115 479 -144
2541 -144 -305 338 261 -578 32 280 -391 -193 473 -14 -581 46 302 -454 -187 337 -86 -385 197 374
2561 374 -270 40 500 -145 -689 295 207 -417 99 302 -333 -162 446 -3 -648 105 352 -258 -345 435 32
2582 32 -336 250 351 -392 -193 642 22 -532 399 114 -361 3 424 -320 -571 460 177 -282 5 542
2602 542 -302 -178 668 226 -496 103 553 -359 -115 451 -111 -487 225 400 -345 -3 503 -226 -344 460
2622 460 224 -664 10 559 -355 -484 486 136 -433 266 332 -432 -254 533 -12 -583 197 336 -477 -102
2642 -102 517 -103 -418 210 381 -442 -176 422 -233 -294 296 128 -543 -135 580 -398 -237 647 -123 -571
2662 -571 148 305 -350 -372 416 -129 -364 298 362 -368 95 419 -146 -412 305 162 -539 1 447 -276 -365
2683 -365 522 105 -597 261 418 -234 -167 364 -188 -588 343 272 -345 47 593 -55 -153 451 133 -536 -132
2704 -132 473 -226 -561 342 -40 -471 251 249 -306 -241 460 -65 -507 437 299 -345 -109 538 0 -387 352
2725 352 167 -441 16 430 -312 -288 426 80 -353 54 390 -358 -23 471 -60 -328 306 370 -314 -36 530
2746 530 -153 -310 206 238 -431 57 356 -210 -372 195 151 -388 149 519 -170 -287 523 31 -345 221 187
2767 187 -330 -104 385 -48 -372 52 87 -304 -115 331 -125 -295 314 127 -182 148 431 -98 -136 362 129
2788 129 -262 120 335 -278 -268 90 -179 -277 62 87 -371 -159 414 -243 -316 189 118 -355 -177 338 -214 -172
2810 -172 368 129 -347 15 243 -121 -24 83 -60 -137 265 45 -326 -105 285 -132 -408 293 141 -333 3
2831 3 339 -41 -197 156 164 -142 -20 198 -280 -168 206 -57 -242 34 144 -221 -57 177 52 -102 152
2852 152 265 -216 -32 130 -128 -132 26 -41 -152 -30 53 -87 -242 37 59 -219 153 -13 -54 -50 193 29 -35
2875 -35 59 12 -145 69 185 -225 -90 218 33 -210 207 121 -46 -133 -36 -40 125 65 -12 -86 -67 300 155 -142
2899 -142 126 135 -77 -292 139 -88 -6 81 51 79 -129 62 -30 -12 164 41 116 -104 0 -75 -61 94 -54 -141
2923 -141 38 -41 -43 -94 -12 -218 -146 -58 -30 8 -182 32 -117 -2 -42 -86 -79 -2 -56 -62 -20 43 -83 66 -185 27
2949 27 -26 39 2 -50 114 -18 61 -59 37 14 42 46 -58 114 207 68 -9 27 -126 -124 32 -118 -92 -16 -45 -177
2975 -177 -152 -105 -6 -190 -36 122 95 -59 29 -30 -135 122 189 107 50 -10 -34 -104 -7 214 -112 -216 75 78 -167
3000 -167 128 -12 9 33 80 30 -171 38 1 -178 0 121 75 -208 131 -57 -157 -24 78 -191 -161 32
3022 32 -12 -219 -93 14 -186 24 230 27 -305 -119 320 -171 -129 365 -108 -192 168 4 -48 45 128 -148
3044 -148 -240 135 51 -281 67 422 -53 -166 98 -36 -190 43 188 -39 -173 286 -95 -363 165 256 -404
3065 -404 -33 203 -141 -324 104 58 -321 184 147 -217 -156 277 175 -146 163 244 -215 36 322 -244 -288 147
3087 147 118 -237 -81 319 -165 -334 254 106 -200 48 75 -218 -206 151 157 -203 29 333 1 -188 297 -201
3109 -201 -369 83 150 -267 -242 139 -93 -156 227 170 -445 -27 347 -189 -213 180 81 -393 25 229 -69 -173
3131 -173 177 19 -397 131 256 -275 -11 322 82 -249 218 92 -441 60 318 126 -28 244 -23 -313
3151 -313 130 218 -187 -78 308 -2 -287 177 239 -311 -3 273 145 -98 33 174 -308 79 178 -20 -287
3172 -287 154 162 -347 126 237 -286 -122 216 77 -343 70 201 -189 -103 368 -71 -205 285 409 -349 -67
3193 -67 203 -85 -115 89 100 -426 23 191 -94 -178 385 178 -520 4 230 -156 -115 312 -57 -240 198 276
3215 276 -90 -105 175 -126 -227 29 229 -325 -126 235 -285 -155 245 134 -104 135 353 -106 -39 285 120
3236 120 -253 123 78 -200 -23 264 -113 -192 120 286 -303 -23 242 -173 -204 120 173 -220 138 284 -89
3257 -89 152 196 -23 -150 25 142 -172 -290 205 32 -318 25 190 -251 -148 305 -27 -30 257 335 -148 99
3279 99 258 -58 -195 169 -17 -242 109 208 -156 32 256 236 -322 130 154 -142 92 130 -99 -144 223 -20
3301 -20 -167 81 216 -137 -133 122 -19 -144 23 144 -118 -97 239 108 -161 97 155 -142 -38 213 -14 -238
3323 -238 249 149 -47 137 74 -134 -71 214 -95 -255 3 180 31 -188 189 63 -366 27 68 -129 -25
3344 -25 79 -82 -323 220 123 -130 -131 89 7 -219 88 142 -88 70 -43 -154 22 74 -81 -170 -7 275 10
3367 10 -120 113 -63 -177 117 111 -157 57 37 -10 -85 105 206 -101 -23 93 1 -28 137 -113 -110 91 173 -110
3391 -110 34 113 82 -33 107 82 -75 129 90 -214 -210 -129 -204 -141 -40 52 -139 -132 133 -203 151 -1 108 -98
3415 -98 100 98 -118 8 -121 87 -32 -214 10 -88 -74 12 1 -133 -116 83 -63 -136 13 96 -58 19 -84 -30
3439 -30 -199 98 -59 -148 -86 104 -21 127 -6 -185 -55 102 63 97 -86 31 120 -108 -16 139 -175 40
3461 40 -14 42 -36 112 21 -5 -78 -116 -150 -66 -94 -17 -82 -57 16 -81 199 51 91 25 108 40 172 -147 -81 -129 87
3488 87 4 111 79 102 -103 23 -164 -163 55 -91 -53 -64 150 -82 60 -22 83 42 72 72 -48 34 121 49 151
3513 151 96 1 -129 -44 77 5 -112 125 -6 -7 -90 122 -321 -41 -2 155 -11 181 74 -115 60 -85 84
3536 84 -9 -65 56 75 -67 102 65 -80 94 47 45 55 -101 57 -98 91 13 -230 53 7 10 -114 16 -64 -172
3561 -172 -68 -102 38 -125 128 -80 48 -210 -14 -165 -28 114 73 -123 3 107 -118 -232 50 -39 -280
3582 -280 -39 -49 -15 -4 193 -6 50 -72 220 -48 79 123 -134 -274 146 48 -157 -14 94 -166 -180 102
3604 102 -16 -284 205 168 -64 -108 121 -94 153 87 15 -144 -82 202 40 -26 47 93 -225 87 86 -112 -80 197
3628 197 27 -96 216 146 -100 -36 215 171 -235 79 -51 -113 -138 176 -196 -197 107 202 34 -8 252 -128 -163
3651 -163 259 34 -32 127 74 -190 -97 40 181 20 126 204 -125 59 168 -13 -20 36 -43 47 58 82 -167 -316
3675 -316 102 5 -212 32 281 47 -289 194 -23 -228 -4 187 -28 -251 53 -95 -342 66 -15 -113 -8
3696 -8 55 -56 -127 113 202 -69 -39 192 -118 -193 117 -95 75 0 163 -239 -11 180 -16 -151 189 159 -7
3719 -7 -172 -31 -156 -231 117 -5 -112 -104 76 -92 -200 198 -70 -141 198 11 -34 -182 100 -63 -265 107
3741 107 100 -203 -143 152 25 99 122 126 -182 -7 238 -118 73 219 51 -6 -35 125 -63 63 -23 -24 -34 98
3765 98 70 -60 -198 81 3 -193 -19 76 -124 -231 134 195 -18 80 51 98 -88 22 -165 29 144 20 -97
3788 -97 -39 13 -63 36 174 -7 4 120 38 12 -96 99 -20 -51 95 26 -236 117 -71 -199 -114 -80 -68 -177
3812 -177 102 -13 56 -66 -76 66 -39 103 85 -99 -114 76 16 -113 164 277 -71 -24 -17 166 -38 83 -92
3835 -92 -188 302 276 -49 26 216 -77 -146 22 25 80 -61 111 55 -269 44 69 -40 5 241 -131 -144 -12 118
3859 118 36 -179 238 -15 -69 -18 -13 -102 -112 -7 -14 -30 59 5 -26 70 -29 80 -25 57 72 17 9 35 -169 -126 -8
3886 -8 11 -22 19 -9 -155 10 226 -78 10 18 -65 -24 69 113 -228 -140 98 -181 -40 9 52 -77 -141 92 87 -72
3912 -72 54 129 67 42 -80 -84 -110 -17 -114 -121 3 61 85 22 68 0 91 -41 42 149 -37 92 -146 -81 -23 49 -109
3939 -109 2 75 11 -20 -17 68 -50 82 -23 16 95 -30 -66 161 21 121 -62 -107 45 27 -31 -73 -16 -38 61
3964 61 -128 -51 152 45 -82 5 21 -27 64 82 -46 67 -61 -235 -74 -40 -109 -10 58 -82 -10 -45 122 -131
3988 -131 -26 -23 97 -51 -212 -102 34 -29 22 40 -225 82 168 -214 -120 -89 -287 -39 -28 5 79 -67 143 3
4012 3 -5 -37 -53 -45 -46 150 41 -2 139 -14 37 -83 -155 -17 -47 -165 -145 -93 -73 -58 55 50 73 113 116 -66 95 58
4040 58 41 60 18 -109 -22 53 -182 -159 30 -30 -46 -73 -51 -30 -21 -96 -42 -72 5 -22 -152 34 181 -69 -69 83 123
4067 123 109 11 -11 6 -60 -93 114 -13 19 132 -7 73 107 -61 -145 -23 59 87 122 1 16 27 108 158 -162 116
4093 116 8 -67 39 -35 -37 18 -52 122 -10 47 258 -72 -37 138 23 -131 -43 -83 -6 -24 57 -122 193 43
4117 43 6 -104 179 -17 -24 -135 69 -1 -19 22 156 -167 67 -4 37 20 25 66 -6 119 -21 156 -228 -45 -31
4142 -31 -74 -37 -72 140 -125 -50 39 -43 -25 171 5 -148 -8 68 130 109 110 -11 -65 178 -114 141 -23 44 -77
4167 -77 122 -25 89 -142 -28 33 -267 -3 -15 -10 -52 29 -78 53 1 177 5 8 161 229 -68 -1 72 52 3
4192 3 125 27 -167 21 -71 47 -146 180 124 147 -34 -38 -72 -66 -50 -42 -146 -42 -42 -170 -55 13 -177 -76 123 88
4218 88 -61 55 0 -96 2 99 41 -58 145 49 133 -107 -67 -134 142 6 -83 -64 14 26 87 169 -109 13 43 221
4244 221 -75 23 109 56 55 -230 40 -124 -168 -84 -13 35 12 83 -83 -127 -51 10 -18 81 230 45 -28 -4 116 -79
4270 -79 -136 1 -24 -68 39 -80 -5 12 -14 146 -159 124 -5 23 -73 147 -12 -99 28 60 -41 25 108 -141
4294 -141 -55 97 -56 -108 155 -44 -130 11 317 5 -42 12 73 -60 20 -191 93 -204 6 150 -3 -63 -14
4317 -14 -61 42 -103 115 -38 -72 186 -115 -215 -30 165 -31 103 -62 9 58 96 129 -41 -28 49 -89 -9
4340 -9 -30 32 -64 62 -31 -17 159 46 35 -227 234 -2 15 8 35 -41 162 64 44 66 -82 -48 63 -267 96 -12
4366 -12 -35 66 11 -56 -43 125 -36 8 -87 105 -58 58 16 39 1 -41 61 -68 36 -115 38 -282 -52 145
4390 145 -207 -13 69 8 43 -71 -92 -6 -58 212 -40 128 5 90 101 -124 66 30 62 32 50 11 138 48 -55
4415 -55 151 -82 -96 -38 -110 -5 5 52 193 78 -64 96 41 3 44 -3 -134 -28 -102 34 15 158 -6 24
4439 24 18 -58 -30 68 12 -142 -82 -129 64 75 122 -113 -73 -154 99 -153 6 54 -62 91 -87 -95 -150 23 40 142
4465 142 -14 13 74 18 -2 -20 -4 -41 124 -167 -173 -25 -57 27 -161 34 -217 -26 43 44 122 126 60 -51 -103 15
4491 15 -19 -50 -102 217 135 -141 123 37 60 -130 138 164 -114 -28 26 62 -18 -119 -53 104 -239 -173 -71 123 67
4516 67 -92 52 74 -10 -148 148 -6 47 -122 42 -64 59 11 62 -21 -71 -85 -7 -3 -23 -54 -35 38 226 103
4541 103 -24 -131 -30 54 -8 46 -93 14 17 -89 61 171 -55 92 -55 -31 1 -197 -40 -30 118 -20 -290
4564 -290 71 22 175 2 27 30 -8 -22 2 -22 -55 7 -63 68 40 -56 180 -92 -23 25 52 60 -110 1 -117 163
4590 163 80 -41 6 18 51 13 19 -125 -39 191 -164 -16 -76 -37 56 -153 39 -38 -209 81 198 137 79 -120 -201
4615 -201 -34 118 64 -240 -112 -187 -21 105 127 -55 4 -111 -23 39 11 145 -9 -44 -43 -8 3 82 -90 113
4639 113 -1 25 -39 -18 60 -118 49 5 -50 -3 -49 -50 -82 14 7 -160 -131 -32 230 -202 39 80 -68 44 4 -58
4665 -58 -140 20 45 60 -234 20 -28 12 161 -118 -36 -105 85 13 21 -10 46 6 -10 46 -72 -105 -15 43 41 -52 92
4692 92 86 -106 135 -11 126 61 -118 92 -138 32 -116 35 26 47 32 -11 -39 -19 -115 -50 -8 -31 43 22 35 138
4718 138 81 -74 -192 -10 -109 86 96 -85 18 2 100 16 120 -45 14 -102 -24 32 -42 -59 -49 -42 -159 -61 14
4743 14 38 -69 -49 -27 112 30 161 28 -34 -186 -34 -42 -38 60 134 207 42 -74 -15 -113 89 67 195 18 -68 108
4769 108 43 -198 62 0 -81 27 -237 -85 14 -29 162 -17 -85 21 -4 19 97 126 43 -124 -12 188 -50 -34
4793 -34 -62 -99 -11 122 -69 -14 -57 -7 32 83 58 138 29 -78 29 228 -8 134 -22 -27 -95 -48 51 -180 -204 -73
4819 -73 5 153 32 72 -158 12 49 11 -62 19 89 4 82 51 -65 -158 108 85 -44 -51 -12 -68 -54 65 -82 53
4845 53 28 -25 8 47 113 187 -89 11 48 -38 75 31 -33 -112 -93 -16 45 -19 11 122 86 213 38 -200 -126 46
4871 46 126 -46 51 91 5 -45 95 9 -47 -5 -34 -43 -114 -115 -7 -139 106 19 -19 -86 -16 -7 -163 18 -92 49 -23
4898 -23 -70 45 96 179 -117 52 189 21 -127 -89 -69 -100 -48 -99 49 -46 22 -22 21 77 -49 69 -33 -34 -138
4923 -138 46 60 -46 68 34 144 -133 -20 80 116 67 55 -43 43 -34 -144 -24 117 -42 -134 99 42 -59
4946 -59 -137 -128 13 -123 -125 -98 1 -64 40 -52 -124 -5 -39 -135 107 -120 65 69 -112 -46 31 -87 15 -7 45 139 45
4973 45 16 118 -9 58 -143 64 -93 149 30 17 -68 -13 -32 -58 56 -139 -150 85 38 145 38 -1 29 -85
4997 -85 40 118 -55 -21 10 -16 -119 -55 -196 67 73 49 80 -83 -15 -125 79 8 -24 33 109 94 -60 -93 -64 -46
5023 -46 -45 -30 -139 86 143 -69 69 155 0 -106 47 0 12 137 -31 3 -113 -48 -52 -46 82 17 113 25 -41 -36 -87
5050 -87 -26 -26 -177 -35 95 -90 83 16 -32 -112 -36 194 -150 -110 113 -175 35 -68 -71 -183 -34 52 61 212 -153
5075 -153 -19 -49 -87 10 19 -326 85 -128 -36 27 15 8 28 68 -160 -76 -113 55 -13 28 51 -42 -67 157 29 37 -224
5102 -224 -26 -96 -196 51 88 -100 16 -86 -149 81 22 -69 39 -85 -11 -44 -4 0 -131 22 256 -8 -93 -145
5126 -145 232 -58 49 -10 -10 -24 12 -115 -57 -27 76 -124 17 45 -10 -61 -223 111 70 -31 -179 32 36 188
5150 188 33 -8 2 75 -73 -99 -77 -40 -25 -144 -10 69 65 65 -82 -91 -84 142 -126 -15 64 25 -67 55 -139 137
5176 137 -42 -105 95 66 91 94 30 -85 140 54 61 32 -85 12 -93 -89 -47 -67 -99 -76 69 -4 -50 -73 -9 -268 -18
5203 -18 129 22 61 83 11 -18 -26 -162 -54 124 -327 -124 -126 -394 -62 164 101 -7 -52 -8 90 -119 149 -153
5227 -153 11 -3 11 7 -11 -89 -225 28 -61 -43 -228 -49 25 -37 96 -22 -113 -122 -51 -159 -121 -21 117 -120 -67
5252 -67 85 21 7 148 80 35 -29 101 51 -17 158 92 31 -68 -47 -111 25 15 -86 -52 29 29 -97 -9 82 -86 -68
5279 -68 11 41 72 -18 96 -33 -162 -21 122 -228 -63 11 -123 -25 -282 95 -8 -85 -123 62 -21 -20 -174 28
5303 28 24 127 -65 -59 -58 170 -26 -43 -6 34 53 38 112 -102 -99 -72 -10 94 293 94 196 -81 14 -202 7 -3
5329 -3 -188 28 15 59 63 125 63 -6 -7 87 16 57 -74 -32 8 -36 59 -69 -122 48 -84 -193 -75 -16 -207 -189 60
5356 60 -13 60 173 116 -136 21 -16 12 -39 -170 42 19 172 11 -12 111 39 -37 47 82 104 50 -103 47 -55
5381 -55 67 -78 65 59 -232 -130 24 9 -90 -19 -65 -60 99 -73 -73 165 -81 -82 -94 221 -20 102 46 -222 -231 -144
5407 -144 -50 50 -42 -41 63 -23 78 74 147 -70 -64 7 -45 66 -119 -33 23 -71 31 -38 -86 33 -207 -69 88 166
5433 166 23 12 -23 -89 -34 -34 -40 -63 167 -19 0 -67 -57 -13 50 0 -76 0 -77 59 -61 30 29 -92 -40 -54 23 -69
5461 -69 -91 166 -10 -113 -232 115 12 -139 -34 86 -40 -50 10 -9 7 -18 -24 -62 -30 163 4 6 -75 -70 -22 -100
5487 -100 25 -49 52 -41 -25 91 123 140 78 -63 -99 149 -12 -22 -43 -42 -37 9 -34 -64 153 127 39 -28 -79 -130 134
5514 134 10 81 -57 -28 -41 -39 130 -30 78 3 13 171 8 -28 128 -8 -165 22 -66 -61 -49 -51 -122 -50 52
5539 52 -108 43 126 12 -20 23 -154 183 -29 -116 -89 42 -12 65 -7 -52 180 -7 24 8 -36 25 -37 -54 10 20
5565 20 140 171 117 -117 41 53 -77 -26 26 34 62 12 -71 -60 -51 104 0 -32 -76 53 48 108 13 -8 73 53 100 72
5593 72 108 39 -97 45 -95 52 152 221 126 -188 -116 -43 124 -91 -85 131 -78 -11 -48 166 69 -45 -45 -59 -47
5618 -47 -107 -142 -70 81 -90 161 52 4 -48 58 -51 158 235 -15 259 103 -86 78 131 162 17 82 41 26
5642 26 -8 -28 -52 121 -98 -16 96 95 -65 -77 -115 -174 -75 -88 11 -142 -1 130 -6 -59 -23 -37 29 38 23 12 -40
5669 -40 132 -53 -26 62 -18 -8 90 -111 116 28 9 -12 -76 -31 80 98 -2 -53 19 149 -45 -52 -45 -104 -218 -46
5695 -46 56 43 202 59 -77 126 -120 -238 52 -79 30 12 79 108 -101 -22 31 -168 307 17 70 79 -156
5718 -156 199 -29 31 90 48 -49 98 -91 -115 -11 159 -76 -56 75 35 -9 75 -181 -103 -58 -13 47 88 -47 -63
5743 -63 -144 -40 -59 -150 17 -13 25 -11 36 -33 106 96 23 -44 7 -38 39 -28 66 40 -68 -74 -43 -72 -58 -34 -82 -10 -145
5772 -145 115 24 -37 -135 24 -39 -28 85 -12 73 -122 136 -159 24 12 220 -9 -28 73 -189 -176 -125 -61 7
5796 7 -27 129 -75 8 206 213 117 -55 -7 126 54 -38 -87 -126 -141 6 40 91 -10 -94 -24 -126 -107 28 50 -98
5822 -98 -166 -14 83 -24 -76 -64 18 55 -39 14 -12 -53 109 -76 24 22 86 -79 -22 20 -115 117 165 136 -27 -217
5848 -217 83 21 -140 84 67 -72 -131 -73 -25 39 93 -118 -40 -150 -104 -1 -19 30 38 25 -70 -49 2 97 80 -212
5874 -212 67 -107 52 -76 56 61 -113 -70 63 63 -139 79 -49 -33 -4 -7 27 18 84 76 -155 48 194 21 -19
5899 -19 128 -16 -113 -22 309 60 11 93 168 194 88 157 -93 2 84 32 -181 -127 -146 -77 51 -26 -76 17 23 76 -146
5926 -146 55 66 -71 15 -99 124 -47 -53 -77 -202 -250 179 73 -126 196 17 -40 42 -70 -68 -74 4 -1 -24 81
5951 81 -48 32 100 -109 -28 -41 -43 99 -44 143 -147 100 -150 -16 45 26 69 -179 9 -18 56 2 -110 18
5975 18 -11 -13 8 -178 73 90 -115 5 223 -211 59 12 76 95 17 -176 42 -71 65 10 169 53 -55 129
5999 129 173 -6 -4 -6 -14 25 75 -69 -22 67 -60 -34 -97 -191 33 26 123 129 -52 64 27 -101 89 -17 14 -22 -123
6026 -123 25 -63 -31 -101 -162 -77 -31 35 53 -68 -150 14 -44 -166 44 23 108 -14 -37 169 105 -131 58 -31 -32 6
6052 6 29 -94 -23 -163 61 -13 -51 -38 46 4 -141 53 128 35 -6 197 -196 -14 -193 63 -34 -18 -99 -80 -18 -234
6078 -234 -106 -31 -74 -18 -36 29 56 108 113 76 110 -80 69 8 -7 31 22 -46 23 -122 9 -26 -132 -328 -118 -139 64
6105 64 -17 82 75 -112 138 10 -113 21 -148 114 38 112 24 -29 -66 65 92 -98 -42 -22 72 58 8 -93 33
6130 33 28 75 37 -180 -15 111 46 82 -6 -76 28 29 -67 -69 -59 -2 -121 -81 6 -115 -15 -53 109 177 38 -67 176
6157 176 -25 -16 -66 -173 -141 -40 -3 84 -95 0 -49 -102 75 -67 -46 -7 202 -98 38 124 13 -112 95 41
6181 41 -53 -122 -6 41 -139 -45 -70 44 53 63 22 36 139 -35 20 -88 101 83 117 77 -1 84 164 -31 130 -87
6207 -87 43 -117 77 40 -96 -139 -114 -167 -21 74 120 70 -71 -105 -257 178 23 48 137 69 -18 -47 -93 17 -65
6232 -65 -133 3 162 69 68 136 -188 92 -88 -9 -91 -42 47 112 3 1 98 -99 10 -115 -8 71 -156 200 -100
6257 -100 -54 -191 -260 -159 -86 135 -180 -71 -74 150 -142 96 -16 -58 63 87 -86 -56 -43 -38 -124 -33 119 -96
6281 -96 -84 159 -26 134 -29 -31 70 94 189 -92 -92 -181 19 -96 42 42 -68 31 47 -19 84 -111 12 -83 56
6306 56 -64 89 47 85 -207 -24 26 127 -37 82 -17 236 13 -49 25 -181 3 21 -52 -177 -163 -98 -143 -71
6330 -71 -81 172 -185 200 112 -72 23 18 -47 122 -9 81 -128 -35 -71 -95 66 -4 -117 -117 121 -11 14 -103 173
6355 173 62 -4 -61 121 -51 -90 175 -3 -3 -24 5 175 -116 19 -189 36 185 37 -3 -154 12 -5 -72
6378 -72 175 124 170 68 69 -87 73 52 -142 -46 17 -46 -23 35 -177 73 -167 35 150 3 -57 90 28 -7 -191
6403 -191 -23 -90 -134 -42 45 -179 -64 -61 -146 -128 12 108 -138 125 -42 -17 0 124 59 -10 -238 -68 -132 136 -51
6428 -51 -12 33 10 89 -47 3 -140 -68 70 108 143 -125 164 212 62 13 -65 1 94 33 63 85 63 -36 14 142 191
6455 191 16 -79 -110 -148 96 110 -86 6 -100 7 97 -12 -38 -11 108 31 -86 44 -166 -81 -217 -34 -40 -143
6479 -143 93 -74 155 46 57 44 88 80 -193 -31 -22 33 -5 -152 -14 -155 -222 -23 -82 72 -109 72 77 156 -153
6504 -153 -89 -23 30 -197 35 22 -6 -14 1 161 -50 144 154 -77 -23 -17 -113 -57 -107 55 -2 -12 -65 98 110 -140
6530 -140 -94 -10 -146 -18 17 152 -21 -26 84 -66 74 49 -103 81 36 -111 -48 102 21 -47 3 -109 -102 88
6554 88 -74 -6 13 105 -16 154 -130 -84 35 90 -94 83 18 -52 -77 -60 -54 30 188 -106 34 56 47 83 69 28
6580 28 -66 -84 -39 -86 98 -47 -84 180 1 -44 -164 72 -120 -42 -97 -26 -56 -29 -142 25 -42 -128 -50 178 17
6605 17 40 152 -47 113 -136 11 -91 -162 4 12 -78 -40 -81 -14 -48 12 50 -77 188 134 106 7 159 -28 -16
6630 -16 53 65 -148 -45 -73 -118 -30 107 142 -38 -248 33 18 101 -112 -132 -19 94 61 57 -103 32 68 4 -96
6655 -96 -125 45 115 38 22 -63 99 -3 131 -46 38 29 -81 53 26 -114 85 2 -12 -143 -7 -38 39 151 -191
6680 -191 -43 -77 -88 -36 111 108 -79 -103 16 55 100 6 -85 29 69 -1 -56 -9 -132 91 127 -57 -74 85 -124
6705 -124 -88 120 -31 -31 85 80 -33 -139 145 -36 68 -24 -6 -25 -71 -111 -25 100 39 -1 60 187 36 45 -206
6730 -206 36 -19 27 36 71 120 18 -203 12 -22 -68 -197 4 -147 -77 94 -10 -97 61 -2 37 80 116 -19 -135
6755 -135 -34 -78 74 20 116 50 92 104 211 -87 31 -41 -1 -42 -24 55 102 -103 -20 62 113 70 -12 -10 -13 -20 -31 30
6783 30 8 86 1 -202 123 120 133 163 -55 -10 -153 -98 112 74 -42 -34 -143 17 86 45 11 -68 -107 -113 21 2 -179
6810 -179 -62 -120 23 122 -26 -39 10 -58 100 -18 67 10 60 82 -24 50 -44 -131 -39 52 -28 143 19 -47 -9 28
6836 28 18 134 -62 45 -165 -58 -70 44 32 -23 49 112 67 -16 151 42 8 15 -58 52 180 -119 -1 -142
6860 -142 -23 31 127 -2 128 -100 163 28 128 53 -43 131 62 15 76 -27 24 -42 -117 -68 39 -92 -86 -182 -14
6885 -14 86 -98 -15 -151 101 23 32 -41 -3 25 32 70 42 104 -110 66 14 46 -84 -236 56 6 76 45 -19 -103 17
6912 17 -57 14 -52 5 -86 42 -51 -161 -21 40 207 84 17 -54 -99 -117 89 -63 43 65 19 -2 -48 -9 -171 126
6938 126 -197 97 126 -80 -72 106 -135 16 5 -20 132 -63 -115 -78 57 137 68 26 129 -89 158 -45 -140 216
6962 216 93 170 -136 3 97 -53 -22 75 78 13 76 -41 -34 -47 13 162 -171 26 -56 -51 30 -120 81 106 -57 113
6988 113 -50 29 125 9 -106 -31 -23 -16 -120 46 28 67 -189 104 -43 108 -22 -72 191 91 38 208 99 -42
7012 -42 -2 -76 -83 107 17 -9 52 94 88 -154 -70 -97 -122 -102 -52 -13 66 -6 39 138 27 -71 -33 28 13 30 -124 -45 38
7041 38 -6 88 17 36 8 30 -66 -147 98 -241 -229 33 100 -41 42 119 -67 22 6 -68 160 34 -101 27 -156
7066 -156 -80 84 -122 83 11 9 -6 -73 79 -114 2 -16 50 -35 -95 -14 122 96 214 168 -71 22 31 -147 -95 236
7092 236 53 -74 160 -32 -25 -68 -71 -174 -28 280 -68 -61 27 119 -27 9 -39 13 -30 31 23 123 -76 49 16 103
7118 103 152 14 -33 -12 -13 -17 -79 -95 284 85 -85 -164 -67 -23 -33 -125 -152 28 -46 1 -174 -31 160 5 90 51
7144 51 -15 30 8 -36 -36 -156 -7 -123 -55 -41 -104 69 69 -170 -2 -64 59 41 88 43 -106 195 -62 -148 5 95
7170 95 -36 -162 -56 125 -117 -24 -107 -22 -99 300 -71 32 167 14 69 -44 41 -31 17 64 -70 4 0 7 -87
7195 -87 -105 57 8 18 -9 76 44 -1 -11 -25 -54 103 26 -146 5 -2 -10 -46 161 121 41 -69 -57 63 75 -75 13
7222 13 -91 80 71 121 -57 -77 -42 43 73 47 -112 67 -63 80 77 188 52 -25 -17 9 126 -79 -143 -103 164 70
7248 70 -49 -111 37 151 33 60 -42 -134 -5 0 23 42 -22 -28 54 -10 -41 9 103 106 -20 -115 -97 42 216 102 50
7275 50 -46 -36 30 -55 -127 39 -39 13 -118 243 -169 -102 52 81 67 66 67 -133 -38 -109 8 84 34 -1 61 20 -8 -29
7303 -29 -6 -146 114 22 137 155 167 -207 -30 -76 4 -184 -167 -68 -216 -164 -141 -59 181 47 -17 -1 -111 7 -39
7328 -39 56 55 -76 -133 -85 151 94 -248 167 -19 -166 -25 210 -1 5 -7 161 48 111 -10 -15 -144 204 -63
7352 -63 -68 80 1 -141 -13 50 74 163 -56 134 75 42 -53 -32 -37 22 -36 -66 -156 -105 16 55 116 4 33 103 -35
7379 -35 25 -44 235 61 23 -43 23 -101 77 23 141 38 78 2 41 -3 -53 -43 117 72 42 37 -53 -24 70 -133 44
7406 44 -23 -41 -117 22 293 -67 127 -13 6 119 -115 21 -51 13 117 -55 -5 45 81 36 122 7 -175 -141
7430 -141 -10 37 82 -84 -50 -28 107 -166 75 270 179 -57 35 -26 -17 -71 188 49 -22 20 -12 -6 -24 111 93 -40
7456 -40 -154 -11 7 -181 -11 1 11 12 72 179 146 -179 -232 50 59 -102 -59 35 63 38 15 -21 -178 45 32 67
7482 67 19 -79 26 26 78 139 119 -89 -44 -54 213 55 109 171 120 132 -319 89 157 -51 -9 -101 90 -101 -23 -21 52
7509 52 -73 -90 -67 -9 87 -5 -41 94 98 -8 -18 83 -22 -158 104 54 -12 -10 125 6 -88 28 36 15 217 90
7535 90 -14 -23 79 76 -81 -140 147 -149 -53 196 84 -116 -28 -9 -107 -9 -76 -52 96 -28 -56 -165 -3 -191 77
7560 77 -132 -177 -188 47 122 -188 97 25 -30 1 21 101 -58 -4 39 -51 -36 -91 97 78 63 -112 -30 33 81 72 -73
7587 -73 79 -111 -23 -100 66 -12 -132 83 41 -97 34 -7 -13 -81 56 -85 168 -59 83 30 98 -32 -13 -161
7611 -161 -37 72 8 81 88 -86 -12 -36 82 -65 -80 -119 83 97 88 -131 -54 72 -32 -90 -3 60 70 -39 93
7636 93 -95 50 -51 89 66 -17 25 111 7 14 -133 41 -77 -132 74 78 -22 103 123 -64 -87 -106 -13 31 38 155
7662 155 -12 39 -26 100 116 13 162 3 -17 108 -53 -94 84 109 -48 70 -138 283 111 -172 0 13
7684 13 -150 89 38 8 -32 195 98 -120 -17 -162 160 139 -147 7 -14 -131 18 -68 98 -58 79 109 -22
7707 -22 12 17 -95 -30 25 -145 -93 -47 11 58 74 84 -75 65 -53 -6 62 29 -140 86 177 -55 -87 -12 -146 -29
7733 -29 107 -67 -118 49 -158 -48 -100 114 -31 -140 -32 -50 124 -102 26 -63 67 4 84 -19 -103 33 208
7756 208 -94 -98 69 143 21 52 150 -78 36 -68 9 62 38 56 12 23 104 -68 -71 69 167 108 10 -6 -117 1
7782 1 -7 49 -203 -37 -19 83 76 20 171 32 181 123 -63 -234 115 21 -18 -10 121 3 54 15 84 -6 -79 63
7808 63 -98 139 55 -14 -128 74 34 65 41 38 -52 13 -22 -28 9 -18 40 27 -167 -113 -22 -38 167 5 -22 93 43
7835 43 139 20 13 -157 -55 19 64 15 -131 -10 36 -40 -9 -133 50 80 93 -56 -13 51 -45 47 -2 -28 -2 -112
7861 -112 85 94 69 53 54 23 39 -100 -44 -18 56 -203 -26 -12 -77 -84 21 15 -62 -28 -43 -56 162 18 43 22 -36 10
7889 10 20 -12 18 -6 108 124 -44 192 -64 -74 4 110 57 -103 -76 -77 10 108 48 -43 -48 16 -109 139 101 -50 -118
7916 -118 -24 -86 -85 117 -40 119 -48 -43 107 -9 -73 -202 157 51 17 -115 -103 -125 -181 48 151 -167 90 -6
7940 -6 74 -160 99 14 -13 57 30 138 78 104 -59 207 -118 72 -47 6 154 78 72 -31 59 -142 -20 60 -98
7965 -98 58 37 -74 28 1 32 106 -209 -37 -195 34 124 17 -44 -6 25 -221 109 -62 -20 50 131 108 121 -46
7990 -46 -122 -60 -34 -4 -45 -50 -119 -46 21 7 -68 12 -76 -166 -149 -64 8 21 -44 -35 -47 41 133 112 6 -82 115 63 197 102
8020 102 -8 46 5 -70 -284 28 -98 -79 40 366 -38 65 -45 38 134 -1 -1 93 -23 8 169 -27 49 51
8044 51 210 79 -94 -33 62 -53 -11 -84 -90 11 -1 128 -26 -8 -76 125 16 7 33 79 -32 -60 6 -35 17 9 66
8071 66 -7 -31 -30 -53 14 -76 -30 133 -148 -59 -70 91 196 49 -72 50 36 199 -54 -28 -142 38 25 53 -112
8096 -112 -19 -14 -4 -21 77 64 -154 -123 -45 60 180 65 55 60 7 45 -28 -181 -42 -17 -100 23 -72 97 -99 -129
8122 -129 6 -12 29 146 85 -190 139 -72 -14 115 85 16 193 111 -49 40 -122 27 -239 11 -104 49 141
8145 141 -38 -1 -96 -122 53 109 50 63 -26 41 30 -14 -51 39 -8 145 -40 32 112 -75 -40 136 41 -80 -142 52
8171 52 -56 -14 -6 -50 -91 -69 -109 8 27 170 -196 37 -17 84 13 -75 -22 206 -66 -5
8191e
$$ Imaginary data points
##PAGE= N=2
##DATA TABLE= (X++(I..I)), XYDATA
0 0 0 0 0 0 0 0 0 0 0 0 0 0 8 -8 8 -8 8 -16 16 -24 24 -32 38 -40 48 -56 70 -80 88 -104 120 -136 152 -175
34 -175 198 -222 248 -278 311 -349 387 -430 478 -527 584 -646 713 -785 865 -955 1051 -1159
52 -1159 1277 -1408 1558 -1724 1914 -2130 2383 -2681 3040 -3478 4031 -4749 5732 -7156 9417
67 9417 -13576 23768 -105852 -67771 101512 -73976 -67191 84807 50343 -69564 39257
78 39257 85822 -30254 -28805 92564 50805 -22690 13210 15697 -39745 10644 51081 -20748
90 -20748 -49190 8622 -16850 -74996 -42936 -1686 -13245 15941 52189 23526 5266 27038
102 27038 -4638 -38698 6215 23451 -30675 -13607 44151 -4374 -49422 37626 73247 -21990
114 -21990 -24591 67999 23705 -73017 -22280 22696 -52704 -40568 59645 15089 -72517 -3099
126 -3099 45680 -43896 -49547 38028 10303 -31892 52082 71971 -21484 -5081 74298 25673
138 25673 -27285 20838 7654 -60406 -26325 7787 -57934 -58468 23040 10938 -32844 16829
150 16829 34706 -23852 -6507 47451 7964 -20338 35277 38679 -12105 6008 29182 -16933
162 -16933 -22936 19341 -8168 -47760 -4141 16185 -34394 -26600 30430 12089 -21625 19108
174 19108 34753 -16890 -18030 23534 -560 -33742 2611 20792 -13612 -3933 27916 -1003
186 -1003 -18531 25732 23789 -24966 -3748 34594 -8181 -32112 16729 12938 -37774 -11273 26884
199 26884 -17292 -36700 11456 8443 -28408 1146 27484 -4462 1311 37680 12208 -12884
211 -12884 21807 22089 -20147 -5456 20447 -16033 -29247 8049 -1617 -33999 -6409 16022 -13362
224 -13362 -12311 17766 3510 -12512 14920 18270 -9004 4031 24831 -714 -12738 12339
236 12339 6705 -18409 -2915 14404 -10136 -17944 7548 4787 -17526 -4542 13044 -2451 -8577
249 -8577 10352 7012 -10574 -599 11555 -3708 -8152 9034 4652 -10248 1650 10496 -5788
262 -5788 -4436 14076 4570 -11287 2985 8112 -11429 -8417 8327 -3047 -11557 6564 6649 -10808
276 -10808 -2088 9428 -4507 -5871 10324 2892 -8718 5924 9756 -6903 -1248 12135 -431
289 -431 -7659 5923 1979 -12599 -4308 4234 -5845 -5326 6481 2317 -4408 3280 4682 -2791 218
304 218 5136 -15 -1150 4381 2302 -2215 157 2473 -364 -1400 -1750 -3340 -4457 -4531 -3211 -1218
320 -1218 -1497 -446 4513 5860 2101 2329 5034 1726 631 4410 1791 -3435 -799 1795 -3500 -4880
336 -4880 -1777 -3929 -6108 -2997 -2063 -4946 -2568 2470 3056 3954 7205 6757 4987 5409 4941 1938 -942
353 -942 -1401 -1418 -3353 -5436 -4328 -3229 -5452 -4548 -453 -1733 -4018 206 2679 -274 2790 7451
369 7451 3115 1672 7855 4270 -3835 1624 3827 -6663 -4810 5669 -1938 -9555 2648 5128
383 5128 -7361 -2217 7891 -3301 -8617 4781 1815 -11001 -1038 7235 -4927 -3652 10432
396 10432 2656 -7469 6125 10232 -4416 140 13079 2634 -5083 6549 4391 -10241 -4901
409 -4901 2690 -9111 -12381 -392 -3858 -12668 -1549 6209 -3624 -28 14452 8647 -962 9337
423 9337 12404 -1996 -1088 10845 1365 -8851 1685 2510 -14265 -11182 1730 -7978 -14393 2617
437 2617 5053 -9265 298 14069 31 -4430 14949 11215 -7182 2848 11963 -8263 -10906
450 -10906 9007 1138 -13364 4342 11334 -9691 -7023 10805 -2781 -13064 7735 8459 -11998
463 -11998 -1859 12301 -6983 -13210 8237 3566 -13150 2600 12273 -7973 -6178 14602 4946
476 4946 -7226 11893 16348 -4851 -1469 11038 -6836 -17421 2117 1538 -17746 -7116 7884
489 7884 -7850 -13124 7199 4969 -9689 5977 18867 -191 -3778 15571 8547 -8537 5738
502 5738 13453 -7263 -7509 9670 -5067 -22230 -2955 5051 -14397 -7620 12833 1 -10283
515 -10283 10544 10397 -11661 -142 17642 -1354 -9675 11009 4914 -13853 2754 13366 -8950
528 -8950 -7312 15974 3113 -15938 2398 8109 -12810 -4578 14295 -3727 -14036 8712 6267
541 6267 -17072 -5855 10597 -6418 -8741 13539 6105 -11501 7396 18832 -3251 -4110 16519
554 16519 5886 -10915 3160 4911 -16602 -10543 8506 -5502 -17653 2845 6804 -12260 -4805
567 -4805 10988 -2801 -6644 15616 12795 -7658 3719 17467 -927 -7004 10092 2730 -13684
580 -13684 880 6911 -15618 -14002 8548 -533 -13753 4772 9634 -9043 -1465 14617 -2950
593 -2950 -11747 11261 11276 -9962 -249 12989 -5012 -8156 11274 2552 -14633 3054 12391 -9381
607 -9381 -9488 9741 58 -11399 6354 8191 -12002 -4370 12290 -3826 -13702 5534 6881 -8645
621 -8645 1607 12768 -3473 -5838 13033 6580 -10100 1940 10704 -5685 -7032 6956 -2527
634 -2527 -13025 2948 7148 -10423 -6687 9141 -940 -9791 5232 6828 -7466 1506 13856
647 13856 -901 -7137 9161 6695 -9204 -673 8094 -6871 -8367 7388 101 -12731 1485
660 1485 9205 -6564 -5043 9688 717 -8604 5895 7070 -8606 -1797 11278 -1351 -8140 6544
674 6544 4538 -9422 -246 8147 -5702 -6930 8394 2528 -9157 2265 7921 -5484 -3264 8675
688 8675 -694 -8609 4229 5250 -8478 -2824 7859 -1704 -6448 5913 3878 -7517 244 8074
702 8074 -3062 -5408 6420 2785 -6722 1330 6052 -4697 -3969 6445 602 -7617 1720 4972
716 4972 -5848 -3542 6231 -289 -5791 4289 5032 -5461 -1283 6495 -1674 -5061 4680 3153 -5989
731 -5989 372 5715 -3845 -4379 5524 1280 -6500 1666 4773 -5017 -3067 5752 -162 -5199 3853
746 3853 4386 -4728 -1021 5300 -2355 -4494 3984 2001 -5310 373 4777 -3282 -3580 4558 874 -4629
762 -4629 1842 3930 -3161 -1586 4519 -4 -3681 2704 3078 -3254 -841 3341 -1805 -3710 2021
777 2021 1049 -3730 -250 3364 -1302 -2210 2891 1543 -2624 882 3322 -1298 -1693 2463 530 -2823
793 -2823 886 2082 -2198 -1432 2540 -394 -2916 1196 1563 -2412 -546 2722 -1053 -2073 1944 958
809 958 -2680 -219 2142 -1435 -1375 2360 755 -1642 1328 2309 -607 11 2365 183 -1429 780
825 780 357 -2485 -1516 4 -1714 -2191 -150 -270 -1508 27 999 151 765 1869 1953 1619 1993 1809
843 1809 689 396 143 -502 -1120 -1494 -1761 -1931 -2195 -2105 -1338 -1124 -778 363 1328 994 915 1809 1602 931
863 931 1622 1668 558 444 1121 -135 -1635 -650 -799 -1880 -1376 -43 -988 -1511 -170 329 -1028 -259
881 -259 1595 427 -380 1142 1026 -998 -128 1724 400 -7 1932 1662 -721 173 1785 -964 -1579
898 -1579 993 161 -2758 -956 359 -2413 -2644 646 -155 -2226 1107 2382 -1026 214 3773 1124
914 1124 -571 3492 3414 -1097 247 2603 -1915 -3807 451 -717 -4719 -1436 1201 -3103 -2942 2366
930 2366 419 -2413 2364 4021 -1041 340 4444 595 -2065 2624 2502 -2800 -485 2678 -2265
945 -2265 -4065 1039 241 -4082 -322 3083 -1889 -1975 3408 877 -3163 1227 3289 -2160 -1609 3301
961 3301 -185 -3690 1591 2791 -2770 -571 4501 -156 -3142 2805 2113 -3990 -339 3844 -1893
976 -1893 -3733 2787 634 -5178 -562 2950 -3122 -2780 4027 895 -3689 2565 4502 -2366 -410
991 -410 5873 515 -3267 2946 2194 -4983 -1541 3502 -2694 -4728 2632 1246 -5310 39 3568 -2957
1007 -2957 -2787 4831 1196 -3981 2421 4468 -2928 -1390 4772 -150 -4082 2658 2654 -5010 -1734 4113
1023 4113 -1604 -4074 3297 2023 -4307 42 4254 -2960 -3945 3866 1212 -4838 791 4219 -2902
1038 -2902 -1962 5083 262 -4220 3079 4447 -3692 -1540 4783 -911 -4074 3178 2293 -5364 -962
1053 -962 4289 -3091 -4943 2999 1160 -4814 1149 4643 -2887 -2054 6021 1405 -4215 2638 4497
1068 4497 -3190 -1726 4557 -1484 -4853 2775 2251 -5347 -1534 4234 -2189 -4181 3139 1389 -4659
1083 -4659 1309 5413 -2447 -2387 5252 1649 -3971 1704 3805 -3822 -1781 4558 -1232 -5343 2302
1098 2302 3054 -4183 -1430 4194 -1687 -3714 3459 1875 -4929 400 5013 -1807 -3041 4027 1649
1113 1649 -3932 1609 3820 -3687 -2665 4661 38 -5032 1587 3002 -3726 -1317 4089 -1591 -4238
1128 -4238 3245 2654 -4354 -384 4498 -1569 -2712 3953 1117 -4592 1327 4244 -3302 -2877 4110
1143 4110 238 -4406 1449 2576 -3838 -937 4755 -977 -3981 2966 2669 -3708 -91 4122 -1659
1158 -1659 -2672 3948 1434 -4343 452 4027 -2385 -2828 3218 -29 -3882 1357 2716 -3527 -1688
1173 -1688 3794 -168 -3550 2258 2557 -3053 -30 4067 -954 -2868 3350 2170 -3485 -119 3310
1188 3310 -2294 -2761 2695 9 -4446 740 2794 -2838 -2057 3432 83 -2998 2434 2989 -2561 -99
1204 -99 4379 -328 -2691 2594 1864 -3404 -224 2583 -2535 -2955 2367 144 -4074 418 2863 -2104
1220 -2104 -1354 3269 454 -2495 2132 2909 -2400 -428 3419 -600 -2504 1753 1155 -3095 -329 2727
1236 2727 -1376 -2377 2173 779 -2886 310 2425 -1632 -1480 2594 209 -2868 977 2006 -2071
1251 -2071 -959 2577 -95 -2044 1698 2062 -1819 74 2734 -627 -2040 1567 831 -2826 -358
1266 -358 1438 -1869 -2010 1552 -67 -2631 457 2006 -1487 -669 2649 474 -1078 1872 1991 -1597
1282 -1597 -113 2077 -649 -2070 1087 272 -2527 -678 1135 -1372 -1687 1525 435 -1492 725
1297 725 1794 -961 -529 1796 249 -1164 905 1289 -1072 -301 1390 -330 -1258 899 804 -1179 -268
1314 -268 1294 -622 -962 831 217 -1306 -144 785 -1111 -1087 522 -173 -1183 533 1146 -105 219
1331 219 1711 615 -150 1096 1046 -349 -200 554 -837 -1312 -433 -506 -1829 -711 -137 -842 -540 433
1349 433 402 -133 791 1378 699 861 1374 891 114 466 92 -576 -574 -307 -871 -993 -652 -566 -521 -489 -62 -119
1371 -119 -34 216 404 392 295 438 561 562 448 511 489 -90 -128 -49 -224 -624 60 64 -544 -414 187 -400 -586 68
1395 68 24 -654 -194 321 -242 -445 589 480 -153 650 1088 314 172 858 349 -610 5 332 -805 -893
1415 -893 63 -800 -1476 -348 30 -805 -412 651 221 -325 1216 1024 -334 696 1541 134 -501 826
1433 826 313 -1367 -220 563 -1080 -1154 460 -138 -1630 346 741 -1026 -381 1331 56 -817 1041
1450 1041 1256 -963 -9 1311 -462 -1175 784 410 -1666 -258 1111 -906 -1024 1108 459 -1161
1466 -1161 630 1296 -1058 -700 1309 -186 -1634 746 995 -1382 -483 1527 -393 -1228 1322 895
1482 895 -1536 -12 1718 -737 -1316 1456 445 -1710 401 1400 -1302 -1199 1495 -95 -1863 683
1498 683 1426 -1249 -461 1707 -119 -1553 1177 1162 -1710 -133 1962 -758 -1495 1382 734 -1847 304
1515 304 1837 -950 -1099 1907 136 -1930 654 1563 -1363 -772 2019 -180 -1916 1054 1267 -1934
1531 -1934 -436 1841 -697 -1742 1530 805 -1929 104 1845 -1111 -1385 2034 113 -2126 647
1546 647 1717 -1443 -1002 1865 -83 -2032 1122 1447 -1960 -565 2211 -615 -1838 1405 1000 -1856
1562 -1856 231 2035 -906 -1433 1655 704 -2196 464 1746 -1421 -1080 1832 -150 -2076 911 1641
1578 1641 -1903 -883 2295 -395 -1892 1432 1206 -1938 -52 2209 -1000 -1834 1744 717 -2328
1593 -2328 289 1619 -1385 -1080 2123 381 -2134 1091 1963 -1498 -720 2247 -262 -1936 1285 1145
1609 1145 -2297 -402 1954 -1116 -1961 1508 800 -2060 361 2131 -1123 -1021 2529 870 -1677 854
1625 854 1900 -1615 -836 1848 -506 -2386 897 881 -2272 -831 1856 -775 -1744 1583 914 -1832
1641 -1832 517 2554 -742 -1317 1979 736 -1854 605 1633 -1722 -1075 1830 -402 -2237 784
1656 784 1367 -1968 -681 1802 -592 -1898 1481 1130 -2064 82 2090 -495 -1363 1685 668 -1789
1672 -1789 649 1991 -1216 -1062 1981 132 -1900 846 1203 -1677 -806 1659 -826 -2144 815 916
1688 916 -1980 -240 1840 -475 -1190 1897 1156 -1275 781 2079 -690 -931 1552 106 -1947 290
1704 290 914 -1827 -1232 1153 -573 -2090 834 989 -1362 -2 1876 -102 -875 1835 1445 -1315
1720 -1315 320 1801 -932 -989 1331 -11 -2071 190 974 -1661 -919 1221 -147 -1321 983 1188
1736 1188 -1275 -59 1724 -205 -1113 1096 744 -1344 -12 1394 -689 -984 1335 405 -1394 282
1752 282 1288 -825 -776 1289 -87 -1371 422 684 -1258 -619 1071 -346 -1179 723 830 -984 107
1769 107 1534 -294 -734 1114 792 -1071 247 1102 -747 -938 778 -158 -1317 71 633 -1148 -532
1786 -532 1092 162 -781 660 861 -611 197 1234 -141 -724 782 320 -1052 15 722 -606 -842
1803 -842 665 -22 -857 247 990 -515 -446 1005 -3 -790 333 442 -547 -288 832 -185 -603 460
1821 460 469 -594 2 894 -127 -239 683 309 -454 297 442 -551 -509 330 -186 -686 -18 139 -546 -424
1841 -424 579 -23 -432 622 605 -103 414 762 -34 -254 378 195 -626 -295 86 -427 -474 148 -64 -657
1861 -657 -91 237 -155 -74 441 127 1 485 347 3 -5 451 0 -272 164 85 -134 -167 119 -363 -261 -26
1883 -26 -63 -190 -35 135 -285 -125 -24 158 -27 88 174 -11 98 93 234 204 -6 -119 -68 -36 -116 179 -25
1906 -25 -346 -178 -23 -383 -85 130 -164 -91 43 84 88 57 275 389 -152 83 123 -108 -269 68 -198 -355
1928 -355 -108 57 -422 -277 206 -216 -425 426 209 -127 -33 281 -41 -204 414 272 -442 80 318 -348
1948 -348 -271 163 -148 -450 19 208 -369 -127 364 -73 -321 321 438 -181 -234 514 -18 -281 398 275 -507
1969 -507 146 452 -546 -556 376 175 -709 146 425 -483 -119 599 15 -438 542 478 -442 4 669 -117 -530
1990 -530 500 233 -742 -2 510 -602 -678 465 44 -829 163 689 -403 -255 864 -121 -437 517 571
2009 571 -664 -307 961 -465 -586 467 332 -846 -171 583 -380 -597 692 348 -871 258 783
2026 783 -394 -414 873 175 -816 276 588 -774 -416 836 -239 -848 676 516 -861 -79 784 -383
2044 -383 -855 785 361 -1012 87 899 -455 -586 829 320 -846 375 847 -687 -298 1118 -178
2061 -178 -843 619 497 -834 -272 941 -583 -901 744 361 -1030 40 982 -656 -661 986 162 -956
2079 -956 428 1067 -694 -463 1067 -171 -855 483 480 -960 -296 910 -440 -858 737 444 -862
2096 -862 37 968 -443 -490 988 236 -1006 25 924 -720 -853 876 -55 -980 708 860 -764 -149
2114 -149 1345 7 -805 796 724 -998 -120 1041 -379 -1000 745 194 -1272 16 827 -815 -615
2131 -615 1077 103 -887 515 1021 -799 -256 1093 -70 -939 885 548 -1067 -296 879 -568 -1117
2148 -1117 717 438 -1223 108 843 -662 -609 967 225 -1031 414 1009 -582 -557 1091 -106 -943
2165 -943 654 767 -1089 -269 799 -336 -812 713 489 -1111 -56 900 -612 -809 811 221 -1009
2182 -1009 317 905 -409 -301 1129 360 -768 589 833 -563 -320 895 -191 -1041 554 394 -1004
2199 -1004 -418 657 -541 -837 700 339 -754 278 1097 -333 -88 970 374 -750 511 643 -876
2216 -876 -563 618 -348 -1125 296 411 -963 -114 861 -277 -664 867 543 -785 218 857 -348
2233 -348 -472 681 147 -836 134 653 -750 -505 673 -151 -848 404 464 -613 1 823 -347 -644
2251 -644 547 370 -682 -62 787 -466 -542 681 316 -637 187 616 -398 -373 754 69 -631 409
2269 409 478 -510 -288 768 -312 -623 325 143 -573 159 677 -260 -313 743 256 -760 49 661 -344
2288 -344 -418 510 -31 -811 203 290 -531 -275 676 -93 -535 258 539 -523 21 556 -209 -468 307 187
2308 187 -701 8 410 -416 -260 395 14 -410 288 591 -360 -214 516 93 -267 285 123 -549 -361 397
2328 397 -388 -368 241 72 -410 -100 319 -347 -270 367 278 -491 335 352 -195 -83 452 -10 -219 144 126 -219
2350 -219 -116 200 -79 -440 8 278 -263 -86 96 -251 63 296 218 -142 127 413 -51 -237 203 -94
2370 -94 -358 214 124 -367 -225 20 -124 -189 239 39 -236 -21 75 -142 -58 309 0 -192 83 273 22 -207
2392 -207 56 -92 -99 -58 84 -211 -121 82 -16 -206 142 100 29 76 106 50 -48 -95 82 46 -53 108 -62 -31 -44
2417 -44 63 -127 70 4 -14 -34 40 25 -45 -25 -115 90 108 -58 -47 4 106 -56 48 18 25 169 -55 -314 38
2442 38 144 -4 -17 88 -93 -184 -171 160 -95 -177 171 -13 -125 207 97 -237 -14 193 -40 -77 83 23
2464 23 -200 -125 12 -65 -359 143 97 -187 166 408 149 -145 249 148 -93 48 430 -92 -97 310 68 -409
2486 -409 201 276 -207 -265 196 -142 -257 43 58 -272 115 356 -13 -416 255 93 -297 90 152 -276 -314 295
2508 295 -167 -460 100 212 -281 -97 261 -66 -329 130 388 -266 -86 397 -67 -285 226 164 -426 123
2528 123 228 -125 -218 306 -28 -461 33 303 -443 -193 401 18 -404 177 287 -414 -26 397 -209 -364
2548 -364 450 206 -434 7 651 -196 -159 347 97 -610 141 328 -204 -376 436 -75 -424 342 612 -181
2568 -181 -124 566 16 -251 240 427 -404 84 368 -220 -307 190 42 -766 50 432 -223 -186 608 -121 -333
2589 -333 233 415 -378 -79 548 14 -456 381 274 -554 -16 559 -248 -538 429 165 -292 196 601 -351
2609 -351 -181 513 144 -422 54 483 -508 -327 578 -39 -584 220 363 -581 -40 591 -75 -305 484 257
2629 257 -542 58 559 -189 -434 465 205 -637 139 404 -500 -300 390 -14 -319 197 362 -341 -260 560
2649 560 -121 -530 323 282 -461 -7 539 -444 -360 384 230 -492 133 526 -457 -317 568 -140 -574 241 447
2670 447 -484 -250 526 -277 -418 342 547 -583 86 389 -197 -349 512 123 -489 -147 446 -253 -403 487
2690 487 46 -581 65 519 -391 -246 625 -54 -578 199 338 -396 33 627 -452 -404 357 256 -544 164
2710 164 507 -26 -325 364 112 -789 31 325 -276 -173 744 104 -391 408 301 -367 -18 353 -21 -320
2730 -320 276 270 -399 131 262 -293 -308 368 96 -255 226 585 -424 -269 421 83 -337 203 460 -414 -5
2751 -5 432 -47 -390 222 157 -274 50 566 -369 -386 229 246 -258 319 479 -239 -135 253 25 -460 143 385
2773 385 -256 -129 287 -21 -332 181 103 -375 -139 373 -205 -344 342 68 -343 107 431 -195 -193 185 44
2794 44 -309 1 356 -292 -132 305 -99 -470 117 187 -359 -68 472 -81 -310 247 92 -415 -11 338 -151
2815 -151 -152 211 198 -255 96 232 -110 -107 213 37 -297 10 236 -362 93 117 -223 -265 253 -27 -330 -170
2837 -170 180 -202 -205 207 121 -212 72 250 -30 -138 309 -132 -257 73 103 -145 -80 265 25 -72 149 114
2859 114 -241 44 299 125 -64 294 126 -335 -2 112 -231 -32 305 -19 -21 -54 218 -150 96 136 27
2880 27 -162 15 -18 -132 -17 103 -107 -23 147 116 -274 79 149 -137 -31 48 211 -196 1 226 -21 67
2902 67 -159 92 -107 86 49 -67 -42 -75 11 -29 -3 -91 -219 -72 150 -46 154 31 75 34 34 -205 -74 -210
2926 -210 178 9 -34 -53 41 -85 -42 0 -2 -35 101 -130 -10 -16 -225 -62 22 -39 -63 -126 43 57 157 136 54 -74
2952 -74 164 37 -136 31 -30 -37 46 -46 -63 -100 -99 -4 -69 -39 0 -78 0 96 87 76 138 146 -108 -93 73 -105 16 88
2980 88 -47 -395 133 6 -179 30 33 -10 -218 78 145 -36 -57 -131 21 14 59 63 -137 -6 147 -144 13 184
3004 184 -116 -165 4 210 -154 -20 18 142 -44 226 -42 -62 -145 159 -122 -154 4 56 -117 9 194 -124
3026 -124 -128 176 50 -329 14 163 -68 -165 174 86 -128 163 139 -100 -35 251 27 -222 143 261 -157 -66
3048 -66 35 -252 -130 15 57 -54 8 191 -31 -134 142 -30 -146 157 197 -161 -283 295 -14 -274 245
3069 245 63 -174 -220 305 -130 -157 199 71 -112 -99 232 101 -179 135 136 -132 123 393 -174 -37 142 -180
3091 -180 -323 42 233 -34 -156 105 40 -220 117 227 -342 81 158 -91 46 320 194 -377 122 321 -255
3112 -255 -59 249 -120 -323 192 98 -233 -248 317 -29 -175 138 123 -205 2 228 10 95 185 -13 -223 -65
3134 -65 407 -94 -78 293 -108 -310 -63 231 -214 -41 324 -5 -216 212 161 -214 -15 401 -83 -259 239
3155 239 21 -187 33 417 -149 -149 179 86 -272 194 174 -296 -122 277 63 -323 113 27 -206 -122 169 -179
3177 -179 -330 238 198 -437 35 218 -263 -256 170 -26 -230 67 153 -274 -194 354 20 -244 135 358 -215 47
3199 47 367 -81 -233 355 34 -357 40 106 -165 -310 375 198 -379 52 285 -144 -78 152 16 -335 237
3220 237 172 -94 -73 173 -74 -217 197 170 -341 107 271 37 -369 200 156 -166 86 513 -7 -134 242
3241 242 178 -278 255 68 -305 14 180 -10 -195 -79 124 14 -153 156 -100 -212 97 25 -346 116 231
3262 231 -157 -140 341 -61 -261 153 257 -314 -55 302 -21 -165 -27 135 -318 -201 476 -151 -209 379 263
3283 263 -193 76 165 -164 -273 262 -50 -257 45 127 -219 -120 250 -16 -311 7 247 -203 -40 303 66
3304 66 -116 54 125 7 -23 141 -180 -69 118 86 -151 -1 44 -117 -239 195 -49 -178 173 -3 -24 -92
3326 -92 218 -115 -110 51 161 -189 162 187 -147 -102 55 -59 -98 15 123 -266 -90 101 -161 -236 48 146 -75
3349 -75 -104 121 -18 -186 77 72 109 36 51 -97 -48 104 -4 -182 68 179 -11 -261 190 24 35 133 94 108
3373 108 78 234 105 -94 -7 223 -111 28 190 -6 -115 136 22 -103 75 43 -35 21 -3 167 -158 20
3395 20 100 28 145 83 165 118 -113 208 76 36 113 68 -195 -107 -16 -175 -64 102 -80 115 73 -7 -101 76 -19
3420 -19 98 72 110 -62 -96 75 98 -97 -19 -145 51 -54 18 161 71 -10 -72 -48 -203 -39 112 32 77 37 29
3445 29 1 113 -138 -96 61 18 -40 108 -168 -123 121 93 97 -14 76 -8 -20 -130 143 -104 -15 -130 -211 -41 -148
3470 -148 -20 -108 -76 -141 -117 -216 -99 -21 74 -64 -170 -14 -40 64 186 62 118 149 -49 -18 18 -57 -181 -74
3494 -74 83 30 12 -21 131 -85 -21 -169 -230 87 -37 72 3 122 112 -54 78 150 -132 -84 76 -34 -67 -23
3518 -23 -134 -99 17 -56 -108 9 -84 -23 -28 144 58 -73 72 1 16 37 140 51 24 -93 118 -108 135 133 -219
3543 -219 -21 144 -36 -108 131 -41 8 -56 84 -82 -148 44 71 -116 119 57 -49 -125 118 -69 -62 32 -106
3566 -106 -35 -10 63 -2 -125 56 -33 -21 51 139 7 -7 165 2 -99 -33 105 34 -212 194 -47 -165 -150 118
3590 118 -27 -214 92 12 -48 40 163 -85 9 261 -27 -101 91 186 -63 166 29 -158 -52 84 121 -257
3612 -257 185 14 -101 -19 145 5 -43 8 51 -309 -131 46 108 -166 77 85 -89 -151 191 -118 -330 139 23
3635 23 -124 99 -140 -4 92 201 8 -139 35 107 -45 52 276 47 8 -7 91 -132 -108 -38 -11 -4 190 204
3659 204 -129 -163 -15 123 135 199 107 -108 -130 123 -117 -10 137 -87 22 45 74 -113 -58 79 -209 -236 36
3682 36 140 -158 -41 158 -109 -112 86 173 -206 -16 366 -83 -203 198 -141 -128 275 126 -195 11 279 -140
3704 -140 4 139 17 -132 93 194 -129 -37 171 36 -156 107 -16 -83 -65 222 -48 -268 254 -20 -155
3725 -155 -73 229 -87 -59 18 102 -168 160 88 -182 -45 58 196 -178 57 62 -73 -28 -18 135 -233 83 188
3748 188 -24 24 179 68 -11 -54 39 -250 -156 274 -118 -261 117 -82 -25 63 93 -30 -194 146 -128 -138 -104
3771 -104 34 -140 12 122 -90 -41 150 40 -169 -145 225 19 85 -14 87 -128 -87 217 -7 -132 25 -4
3793 -4 -265 50 84 -57 -124 254 -22 -37 41 172 -122 203 334 -43 -22 139 75 -65 15 88 167 -79 276 56
3817 56 61 19 26 -70 10 27 44 54 -203 124 65 -2 94 -127 -5 29 4 -186 -38 17 65 -423 57 33 -56 23 231
3844 231 39 -43 54 -115 -109 -11 99 -20 -96 93 68 -60 91 71 -105 -44 84 -3 -30 64 121 -144 136 -25
3868 -25 101 111 -18 37 37 -5 58 -47 -97 77 -27 -55 30 1 -78 -5 -29 4 38 190 -10 -126 50 80 45 -102
3894 -102 -26 120 80 97 132 148 -74 -122 -70 -190 -34 100 -26 -121 153 183 23 38 95 -100 170 41 -98 -60
3918 -60 63 -9 -98 -121 122 51 9 -112 -166 83 -37 208 -113 -62 146 -52 -111 -34 78 -233 -37 5 -13 -130
3942 -130 21 -132 -68 -13 104 17 -68 -9 -46 30 28 -77 -64 -45 -27 3 183 48 54 -37 -135 64 67 -58 4 -94 -118
3969 -118 -50 -86 65 102 19 33 -20 -150 -81 33 -135 -55 33 -104 -103 -132 -30 -82 -117 -211 -155 -81 27 79 18 90 -28
3996 -28 117 137 57 -68 -6 -85 61 57 -116 -22 82 -51 -15 -60 -116 -89 -84 103 -113 -6 -27 -166 -36 -134 94
4021 94 -69 35 16 60 -40 63 11 -211 112 91 44 -73 -15 -96 72 -28 18 66 54 38 3 -6 71 43 58 59 -11
4048 -11 177 -153 120 -89 -124 -82 -108 72 -149 -47 78 57 157 -153 27 -54 -78 -110 8 165 141 -11 165
4071 165 -32 -115 2 1 46 160 33 78 18 -40 190 -2 14 -43 102 -75 39 -68 -19 -132 -85 129 -23 -36
4095 -36 79 143 -67 -47 -83 -54 -106 68 -59 -120 -162 -28 -99 -52 83 -22 24 103 238 -86 -140 129 24 -36 72
4120 72 -71 -73 8 97 -61 41 -1 -34 -44 44 36 -195 -79 -33 90 -117 -16 45 -1 -90 6 -164 150 123 122 -95
4146 -95 -127 54 -122 -76 110 -56 3 45 -42 153 98 -48 46 -75 70 106 11 141 127 118 -112 228 -183 -116 92
4171 92 114 -222 -122 35 76 -185 16 -23 -32 128 -88 -60 -17 68 -38 -127 -158 146 -112 -117 14 -5 17 39 123 -78
4197 -78 -211 92 -38 -32 -12 286 11 -2 -199 -139 -7 55 229 -84 9 141 48 -167 -38 -145 -133 -33 88
4220 88 97 -61 158 -99 -35 108 28 -158 77 84 -14 80 42 86 -144 -23 135 -168 -220 163 7 113 186 78
4244 78 -150 3 66 105 -168 47 -34 -110 67 -159 -83 -30 19 -212 -154 -111 78 65 -130 117 -79 -68 1 73 -153
4269 -153 -66 3 13 -216 36 29 -156 -1 34 -96 -82 10 95 -225 -210 -31 89 84 6 174 49 42 59 -73 -157 224
4295 224 -10 -182 37 -172 -138 -73 34 -153 -212 22 -222 13 98 51 61 -186 65 38 -77 -42 -41 -47 8 126
4319 126 167 -21 107 -50 -20 -111 44 114 -30 -71 33 73 36 20 -51 -72 31 32 -61 -48 19 40 -72 124 37 58
4345 58 -56 -8 -103 12 95 -78 -23 59 85 -10 39 -97 -73 -143 -68 -103 -98 5 50 54 -164 -3 130 45 29 27 -84
4372 -84 29 -2 -48 -76 -164 16 -168 -55 -82 50 -29 -17 22 228 77 -42 70 59 -39 71 53 -178 12 -19
4396 -19 -131 82 13 -6 149 -181 58 -69 -50 -84 -45 9 161 48 112 47 -53 122 -76 24 -80 -33 -164
4419 -164 41 -211 -138 -168 -21 -28 -128 -12 -80 -41 62 57 -138 90 -190 -78 12 -15 -22 -194 -42 -17 -1 -26 -11
4444 -11 -11 25 -117 163 93 123 62 112 25 127 111 -219 31 -169 -211 120 269 -57 13 87 -121 151 144 152 -36 -16
4470 -16 -193 -77 99 108 -120 79 7 185 -96 -10 49 35 111 2 -157 -96 50 0 32 21 70 106 23 77 -15 71
4496 71 120 15 -128 6 -37 -5 35 -76 -68 -80 -53 -143 -208 -5 86 101 -7 48 -25 20 37 51 -21 111 -172 -148 37
4523 37 121 165 137 -89 -9 -1 59 92 -165 277 -25 52 3 70 135 -75 64 101 -14 -16 74 -120 95 -123 -39 -11
4549 -11 -54 -12 -10 -107 37 -1 1 -121 -86 138 54 -27 226 -91 -6 64 100 -50 -33 257 124 -76 11 -25 -147 -20
4575 -20 98 -43 -4 131 -106 -77 -163 106 -51 -76 -33 -133 -128 22 7 21 41 -186 -80 134 215 29 -53 -136 -68
4600 -68 19 36 86 57 -110 133 30 118 -23 -54 -72 -89 57 40 108 114 -22 -26 -102 -23 -145 23 103 -48 123 -51
4626 -51 -3 -145 20 94 -9 67 -56 -40 -27 -60 61 -33 -113 87 229 63 18 -129 -3 71 43 178 -83 181
4650 181 13 -158 -21 -133 -52 230 180 26 -93 -61 87 129 -27 35 59 -39 -94 63 13 47 97 6 -16 -46 -80
4675 -80 -70 31 172 -178 2 -68 -70 -76 -10 -26 77 -22 -5 12 87 -212 -75 62 -166 -17 113 -41 79 2 -54
4700 -54 -134 -136 69 -28 127 0 3 -148 -2 38 -10 152 -121 69 -96 21 170 -106 16 -22 -10 -174 97 -35
4724 -35 31 9 -78 17 -61 -76 -148 -176 -26 -58 20 112 -63 -1 -111 232 28 195 40 13 -164 -161 23 -11 104 -81
4750 -81 -77 -122 38 100 129 8 68 -37 -42 -154 103 8 17 -120 -58 -39 -166 74 -38 -134 33 -77 -197 23 -127
4775 -127 -53 -20 -86 -71 50 146 -4 30 -230 -2 59 -86 -54 -102 -141 39 27 78 72 -61 -40 -107 39 -41 17 36
4801 36 29 69 97 -39 -19 -117 -40 -41 18 154 71 14 -87 14 -70 5 51 59 -178 -45 144 -115 -217 170 -43 -25
4827 -25 42 29 -36 42 11 -22 -83 -4 -96 -15 66 -164 -84 112 128 22 -65 5 7 -76 -37 43 -75 -108 -54 107 -20 -11
4855 -11 -40 39 -49 -103 34 -13 55 54 5 93 43 -109 -207 5 -33 49 14 -1 7 31 97 -1 152 -36 58 49 96 72 68 -52
4885 -52 -125 26 -15 88 -101 101 -73 184 -98 -140 -138 -11 -98 84 -88 97 62 60 126 -105 98 -148 91 -34
4909 -34 -163 -14 63 -124 -130 -88 -80 -80 15 -27 -80 87 68 -66 80 56 118 110 -22 104 24 -129 -71 28 18 18 86 56
4937 56 -114 66 -79 -136 88 124 -82 17 82 -217 -49 -45 112 -172 105 -19 -26 -52 61 -59 119 50 -113 84
4961 84 -62 114 -12 31 -15 10 -44 -141 -37 -18 203 -96 -21 26 -76 34 -45 29 -115 117 117 -46 -46 -80 21
4986 21 -57 -88 127 -49 -42 -39 96 -19 22 71 -166 -144 -64 -55 -112 -166 -40 -35 -4 44 -212 173 199 -3 136 32 -150
5013 -150 147 61 -13 -32 0 74 66 -3 201 -173 -27 70 -67 -80 -237 -80 -71 30 -33 -147 -228 -48 188 -84 -19
5038 -19 7 -130 48 -33 -77 -11 -42 23 62 20 -12 23 57 45 -24 -94 -61 10 -55 -1 -125 22 55 -90 -34 -85 137
5065 137 66 -97 -237 -22 -34 120 -101 -74 207 -32 87 48 -11 -73 -182 -2 34 -39 58 166 14 52 -147
5088 -147 -155 -33 -127 -181 -106 63 121 -149 -72 50 -31 167 100 15 54 2 -101 -24 12 -27 67 -123 -59 -113 10 -18
5114 -18 -63 -68 47 -107 71 -42 18 100 -46 3 78 -146 21 -95 -58 -135 56 27 206 -1 32 60 -60 97
5138 97 121 -51 -64 90 75 -26 -82 41 3 82 0 -81 35 77 -15 16 -21 69 66 147 115 19 8 -49 -11 110 -69
5165 -69 -21 -20 -126 22 -49 90 25 56 -178 -46 -98 91 -95 18 52 109 42 -2 72 48 59 53 8 8 119 -7 -3
5192 -3 -45 41 4 -99 -1 -124 -15 -94 -25 -53 11 151 1 9 242 -9 160 23 -33 -62 -86 92 119 -17 -119
5217 -119 77 -87 107 39 -84 52 -46 29 142 15 148 12 -89 173 23 161 45 127 37 -77 -28 27
5239 27 -163 -11 -77 -39 183 52 196 78 -38 -89 62 -67 95 67 -12 129 145 123 -16 63 86 29 102 -71
5263 -71 -66 -66 40 -63 -5 -97 45 -170 -15 -1 65 130 -78 43 -213 -68 -32 -20 -228 11 230 -5 -16 -71 -47
5288 -47 -92 158 -75 -72 -102 -14 -25 46 -11 8 50 -17 103 133 -77 -26 20 -43 -197 24 126 56 141 -84 -152 -37
5314 -37 47 13 -48 -86 -99 11 1 -82 -132 3 150 99 146 -76 33 167 114 4 -47 81 -6 145 -112 297 179
5339 179 -20 -5 15 82 -118 231 -5 54 73 -10 -30 -69 -18 -121 -150 -56 157 -86 4 -73 91 -232 54 -159
5363 -159 -198 88 -157 97 55 -74 -123 -108 60 -16 30 150 -78 -61 -91 69 -72 -154 0 -104 96 -113 -22
5386 -22 126 -4 64 91 -49 61 -45 37 -81 17 59 71 -2 208 87 28 85 -10 -182 -16 13 30 -160 71
5410 71 31 35 25 6 24 93 -17 -77 108 21 -92 -9 -5 24 -30 50 -8 -158 136 -55 10 -6 -48 64 -5 -93 7
5437 7 -53 -125 -78 149 -90 73 -158 81 2 -88 34 -68 -88 -28 -27 -81 216 -138 -78 -49 5 42 36 -183 -50 120
5463 120 54 -20 4 -63 76 13 38 8 75 -116 1 48 183 -11 -161 37 -142 -63 0 126 -71 -85 53 -139
5487 -139 108 65 -46 -24 56 -1 -125 22 14 -10 56 -18 -14 106 -45 234 17 88 84 -72 61 30 16 131 43 -38
5513 -38 -131 -90 -19 -33 -24 -16 -8 -84 -13 49 -9 36 -78 -74 -1 -61 106 -78 -132 22 -186 60 156 -12 -21 -189 -69 8
5541 8 106 3 -90 -75 109 23 96 54 132 41 61 -46 159 -59 -76 -97 64 -1 -38 91 -23 -66 -75 -100 -57 -109 -2
5568 -2 -91 119 26 46 178 20 6 35 -113 -152 -64 76 -134 -72 146 -166 -66 -25 -29 -2 -16 -79 169 -31 -50 -19
5594 -19 -39 -218 -52 -45 -222 142 -161 9 -144 86 127 -9 0 113 26 74 1 103 -20 -38 -143 -93 -21 -63 99
5619 99 15 -161 23 -69 12 92 48 -38 81 40 1 86 132 -80 1 -73 32 -98 -53 -100 -45 -62 33 43 -6 77 -16
5646 -16 -29 -133 64 -61 47 34 76 37 -93 -76 -45 -4 85 -75 75 121 -160 71 11 -3 -39 -19 -31 295 213
5671 213 122 26 1 15 174 43 -3 -28 1 -1 -78 -34 177 -41 109 70 123 0 64 -88 112 -61 -55 110 -117
5696 -117 -19 24 -43 -90 58 -31 -102 41 -110 71 -46 8 69 -70 54 -180 -74 115 68 -164 -3 -84 -29 -71
5720 -71 125 139 -221 60 -13 95 156 -39 -42 -47 -67 -88 -32 184 63 90 11 -51 51 95 -42 -1 15 -104 29 -101
5746 -101 81 88 87 -143 99 33 -139 49 -43 118 4 -9 84 37 -81 -31 -29 94 -137 -41 79 32 178 19 -163
5771 -163 -114 46 106 76 55 -92 169 -18 99 325 -83 116 -158 -119 -53 31 -188 -203 105 -72 -67 96 3 -53
5795 -53 81 -48 -85 63 66 -63 107 32 31 -1 -10 -47 -188 -125 -41 -39 34 -224 31 65 -6 -74 -112 48 -83 131 -33
5822 -33 -39 68 55 83 67 7 -108 13 72 72 -54 19 29 162 -10 60 -62 93 -156 -104 63 -195 155 -114 58
5847 58 -35 -65 111 -27 10 -3 -8 -50 -100 -66 8 -63 -44 50 -92 113 25 -195 -82 -100 17 -40 -35 35 165 -24 -54
5874 -54 50 -80 -125 -53 -107 -43 -157 -109 -21 -68 124 -14 -48 -46 -16 -16 -187 -10 102 15 -62 -7 41 11 -74 -138 -9
5901 -9 91 40 57 -150 -63 240 -134 -231 -86 64 32 47 11 -96 94 -138 -21 -90 -14 -9 -19 -63 46 84 -90
5926 -90 -26 -11 -105 -58 51 -11 -28 10 -70 35 106 31 -90 180 -10 -63 124 -140 59 -71 51 5 -99 -53 -1
5951 -1 136 -35 -100 114 56 -64 -29 38 15 -4 -233 26 65 -42 19 71 52 -69 -18 -134 -83 -109 103 -68 86
5976 86 -28 10 -25 171 73 28 -176 113 -8 -68 42 -104 -13 -123 46 44 18 120 -108 -142 -24 -68 81 -14
6000 -14 -26 -47 -28 29 6 -144 -2 18 -3 -196 50 124 178 -73 -203 5 -62 -46 18 104 -83 -36 246 196 -123
6025 -123 24 77 77 -62 230 42 12 60 74 17 -99 89 56 118 67 94 -60 61 223 74 -118 28 49 -1
6049 -1 -27 -2 -182 9 -41 -79 -37 109 10 -113 155 -263 102 -137 -12 -35 -32 59 7 -34 76 -47 126 -68 -61
6074 -61 -59 -115 116 66 28 29 61 -137 -5 -104 -19 -6 61 43 -52 34 53 -64 38 61 34 190 26 17 -208 -20 44
6101 44 -37 121 67 32 -36 141 -69 -54 102 75 -77 -48 -13 57 -18 109 162 66 112 172 -129 79 -3 44 -70 -2
6127 -2 102 -3 -16 164 113 114 -159 99 3 -204 27 -49 -68 110 -170 29 69 28 -73 -85 -73 -47 182 -19 -70
6152 -70 36 -39 -47 -60 42 26 -106 69 35 130 53 136 -39 123 -30 39 -92 209 176 -178 -27 162 48 81
6176 81 51 160 -28 132 -55 -70 142 -24 -44 22 -25 -57 24 -118 -116 46 -203 -57 -108 -162 63 3 -9 -263 -48
6201 -48 -29 154 65 -33 124 -39 -95 -48 134 71 14 -68 103 -263 0 -151 -44 66 5 -77 55 45 -32 59 126
6226 126 122 -10 -73 94 -19 -68 -103 14 53 136 -53 -36 142 21 86 -19 22 -105 -176 -90 47 38 89 34 -33 -134
6252 -134 52 -57 153 -13 33 32 -169 -281 -23 112 -54 -8 -1 -98 159 -56 -43 72 -91 144 87 -47 167
6275 167 -9 -68 -190 41 -14 -82 -120 -33 -131 -40 93 128 -36 45 -37 -7 24 10 14 105 43 -121 134 58 -103 -66
6301 -66 -42 90 97 -15 157 54 39 106 5 238 114 113 88 -14 -121 56 122 -80 -28 -5 -9 -127 -12 42 -63
6326 -63 -58 -124 -150 -16 139 110 -24 -100 -17 -44 -32 -136 100 -108 -32 -83 -36 93 7 61 -45 144 -38 -155 -6
6351 -6 17 111 0 65 -55 -26 34 -136 54 -5 109 -56 14 -1 116 -65 -32 34 -171 70 -186 -122 -189 61 -114
6376 -114 14 -3 -50 21 -19 154 118 -80 -18 -27 -3 69 -73 57 -60 93 169 -74 9 95 -55 -72 78 39 3
6401 3 32 -91 112 103 72 132 68 75 -235 62 -91 40 58 -85 15 119 20 -184 71 75 85 30 0 91 61 4 -34
6428 -34 104 -36 -134 121 48 164 -122 -111 31 154 -72 -61 3 -12 31 100 190 -21 -83 196 -52 113 143 75
6452 75 -153 -89 75 1 -47 -110 12 -49 147 -22 -12 30 107 -53 -170 210 155 -16 57 49 176 -21 -7 17 -136
6477 -136 16 55 -117 -112 22 -33 -39 -88 -97 -143 49 -40 92 -23 -70 -208 -25 -108 26 -9 -100 -8 -58 -27 -92 -27 -91
6504 -91 -93 -109 -18 64 56 95 -65 -43 172 4 36 69 34 24 50 -69 17 52 95 38 -40 173 -19 78 20 66 5 -84
6532 -84 -116 -48 -8 -57 -37 -9 147 198 91 58 -35 -43 -78 -46 -70 102 -6 -105 137 206 127 27 -28 22 16 111 90 148
6560 148 -158 1 -8 53 28 -180 89 137 -22 -11 -7 -226 151 134 59 -54 14 17 113 -6 -90 81 -58 19 -11 149
6586 149 9 15 -11 35 -16 -56 39 -66 -69 -3 -75 156 79 -75 -11 -85 -191 -2 117 69 43 232 -44 -6 -57 -77
6612 -77 72 -3 -69 -34 -135 -5 -280 89 -5 -59 111 -44 53 0 22 17 13 62 141 5 31 109 -20 -14 -99 -58 -61 -21
6640 -21 17 103 51 71 -6 33 -79 124 144 -109 37 177 -11 142 37 22 -104 -35 -13 2 -60 -137 -12 -56 -18
6665 -18 -25 -14 -11 44 -53 -154 107 13 88 -47 25 -12 36 -44 147 -22 35 144 -78 172 54 -144 28 -21 -30 39
6691 39 -24 142 -12 -28 -19 -40 119 12 -217 -103 36 54 -50 -13 135 -35 -61 -21 -58 48 -139 -57 -56 32 48
6716 48 101 81 83 -46 -42 -22 -92 71 -9 182 -42 -92 34 -18 -138 -32 87 -61 -67 -98 116 -51 56 64 69 -66
6742 -66 -121 -197 113 100 -11 -101 -62 76 71 -125 -60 257 67 3 -120 109 145 57 -49 73 1 -99 88 175 28
6767 28 170 33 98 -31 33 -67 -53 54 -103 97 -49 -28 39 -5 -50 -57 -107 45 -90 -36 -41 27 185 15 153
6792 153 57 96 116 -39 106 95 165 -188 -61 170 7 -30 -39 21 123 22 -69 126 8 -224 4 -3 15 9 -216
6817 -216 41 59 62 13 -97 77 -79 -67 -90 46 -124 50 19 -46 -63 -115 62 -19 -87 50 82 61 -55 -39 -2
6842 -2 112 -82 56 156 103 -15 -87 -5 -98 2 35 151 24 -102 -56 24 0 -63 70 44 -60 -16 -7 -50 9 35
6868 35 85 90 -43 -26 68 33 101 15 27 128 -25 138 -4 -16 -59 185 -9 -38 -77 -56 14 38 -68 -77 121 1
6894 1 76 -30 -36 -97 -90 59 143 137 23 59 6 -11 -89 114 -1 29 108 -166 44 -102 -162 147 100 135 175 -158 -57
6921 -57 -66 -110 -7 101 22 -22 66 -30 -20 -14 72 -99 -4 -122 -12 28 96 114 -54 45 21 147 115 28 -45 -93 25
6948 25 -104 -47 10 53 1 78 -1 7 16 -86 40 39 -78 -67 24 50 -27 -105 9 -124 -110 4 -62 -8 57 -4 15 202
6976 202 -51 37 -62 -36 -47 155 95 -97 -27 100 60 -6 95 -123 294 -180 27 -38 -49 90 39 -13 29 -14 -199
7001 -199 -85 40 -10 178 -28 -15 -6 -119 28 -4 95 58 -80 -51 -90 73 -29 121 102 -54 -125 67 4 171
7025 171 -32 58 202 -95 -41 -40 39 -16 -16 -111 -89 149 -21 -92 -178 -60 16 31 -11 50 -34 -175 -85 -32 -3 104 -48
7052 -48 74 43 95 -48 -84 -68 22 94 6 99 36 4 -78 -37 -63 -142 63 88 -146 -61 97 -2 -107 28 -110 20
7078 20 88 45 58 7 105 17 -51 107 0 -61 -47 -35 -37 -94 -24 -12 -23 45 -94 -53 -14 -69 153 15 195 72 -4
7105 -4 145 -1 -140 83 50 4 -74 86 -124 -126 73 -53 -35 -127 65 -3 44 -134 98 -195 14 -90 101 -148
7129 -148 34 48 -73 -49 -17 92 60 -18 -185 114 -53 96 13 -38 58 -59 -4 -8 -94 -11 104 63 -22 111 -39
7154 -39 96 54 48 -73 -143 -82 -43 20 -230 45 -10 -41 -53 -55 23 -2 -72 46 112 -239 -30 -169 39 38 -80 130
7180 130 -92 74 -44 125 159 52 -58 72 14 -47 23 -12 64 -5 173 -184 -15 -63 31 -46 -71 132 -155 -125
7204 -125 -57 -2 71 -18 20 19 36 52 41 -83 -62 37 -137 79 -101 -56 6 111 96 -4 115 57 -6 -31 138 8
7230 8 -86 137 21 -84 80 46 129 109 -16 44 36 -209 -3 -150 105 -102 39 131 -92 40 -61 67 -4 -56
7254 -56 127 -20 -128 52 -94 -18 -81 -20 -177 -41 73 40 -85 -33 -24 28 -89 80 19 -119 68 20 58 -29
7278 -29 -61 25 -65 -108 -73 26 66 19 124 -140 35 -31 20 33 -65 70 -19 42 -1 152 -40 20 -50 49 1 72 -34
7305 -34 -60 -68 22 -86 36 -85 -71 123 -36 137 -10 27 -32 8 57 6 -166 125 14 -81 122 -27 -136 107
7329 107 -96 14 -36 76 13 104 81 -49 15 -141 18 -33 147 18 18 -4 76 134 -48 -30 -155 -9 54 -122
7353 -122 117 -81 27 -16 87 -85 -26 19 -60 -21 -80 144 -59 -62 -30 -44 -163 -50 24 91 23 -63 48 64 29
7378 29 -138 -22 63 -19 -90 -106 -12 -74 1 -93 77 1 46 -13 -91 66 -1 47 -186 -99 64 45 -23 48 130 -33 -82
7405 -82 -10 -6 24 17 23 111 149 143 -84 -94 -26 67 -82 -23 5 -6 -22 85 -47 4 74 -36 -71 73 -139 -82 57 -121
7433 -121 58 29 11 -88 -31 -36 103 78 -76 -44 -19 50 -54 71 -3 -66 -30 46 48 -55 7 7 -73 16 34 23 95 -181
7461 -181 193 -149 -147 64 -28 138 -102 26 47 116 -111 41 92 80 -51 -49 -5 85 69 84 209 30 16 -42 -183
7486 -183 -26 15 -85 68 -17 9 -99 -75 4 -39 -74 2 -41 -166 59 50 34 53 18 -145 31 -218 -20 25 -2
7511 -2 21 -24 -173 -124 6 114 138 53 -85 30 45 114 -159 -68 -56 15 74 82 -68 76 6 59 -70 -19 -49 27 84
7538 84 -204 33 158 29 -44 -67 65 103 32 1 -164 34 -165 -180 57 -70 -119 66 29 -3 179 -24 -120 -13
7562 -13 -13 -6 -36 -51 18 53 -36 73 -99 102 -85 -90 -12 -69 83 16 -41 137 -110 27 -5 -31 -44 85 97 67 82
7589 82 -115 40 1 -63 -8 -84 -70 109 21 15 -104 26 100 90 37 88 -61 6 30 80 -132 114 -7 124 -34
7614 -34 70 64 48 51 -9 -195 -199 60 55 -33 169 -101 -36 113 -127 101 92 46 200 -75 -95 -36 138 -31 -201 123
7640 123 33 9 -48 -19 -160 -49 105 -71 37 56 80 92 -54 -105 112 87 -131 53 12 132 149 -39 -37 126
7664 126 57 84 153 -10 135 1 -70 109 83 91 -110 -26 -97 128 96 -8 -5 -103 70 97 12 -95 23 0 -154
7689 -154 23 20 34 18 -80 -66 31 -55 47 57 86 -26 -112 40 -24 -154 -165 6 60 32 -59 -90 -29 33 -85 202
7715 202 -10 46 -50 63 70 -136 18 30 38 -6 -35 83 -146 26 23 -31 34 101 -91 -95 -112 196 -5 -61 100 -77
7741 -77 3 -19 41 10 48 -108 45 -29 -75 -4 182 116 194 -25 -109 -78 -104 -48 -120 -15 78 -146 -6 -107 -81 -46
7767 -46 -56 -43 -148 209 96 -53 -68 28 -161 97 15 57 57 85 34 168 122 -133 41 -116 146 -32 209 61
7791 61 -82 -104 114 -127 137 141 -40 -29 -128 -53 60 4 125 -8 78 257 -73 42 88 -12 34 -112 -70 -65 -14
7816 -14 -9 -28 -82 -110 -64 93 111 107 74 53 -54 -34 -46 65 7 49 -65 -178 49 -231 -105 81 101 -24 -46 -8
7842 -8 -76 113 56 186 52 -9 -99 29 -106 -8 -104 -72 -168 114 -7 -79 -28 -59 49 11 -74 -97 57 -68 57
7867 57 158 -166 51 -16 -73 -41 18 -35 -3 -144 -27 -71 -50 -53 -25 34 -116 127 -83 59 63 63 127 5 -132 61
7893 61 30 -37 -15 40 21 2 113 -12 -230 28 93 36 11 -45 21 -54 -114 10 -68 -111 144 55 120 49 -44 46 197
7920 197 -96 -106 -63 93 90 -53 -34 -2 -95 -9 -94 82 148 -43 -45 -48 -50 -111 133 -31 -14 87 59 -13 10 14 47 16
7948 16 -27 117 -51 25 37 -74 -97 64 39 19 121 -26 -64 -191 -96 133 104 20 -11 -177 53 -16 26 109 -135
7973 -135 -67 -88 38 188 -54 -78 -40 -74 92 173 49 37 25 -28 279 -18 59 160 -59 -30 -89 -10 95 100 8
7998 8 -12 -43 -199 75 -27 85 -62 51 -7 7 -81 -148 15 -11 -25 21 27 22 -32 -65 -47 10 -17 27 -53 18 -87 41
8026 41 87 -28 75 -40 -124 -90 -108 20 102 -21 -45 -52 87 -91 1 155 61 94 191 -11 34 -21 -35 64 136 122
8052 122 -129 -39 87 35 -93 -96 -14 -128 56 20 81 -94 -86 63 -15 -127 153 -24 55 -37 -18 25 -76 -118 88
8077 88 -70 -51 4 232 -133 -110 30 103 62 -67 -53 104 81 177 -8 25 69 -81 -129 -57 40 63 -1 26 166 -78
8103 -78 -141 17 115 106 4 -38 -19 -72 79 127 -8 33 168 56 -13 71 -35 -143 209 12 -120 3 92 -9
8127 -9 -61 49 67 66 10 41 -72 27 57 -16 170 15 -83 33 127 -61 -17 -11 126 -101 -190 14 -43 6 1 21 -117
8154 -117 69 102 79 8 61 -39 -131 85 7 -254 -125 172 51 32 163 105 93 -120 46 171 -19 -14 -50 65
8178 65 -138 155 56 -74 -28 -64 20 -141 -63 2 -15 -16 -74
8191g4
##END NTUPLES=NMR FID
##END=
