##TITLE=1H_Pr 80-F
 CDCl3
 8 sc, 
 6.05.2022
##JCAMPDX= 6.0         $$ Bruker NMR JCAMP-DX V2.0
##DATA TYPE= NMR FID
##DATA CLASS= NTUPLES
##ORIGIN= UXNMR, Bruker Analytische Messtechnik GmbH
##OWNER= root
$$ XWIN-NMR		Version 3.5
$$ Fri May  6 14:34:27 2022 Russian Standard Time (UT+4h)  she@DPX200
##.OBSERVE FREQUENCY= 200.1313499996
##.OBSERVE NUCLEUS= ^1H
##.DELAY= (6, 6)
##.ACQUISITION MODE= SIMULTANEOUS
##.ACQUISITION SCHEME= undefined
##.AVERAGES= 8
##.DIGITISER RES= 18
##SPECTROMETER/DATA SYSTEM= spect
##.PULSE SEQUENCE= zg30
##.SOLVENT NAME= CDCl3
##.SHIFT REFERENCE= (INTERNAL, CDCl3, 0, 15.7039)
##AUDIT TRAIL= $$ (NUMBER, WHEN, WHO, WHERE, WHAT)
$$ ##TITLE= Audit trail, XWIN-NMR		Version 3.5
$$ ##JCAMPDX= 5.01
$$ ##ORIGIN= Bruker BioSpin GmbH
$$ ##OWNER= she
$$ F:/spectra/data/she/nmr/H-F/1/audita.txt
$$ ##AUDIT TRAIL=  $$ (NUMBER, WHEN, WHO, WHERE, WHAT)
(   1,<2022-05-06 14:33:28.31 +0400>,<she>,<DPX200>,
      <created by zg, POWCHK disabled, PULCHK disabled
       configuration hash MD5:
       00 E9 B6 7A A2 85 ED C7 34 08 36 98 17 FE 4E 26
       data hash MD5: 16K
       2F 7D A5 C4 F9 54 4F 3E 0F 65 57 1D 43 60 B0 C4>)
$$ ##END=
$$ 
$$ hash MD5
$$ 1F 57 7B 52 85 4D AF 97 45 87 43 85 23 51 03 FA
##$RELAX= 
##$RELAX= 
##$RELAX= 
##$RELAX= 
##$RELAX= 
##$RELAX= 
$$ Bruker specific parameters
$$ --------------------------
##$DU= <F:/spectra>
##$EXPNO= 1
##$NAME= <H-F>
##$PROCNO= 1
##$TYPE= <nmr>
##$USER= <she>
##$AMP= (0..31)
100 100 100 100 100 100 100 100 100 100 100 100 100 100 100 100 100 100 
100 100 100 100 100 100 100 100 100 100 100 100 100 100 
##$AQSEQ= 0
##$AQ_mod= 1
##$AUNM= <au_zg>
##$AUTOPOS= <>
##$BF1= 200.13
##$BF2= 200.13
##$BF3= 200.13
##$BF4= 200.13
##$BF5= 200.13
##$BF6= 200.13
##$BF7= 200.13
##$BF8= 200.13
##$BYTORDA= 1
##$CFDGTYP= 0
##$CFRGTYP= 5
##$CHEMSTR= <none>
##$CNST= (0..31)
1 1 145 1 1 1 1 1 1 1 1 1 1 1 1 1 1 1 1 1 1 1 1 1 1 1 1 1 1 1 1 1 
##$CPDPRG= <>
##$CPDPRG1= <>
##$CPDPRG2= <>
##$CPDPRG3= <>
##$CPDPRG4= <mlev>
##$CPDPRG5= <mlev>
##$CPDPRG6= <mlev>
##$CPDPRG7= <mlev>
##$CPDPRG8= <mlev>
##$CPDPRGB= <>
##$CPDPRGT= <>
##$D= (0..31)
0 1.2 0 0 0 0 0 0 0 0.06 0 0.03 0 0 0 0 0.0002 0 0 0 0 0 0 0 0 0 0 0 0 
0 0 0 
##$DATE= 1651833207
##$DBL= (0..7)
120 120 120 120 120 120 120 120 
##$DBP= (0..7)
150 150 150 150 150 150 150 150 
##$DBP07= 0
##$DBPNAM0= <>
##$DBPNAM1= <>
##$DBPNAM2= <>
##$DBPNAM3= <>
##$DBPNAM4= <>
##$DBPNAM5= <>
##$DBPNAM6= <>
##$DBPNAM7= <>
##$DBPOAL= (0..7)
0.5 0.5 0.5 0.5 0.5 0.5 0.5 0.5 
##$DBPOFFS= (0..7)
0 0 0 0 0 0 0 0 
##$DE= 6
##$DECBNUC= <off>
##$DECIM= 32
##$DECNUC= <off>
##$DECSTAT= 4
##$DIGMOD= 1
##$DIGTYP= 9
##$DL= (0..7)
0 120 120 120 120 120 120 120 
##$DP= (0..7)
150 150 150 150 150 150 150 150 
##$DP07= 0
##$DPNAME0= <>
##$DPNAME1= <>
##$DPNAME2= <>
##$DPNAME3= <>
##$DPNAME4= <>
##$DPNAME5= <>
##$DPNAME6= <>
##$DPNAME7= <>
##$DPOAL= (0..7)
0.5 0.5 0.5 0.5 0.5 0.5 0.5 0.5 
##$DPOFFS= (0..7)
0 0 0 0 0 0 0 0 
##$DQDMODE= 0
##$DR= 18
##$DS= 0
##$DSLIST= <SSSSSSSSSSSSSSS>
$$ [...]
##$SUBNAM2= <"">
##$SUBNAM3= <"">
##$SUBNAM4= <"">
##$SUBNAM5= <"">
##$SUBNAM6= <"">
##$SUBNAM7= <"">
##$SUBNAM8= <"">
##$SUBNAM9= <"">
##$SW= 18.0517283424761
##$SWIBOX= (0..15)
0 0 2 0 0 0 0 0 0 0 0 0 0 0 0 0 
##$SW_h= 3612.71676300578
##$TD= 16384
##$TD0= 1
##$TE= 0
##$TE2= 300
##$TE3= 300
##$TEG= 300
##$TL= (0..7)
0 120 120 120 120 120 120 120 
##$TP= (0..7)
150 150 150 150 150 150 150 150 
##$TP07= 0
##$TPNAME0= <>
##$TPNAME1= <>
##$TPNAME2= <>
##$TPNAME3= <>
##$TPNAME4= <>
##$TPNAME5= <>
##$TPNAME6= <>
##$TPNAME7= <>
##$TPOAL= (0..7)
0.5 0.5 0.5 0.5 0.5 0.5 0.5 0.5 
##$TPOFFS= (0..7)
0 0 0 0 0 0 0 0 
##$TUNHIN= 0
##$TUNHOUT= 0
##$TUNXOUT= 0
##$USERA1= <user>
##$USERA2= <user>
##$USERA3= <user>
##$USERA4= <user>
##$USERA5= <user>
##$V9= 5
##$VALIST= <valist>
##$VCLIST= <CCCCCCCCCCCCCCC>
##$VD= 0
##$VDLIST= <DDDDDDDDDDDDDDD>
##$VPLIST= <PPPPPPPPPPPPPPP>
##$VTLIST= <TTTTTTTTTTTTTTT>
##$WBST= 1024
##$WBSW= 4
##$XGAIN= (0..3)
0 0 0 0 
##$XL= 0
##$YL= 0
##$YMAX_a= 327379
##$YMIN_a= -184338
##$ZGOPTNS= <>
##$ZL1= 120
##$ZL2= 120
##$ZL3= 120
##$ZL4= 120
##$ABSF1= 10
##$ABSF2= 0
##$ABSG= 5
##$ABSL= 3
##$ALPHA= 0
##$AQORDER= 0
##$ASSFAC= 0
##$ASSFACI= 0
##$ASSFACX= 0
##$ASSWID= 0
##$AUNMP= <proc_1d>
##$AZFE= 0.1
##$AZFW= 0.1
##$BCFW= 1
##$BC_mod= 2
##$BYTORDP= 1
##$COROFFS= 0
##$CY= 11.3945322036743
##$DATMOD= 1
##$DC= 2
##$DFILT= <>
##$DTYPP= 0
##$F1P= 2.36226072786647
##$F2P= -0.459571619588291
##$FCOR= 0.5
##$FTSIZE= 0
##$FT_mod= 4
##$GAMMA= 1
##$GB= 0.15
##$INTBC= 1
##$INTSCL= 1
##$ISEN= 128
##$LB= 0.24
##$LEV0= 0
##$LPBIN= 0
##$MAXI= 10000
##$MC2= 0
##$MEAN= 0
##$ME_mod= 0
##$MI= 1.114404
##$NCOEF= 0
##$NC_proc= 0
##$NLEV= 6
##$NOISF1= 3.799351
##$NOISF2= 2.8
##$NSP= 1
##$NTH_PI= 0
##$NZP= 0
##$OFFSET= 15.70392
##$PC= 1
##$PHC0= -18030.35
##$PHC1= 7.600749
##$PH_mod= 1
##$PKNL= yes
##$PPARMOD= 0
##$PSCAL= 0
##$PSIGN= 0
##$REVERSE= no
##$SF= 200.130013532006
##$SI= 16384
##$SIGF1= 3
##$SIGF2= 2
##$SINO= 400
##$SIOLD= 16384
##$SREGLST= <1H.CDCl3>
##$SSB= 0
##$STSI= 0
##$STSR= 0
##$SW_p= 3612.71676300578
##$SYMM= 0
##$S_DEV= 0
##$TDeff= 0
##$TDoff= 0
##$TI= <>
##$TILT= no
##$TM1= 0
##$TM2= 0
##$TOPLEV= 0
##$USERP1= <user>
##$USERP2= <user>
##$USERP3= <user>
##$USERP4= <user>
##$USERP5= <user>
##$WDW= 1
##$XDIM= 8192
##$YMAX_p= 0
##$YMIN_p= 0
$$ End of Bruker specific parameters
$$ ---------------------------------
##NTUPLES= NMR FID
##VAR_NAME=  TIME,          FID/REAL,        FID/IMAG
##SYMBOL=    X,             R,               I
##VAR_TYPE=  INDEPENDENT,   DEPENDENT,       DEPENDENT
##VAR_FORM=  AFFN,          ASDF,            ASDF
##VAR_DIM=   8192,          8192,            8192
##UNITS=     SECONDS,       ARBITRARY UNITS, ARBITRARY UNITS
##FACTOR=    0.0002768,     1,               1
##FIRST=     0,             0,               0
##LAST=      2.2672688,     0,               0
##MIN=       0,             -184338,         0
##MAX=       2.2672688,     327379,          0
$$ Real data points
##PAGE= N=1
##DATA TABLE= (X++(R..R)), XYDATA
0@%%%%%%%%%%%Qj6J6j6K3l1L2m0M9n7P1q6J02j18J35j59J84k10K42k80L20l62
33a93M11m66N26n89O59p38Q24r18J023j135J255j389J537j696J871k064K273k504
51a313K759l042L355l702M095m543N054n643O335p159Q160r408J1018j3183J6264
66I047k1044K9556m9452J88930J70342q6637k2650j29467p4576j51380m3995K1062
78a60264k4074L4303Q5647L4947O2150k7556l968L1440o2276k1897L9816J4751
90C019N9511J2860L7453O5838o0439n7499k3994q6913n6335o1353p755P0428N204
103i9975N1481J06450K5974K3229j3930l0275r58q0038m1472L3484j4623K2722
115a7931K8410J7514M9054l8001l7552J2089n6087l3895o655M012O0646O718K5040
$$ y = [0, 0, 0, 0, 0, 0, 0, 0, 0, 0, 0, 0, 8, -8, 8, -8, 15, -16, 16, -24, 25, -32, 39, -47, 55, -63, 72, -87, 97, -113, 129, -151, 169, -193, 218, -248, 278, -311, 348, -390, 434, -484, 539, -596, 659, -730, 807, -889, 982, -1082, 1191, -1313, 1446, -1596, 1759, -1943, 2152, -2391, 2663, -2980, 3355, -3804, 4356, -5052, 5966, -7217, 9047, -11997, 17559, -31893, 157037, 327379, 240742, 218092, 88625, 14049, -137331, -181326, -160264, -184338, -150035, -64388, -29441, 32709, 5153, 1185, 32625, -29651, -51548, -11732, 3019, 62530, 75390, 112843, 178681, 118242, 60743, 36749, -50164, -106499, -167852, -175607, -105179, -99975, -48494, 57956, 83930, 107159, 93229, 62954, 61996, -18042, -59514, -26030, -40653, -17931, 10479, 27993, 77047, 39046, 1494, 13583, -42504, -76399, -83054, -79042, -18396, -11678, 13362]
128A3362Q0737j0731k0552j3952m5800j9846n9165k7644N2454J835K6557O4134
140D1389K6670L6574k0565l6855M422o5548n5180k813j6762K4955J2952J9953
152c0808P5104L741p977K3453k5146j6084l1890k9752L0333j7796j0069M5044
164H153L699O913l111j8338K0739l1668k9148L2462n639R507K0513M001L7824
177E5907j2464k8553J7830l0729k6651q725k0794K4652m735r151M9223M594l016
190G388J6320r320J5455j4436k3855L3265r746j3282J9144j0839R772j4525l1610
203b6269K0001k0899k5001J7713l003K0892J3629j418M5463L703j5929J9550j6835
216C1597r362j2843l2400J6370j2842k5390K4619k277L896J1010j0986K9404q99
$$ y = [13362, 94099, 83368, 62816, 48864, 3064, -16782, -75947, -103591, -51137, -49302, -22745, 41389, 68059, 104633, 84068, 47213, 51635, -13913, -69093, -71906, -88668, -63713, -50761, -30808, 44296, 48037, 40060, 63513, 38367, 22283, -9607, -39359, -9026, -26822, -36891, 8153, 11852, 18765, 15654, -2684, 18055, -13613, -42761, -10299, -15938, -6431, 14082, 18083, 55907, 43443, 14890, 32720, 1991, -24660, -33385, -54179, -29527, -34262, -43413, 5810, 10404, 7388, 23708, 14388, 29843, 15407, -8448, 24817, 15071, 1789, 20933, 10094, 19866, 5341, -26269, -6268, -27167, -52168, -34455, -37458, -16566, -2937, -4355, 41108, 44811, 28882, 48432, 31597, 22235, 9392, -23008, -6638, -19480, -44870, -20251, -22528, -18632, -7622, -18608, 10796, 9897]
229I897j9497K7584l596n705R197j5826J8801m370k5521K3235p924j3137P646
242G84j6194J3713k54k5272K4200j578j2978J5500q183J4403N767k0961K7075
255A6022L5j7463J4825j2324L618K514k4563K0647P23j9409J8810n851M031P919
269I534k0415J9411K162k2787J6869n457l366Q370j8485J6546N392k1947J8249
282D076j549n182J0080j6497J2938N467k3583J6618L19r279J1678j2508J0522
295C100R081k1818J6040K062j4030J0520j1895N346Q855k0777J6788O183j3449
308c994J3251r454J809O983k3977J1764N042j7388J4975k232K991J4059j8263
321d434J1395N957k2698R036o312m363J2520j3096J4966J5075j5166J4263k178
$$ y = [9897, -9600, 17984, 14388, 8683, 17880, 2054, 20855, 16485, -9036, 14199, 6275, -6862, 784, -15410, -1697, -1951, -27223, -3023, -4601, -17579, -2079, -10262, 4141, 9908, -11053, 16022, 16057, -1406, 13419, 1095, 4713, 7227, -17336, 3311, 4034, -15375, 3435, -2416, 1615, 9534, -10881, 8530, 10692, -12095, 4774, -683, -4049, 4321, -14164, 2382, 7774, -14173, 4076, 2527, -2655, 7425, -9072, 3866, 9333, -14250, 2368, 2687, -6592, 5086, -7422, 3100, 12181, -9637, 6403, 8465, -5565, 4955, -6940, -1594, 7261, -13516, 3272, 9455, -3994, 9257, -197, 1612, 8595, -15382, -3618, 1424, -15964, -989, -3221, -230, 13829, -4434, 6961, 12918, -9780, -744, -7056, -11419, 1101, -11995, 2971, 18046, 2880, 17143, 14965]
334A4965j0962L875k1921J087P043j7788J5567R995j732J8082r348L759N984k6740
348h134J329j995j4232J2052l412J0972K0721j1984J2795M518j9722J866j7054
361a2280p248R960j4729J5865J9577l534J8667j476o164L251k9673p037N57k0218
375c4482J2511P048P798K4025n287Q457P524k5824l261j0380j5823J1420o645
388b2919J4669K7063k608J6901M527j6339k941k7983j7020l80k0640J1954J8872
401a6844P546L0456O265N774J0488k5542j0520r054k4257L627l854O119K6163
414F367l366J1382J1247j9722l223j6459j7576P649j0615J3800K8945N445K6364
427D0238R942p093K926l0470k3187j0002l0376k30N656M238L0702R263J3063K1825
$$ y = [14965, 4003, 7878, -14043, -12956, -5913, -23701, -8134, 1861, 129, 18211, 8863, 12622, 18606, -8134, -6805, -8800, -23032, -10980, -14392, -3420, 17301, 5317, 18112, 22630, 2908, 4774, -12280, -19528, -9568, -24297, -8432, 11145, 7611, 26278, 24802, 18638, 21889, -7784, -14821, -14264, -34482, -21971, -14923, -7125, 16900, 11613, 20070, 27594, 1770, -1491, -11871, -27694, -16274, -22919, -8250, 18813, 16205, 33106, 37633, 21294, 18353, -9630, -26650, -27030, -47670, -35716, -16844, -9298, 21158, 27423, 33197, 43685, 18143, 7623, -1431, -25688, -22061, -25915, -19796, 6367, 3001, 14383, 25630, 5908, 2685, -13774, -31350, -23701, -34316, -20516, 8429, 13874, 40238, 50180, 43087, 46013, 15543, -7644, -17646, -48022, -48252, -42596, -38358, -7656, 1607, 14670, 36495]
441C6495j4535k515p194k0012M012q712K417K4173k969J0585Q836j8004m873k3683
455a5979k3544k59j7611R004K5809J2098L5657J9903Q066J7095j9465j9222j3500
468A8052l5334j1017j0818q411K1190K988J0642K3013n747L740l666j5019O312
481d075j0292J526K2591R74J6524J2733p520M471j9362k3356o605k6453n979O831
495c7992j674K5319J4035R765K4015n622k866j817k2058k094j0696j0443J6240
508e888j590O597J6830n584N401o213j6261L555j5747n766J2546l752J3719J1125
522H972j577J3385p701r038K163j6823l40K817n534J8561N005J799J6079p967
536A9801l348n321k0993k472j3667j2753J2905l158R043J8505K953J7846M519
$$ y = [36495, 21960, 19445, 12251, -7761, -3749, -12461, -10044, 14129, 11160, 21745, 30581, 12577, 7704, -15979, -39523, -39782, -57393, -48389, -22580, -10482, 25175, 45078, 53144, 70239, 50774, 31552, 18052, -17282, -28299, -39117, -47528, -26338, -23350, -12708, 10305, 4558, 8298, 4632, -10387, -4075, -14367, -12841, 9750, 10724, 27248, 39981, 32461, 36932, 17570, -5786, -12391, -38844, -44823, -37992, -39666, -14347, -312, 9453, 33468, 27846, 24980, 23163, 1105, -989, -11685, -22128, -5888, -7478, -881, 15949, 10365, 15766, 9553, -6708, -3153, -18900, -24666, -12120, -15872, -2153, 8972, 7395, 20780, 13079, 4041, 6204, -10619, -10959, -8142, -13676, 4885, 9890, 11689, 27768, 19801, 16453, 11132, -9861, -12333, -26000, -38753, -25848, -29006, -19963, -1458, 1495, 19341, 23860]
549B3860m462J1193j1491o036K479j4546L128l444j1961O797j0787n877N926j1007
563b6228P791N720k712J9870N057L706J5591m577M375r28j5928K678j4259j5231
577a5075K954j3860j409M176o001J4086M034J937J9820n11P173J1827p736P390
591B8805l218j3638K060j4754q937j073j5722N451R90o585J5478Q90K516J3415
605E678l435J0087N012p340J2479n043p454N714j3315l518l140j4884N736n205
619a8628m455J4582l114R264J2151m536J1873k00q299N666j1590k940K376j2496
633a0346Q047J821p507J0698m663k218M489j0894N131N85p551J3662p56J061J2289
648A3848o998M158M32j1967M592p096o904Q400p367N855Q298o864R976j245p242
$$ y = [23860, 19398, 30591, 19100, 13064, 15543, 997, 4125, 681, -11280, -4483, -15270, -21147, -15221, -26228, -18437, -12717, -15429, 4441, 9498, 13204, 28795, 24218, 28593, 27665, 11737, 14415, 156, -15075, -12121, -25981, -27390, -23214, -29215, -15129, -11095, -9158, 10662, 10151, 17324, 29151, 21415, 28805, 25587, 11949, 14009, -745, -9682, -10755, -26477, -21026, -20036, -26621, -11143, -10253, -7737, 5678, 2243, 12330, 17342, 10002, 22481, 17438, 9984, 15698, 2383, -1135, -4275, -19159, -13423, -18628, -23083, -8501, -11615, -2351, 9800, 5264, 17137, 16937, 8638, 14304, 2714, -226, 2150, -10346, -2299, -478, -7985, 2713, -1950, -4168, 321, -10573, -5442, -4857, -12408, 1254, 498, 1559, 13848, 6850, 11008, 11440, -527, 4065, -3031, -9935, -1535, -8902, -3047, 5251, -1613, 8363, 7118, -124]
663a24N767j1663p30K548j0652R976L185l222J3597l034J003N329j1945L783k447
678A371j0190Q516m427o52R654o746O145K340r272P166n635m604Q094p970M645
693a565O803o760R317j718m056O124j0956K54K205j1117O943j76m184J0843l853
708a896L288O842q673O727r08p521P187o642j028N337q243N329K054o923Q944
723C874m272j004P447q367M170K313q484O574l743l030O989q024L730M897p858
738d788P326j425m175P154p510K273M850p978Q006J78m340Q341p206M61L396j0013
754e450L867r81n441R274l867K449Q624p419M939O75r386M864p298l212O268p303
770i397O521N613m823Q785k356l393M783r926Q95K314p165Q534J598o1J0756o190
$$ y = [-124, 5643, -6020, -6750, -4202, -14854, -4878, -1693, -4915, 8682, 5648, 6651, 11980, 35, 3818, 1371, -8819, -303, -4730, -5382, 4272, -2474, 3671, 6011, -3261, 3905, -1730, -6334, 1760, -6210, -1565, 5238, -1522, 7795, 6077, 2021, 8145, -2811, -2557, -352, -11469, -4526, -4702, -8886, 1957, -1896, 1392, 8234, -439, 6288, 5380, -2141, 5046, -1596, -2624, 2713, -5530, -201, 1853, -5070, 3874, -398, -1402, 6045, -2322, 1848, 4161, -4323, 2251, -1492, -4522, 2467, -5557, -1827, 3070, -4788, 2538, 1113, -3062, 4092, -3418, -1145, 3705, -4273, 3733, 3911, -429, 7912, 706, 1167, 4563, -5450, -1583, -2564, -8005, 1269, -2598, -149, 8475, 1056, 5995, 6670, -2716, 2148, -5150, -8362, -2094, -9397, -2876, 2737, -2086, 6699, 4343, 950, 5733, -4193, -3298, -984, -8149, 385, 1983, 1922, 12678, 6488]
786F488J048J690j2827J511n036p778P692m508M962J1271l629Q775J735p080M465
801H779r826m905L939r481O146N156l135J1749j908j230N023j1813p96q48r433
816a2583P294p48J090J1974l525M816M350r949K210n955q098N444o670K991Q920
831A561m140R092J152n618N196r392m362L576r074N827M794j766J2278j136j08
846G880N738j0752j162k346j0252N292k774K27J1641k756O133M768p984L452o484
861F21q211M244q557K025P306l189J0310K599k765P302p795l496J870j0375L535
876d576O82l430J0639j729J362P341p895K443j848q643M838m817j586Q141m447
891c525N027M011n459N646m890m628M399p546J494M660m981Q303L14j722P958
$$ y = [6488, 7536, 9226, -3601, -2090, -7126, -14904, -7212, -11720, -6758, 4513, 884, 9659, 11394, 4314, 8779, -1047, -5952, -2013, -11494, -5348, -192, -3327, 8422, 6514, 5284, 10307, -1506, -2302, -3150, -12583, -5289, -6037, -4947, 7027, 3502, 8318, 12668, 2719, 4929, -1026, -9124, -3680, -10350, -7359, 1561, -2579, 6513, 7665, 2047, 7243, -2149, -6511, -2935, -12009, -6182, -1388, -3154, 9124, 7988, 7880, 13618, 2866, 1704, -642, -10894, -5602, -8376, -8149, 3492, 736, 6869, 11637, 3653, 7105, 621, -7590, -3346, -11903, -9878, -2572, -5761, 4549, 7148, 4383, 11685, 3890, 394, 2264, -8111, -4576, -3894, -7324, 3315, 1586, 2948, 10289, 2394, 4837, 2989, -5654, -816, -5633, -7219, 922, -3525, 1502, 5513, 54, 5700, 810, -3818, 581, -6965, -5471, -811, -5792, 2511, 2825, 1103, 9061]
906I061o581K57K386q262M100j659m438P654m925K6M690p465M457q97m820P657
922A241l193M84P585m640M745J585o245N476n968m411L943q536J608J473n825
937a0678P144j319o59Q092l712M461N557m666P502p96m100M549q330l009l50j0517
953a0831K372k806m463Q522j631K908Q740k856O846J310m085O742m874j997M703
968H600p533K315k97p756M049o126m676M493o671M149N952j997J1193K914P54
983I363Q092o152n25j165j1721J529n449o366O515m216K026O215m510O335l18
998c47m342P143m308J110P237l772O644K739m440M935p089n756M13j1363J23Q76
1014a0197m876R556K381K101R658l644K684R07r479L247m366n071O713l240L258
$$ y = [9061, 2480, 2737, 5123, -3139, 961, -698, -5136, 2518, -2407, -2381, 2309, -5156, -699, -1596, -6416, 1241, -1952, -1468, 6117, 1477, 6222, 7807, 1562, 7038, 1070, -3341, 602, -7934, -6326, -4853, -10678, -3534, -4853, -5512, 2580, -1132, 3329, 8886, 4220, 11722, 10926, 6826, 11375, 3045, 36, -314, -10831, -8459, -11265, -15728, -7206, -8837, -5929, 2811, -45, 6801, 8111, 4026, 10768, 5894, 3897, 8600, 1067, 3382, 3085, -4671, -622, -6748, -11424, -6931, -13602, -9453, -3501, -5498, 5695, 8609, 9363, 17455, 11303, 10778, 9613, -2108, -579, -6028, -12394, -5879, -10095, -8069, -1854, -6364, -29, -347, -4689, 2454, -1854, -744, 6493, 2721, 9365, 12104, 7664, 12599, 5510, -246, 167, -11196, -11073, -10197, -15073, -5517, -3136, -1035, 8623, 4979, 7663, 8570, -909, 2338, -2028, -7099, -386, -3626, -368]
1029c68N970m097N487j745o591L811p724k012M018n945N854L076k072Q310k973
1044B999k63L757q064K368M78n916P598r26K07O296n879J510j317r279K130m872
1060i173m262O481k740N414P138j813Q225k42l869M812p394j471K205o755L746
1075C02P38l017O259m170r04K167q419J387n51n009O537K46K674Q796k200N425
1091A0261J116o860L155o409n904K650o681J837L245k869P831l20j178O738n412
1106A200J022K463o814L601j207l165N487m389O76L781o332L983k50m598N945
1121A403l038M79M846m694M223J26n137M312l824k423L876n141L490K249l763
1136c016O430j943j668M860n860J434K099n606N151j468j344N580m797J755K716
$$ y = [-368, 5602, 1505, 6992, 5247, -1344, 2467, -5257, -7269, -3251, -9196, -3342, -266, -2338, 5972, 2999, 2736, 6493, -1571, 797, 1275, -4641, 2957, 2031, 2238, 8534, 2655, 4165, 2848, -6431, -4301, -9173, -13435, -6954, -9694, -4280, 2858, 1045, 9270, 9028, 5159, 9971, 2577, 1106, 3311, -3444, 302, 1040, -1977, 4282, 112, -792, 1375, -7044, -5657, -6208, -11217, -4680, -4434, -1760, 7036, 4836, 10261, 11377, 4517, 7672, 1263, -4641, -1991, -8672, -6835, -3590, -6459, 1372, 1052, -126, 6612, 1200, 2222, 4685, -2129, 1472, 265, -2900, 2587, -1802, -1126, 2655, -3677, 306, 56, -4542, 1403, -1635, -1156, 3690, -1004, 3219, 3345, -1792, 2520, -1304, -3727, 149, -4992, -1502, 747, -3016, 3414, 1471, -197, 4663, -1197, 237, 2336, -3270, 1881, 413, -931, 4649, -148, 1607, 4323]
1151D323o470L151j928m813M150m613R52M379m474O042J746k810O530l024p32
1166B409L881o294K243m35m928M723l668q01N496n500L197K054m594M752l403
1181h68k627L987n860J755K857m474O335N46j095O222l803J062K297o861L053
1196B526k961m755M741m300NM784m164M905R48k953N856l749j158M509n874K409
1212G69P36m492M913k878j061N237n518K492K120n119M751j522k633M864n176
1227b517P66K200n330M580q10k630O495k950J178M318m587L867q96m570M633m802
1243a055j262M131n450L248J512l753M968l594j571L277n741J792J211l594N785
1258i6k68Q6O132k639K667K268n106K922l172m464K785n703p5K156m597M420K45
$$ y = [4323, -2147, 1004, -924, -5737, -1587, -6200, -5248, -869, -5343, 699, 2445, -365, 6165, 3141, 2409, 6290, -4, 2239, 1804, -3124, 1599, -2069, -2870, 2626, -2874, 323, 2377, -2217, 2535, -868, -3495, 492, -5368, -3613, -756, -5230, 1105, 1651, 556, 6778, 2975, 4037, 6334, -527, 2526, -435, -5190, -449, -4749, -4744, 40, -4124, 781, 1729, -1224, 4632, 883, -275, 4234, -1640, 769, 1505, -2987, 1926, -952, -2013, 3224, -2294, 198, 2318, -2801, 1950, 428, -2205, 2659, -2517, -1751, 449, -4881, -301, -1111, -3741, 2754, -196, 982, 5300, 713, 4580, 3684, -886, 3747, -1055, -2317, 1814, -3636, -388, 1124, -2629, 2339, -1255, -2826, 451, -5290, -3498, -2287, -5881, -96, -364, -278, 5854, 3215, 5882, 8150, 3044, 5966, 2794, -1670, 1115, -4588, -4663, -2507, -7104, -2684, -2439]
1275b439j820N980k702J381L862m382L535P8l760M324l976j048L385n268K759
1290i1M42l612M898k462r80L714m734J720J631m523M558j379o57M878k934K521
1306B990K081m187L355k610l550L096m930M76K890m170M368P2j914M951l274M23
1322F7K029m529K850m15l109N112k772N15M158m212K679O41m193M149l017j227
1338a274L749m673K170R51m084L387k131k160M206m020K126K536k760M838n26
1353B335j935M104m345j15J474m789L259l39k106N225k319P02L293n122K316j398
1369B40m493L357l172j43M709l158M120K002k547M162k966k186K261n224R72J253
1385h13l707M967o08q20M805m089J173J300m993K634j196j873M511k271J409L839
$$ y = [-2439, -4259, 1721, -981, 400, 4262, -120, 3415, 3493, -267, 4057, 81, -967, 2418, -2850, -91, 351, -3261, 1637, -825, -1805, 1909, -2825, -1105, 526, -3997, 561, -818, -1475, 3403, 469, 2990, 5071, 884, 4239, 1629, -1921, 1175, -3755, -3279, -389, -4559, -191, -119, -2033, 2918, -356, 67, 2096, -2433, 417, 2, -3107, 2005, -767, -252, 3906, -306, 2373, 3014, -1179, 2970, -47, -1274, 2475, -2198, -28, 923, -3161, 226, -1905, -4065, 141, -3879, -1753, 783, -1977, 2861, 2335, 400, 4504, 159, 44, 1518, -3271, -12, -351, -2457, 2768, 449, 1151, 4444, -678, 1638, 240, -4253, -896, -4068, -4211, 498, -2660, 1460, 3462, 915, 5077, 2111, -75, 2186, -3038, -2066, -813, -4520, 447, -161, -981, 3824, -265, 908, 2208, -2785, -151, -1347, -3220, 1291, -980, 429, 4268]
1401D268m066L273j101l543L405m146o60L261l923L291J238l255M207l003j482
1416b236L122m623J841J533l006N274p52QM478l861R90Q82n188J901j889k445
1432c971L987k962J760L209l551L697o97l216L413l622j83K831l367L695R12k451
1448e16M352k645j071K236n031R85M79l174M083j011L89M478l214K403J386m424
1464b95K852k421j894K936l239J439J911l659L812j251k535L294l756L56K343
1479a07l129L508N13j361M501k331p3K211m359J645p93l342L391k103J71L399
1495A741l214K554J178l470K807j846j522K934l352J800J565l052L851r90j781
1510g97L115l367N65J344l378L078q64j552M054l123O42K381l807K256k59j785
$$ y = [4268, 202, 3475, 2374, -1169, 2236, -1910, -2570, 691, -3232, 59, 1297, -1958, 2249, -754, -2236, 886, -3737, -1896, -363, -3369, 1905, 1153, 1161, 5639, 1778, 2768, 3650, -1538, 363, -1526, -3971, 16, -2946, -1186, 2023, -1528, 2169, 1472, -1744, 1669, -1953, -2136, 695, -2672, 1023, 1935, -516, 3836, 1191, 120, 2356, -2675, -1690, -1211, -4385, -302, -1313, -924, 3554, 340, 2743, 4129, -295, 2557, 136, -1758, 1178, -2061, -622, 1289, -2370, 1442, 191, -2344, 950, -2806, -2450, -107, -3236, 272, 785, -576, 3925, 1594, 1521, 3732, -627, 1018, 225, -3117, 274, -1829, -1658, 1741, -1473, 1081, 2259, -1211, 1596, -250, -1772, 1162, -2190, -390, 1175, -1877, 1974, 984, -797, 2318, -1049, -484, 860, -2518, 560, -304, -1856, 2198, -925, -283, 2098, -1709, 547, 288, -1497]
1526a497L555k864P22L084l528K248O09l329K876k525j299K454l890K325R95k645
1542b709M014j115j371L138l408J165R80l289L804j163j247M395l115J100K041
1557C220l595K338j246k582L219l562M87K542l731K982P20k196L635k543L0K150
1573A868m220K521Q9k742L465j388p29K867l100K280P23k939L549j843j404L561
1589B558l876J091J693l825K982j030j443L389k955P61K542l472K682K08k360
1604a055L207k834K19J714m061K683K41k540L833j497n99L041l480J812N5k855
1620b116L693k273r65L775l071J662J568k734L231j830j085K454l891P36J271
1635D25l733K382m92j099L579k007O80J733k990K868l40k646L465k300k33K444
$$ y = [-1497, 2058, -806, -84, 3000, -528, 1720, 2329, -1000, 1876, -649, -1948, 506, -3384, -1059, -64, -2709, 1305, 190, -1181, 1957, -1451, -286, 694, -2595, 1209, 46, -1201, 3194, 79, 1179, 3220, -375, 1963, 717, -1865, 1354, -2208, -1721, 821, -2910, 72, 792, -1404, 2231, -312, -282, 1868, -2352, 169, 258, -2484, 981, -407, -1136, 1731, -1369, 911, 1634, -1305, 2244, 401, -1003, 2558, -1318, -227, 1466, -2359, 623, -407, -1850, 1539, -1416, -655, 1887, -1585, 1097, 1305, -1055, 2152, -682, -463, 1251, -2810, -127, 114, -2426, 1407, -90, -689, 2352, -1128, 684, 739, -2116, 1577, -696, -1661, 2114, -957, 705, 2273, -461, 2770, 940, -145, 2309, -1582, -846, 425, -3308, -926, -1418, -2517, 1062, -945, -265, 1468, -1522, 1346, 1006, -1640, 1825, -475, -708, 1736]
1651A736l004K497J38k188L412k553j88K163l314J308J48k457K713j465l82K625
1667A189l025J541J421k984L079r98j375L123k838J319J157l418K875o10j989
1682a533K797j940N62J750k859K346o13j878L036k709j41K358k868J925O08k129
1698a288L525k025l16K499l548J640N12l487K610j722q21K873k840K016J602k269
1714a039L274r90j480K863k669O54J095k908K643j094j772L033k586J24J920l260
1730b192K304k47j964L112k263J75K218k366K015M02k416L172k068n93K569l041
1746a183J618N59k430K943j572q60K730k675J285Q22k937K964p64j783K749k630
1762a164M52J843l322K387l58j779K999k170L99K580l217K396P6k273K898k368
$$ y = [1736, -1268, 1229, 1367, -821, 2591, 38, -150, 2013, -1301, 7, 155, -2302, 411, -1054, -1436, 1189, -1836, -295, 1126, -1858, 1221, 223, -1152, 1971, -867, 452, 1609, -1809, 1066, 456, -1533, 1264, -676, -114, 1636, -1223, 1123, 510, -1368, 1668, -1041, -1182, 1176, -1692, 233, 841, -1288, 2237, 212, -104, 2395, -1153, 487, 999, -2488, 122, -1600, -2421, 452, -2388, -372, 1230, -1039, 2235, 1245, -235, 2628, -41, 613, 1708, -1200, 1443, 349, -1423, 1610, -976, -852, 1068, -2192, 112, -135, -2099, 1013, -1250, -1075, 1143, -1223, 792, 1194, -1222, 1950, -118, -711, 1858, -1183, 435, 994, -1436, 1507, -65, -925, 1805, -870, 415, 1237, -1700, 1264, 500, -1283, 1466, -1164, -712, 1131, -2191, 196, -162, -1941, 1058, -1112, -713, 1867, -1350, 1046, 1122, -1151, 1747, -621]
1778f21j95K225l076J685R01k650L356j627m65K374k836J284J054k917K663j041
1794A14j411L063l149J007R84k836K730o27j525K826k384M17K021k827K751j64
1810I90j906K938k067J84J647k966J967K76k347K525j893m11K508k900J415M52
1826D12k134K936j436p66K761k470J073J174k953K525j266j281K384k768R44J536
1842F71k935K920m54j345K984k037P72J722k752K428n41k348K748k685k24J908
1858H32l169J470K60k270L497j678l15K717k307J558J158k543K711j067j320K224
1874A758k755R83Q63k518K053r44j250K912k598Q87J906k368K680m64j427K774
1890B492k321j99J472l104J476m83k280K801j845R6K307j908K095M89j793L019
$$ y = [-621, -816, 1409, -1667, 18, 919, -1731, 1625, -2, -467, 1907, -929, 355, 1409, -1508, 1155, 114, -1297, 1766, -1383, -376, 608, -2228, 502, -125, -1650, 1176, -1208, -791, 1230, -1597, 1154, 990, -916, 2022, -45, 139, 1786, -1180, 787, 1063, -1284, 1241, -652, -1063, 1445, -1455, -40, 412, -1722, 1214, -222, -988, 1773, -697, 376, 1550, -1403, 1122, -144, -1425, 959, -1809, -865, 671, -2264, 656, 202, -1143, 1841, -196, 576, 2298, -454, 1974, 1433, -915, 1833, -852, -1076, 832, -2337, -867, -607, -2877, 620, -1058, -1373, 1344, -963, 595, 1753, -790, 1921, 854, -466, 1758, -997, -14, 849, -1669, 384, -560, -1810, 1102, -1496, -609, 1297, -1071, 1609, 1145, -282, 2492, 171, -28, 1444, -1660, -184, -667, -2947, -146, -1991, -1895, 412, -1496, 599, 1088, -705, 2314]
1906B314j589l53K200k843J216N49k731K146j551r87K645l106J434J252k351L000
1922A245o80j025K875k376L72J157k779J571o93j872K928k432L36K102k539K362
1938E52K25j866L055j999n54K234k701J894L50k160K685j352p36K102k811Q98
1954a84P10k755K708r82j119L134k633J008J146k518K100r78j347K668k364R65
1970d41J480k178L004o05j270L011k715o3J645l064J454l07k069K554j925l41
1986a830K653k755J951M15j929K787j010l84K557k401Q97M68k639K037j752j390
2002b325K745k684O67J878k198K661l7j010K794j962M01J745l339J433q6j909
2018a226K404k198K84J581k991K259l33k420K818j122n98K535k013J648P66k062
$$ y = [2314, 725, 372, 2572, -271, 945, 1494, -1237, 909, -642, -1629, 1016, -2090, -656, 596, -1755, 1245, 565, -460, 2415, 39, 411, 1568, -1211, 360, -333, -2205, 723, -1709, -1373, 729, -1810, 552, 777, -1089, 1966, -33, -587, 1647, -1054, 840, 1190, -970, 1715, 363, -373, 1729, -1082, -184, 526, -2229, 479, -503, -1622, 1512, -1121, -113, 1033, -1485, 615, -363, -1710, 958, -1406, -441, 1039, -1139, 1865, 1260, -10, 3001, 286, 223, 1868, -1196, 258, -49, -2118, 436, -1489, -1830, 823, -1932, 19, 434, -1495, 1292, 282, -102, 2455, 54, 951, 1419, -1220, 817, -935, -2325, 420, -2264, -1597, 281, -1917, 744, 707, -303, 2491, 529, 930, 2675, -664, 769, 683, -1226, 1178, -1020, -736, 845, -2146, 113, -220, -2640, 178, -944, -1542, 993, -1020, 628, 1394, -668]
2034f68K653j538q35K122k327O40R98k418K072q26j357L119k458Q31J592k749
2050a149J875l09j823K451k190M33J966k801K107M6j843K289j755l31J871k282
2066a445J963L04k222K714j394m17K313k361J400Q98k446K179j436q96K146l024
2082a724J114J044k338K269p79j055K314j879J076J508k718K384m79j340K279
2097A676j985j78J174k589J894m27k197L347j939K77K475j677J878O45j903K579
2113C050k124q11J571l356P08K83k691K588j224k42K349k031J704J715j825K702
2129B366l95j368K520k573L92P25l143J742j423k097K529k061K13K688j799K684
2145A000P04r13K993j896j92J612l481P86l23k555J761j931p20K065k182J559
$$ y = [-668, 1985, 447, -388, 1734, -593, 47, 1045, -1373, 699, -127, -1484, 1635, -823, 8, 1600, -1149, 726, 417, -1406, 1045, -1145, -712, 1254, -1547, 560, 606, -1237, 1052, -703, -1034, 837, -1445, 518, 822, -1400, 1314, -80, -497, 1816, -545, 855, 1753, -693, 1486, 50, -846, 1300, -1724, -610, 434, -1904, 365, -414, -1469, 845, -1034, 42, 1550, -1168, 1216, 737, -603, 1676, -309, -487, 687, -1902, -8, -435, -2632, 715, -1224, -947, 1528, -149, 1729, 2374, 471, 3050, 926, 115, 1686, -1670, -962, -679, -3370, -782, -2006, -2248, 101, -1930, -226, 1489, -336, 2366, 1971, 603, 3123, 550, 942, 1667, -1476, 266, -1157, -3254, -725, -2786, -2573, 115, -1684, 1000, 1704, 791, 3784, 1888, 1696, 3308, -173, 613, 290, -2265, -504, -2435, -3155, -1090, -3272, -1713]
2161a713J466k006L281k89l87K940j454P68R73k598J488j265k472K096l429m9
2177b650J360k378K049N54q24L410j335K71K180k562J754L5k014J766k264m03
2193a051J497k605J387J111k085K453j106k92K586k118J181O15j753K058j630
2208B48j060K080k397M33J025j789K117q3j233K607k068o4J557l011J955n35j043
2225a261J899k048N86J477k963K923p0j517K652j666M68K003k592R28M95j119
2241A95J262j186j066J682k560Q54M52k273K184n01q91K862j850J502R91r36J104
2258A825M4j936J249j832j058K565l104J989J21p48K722j682M49J955j674P01
2274A586k64j816L035k636k260K171k490R78J510j923J905j374L33K455j714J196
$$ y = [-1713, -247, -2253, 1028, 739, 352, 3292, 1838, 2606, 3579, 981, 2469, 1204, -1268, 828, -2601, -2650, -1290, -3668, -1619, -1065, -1889, 1521, 186, 457, 2637, 75, 1829, 1864, -150, 1616, -648, -1051, 446, -2159, -772, 339, -1746, 707, -399, -691, 1895, -223, 958, 1573, -180, 1878, 248, -812, 1268, -1129, -696, 329, -1460, 657, 574, -659, 1948, -120, -184, 1373, -1638, 317, -218, -1261, 638, -1410, -824, 653, -2310, 613, 543, -974, 1678, 12, 480, 2483, -109, 819, 1314, 195, 1457, 271, -795, 887, -1673, -819, -367, -2640, -456, -957, -1848, 1014, -836, 666, 1657, 721, 1825, 1869, -67, 1182, -650, -1708, 857, -2247, -258, -137, -885, 1837, 155, 604, 2559, 885, 1586, 1322, -494, 2541, -95, -2355, -184, -2674, -1696, -186, -2109, -204, -1578, -1245, 1210, -504, 692]
2290F92J716k620J413n54r37J569k120N35J105k109J654m19j416K275j479j095
2306a790K299j714K653J25j767L033r40p17J403l338J657m8k512J843k663O6J466
2323i44j761K021Q97k450M146o18n52K802j757l20M75k810J921l56l133L365k910
2340a984P23J911k879J714L48j140K013j781J23J890k367J588J86j053K198j344
2356A46l54J509j579J139M29k585J733r01p99K692l141K628O11k485L056j024
2372A075j330K190k192J54O79l306K214k97j826K565r23oL080k368K597L0j565
2389G71J589j367p11j34k227J498O4k055L224j748K04K498k599J930J202k294
2405a55K212j606l73J895j343M41O49k242P99r25j447K106j735o6J449j838K260
$$ y = [692, 2408, -212, 1201, 647, -290, 1279, -841, -306, 799, -1310, 344, -75, -1491, 784, -695, -1790, 509, -1205, 1448, 1573, -194, 2839, 1899, 1182, 2585, -753, 904, 856, -1656, 187, -2476, -2410, -944, -2705, -684, 213, -2237, 1909, 1291, 739, 3541, 1784, 1464, 1939, -871, 1050, 694, -2439, 926, -1984, -1261, 650, -2229, -515, -167, -1307, 706, -1075, -952, 938, -1429, 159, 345, -708, 1490, 146, -208, 1301, -278, 861, 1290, -1295, 438, -463, -1262, 1430, -1711, 917, 1528, -957, 2099, 1075, -255, 1935, -257, -103, 576, -2730, -516, -813, -2639, -74, -997, -1003, 2077, -291, 2306, 2336, 771, 2360, 993, 282, 148, -2079, -581, -517, -2572, 652, -1096, -892, 1606, -993, 937, 2139, -155, 2057, 451, 78, 1973, 630, 1071, 1720, -522, 277, -648, -2095, 11, -1724, -1790, -341, -2179, 81]
2422H1j81j287L111j306O50K077k292J190l45k061J328j021m01Q07k684J100n14
2439a748l69J840m97j005K222j063J632mj751J781n00q30J154j850P48J269j508
2456d79J779p20j365K040k080N25O39k227J585Qj157K179r21r2J812j441J278
2473A363j66j893J775j472l64J520k733J593L00q81J699j674M2J634j048K12R57
2490H64j533J825j25j426J901k166L79Q48j947J941q58r29K451j489N61J518k592
2507g77J893j015j370K026j995K39J238k550K025j9j085J973p09k33K265k087
2523a81J252K95j313J964j130p95J222k178K91J19k338K024r45l43K162j383J362
2540H5J739j795K108o51m93J206k150n24Q66k268J225m51j544K473j705R73J683
$$ y = [81, -100, -1387, 1724, 418, 1068, 3145, 853, 2043, 1698, -363, 965, -56, -457, 350, -2334, -1234, -1748, -2117, -277, -774, -1779, 443, -620, 1012, 1008, -743, 1038, 538, -292, 862, -988, -240, 1029, -479, 1300, 580, -785, 1255, -825, -300, 339, -1888, -303, -295, -1452, 727, -194, -286, 1526, 85, 1363, 1197, -696, 1079, -393, -757, 763, -1970, -377, -77, -958, 741, -933, -891, 743, -305, -93, 864, -669, 1156, 1031, -395, 1506, -660, -281, 567, -1380, 561, -297, -1226, 1225, -264, 297, 1815, -777, 1116, 101, -1269, 757, -1238, -999, 239, -2311, -286, -305, -1390, 583, -126, -359, 1906, -181, 1071, 1366, 53, 2017, 887, 92, 1314, -864, -573, -454, -2792, -768, -1713, -2056, 106, -1277, 85, 1824, 29, 2137, 1486, 993, 2199, 49, -475, 391, -1877, -652, -1103, -2647, -174, -1879, -906, 777]
2557G77j539J430O41j163K434j561j82J707k759O64J57k575J430j204j21J318
2573e46j752J445J316j450K163j68q92K203k053K26O50j853J219p38j345K485
2589I10j352K61J054j662J363Q4j423K182j774j51J373j909Q30L80j945J616j118
2606a281J5J799j376J148Q12o33J763n24j121J223k346r2K00k110J255k89j271
2623b828K610o63O67J959j078J362K41n59J146j651l76P92k371L51o71k222J012
2640b279j259k01J691r10K172J533j88K783K81J01J028k219K95q77l015J17j894
2657b841j300J599j276Q94J379o33K577M28k86K645j288P75J206j493M45q55k179
2674b03J42k645o76J55j683J333J076MK877M64J020K176j452J091l69j995N82
$$ y = [777, -762, 668, 1309, 146, 2580, 1019, 837, 2544, -215, 449, 606, -1969, -539, -1743, -1864, -546, -2298, -853, 463, -987, 1176, 1008, 116, 2319, 266, 492, 1142, -711, 508, -230, -1575, 910, -442, -181, 873, -789, 574, 658, -765, 1417, -357, -508, 865, -1044, -214, 166, -1779, -163, -1281, -1266, 533, -843, 305, 1117, 484, 2247, 1723, 602, 1825, -521, -613, -413, -2523, -1268, -1557, -2828, -218, -881, -214, 1745, 667, 2029, 2270, 1711, 2857, 1206, 830, 1622, -749, -398, -1069, -3291, -2279, -3538, -3739, -2048, -2958, -786, 747, 559, 3342, 3623, 3724, 4752, 2533, 2828, 1951, -1064, -947, -2841, -4141, -2542, -3818, -2924, -1545, -2178, 399, 827, 541, 3186, 1898, 2673, 3879, 2386, 2831, 1976, -203, -61, -2706, -3382, -3227, -4910, -3577, -2501, -2497, 380, 844, 1864, 4040, 2588, 3679, 3310, 1315, 1897]
2691A897j854j337J246k214R04M69j583J376m86q88K161j344J020K058r77K105
2707B553P74j173J028k352j213K39k783P95m34q96K410j9J175J929j066J525m78
2724B014j684J083j374r45J305j400J329L75j116J545q59j110J029k391Q65P57
2740e77j224K049J96J6J582j572Q9M78k491J287o58n72K062n41N89J662j498J037
2758A914n56k077N56j798o08J108j334K010J218n27K108o97n57Q90k195N15p0
2775a00j596J998j03oJ781j600P0P0k152Q03p50j233K034o62J455J929l28J741
2793C351n17j448N97k065j342P67k079J563K74n96K225r35M59R45k089O37L40
2810H7j490J703l47J22J990j355J261q0k058P64j322j157J458j410R51J150j006
$$ y = [1897, 43, -1294, -48, -2262, -1358, -889, -2472, -1096, -1582, -2470, -309, -1653, -633, 1425, 448, 2553, 3327, 2154, 3182, 830, -383, -144, -2927, -2132, -2566, -3462, -1052, -1071, 104, 2033, 967, 2492, 2014, 330, 1413, 39, -906, 399, -1001, 328, 703, -413, 1132, 273, -837, 192, -2199, -1334, -577, -1801, 248, 444, 460, 2042, 470, 559, 1037, -1454, -167, -825, -1397, 665, 124, 713, 2375, 877, 1914, 1358, -719, -163, -1961, -2569, -1461, -2795, -785, 433, -94, 2014, 1317, 760, 1650, -545, -30, -100, -1696, 302, 199, 193, 1974, 374, 444, 514, -1638, -835, -1585, -2818, -784, -1446, 9, 1938, 1610, 3351, 2834, 1386, 1983, -82, -1424, -657, -2736, -1173, -899, -1495, 730, -205, 254, 1199, -890, -253, 87, -1403, 300, -47, 75, 2065, 710, 1971, 1891, -167, 597, -725, -1882, -424, -1834, -883, 267, -739]
2827g39J929j06o12O83j661M3K24j629J246L07k67J706q55O53M26k226J130n36
2845b84j232J633q70L23J506q10J592L49j460M80j288p77O56k077L59J343l32
2862h89J258J34l26J259j476P30j92j710J206j78o4N59p28k08J719j008J08j74
2880B0j713K449k824J143K320k476J800O44q09J523j602l43N88j832Q1M26j435
2897b040K266p09j88J447j695J274J14j436J160j44n36J696j194Q02J099j752
2913A64J337p68j308Q63j147r6J116j531J278K40m62J631q61n82R43j716J090
2930A91l93j264J529n17L34Q66o26P25P4k048J441l66j305J890j570R82J011j399
2948d45J444o34n35J515j944N96P78j919J593p17n58J151n83l25R79j920J077
$$ y = [-739, 1190, 1084, 472, 1155, -506, -463, -239, -1868, -622, -315, -582, 1124, 269, 922, 1348, -878, 252, -284, -1516, 117, -753, -430, 1076, 266, 1858, 2207, 747, 1227, -61, -838, -182, -2259, -1900, -557, -889, 369, 503, 177, 1436, -40, 690, 498, -1212, -6, -184, -248, 311, -417, -625, 1094, 86, 194, 20, -1693, 756, -2068, -925, 1395, -1081, 719, 1363, 554, 2077, 475, 132, 720, -1112, -1031, -605, -2040, 226, -483, -671, 776, -919, 355, 469, -967, 193, 49, -487, 1209, 15, 817, 1916, 164, 1501, 733, -575, 288, -859, -955, 161, -1370, -92, 148, -314, 1317, 456, -126, 817, -899, 191, -202, -1466, 63, -454, -120, 746, 120, 845, 919, -1129, 312, -54, -1359, 531, -1039, -57, 954, -445, 999, 365, -170, 1345, -599, -3, 775, -1144, 449, -268, -826, 325, -258, -583, 396, -1524, -447]
2965d47N50j299J267l13L40J304j477Q55N11j368M22n70o10R33j527J071J011
2982F53j292J663q32j29J296j493K74P30j567J178l87p68J345j307J12N54j627
2999a597R89L34j333K029p34L72J781j139J574n45j275O77j532j524J514k412
3015b821J048P85p64J604l81L00J586p77N64K23j633J616q20n79J601j328J08
3032C32p89k204J136q37j017J508l8J084K361j90K513j03q56J058k723j102L82
3049E15k422p65k34m46K276l75j70J367m06m13J266m13J071j74Q94K221j510j6
3067B266K81l334J541l001j828J139j740J086K229J50K416N15k65K649j688j96
3083B220K48l081N25p56r56K222j613n3K264k694N14m16q53J233l06J020J846
$$ y = [-447, 103, -1196, 71, -242, 98, 1402, -75, 780, 1291, -77, 345, -225, -835, 98, -1429, -358, 653, -639, 1024, 192, 63, 1359, -134, 140, 870, -697, 481, 94, -674, 671, -636, -524, 30, -1597, -608, -274, -1607, 422, -312, 60, 1841, 702, 2276, 1731, 456, 1133, -399, -1923, -409, -2821, -1773, -988, -1752, -148, -529, -229, 1357, 580, 1144, 1367, -266, 1350, 530, -49, 1552, 224, 332, -457, -2661, -1525, -2362, -3379, -1871, -1909, -825, 1536, 1346, 3859, 3756, 2900, 3958, 1235, 133, 515, -1907, -2672, -2906, -3352, -1076, -1451, -1621, -254, -660, -1073, 193, -220, 851, 677, 1571, 3792, 2282, 2266, 2547, -787, 754, -2247, -4075, -2936, -4676, -3590, -1361, -1211, 1205, 1720, 1455, 4104, 2416, 2220, 2468, -613, -88, -844, -1800, 422, -1191, -1244, 1020, -1674, -1160, -1576, -2429, -1196, -1502, -482, 1364]
3100A364m95J553J045r86L8j767j622L28k065k39O61O87K879l04M51J329j962
3117H95p71k23k117L58p84Q18K722j597J431J309j224J256n40j520M15j839k92
3134a703J512j250J979N38j042J283j833j129O67k382J067J159L7L191Q6K2K906
3151E108j975p02r00l703J07j460l28M86P5J306K256n32J898P12j127O62n81k51
3169A051P85j068J064J22p93N20j289j907m22j936K56k94p3K536Q52J280L959
3186D643p96K79P61k903j33k031j512J71j387M53P13m59J915k47k03P40o87O94
3204A1R48r99K035M17l85K512k394k52l39l201k48o45j632J920p67P89K639o81
3222b72J275J832j968N01o46j055R51j123R69M50p94P97l93q40J889k223j183
$$ y = [1364, 869, 2422, 3467, 2481, 2519, 752, -870, -542, -2607, -2846, -2185, -1498, 1381, 1077, 1528, 2857, 895, 124, -99, -2216, -1858, -2642, -1824, 898, -699, 732, 2041, 817, 2073, 1533, 13, 428, -1411, -1703, -191, -1441, 538, 1076, 34, 1317, -516, -1645, -978, -3360, -2293, -1134, -1097, 2094, 2180, 2202, 5108, 3133, 2431, 1531, -2172, -2065, -3525, -3853, -3367, -3292, -1986, 270, -262, 1636, 2348, 1221, 1883, 1302, 1051, 1836, 768, 1832, 1954, 1161, 1681, 392, -1515, -1937, -3873, -3617, -3911, -3984, -1448, -596, 684, 4643, 3847, 4126, 4887, 1984, 1851, -180, -1692, -1521, -2908, -2455, -1742, -2201, -286, -533, -736, 4, -683, 11, 959, -40, 1995, 2412, 2027, 4539, 2145, 1893, 1554, -1647, -1895, -2540, -4172, -2252, -3019, -2230, 409, -272, 1003, 2835, 867, 1368, 722, -333, 618, -505, 464, 914, 120, 917, 524, -316, 1573, -650, -1833]
3239a833K27r3J285j01j63K854j993R54R35k333P73j15j629P76m41N76J20j302
3257a503K214n06l84J391j322j39M54k573J570J183m56J761j492l76J877j279
3273D20j89P21j986R15q23o83K213j881J144N09j495J599k76j845J481M0l61J679
3291A182k391K210n13q26J757j554k86J328k043J418j022j030K075p60j97K174
3307A522j787Q34n07j128J687n46j370K449k379J085J40j135J229L1n30J033j097
3324d69j65J115j664J513K63n13M36m04n13J430k457R26L06j045J300r37j4J366
3342D74p36M51J15j213J713j015p02J540k130R72Q17j182J514p86K63L99j235
3359g41P33M83j268J521n66q14K129k301J711m57q46J011j019o50Q14r36O23J212
$$ y = [-1833, -1606, -1699, -414, -515, -678, 2176, 183, 1137, 2072, -261, 512, 397, -1232, -456, -897, -321, -201, -1503, 711, 205, -179, 1212, -110, -249, 205, -2368, -798, 385, -71, 1690, 198, -178, 1699, 420, 231, 952, -1034, -119, -942, -1625, 588, -1293, -149, 360, -1135, 464, 188, -1657, -176, -136, -497, 1182, -1209, 1001, 488, -338, 1419, -135, -421, 907, -1136, 282, -740, -1770, 305, -455, -652, 1522, -265, 569, 62, -1066, 621, 75, -1295, 1154, -1225, -140, 0, -1135, 94, 125, -405, 628, -469, -634, 481, -1183, 330, 593, 80, 516, 112, -401, 1029, -1428, -502, -196, -1241, 59, -878, -892, 474, -262, 189, 304, -909, 804, -211, -913, 627, -1503, -531, 286, -896, 618, -168, 95, 494, -741, -8, 475, -793, 728, 162, -652, 1477, -824, 887, 430, -416, 595, -424, -1074, -260, -1196, -573, 639]
3377F39p88M80L97j101P04k18n98Q40j627J446j67o05J313j129n62J643j116J031
3395E82n8j285R28q11Q97J161j053L99L24j199K91q85J13J117j137R64O01j196
3413b47J293p50m76J059k049J67J868k123J373M45k22J347j484J25R29k474L80
3430h39o7r03J338N04J74J212o25O28K11j605M15p22j345J076j070M86O37o68
3448a163J476l8m42R70r56k57Q26j128J111N08n54J485m18q15P28j621n4l97j695
3467b434J263j33J57K091n61P07R58j427P92j164o38j5q66O78R02o69J418K01
3485A260j183K95j283j81K52j087J001M11K33J758o43L67J155k069K22q24j113
3502a429L90p85P42J382l58J873M17r66K22j205j982K99j174O13O72k3J717N33
$$ y = [639, -149, 331, 728, -373, 331, 113, -485, 355, -1272, 174, 7, -598, 715, -414, -976, 667, -449, 582, 524, -761, 167, -644, 253, 1414, 361, 760, 1084, -115, 176, -709, -596, 521, -616, 348, 949, -247, 1046, 296, -180, 879, -1170, -1003, 865, -1258, 115, 560, 338, 1685, 201, 326, 1255, -1219, -839, -906, -1809, -471, 33, 207, 1419, 794, 1422, 1633, 28, 443, -279, -1624, -548, -1618, -1132, -495, -1163, 313, 275, -167, 803, -153, -410, 416, -712, 399, 907, 353, 1838, 1420, 605, 1333, -288, -342, -739, -2434, -1171, -1304, -1147, 944, 383, 1090, 2048, 621, 1413, 249, -389, -404, -1270, -592, 310, -359, 1059, 1260, 77, 372, -911, -1092, -840, -1927, -926, -515, -282, 1476, 833, 1200, 2355, 286, 508, -316, -1429, -1039, -1824, -1082, 300, -58, 1815, 2232, 1266, 1488, 283, -1699, -1400, -2574, -1961, -1289, -1312, 405, 938]
3520I38J27J363r23k08j03j617Q29k95k23J098p60J36O57j925L78o20j432O98
3538a882k55M58K007j90K014R00p75J295j718j075n42k127K97k47q78J508n6K39
3556a027J359j059R16N06q32R53r3q2J589l58J51J15j258p0j614j502J45j610
3574c771M17J008r7K325J007L89J856k61o01K52j637j23m77j826J180o19l76R12
3592d42r33O54J92r19J219n40K71J770n40R18Q19q74N08p58j320K81j779k67N25
3611a215r88R40O02k27J167j12L13N42r54R01k15n69R32p41J1P47j238O25k84
3630B37j036N86m65m86J105o43M22K01m75J009o00k57P06q64M88N56n51Q54M2
3649H29o02J096j069k95M02j303J155p89n95J012r13m2R06p37J164R1l33J379
$$ y = [938, 1065, 2428, 1505, 1297, 1194, -423, 406, 111, -112, 986, 226, 362, 1019, -906, -528, -1148, -2580, -1882, -2137, -1679, 328, 138, 2152, 3052, 2277, 3572, 1854, 779, 237, -1890, -1593, -1840, -2718, -1210, -1266, -1027, 332, -727, 189, 695, -137, 816, 723, 641, 2230, 1872, 2023, 2138, 880, 810, -804, -2306, -2161, -3771, -3354, -2346, -2443, -118, 889, 1278, 3134, 2873, 2272, 2524, 887, 764, 287, -1539, -359, -978, -1354, -442, -1375, -721, -529, -1448, -229, -769, -498, 1272, 732, 1650, 2469, 1595, 2103, 1345, 25, 306, -1473, -1740, -1215, -2203, -1263, -661, -888, 279, 167, 480, 1022, 68, 969, 754, 185, 1117, 376, 387, 1134, -104, 521, 237, -799, -213, -678, -1164, -59, -702, -280, -79, -554, 455, -145, -402, 304, -560, -72, 484, -67, 787, 829, 227, 1323, 254, -41, 361, -942, 213, -576, -1171, -159, -1072, -1114, -208, -945, 219, 310, -23, 1356]
3667A356m51L79O50j152K11j00j442L29q85n66M99j115J158N86m18J271k7o8J471
3686A686r85j5P66j053P64k82q56R47j233l09K19j512O08n49o5J226j30R07J154
3705A288o41P89J79j013R46j696l53O89j276N08K54m70R23m55J67M53p88M40K42
3724A86o05Q49N64p97J269p60J49K79j549L67p32r17J038q51Q66O00n34J258q4
3743E96n11P74p56m51N39p69P15K88q55J172j29n77R32j623N92L7r81Q90k95j44
3763e56Q18m99N20L69p35P22l17q94Q85p14N03K82o48O48j0l62M16q79J57Q47
3783E53j443Q29J1m52Q11j77L36N67j134M48K92j288R14m75l72P54q82M70O19
3802C81j071J085o44O6N03q47N55L63r44O17M4m59Q76q65O08M81j015O71l16l86
$$ y = [1356, 905, 1284, 1934, 782, 993, 893, -549, -220, -1105, -1671, -1172, -2287, -1129, -543, -961, 310, 283, 215, 1686, 701, 686, 1452, 399, 1163, 881, 25, 972, -261, -570, -351, -1863, -1255, -1804, -1869, -643, -773, 134, 1288, 647, 1436, 1615, 602, 1548, -148, -501, 188, -1088, -580, -326, -796, 127, -328, -161, 292, -496, -56, 186, -419, 430, 994, 197, 1466, 706, 855, 1134, -415, -48, -780, -1697, -659, -1510, -644, -44, -578, 680, 596, 85, 859, 103, -348, 191, -578, 137, 425, -430, 742, 613, 36, 968, -655, -63, -26, -1007, -117, -412, -556, 262, -237, 283, 652, -83, 639, 322, -572, 313, -401, 102, 384, -264, 384, 374, 12, 428, -451, -294, 553, -890, -61, -50, -502, 309, 132, 468, 1035, -99, 349, 641, -647, 267, -208, -580, 174, -708, -238, 381, -690, 395, -249, -183, 320, -527, 28, 391, -553, 64, 108, -351, 525, -340, 268, 749, -266, 405, 89, -297]
3822b97O29m77QP41j204R53k46l83R69q34jK73j142L11K52p47J037K06k10R88
3842H26p98N02J59q29M52k43j005J138o39M28K32l23N07r3n10O25q92p4Q67j093
3862g63R65r7j17R08n99p4L66j436P72o65o14J182m07K85J162p04J36K24n54J80
3882A50m66l76P92q90R37N81m95R09p63p7K36j180K23J76j176J273J12k00J320
3901A086m65O8M87j388J32l81q22L60n5k4J599p99P07N24j184J094l78q94Q17
3920D84m55N51k34p84J007l35j46L51j388M71pj038J013L13j46J207l72N05O61
3939A658j515P68n89r50K15l31K13O20l09K88K7r66J013r00L31M17o98R54L14
3958E60o7Q66m73k37M09j523Kk78p07M67k78j33J067l15R01O01p23P51n33n1O9
$$ y = [-297, 332, -145, -137, 604, -600, 353, 107, -276, 693, -141, -142, 131, -1011, -700, -448, -1195, -158, 48, -162, 826, 28, 530, 689, -140, 312, 69, -936, 202, -437, -9, 223, -100, 407, 314, -196, 429, -463, -537, 330, -763, 202, 105, -12, 896, 297, 223, 589, -847, -75, -740, -1354, -172, -579, -294, 868, 164, 300, 524, -30, 150, -316, -692, 100, -790, 147, 728, 233, 1142, 379, 302, 538, -642, -419, -243, -1419, -146, -34, -234, 1086, 621, 689, 1176, -212, -80, -461, -1283, -923, -978, -1002, 597, -202, 505, 1029, -155, 939, 561, -333, 484, 29, 580, 346, -438, 569, 234, 88, 439, -949, -478, -485, -1523, -510, -197, -343, 864, 492, 997, 1658, 143, 911, 322, -628, -413, -744, -531, 89, -220, 68, 95, -871, 142, -758, -427, -10, -708, 246, 560, 493, 1359, 886, 649, 1058, -465, -463, -741, -1448, -981, -1259, -1392, -325, -640, 261, 862, 139, 890, 357, 306, 375]
3979C75m86O54L26q25O81q02o63P71q56J16K63m88N06M74n40P33J48k3K23j483
3999h96J136rq07J014n78k7O73o01K04L12j037R23m55l74O64o56N1J385q02O65
4019G85l00l9J96r69N32J9j103J023K94o52J183r62M4j48j436N42N67p60J118
4038f6J14J97O61O9K79n85p6L40r33q39J157p39K91P64j084R27p98n84M52l39
4058g92L91K80o55J807j2l12J360j014j20M99k607M60n78n51N34n1O29J243q68
4077c57R60N09p93O02q88J86P14n51r7O34j101R11j038k95J300j690n41R3L69
4096a073M63L90M77J433o37J87k9p75O96r75j304J603j350O57N99q12p7L89j57
4115b95J153j134o93R12n16P87K08oJ362j201n16J229j303l23j52j336J573m97
$$ y = [375, -111, 543, 869, 44, 725, -77, -740, 31, -825, -709, -446, -934, -428, 46, -494, 239, 387, 364, 587, -896, 240, 231, -576, 438, -140, -167, 506, -95, 109, 421, -616, 307, -148, -522, 142, -514, -463, 922, 120, 785, 485, 446, 642, -327, 205, 224, -879, 144, 438, -214, 969, 7, 51, -97, -1533, -991, -424, -1184, -66, 48, 245, 906, 975, 1254, 669, 593, 933, 0, -839, 318, -421, -130, 634, -450, 477, -321, -905, -453, -792, -401, -121, -776, 1031, 1019, 707, 2067, 1053, 933, 1432, -1175, -715, -1293, -1844, -1310, -1361, -732, 511, -357, 603, 1112, 319, 921, 33, 219, 933, 382, 285, 919, -182, 729, -309, -604, 696, -994, -1535, -1442, -1073, -610, -220, 257, 1690, 1053, 1240, 1211, 436, 1132, 157, -1147, 456, -894, -237, 362, -450, -527, -138, -295, 858, -276, -969, -57, -573, 214, 422, 416, 1778, 577, 61, 1290, -13, -336, -488, -1824, -251, -748]
4133g48j1J474n16L83k01o24J66r2l07J104k42k46R33o97Q11o64l41J213j291
4152A04m23j86m58M36J03m58J220j70p81J811j065M29l13r03L15O35j88R18n94
4171D32j3K69m74R7n87r8K91p25J75J130o54N70k51j58O92j11p13O12p41lr7l96
4193g53J438l49k27J64q74N22K31q32P55o51L08J109o27J82P17j166J092p92q55
4212f08J148o88K69l1j096J157m55Q0O15q98N48K79o64R81n81p62J024r18P04
4231A04n7pK91K1j17J63p30Q19O89j545O00l67j75J078o97j81J095j623J025P
4251C93r00O53n87R0J073o93L81L71r89K65k17o45Q84k23j5l08j04L89L84q75
4271f73R50p99Q29m6o39N94L12j191J391q04J06P71n18pj176N0P68k01J42N52
$$ y = [-748, -759, 715, 199, 582, 381, -243, -77, -169, -476, 628, 386, 140, 1073, 376, 1187, 523, 182, 1395, 104, -319, -505, -963, -527, -424, -882, 338, 168, -613, 1198, 133, 562, 249, -654, -339, 296, 108, 1026, 432, 419, 688, 214, 311, -276, -374, -83, -808, -633, 497, -157, 413, 162, 4, 696, 585, -128, 484, -257, -260, -357, -753, 685, 336, 109, 273, -601, -79, 152, -680, 75, -576, -268, 841, 214, 396, 1113, -53, 1039, 247, -608, 540, -148, 121, 90, -1006, 151, -304, -224, 391, -507, 41, 320, -344, 637, 56, -706, 318, -600, 104, 47, 40, 331, 352, 235, 398, -332, 487, 1176, -369, 231, -136, -311, 767, 70, -111, 984, -639, 386, 393, -507, 146, -441, -351, 722, 29, 410, 781, -208, 57, -160, -805, 79, -144, -159, -467, -571, -182, 202, -673, 277, -522, 307, 261, -378, 216, 528, -663, 728, -76, 30, 801, 283, 276, -900, -850, -82, -283, -141, 411]
4291D11m79M85o35L53Q55p32n04R83j631P78l6m70Q74J09j30O2q57Q38L17j198
4311f07N14k61j59R20q57K40L74l88O96Ko46L91j003K24N93r7N09j01p13L43K81
4332B55m14j91p82J108p3m45P65m20L32N03q38L65r9p01P37j25qO62o12J36M01
4353E56r94Q57k0j051M64l34L76M48j185Q11M55o15Q91n71k11J237j561P52n1
4372B54p95J283k20j55M68r0l17O6r92O08q31L52O63j24J77J4q52J293o86p33
4392f17Q53j339O82J20l36J395j90m59R94o25n20J36l98p4K52oM09n03K89N01
4412E64j307P77K73m91R81j178P97O58k047J488L66j287J338n66j113J477j148
4429d18k36L88q65J238l46R29L16q31l47kn3K13j81r67J184l12J29L27k13M10
$$ y = [411, -68, 417, -218, 135, 990, 258, -246, 737, -894, -116, -152, -622, 252, 361, 231, 293, -564, 274, 591, -607, -93, -354, -513, 407, -450, -210, 164, -224, 472, 474, -172, 219, -784, -560, 33, -64, 445, 344, -369, -26, 255, -159, -350, -1132, -24, -97, -542, 223, -197, 135, 638, -200, 165, 66, -635, 102, -23, -31, 631, 19, 155, 556, -438, 419, 399, -652, -188, -522, -146, 302, -883, -72, 383, -232, 659, 88, -123, 1114, -447, 305, 254, -541, 742, 522, 367, 835, 745, 428, 494, -498, 110, -721, -369, 294, 170, 347, 361, -491, 802, 116, -617, 236, -1103, -421, -301, -637, 758, 568, 109, 1103, 478, -42, 94, -304, -378, -126, -132, 277, -226, 63, 564, -743, 34, 307, -184, 797, -381, 416, 1074, -973, 515, 881, -406, 932, 366, -747, 730, -418, -654, -266, -1131, 107, -239, 690, 1006, 175, -172, -174, -227, -14, -195, -1162, 22, -290, -161, 166, -47, 363]
4449C63j48l90j35p31N24M91m6l62J253o17J072q02j91J52p20k5K26p05M33M87
4469A29l83O41o56L76No17J066m88j594K390q06j70K92n20L91K99j107N10p36
4488i78J093L80j109M62k18L17L59l92n4O99l45k42K64l40N34j62O31k31r50M88
4508B06j75m89O25j115o4P03n03K50P26k36R21L71q32J9k80Q79m40L49j184Q99
4528F30j354J359r24j8R19j236N55N27p92R89o49L92J11O7K19J48j383M50l20
4547c10o67J547o56O89n18q21P81l58N19k05k13O46R3K0L48K93j260J03J45q74
4567f98J067m14p8J69r01O43K88m39J109n93J227j036n67O28p35Q74k80J82k12
4586B34O82j075J29K39O8l46q00P50L98o61J392o55n98R43O8n34M86p39Q48j069
$$ y = [363, 215, -175, -310, -1041, -517, -26, -72, -434, 819, 202, 1274, 472, 281, 433, -287, -312, -86, -791, -358, 129, -254, 387, -269, 107, 112, -505, 561, 73, -1521, 869, 63, -107, 185, -335, 56, 355, -752, -242, -978, 115, 495, -614, -152, -370, -53, 306, -86, -140, 559, 214, -28, 236, -104, 430, 268, 899, 668, -282, 206, 31, -458, 167, -948, -1012, -309, -812, -562, 164, -72, 849, 1220, 388, 407, 127, 1006, 566, 915, -269, 630, -724, 635, -289, -307, 612, -624, -69, 458, -334, 655, 6, 398, 509, 576, 795, 943, -440, 10, -310, -977, 570, -86, 603, 85, -736, 45, -313, 206, 1, -212, 434, 527, 547, 895, 1188, -72, 31, 176, -698, 369, -45, -123, 46, -855, -212, 76, -363, 746, 153, 1380, 344, -223, 405, -330, 544, 264, 446, 234, 916, -159, -30, 209, 277, -69, -869, -119, 279, -382, 1010, 355, -243, 700, 768, 234, 720, -19, 829, -240]
4606b40J4N48q38M90P99j273P74n79m80J145l53L63l44K54n27P15NQ43r69j41
4626B06j31k91J53M1j130J190K25l95K08o54L29Q97q77Q8l5J53N15j084J090j69
4646C29k49M04K19q09j12K95K66n15L53q52R89p51M84k46O4J73k49Q26n76k77
4666b34L10N33m3n35j72L22J40J09j88j167R32o00p13J414P38j111k69J230j354
4685f58J098p5j42K65l52M26K51j287L49n3L12j63l13J89O28n92j03p58O72L27
4705B1J075q29j030L69m38R81l65L35j322P87K62j32o9P09j48K37r6n87m1R1L54
4726A64M65m44M30n88m20Q64j167J674n46o65L99K09o3k34j29O09p08L49m74K95
4746B0n18Q08p49m2J607j562N68K74m12J02q83J717m96j135J858nq6q45n28K52
$$ y = [-240, -226, 322, -516, -26, 773, -500, 274, -305, -785, 360, 7, 370, 26, 280, -247, 468, 473, 1316, 347, 206, 75, -216, -63, -22, -1152, 38, 263, -132, 76, -578, -249, 648, -229, -141, -176, -23, 492, -592, 498, 329, 80, 484, 703, -106, -218, 77, 343, -172, 181, -671, 318, -433, 51, -195, -131, 42, -207, 619, 43, -234, 76, 609, 566, 31, -141, 181, 321, 430, 242, -925, 7, -593, -1306, 108, 846, -265, -534, 696, -658, 440, 365, 223, 488, 136, 562, 813, -474, -125, -178, 134, -29, -342, -153, 475, -117, -220, -978, -306, 21, 1096, 267, -763, -394, -832, 149, -216, 119, -1203, -416, -154, -286, -355, 354, 206, 443, 347, -240, -281, -190, 164, 629, 185, 615, 27, -393, 471, -696, 978, 432, -233, 166, 375, 312, 78, -51, 558, -150, 199, -275, 20, -498, 310, -439, -481, 1126, -436, 132, 406, -6, 96, -787, 930, 434, -701, 1157, 1152, 1066, 221, -307, -55]
4766e5L88k66M84j151L14P63j217Q09J140j209l4K08j708J272P75N6l40j20J503
4785A612j214m2L03J46o64M57k30n95L33m13O56O50m78K55p27K06N24o97Q00r82
4805a00j84N31j014J637q03j224J802j416N15J10K27M25r87O09Q33j637N81P24
4823F29k69L6J6r47J085l56j504J581L42J8M94j90j193J265j624j97p3J711n64
4842B60rr68J245j466J903k66m21J071k263J444o71k03l33N89K01K14n96O74k95
4861A10J30k28L48m61O99j356M91R40j56n79J118j367O29m97K09k07j12L89l0
4880G0k90O43N9o61J365r95J40p56p2N90m53k11R32j69l46R92r78j8Q67j027J22
4901a96M00j128J247j013p1N7L08Q04o86J70M37P71j984P93n40R65K17m89O64
$$ y = [-55, 333, 67, 551, -600, -286, 477, -740, 69, 1209, 0, -34, 174, -1534, -262, 513, 569, 229, 109, 1612, 398, 356, 659, 805, 141, 598, 368, -227, 106, -307, 349, 999, 521, 776, 49, 255, 779, 82, 882, -100, -284, 247, -767, 870, 67, -1157, 645, -771, -256, -146, 81, 506, -481, 128, 961, -676, -95, 629, 360, 396, 412, -535, 550, 194, -1310, 271, 613, 631, 1125, 935, -258, 1007, -617, -814, -887, 824, 260, 251, -717, 528, -938, 965, 699, 278, 1349, -914, 530, -141, -344, -677, -88, 113, 327, -269, 405, 110, 240, 12, 360, -101, 598, -758, -267, 673, 517, -62, 1056, -311, 318, -179, 30, -177, -289, 100, 70, -220, 423, 482, -179, 1186, 191, 331, -425, -497, 93, -360, -571, 361, 192, -154, 838, -140, -158, 709, -318, -196, 204, -924, 323, -690, -761, -704, -396, 408, -278, -108, 329, 1100, -884, -91, -631, 334, 551, 62, 726]
4920G26k8j097P77n96J5l89N49j35m27K08R33j111J044o8p48N72j728J382l2j93
4940c46J190j366R30O18j835N46J017j364L9N27M15N22q85J42L95q27J52N27n06
4959a09J30k32r19R47j74L90N77p00J009n05R93j047o41m41P68j8q45J450N01
4978A134m13m60l1L34j064j08N97k65L9O39K15K83L30j156J58n38j18R7K05m76
4998e98M24M81p17p04J571P6p38j65N94r19K111j570Q33N27j094m91J95n26J227
5017E17q57Q16r31j201J580n63R10j89k81M88K11r74J319p00p90N80m56P88l17
5036e0r89J366j058j02Q21k27Q65j169J03P12p4j41O17k00p34j28n92J405l26
5055I9p17J610p07o82O96p96Q58j1J21j33n14K27O11q86Q47n38j432J011J56j55
$$ y = [726, 698, -399, 378, -218, -203, -592, -43, -178, -605, -397, 536, -575, 469, 401, -347, 225, -1503, -121, -153, -346, 844, -522, 408, 1026, -809, -263, 754, -610, -571, -44, 371, 893, 8, 150, 545, -282, -130, 397, -109, 21, -211, -1130, -183, -357, 33, 610, -90, 919, 414, 1407, 360, -281, -722, 46, 28, -817, 633, 1134, 721, 261, 230, 564, -500, -608, -11, -276, -237, 402, 617, 900, 1230, 74, 232, -306, -424, -327, -122, -598, -174, 307, -410, -1114, 457, 533, -205, -370, 224, -695, 1416, -154, 679, 1206, 112, -379, -184, -710, 517, -340, 476, -455, -1656, -76, -639, 271, 82, -199, 289, 500, -474, 845, 145, -645, -65, -521, 267, -50, -1039, 327, -731, -833, -12, -239, 626, -543, -440, 272, 198, 57, 674, 474, -260, -388, -980, 425, 99, -618, 992, 285, -397, 299, -497, 361, 350, 471, 338, -176, 51, 662, -224, 623, 85, -1347, -336, -180, -335]
5075c35P65p51q9J455j225Q40m16o87J4L29N07K30j43p27J077o71P05q97k49O33
5095C65r00K23J091j345J37K75m86K148k307J449j428J248j481J477n86j25L56
5112A11l50J76o90J240l71P9m05k10L9R14q23J319r56K22N65J0j304J357j462
5131e39Q44o28jJ68m17J79N25L4q76N24q09K119j222o9O09k66j98R16j547J253
5151E99j326L84O31l72J66n17j76J103l49k03J24p16m2K40K5L33r92P5J993r2
5171H88j439J143n41l41O81J99n54N6M79k74m20P2J31m67k66L27l53Q85r44J054
5191C16j556M63J135j39j035Q62N5n35K50J07l10k77J374p74p5L18M34l23j19
5210A71L30p82M58J357j372M46j500J239J39k10m07l92Q16j57j203J473j136k85
$$ y = [-335, 430, -321, -410, 1045, -180, 660, 244, -443, -429, -100, 407, 637, 494, -233, 844, 173, 878, -19, -268, 365, -535, -312, 779, -566, -429, -154, -640, 1508, -799, 650, -778, 470, -1011, 466, -120, -245, 111, -239, -63, -753, 487, 116, 195, -210, -420, -381, 533, -290, 1029, 73, 295, 860, 870, -434, 923, -539, 305, -323, -324, -156, -573, -394, 131, 165, -711, -187, -996, 1123, -99, -168, 441, 175, -23, 893, -654, 599, -727, -343, 288, -84, 82, -435, -611, 492, 143, -60, 64, -652, -694, -454, -429, -96, -1088, -1013, 980, 888, -551, 592, 51, -290, 391, 590, 36, 92, 571, 297, -123, -51, 80, -387, -653, -326, -679, 206, -738, 316, -1240, -777, 358, 219, -816, 46, 101, -434, -184, -77, -387, -664, 710, -64, -139, 179, 613, 290, 171, 501, -281, 177, 1534, 162, 608, -892, 347, 486, 276, -131, -523, 293, 136, -1067, 406, -730, -1015]
5228a015J415k37k52K79J5j73O38k511J875j51r7O65j104J371j291K40R55j036
5246d14P55l41j74J97k32O36M96j881J094k26q15M28N70j802O05P64Q80O08l07
5265H41n16O22j302p0j98j65P67m81J11L19rM5Qo97O44n56l04J125j86o24J672
5286A046l2k30o00O30o05o2O7l18j057L80J127j932J646j31J17R15q36k98o8l46
5306e87P19l81m25J342j069O3L77q9O40j175L24R60j197O22k73K69J1P88q13n24
5326d18M90M59m03r07N98j83J79jk44O13m49J34J228j099m87P59r39N07Q60p47
5346e0M2K23m87N90M58q54N57q88L7Q52q94N12J7k89N22j96L71m67J41K37m53
5367a9m24Q85p43L39J73r27N70M14j24k7N44j358J177p12L41J5k24M56n81K63
$$ y = [-1015, 400, 163, -89, 190, 205, 32, 670, -1841, 34, -117, -214, 451, -653, 718, -573, -333, 622, -414, 341, 0, -174, 23, -209, 427, 923, -958, 136, -90, -905, -477, 93, -1709, -1104, -340, 540, 1148, 841, 325, 947, -355, -425, -623, -788, -21, -502, -391, -72, -81, -36, -28, -725, -81, -637, -941, 184, -2, -626, 1046, 1014, 784, 184, 814, 209, 147, 214, -104, -1161, -781, 346, -1586, 60, -71, 46, 961, 125, -173, -241, -587, 132, -249, -674, 668, -401, -338, 39, -50, 590, -585, -261, 699, -498, 124, -149, 120, 131, 919, 106, -418, 72, 531, 128, -779, -181, -364, -185, -186, -430, 183, -266, -132, 1096, -3, -490, 269, -670, -163, 697, -50, -8, 215, -272, 318, 776, -78, 479, -409, -372, 480, -414, 98, 115, -174, 348, 152, 523, 56, 197, 434, -19, -443, 442, -301, 38, 211, -716, -146, 268, 144, 117, 661, -697, 480, -232, 109, 124, -100, 356, -225, 38]
5387C8R22p12R23r09l83j04o90M90L24l65Q25k94j00J71K16l80J057n98n52K15
5407I4m35J58K09K71m41L75l03M85j313R11j63m33P63o06Q35r6m93O89k05R7K0
5428D19p22j8M22j08J42J49j18K40k78j55KJ3J90l09o87M28K70j15R98q31O7O45
5450F44m51j25M9o63L29q19O43K56j45K33j35Jj68j07M81j00j35N5K65m8K81j31
5472B10Q9M78j133K06j27j24K91k35j33M10r7O0O00o61M07o6j57N59r46N25l52
5493a96l71N82M7Q3K42o52J71K21n59N15o3j78N42j80k89K54L97m05J45n92L32
5514D6j180O27N06o82Q57j51M77j66l51p1k02M26K35n33n4P01o93P00k5n31Mk2
5536h2J30l52K65m34N32m46M55L75n94J60J27J21m16j84L73k94m01O33n8JR3o4
$$ y = [38, 960, 248, 1171, 262, -121, -225, -915, -425, -101, -466, 359, 65, -35, 136, 352, -28, 1029, 431, -121, 94, -341, -183, 26, 297, -144, 231, -72, 413, -900, 11, -152, -585, 178, -428, 407, 311, -182, 507, 302, 399, 419, -303, -321, 101, -7, 135, 284, 166, 406, 128, -27, -25, -12, 178, -131, -818, -390, -120, -235, 763, -68, -1, 644, 193, 68, 117, -546, -217, -1036, -393, -137, -282, -49, -184, -183, -351, -458, 23, -77, -212, -157, 108, 60, 341, 210, 299, 777, -356, -150, -277, -401, -110, -345, -478, -68, -165, -105, 495, -166, 241, 175, 18, 577, -369, 156, -196, -567, 15, 62, 145, 387, -265, -94, 127, -432, 83, 20, -158, 384, 204, -85, 169, 566, 161, 306, -286, 46, -1134, -507, -1, -683, 174, 23, 500, 334, -17, -88, -290, 136, 371, -162, -216, 485, -208, 492, 467, -64, -60, -82, 48, -304, -39, -473, 59, -387, 68, 443, -151, 9, 136, 257, -159, -343, 30, -264, -665, -32, -90, -89, 4, -60]
5558f0P8M65n38M47k39k78J18J19k41L13k57L54J57n10k4r0o3N11p65K27k85M8
5580e13N28j72j09P35n57L33J09KJ4n06O14m44m23L29J11N7k98J89l73O36o05
5601c43r0O59o56L05K26l29R10q73M69J58q40O73m85j88k36o34R30J82L9nP30
5622F02m14M55K68o57r7l46K12Mn32N11L21n97K47j93n4M20m41O06n93N46L39
5643F07p24N78K10k92l16K00o38J76r2m00O09l19L80J50L6L26j03l90L10n06L17
5664A19K53m88M4j20l77N83j92k73L74j72K71k45P2N04m61K99J72n7J07k10o76
5685d73N19m54R8j30j76L24L89j61M45k72kM66n44K98k24k46M60l14k64M70l21
5706a12M0j47j93L23p3o2M15n7o4J40o77O57R0l81L45n31k6K56l67O58j22p90
$$ y = [-60, 18, 483, -55, 392, 153, -125, -7, 112, -129, 184, -73, 281, 438, -72, -96, -186, -249, 262, -503, -276, -561, -513, 15, -157, -266, 469, -88, 245, 354, 356, 370, -136, 478, 34, -389, -60, 51, 108, -190, -1, -374, 262, -343, -433, 226, -430, -125, 101, -228, 682, -191, 278, 436, -404, 269, -216, -404, -640, -1274, -344, -162, -123, -128, 602, 188, 643, 911, 254, 157, -189, 23, 27, -505, 6, 327, -270, -23, -216, -270, 150, -291, 315, -278, 268, 607, -117, 461, 671, 379, 63, 263, -375, -199, -291, -691, -82, -401, -21, 129, 165, 491, 388, -2, 308, -198, 119, 372, -116, -72, -192, -569, 14, -178, -451, -77, -249, 22, -223, -151, 353, -108, 191, 363, 306, 413, 203, -473, 46, -408, -310, -440, -616, -292, 97, -64, 381, 109, 107, 573, 29, 327, 103, -143, 317, 3, -261, 209, -112, -72, -219, -412, -89, -162, -224, 191, 134, 70, 210, -467, 190, 280, -101, 244, -287, -313, -57, -424, 234, 112, -678]
5728f78Q11j10j39L01n9J59j84j03J65o11J45O6j97j6M62p19Q82l63L38M91l99
5749B42K21l9j11J68p27j26M60m84K81q8k41L16l6m92O07j39K62L88k29K69K4
5770E26j69O1k25k76K02m42j43O4l99O87l54N75L02m76P52J79n60J24n15P9pQ5
5792G0j95K46m69O20n05j29L26k49j39k05L98L12j52n1M78k4Q7k85m17K10k72
5813c45j70J74K4k0L88j58k25O12k12J36J95k68j87qo9K91j2o0K48m56M23o89
5835c88J41m53J20P0M32l33O79R1o3K80p24L94k42m17j32K03l3O04m97M60j87
5856EK48J14n65L9k71k01L52J53j95O56j65qM33m03l88k22j50J15o8J33O09k76
5878e5j56L51L8j93K97n56M74j14j76j33l05N27J75m33M73l47p5J11o1J55l51
$$ y = [-678, 133, 23, -116, 185, 126, 285, 101, -2, 163, -448, -303, -237, -434, -450, 12, -707, 175, -188, 150, 641, 242, 463, 424, 313, 481, -246, -372, 88, -396, -115, -203, -444, -128, -164, -656, -49, -188, 74, 462, 233, 502, 526, 357, 418, 193, -83, 119, -323, -466, -402, -801, -114, -468, 107, 409, -67, 685, 864, 304, 428, -87, -8, -15, 70, -125, 121, -348, 272, -233, -362, -36, -285, -424, -629, -231, 81, -71, -122, 356, 332, 419, 134, -283, -73, -345, -515, -341, -317, -337, 51, -107, -332, 280, 68, 204, 399, 131, -56, -64, -133, 158, 146, 86, 334, -122, 301, -388, -247, -700, -580, -510, -78, -411, 268, 359, 296, 576, -148, 246, 4, -413, -545, -342, -375, 229, -268, 192, 5, 253, 367, -198, -159, -430, -631, -279, -126, -321, 335, 170, 162, 595, 192, -196, -418, -568, -453, -521, -388, 221, -55, -211, 140, 178, -15, 282, -274, 200, 86, -90, -223, -528, -1, 174, -259, 214, -133, -208, -97, -158, -3, -354]
5899c54L13R9p5j83O18k61j77k2n67Q12l52k13K29l56N49J14n41N02Q8l56M49
5920C16l13m87N73l04N12K5p7L20m67j87K34n36L52k98k5K00j43K19M2K9K92k42
5942C5k36K84K93r81J011o95j63L01Q7K30m7o26L81L84l68L33m46J007p08j33
5962e7J99k19J00o9j70N25k11k62L29o58J51L08k50J08J24q5J18Om7K01k48N37
5984D30l63m5L33k33m1J91k84j60K82j01J7p8l60O95n36RR3O4M09Q5k26O2m10
6007a67M89j58k8l01K36r3j49oj4O16n16M66k19m31N89q6n00O29o33O26n25J22
6029e3Q7l57j96O33k42J56M4j94N66k76k42O40o59m65P87n03j40J3J26L99o5N9
6051A18J70q6K01m24L12j68l62j89Q07o91J93j15L9N00p11M44J94o70N10j49j36
$$ y = [-354, -41, 58, -17, -200, 418, 157, -20, -42, -609, 203, -149, -362, -133, -489, 60, 174, -367, 135, 223, -133, 316, 3, -484, 89, -215, 297, 322, 245, 565, 98, -89, 145, -391, -39, -337, -362, -162, -305, -86, -44, -15, 277, 35, -201, 83, 376, -605, 406, -289, -452, -151, -64, 166, 119, -507, -126, 258, -110, 223, -223, 784, 76, -57, 142, -77, 23, -46, -216, 309, 98, -164, 165, -493, -342, -34, -284, -176, -52, -137, -19, -13, -60, 141, -107, 430, 67, 22, 355, 122, 81, 272, -12, -172, 110, 9, 26, -52, -412, 283, -253, -244, -151, -87, 322, 407, 181, 243, -167, 322, 164, 136, -165, 71, -22, -171, -177, -191, 425, -91, 375, 156, -275, 314, 228, -272, 357, -276, 350, -175, -53, 34, -323, -519, 114, -128, 28, 72, -122, 444, 168, -74, 566, -93, -558, 229, -274, -414, -401, -275, 124, 59, 118, 288, 202, 403, -21, 291, 123, -239, -428, 379, -312, -119, -234, -195, 305, -406, 38, 232, -438, 72, -77, -213]
6072b13K38K29o95O63k25m3j4M4K25m07OL74l43K87j8k47N09l02J7M53o68j1K37
6095I6m01K55J21j63K01l0k42J17m31M21J56n9M90m98K3K33l60K58l53k38M52
6116D8k68j73L56k8J31L04j99K59k98O5J99l34L28j50k97K19o5o27L02p6J35Q1
6138h8j72K89KQ3L87P9k68J69k89o0K30o14J86M1k66j53n7L78j04r6M10L32k11
6161B08N28m33K92J33m74N20j123L90n02m6j38L98m30K10J32J38O16l18M35J23
6181F59j20j8l10N30l00o39j78L51k2p3J59m78k95N39k66R2J83K65K26Q6r1R05
6203A205q56K14m21k19k41K27l45L31n67P85l44j41L51LK22K42q83O75J99o82
6223b45O94o43P6N60n60m3N38q09M24m15L32j11j15j4K03L2J66k48J23N14q19
$$ y = [-213, 25, 254, -441, 222, -3, -46, -60, -16, 209, -198, -192, 182, -161, 126, 108, -139, 370, 68, 85, 538, -130, -141, 96, -305, -50, 71, -92, 109, 79, -163, -46, -477, -56, 100, 41, 531, 33, 56, 289, -71, 187, -166, -404, 48, -220, -393, -37, -65, 66, 370, 171, 430, 132, 197, 396, 62, 390, 240, -57, 162, 97, -530, -228, -304, -169, -88, -260, 29, 31, 114, 501, 580, 312, 481, 192, 132, 362, -252, -66, -25, -291, -444, -501, -123, -227, -323, 87, 419, 208, 736, 303, 595, 728, 254, 774, -349, 41, -461, -507, -645, -247, -677, -467, -335, -197, 419, 101, 536, 659, 539, 521, 211, 741, 441, -198, -376, -25, -47, -120, 39, -439, -734, -195, -461, -369, -186, 79, 305, 391, 300, 1205, 349, 563, 142, -77, -318, -91, -436, -105, -672, 113, -231, -372, -21, -18, 204, 446, -437, 238, 437, -245, 449, -194, -118, 442, -118, -161, 377, -432, -8, -423, -91, -202, -317, -331, -128, -96, 70, -178, -55, 459, -360]
6244c60k4k73P46j97j66M42K68k37n87L59L83p80K60k37L53m57N55pK03k98m13
6265d67J77L04J15j19j64l23R35n85j87P92l13k64K27r39N49l6J11O05m21p0O98
6286F25j96M17n14M98p22n57L79j76L63m15K42l4j6K71L93m00j74J226j293j5
6306i8L64K16j96P8p9J32p63k42N96j42K2j41N3P75o95J15L87j50m16R2K83J88
6328C79n39J52J67K77k86K65m03J04J91m65K20N0k32M74r7m80J11J92L35o31J14
6349a02J88l31N29rj91q37J42P05m12K34J63j2j50K25L16k91k13J80m0K62l38
6370A8J7n47P36j62J0K1j16j9K55j69M81n30L00j63J95l88K35l87j83P70r6m56
6392a78n91O87J76L93k70J04L04j099Q65j26q23N91p59R16j58k70L37j18r3j73
$$ y = [-360, -384, -657, 89, -108, -274, 168, 436, 199, -388, -29, 354, -426, -166, -403, -50, -507, 48, 41, 244, -54, -467, -290, 14, 129, 10, -154, -477, 458, -127, -314, 478, 165, -99, 128, -811, -262, -298, -187, 418, -3, -73, 625, 429, 846, 332, 830, 108, -449, -70, -246, 117, -298, -56, -90, -106, 165, 558, 158, -16, 1210, -83, -98, 266, 482, 286, 364, 285, 417, -346, -588, 8, -134, -112, -253, -200, 575, -120, -5, 382, 232, -184, -92, 191, 379, -160, -8, 159, 436, 150, 415, 12, 116, 307, -158, 62, 112, -120, 354, 257, -223, -112, 80, 415, -216, -102, 86, -245, 284, 275, 84, -753, -611, 94, -318, -84, 79, 67, -83, 142, 458, 167, -46, 134, 94, 356, 18, 35, -512, 224, 62, 72, 93, -23, -42, 213, 44, 525, -5, 295, 132, 327, -61, 174, -213, -396, 374, 278, -178, -769, -82, 94, 487, 217, 321, 625, -474, 391, 265, -558, 33, -726, 190, 32, -238, 99, -19, -112, -285]
6412b85N32M1k73p14O28o55J97M98k10K0N47o42L05J93r7j70M24m84M75J39l90
6433G9j13j67j05K18m57R06q56L99j29O49J45o39L50l64L35j73O3o48N51K16n48
6454b88N16k84J02J51l56N2j02M7k42O36k03L91n39JJ30k21N77j148O20k26N82
6475A96j17K07m33N67j84J21q64L00K14j12j73R86p32n58J250N6n59l09K99p63
6495f08O12o44J415j453R15j0L80j97j79M7J45J97j104j4J56Q25o75K45K11N35
6515G99p13J37o38N84L40j005J211l66M8K23m56k20L09r81N95L6N15K09k6k3l51
6536B27j74L91p4k05J83l35L86r4j04m76K37o13P61q31O83k84m15Q11o7M15n75
6557a53l98J304j047j93J124k7m99M33j119J135o80O17o25M59m85K89r5M97k73
$$ y = [-285, 247, 288, 15, -699, -71, -726, -529, -31, -241, -221, 326, -316, -11, 182, 85, -85, 339, -145, 330, 469, 79, -34, -201, -306, -88, -545, 361, -495, -96, -225, 424, 569, -70, 280, -84, 251, 78, 141, -507, 44, 260, -288, 228, -56, 46, 197, -159, -107, -209, -162, -404, 232, 29, 420, -119, -118, 12, -209, 368, -780, -160, -386, 196, 79, 286, -147, 420, 236, 357, -507, -207, 7, -105, -278, 708, -24, -582, 668, 724, 165, -144, 155, -608, 4, -640, 775, -678, 237, 227, 607, 410, 231, 278, 423, 620, -484, -498, -342, 483, -192, 53, 264, 799, 86, 223, -415, 169, 509, -496, 715, 349, 397, 620, 164, -56, 253, -728, -133, -97, 418, 627, 601, 578, 227, 53, 444, 370, 165, 348, 13, 399, 305, 201, -275, -38, -651, 110, -721, -38, -322, -737, 74, 7, 422, -153, -551, 753, -294, -487, 637, 610, 111, 544, -575, 560, -120, 497, -128, 331, -154, 135, 40, 537, 264]
6576B64J1p7k69q4K7L52j32K0o84P20J8n10nN30p20M08l86Q12K03K79j60l70l76
6599a29Q94n70q3l3j88K0n39M39K0L53j055R83pK87o92M38K09m27J57K18l73q0
6621a58R76r49j09L23k40k9l9K17K10n48N10J34m84M64L66o09j59l43J228p97
6641c6R9N14j79o23Q89k05n56L58r71L15j16M45J29l9k62K30M00K96o24L4k5R5
6663A68O59l67q67Q90o41M98l95n28K63K4j05J86M42k82M11m59n44R23p9K74J72
6684F43n56O29p65J66j49m43K57M34l90K40J26o48O22J00k44K2Q2O96n59pK82
6705E38m16L1j4n76K74J8n75P01l03Q0O1K20R6J60k15L74l97j17N03m18O8p3r9
6728g9N12q22J29K29j93k0J41j22L59j71R8K79n18L85M0k73L46j59n18L84j56
$$ y = [264, 275, 198, -71, -155, -128, 224, 92, 112, -572, 148, 166, -344, -349, 181, -539, -131, -517, 295, 498, 777, 617, 247, -129, 765, 195, 112, 79, -109, -89, -628, -189, -169, 184, -871, 112, 105, 392, -300, 138, 347, -80, 77, 295, -78, -158, 818, -131, -240, 83, -157, -186, -225, -8, 202, -346, 164, 298, -186, 278, 644, 35, -124, -467, 761, -36, 63, 577, 398, -225, 664, 459, -97, 261, -710, -395, -511, -66, 63, 24, -238, -8, 392, 688, 64, 98, 73, 168, 827, 460, -407, 483, -158, 340, -55, -583, -320, -296, -401, -215, 227, -55, 356, -103, -647, 276, 197, 471, 643, 87, 716, -49, 117, -32, -475, -218, 216, -174, 66, 192, -456, 166, 266, 22, 44, 126, 822, 263, 256, 538, 122, 153, 139, -437, -163, -145, -720, -19, -322, -242, -181, 39, 135, 295, 80, 454, 57, -60, 443, 25, 93, 20, -79, 433, -389, -260, -31, -224, -244, -103, -225, 134, -37, 61, 340, -178, 207, 247, -26, 320, 161, -357, 27, -129]
6749a29LK78k26l4J85k83J17j60L52R8p86O68p9j64K26l7Q2J08k68J35L2j15K45
6772B48l20K33k32j00J73l14K11L66j55r4L2j58J41K64l29M93m44M4K01m83J40
6793h3J45l40L34k21j67L50j87R3K54k79L48j61j25K19k33J45j09p5K07j32j32
6814a49L93k18k05j1J57P3Jl59K17N40n12M77m15j01r3k5M02nl10J68o8J63Qk91
6838a63L74k28k9Qj32l4J41o2K58ok69J78j56L63n4m29jK12k21K45O7m7K16m41
6862b10M65j49l04K46l92J06M58n18J64K25l68L89J04k40J31l9k23J99j67O7o2
6883a18j43L7L40k9j38nK98K1n92L80l3p5J88r1J78j57n7J92j43k36K66k71O7
6906a21K87o14K22J55j79M11l82K84N9l65K97k6p7L24n6K1Pj35qj16n27O78l20
$$ y = [-129, -126, 152, -74, -108, 77, -206, -89, -249, 103, 201, -585, 83, 4, -160, 66, 29, 111, 219, -49, 86, 118, 3, 248, -72, 161, -71, -171, 2, -312, -101, 265, 110, 16, 48, -110, 31, 295, -34, 459, 15, 59, 260, -223, -83, 62, -278, 56, -165, -332, 18, -169, -76, 178, -101, 247, 86, -39, 180, -53, 92, -17, -92, 115, -17, -149, 244, 26, -179, -190, -33, 40, 41, -318, -101, 439, -73, 404, -11, -112, -205, -230, 172, 167, -143, 25, -43, 120, 128, -163, 211, -17, -46, -38, -170, -204, -63, -125, 133, 127, -142, 36, -120, 243, 189, -240, -241, -29, -250, -5, 62, 15, 231, -210, 255, 106, -198, 48, -344, -238, 220, -298, -134, 91, -277, 112, 216, -24, 107, 68, -155, 44, -123, -56, -118, -261, -224, 116, 87, -51, -56, 242, 263, -329, 51, 18, -57, 131, 40, 218, 61, 4, 196, 53, -183, 83, -188, -121, 166, -448, -226, -71, -250, 161, -221, 63, 122, -243, 54, 28, -49, 275, 219, 240, 247, 112, 104, -12, -539, 139, -181]
6929a81Q8K01o2K8k6k5N0n8m2P0j61Q9L09m46L85J60n01J11J55M6m21k04N01k0
6953D6O2K42n52J22L49l29J81j67LJ35m69K45R1K35K13j75k23J96m13J95J56k81
6975a38Q8J71j59Q9j07J36J50k07j14K02k71Q4k37M4N14k54O2J05j72m0N7J06
6997A09j60j93M35k16M1N8J81m95L71n09R3j4J84J12j71K83M6l52L21J48k71L90
7019C91j62l43M76l04r3K2J11j66K01j88L21r6k13J45J19k32L91m01J38r0%R7
7041A24j41n0p1o4j1J16p2R7m81R16l55Q9j80L25j86m6J05P7q4j12JL47n17O2
7065a11J1j10R0l10J67K57j94K90M3l20P27k69j52P6k02J38J8l46J56r6L5J13
7087A1l57K43j31j51K22k6j76N01l85N62P9l98J08j48o4K01k84r5J87k58L72j74
$$ y = [-181, -93, 108, 46, 74, 48, 23, 73, 15, -27, 43, -118, -29, 280, -166, 219, 379, -122, -11, 144, 190, -231, -435, 66, 46, 108, 350, -202, -80, 269, -60, 121, -46, -43, 92, -377, -132, -41, 194, 407, 232, 9, 205, -208, -13, 143, -138, -50, 121, -38, 51, -56, 80, 230, 23, -91, 111, -160, -76, -313, -269, 245, -9, 53, 158, -14, -54, 3, 109, -51, -244, 191, -25, 16, 74, 255, -240, 131, -378, -285, -299, -115, -3, -174, 109, 155, -197, 124, 272, 1, 391, 229, -114, 362, 58, -35, -13, 98, -68, 133, -55, 266, 170, -43, 102, 221, -11, 380, -21, 117, 27, 27, 124, -17, -67, -138, -202, -213, -97, -169, -72, -553, 363, 8, 97, -83, 242, 56, 10, 115, 192, 108, -4, -3, 344, -173, -111, -100, -210, -120, -430, -263, -6, -200, 90, 133, -187, 540, 271, 119, 195, -7, 131, 149, -197, -41, -137, -102, 11, -346, -103, -234, -385, -163, -189, -365, 136, -249, 313, 392, -6, 102, -46, -110, 91, -193, -288, -101, -359, 13, -161]
7109a61J88J73k57M35m49j57K59j4j39K98j02K78j65K7p0lNJ4k71N2q4k94K27
7132b10n2J51J1j18J91O7j66K53Q9l49K89P9m79L02l3P2O1k34K49l02m6P6K54
7155A55k73K89k21K55O5J26j38k82pK54l93M29n50O4J96j63K46k7k42j01K98l16
7177c36L21j95K63L28o1k57J08N7K93n20l48N82n07K66j03l05J95J62j25J42l4
7198g4J5L91m28M50m23J71J96o91O69J9o38K68q5j07K8l86M51J35Q8J1M3j69O9
7221CM0P4M9j23oo1j46K24j67P7K0k15J50K63n41N12q0j71J63l4M9p2j2L24j98
7246A22M3p3jl28K89l84L25J10j54J64lk82L58l30J61q1j23J92k60K53q4J02n0
7269c4J77k52L80n77J96L1j35J8M5L4M9r7j6M41j58P7j11k87J83P3k45P5m6M25
$$ y = [-161, 27, 200, -57, 378, -71, -228, 31, 17, -122, 176, 74, 352, 187, 214, 144, 141, 146, 160, -111, -59, -143, -437, -210, -262, -111, -100, -218, -27, 40, -126, 127, 216, -133, 156, 235, -244, 58, 25, 97, 158, -76, 173, -129, -175, -99, 155, -118, 171, -50, 205, 270, 396, 258, -24, -31, 223, -170, 259, -291, -227, -31, -194, 52, 25, -217, -318, -20, -336, -15, -210, 53, 381, 320, 63, 171, 228, 521, 1, -347, 235, -272, -6, -109, -414, -219, -57, -182, -40, -74, -59, 332, -96, 354, -69, 102, 298, -393, 276, 295, -343, -75, -160, -267, -239, -625, -174, -39, 49, 60, 103, -66, 3, 43, 117, 166, 43, 37, -24, -170, 54, -113, -36, -16, -231, -81, 182, -359, 153, 73, -98, 65, 31, 80, 8, -4, 320, 122, 165, 92, 91, -237, 52, -332, -7, 103, -51, 113, 110, -172, 186, -144, 17, -64, -187, 5, -255, -2, -86, 16, -34, 143, -109, 271, -306, -110, -79, -214, -196, -151, -117, -68, -165, -181, 260, 102, 179, 68, -219, -36, 37, -208, -133, -179, 246]
7293B46j81j40K88j85l49N49m48rM12k26p4M09o31P31k65k4J12q5l6m1j12J91
7315A32J18j67j57k23J09J40J49n0j46j29K79l31K80l7J02j27J8p3L07k54j62
7336b22L50k62M13j89j1QQ5k72L09q3k02O7O8L4j71P9J35p1k20QJ12l3P4k68L54
7361I2M4j04J82j59J3J04j78j26L09k97k1K06J52j02n4K63l34j12L2n7k1o1K99
7384G0P4m41J67J94K4J21j60j88L17j50j14K72j22O6K3k75R5R5mPm29K84J17j62
7408a19L53l33OM40k57k88L40k44j27K03l48Q11m36m2R4j5m4M9o0J42k93m8J70
7431d6L4J76r6l64M78j33m19M82q3J78j84J26JP3j86J01k50K01k49J90j13J59
7453G6j43J38K90J20o24rO58q94J05O9Q7J21K74o51L48P1k37M16m16K93k81J12
$$ y = [246, 65, -75, 213, 28, -321, 228, -220, -229, 183, -43, -117, 292, -339, 392, 127, 103, 215, 130, 94, 53, -59, 132, 250, 83, -74, -297, -188, -48, 101, 51, -95, -224, 55, -276, 4, -33, 69, -58, -40, -113, 194, -60, -222, 128, -134, 279, 90, 79, 87, 172, -100, 209, 126, -76, -9, 59, 93, -78, 1, 136, 65, -155, -147, -35, -68, 6, -262, 92, 136, 32, 214, 55, 68, 172, -6, -132, 177, -120, -141, 65, 217, 115, 61, 324, -10, -122, -90, -147, -168, -229, 70, 144, -297, -130, 64, 88, 209, 49, -139, 178, 28, -86, 186, 64, 130, 153, -122, -27, 68, 64, 71, -358, -74, 43, -119, 234, -99, -93, 347, 90, -198, 142, -102, -229, -26, -374, 437, 1, -41, 53, 38, -6, 43, -17, 125, -168, -216, -46, -12, 164, 68, -296, 182, 49, -370, 112, 29, 207, 23, 149, 150, 223, 37, 138, -112, 89, -160, 30, -83, 76, -67, 71, 361, 481, -143, -152, 506, -388, -283, -214, -127, -6, 268, -383, -35, 36, -201, 215, -201, 92, -189, -77]
7475g7K87k49j26M38J2l51P1j07K44P3m63M04k72k79P24m37J07j06K85l10J96
7496F4n56N32L5j43J21l39L02J48k46J96J7l7r0m14M31r9K61j39o4K91q4k55J78
7519A10k9l85K72J56j78J41m32M33j47R8L04j78l62P6K90j21M6k36M29J49n58
7540a22J04l86O74l26j31J78K1k57L49j03l35N23k28J54J47k91L13m21K20K17
7560C00o69L05k45J97K55r3j28J92n66N63K14j99N7q8m61M40j79n8K88R0q8n4
7582G3l14L37k88M54p7l02O1j01oJ38k51K38L04n85M18k21L40k47J20j11K01k16
7604c5r6JK45J34l57J4K24o5J29nk48oj86K29J97o5J22r7LJ78l39m30M86j38P3
7629c2M03l99K4Q2m89K82j41j73K67J29r4M13l19M52l88m16M03J79l51O05n18
$$ y = [-77, 210, -39, -165, 273, 285, -66, 5, -102, 142, 215, -248, 156, -116, -395, 329, -108, -1, -107, 178, -132, 64, -492, 40, 75, -68, 53, -286, 16, 164, -82, 114, 131, 94, 4, -410, 21, -78, 183, 44, -20, 271, 187, -68, 110, 81, -304, -32, 124, -54, 87, -345, 88, -59, 39, 343, 165, -197, -121, 169, 48, 94, -142, 287, 436, -122, -18, -404, 270, -56, -187, -9, 12, -245, 104, 1, -334, 189, -39, 115, 262, -29, 284, -137, 83, 300, -369, -64, -309, -112, 143, 50, -78, 114, -452, 111, 325, 126, 183, 95, -366, 74, -105, -163, 125, 215, 127, 73, -241, 96, -192, 262, 185, -117, -56, -157, -163, -25, -276, -38, 266, -319, 99, -122, 218, -29, 91, -20, 181, -35, -131, -130, 115, 249, -108, -94, 130, 65, 194, 189, -59, -65, -251, -22, 175, 110, 232, 135, 138, 316, -23, -453, 33, -105, -32, 371, -28, -4, 78, -411, -129, -270, -443, -176, -47, -141, 272, -47, 405, 17, -399, 4, 183, -168, 437, -81]
7650h1j36M02l46J60P5o9l76L05j26N34k87N32l31m58N41m62R21q48k6j18m17
7671f11P15l57r7L68l46K89K32k40K64n26N7L22n8K27n2N0j32O6j28n6k30K97
7693E4L24k57n63O19m92L93Q1n50O62n14K40M15o14O1q0J18N31o61J51l60R18
7714D76j22j98M4Q9k60j11N47o14l80M42L90O7P6k51n78O81m45O3K63O4l31K85
7736A97L32n56Q4j33Rk3K35k30J18J74o39M57O4m16J78N5Q0r5M5K3J59K39j32
7759B25p24P60l75K78j43j27M18p09M77o6m49O34K9l15K10l41L16L66k57o30Q7
7780c36p1J27L64L7k99M23n05Q3O05j65j0J7k33mM30n70P67m64J84Pq56R16k73
7803A74j97K54k69k23N9r4L64j35J02J88j13m07k04R78k56K93q49k40qQ94J38
$$ y = [-81, -217, 185, -161, -1, 74, 5, -371, -66, -192, 342, 55, 587, 256, -202, 339, -123, 798, -50, -76, -194, -611, 104, -253, -350, 18, -328, -39, 193, -47, 217, -309, -252, 70, 12, 239, 187, 237, 105, 171, 43, -13, -243, 54, 378, 121, -442, 177, -315, 78, 159, -391, 271, -243, -3, 412, -202, -141, -221, -103, 428, -233, -82, -442, 476, 354, 156, 200, 289, 29, -82, 465, -149, -529, -87, 303, 370, 446, 195, -383, 298, -147, -84, 179, 243, -88, 197, 529, -27, 57, -76, -67, -90, 145, -85, 33, 207, -432, 25, 89, -327, -149, -94, -14, -109, -64, -41, 118, 357, 225, -499, 261, -114, 164, 21, -106, 312, -397, 80, 14, -435, 199, 228, -87, 123, -218, 98, 464, 207, -423, -336, -407, -280, 84, 121, -178, 245, -260, -177, 428, 263, 253, 270, 37, 33, 463, -107, 660, 196, 380, 387, -469, 447, 174, -23, 231, -38, -261, -202, -296, 68, -67, 35, 223, 110, -297, -501, 477, 221, 514, -335, -575, -583, 311, 449]
7824D49k33P5q95P02K47j22kKp95P24j1j9K42J06k88l3p60N06J42l3L71n34K44
7847H5K79l1n3n54N50l31N55o37N8n41J6L28l03O66l56M41N13r84Q43r27M5K34
7869a04n65J56Q15q33J252p6J61m25p96L31m32L1L64M88o70K19K93o18N50k1M6
7890A66q07J014n24j67M32J51k91L09m00n05O13k02K77k50j92L99K9P5j57N57
7910E27o55K22m23L08k54O23q17M90K22q5k20j6O14M4n50l77l63J059J0j92l51
7931a84j91Q6M68j0j84N72p18M50N74j137J064n85k82l92K43N49p6N49p88K77
7951B85j71o44R43n08L38j64j44p2J77J78p58P74o9k3L91O0r34L17L89n61O0J022
7973H86p12m80P61j55j58Q23j86r76l41J279o35Ok35m2N99n35k5k28J90l92O04
$$ y = [449, 216, 291, -604, 98, 345, 223, 221, 223, -572, 152, 141, 122, 364, 470, 182, 149, -611, -105, 37, 4, 375, -159, 85, 364, 333, 280, -274, 276, -55, 500, -137, -79, -620, -604, -276, -579, 87, -269, 172, 685, -299, 544, -383, -338, -104, -669, -513, 302, -531, 721, 645, 806, 381, -415, -84, -516, -485, -121, 367, -303, -84, 209, -409, 141, 120, 166, -641, 373, -151, -318, 114, 265, -26, 283, -117, -622, -9, -211, 66, -184, -376, 23, 52, 127, -30, 527, -128, 94, -329, -21, -275, 348, -469, 21, 243, 158, -62, -78, 536, 580, 30, -347, -710, 349, 359, 167, -184, -375, -289, 179, 169, -15, 557, -161, 289, 863, -274, 790, 205, -77, -469, -226, 323, 247, 796, 8, 285, 114, -530, 413, -95, 243, 79, -65, -137, 40, 218, -540, 234, 165, 142, 533, 593, -341, -24, 365, -196, -136, 886, 174, -306, 455, 300, 142, 965, 779, -197, -538, 741, 106, 112, -123, -165, 434, -101, -126, -354, -164, -556, 48]
7994D8K8l24l54R98j060L44K78J014m40r4o78o05R09J9R8N13k10k23J91j279J211
8015C84J10m43r16R07j99K57J87o30N92k12k51rQ41P7j450K86KP43n00J57j6m85
8037e68J73J024j008L97j98m48O08n43K20L51J28l02M3K11M5L06r66%Q51m98q2
8058b56L07J47L99l87l02J17K46q08M72j11k44L88K96n42N33k51K22M77l91o65
8078c53k01J01J156p59Q7l93Q77j091R13o03M42n88O01K26o47o6j6K3N38l54J07
8099@M7k49M89m00N80m27l93N17J32K89n07J51j02r0Q5k52k97N40k2L22o57Q16
8121E72r70L18p0L88n2K08M47k025J365k24Q78j049M96L1l01ko02O71K43o69M10
8142F3l46O51m77L39k00K78l08Q41p99K14l99R29m02n61K14k93O15o36N76k72
$$ y = [48, 76, -248, -602, 396, -664, -320, -42, 972, 532, 438, -240, -845, 64, 83, 181, 694, 484, 261, 452, -827, 384, 494, 51, -865, 42, -157, 100, 287, -343, 249, 37, -214, -223, 618, 695, -755, -469, -467, 276, -224, -67, -83, -568, -395, 629, -379, 18, -180, -628, -20, -563, -343, 8, 136, -166, -123, 88, 133, 439, -527, -527, 324, -174, -256, 51, 198, 597, 210, -92, 25, 271, -537, -65, -176, -420, -32, 264, -278, 255, 4, 226, 703, 312, -353, -554, -453, 703, -56, 31, -362, 515, -576, 337, -266, 176, -412, 189, 415, -232, -298, -314, -291, 247, -107, 0, 47, -202, 287, -113, 467, 40, -353, 164, 296, 585, 78, 229, 127, 37, 122, -130, -427, 113, 91, 413, -244, 572, -398, -80, -150, 238, 186, 394, 841, -1184, 181, -43, 835, -214, 282, 313, 12, 10, -592, 79, 322, -347, 63, -283, 368, -109, 230, 30, 308, 0, 841, 42, 256, -143, 786, 384, -177, 37, -256, 359, -277, 299, 27]
8162B7Ok93j87k7N10p18Q94q2M25m12k33L41J27n21l58N49j85J12j46J75m0O01
8184E65n49M29m68Q2L80l58r4
$$ y = [27, 33, -260, -447, -474, 36, -682, 212, 130, 555, 143, -90, 251, 378, -143, -501, 48, -137, -25, -171, 4, -36, 565, 16, 445, -23, 59, 439, 81, -13]
8191a3
$$ Imaginary data points
##PAGE= N=2
##DATA TABLE= (X++(I..I)), XYDATA
0@%%%%%%%%%%%%%%Qj6J6j6J6j9K7l2L9m7N4o2P2q5R6j10J26j44J66j88K12k41
36a28K72l04L39l80M26m72N21n77O39p06P80q61R48j046J152j268J399j543J703
55H94j886K091k323K593k910L291l751M324n062O050p452R606j3366K1767p4049
70f0183L9865J70754J8462Q9093L0945p4767p3438r1650o3166l6083r1421L9638
82a01951O0524j4830L4264J7646k653j0002q1798Q449K7803l1357N3700O9135
94B8930N7723O5454j6564J8309k183j08259o0190n0080n4173m081k6307N5540
106i5881Q6977J935M6967M2521j4576j3358o2451j3520J4399n5430K4307N9212
118B1102J1828L0417p421K568J718q6425k8017Q22l6476J7966J7848M5349O8812
$$ y = [0, 0, 0, 0, 0, 0, 0, 0, 0, 0, 0, 0, 0, 0, 0, 8, -8, 8, -8, 8, -11, 16, -16, 23, -24, 30, -32, 40, -45, 51, -59, 67, -77, 89, -99, 113, -128, 144, -160, 179, -201, 225, -247, 274, -303, 336, -370, 410, -451, 497, -549, 603, -665, 734, -809, 894, -992, 1099, -1224, 1369, -1541, 1750, -2001, 2323, -2739, 3311, -4141, 5465, -7901, 13866, -60183, -20318, 150436, 168898, 257991, 288936, 214169, 140731, 49081, -14085, -50168, -141589, -101951, -41427, -56257, -21993, -4347, -7000, -17002, -98800, -90351, -62548, -93905, -40205, 28930, 86653, 152107, 135543, 153852, 151669, 43410, -16780, -66860, -121033, -125114, -151421, -95881, -8904, -6969, 39998, 82519, 67943, 54585, -7866, -21386, -6987, -62417, -38110, 21102, 32930, 63347, 55926, 58494, 60212, -26213, -54230, -53408, -89884, -71918, -54070, -8721, 60091]
131F0091j0643J9110K4171n2521l4728m8051k9679J0081l6509K9916P6270J4117
143B1625L8842K6859L454K713o9159l4267k905n9076j0461J8129J6664M5241J176
156a165K5309M3070l4500j3660l704k6188L191k5243N574M4285j8864P842K1444
169B7391j4876N13l2549j3592K5029l1784L184L9090N802K4799J282M125K6647
182F5061m3740k0661P930l4636n527r211j457L4710j6104M148L4343j5161L221
195B916k581p307K6712j8505q30L8469j2907J549J508j6058P553l7222k3404J9799
209b0308k6664k536J7908M061L3746K75N422M0223j6253q678P950k1013L178k2043
223d732j8274K3946k1550q217J9146j0537J2742m341q971L1912j4277p384K4293
$$ y = [60091, 49448, 68558, 92729, 40208, 5480, -42571, -72250, -62169, -98678, -68762, 7508, 21625, 60467, 87326, 90780, 93493, 24334, -9933, -12838, -71914, -82375, -64246, -47582, -2341, -1165, 24144, 67214, 32714, 19054, 15350, -10838, -7647, -32890, -27316, 16969, -1895, 5947, 27391, 12515, 13028, -19521, -33113, -8084, -39868, -36684, 2406, 8208, 33007, 34289, 38414, 65061, 21321, 660, 8590, -26046, -31573, -40784, -42241, -7531, -23635, -19487, 14856, -305, 2916, 335, -6972, 19740, 1235, 405, 38874, 25967, 27516, 29024, 12966, 20519, -16703, -40107, -20308, -46972, -49508, -31600, -27539, 6207, 6482, 11904, 52127, 35874, 27196, 35146, 14133, 17311, -4732, -23006, 940, -20610, -28827, -9681, -20218, -7476, -11817, -20788, 11124, -3153, -10537, 13756]
236A3756r926Q713j782j0149K6492j7069j3654K2563j5896k62j372j5246K0321
249F489j5581j4540K4240j2181J126Q369j0047K4221p426j3308K7628j3058o110
262a78P227j4362J5148q707j5817K6564j0614o148J3672j0537J3328m567j6810
275a1801K4786j0350j1640J4514j1601R147j731j5371K4357q189j2215J7925j0035
288b204M477J222j5837K0566o896j4709J8578q513L031N454j4135K0369n002j7041
302a0640J8814r080l644O814j4122J8128p01j4332K1579n479o178P815j6340J0203
316B837l130j9105K0196k753m840J4978r126J1673j25k0400J4980q749j4029J2036
330e557q549J1818R668j0368K3055l18j3941Q837j5845l648j178j9383J7250M401
$$ y = [13756, 3830, 12543, 10761, 612, 27104, 10035, -3619, 18944, 3048, 2786, 1414, -13832, 6489, -9092, -23632, 608, -11573, -10447, -2078, -12125, 12096, 4670, -8638, 18990, 5932, -178, 7049, -7313, 7835, -872, -16689, 9875, -739, -6887, 6785, -3752, 9576, 5009, -11801, 12985, 2635, -9005, 5509, -6092, 3055, 1324, -14047, 10310, 2121, -10094, 7831, -2204, 2273, 3495, -12342, 8224, 1328, -13381, 5197, -3316, -285, 5169, -8966, 11403, 6401, -10640, 8174, -906, -4550, 2264, -11858, 6270, 5569, -8763, 12816, 7337, 1159, 8974, -7366, 2837, -293, -19398, 798, -1955, -6795, 8183, -943, 10730, 10605, -9795, 5185, -3564, -17593, -5557, -14106, -2288, 7380, -2988, 20067, 19749, 5808, 14645, -1200, -4848, -6026, -25409, -8159, -3758]
344c758o789K2824o60L637N297k0482N935q541k1896J1712m008L336J7924n214
358f83J9401N485j9002P498j3152j5553J524j5242J3741J3155m708K7719O764
371B6947m254P472k0750n769p852k6807J0381K509j480K4170J665J2779R615k1700
385F926K825j2436k4689M216q658Q935K1595J096K7798J3841j0730N385j9989
398A6115j9180j0236k9228M290Q884l619K9906J4745J0414J6900j5252o18q192
411A4929k9767J784o180k874K1023J43J6617J4368j6761J611j5026k4898l960
424b8991j7664N495K1213L027L3214K3506L546J4725j5891j4846j2302l7318p521
437b9807m312j1440K0848Q263J3083K2304r852O253j442k2944K879p207o32K0616
$$ y = [-3758, -10547, 12277, 11617, 15254, 20551, 69, 6004, -2537, -24433, -12721, -16729, -13393, 4531, -683, 18718, 24203, 5201, 12699, -453, -16006, -14482, -29724, -15983, -2828, -7536, 20183, 26947, 22693, 30165, 9415, 3646, -4206, -31013, -20632, -18123, -19603, 4567, 6232, 19011, 28626, 6926, 9751, -2685, -27374, -23158, -31816, -22881, -1286, -190, 27608, 41449, 30719, 36104, 16115, -3065, -13301, -42529, -38239, -29355, -32974, -3068, 11677, 22091, 38991, 23739, 23121, 14929, -14838, -13054, -19234, -22108, -1085, -942, 15675, 30043, 13282, 14893, -133, -25031, -28991, -46655, -41160, -19947, -16920, 16294, 39800, 43346, 58071, 42180, 27334, 15032, -22286, -29807, -34119, -45559, -24711, -16448, -3365, 18939, 9087, 15340, 13898, -9046, -6167, -13374, -14006, 6610]
451F610M88J9280J7728j1505J686j9143k7863j2482l1134o080J1580m72L1227
464b0080K7844J7841K8289k366j152l126l2796j0945j2972j8720R497k529P255
477a3960J8717q480O629q00j8416K041j2288l764J9371n18K0644K2511J743J4370
491D7800p819j5197o856l2074j3443k651j4397J4110J0497R803K4443n36O152
504A9832O006k0059k268p808j2915J0880m531P360J7535m760Q746k63j3783K464
518F436j7413q576Q384j0499R448J2092j73J5097m180m522N072k0080l558J578
532a0894r627J3442N976P137K0692k730M866K562j9526l694j4687j7659K900j2091
546c3333J604J2863k349J5936P888J64J6455n864J9J0108j0696M289m21r521O752
$$ y = [6610, 7098, 26378, 44106, 32601, 34287, 15144, -12719, -25201, -56335, -62415, -50835, -51307, -20080, 7764, 25605, 53894, 51528, 50376, 47250, 14454, 3509, -9463, -28183, -18686, -21215, -13960, 4757, -3723, 2906, 2106, -16310, -14269, -26557, -30321, -10950, -11468, 9176, 31687, 33430, 47800, 39981, 24784, 17928, -14146, -27589, -30240, -44637, -30527, -20030, -10227, 14216, 13680, 19832, 25838, 5779, 3511, -4297, -17212, -6332, -10863, -3503, 14032, 9272, 18018, 17755, 3972, 6436, -10977, -19553, -11169, -21668, -12220, -128, -301, 14796, 10616, 6094, 11166, -8914, -12472, -10894, -20521, -7079, -1103, 6034, 26726, 23996, 28862, 31424, 11898, 8204, -6483, -24142, -21242, -33333, -31729, -18866, -21215, -5279, 2609, 2773, 19228, 13364, 13383, 23491, 12795, 17084, 16663, 7142, 13894]
561A3894j3043p902K854j8215j253J372q539J2832K844O598K0226k64J1291Q323
575C1018q664P214q680j2441K603j7016o866j518j3741N468l724l462J7461j378
589a3726P657J7280n58J2158L102m551Q683j2824o869J966j8240j358l364j2169
603b2813Q183n760p90J2401n446R711Q005l762J5215l54k380J1359r564j008j556
618A1441j5930K698j0821r584J0548p770M470J2102k577J3004J546m199J0416
631A5344j0319k533O105j1950N794J640o838J0217n904k812N614j2533K407l23
645f091j0423J1682j837k13J3275l585O078L061r337O533p893r012Q136q418K767
660e277Q197m688J1157q22n796P985j1314l494K494j1874O335J316l844J3107
$$ y = [13894, 851, -7051, -4197, -22412, -23665, -22293, -30832, -18000, -15156, -8558, 11668, 11404, 22695, 31018, 22354, 29568, 20888, 8447, 11050, -5966, -12832, -14350, -28091, -22623, -26347, -29809, -12348, -13726, -6069, 11211, 10653, 22811, 25913, 21362, 30045, 17221, 10352, 12318, -5922, -7280, -10644, -22813, -14630, -20390, -21180, -8779, -14225, -4514, 3491, -271, 14944, 14590, 12210, 23569, 14005, 12997, 11441, -4489, -1791, -12612, -22196, -11648, -19418, -14948, -2846, -5423, 7581, 9127, 4928, 15344, 5025, 2492, 8597, -3353, 2441, 4081, -2757, 7460, 1556, -1256, 4358, -8175, -5768, -6091, -16514, -4832, -6669, -6882, 6393, 2808, 8886, 11947, 2610, 9143, 1250, -7762, 374, -8044, -5277, 2920, -1768, 9389, 8567, 2771, 10756, -558, -4052, -1558, -13432, -7097, -5781, -9625, 3482]
674C482k638J859Q422j0018M648j555j0428P862n353j973Q776o143O503K359q196
689b393Q043o081o092P000p704L043N613n395J0813m26l482Q484q619j299K097
704C602j1183M756j962n321R257m579K579P058p200P503M91p266P984n649j937
719a867N763q571N184P08o555Q504l358k273P688p043M311K300p882Q070m458
734E21m748P720p692K908L448p757P923j697m845P620p599J311M353q044P998
749A420R06m349R765n156J97L651j0172L802j118p972Q850m136J241R228n324
764H33O288J561p745M956o764n156M719q456M972M771n329J0409j151l215N768
779F461r825l72J520r010P719J294n58J2541k690L196M483j0887J671n845j0614
$$ y = [3482, 844, 2703, 11125, 1107, 5755, 4200, -6228, 1634, -3719, -5692, 3084, -3059, 3444, 5803, -2393, 5650, -431, -6523, 477, -7227, -4184, 1429, -3966, 6847, 6421, 2939, 11423, 2804, 1505, 3602, -7581, -2825, -4787, -10108, -851, -5430, -2851, 4207, -2993, 4510, 5001, -2265, 5719, 70, -1867, 3896, -4675, 509, 1217, -5338, 3166, -192, -2465, 5223, -1820, 2491, 4791, -3091, 4979, 521, -4227, 3493, -4199, -1291, 2157, -5600, 2323, 626, -4219, 3401, -4198, -2887, 1466, -6578, 1420, 2326, -2023, 7742, 2586, 2783, 6434, -3738, 64, -1054, -9026, -176, -4312, -3071, 6157, 833, 7121, 8682, 937, 5893, -871, -6027, -1308, -9764, -4792, -21, -5350, 5059, 3908, 693, 6461, -3364, -3736, -2216, -11226, -3507, -2213, -2771, 9770, 7080, 10276, 14759, 3872, 5543, -302, -10916]
794a0916M331o472K316R072l683J1236M154n787O825p856n662K614j1076M139
808f765L667m069J2312J17n64P374r639m30j388j1868N269k259j777J1722k021
823c19O246O551p947M717m731r069L711q167J059P204m840R772L382m318O458
838I709q094m451J573j1071L689K547l096J1937J117K044Q077q266M41j613j1571
853g028L568m663k214R867k747P082P130o002N657m775q196L007j0356k61N163
868d768n405R501L354j551R073n917j460K274j0816K108j30n190Q645j521K287
883D84Q074o388L680K23q717M281n198k965P029n358M756M928n116O654l369m767
899a769M563q632J88L671o172P176N62j667Q360m790Q02M253q246M413r21m687
$$ y = [-10916, -6585, -13057, -10741, -1669, -5352, 5884, 10038, 4251, 11076, 3220, -2442, 172, -10904, -6765, -3098, -7167, 5145, 5262, 4698, 12072, 2433, 2003, 615, -11253, -5984, -8243, -10020, 1702, -319, 5927, 12478, 4531, 9248, 4517, -4552, -841, -9008, -7949, -745, -5585, 4187, 7569, 3251, 9709, 1615, -2836, -1263, -12334, -8645, -6098, -9194, 2743, 3860, 5904, 13981, 5715, 6156, 4543, -7028, -3460, -8123, -10337, -470, -3217, 3865, 10995, 4993, 10650, 5875, -2321, 686, -9670, -9931, -4768, -10173, -672, 2682, 1131, 10204, 4287, 2827, 5101, -5715, -3607, -3737, -8927, -282, -1803, 484, 8558, 2170, 5850, 6073, -2644, 1637, -3561, -6526, 503, -4855, -99, 4829, -287, 6367, 2998, -1769, 2794, -5838, -5650, -1979, -8151, -975, -413, -2080, 6280, 1490, 2292, 6545, -1701, 2712, 1791, -2896]
915b896O825m735L07M640q199L410m89o563O234l904L19P533m167N827L345m662
931B825P065m371l477M525q741J68Q90p766M755l452k783O874n288L854O311l341
947a952Q457J909o66P814n504r66J690j1304L98m001q009M966m959J042O724l854
963h215P032K702l413Q194k747m88O872n587L755J541o432M287p025o224K242
978c506j0092N20L175m490R430K954K680J1139k559K928L026r209K204n006p674
993d480M468o401O40M584n960N243j108n618N880n352m27P438k892P810N379j640
1009G564Q192m453l659J788j1498k171j653p389O415r04J218R484k625M068L671
1024H048q055L406l810n844N356m394K874O296l405P139Nn318M429p656l590K404
$$ y = [-2896, 3929, -806, -499, 4141, -4058, -648, -1137, -7700, -1466, -5370, -5051, 2482, -1685, 4142, 7487, 2825, 9890, 5519, 2042, 6567, -2174, -2006, -1116, -8882, -4127, -7579, -10362, -3488, -8776, -4922, 1389, -1952, 6505, 8414, 7748, 15562, 10058, 9092, 10782, -522, -124, -4125, -12134, -7168, -12127, -11085, -4361, -8215, -1183, 1519, -1894, 6300, 3553, 3065, 9937, 4350, 8105, 9646, 3214, 7501, 476, -5748, -3506, -13598, -13078, -9903, -14393, -4963, -2009, 671, 11810, 9251, 12179, 15205, 5996, 8200, 3194, -4480, -12, -6413, -5773, -1189, -7149, -1906, -3014, -8632, -2752, -8104, -8531, -1093, -3985, 3825, 9204, 7564, 15756, 11303, 7644, 9432, -2066, -4237, -5890, -13279, -6864, -7768, -6550, 2934, 309, 4377, 8048, -7, 3399, -411, -6255, -899, -5293, -2419, 3877, 472, 7611, 7616, 2298, 6727, -929, -4519, -2115]
1040b115p017M457J804k561Q821k707o09M764p506K113Q16n805P272q56R14Q356
1056A0141m570L187J068r130J814o047o886L417n666K637N797k422Q959J670k253
1071A716O459n637j501K823o278M577R07k607P422l393p33K910r068L38k415p047
1087a1527M254k331J396Q419k053P049M306m342N070m024n250K042p882K08J218
1102c447m625O772Q0j543P224m132N99K816n849M191j141l456O461m834R96L625
1118C737o552L270k81m545N085l175N97M542m743M624J103m955N296l716k595
1133b308L468n579K529J513m633O493j489j737N663m990J139J697n456M748j281
1148b23k119O788l885K374L329n608L354j525n136L670n591m52L011n813N046
$$ y = [-2115, -9132, -4675, -2871, -5432, 3389, 682, 73, 4837, -2669, -556, 260, -5545, 1727, 871, 1785, 10141, 5571, 8758, 9826, 696, 2510, -3537, -10423, -7006, -12672, -10035, -4238, -6660, 2299, 3969, 1716, 8175, 2538, 1037, 3860, -2418, 2159, 3066, 459, 7881, 4488, 3755, 6665, -2403, -2065, -4480, -11527, -7273, -9604, -8208, 211, -1842, 5207, 9513, 5171, 10241, 6217, 967, 3009, -4873, -4665, -3447, -8072, -1300, -1220, -2763, 4461, 329, 928, 3744, -2105, 2086, 945, -2511, 3950, -884, 112, 3737, -2815, 455, 174, -4371, 714, -2461, -1864, 2678, -2065, 2559, 3662, -1293, 4003, 287, -2308, 1160, -4419, -1890, -377, -5010, 1483, -6, -1743, 3920, -1070, 69, 1766, -3690, 1058, -223, -2342, 4446, 561, 2935, 6264, 656, 4010, 2485, -2651, 1019, -4572, -5024, -2013, -7826, -2780]
1163b780J486l156P159k036M78M584n294K923r6n722N233l602j570N059m423L105
1179A348K214m413M890k890k946M093o562L91J993n257M924j25j189P126k578
1194A019K499L388n683L644j557n638L801m528o15L547n179M678R22l552O504
1209C250k674j233M270n293K809P55m614M888k616j713N343n113K116K466m942
1224b301N147j741k404M924m936L77K425o359L945j284l014N381l014J435M365
1239B946m042M458L23l946M817l982r32L516n401L694J025l599M884k670j879
1254g88L301o369R03N33n211M340j611j93O041k238L756M181l918M516j365l593
1270B285L157n618n94J572n821L043o48l173N444k979R45M142l947L928J049l635
$$ y = [-2780, -1294, -4450, 2709, 673, 1151, 5735, 441, 3364, 3268, -2454, 2779, -823, -2393, 2666, -1757, 1348, 3562, -851, 4039, 1149, -1797, 2296, -4266, -3875, -1882, -7139, -2215, -2340, -3529, 3597, 1019, 3518, 6906, 1223, 4867, 3310, -2328, 1473, -3055, -3670, -123, -5302, -624, 298, -3254, 3250, 576, -657, 3613, -1680, 1129, 1884, -2730, 2158, -458, -2171, 3172, -1941, 175, 2641, -2301, 2846, 1105, -1299, 3625, -1311, -934, 1491, -4868, -923, -2207, -5221, 160, -2854, -1419, 2946, -1096, 3362, 3685, -261, 4556, 574, -358, 3158, -2243, 1451, 2476, -1123, 3761, 1091, -788, 2513, -3856, -2953, -2420, -7631, -3291, -4902, -5095, 946, -1292, 2464, 6645, 2727, 7243, 5878, 2285, 5442, -176, -770, 802, -5019, -1976, -2624, -5797, -353, -3332, -2387, 1755, -2192, 1736, 2785, -850]
1286h50N036l514p45L221m656K008J116l914M758k482r54M013n322J705P69m930
1302d741M058j926j663N538k855K757L369l770M331j583l466L448m876j45J982
1317D58m596L790J08k544N236l144m4L195n058K346m00l158M287k413K96L995
1333B354l859K861J311l947M375k147j465M155m050K064J421m570L845k719k637
1348c008K972m365J348K586l198M301M61j664M332l562K40J814n505L100n76k456
1364c180N204k132J093L719l682K074o68m642K729l786j272L554l375L786K093
1379A515k245N156j708k217L106n237P10J083m269M327r69j085M833l253R06J952
1395B605n066K622j347k789M290k464J156L916l251L322K4l361L523l523r93L133
$$ y = [-850, 4186, 672, -73, 3148, -1508, 500, 1616, -2298, 2460, -22, -976, 3037, -2285, -580, 189, -4741, -683, -2609, -4272, 1266, -1589, 1168, 4537, 767, 5098, 3515, 49, 3497, -1379, -1524, 458, -4138, -348, -240, -2784, 2452, -692, -736, 2459, -2599, -253, -653, -3811, 476, -1937, -1641, 2354, -1505, 1356, 2667, -1280, 3095, 948, -517, 3638, -412, 1652, 3073, -1497, 2348, -371, -3008, -36, -4401, -3053, -467, -3665, 636, 1097, -567, 3765, 203, 443, 2257, -3248, -148, -724, -3180, 2024, -108, 985, 4704, 1022, 3096, 2428, -2214, 515, -3271, -4543, -989, -4364, -578, 1515, -730, 4426, 2718, 501, 3607, -1630, -920, 163, -4106, 221, -748, -1833, 3000, -253, 653, 2605, -2461, 161, -1186, -3975, 315, -2149, -993, 2923, -328, 2994, 3018, -343, 3180, -343, -1336, 1797]
1411A797m409L163J160l124M553k928j431K452m866J250O66l753M996l91l12N142
1427C965k874J630J619m534K243j816k762L466l547J591K901l637L977m77l309
1442a564L619l658q41K776l788L369J168k075M702j778j041K573n217J146o5m200
1458d874L845j686k63M602k686K377J966l549L203k003j836L236l882J658K414
1473B522l831L689o67k930K930l634m45J796m168L379M70j722N125j707K63K680
1489C750l652J630n84l468L264k744l63L797l044K063J398l291L730k708j148
1504a370K811l776J783J396l085L752o87j736L644l184P28Q70l894L071m60k419
1520b556M284k522K07K364l658K555q47k600L917k628K65L438k663K286P51k865
$$ y = [1797, -2612, 551, 1711, -1413, 3140, 212, -1219, 1233, -3633, -2383, -1717, -5470, -474, -865, -1177, 3965, 1091, 2721, 4340, -194, 2049, 233, -2529, 937, -2610, -1019, 1882, -1755, 2222, 1745, -1564, 2055, -1603, -2444, 332, -3456, -87, 1081, -994, 3708, 1930, 889, 3462, -1755, -609, -674, -4874, -1029, -2715, -2978, 1624, -1062, 1315, 3281, -268, 2935, 932, -904, 2332, -1550, 108, 2522, -1309, 2380, 1713, -1217, 1713, -1921, -2366, -570, -4738, -1359, -889, -2611, 2514, 807, 1070, 3750, 98, 1728, 1144, -2324, 940, -1804, -2167, 1630, -1414, 649, 2047, -1244, 2486, -222, -1370, 1441, -2335, -552, 844, -2241, 1511, 824, -912, 2732, -452, 276, 1146, -2748, 323, -137, -2556, 1728, -794, -587, 1777, -1881, 674, -173, -2773, 1144, -1484, -1219, 2219, -444, 1842, 2593, -272]
1536b72L215k717p91K621m372J829R29l275L585j070j172L330l394J383R63l735
1552b943L178j091j475M041k441J157K477k860K923j321k303L018l348l07K514
1567A219l714K661L16k297L584k303K81K594l848J864L32l284L262j845p49L182
1583A255l176K166J280l552M124j663j416L476l189P71J750l219K703j430j952
1598b072L678l336N31K938l240K670k28k075L422k988oK636m128K277N54k805
1614b172L230j878k42K635k999K243N73l496L404k119j526L366l094J811J786
1629A522k424L407q94j444L191l490N44J387m104K448p44j945L231k649J066K155
1645A257l171K506j7k259K985k144k21K168l128K571Q13k492L467j707n38K514
$$ y = [-272, 2943, 226, -565, 2056, -2316, -487, 442, -2833, 752, -318, -1490, 1840, -1554, -171, 792, -2943, 235, -856, -2331, 1710, -731, 426, 2903, 43, 2966, 1645, -658, 2360, -988, -1295, 1219, -2495, 166, 482, -1815, 1769, -534, -253, 2341, -1507, 357, 689, -2595, 667, -1178, -1927, 1255, -1921, 245, 1525, -2027, 2097, 434, -982, 2494, -695, 76, 1826, -1393, 1310, -120, -2072, 1606, -1730, -1199, 1739, -1501, 1169, 941, -1134, 2288, -700, -706, 1930, -2198, 79, 633, -2172, 1058, -820, -1062, 1573, -1426, 817, 1390, -2106, 1298, -821, -2347, 1019, -2075, -264, 1522, -902, 2505, 1611, 167, 3358, -132, 412, 1799, -2305, 143, -601, -2546, 685, -1964, -898, 1257, -1914, 592, 575, -1684, 1301, -843, -1064, 1104, -2024, 547, 1360, -1132, 2335, 628, 90, 2604]
1661B604k996J234K41k611K843j835j090K913l060R72J259k516K603n31j373L003
1677A660k967J356J334k958K573n01j987L058k553M44J979l001K570k26k219L147
1693A709k237m91K226l182J844K86j677L307j585k06K949l227J453M99l136K372
1709I04j780j434K524k958J329J374k639L329l40j307L427k661O26J606l138K525
1725A387l90j966L277k431k04K150l002J705l52k281L081k071m05K585k732J804
1741A55P78k391K950j701r87K893l268J580P85k864L124j277j042K936k542J139
1757B68J227k833K574n55j779L437k804L76J612l200K410q47k014L138k286j17
1773a393K391k758K301N56k512L308k188l40K329l401J825N84k612K866j396n59
$$ y = [2604, -392, 842, 1083, -1528, 1315, -520, -1610, 1303, -1757, -785, 474, -2042, 561, 30, -1343, 1660, -1307, 49, 1383, -1575, 998, 497, -1490, 1568, -985, -541, 1438, -1563, 1007, 781, -1438, 1709, -528, -1019, 1207, -1975, -131, 155, -1522, 1785, 200, -6, 2943, -284, 1169, 1668, -1468, 904, -876, -2310, 214, -2744, -1415, -41, -2680, 649, 309, -998, 2429, -232, 394, 2000, -1138, 1387, 997, -969, 2308, -123, -327, 1823, -1179, 526, 174, -2107, 974, -1097, -1502, 1083, -1649, 155, 933, -1458, 1492, -209, -1196, 1697, -1571, 9, 794, -2070, 1054, -223, -1265, 1671, -871, 268, 1495, -1338, 1236, 681, -1098, 2339, -465, -89, 1523, -1677, 733, -114, -2128, 1010, -1276, -1393, 998, -1760, 541, 1097, -1415, 1893, -295, -635, 1694, -1707, 118, 702, -1910, 956, -440, -999]
1789i99K815k668J421J189k936K744j155j438K866k756P06J652l153K468o52j796
1805a692K652k710N46J979k866K259M43k128L433k166Q8K057k841K207r0k383
1821a212K859j794q57K574l218J553R75k766L023j091j133K707k433J352J109
1836A648k864K776j249j452K537k901M83J251k626K529o13j609L108k004R77J770
1852A761k413K175L87j951K349j634m60J560l055J222J7k319K650j650k17K402
1868H24k440J757Q11k202K776r70j157K555k578P47J200k641K090j068j329K461
1884H36k476O08J837k596K427J06j300L325k035K70J756l167J698o01k389K150
1900D49k292n9K044k716K018O63j885L106j037n02K535k474J242Q17k604K258
$$ y = [-999, 1816, -852, 569, 1758, -1178, 1566, 411, -1027, 1839, -917, -211, 1441, -1712, 756, 104, -1692, 960, -1750, -1204, 775, -2091, 168, 611, -1517, 1916, -250, -162, 1895, -946, 1261, 1171, -1212, 1647, -147, -1004, 1570, -1648, -95, 880, -1886, 1137, 46, -1087, 1620, -813, 539, 1648, -1216, 1560, 311, -1141, 1396, -1505, -1022, 229, -2397, 132, -481, -2090, 1018, -986, -9, 1761, -652, 1523, 1910, -41, 2308, 674, 214, 1774, -1281, -59, -42, -2361, 289, -1361, -1578, 824, -1616, 141, 952, -1250, 1526, 556, -601, 1954, -624, 123, 1323, -1318, 772, -296, -1625, 836, -1640, -1032, 805, -1791, 636, 742, -558, 2767, 732, 1002, 2758, -409, 1289, 688, -1701, 449, -1843, -1902, 142, -2574, -556, 107, -1778, 1328, 291, -211, 2324, -150, 1092, 1909, -695, 1563]
1916A563j355j219K140k769Q07J247k851K903m86j143L047j859O72J464k805K006
$$ y = [1563, 208, -1011, 1129, -1640, -833, 414, -2437, 466, -20, -1163, 1884, 25, 697, 2161, -644, 1362]
$$ [...]
8191B64
##END NTUPLES=NMR FID
##END=
