##TITLE=1H_Pr 70 mg
 CDCl3,8 sc, 
 3.03.2021
##JCAMPDX= 6.0         $$ Bruker NMR JCAMP-DX V2.0
##DATA TYPE= NMR FID
##DATA CLASS= NTUPLES
##ORIGIN= UXNMR, Bruker Analytische Messtechnik GmbH
##OWNER= root
$$ XWIN-NMR		Version 3.5
$$ Wed Mar  3 10:38:49 2021 Russian Standard Time (UT+4h)  she@DPX200
##.OBSERVE FREQUENCY= 200.1315066352
##.OBSERVE NUCLEUS= ^1H
##.DELAY= (6, 6)
##.ACQUISITION MODE= SIMULTANEOUS
##.ACQUISITION SCHEME= undefined
##.AVERAGES= 8
##.DIGITISER RES= 18
##SPECTROMETER/DATA SYSTEM= spect
##.PULSE SEQUENCE= zg30
##.SOLVENT NAME= CDCl3
##.SHIFT REFERENCE= (INTERNAL, CDCl3, 0, 15.7039)
##AUDIT TRAIL= $$ (NUMBER, WHEN, WHO, WHERE, WHAT)
$$ ##TITLE= Audit trail, XWIN-NMR		Version 3.5
$$ ##JCAMPDX= 5.01
$$ ##ORIGIN= Bruker BioSpin GmbH
$$ ##OWNER= she
$$ F:/spectra/data/she/nmr/H-F/1/audita.txt
$$ ##AUDIT TRAIL=  $$ (NUMBER, WHEN, WHO, WHERE, WHAT)
(   1,<2021-03-03 10:37:41.23 +0400>,<she>,<DPX200>,
      <created by zg, POWCHK disabled, PULCHK disabled
       configuration hash MD5:
       00 E9 B6 7A A2 85 ED C7 34 08 36 98 17 FE 4E 26
       data hash MD5: 16K
       DF 41 DA 09 76 73 49 41 CC CB 0A 58 85 C3 AD 63>)
$$ ##END=
$$ 
$$ hash MD5
$$ 06 1F 42 7E D8 53 74 C6 A1 9C 05 83 03 67 5C 58
##$RELAX= 
##$RELAX= 
##$RELAX= 
##$RELAX= 
##$RELAX= 
##$RELAX= 
$$ Bruker specific parameters
$$ --------------------------
##$DU= <F:/spectra>
##$EXPNO= 1
##$NAME= <H-F>
##$PROCNO= 1
##$TYPE= <nmr>
##$USER= <she>
##$AMP= (0..31)
100 100 100 100 100 100 100 100 100 100 100 100 100 100 100 100 100 100 
100 100 100 100 100 100 100 100 100 100 100 100 100 100 
##$AQSEQ= 0
##$AQ_mod= 1
##$AUNM= <au_zg>
##$AUTOPOS= <>
##$BF1= 200.13
##$BF2= 200.13
##$BF3= 200.13
##$BF4= 200.13
##$BF5= 200.13
##$BF6= 200.13
##$BF7= 200.13
##$BF8= 200.13
##$BYTORDA= 1
##$CFDGTYP= 0
##$CFRGTYP= 5
##$CHEMSTR= <none>
##$CNST= (0..31)
1 1 145 1 1 1 1 1 1 1 1 1 1 1 1 1 1 1 1 1 1 1 1 1 1 1 1 1 1 1 1 1 
##$CPDPRG= <>
##$CPDPRG1= <>
##$CPDPRG2= <>
##$CPDPRG3= <>
##$CPDPRG4= <mlev>
##$CPDPRG5= <mlev>
##$CPDPRG6= <mlev>
##$CPDPRG7= <mlev>
##$CPDPRG8= <mlev>
##$CPDPRGB= <>
##$CPDPRGT= <>
##$D= (0..31)
0 1.2 0 0 0 0 0 0 0 0.06 0 0.03 0 0 0 0 0.0002 0 0 0 0 0 0 0 0 0 0 0 0 
0 0 0 
##$DATE= 1614753460
##$DBL= (0..7)
120 120 120 120 120 120 120 120 
##$DBP= (0..7)
150 150 150 150 150 150 150 150 
##$DBP07= 0
##$DBPNAM0= <>
##$DBPNAM1= <>
##$DBPNAM2= <>
##$DBPNAM3= <>
##$DBPNAM4= <>
##$DBPNAM5= <>
##$DBPNAM6= <>
##$DBPNAM7= <>
##$DBPOAL= (0..7)
0.5 0.5 0.5 0.5 0.5 0.5 0.5 0.5 
##$DBPOFFS= (0..7)
0 0 0 0 0 0 0 0 
##$DE= 6
##$DECBNUC= <off>
##$DECIM= 32
##$DECNUC= <off>
##$DECSTAT= 4
##$DIGMOD= 1
##$DIGTYP= 9
##$DL= (0..7)
0 120 120 120 120 120 120 120 
##$DP= (0..7)
150 150 150 150 150 150 150 150 
##$DP07= 0
##$DPNAME0= <>
##$DPNAME1= <>
##$DPNAME2= <>
##$DPNAME3= <>
##$DPNAME4= <>
##$DPNAME5= <>
##$DPNAME6= <>
##$DPNAME7= <>
##$DPOAL= (0..7)
0.5 0.5 0.5 0.5 0.5 0.5 0.5 0.5 
##$DPOFFS= (0..7)
0 0 0 0 0 0 0 0 
##$DQDMODE= 0
##$DR= 18
##$DS= 0
##$DSLIST= <SSSSSSSSSSSSSSS>
$$ [...]
##$SUBNAM2= <"">
##$SUBNAM3= <"">
##$SUBNAM4= <"">
##$SUBNAM5= <"">
##$SUBNAM6= <"">
##$SUBNAM7= <"">
##$SUBNAM8= <"">
##$SUBNAM9= <"">
##$SW= 16.9725356469052
##$SWIBOX= (0..15)
0 0 2 0 0 0 0 0 0 0 0 0 0 0 0 0 
##$SW_h= 3396.73913043478
##$TD= 16384
##$TD0= 1
##$TE= 0
##$TE2= 300
##$TE3= 300
##$TEG= 300
##$TL= (0..7)
0 120 120 120 120 120 120 120 
##$TP= (0..7)
150 150 150 150 150 150 150 150 
##$TP07= 0
##$TPNAME0= <>
##$TPNAME1= <>
##$TPNAME2= <>
##$TPNAME3= <>
##$TPNAME4= <>
##$TPNAME5= <>
##$TPNAME6= <>
##$TPNAME7= <>
##$TPOAL= (0..7)
0.5 0.5 0.5 0.5 0.5 0.5 0.5 0.5 
##$TPOFFS= (0..7)
0 0 0 0 0 0 0 0 
##$TUNHIN= 0
##$TUNHOUT= 0
##$TUNXOUT= 0
##$USERA1= <user>
##$USERA2= <user>
##$USERA3= <user>
##$USERA4= <user>
##$USERA5= <user>
##$V9= 5
##$VALIST= <valist>
##$VCLIST= <CCCCCCCCCCCCCCC>
##$VD= 0
##$VDLIST= <DDDDDDDDDDDDDDD>
##$VPLIST= <PPPPPPPPPPPPPPP>
##$VTLIST= <TTTTTTTTTTTTTTT>
##$WBST= 1024
##$WBSW= 4
##$XGAIN= (0..3)
0 0 0 0 
##$XL= 0
##$YL= 0
##$YMAX_a= 681604
##$YMIN_a= -1039814
##$ZGOPTNS= <>
##$ZL1= 120
##$ZL2= 120
##$ZL3= 120
##$ZL4= 120
##$ABSF1= 10
##$ABSF2= 0
##$ABSG= 5
##$ABSL= 3
##$ALPHA= 0
##$AQORDER= 0
##$ASSFAC= 0
##$ASSFACI= 0
##$ASSFACX= 0
##$ASSWID= 0
##$AUNMP= <proc_1d>
##$AZFE= 0.1
##$AZFW= 0.1
##$BCFW= 1
##$BC_mod= 2
##$BYTORDP= 1
##$COROFFS= 0
##$CY= 11.3945322036743
##$DATMOD= 1
##$DC= 2
##$DFILT= <>
##$DTYPP= 0
##$F1P= 15.9154993809931
##$F2P= -4.1035820241983
##$FCOR= 0.5
##$FTSIZE= 0
##$FT_mod= 4
##$GAMMA= 1
##$GB= 0.15
##$INTBC= 1
##$INTSCL= 1
##$ISEN= 128
##$LB= 0.24
##$LEV0= 0
##$LPBIN= 0
##$MAXI= 10000
##$MC2= 0
##$MEAN= 0
##$ME_mod= 0
##$MI= 1.114404
##$NCOEF= 0
##$NC_proc= 0
##$NLEV= 6
##$NOISF1= 3.799351
##$NOISF2= 2.8
##$NSP= 1
##$NTH_PI= 0
##$NZP= 0
##$OFFSET= 15.70392
##$PC= 1
##$PHC0= -10762.86
##$PHC1= 14.00094
##$PH_mod= 1
##$PKNL= yes
##$PPARMOD= 0
##$PSCAL= 0
##$PSIGN= 0
##$REVERSE= no
##$SF= 200.130013532006
##$SI= 16384
##$SIGF1= 3
##$SIGF2= 2
##$SINO= 400
##$SIOLD= 16384
##$SREGLST= <1H.CDCl3>
##$SSB= 0
##$STSI= 0
##$STSR= 0
##$SW_p= 3612.71676300578
##$SYMM= 0
##$S_DEV= 0
##$TDeff= 0
##$TDoff= 0
##$TI= <>
##$TILT= no
##$TM1= 0
##$TM2= 0
##$TOPLEV= 0
##$USERP1= <user>
##$USERP2= <user>
##$USERP3= <user>
##$USERP4= <user>
##$USERP5= <user>
##$WDW= 1
##$XDIM= 8192
##$YMAX_p= 0
##$YMIN_p= 0
$$ End of Bruker specific parameters
$$ ---------------------------------
##NTUPLES= NMR FID
##VAR_NAME=  TIME,          FID/REAL,        FID/IMAG
##SYMBOL=    X,             R,               I
##VAR_TYPE=  INDEPENDENT,   DEPENDENT,       DEPENDENT
##VAR_FORM=  AFFN,          ASDF,            ASDF
##VAR_DIM=   8192,          8192,            8192
##UNITS=     SECONDS,       ARBITRARY UNITS, ARBITRARY UNITS
##FACTOR=    0.0002944,     1,               1
##FIRST=     0,             0,               0
##LAST=      2.4114304,     0,               0
##MIN=       0,             -1039814,        0
##MAX=       2.4114304,     681604,          0
$$ Real data points
##PAGE= N=1
##DATA TABLE= (X++(R..R)), XYDATA
$$ [...]
1771e11R82o46o73R54j04L2k91l76J748j559K75K11k03J037j503N50P95q24M24
$$ -511 471 -175 -848 106 2 34 -257 -633 1115 -444 -169 42 -161 876 -627 -77 718 -106 318
1790C18o76O34M39j258P82K52m2p2q71J356k48p44M97o88J079q55l44Q86k23N3
$$ 318 -358 276 715 -543 239 491 449 377 -494 862 614 -130 367 -321 758 -97 -441 445 222 275
1810B75k57k07P66n80l82M26R7L17j054L62O77o37J41m24R02l47q73Q16k57L79
$$ 275 18 -189 577 -3 -385 41 138 455 -599 -237 440 -197 -56 -480 422 75 -798 18 -239 140
1830A40j25r64J213k97l81N27p19R40o21o84J332p38L11q6p33J527j083k30N35
$$ 140 15 -949 264 -33 -414 113 -606 334 -287 -971 361 -377 -66 -152 -885 642 -441 -671 -136
1849a36M4K14n83NJ117o85k17K31j13P46j081M35J49nm38j11Q60k60j20q3j80
$$ -136 -92 122 -461 -456 661 -24 -241 -10 -123 623 -458 -23 126 121 -317 -428 432 172 52 -31 -211
1870b11P48n61Q3L35k87P20r37j29J475j682L21L82m46J132j385L12O50q78Q12
$$ -211 537 -24 59 394 107 827 -110 -239 1236 -446 -125 257 -189 943 -442 -130 520 -358 454
1889D54m63m39P73q27O18K80p61P91q42M35L51r20N61N8l72K79l22K04K93m42
$$ 454 -9 -448 325 -502 116 396 -365 426 -416 19 370 -550 11 69 -303 -24 -346 -142 151 -291
1909b91q8N10k46j52N7m2N18k60q35J048r0p48P04r40J399l66j284J442o65O89
$$ -291 -379 131 -115 -267 -210 -252 266 6 -829 219 129 -619 85 -855 544 178 -1106 336 -329 360
1929C60j88j148J555l00r05J088j060R45L89j588J340j68j16K57j146J203J21
$$ 360 172 -976 579 279 -626 462 -598 347 736 -852 488 320 204 461 -685 518 639
1946F39j099N69mK6M11q36L99M17q61N71r1n6K41j71n47P77n06K44M33j252J123
$$ 639 -460 109 105 131 542 -294 105 522 -339 232 141 85 326 155 -392 385 -121 123 556 -696 427
1967D27l93l80R22j333Q89L63j258R09j47n41J302j646M31J173j385J071j220
$$ 427 34 -346 576 -757 132 495 -763 146 -1 -542 760 -886 -455 718 -667 404 -816
1984h16M05J162j328L42L67o52J048j041l18J463p78Q9k25j35J101p06k89J01
$$ -816 -411 751 -577 -235 132 -520 528 -513 -831 632 -146 -57 -282 -417 684 -22 -311 -210
2002b10M32j9l99l01N77M75r08M68j99J91K95q88M06P62r36M68k13l92J228j313
$$ -210 222 203 -196 -497 80 555 -353 115 -84 107 402 -486 -80 682 -254 214 1 -391 837 -476
2022d76N81L47r80J235p87k82J054j103J015k49r46J458q79k25O89q22R58l03
$$ -476 105 452 -528 707 -80 -362 692 -411 604 355 -591 867 -12 -237 452 -370 588 285
2040B85j078J062k67l4J89n47N34R3n75L40L0l6O0l87J39O17o98Q6L9k65O56l56
$$ 285 -793 269 2 -32 157 -390 144 237 -338 2 32 -4 56 -331 -192 425 -273 -187 -148 -413 243 -113
2062a13o21J025o80L69oo50J162q13j84O95o13M44M58j253J122p81J46N18q73
$$ -113 -734 291 -389 -20 -26 -676 486 -327 -511 184 -429 15 473 -780 342 -439 -293 225 -648
2081f48J140n10m23P48k63J47J40m24K90K7n10M83k03O2L10o13N20k69L22j47
$$ -648 492 -18 -441 307 44 191 331 -93 197 224 -286 197 -6 56 366 -247 273 4 326 179
2101A79N7m10K71j26K31P1k72L55k20l66K50K60n32M02m69L78N34r87Q39p53J03
$$ 179 236 -174 97 -29 202 273 1 356 136 -230 20 280 -252 150 -319 59 593 -394 445 -308 -205
2122b05O63j015N16k16n5L75n30J54Q15q12M43j43k68N71p02J24J32N9P7k03J90
$$ -205 458 -557 -41 -257 -312 63 -467 -313 502 -310 133 -10 -278 293 -409 -285 -153 -94 -17 -220 -30
2143c0K58l02p9K6J99r1n4J54l48N69k81r2J11q3Q4l9j6N77p52M91k72j43M23
$$ -30 228 -74 -153 -127 72 -19 -73 81 -267 302 21 -71 40 -43 41 2 -14 563 -189 302 30 -113 310
2166C10m92L72K10o00L44J1k04M55n69M22j75O6N9m00M22j07l26K59k25M21k59
$$ 310 -182 190 400 -200 144 155 -49 406 -163 259 84 150 209 -191 231 124 -202 57 -168 253 -6
2187fk95M32j22j40J50R6n3k47J94j32J82L10p37M04Q9k20M2k23K73K6j88R4J2
$$ -6 -301 131 9 -131 19 115 62 -185 9 -123 59 369 -368 36 125 -95 -53 -276 -3 23 -165 -71 -59
2210e9k57K70r1L24k25m9L9l16M55j24m48N69J6j44k20K53R2k34J53lJ28q4j76
$$ -59 -316 -46 -137 187 -38 -87 -48 -364 91 -33 -481 88 104 -40 -260 -7 85 -149 4 1 129 45 -131
2233a31J74K11k90L03l72L50j38j70K44k8J2j66P2K77k40j75L29j3P4m39L8L79
$$ -131 43 254 -36 267 -105 245 107 -63 181 153 165 -1 71 348 108 -67 262 249 323 -116 -78 301
2255C01j2j54r0k50L35j73J31oj02j4l9K1M8k7P3k80M6L85k97pL02k75ml42M65
$$ 301 289 135 45 -205 130 -43 88 82 -20 -34 -73 -52 -4 -31 42 -238 -192 193 -104 -111 191 -84 -88 -430 35
2280C5n1k39L39k91L22K5l17J68J60k12k00O5J71r7M5p0J70J71l13k03K57K74
$$ 35 -16 -255 84 -207 115 140 -177 -9 151 -61 -261 -196 -25 -122 -77 -147 23 194 -119 -322 -65 209
2302B09r2l87K98K56l39P9J94l34L98n14L15K40n15L60k09L61l08j21m2L62j99
$$ 209 117 -270 28 284 -55 24 218 -116 282 -232 83 323 -192 168 -41 320 12 -109 -151 211 12
2323A2J50j54P7j45J09k14J18R0J7k7J88k28j18J18J99k18j51J80K6N7l31m1L85
$$ 12 162 8 85 -60 49 -165 -47 43 60 33 221 -7 -125 -7 192 -26 -177 3 29 86 -245 -286 99
2346I9j27r3O9m1K09k77k81N45j74p3k91P3M27m39L53J87n9J83m08k9L84l65q2
$$ 99 -28 -121 -52 -93 116 -161 -442 103 -71 -144 -435 -362 65 -374 -21 166 107 290 -118 -147 237 -128 -210
2369b10R3k57N06l33J9K93j48J20k18K13J75j46l16L9K78r2oM8J18p9j74R6K33
$$ -210 -117 -374 132 -201 -182 111 -37 83 -135 78 253 107 -209 -170 108 16 10 58 176 97 -77 19 252
2392B52l76M6M9K68n6k44MM48o01L30n0J14j71j72M70j76k14L73m20J15J66l81
$$ 252 -124 -78 -29 239 183 -61 -57 391 -210 120 70 184 13 -159 311 135 -79 294 -126 -11 155 -226
2414b26N39o8l48J15l59K33K67k95k87M94RJ45o67L80K45k52j8q3N7L22l17l91
$$ -226 313 245 -103 12 -347 -114 153 -142 -429 65 74 219 -448 -68 177 -75 -93 -176 -119 203 -114 -505
2436e05P17l32l76J99j15N27j41m12M01o3J15p6k81M54j2m33P42m85L0M8k67M27
$$ -505 212 -120 -496 -297 -412 115 -26 -438 -37 -100 15 -61 -342 112 100 -333 409 -76 -46 2 -265 162
2458A62o6j59R3Qj77K87l25M58p0n98O53m01K09j0J72L0k10j38J16o2J7J92k75
$$ 162 96 -63 30 38 -139 148 -177 281 211 -387 266 -135 74 64 236 266 56 -82 34 -28 -11 181 -94
2481i4kP03p04J50j76P5M21o78J74M09l25j18J63k47N58p54L59J97l42K98Lj44
$$ -94 -96 607 -97 53 -123 -48 373 -305 -131 278 -47 -165 -2 -249 309 -445 -86 111 -231 67 70 -74
2503g4M45p47Q9M33j50N91p88j61M32j58j14L33q4J25k69r4K13K6J48j97J16r5
$$ -74 371 -376 -287 146 -4 587 -201 -362 70 -88 -202 131 47 172 -97 -191 22 48 196 -1 115 20
2525B0k57o6J56K78j24K68k05J6O1k58J11J13p7PJ02k17M50n08M53k60j95J60
$$ 20 -237 -303 -147 131 7 275 70 86 147 -111 0 113 36 43 145 -72 378 -130 323 63 -132 28
2547B8j87K05L9j52K51Kj41N4j65J29P6l57J03K05k24L85k82oM56o07L2J70ON
$$ 28 -159 46 85 -67 184 186 45 99 -66 63 139 -218 -115 90 -134 251 -31 -37 419 -188 -156 14 20 25
2571B5m6l72M15J13l04O8m9O3j9J01J64k12J23k75L00M4o4m18N00q1j94J70l76
$$ 25 -21 -393 22 135 -169 -101 -150 -87 -106 -5 159 -53 70 -205 95 139 75 -343 157 76 -118 52 -324
2594c24J83J80l31J61J25K4p6J99k0r6j30J82j28M8J68j97M45k99l13K14L2j81
$$ -324 -141 39 -292 -131 -6 18 -58 141 121 25 -105 77 -51 -3 165 -32 413 114 -199 15 47 -134
2616a34J47j18J07J61k77J86Rj05J9K17l05K85l80P7L38m93L70m06K49K45k83
$$ -134 13 -105 2 163 -114 72 81 -24 -5 212 -93 192 -188 -111 227 -266 104 -302 -53 192 -91
2637i1Q9j4J44P0l55L9J26J51j05j70k5J74J4N3K1m71L48j47j24O16n44kJ04K76
$$ -91 -2 -16 128 198 -157 -118 8 159 54 -116 -141 33 47 100 121 -350 -2 -149 -273 343 -201 -203 -99 177
2661A77k74k39K86L97j15l53l3K71j0k43K83k3p3k73M33q4l34J8j13L69j27q0
$$ 177 -97 -336 -50 347 232 -121 -154 117 107 -136 147 124 51 -222 211 127 -207 -189 -302 67 -60 -140
2683a40J25K33l41J34r4M8N7Rj49J84k2j31K99j61J89k90k0N5J25k05J36R8k11
$$ -140 -15 218 -123 11 -83 -35 22 31 -118 66 44 -87 212 51 240 -50 -70 -15 110 -95 41 139 -72
2706g2J84r0r0K14q4Rp6J2Q0j91J25m6j70oJ65l2J90n3j32K8j1Q1j50RK25P9j73
$$ -72 112 22 -68 146 62 71 -5 7 87 -104 21 -25 -195 -201 -36 -68 122 69 -63 -35 -46 35 -115 -106 119 198 25
2733B5M4J03k31R6k48M14k81J99j72M39j88k61j85K87J46l17J08K42k01J04k44
$$ 25 69 172 -59 37 -211 203 -78 121 -51 388 200 -61 -246 41 187 -130 -22 220 19 123 -121
2754a21q0J61n2j55L71q7j46J5J48K81m92L24j15m6m7j57L12j4J77l06q8K82r9
$$ -121 -201 -40 -92 -247 124 37 -109 -94 54 335 -157 167 52 6 -41 -198 114 100 277 -29 -117 165 66
2777F6l45K61p6L95l94l1K42l00K01j22J04L53m86j12J90J28j57j24q4N86m45
$$ 66 -279 -18 -94 301 -93 -124 118 -182 19 -103 1 354 -132 -244 -54 74 -83 -207 -291 295 -150
2798a50J64O3J3m7j39J32OJ57k26lK48j11j91l9K47j32L2r9p3K14k33J48k16J34
$$ -150 14 77 90 43 -96 36 42 199 -27 -30 218 107 -84 -123 124 -8 24 -75 -148 66 -167 -19 -235 -101
2822a01Mq1J35J06j19Q1K61j25r9O1m2N8p6j86L9o2J41Q7k81K41J04k47P8K80
$$ -101 -97 -178 -43 63 -56 25 286 161 62 123 81 139 63 -123 -84 -146 -5 82 -199 42 146 -101 -23 257
2846B57j17j32k69K26J37k71N4j69J81K70l77J45K88k19J5o1J02K31m37r8M62
$$ 257 140 8 -261 -35 102 -169 -115 -284 -103 167 -210 -65 223 4 19 -42 60 291 -146 -244 218
2867B18k78k55L39j70M72n53N5L53k03l44L00j20L76k30J07j29j37M86m70l4M50
$$ 218 -60 -315 24 -146 326 -227 -172 181 -22 -366 -66 -186 190 -40 67 -62 -199 287 -183 -217 233
2888B33l84L31j35j64J65Rj72j9L63j64J83k34j56K44J19j03p7l04L00l6p4J49
$$ 233 -151 180 45 -119 46 55 -117 -136 227 63 246 12 -144 100 219 116 39 -265 35 -1 -75 74
2910G4j45L00k23l48J95o3K50M4j4Lm1o4qJ17K32k7m68K00qK31r5j37K7K59l85
$$ 74 -71 229 6 -342 -147 -210 40 84 70 73 32 -32 -40 77 309 282 -186 14 6 237 142 5 32 291 -94
2935i4k7L5j14K09j53Q8J72k2ml59K89K82k88j87L38l49J83j90J20L06l95K42
$$ -94 -121 -86 -200 9 -144 -56 116 94 90 -269 20 302 14 -173 165 -184 -1 -191 -71 235 -160 82
2957H2r9o6J59k8k69L38j44j24L94l31J58J7n8l3N4j74M97l14m1L7lL25k02l93
$$ 82 -17 -83 76 48 -221 117 -27 -151 243 -88 70 87 29 -4 50 -124 373 59 18 55 52 377 175 -218
2981b18M71k28J3O8j61L13j88m16M17R3j37J02m17L35J74m35L02j00J43j6k80
$$ -218 253 25 38 106 -55 258 70 -346 71 164 27 129 -288 47 221 -214 88 -12 131 115 -165
3002a65J95N9j79J38j08jL17m62l2K61o0J25N1k45M36m81K6N39o62M57q5l04L88
$$ -165 30 89 -90 48 -60 -61 256 -206 -238 23 -37 88 139 -106 330 -151 -125 414 -248 209 124 -180 208
3025B08l77J0K67k82K80k07P7K48l38N5J79j22J43l27j0N83m17K01j23l9q7P1
$$ 208 -169 -159 108 -174 106 -101 -24 224 -114 -59 120 -2 141 -186 -196 387 -30 171 48 9 -78 -7
3047gp8K18j0j56J77r0m6o9K67o7j65J34n9j24L78n8k43k2K80j83J56k91J00J50
$$ -7 -85 133 123 -33 144 54 8 -61 206 139 -26 108 49 -75 303 245 2 -20 260 77 233 -58 42 192
3071A92m66L00J18k19K80m43L9L63m30J50K09M6n8m04M94k03q9N7L10k66j71o4
$$ 192 -274 26 144 -75 205 -238 -199 164 -266 -116 93 139 81 -323 171 -32 -121 -64 246 -20 -191 -255
3093b55J00J80l3J88n2j98J31j68rO1J65k30J05L9m1L4k27L53j58Pr9J82p9J32
$$ -255 -155 25 -8 180 128 -70 61 -107 -116 -55 110 -120 -15 24 -17 17 -210 143 -15 -8 -107 75 -4 128
3117A28j49jJ2J25q0m3o0M8k19L78o5j39L21q9j04k15n4L05k15L6O4L4J21j15
$$ 128 -21 -22 -10 115 35 -8 -68 -20 -239 139 74 -65 256 167 63 -152 -206 99 -116 -80 -16 18 139 24
3141B4K15j03k25J65L4r6k40L85k42l6L40j95k52O1K00P8j97r7O26n25PK8P8J13
$$ 24 239 136 -89 76 110 14 -226 159 -83 -119 221 26 -226 -165 35 113 -84 -181 445 -80 -73 -45 33 146
3165A46k84J28O2l9j39l2J66J32k28J49j29K61l79j06L82j69j48O2L19j02q4N2
$$ 146 -138 -10 52 13 -126 -158 8 140 -88 61 -68 193 -186 -292 90 -79 -227 -165 154 52 -32 20
3187B0j17L73j17o4m7j46J72j05N9P1o7k24K49r4R3J12j95J8M4j06o2J58O7L20
$$ 20 -97 276 159 95 48 -98 74 -31 28 99 32 -192 57 -37 56 168 -27 -9 35 -71 -133 25 92 412
3211D12l42j81L32j76J87m85L24j88m0J16J35m8M8q0K7q5L34k95K7L1L9k60K28
$$ 412 70 -111 221 45 232 -253 71 -117 -157 -41 94 46 94 14 41 -44 290 -5 22 53 92 -168 60
3234F0Ok59j22L75j51JR6k9J26k70P2k6k0K58lk45P2j19Q8J69l0J44j28Rk28J16
$$ 60 66 -193 -315 60 -91 -90 6 -23 103 -167 -95 -121 -141 117 114 -131 -59 -178 -90 79 49 193 65 74 -154 -38
3260c8J08k8r5N8P5j81J19J0k41k6J01K27j5pk06j54J89j7l9R5K03k40R4r2L81
$$ -38 70 42 -53 5 80 -101 18 28 -213 -239 -138 89 74 67 -139 -293 -104 -121 -160 -65 138 -102 -8 -100 281
3285B81m65L56k57l0OJ73j46P5n5K20m4j51k34N65j63m7j38J5j1M07l89N9j32
$$ 281 -184 172 -85 -115 -109 64 -82 -7 -62 158 114 -37 -271 294 131 84 -54 -39 -50 357 -32 27 -105
3308a05J80r1j17N3M8oQ9j86L29j68l26J11K85J01q4r7j28K08P8J45k92j37K04
$$ -105 75 -16 -133 -80 -32 -38 51 -135 194 26 -300 -189 96 197 113 16 -112 96 174 319 27 -110 94
3331I4n4J86J71n32J36j24K03j16N5K24j38j02pM4j54J86j40p9K38r4k14J87j56
$$ 94 40 226 397 -135 1 -123 80 -36 19 243 105 3 -4 40 -114 72 -68 -147 91 -3 -217 -30 -186
3354a86L58l90N30j64j73j91J70k0J47k19R1K36l0k07L0k98M90j70m2K43k87K77
$$ -186 172 -218 312 148 -25 -216 -46 -66 81 -138 -47 189 159 -48 -18 -316 174 4 -38 205 -82 195
3376A95j92m2J93j91l3J93j84M28km13J5j56J51kJ55j35L27k05m0n5R2Kj78JK03
$$ 195 3 -39 154 -37 -70 123 -61 367 365 -48 -33 -189 -38 -40 115 -20 307 102 62 7 99 101 -77 -76 127
3401A27k55J65J20m30L94j60O8L6l43L10K31k33N7k46J60J3l65L68j78p3K40j23
$$ 127 -128 37 157 -273 121 -39 29 65 -278 32 263 30 87 -159 1 14 -351 17 -161 -234 6 -117
3423a17J89J34m85L65r6J0K00m80J27M70m95J01P6J90l48k05K30L78m21K09k2
$$ -117 72 206 -279 86 -10 0 200 -280 -153 317 -178 -77 -1 189 -159 -364 -134 244 -177 32 10
3444A0p5N9l26L16K32j46k02J13L0j29K92k94M68m94L06j00j80J35j74J38L32
$$ 10 -65 -6 -332 -16 216 70 -132 -19 11 -118 174 -120 348 -146 160 60 -120 15 -159 -21 311
3465C11l35J44l1k41L27j02m7L28k90k10m0J28K44l08k06N95j41j21L6j43K37
$$ 311 -24 120 89 -152 175 73 26 354 64 -146 -186 -58 186 -122 -328 267 126 5 41 -102 135
3486A35k48m8m9J50Q2J3j45K56j4k48K4R3J23J12l19o6J77K6J20m65M11j61J49
$$ 135 -113 -161 -210 -60 22 35 -110 146 132 -116 -92 1 124 236 -83 -149 28 54 174 -291 120 -41 108
3509A08j42J05j03J27J08l07J75l91J53K53r1O8j53J67O0n0j18j03pJ94P4j85
$$ 108 -34 71 -32 95 203 -104 71 -320 -167 86 -5 63 -90 77 137 87 -31 -134 -141 53 127 -58
3531e8P8o4r2J85m8j1l1J20j96J78j39J26Q6j29M8J25J92m74k6R3K39p9k11pK31
$$ -58 20 -44 -136 49 1 -10 -41 79 -117 61 -78 48 134 5 53 178 370 -104 -130 -37 202 123 -88 -95 136
3556A36j34p0O8j45J65j06M1j25J72l05J25J31K28M6o14M58m5j4j42P1q9L31l07
$$ 136 2 -68 0 -145 20 -86 -45 -170 2 -303 -178 -47 181 227 -387 71 26 12 -130 -59 -148 183 -124
3579a24j15J73P1k82L19k0%k53K72j0O4r9r5J85m5J11j28J33l93K79J07j27J88
$$ -124 -239 -66 5 -277 42 22 22 -231 41 31 95 -4 -99 86 41 152 24 157 -236 43 150 23 211
3602B11k57R6j46J43K5m15L30J08j92K16j50J47p5L9j43L41l41l3p8O0K65k03
$$ 211 -46 50 -96 47 72 -343 -13 95 -97 119 -31 116 41 80 -63 278 -63 -96 -174 -114 151 -52
3624e2k15J59j0J24j38j5J36k00P3r5J57j77J28P1J74J0k03J83l3j45P3j15L17
$$ -52 -267 -108 -118 6 -132 -147 -11 -211 -138 -233 -76 -253 -125 -54 120 130 -73 110 77 -68 5 -110 207
3647B07m15J4K1K60k29o2M0J76R8j33r2K89J9k99J35p0N20m00j60L23l15P6p8
$$ 207 -208 -194 -173 87 -142 -204 -164 12 110 -23 -115 174 193 -106 29 -41 479 79 -81 242 -73 3 -75
3670g5J0O3o4j65J83n9L66m01o6K38n6l1K56k4k15L9O9p0J8j45K27m9Q7j55q4
$$ -75 -65 -2 -66 -231 -48 -107 259 -142 -208 30 -26 -57 199 175 -40 -1 68 -2 16 -129 98 49 136 -19 -103
3695a03J98K46l39q1J60o9Mj76P9J03K59n49K64J49j55q5o1J90Pk67J97Q0p1J
$$ -103 95 341 2 -79 81 12 16 -160 -81 22 281 -268 -4 145 -10 -95 -156 34 41 -226 -29 51 -20 -19
3719a9m9K16m69L75j84J72q1q0J8K77j43K52k36j65J74k82K05j27J36J77l66J6
$$ -19 -68 148 -321 54 -130 42 -39 -119 -101 176 33 285 49 -116 58 -224 -19 -146 -10 167 -199 -183
3741a83K04l2l5J30n5P0k41J68J31m27N00j90N4kJ3m9J2o9j99L85J4k74J99q2
$$ -183 21 -11 -46 84 29 99 -142 26 157 -270 230 40 94 92 105 56 68 -1 -200 185 199 -75 124 42
3765D2J5k08J74OK91k91j40L2P2j21J21j66j10M83k40Q9o9j59L94k74oQ6j05N0
$$ 42 57 -151 23 29 320 29 -111 -79 -7 -128 -7 -173 -283 200 -40 49 -20 -179 215 -59 -65 21 -84 -34
3789c4k7k1K76k88J65j28O9J23j97p7J78k91k2J66K48j48J55l08J66J00j0k47
$$ -34 -61 -82 194 -94 71 -57 12 135 -62 -139 39 -252 -274 -108 140 -8 147 -161 5 105 95 -152
3811a52K26P4j98oK88k65j00J29k6P2K9n7J13J7l45K29J84J35m21N6L04n50K88
$$ -152 74 148 -50 -56 232 -33 -133 -4 -30 42 71 14 127 144 -201 28 212 347 -74 -18 286 -264 24
3834B4j38j02K10P9j76J69J5j25j40O4J61jQ0k17K70j65J25l6rJ76k52r1J04K9
$$ 24 -114 -216 -6 73 -103 66 81 -44 -184 -120 41 40 120 -97 173 8 133 97 88 264 12 -79 25 54
3858E4m3k49J51L38m80K53J19j63L13n53K78Q2j01j30m5J30J99k81k43K91oRK32
$$ 54 11 -238 -87 251 -229 24 143 -20 293 -260 18 100 -1 -131 -176 -46 153 -128 -371 -80 -86 -77 155
3881A55k82J49q1l35N34k25J54L9j16m5J15j04L5j62K36O2o2P7n3k49K35Q0k13
$$ 155 -127 22 -59 -394 140 -85 69 108 -8 -53 62 -42 -7 -169 67 129 67 144 91 -158 77 157 -56
3904e6K28l25K55j64P4Q9j16L7o9J09J97j43k30j4K04n5pl29M77j50l8k16K49
$$ -56 172 -153 102 -62 12 101 -15 22 -47 62 259 116 -114 -128 76 21 14 -315 162 12 -26 -242 7
3927GJ60j88o4K9K03k92K28p9L2J72l90l5L04k1N9j95r7M62l43O9L87p11N56m23
$$ 7 167 -21 -85 -56 147 -145 83 4 36 208 -182 -217 87 66 125 -70 -167 295 -48 21 408 -303 253 -170
3951a70l02J02K66J22mj10M6J35j62K5R8r2O3p0j42k2K08K03k45p3J60j63J78
$$ -170 -472 -370 -104 18 14 -96 -50 85 -77 -52 46 -46 17 -53 -195 -217 -9 194 -51 -124 36 -127 51
3974E1l0j05K88j77j24O1RJ15k02L08j5o9k57L94l10K57j52j03L8J71p6m23J44
$$ 51 21 -84 204 27 -97 -36 -27 88 -114 194 179 110 -147 247 -63 194 42 -61 -23 148 72 -351 -207
3997b07L22J95n36R3K94k01J52l81J81K82l49J02J01l8O5j01k03O37p31J69K67
$$ -207 115 310 -226 -133 161 -40 112 -269 -88 194 -155 -53 48 10 75 -26 -229 408 -323 -154 113
4018A13qjj37K06N1l93K41j24MJ47k23m1L60l11J49k17O6R8P2j88R3p8N6L4J01
$$ 113 105 104 -33 173 224 -169 72 -52 -48 99 -124 -165 195 -116 33 -184 -118 -20 52 -136 -43 -121 -65 -31 70
4043G0R3j90k17L83m3k07M7J58j18J28j84j13J76J40j41p1P6J16k55K50j31J32
$$ 70 163 -27 -244 139 96 -111 -64 94 -24 104 -80 -193 -17 123 -18 -89 -13 103 -152 98 -33 99
4065I9j56j22K10L1p7Q7OM8J10k18N3j62M1l7J82p6j5j42K10J66l0m0l87J38J35
$$ 99 -57 -179 31 62 -15 72 78 126 236 18 71 -91 -50 -87 95 19 4 -138 72 238 208 168 -219 -81 54
4090E4l37M00j13k9K51l47j14K76k51J09R3j5M9M7rN3m17J93L70j45k41l1L13
$$ 54 -283 117 4 -25 226 -121 -235 41 -210 -101 -8 -23 26 73 64 117 -300 -107 263 118 -123 -154 159
4113A59k95L2p8K53j29Q5j50J06J90k92k96L51J73O6k25k97M69Mo4J45m0j1j11
$$ 159 -136 -104 -182 71 -58 27 -123 -17 173 -119 -415 -64 109 175 -50 -347 122 126 62 207 167 156 45
4136D5k22M25J33k81q5p8J28J7k76K07k9J01j8J0j82L9j9l6K06j48K2J51j1m32
$$ 45 -177 248 381 100 15 -63 65 82 -194 13 -16 85 67 77 -105 -66 -85 -121 85 -63 -41 110 99 -333
4160c33L46j7K65j13J7l70J03J62j98K16N2j19J50j98J3R9j10r8J22ln7j49K62
$$ -333 13 -4 261 148 165 -205 -102 60 -138 78 130 11 161 -37 -24 75 -35 -133 -11 -14 -71 -220 42
4183D2q7j4k2O4J77l77J23N0M7N0o4j05p4K4n6J83O7q6K42j59j92J69pr2K61J00
$$ 42 -45 -59 -81 -17 160 -217 -94 -44 3 53 -11 -116 -190 -166 -222 -39 28 -58 184 25 -167 2 -5 -97 164 264
4209B64l38R9q6K14k27K03J1N0K8k91M6J49o2N2j28J88k80L55k77J78p0p8J3j8
$$ 264 -74 25 -61 153 -74 129 140 190 218 -73 -27 122 60 112 -16 172 -108 247 -30 148 78 0 13 -5
4233em0MJ39j91K44k60p8P6M8k0Q3j21J78Nk3j06r3K35l1m5Mj54J29J69J98l48
$$ -5 -45 -41 98 -93 151 -109 -187 -111 -63 -83 0 -121 57 62 39 -67 -160 75 44 -1 3 -151 -22 147 345 -3
4259cr8J62k99L80k40j67K59K72j88j31p2P2j5r3J22J07n7j44M31k58l9J9k34
$$ -3 -101 61 -238 142 -98 -265 -6 266 78 -53 -125 -53 -68 -161 -39 68 11 -133 298 40 1 20 -214
4282b14M44l77J86J48j12Q5j28j22L76j13k00q3J13J27j62j07L96l71L30l22J30
$$ -214 230 -147 39 187 75 160 32 -90 286 173 -27 -110 3 130 -32 -139 257 -114 216 -106 24
4303B4o8J98j8j14L1j07K9k34M08j9o56O43l68J25O8Q4j06J7q9J50n2jn1mJ07
$$ 24 -44 154 136 22 53 -54 -25 -259 149 130 -526 117 -251 -126 -58 26 -80 -63 -152 -2 -54 -55 -106 -110 -3
4328cM2j58o1L5J42R8k17J07M3k85lK81j2J66n47K43K25j40j50L08j7P5m07L85
$$ -3 39 -119 -180 -145 -3 95 -122 -15 28 -257 -260 21 9 175 -372 -129 96 -44 -194 114 97 172 -235 150
4352A50J71m30J51LJ05n0k95k0O27k30j11k54J06K46J23l96K58k45J06M1k42M39
$$ 150 321 -109 42 45 150 100 -195 -215 412 182 71 -183 -77 169 292 -104 154 -91 15 56 -186 253
4374B53Q9l88J57k30N35l21k03K17m1r7J8J16q5m8lp2L03l20J14j74J41J39j85
$$ 253 342 -46 111 -119 416 95 -108 109 68 -29 -11 105 20 -28 -31 -103 200 -120 -6 -180 -39 100 -85
4397h5L83n9l52K65j14J1K9j74P9J14m41N28n14K11K54n26N37j76l04M38j95K80
$$ -85 298 239 -113 152 38 49 78 -96 -17 97 -344 184 -330 -119 135 -391 146 -30 -334 104 -91 189
4419A89j5n47L76J27m16L60J4NJ94m05%K06K4J57m74K41L1j82K6j19J15K55L4
$$ 189 174 -373 3 130 -286 74 88 93 287 -118 -118 88 112 269 -205 36 67 -115 -89 -208 -93 162 196
4442A96m54M57Ll20J59l8J08M6n20N00J57m60L65l97J92K10l50L84k43K11j31
$$ 196 -258 199 202 -118 41 3 111 157 -363 137 294 -166 199 -198 -6 204 -146 238 -5 206 75
4463G5j69L51q4k69L40k92Q6O6j00j34M43o50L23P0l10M41kl69K50j43J72j77
$$ 75 -94 257 173 -96 244 -48 38 104 4 -130 313 -337 -14 56 -254 187 185 -184 66 -77 95 -82
4485h2JQ9l3J42O7o03M26j08k35K90j48K03K37m11K81o2j21M12l94j37K50K2J51
$$ -82 -81 8 -25 117 184 -419 7 -101 -336 -46 -194 9 246 -165 116 54 -67 345 -49 -186 64 86 237
4508B37l3l08K37J45l92K58j43R0q0q2nJ21r2J04q5J44J8j36j3J64j20L4j04R0
$$ 237 204 -104 133 278 -114 144 1 91 11 -71 -76 45 -47 57 -28 116 134 -2 -15 149 29 63 -41 49
4532D9j46r9L08j12KN2j92k3M4L52r2k41j74M56k38Lj17N6J35p6N0J91k53r3J73
$$ 49 -97 -196 112 0 2 54 -138 -161 -117 235 143 -98 -272 184 -54 -51 -168 -112 23 -53 -3 188 -65 -158 15
4557A5qL37k91k78K48j63K42k1k65L74k35NJ80k8j52J20j15j16P3o4N3J20P6J04
$$ 15 7 344 53 -225 23 -140 102 81 -184 190 -45 -40 140 112 -40 80 -35 -151 -78 -142 -89 31 107 211
4581B11k48l0R8l0J03q7j28J80j43J4L12k9k61K17l9k03J39j40N8n2K39k42o2
$$ 211 -37 -67 31 1 104 17 -111 69 -74 -60 252 223 -38 179 140 -63 76 -64 -6 -58 181 -61 -123
4604a23J77j25J46j38o8J25L4K11k76ll5J92k59J64J56k59lJ47j95j25K90P3j58
$$ -123 54 -71 75 -63 -131 -6 28 239 -37 -40 -75 117 -142 22 178 -81 -84 63 -132 -257 33 106 -52
4627e2M1n9J8j31K05J6K21k99k23K00J38q4k4j12L71k13j05Q2J0K62k75q1O4m
$$ -52 -11 -70 -52 -183 22 38 259 -40 -263 -63 75 -9 -33 -145 226 13 -92 -10 0 262 -13 -94 -30 -34
4651c4j08O8Q4n2K47j49k22M84l52K13p4q0J35k26J52N3p2N6K6r0K31m54K51p7
$$ -34 -142 -74 10 -42 205 56 -166 318 -34 179 105 25 160 -66 86 139 67 123 149 59 290 -164 87 10
4675A0l8J31J59k76l6J76l55K24O2J51k00j70K94k8j10q2j8l0J37l2o2N7J18K4
$$ 10 -28 103 262 -14 -50 126 -229 -5 57 208 8 -162 132 104 -6 -88 -106 -136 1 -31 -93 -36 82 106
4699A06m03L67m13M60j72k4qJ07%q6J26k17K93j62J5r6K52k44l0J7J03j64K4J2
$$ 106 -297 70 -343 117 -55 -79 -87 20 20 -66 60 -157 136 -26 -11 -107 145 -99 -129 -112 -9 -173 -149 -137
4723a37O4j82L41l3n5n7O9r4m5K54m4q5k18M44k24P5j52p1K06J53l94K72j35r3
$$ -137 -73 -255 86 53 -2 -59 10 -84 -129 125 81 -4 -222 222 -2 73 -79 -150 56 209 -185 87 -48 -141
4747a41M2M63k22j95O6N3k41L13l10L4K3L7Q3N6j73K04k4k34L54j54k32L46j35
$$ -141 -99 364 142 -53 13 66 -175 138 -172 -138 -115 -78 5 61 -112 92 68 -166 188 34 -198 148 13
4770A3r0J57n3J14l15J92q3K14r7k75P5L83k09l00J57j34K71M6j08J51k48j11
$$ 13 -77 80 27 141 -174 18 -65 149 52 -223 -148 235 26 -274 -117 -251 20 66 -42 109 -139 -250
4792b50J83r5K67n3M3j17q9J2N2k7J97j26l0K72n6j08J21k86J18k6n1J78l0j63
$$ -250 -67 -162 105 52 95 -22 -111 -99 -47 -74 123 -3 -33 239 183 75 196 -90 28 2 -49 129 99 -64
4816f4L46K8l77Q0j28O9J10m1M0j31L36j58j7J00j23k53O5O9L26O0m95L3k5J18
$$ -64 282 310 -67 13 -115 -46 64 23 63 -68 268 110 93 193 70 -183 -118 -49 277 337 -158 -125 -150 -32
4840c2J71l7j16m2r8Q5K38l41K10j57p3K80k99L08k75K67J38l37r5K25k36M58
$$ -32 139 102 -14 -56 -154 -69 169 -172 38 -119 -192 88 -211 97 -178 89 227 -110 -205 20 -216 242
4862B42k10m8M8j28K25j26oo4k51K78L41l12m1R8j22K4J62k28J18J98j39j40q3
$$ 242 32 -16 32 -96 129 3 -3 -67 -318 -40 301 -11 -52 46 -76 -52 110 -118 0 198 59 -81 -164
4885a64L55k67k6K04Q5n2J24j81r5J01j44L01k38P8M8k37O2J4n2K80Q4m48P1J89
$$ -164 191 -76 -102 102 187 135 259 78 -17 84 -60 241 3 81 129 -108 -46 -32 -84 196 280 -168 -97 92
4909I2l8k3J07l28L10j96p5mR6L67n42M35p6k9J60l85q3L14l26J02J95l45K07
$$ 92 54 31 138 -190 120 -76 -151 -155 -59 308 -234 201 125 96 256 -129 -212 102 -224 -122 73 -272 -65
4932f5J34l80O03n02J01J58j80J67p4q7N8N6Q5k1j64M3K12j69Mj2j20K85l57L45
$$ -65 69 -311 292 -210 -109 49 -131 36 -38 -125 -67 -11 74 53 -111 -68 144 -25 -21 -33 -153 132 -225 120
4956A20p3j12L52j59j89N0l5K03m3j97L34l0k87J78j04J54r4J9K06k02j60O0P8
$$ 120 47 -65 287 128 -61 -11 -46 157 114 -83 251 221 -66 112 8 162 68 87 293 91 -69 -9 69
4979F9l2J47j86J54j87Q3L63n89K52J74l34R1l2r2L11l05%K69j16l7p0K04j23
$$ 69 37 184 -2 152 -35 48 411 -178 74 248 -86 5 -27 -119 192 -113 -113 156 40 3 -67 137 14
5002A4k3N1k6j21j19J13n1J51k12L59n9qJ14j61l06L35k1p8K62l61L08n5l20L78
$$ 14 -9 42 16 -105 -224 -111 -162 -11 -223 136 77 69 183 22 -284 51 30 -48 214 -147 161 106 -214 164
5026A64j47k62J75K50l47J71O0J55j54l22K49o2Q1j23K44l4K1l07R2Q3J25j98
$$ 164 17 -245 -70 180 -167 4 64 219 65 -257 -8 -70 11 -112 132 98 119 -188 -96 -13 112 -86
5048h6J22J20M2o1k17k7K00p2l2j05J73r9K21k44L93k18j98J02j8J80k12J53o5
$$ -86 36 156 198 137 -80 -107 93 21 -11 -116 57 -42 179 -65 328 110 -88 14 -4 176 -36 117 52
5071E2r1P8j45l5O6K49j17j51P1k63K42k0p0o8q2L31L0l26K86j36O2K8J25j50
$$ 52 -39 39 -106 -141 -75 174 57 -94 -23 -286 -44 -64 -134 -202 -284 47 77 -249 37 -99 -37 -9 116 -34
5095c4Q3Q1j27N8k24J26j79L50n1j44K53j72K03k59J21r2J87m3J49k19m57L48
$$ -34 49 130 3 61 -163 -37 -216 134 83 -61 192 20 223 -36 85 -7 180 137 286 67 -390 -42
5117d2K64j44k83K75M4j62J07K3r3n8J49N9k27j0J28K04l98K87k46R5O9j13j10
$$ -42 222 78 -205 70 114 -48 59 82 -11 -69 80 139 -88 -98 30 234 -164 123 -123 -28 41 -72 -182
5140a82J18K96q0r4k03m8K12q2K2J5n9M8k65L03J61j1m18L72l52j1J05J32K24
$$ -182 -64 232 152 58 -145 -193 19 -63 -41 -26 -85 -37 -302 1 162 151 -267 105 -247 -258 -153 -21 203
5163B03k80j11Q7J22k31L7L2J55n3j59k5J27L02j69j35nR8M5p6R3j51Ml1K04o
$$ 203 -77 -188 -101 21 -210 -173 -141 14 -39 -198 -223 -96 206 37 -98 -103 -5 40 -36 57 -94 -90 -121 83 77
5188G7m0N1o1o0n3M6k8J56j96P6j0R5p3n8K68j01Rk43J14J48j15k34K68N3pok60
$$ 77 37 88 27 -33 -86 -40 -68 88 -108 -32 -42 53 -20 -78 190 89 98 -145 -31 117 2 -232 36 89 82 76 -184
5215a84J94jr7J49O6q9j16J49j70p2K02R1k50J32j11L7P2k09m5r2L46J56j20j
$$ -184 10 9 -88 61 127 38 -78 71 -99 -171 31 122 -128 4 -107 -70 2 -207 -252 -344 2 158 38 37
5239C7j53m7J18K12k16n5N0j36K41M9j1k13N0j42K71l10M5J25L44m10QJ92p5k8
$$ 37 -116 -163 -45 167 -49 -104 -54 -190 51 100 89 -124 -74 -216 55 -255 -210 -85 259 -151 -143 49 -26 -54
5263e4J24K45l59J70L1k61R3R3R1K78n57J41m0qL6j01J43MJ65j32J01l84M2K36
$$ -54 70 315 -44 126 157 -104 -11 82 173 451 -106 35 -5 -13 23 -78 65 69 234 102 203 -181 -139 97
5287I7O9k55R4PLj57K21L4m6k63J58K74j29j97o6J59l02K07l6J69q7k02pL16k49
$$ 97 166 -89 5 12 15 -142 79 113 67 -196 -38 236 107 -90 -156 3 -299 -92 -128 41 -46 -248 -255 61 -188
5312a88L71j72n8Q6j08N4J76l47L01j91N7m3j8P6R4m02L06J37l4k11M1J34Q3k58
$$ -188 183 11 -47 39 -69 -15 161 -186 115 -76 -19 -62 -80 -4 90 -312 -6 131 97 -114 -73 61 144 -114
5336a14Q2j50K19j43j1o3K48L9pk4k06K53k51J36J81Lj93j48O7LJ92j4J7k86K02
$$ -114 -32 -182 37 -106 -117 -180 68 107 100 76 -130 123 -128 8 189 192 -1 -149 -82 -79 113 99 116 -170 32
5361C2n9o2K16M1j82K38j82k32K14m1RO0k10J27j25K28m4m8J0j6j64j36K24P6
$$ 32 -27 -89 127 168 -14 224 42 -190 24 -17 -8 52 -158 -31 -156 72 28 -20 -10 -26 -190 -326 -102 -26
5385b6M9j73J72j88K27o3j38K13M8o6j00O8j60L02q0j39J96l50L38r9j0Q2m5Q9
$$ -26 23 -150 22 -166 61 -2 -140 73 121 55 -45 23 -137 165 85 -54 142 -208 130 31 21 103 58 147
5409A47J8j60k03K84M5k13j96K92O5K5J2lj34J64m1j50J27ll5K0k82K79p6q2J18
$$ 147 165 5 -198 86 131 -82 -278 14 79 104 116 113 -21 143 102 -48 79 76 41 61 -221 58 -18 -100 18
5434A8lM8j27M2K49k49k6pM1j04K15n53L59j8K9K2pK0n6J22L0J4k13J03j53K81
$$ 18 15 63 -64 -22 227 -22 -48 -55 -14 -118 97 -456 -97 -115 -86 -64 -71 -51 -107 15 45 59 -154 -51 -204 77
5460G7o6l4j57Nm5K38j6Jp1J27J10O9j38k5o0K11k35O3M9M1p8o4o1L4L6%j8J14
$$ 77 11 -23 -180 -175 -220 18 2 3 -68 59 169 238 100 75 15 226 -9 54 103 144 66 2 -59 -25 11 11 -7 107
5488A07p0R9j18O8j13pK86j02k6Q1q0j86L30l80L74k45N6P2l09j09J80j7omJ71
$$ 107 37 136 18 86 -27 -34 252 150 124 205 125 -61 269 -111 263 18 74 146 -163 -272 -92 -109 -115 -119 52
5513E2J9r4Q5j57J25j14J81k8M6M9j00r2j0K7j48L23r5k20L25k31j06J16l7M1
$$ 52 71 -23 62 -95 30 -84 97 69 115 164 64 -28 -38 -11 -159 164 69 -151 174 -57 -163 -47 -84 -43
5537d3O4j18j11J10K48p5k16L84l40J25j20K31k43j62K26q8J02l1L30K5j85o5
$$ -43 21 -97 -208 -98 150 75 -141 243 -97 28 -92 139 -104 -266 -40 -128 -26 -57 273 298 113 48
5559D8M0j15O0J42k01mj23L14L2j50K33l36L5K44j94j25L21l46J02O5K02j02J1
$$ 48 88 -27 33 175 -26 -30 -153 161 193 43 276 -60 -25 219 25 -100 221 -125 -23 42 244 142 153
5582A53j6k6j67j83NK37k60J72k4Q0NqJ07l9Q7k61N8J59j12P7L2k02J67j37j72
$$ 153 137 111 -56 -239 -234 3 -257 -85 -109 -29 -24 -32 75 36 123 -138 -80 79 -33 44 76 -126 41 -96 -268
5607b68Q2J60J16j08j5M6P1k95K17k14K78K9k23N3K8k1l5K83j52j30K07J88j65
$$ -268 -186 -26 90 -18 -33 13 84 -211 6 -208 70 99 -124 -71 -43 -64 -99 184 32 -98 109 297 132
5630A32j85J78r9J35k52R5R5p0j63J88J6o4k05K39L25l16j7j88P8N7J23l3j65
$$ 132 -53 125 26 161 -91 4 99 29 -134 54 70 6 -199 40 365 49 32 -156 -78 -21 102 69 -96
5653i6L03o5R8j45m8J59k85K2P1R8p2L4k3j02j67K49K02k40k5p3qR2r5J8L40k28
$$ -96 207 142 240 95 47 206 -79 -57 14 112 40 74 51 -51 -218 31 233 -7 -32 -105 -113 -21 -116 -98 242 14
5679A4k9O3K7j5m1P0j79N8%Jq7J62O3Qk26K0J5j59J77L92m13P1j27P3K05Ol9j01
$$ 14 -15 48 75 60 19 89 -90 -32 -32 -31 -118 44 107 115 -111 -91 -76 -235 -58 334 -79 -8 -135 -62 143 149 110 9
5707Ij64K07K9j25J4L45k96j53p5J91J28k24K72K1k89R0J2n9Lj15J23Lq6K9J64
$$ 9 -155 52 81 -44 -30 315 19 -134 -209 -18 110 -114 158 179 -110 -20 -8 -67 -64 -179 -56 -53 -139 -110 54
5732E4k89M44m54L20J05j71j15O4l0J76L5N4k2o5M8j61L3K5j09J91j63J0K3op2
$$ 54 -235 209 -245 75 180 9 -106 -42 -72 104 139 193 171 106 154 -7 26 51 -58 133 -30 -20 3 -3 -75
5757g5J10j80k5L18k25p4K53m01L42k08R7K20m7r9R8j53pL35n91L52j42p2L97
$$ -75 35 -145 -170 148 -77 -151 102 -299 43 -165 -68 152 105 6 104 -49 -56 279 -312 40 -102 -174 223
5780B23j48j66L28k23L5k15J86O8l03J31K19k24P3J47L8k16Q5K3j65K32j76Q6
$$ 223 75 -91 237 14 49 -166 20 88 -215 -84 135 -89 -16 131 169 -47 38 61 -104 128 -48 38
5802C8m3J13k65k0L84k82L1K8K76j38j44n1n0J11j35J87j04M2j67J60J2j78K07
$$ 38 -5 108 -157 -177 207 -75 -44 -16 260 122 -22 -73 -123 -12 -147 40 -64 -22 -189 -29 -17 -195 12
5825A2L3k49J67PJ88q9J9l37q6N55k60m2j62K74J06j06j52J23P3J28k42o5%K32
$$ 12 45 -204 -37 -30 158 69 88 -249 -335 220 -40 -82 -244 30 136 30 -122 1 74 202 -40 -105 -105 127
5849A27l0j36P8m8p4K9J25m68N31J3l10L64l48K21M7r5o5l1L7K50k24j30M0J38
$$ 127 97 -39 39 -9 -83 -54 71 -397 134 147 -163 201 -147 74 121 26 -39 -70 -33 217 -7 -137 -97 41
5873D1J46k25K37j19K6o1n2p7K91m3k13p7J84l1j9q6J87l72K83o2K5j58J75R7
$$ 41 187 -38 199 80 106 45 -7 -84 207 164 -49 -126 58 27 8 -78 109 -263 20 -42 -17 -175 0 97
5897I7k41k9K36L5p2q2J20l00J63J5M7j7P1j30k00N75k59m5k3k06L64j14r9K78
$$ 97 -144 -173 63 98 26 -56 64 -236 -73 -58 -11 -28 43 -87 -287 288 29 -16 -39 -245 119 5 -94 184
5921A84j81J31L3j92l6n9J84m8q0R1M8K6J02O9j41J08o3l9j98J06j52J33m6P0
$$ 184 3 134 167 -25 -61 -120 64 16 -64 27 75 101 203 272 131 239 176 137 -61 45 -107 26 -20 50
5945E0K6Q5k92j15J91pN2K11k63P2O8o0K0L7o1JJ09l54J64K34m00J60J32k02K70
$$ 50 76 161 -131 -246 -55 -62 -10 201 -62 10 78 18 38 75 14 15 124 -230 -66 168 -232 -72 60 -142 128
5970A28J1l98J71L53l24k92K66j06L40o6J49k97J95k60L1j00J47m5j5J40j16K1
$$ 128 139 -259 -88 265 -59 -351 -85 -191 149 83 232 -65 130 -130 -99 -199 -52 -97 -112 28 -88 -67
5992f7n8K61k30k42M08j65P0L24l08qj33M3K00j14K97l23K41l22J42j60J97J4
$$ -67 -125 136 -94 -336 72 -93 -23 301 -7 -15 -148 -105 95 -19 278 -45 196 -126 16 -144 53 67
6014F7j91O8p8M87m36k1KJ77ON4j38J05j38k0JJ28J8r0J79j24J3j48Q4j35K8J41
$$ 67 -124 -56 -134 353 -83 -104 -102 75 81 135 -3 102 -36 -56 -55 73 91 1 180 56 69 -79 5 -130 -102 39
6040C9j06J03j28Q7MK5N7n4m3K60l72J12N3J86l75Q7Q3P9p0j33J18J07j80K02
$$ 39 -67 36 -92 -5 -1 24 81 27 -16 244 -128 -16 37 223 -152 -65 18 97 27 -106 12 119 -61 141
6064A41j56J09N8k12J09j64K11k14J17M2j51l6L37l90J1M4L98k63L8K18j76j72
$$ 141 -15 94 152 -60 49 -115 96 -118 -1 41 -110 -146 191 -199 -188 -144 254 -9 29 247 71 -101
6086a01J3k37M60j12p0K09l40O5J03K4j05J8J97j32J84j27m3J06J46j00l6j35
$$ -101 -88 -325 135 23 -47 162 -178 -113 -10 14 -91 -73 124 -8 176 49 6 112 258 158 122 -13
6108a3r0J20k23R0P9Q6Q2K0k91j0K12j36K57l82J50L9J1n6ONL10k51J8k4P9N1
$$ -13 -103 17 -206 -116 -37 49 131 151 -140 -150 62 -74 183 -199 -49 -10 1 -55 -49 -44 266 15 33 9 88 139
6134A39k49l3R7J51k02l4J58K17k85M9K0K3j41K93k69K20k29J37o7J2J76k66R9
$$ 139 -110 -143 -46 105 -97 -131 27 244 -41 8 28 51 -90 203 -66 154 -75 62 -5 7 183 -83 16
6157A6m6L6P5j33L88l99jL3R3J9q5J39k45K90kj32j86P6J04J73j53L34l48j62
$$ 16 -30 6 81 -52 336 -63 -64 -31 62 81 -4 135 -110 180 178 46 -140 -64 40 213 60 394 46 -116
6181a16J63j36MJ82p3j20J05p4K28j87O9k53L77k77N4K10l63J45R9O6ok98L52
$$ -116 47 -89 -85 97 24 -96 9 -65 163 -24 45 -208 169 -108 -54 156 -207 -62 37 103 97 -201 151
6204A51j66J00o9Ql20K04J39j89J95N7k59o6J41J23n7J98j31o4K04j91k9j03J29
$$ 151 -15 85 16 24 -296 -92 47 -142 53 110 -149 -215 -74 49 -8 190 59 -5 199 8 -21 -124 5
6227El7J06k43J19K34q1M8k09N4n5Q1J79l8k68K09j73Mp6m4K04j6N2l09J64J47
$$ 5 -32 74 -169 -50 184 103 151 -58 -4 -59 22 201 163 -105 104 -69 -65 -141 -185 19 3 55 -254 -90 57
6252E7O3r3j32J07n4J48j85l5j30L03J64l42K14n5K6o9r4Q6M3q1P4l02M39r6M6
$$ 57 120 27 -105 2 -52 96 -89 -124 -254 49 213 -129 85 30 56 -13 -107 -21 22 -59 15 -287 152 56 102
6277A02n4r2P7o8J63Rl60L11k66K41O2j70J83j33L1oj85K12k25R4k05K67P7J26
$$ 102 48 -44 33 -35 128 137 -223 88 -178 63 125 -45 138 5 36 30 -155 57 -168 -74 -279 -12 65 191
6301A91r4l3j26PJ56l2n7O3K4m7R4k39J58j03J31N8j37j23m7J68K73k66P4o4j67
$$ 191 97 64 -62 -55 101 69 12 75 99 52 146 -93 65 -38 93 151 14 -109 -156 12 285 19 93 29 -138
6326a38j6J48K59j22j99L25r3j60n7oK10k55MJ13j01j6N9n2J81k47NJ61j4n9n7
$$ -138 -154 -6 253 131 -68 257 164 4 -53 -59 151 -104 -100 13 -88 -104 -45 -97 84 -163 -158 3 -11 -70 -127
6351a27L02j78l1J6J11L0j60J39k70K0r3J18J58J52Rp4Pj07J76j08j12N0Q9l3
$$ -127 175 -3 -34 -18 93 123 -37 102 -168 -148 -241 -123 35 187 196 122 129 22 198 90 -22 28 117 84
6375H4J01k35q8J09r1K05j71P0J24k32J22rj26L1N5J61l74R4L37j22j0mo9L7j3
$$ 84 185 -50 -138 -29 -120 85 -86 -16 108 -124 -2 -11 -137 -106 -51 110 -264 -170 167 45 35 31 -38 -1 -14
6400a4j18J28J79k61J65l78K82J2P0k9r6M24o24K46k25J13j75L86J78l98J08o6
$$ -14 -132 -4 175 -86 79 -299 -17 -5 65 36 -60 364 -260 -14 -239 -126 -301 85 263 -135 -27 -93
6422i3K12k17n5L7J64mj65J14J6pK2k08L12j88R1O4l38L73j08J12l6k26J01J09
$$ -93 119 -98 -153 -116 48 44 -121 -7 9 2 24 -184 128 -60 31 95 -243 130 22 134 98 -128 -27 82
6446H2q1J1J25n2J06j80J29j22j09L27m71L15j49J86K7j11N5J22k51q0P0K66j46
$$ 82 1 12 137 85 191 11 140 18 -91 236 -235 80 -69 117 144 33 88 210 -41 -121 -51 215 69
6469F9P4l92J90pMK19r3J03j61K3q9m7p8K59L7j32j07O8J24j19q3J82pq4Q8j44
$$ 69 143 -249 -59 -66 -62 157 64 167 6 29 -60 -107 -185 74 111 -21 -128 -60 64 -55 -138 44 37 -47 41 -103
6495a03J51N3j9q3M3J3j87j08K30n5J1j58L04k10J37K51k76J90j77j90L99p3k51
$$ -103 48 101 82 -1 42 55 -132 -240 -10 -65 -54 -212 92 -118 19 270 -6 184 7 -183 216 143 -108
6518a08R8N4J23j26k3p7j42K90L0j96J18K52k38Q2O9l26l8J17l4mJ87k9r7M8K68
$$ -108 -10 44 167 41 18 -59 -201 89 119 -77 41 293 55 137 206 -120 -158 -41 -75 -79 108 79 -18 30 298
6543B98k58j68J59K0k12r9K82rJ37j38j33j10K90j08o3J75N0j59k06N55l59j7
$$ 298 40 -128 31 51 -161 -260 22 13 150 12 -121 -231 59 -49 -112 63 113 -46 -252 303 -56 -73
6565g3k13K83J72k78J46R6k70K58j87Ro8O1j74L37k30Q6N5j19J00k21L54Pj2N1
$$ -73 -286 -3 169 -109 37 133 -137 121 -66 -57 -125 -64 -238 99 -131 -45 10 -109 -9 -230 124 131 119 170
6589A70j86K44j47k1k5J5P5k52J07j90M38k05r2j53L62o8r4k56L83j88L6j57L81
$$ 170 -16 228 81 60 35 50 125 -127 -20 -210 228 23 -69 -222 140 72 -22 -278 105 -83 -47 -204 177
6612A77l43J01N9J63k0j99J64k22K88o6q2l16J47K61J12k09R2j19P5p0oN3k65
$$ 177 -166 -65 -6 157 137 -62 102 -120 168 102 20 -296 -149 112 224 15 107 -12 63 -7 -13 40 -225
6635b25L03l7l23J65J32k1J4P7n0Lj1J21l58L87r1j92Q7Q8j03j7J54k20K49j56
$$ -225 78 41 -282 -117 15 -6 8 85 35 38 27 148 -210 177 86 -106 -19 69 -34 -51 103 -117 132 -24
6659b4j02J49r4j41NK10p4j29J36K53k31O6m4R3l36K67J17j76J28k29L00j28j56
$$ -24 -126 23 -71 -212 -207 3 -71 -200 -64 189 -42 24 -20 73 -263 4 121 -55 73 -156 144 16 -140
6682a40J63L42Kn61J61K19J30j80j12P9j29R9N9K9k15k0K31RJ25k99j02m0OJ33
$$ -140 23 365 367 -194 -33 186 316 136 24 103 -26 73 132 161 -54 -74 157 166 291 -8 -110 -150 -144 -11
6706a1j58J32J29o5qP9O0j75J23k74Q6m5J07K22k15O2j14J26P4n6j72L8j05P2
$$ -11 -169 -37 92 27 19 98 158 -17 106 -168 -82 -127 -20 202 -13 49 -65 61 135 79 -93 -55 -160 -88
6730h8L4J44j7j32K12j55k11J05J42o8M3J16j95l4Q0J6J87p9k25j76K22J24j22
$$ -88 -54 90 73 -59 153 -2 -213 -108 34 -34 9 125 -70 -104 -24 -8 179 100 -125 -301 -79 45 -77
6753g7J32j91m1L09r8j82L13j93r7J03LL68n58J97K23l29K65k03J34k96K26L4
$$ -77 55 -136 -177 132 34 -148 165 -28 -125 -22 -19 349 -209 -12 211 -118 147 -56 78 -218 8 42
6775D2j54J95j32K5j4J00q8j11K03r3K50j42N1p1r3j00L95j61n6j32r2J92K37
$$ 42 -112 83 -49 -24 -38 62 -26 -137 66 -27 223 81 132 61 -32 -132 263 102 46 -86 -178 14 251
6798B51m46J35k36L35p0k3o2M6J60ro2j53J15j9p0m6j59M19j03R3k1k06L30k35
$$ 251 -195 -60 -296 39 -31 -54 -116 -70 90 81 19 -134 -19 -38 -108 -154 -313 106 3 96 75 -131 199 -36
6822c6m6K25n5K10l39K6J47k36J36P3L9l48J80j16J30J29j35j75J06J9J24j8L8
$$ -36 -82 143 88 298 -41 -15 132 -104 32 105 144 -204 -24 -140 -10 119 -16 -191 -85 -66 58 40 78
6845G8q4J56j78J58k96k3M3M85k60j08j40J87j16J25J59j97J6M4R9k02j2K01r6
$$ 78 -6 150 -28 130 -166 -189 -146 339 79 -29 -169 18 -98 27 186 -11 5 49 148 -54 -66 135 39
6868C9j9P8j49K98l75J61j43l7m3J46J64p9j3k19K34j27J96l1l85L25J08j84J43
$$ 39 20 98 -51 247 -128 33 -110 -147 -190 -44 120 41 28 -191 43 -84 112 81 -304 21 129 -55 88
6891H8J32p4j51r8o7J73j68K27j45l0mJ17O6N1l8j65K10k58Q7O1P8k8j95O2mP1
$$ 88 220 146 -5 -103 -170 3 -165 62 -83 -113 -117 0 66 117 79 -86 124 -134 -47 14 92 64 -131 -69 -73 -2
6917bJ32j16j34K68L0j81p7J04L7J7j7j80K28k22R9k42J72J01r7M4J40k91K72
$$ -2 130 14 -120 148 178 -3 -80 24 61 78 61 -119 109 -113 -14 -256 -84 17 -80 -36 104 -187 85
6940H5r3Q4J3n2L1n1OkJ79m72M33l82K96q9j27J00j11p6J93L34j97j90R2q4M5
$$ 85 -8 76 89 37 68 17 23 21 200 -272 161 -221 75 -14 -141 -41 -152 -228 -35 299 102 -88 4 -80 -35
6965c5O4q9K50j15O8r0K12p0j99J14l2O6k20J76QM9O8k92L8J54J00J17k98j23
$$ -35 29 -60 190 75 143 53 265 195 -4 110 78 144 -76 100 108 157 225 -67 -29 125 225 342 44 -79
6989g9J62n9J34k33K95j91J2Q3j54m7j10K47p7j08K92K0j36K8k7o7J63Nj98o2
$$ -79 83 24 158 -75 220 29 41 124 -30 -77 -187 60 -17 -125 167 187 51 79 52 -15 148 153 -45 -107
7013a07k28L62j19J18M9k89J74M8Q2j70j29K71q3Q7k07J77n5j11J66j53j7K52
$$ -107 -335 27 -92 26 75 -214 -40 8 90 -80 -209 62 -21 66 -141 36 -19 -130 36 -117 -134 118
7035A18k04r6R8Mj15K35N4j21J8J77j04q6l0j68L13j48Q8J20j46oO8j7q9K47j62
$$ 118 -86 -182 -84 -80 -195 40 94 -27 -9 168 64 -22 -52 -220 93 -55 33 153 7 1 69 52 -37 210 48
7060D8L2J14j02j96L72l73Q4j17K5L21m11J17p9K68m5q9O1N2R5j92p2N9l7R4k19
$$ 48 80 194 92 -104 268 -105 -21 -138 -113 208 -203 -86 -165 103 58 -31 30 82 177 -15 -87 -28 -65 29 -190
7085a90k25L82K49j91j9J76m07J57K46L6k23j64K29N3k58nM9j08K71n9j52K10
$$ -190 -415 -33 216 25 6 182 -225 -68 178 214 -9 -173 56 109 -149 -154 -105 -213 58 -1 -153 57
7107E7J33n6k81J82j3J61k96j3K19J67k51O5k8lJ50j50j59p6L22k19N2P8k65M50
$$ 57 190 134 -147 35 22 183 -113 -126 93 260 9 74 46 43 193 43 -116 -192 130 -89 -37 41 -224 226
7131B26j66j25L10l22L86l47K61n9k49Q2j55L5L33l84N8K73k24O2K7q0J13L2j5
$$ 226 60 -65 245 -77 309 -38 223 164 -85 -3 -158 -123 210 -174 -116 157 -67 -5 22 -58 55 87 72
7154G2k19K54M4l5j02K2j09J46k6j80J13j53J22K09m73K66J84j08o4K27j72k03
$$ 72 -147 107 151 116 14 36 -73 73 47 -133 -20 -173 -51 158 -315 -49 135 27 -37 190 18 -185
7176a85J70J46M0j12J1k59K78j38K08j25J33l97L43j80k30K17J77m21L59k86L15
$$ -185 -15 131 171 59 70 -189 89 -49 159 34 167 -230 113 -67 -297 -80 97 -324 35 -251 64
7197F4K35m18J31k34L34k4r0LJ29J81l13l05L75j08N4J48L8K8k6j41l98L69l1
$$ 64 299 -119 12 -222 112 88 -2 1 130 311 -2 -307 68 -40 14 162 200 228 202 61 -337 32 1
7220AM1J03l26J50L6q1K88k77J85j14j18l5J98o2J42j26K67k06n5p8L9k48K43
$$ 1 42 145 -181 -31 5 -76 212 -65 120 6 -112 -147 51 -11 131 5 272 66 11 -67 -28 -276 -33
7243c3Lo5K0O0j38K00j35Q4K4j34K01j72K65j86m6J02Lj70J57r1k56N62l22J29
$$ -33 -30 -95 -75 -15 -153 47 -88 -4 20 -114 87 -85 180 -6 -52 50 53 -117 40 -51 -307 255 -67 62
7267F2Kl3K9p2j32K04j36q9O5J50J0m1L8M2m1k36K04J7pj28J61m1J51K1l67J33
$$ 62 64 31 60 -12 -144 60 -76 -165 -100 50 60 19 57 99 58 -178 26 43 36 -92 69 28 179 200 -167 -34
7293c4J96j77J61j61l6J32j12J75k80J28K57k52K8q9K9k3j94L87k33P6j63L24
$$ -34 162 -15 146 -15 -51 81 -31 144 -136 -8 249 -3 25 -64 -35 -58 -252 135 -98 -22 -185 139
7315A39k06K6K52n41L12J94j49l1r5qJ36Kj4j59J23K01K3k13J08LJ3K4k80J68
$$ 139 -67 -41 211 -330 -18 176 27 -4 -99 -107 29 31 17 -142 -19 182 205 -8 100 103 116 140 -140 28
7339B8Q5j84J07M0j50K0K08j16o8N4l7J76j80R7l2j6J76k67J07J01n0l40K58N0
$$ 28 113 -71 36 76 -74 -54 154 38 -30 24 -13 163 -17 80 48 32 208 -59 48 149 99 -241 17 67
7363F7R0j14n4j16J78j30J18j7L8r6M0J34k42M2J34k43K49q9j56J69l4o2j9j78
$$ 67 157 43 -11 -127 51 -79 39 22 60 -36 4 138 -104 -62 72 -171 78 -11 -167 2 -32 -94 -113 -291
7387b91J00K4J53j46jJ25K4l9N54m44k62J30k4K68k73P0J1K9k39K03J27k94L47
$$ -291 -191 -167 -14 -160 -161 -36 -12 -51 503 59 -203 -73 -97 171 -102 -32 -21 8 -231 -28 99 -195 152
7410A52k24K01l8k90J58M2j09j3K49p9k04L01L1j15N4l36K85L6N5m3L8k12J54
$$ 152 -72 129 91 -199 -41 1 -108 -121 128 49 -155 146 177 62 116 -220 65 101 156 113 151 -61 93
7433I3j9j41K54k07kj10J19P7L2o8Q2Mq1k0Jp6j75K17k63Q2N9J58k10P9n7Q8N3
$$ 93 74 -67 187 -20 -22 -132 -13 64 96 28 110 114 33 13 14 -62 -237 -20 -283 -201 -142 16 -194 -115 -172 -84 -31
7460c1J5r0K9q0J06q6O3J82k48j52N7K37nP1k60K69j58J31j41K36l33K89l33J6
$$ -31 -16 -106 -77 -157 -51 -137 -74 108 -140 -292 -235 2 -3 68 -192 77 -81 50 -91 145 -188 101 -232 -216
7484b16J70qQ3J30k68J21r1J86m4j74P2N3J49j50O6q6K56m87J19K9J02J9j70O3
$$ -216 -46 -54 29 159 -109 12 -79 107 63 -111 -39 14 163 13 79 -7 249 -238 -119 -90 12 31 -139 -76
7508g6J4J0q3J6P5K19j85K7K18j26j13J26l6l55J19J12j05L4Q9r6K23l23J13j2
$$ -76 -62 -52 -135 -119 -44 175 -10 17 235 109 -4 122 86 -269 -150 -38 -143 -109 -20 -116 107 -216 -103 -115
7532a15J59j94J68j46k48M5L87j49j67M41j11k96K53J15k61J15K8M0J26J6j09
$$ -115 44 -150 18 -128 -376 -331 56 -93 -260 181 70 -226 27 142 -119 -4 24 64 190 206 97
7553I7j34K6OO2J22r7j65J01j02N3n8K86j48N8k65J62j00K2Q9k86K94p4R7l0R8
$$ 97 -37 -11 -5 57 179 82 -83 18 -84 -31 -89 197 49 107 -158 4 -96 -74 15 -271 23 -51 46 16 114
7578A14nK0K9l2n0j81J6l9J97k5j36J58n4j18J14j82K04K8o1M3l0J50r8j11R3
$$ 114 109 129 158 126 76 -105 -89 -128 69 44 -92 66 12 -106 8 -174 30 58 -3 40 10 160 62 -49 44
7603D4n3P9j54J20P2L4J54l53J17q4j15J16J31j08J12j69J67l89L85j78L7j03
$$ 44 -9 70 -84 36 108 142 296 -57 60 -24 -139 -23 108 0 112 -57 110 -279 106 -72 -35 -138
7625a38R0p0J16N6M9j74J6m8m9J91J44k96M50m56O2j62j7J31R3J39k06o5J66k2
$$ -138 -48 -118 -2 54 103 -71 -55 -103 -152 39 183 -113 337 -119 -57 -219 -236 -105 -12 127 -79 -144 22 0
7649@O6J32m12J28J04j51J81m5q0Q5j22J31k65K29q4L41j77k4J1j35J44R1k92
$$ 0 66 198 -214 -86 18 -133 48 3 -77 8 -114 17 -248 -19 -103 238 61 37 48 -87 57 148 -144
7672a44J6J02J10J28m4j22j4L4Q4k24J00J11p5j09j9r7R8mK27l22J22L35m63M76
$$ -144 -128 -26 84 212 168 46 32 66 150 -74 26 137 62 -47 -66 -163 -65 -69 158 -164 -42 293 -170 306
7696C06m66J64K98j82j59N8m0J77k37K70k80J78j70o2L77r7j48k13M00l7K7k43
$$ 306 -160 4 302 120 -39 19 -21 156 -81 189 -91 87 -83 -145 232 135 -13 -226 174 137 164 -79
7718g9J87k02K48j76J57J00o5k63K16l73L27j31Q8j0J35j70K5j66m8K83o8MJ4
$$ -79 108 -94 154 -22 135 235 170 -93 123 -250 77 -54 34 24 159 -11 14 -152 -200 83 15 19 33
7741C3J54k83j1J48Np1K88k31M1m3l6l08L24J98k35j05K44m2j51J31j40N0l4J04
$$ 33 187 -96 -107 41 46 -25 263 32 73 30 -6 -314 10 208 -27 -132 112 70 -81 50 -90 -40 -74 30
7765C0P1l35J25j6P9R1j92K99k38J67j40J35j16J25k27K00O5k11l8q6L94q8l32
$$ 30 101 -234 -109 -125 -46 45 -147 152 -86 81 -59 76 -40 85 -142 58 123 -88 -126 -212 182 94 -238
7788b38L85%l30K9L44k15J39j20M2J33k67P2J72j34KJqJ39j72J15J7m9O0k18L08
$$ -238 147 147 -183 -154 190 -25 114 -6 36 169 -98 -26 146 12 14 15 7 146 -26 89 106 57 117 -101 207
7813B07l49O6J53K8J31l14K42k14J7J61k10M5Q7r6K85l93M8R3k28K53j50O6M0
$$ 207 -142 -76 77 105 236 -78 164 -50 -33 128 -82 -37 50 -46 239 -154 -106 -13 -241 12 -138 -72 -32
7836c2K08k38m5J37j21l7n6K79l34J00N2oK72j03M4L6k68N4m5j73L15n6m1J54
$$ -32 176 -62 -107 30 -91 -128 -184 95 -239 -139 -87 -93 179 76 120 156 -112 -58 -103 -276 39 -17 -58 96
7860I6m0r9O4L1k6j1r9O0nJ74J4m9l3l7m6N3k77k3OL39K2j18j59J12J39k57L90
$$ 96 56 -43 21 52 26 15 -84 -24 -29 145 159 110 77 40 -6 47 -230 -253 -247 92 114 -4 -163 -51 88 -169 221
7887B21m09O6J90NJ42m11J92j56K64M7l14P0PJ07l3p9J1mJ11o6k7J05j30K24o3
$$ 221 -188 -122 68 73 215 -196 -4 -160 104 151 -163 -93 -86 21 -12 -91 -80 -84 27 -39 -66 39 -91 133 70
7912G0k07J78k69K22Q1j21L03k31j38Q2J96m04L24l28K68q8K23j8j78N3J07jk55
$$ 70 -137 41 -228 -6 75 -46 257 26 -112 -30 166 -238 86 -242 26 -62 161 143 -35 18 125 124 -131
7935a31o1J30L2n2J10l6N0q3m4K45l38K81j09j6K3J20p2n0J09r8j23J55k27L51
$$ -131 -192 -62 -30 -82 28 -8 42 -41 -85 160 -178 103 -6 -22 1 121 49 -1 108 10 -113 42 -185 166
7959A66l81J96j68K31lq4J43j24O3m6j31K93j82%r2j77K84J16J20j01q2O7q9k00
$$ 166 -215 -19 -187 44 41 -43 100 -24 39 -7 -138 155 -27 -27 -119 -296 -12 104 224 123 41 108 19 -181
7983a81L80j69Np3p5J91j28Q9j59L9l7K7j06J26kL7o7K13k30O9j14K08j92J12
$$ -181 199 30 35 -38 -113 78 -50 39 -120 -81 -118 -91 -197 -71 -73 -36 -103 110 -120 -51 -165 43 -149 -37
8007c7n3PJ2N3K05j56J08m5j36O5j9J24jm6R5k73L99k12n1J3k6ml4j1k18K64K46
$$ -37 -90 -83 -71 -18 187 31 139 94 -42 23 4 128 127 81 176 -97 302 90 39 52 26 22 -12 -23 -241 23 269
8034B69k55J2m3J00o5J55k54r5K66o0P5J16p4j27r0np3J86L01l93J42K8l08L53
$$ 269 14 26 -17 83 18 173 -81 -176 90 30 105 221 147 20 -70 -75 -148 38 339 -54 88 116 -192 161
8058A61k36J38r4K61k38q5k0lJ08K4J36j30m6m9r6J35P7j29J16j81K83k05kJ32
$$ 161 -75 63 -31 230 -8 -93 -113 -116 -8 16 152 22 -24 -73 -169 -34 43 -86 30 -151 132 -73 -75 57
8082E7J7J0j26j51K1L66L7k13j18N4q5J19R7o2j55J74q6O0J79j34j27J14P9k89
$$ 57 74 84 -42 -193 -172 194 231 18 -100 -46 -131 -12 85 23 -132 42 -44 16 195 61 -66 48 127 -162
8106a62J34L6q6J83l0L3j64J23k5j05P1Qk2J91k12L9K2k7K4N2j58K03l4l77K76
$$ -162 -28 8 -78 105 75 108 -56 67 42 -63 8 16 -6 185 -27 12 34 7 31 83 -75 128 94 -283 -7
8131gK4j2J7o6j85L22N5j07j93L10j81O8j22Q6j65O8P9QR7q8m3L16k31n1q6J60
$$ -7 17 5 22 -44 -229 93 148 41 -152 158 -23 45 -77 9 -156 -88 -9 -1 96 8 -35 281 50 -1 -87 73
8157G3Q8k04J05p0q8K85l49k0O5O1p5J32N1J17k34j53K65j29K64o0k9K7j60L10
$$ 73 161 -43 62 -8 -96 189 -160 -180 -115 -54 -129 3 54 171 -63 -216 49 -80 184 124 95 122 -38 272
8181B72j77L0j96L2J19L8o8m9k8J4
$$ 272 95 125 -71 -39 80 118 50 1 -27 -13
8191a3
$$ Imaginary data points
##PAGE= N=2
##DATA TABLE= (X++(I..I)), XYDATA
0@%%%%%%%Qj6J6k4L2m0N6p2Q8j12J44j76K15k63L15l75M46n28O21p27Q45r76J126
$$ 0 0 0 0 0 0 0 0 8 -8 8 -16 16 -24 32 -40 48 -64 80 -96 119 -144 171 -204 242 -286 335 -392 453 -523 603
30F03j295J485j695J928k185K468k779L122l503L920m374M872n417O008o655P363
$$ 603 -692 793 -902 1026 -1159 1309 -1470 1652 -1851 2069 -2305 2567 -2850 3158 -3497 3866
46C866q137Q983r905J0914j2021J3238j4581J6065j7718J9565k1637K3990k6682
$$ 3866 -4271 4712 -5193 5721 -6300 6938 -7643 8422 -9296 10269 -11368 12622 -14060
59a4060K9794l3441L7785m3062M9631n8072O9368q5374J10113j55221L74206j150110
$$ -14060 15734 -17707 20078 -22984 26647 -31425 37943 -47431 62682 -92539 281667 -868443
71h68443Q00694P49353j147539O84977m26001K03813L17035o29099L95019P5127
$$ -868443 -67749 681604 -465935 219042 -206959 -3146 313889 -315210 79809 154936
81A54936l69864L09831r6236K7432j32785J16887J94415m05008P1116M01960k72541
$$ 154936 -214928 94903 -1333 26099 -106686 10201 204616 -200392 -129276 272684 143
92A43k48421L20496M9749k51633J51475j07332J50757M9720l92104M41764q8894
$$ 143 -248278 72218 121967 -129666 21809 -85523 65234 114954 -277150 164614 75720
103G5720l51730N00678l16386O0247J93515m60181N07185j40066l43575M68400
$$ 75720 -276010 224668 -91718 -31471 162044 -298137 209048 68982 -274593 193807
113A93807k26218R448K7428q9087K39064k62081J19983Q3144k55474L08487j61254
$$ 193807 -32411 -22963 4465 -84622 154442 -107639 12344 95488 -159986 148501 -12753
124a2753j00811K27455j70039J27097n6094j44459K14727J4778j71354l2942K67558
$$ -12753 -113564 113891 -56148 70949 14855 -129604 85123 99901 -71453 -104395 163163
135A63163j36422j59153K41950j68843R2733O5845k71071K91594q6374j30722
$$ 163163 26741 -132412 109538 -59305 33428 99273 -171798 119796 33422 -97300
145i7300K08868k22264J74638J8106k13978K08381r5311M5107j2371j16364K29354
$$ -97300 111568 -110696 63942 82048 -131930 76451 -18860 26247 13876 -102488 126866
156A26866j70264j5842J54622j83828J19134L881j09001J20712n0095k2641Q880
$$ 126866 -43398 -59240 95382 -88446 30688 34569 -74432 46280 -3815 -26456 -17576
167a7576L7848q832n3775O5985o8330Q5841l7663j18851K22784j21800n4548J20918
$$ -17576 20272 11440 -42335 23650 -44680 41161 3498 -115353 107431 -14369 -68917 52001
179E2001j19647J31231p3383p9731J85920j42005N8387q792r9051K14866j48619
$$ 52001 -67646 63585 -9798 -89529 96391 -45614 12773 3981 -95070 119796 -28823
190b8823k8573J00585p1455R4495j25517J8152J38588j39358M3010K133k0812
$$ -28823 -57396 43189 -28266 66229 -59288 -41136 97452 -41906 1104 3237 -17575
201a7575P5301q8422K6764R279J0654K3963j08894R7584K691m5482L6934o9227
$$ -17575 57726 -30696 -3932 5347 16001 39964 -68930 28654 31345 -14137 22797 -46430
213d6430J00583l1948q0332R4551l1342J8660l9753j2714R8859j12778M9763K2648
$$ -46430 54153 22205 -58127 36424 5082 23742 -16011 -28725 70134 -42644 7119 29767
225B9767q5166J32157j12684R31J08307j28998P6400j3237l8086Q1194r2855K7643
$$ 29767 -55399 76758 -35926 -34995 73312 -55686 20714 7477 -30609 50585 -42270 -14627
237a4627M8364n3741K0176j1606J1898J899p204k873j8635O7909o6338m192O4465
$$ -14627 33737 -20004 172 -11434 464 2363 -4841 -7714 -26349 41560 -24778 -28970 35495
250C5495p4271O8616n2850j6605J15028j26454L4176M2512o2597R0425r6860J3255
$$ 35495 -38776 29840 -23010 -39615 75413 -51041 -16865 25647 -36950 53475 -43385 -30130
262c0130J02783j26755O2689J526m2284Q4426q6161K0583M3408l9881J5767k5649
$$ -30130 72653 -54102 8587 10113 -32171 52255 -33906 -13323 30085 -9796 5971 -19678
274a9678L6401L091l8616K3324j2190L2852j5404m1090N8256k2910J766m744k3218
$$ -19678 16723 19814 -18802 4522 -7668 25184 9780 -31310 26946 4036 5802 1058 -22160
287b2160O3868m6093q136K5697j2472K3617m8136K4628K8603l8853J7509k6407
$$ -22160 41708 -4385 -12521 13176 704 24321 -23815 813 29416 -9437 8072 -18335
299a8335K8922J9716o5988M7921p885p983K6296o3021O0035o875l6915M1719m2607
$$ -18335 10587 30303 -35685 12236 4351 -3632 22664 -40357 19678 12803 -24112 17607 -25000
312b5000M5300j3480m9590P0850l1911n241J5207l8577N8940k6447k8586L9983
$$ -25000 20300 6820 -42770 28080 -3831 -9072 6135 -32442 26498 51 -28535 11448
324A1448k3736K7316k7409q620M2942l5689J3783p343K836K1315l9591K1160R594
$$ 11448 -12288 15028 -12381 -21001 21941 -13748 35 -7308 -4472 16843 -22748 -1588 8006
337H006j3847J3807k7123K4240Q356k7122K0825j7852K2098m682k5011L5565k3952
$$ 8006 -5841 7966 -19157 5083 13439 -13683 7142 -10710 11388 6706 -18305 17260 -6692
350f692J3738m198j6242M1151l7121L986K1147k4830L0864l0497j658M1891m7258
$$ -6692 7046 2848 -13394 27757 -9364 -5378 15769 -9061 21803 -8694 -10352 31539 -15719
363a5719K5700p283j4357M5020n2894J7746K3284l3952K3696j5967L637J9808
$$ -15719 9981 2698 -11659 33361 -19533 -1787 21497 -12455 11241 -4726 -1089 18719
375A8719l0711Q855J0629m112j896j1262J5516n288J526p121m190K7034l2720
$$ 18719 -11992 -3137 7492 3380 1484 -9778 5738 450 1976 -5145 -9335 17699 -15021
388a5021J4964N628k4746L8024l3606M037L0473m1964K8818q200j8088M4406m5416
$$ -15021 -57 5571 -19175 18849 -14757 -10720 19753 -22211 6607 -1593 -19681 24725 -20691
401b0691J2386K2653l1292L0289l2000J4116K8567n0037K7047N450j3381J2302
$$ -20691 -8305 14348 -16944 13345 -18655 -4539 24028 -26009 1038 6488 -6893 5409
413E409k1103K2872L158k6405K1541o618L721K688j5639J7843q223M675J430j3748
$$ 5409 -15694 7178 10336 -16069 5472 -1146 2575 5263 -10376 7467 -756 3919 5349 -8399
427h399J0762Q078l583k1460J9284J3661k6241R673k402P527R626l8777L1839
$$ -8399 2363 10441 6858 -14602 4682 18343 -7898 1775 -627 6900 16526 -22251 9588
440I588Q369l4767L3834k5856J0188J8826m1982L8842j9623r746M1342m6545J2717
$$ 9588 17957 -16810 17024 -8832 1356 20182 -21800 17042 -2581 -12327 29015 -17530 -4813
453d813J9050k4923K4514k5147K785K9354l4376J3674j767k381J4256k3598J4034
$$ -4813 14237 -10686 13828 -11319 -8534 20820 -13556 118 -1649 -4030 10226 -13372 662
466F62L64p973J1172r167j413N832K917m916p628J1218k55j910j968j0920K3657
$$ 662 1026 -6947 4225 -4942 -6355 -523 2394 -2522 -10150 1068 813 -1097 -3065 -13985 9672
481I672p147j3021P861k435J9792k2475l777K0661j5335J6717j7252o391L3214
$$ 9672 2525 -10496 -2635 -5070 14722 -7753 -11530 9131 -6204 10513 -6739 -13130 20084
494B0084k8133P511P402k3107L4916j9082o188J4054j9285L8392l2455j7288N1819
$$ 20084 -8049 -538 6864 -16243 18673 -409 -6597 7457 -11828 26564 -5891 -23179 28640
507B8640k7953l054J376o236L3081l0857q386K8980j7389Q821o576n408J3264
$$ 28640 687 -2367 -991 -7227 25854 -5003 -13389 15591 -1798 7023 447 -4961 8303
520H303j2694J5852j0906j5597K6163K323k3682n13K4016q277j1970L557J326
$$ 8303 -4391 11461 555 -15042 11121 13444 -10238 -10751 13265 4988 -6982 -3425 -2099
533b099J3562j5735q698K4667j7820N337O199k0922K5016j7513R641Q621m2528
$$ -2099 11463 -4272 -12970 11697 -6123 -786 5413 -15509 9507 -8006 1635 10256 -32272
546c2272M9208p905l1904L3113k5149K1720N593m3854M4238j0465j2535K3247
$$ -32272 16936 9031 -22873 10240 -14909 6811 12404 -31450 12788 2323 -10212 13035
558A3035l6083L1702P67k6293K9177k6450J3881K1218l9744J1920J9116r238l640
$$ 13035 -23048 8654 9421 -16872 12305 -14145 -264 20954 -18790 -6870 12246 3008 -632
571f32j0072J1747J5886j9520j0111J8289M477r548J32j0312J9436L373k6153
$$ -632 -10704 1043 16929 -2591 -12702 5587 10064 516 648 -9664 9772 13145 -13008
584a3008K1914j4311J0538J5825m7101L4901Q657l1069K7923k5823J3668K0984
$$ -13008 8906 -5405 5133 20958 -26143 8758 17415 -13654 14269 -11554 2114 23098
596B3098m6561L4043o396j3589L1150m2328K4174R971k9152L0331k3869K703K4107
$$ 23098 -23463 10580 4184 -9405 21745 -20583 3591 13562 -15590 14741 -9128 -6425 17682
609A7682l1267J5646Q04j3377K1080j5517p14P527n561P375p869k003N303O428
$$ 17682 -13585 2061 2865 -10512 10568 -4949 -5663 1864 -3697 3678 -4191 -6194 -891 5537
623E537j0395k973J0469n917R064j3752l313K6211k0349j258Q466j0639K3607
$$ 5537 -4858 -7831 2638 -3279 5785 -7967 -11280 14931 -5418 -6676 1790 -8849 14758
636A4758k1411o228K6011k1416J7411j4668q723L6944l0678M042P448j1484K7031
$$ 14758 -6653 -12881 13130 -8286 9125 -5543 -14266 22678 -8000 -3958 3490 -7994 19037
649A9037k7671k834K9676k2465O679m098j377J8460k3677J0013K869o097J1122
$$ 19037 -8634 -11468 18208 -4257 2422 -1676 -3053 15407 -8270 1743 4612 -1485 9637
662I637j6601R420L341o520N088q734R320o05p766O839m633O876p547k670J6271
$$ 9637 -6964 2456 5797 -723 4365 -4369 4951 4346 -3420 3419 -1214 5662 -1885 -4555 11716
677A1716j8821Q186J100p243J6640k3405J1450R725j8856J3946j1037O275R293
$$ 11716 -7105 1081 2181 -5062 11578 -11827 -377 9348 -9508 4438 -6599 -324 8969
690H969k3238J6465j53o831R231j8353J9900j400j6137J5617j1756J2274k786
$$ 8969 -14269 2196 2043 -4788 4443 -13910 5990 4590 -11547 4070 -7686 4588 1802
703A802j4900J7700n235Q73l135n530J6922r966m377N665j277R678j7040M947
$$ 1802 -13098 4602 -633 240 -2895 -8425 8497 -1469 -5846 -181 -1458 8220 -8820 -3873
717c873J2420j3045Q483j0899R237O896j8836J3862n015K904M289j7741J9397
$$ -3873 8547 -4498 3985 -6914 2323 9219 -9617 4245 -770 2134 6423 -11318 8079
730H079l102j0232J2098j3339J4638l001j6421K2162j1377K338J146j0161J8891
$$ 8079 4977 -5255 6843 -6496 8142 5141 -11280 10882 -495 1843 2989 -7172 11719
743A1719j2453k762P010l952Q103j3072K396J1796j1284L741n276M655Q190j8908
$$ 11719 -734 -3496 3514 -438 7665 -5407 -3011 8785 -2499 1242 -4034 621 8811 -10097
757a0097J2068l82k788M834j4596J6667l097q969Q020p743J1694n076j1686J6358
$$ -10097 1971 1589 -1199 3635 -10961 5706 2609 -6360 1660 -6083 5611 535 -11151 5207
771E207o358P17j323o682J7698j3314j671P894o003J0281j4947M969J0830j2239
$$ 5207 -1151 -434 -1757 -8439 9259 -4055 -5726 2168 -3835 6446 -8501 -3532 7298 -4941
785d941O093p038O163Q074j7714R263K472k790M695j3702J4153M79j1278R549
$$ -4941 1152 -5886 277 8351 -9363 -100 2372 -418 4277 -9425 4728 5207 -6071 3478
799C478p277J1039n405j0240J6501p839J694j429n654J5933j1193l758R128o421
$$ 3478 -3799 7240 1835 -8405 8096 257 1951 522 -5132 10801 -392 -4150 4978 -1443
813a443R026j0471q10J3505j2145L946l047K499O448j3270O278K046k98r37q153
$$ -1443 7583 -2888 -3698 9807 -2338 1608 -1439 1060 7508 -5762 516 2562 2264 1327 -6826
828f826J1682j246p573M761m839J0506o703q748J5894r913L800k547n340J7037
$$ -6826 4856 3610 -3963 798 -4041 6465 -238 -8986 6908 -3005 795 -1752 -7092 9945
842I945j5060M6Q487p313Q379r839m99J3669j2018K134J38l93Q160j3207N644
$$ 9945 -5115 -5069 3418 -3895 4484 -5355 -5854 7815 -4203 -2069 -1931 -2324 5836 -7371 -1727
857a727M027l410K009p611R818k8o844K363n97Q602p899n648J2008m323R48l940
$$ -1727 2300 -1110 899 -6712 3106 3078 -3766 -1403 -2000 6602 -1297 -6945 5063 740 1688 -2252
873b252k269J5108j3679R5O989n565Q985j3247N120R273j2414P022m494O76R888
$$ -2252 -4521 10587 -3092 -2997 3992 -1573 7412 -5835 -715 8558 -3856 3166 -1328 -652 9236
888I236j4394M720M851n937O662r615N619N226j0054M758j683M117k103o438Q152
$$ 9236 -5158 -438 4413 -1524 5138 -4477 1142 6368 -3686 1072 -611 3506 1403 -5035 3117
903C117k52l803k568L985L908p757J889J650J79K918j1217R221L554j1336Q713
$$ 3117 2865 -938 -3506 479 4387 -3370 -1481 169 348 3266 -7951 1270 4824 -6512 2201
918B201o877O219K861j4877J3272k186k104L885j2417J4122R32j4040J0277l854
$$ 2201 -4676 1543 4404 -10473 2799 613 -1491 2394 -10023 4099 5031 -9009 1268 -2586
932b586N126J48j3742J5403j556m927P47l620J1821o115o806P387L7J415l676
$$ -2586 2540 2688 -11054 4349 2793 -2134 -1387 -5007 6814 699 -6107 1280 1317 2732 -944
947i44l011Q174j757l855o13L445K537n789K793r77K157L08n588O905l881R24
$$ -944 -3955 4219 2462 -1393 -2006 1439 3976 -1813 980 3 2160 2468 -3120 3785 -96 828
963H28J280m930Q422p224J7Q407j1226O608R0o926J3098j3119K138R345j0647
$$ 828 2108 -2822 5600 -1624 -1607 6800 -4426 2182 2272 -4654 8444 -4675 -2537 6808 -3839
978c839P605q006K213J1171j5338M088L727k470N727j2478M710J1017j1601N28
$$ -3839 3766 -4240 -2027 9144 -6194 -2106 1621 -849 4878 -7600 -2890 8127 -3474 -2946
992b946J82L555L854j0568K282M983J213m472k988M097M149k300p470M972N409
$$ -2946 -2764 791 4645 -5923 -3641 1342 2555 -1917 -4905 -808 3341 1041 -6429 -1457 3952
1007C952m527p40l024N319N368j3282N471M945n496N910j0004O784N515j2625
$$ 3952 -575 -1315 -4339 980 6348 -6934 -1463 3482 -2014 3896 -6108 676 6191 -6434
1021f434J0424n239q69R847j3804P820K219r812J3228q926j267R402j0905Q346
$$ -6434 3990 -1249 -2118 7729 -6075 1745 3964 -5848 7380 -1546 -2813 6589 -4316 4030
1035D030k286n885Q983n213J666M05n377P460l71o596L356J660L13r94m804L511
$$ 4030 1744 -4141 4842 -371 1295 1700 -3677 3783 3412 -3184 172 1832 2145 1151 -3653 -142
1051a42O382p438l822P618k156K097m684m023J3474p631l298M340m945J0560p606
$$ -142 6240 -1198 -5020 2598 442 2539 -2145 -6168 7306 -325 -3623 717 -4228 6332 -1274
1066a274p096J3540o447R42L37p228J4115p516n527R139o520P229m801n951J2083
$$ -1274 -8370 5170 -1277 -335 2 -7226 6889 -627 -6154 2985 -3535 3694 -1107 -7058 5025
1081E025n993j090L309n265O655j930m653N940k743L81R61j642J522j53m69J77
$$ 5025 -968 -2058 1251 -4014 2641 711 -3942 1998 -745 -364 597 -1045 477 324 -145 32
1097C2J694l544K814J497m152L759k900J418L518p713M704K442n177M926o470
$$ 32 1726 -1818 996 2493 -1659 2100 -800 618 4136 -3577 1127 3569 -1608 3318 -3152
1112c152L777O091j1396O388p96r25M879j0370O346M231p136L055k867K931L479
$$ -3152 625 6716 -4680 1708 912 -13 4866 -5504 842 5073 -2063 992 -1875 1056 4535
1127D535q576L962J361j505J801o236N906J012m308J484p72L119j402l119J720
$$ 4535 -4041 -79 1282 -223 1578 -4658 1248 2260 -2048 -564 -1336 1783 381 -2738 -1018
1142a018J458K66k551K23K569j549j87j239J466J754m273L636j051n52K362m991
$$ -1018 440 706 -1845 -1622 947 -602 -789 -2028 -562 1192 -3081 555 -496 -1048 1314 -3677
1158c677N122j333k873M583l572K328L12m007O130l681j136M096m673N161k909
$$ -3677 1445 112 -2761 1822 -1750 578 890 -3117 3013 -668 -1804 2292 -2381 2780 -129
1173a29k557N957l690J353q25p17L887l969J00K044j237K073l451P78L258k923
$$ -129 -2686 3271 -419 934 109 -608 3279 -690 -590 1454 217 2290 -1161 -383 2875 -48
1189d8P65q13J532R02l705K060m30J429j162k236L553j272o50n5n70K616k599
$$ -48 717 -96 1436 2338 -1367 693 263 1692 530 -1706 1847 575 -75 -130 -700 1916 -683
1206f83o32K404k112K393k623k04L654m415K502r02n66L042m788K399J432l124
$$ -683 -1315 1089 -1023 1370 -1253 -1457 2197 -2218 284 -618 -1184 1858 -2930 -531 901 -2223
1222b223K973k293P94K502m478K622p0n98J329l172L487q15j214J353j427K816
$$ -2223 750 -1543 -749 1753 -2725 -103 -173 -771 558 -2614 873 58 -1156 197 -1230 1586
1238A586j975r18K282j089P36j114N1K396k817R06M93r31K759l814J790J140j721
$$ 1586 -389 -1307 975 -114 622 -492 -441 1955 -862 44 537 -394 2365 -1449 341 1481 -240
1255b40J995l129K479Q15l052K607j038pJ128k968K683k72j597J781k306K987
$$ -240 1755 -1374 1105 1920 -1132 1475 437 430 1558 -1410 1273 1001 -596 1185 -1121 1866
1271A866j856j167L029k498J542r32j107K675k022Q8M91n76J256k086Q80R18j781
$$ 1866 10 -1157 1872 -626 916 -16 -1123 1552 -470 -382 109 -467 789 -1297 -417 501 -1280
1288a280K015k272J015J464l162K544j777J287P57k979K740n75j058J680k127
$$ -1280 735 -1537 -522 942 -2220 324 -1453 -166 591 -2388 352 -223 -1281 399 -1728
1303a728J993l91j938L066k071J227m98j364L256k601R67L44j097K265k216P79
$$ -1728 265 -126 -2064 1002 -1069 158 -340 -1704 1552 -1049 -82 262 -835 1430 -786 -7
1319gR62j530J641j597M74J540k595K099q90j77J948k774K002m68m19R47j579
$$ -7 955 -575 1066 -531 -57 1483 -1112 987 97 -80 1868 -906 1096 628 209 1156 -423
1336d23J721q94q46J681j420R63n98o29K067j958O28K13j024K380l347K008M03
$$ -423 1298 404 -442 1239 -181 782 184 -445 1622 -336 292 505 -519 1861 -1486 522 925
1353I25k019K309k618J382J340k702J771j048J39J867l681K586kj929K525k757
$$ 925 -1094 1215 -1403 -21 1319 -1383 388 -660 -521 1346 -2335 251 249 -1680 845 -1912
1369a912K040N33k641K218j286J101m7j876K157l25n75M20q18J485n25r34J011
$$ -1912 128 661 -1980 238 -1048 53 6 -1870 287 -38 -613 -193 -1011 474 -51 -985 26
1386B6r7N15j317J084l6p01J762k315J476M31j868K308k103Q42J655k954L062
$$ 26 -71 444 -873 211 175 -526 1236 -1079 397 828 -1040 1268 -835 7 1662 -1292 1770
1403A770j669j122L511l687K230K72k888M511l600K47K242k836K616j571r56L150
$$ 1770 101 -1021 2490 -1197 1033 1305 -1583 2928 -672 -425 1817 -1019 1597 26 -930 2220
1419B220k274N9N67j396K774k276p98K006o79J99j121K18R19L82j571l90K176
$$ 2220 -54 5 572 -824 1950 -326 -1124 882 203 402 -719 -501 418 800 -771 -1161 1015
1436A015j200J89j056L3L068k955p35K316j671J920k161j049M690l994J419M28
$$ 1015 -185 4 -1052 -1019 2049 -906 -1641 675 -996 924 -1237 -2286 2404 -1590 -171 257
1452B57k411M248l303m18L099l211K838j133k328M705l437P07J435l386M274j827
$$ 257 -2154 2094 -1209 -1627 1472 -1739 1099 -34 -2362 2343 -1094 -387 1048 -2338 1936 109
1468A09j329K506k113J423K48j682J368K61n17M48j365Q10J161j116o40R72r2
$$ 109 -1220 1286 -827 596 844 -838 530 791 274 722 -643 167 1328 212 -428 544 452
1485D52K04m5k254L242m09k126K003k318K986m4m553M125r26k01R83l898L881
$$ 452 656 611 -1643 1599 1190 -936 1067 -1251 1735 1691 -2862 1263 337 136 1119 -2779 1102
1502A102P40m023K899j985K207J034n486M454j77j539J295k855K925Q01l483J915
$$ 1102 1842 -2181 718 -1267 940 1974 -3512 942 765 -774 521 -2334 591 1392 -2091 -176
1518a76l12J15J217k865J533J307j583L15k76L46P33l91j367J910o81l14J048
$$ -176 -488 -373 844 -2021 -488 819 -764 -449 -725 -379 354 -37 -1404 506 -175 -489 559
1535E59j879J446M70j746K009j601L81K427l563K012q1j398L476m129J015K696
$$ 559 -1320 126 596 -1150 859 -742 -361 2066 -1497 515 434 -964 2512 -1617 -602 2094
1551B094l099K319j958J70L498l966N23J586j326J866k732K43L044k421J11n64
$$ 2094 -1005 1314 -644 -474 3024 -942 -419 1167 -159 1707 -1025 -782 2262 -159 -48 -612
1567f12O80J956k389o79J674L22j002l26J29J221J12k364J169J020j141O83j397
$$ -612 68 2024 -365 -1044 630 952 -50 -376 -247 974 1086 -1278 -109 911 -230 453 -944
1584i44N25K077l132J162N15j198K356l053J154J830k958J940o36q37K441k748
$$ -944 -419 1658 -1474 -312 203 -995 1361 -1692 -538 1292 -1666 274 -362 -1199 1242 -1506
1600a506J211J165k549K725j391k97J448k205K022m67j346J608p34P03j17j422
$$ -1506 -295 870 -1679 1046 -345 -642 806 -1399 623 156 -1190 418 -316 387 270 -1152
1616a152J632L53r95J95k46J176q63n88M94R69k74j218P62L45M00p97j389K794
$$ -1152 480 833 -162 33 -213 963 100 -488 6 975 701 -517 245 590 990 193 -1196 1598
1634A598j124p72O25q50J864q68j988K729j068P6L66j821L058j838p26J433j178
$$ 1598 474 -298 327 -523 1341 473 -1515 1214 146 222 588 -1233 1825 -13 -739 694 -484
1651d84J473j286p80K104j000m05M20o59J358j380j35J396j094L71o39N81M10
$$ -484 989 -297 -1077 1027 27 -378 42 -617 741 -639 -774 622 -472 -101 -740 -159 251
1668B51q36L12j83M34l96k70R43n49K32l70k92J669j418k46J008p41J193j701
$$ 251 -585 -273 -456 -22 -418 -688 255 -294 -62 -432 -724 945 -473 -719 289 -452 741 -960
1686i60K68J851j747R39p00K47J194j980P35J118p61K50r80R46N67j682J100l49
$$ -960 -692 1159 -588 351 -349 -102 1092 -888 -153 965 204 454 -526 420 987 -695 405 56
1704E6N67j24j244J634j71m88l90q9J389q77p25P09O3L0k76n22J280r56M3J34
$$ 56 623 499 -745 889 718 230 -160 -249 1140 263 -462 247 310 340 64 -458 822 -134 -91 43
1724D3J5O40j309L95N89m22L25j228J366j1j227Q39l13L99J87j387J401k26n53
$$ 43 58 698 -611 -216 373 -49 276 -952 414 403 -824 15 -298 101 288 -1099 302 76 -477
1743d77L80q55J609r36m87Q30k54K37m31k52J034q11j9K17K9P87j280M18O18n14
$$ -477 -97 -952 657 -279 -766 64 -190 47 -384 -636 398 -413 -432 -215 -186 601 -679 -261 357 -157
1763a57M76r56J002K35j062O16l86P36k31r92J261j82n53K90j92Q25l86p76R37
$$ -157 319 -637 365 600 -462 154 -232 504 273 -719 542 360 -193 97 -95 730 344 -432 505
1782E05l03L88o17k28J214j095K15j48K82P07j333M60O28r32L75m61M10Q39j432
$$ 505 202 590 -27 -255 959 -136 79 -69 213 920 -413 47 675 -257 118 -343 67 906 -526
1801e26N15R3K55j64o39Q16k79k34k3o2O65m72n64O11Q5j93o39M05N77o27P2O6
$$ -526 -11 82 337 173 -466 350 71 -163 -186 -248 417 -55 -619 -8 77 -116 -755 -350 227 -400 -328 -262
1823b62K78M10r20M30K06k48J96q17J058J48j076N83j40N3K50r28J356j50p31
$$ -262 16 426 -494 -64 142 -106 90 -727 331 479 -597 -14 -154 -101 149 -779 577 427 -304
1842c04O18n91P35k61p84J158m55k87K45q3O65m74n11N32q4N58o69j98J009m28
$$ -304 314 -277 458 197 -587 571 116 -171 74 -9 656 182 -329 203 119 677 8 -190 819 391
1862C91l29l79N61K93n68J11m7P68p07m59P88q4j23k22l55P78n02o18R29p96J123
$$ 391 62 -317 244 537 -31 80 33 801 94 -365 423 339 216 -6 -361 417 -85 -703 226 -570 553
1883E53r37m54J554j300M18K15p33J131n70n85J312j109L45L61q34Q16o59J11
$$ 553 -384 -838 716 -584 -166 49 -684 447 -123 -708 604 -505 -160 201 -633 183 -476 -365
1901c65M85m57J83NKK84j72k99M78M4m06J62n5N36k64n76M57N85r80L63k47O49
$$ -365 120 -337 -154 -149 -147 137 -35 -334 144 188 -218 -56 -111 425 161 -415 42 627 -353 10 -237 412
1923D12N17j459R73j36l30O74j345R36O92j360Q62j88k33Q89j767J197N73j037
$$ 412 929 -530 443 307 -23 651 -694 242 934 -426 436 248 15 904 -863 334 907 -130
1941a30N45r24M84P42j150L65J98j66K26n20J56P32o70J48j53j86L82K3n61J76
$$ -130 415 -509 -25 717 -433 -68 130 -36 190 -330 -174 558 -112 36 -117 -303 79 102 -459 -283
1961b83L30k84P72j083J66N91q41P21o33O2Q44r16Q9P01q20Q51k25j034J705j258
$$ -283 47 -237 535 -548 -382 209 -632 89 -544 -482 362 -554 -465 236 -584 267 42 -992 713 -545
1981e45K99J93n02J540j380k76J188p92P40k58p46J269m87n47L00n7P59l42q18
$$ -545 -246 -53 -555 985 -395 -671 517 -275 465 207 -539 730 243 -304 -4 -61 698 356 -462
2000d62Q43o3m33J55M4J05M86j180N50K34j89M30o50J67O54q42LM88r01J201o47
$$ -462 381 318 -115 40 84 189 675 -505 45 279 90 520 -130 37 691 -151 -148 340 -561 640 -7
2021gn84J080p89O41k67o08J077o64m44R11p97P32l7j148J421q84J87K27p91R15
$$ -7 -591 489 -300 341 74 -534 543 -121 -565 346 -451 281 244 -904 517 -367 -180 47 -744 171
2041A71j9n75L88k53K8N39j005M44M31k48L65n86K17K52k92k85L73J31J97j94
$$ 171 152 -423 -35 -288 -260 279 -726 -282 149 -99 266 -320 -103 149 -143 -428 -55 76 273 79
2061G9q76R71kn45M43n42P72L81j162P89k62k73R67j347R69L09j134J007q87N24
$$ 79 -797 174 172 -373 70 -472 300 681 -481 308 46 -227 740 -607 362 671 -463 544 -343 181
2081A81K12j060J044M3o50P00n50R0M55n89K27j76m6N45l44r5j90K85l06J34l4
$$ 181 393 -667 377 420 -230 470 -80 10 465 -124 103 -73 -119 426 82 -13 -203 82 -224 -90 -124
2102a24p8M89o01N89m44j65M92m30l7K79l78L11j52j96R03p53K41R3n34P43m75
$$ -124 -202 287 -314 275 -169 -334 158 -272 -309 -30 -408 -97 -249 -445 458 -295 -54 39 -495 248 -227
2123b27K02K07n08M26r2l34O16p10K53K45m39O12n24P4N27m07L37k30j80N61o19
$$ -227 -25 182 -326 100 8 -326 290 -420 -167 78 -361 251 -273 -199 328 -79 258 28 -152 409 -210
2144b10J82K4J55J39l27J00jJ96o7j3J10j80J56L6m79O05l17j53J75k98M78l88
$$ -210 -28 -4 151 290 -37 63 62 258 191 178 288 108 264 300 -179 426 109 -44 131 -167 311 -77
2166g7J45K70o80N89p6m84N88m47J63J65o88O92k12j94M46k35L24m45R6L4k43
$$ -77 68 338 -342 247 171 -313 275 -172 -9 156 -532 160 -52 -246 200 -35 289 -156 -60 -26 -269
2187b69M41k06j73K73l13R0J5j55L43j70P3k83K43Q3k12K01n0K6J92k55P1K80
$$ -269 172 -34 -207 66 -247 -157 -142 -297 46 -124 -51 -334 -91 -8 -220 -19 -69 -43 149 -106 -35 245
2209B45l80J06k61J95M02o23K60Oj5J68l40J98Q6r1M9K7P3J31n97N50k43K80j50
$$ 245 -135 -29 -290 -95 307 -316 -56 -50 -65 103 -237 -39 47 -44 5 32 105 236 -361 189 -54 226 76
2232G6k90M98n36L78M2j07J00l09K95j21M7Qj67N3K48j67k05K05o0J22l27K19
$$ 76 -214 284 -252 126 168 61 161 -148 147 26 73 81 -86 -33 215 48 -157 48 -12 110 -217 2
2254BN3j98K47j45l2j51K03j71L7L13m70P8O01m59q2J89l00L58j48j00M15l48
$$ 2 55 -143 104 -41 -73 -224 -21 -192 -155 158 -312 -234 367 -92 -174 15 -285 73 -75 -175 240 -108
2276a08J82l48K57K18n10R8L44l50R7l6K02K22l49j3m3Q4K04j55K72m0m5p1o8
$$ -108 74 -274 -17 201 -309 -211 133 -217 -120 -156 46 268 -81 -94 -137 -53 151 -4 268 228 183 112 44
2299D4N51p57K01o8K33K9k48R1K18m72L09k48L26J99p28M27J48l38K34m81L67
$$ 44 595 -162 39 -29 204 233 -15 76 294 -178 131 -117 209 408 -320 107 255 -83 151 -330 37
2320C7L29m51n2J98J91j94m59M02j94KJ90k92M28k54j8J54j42K63k22O3J44Qj6
$$ 37 366 -85 -137 61 252 58 -401 1 -193 -191 -1 -293 135 -119 -137 17 -125 138 -84 -21 123 131 115
2343A15l22K33n1q3L3J63J81k85k21J80J63j89J1j44N02l26k38O16j93m9k96j9
$$ 115 -207 26 -25 -108 -75 88 269 -16 -237 -57 106 -83 -72 -216 286 -40 -278 338 145 96 -200 -219
2365b19M24l3j45L32l69J50k76j1M44l59J46o5RL45M2l37p9J78m36L29j77J64
$$ -219 205 172 27 359 -10 140 -136 -147 297 -62 84 19 28 373 415 78 -1 177 -259 70 -107 57
2387E7J94l52m7L93j18n01M05j76L93l85k2M15m36M78j46l97L49l81J82K56l14
$$ 57 251 -101 -148 245 127 -374 31 -145 248 -137 -159 256 -180 298 152 -245 104 -277 -95 161 -153
2408a53J37K0k68N78m31k5K74k11Q8l9JJ48l87Q1J94k0rk02N8N55m23m7M3NO3
$$ -153 -16 4 -264 314 -117 -142 132 -79 9 -30 -29 119 -268 -187 7 -13 -22 -224 -166 389 -34 -81 -38 -33 30
2433C0k87J16L21j82o2L6nM76l75j70K68j79k16J16J81j24N75q13K07K61j67M90
$$ 30 -257 -141 180 -2 -64 -28 -33 443 68 -102 166 -13 -229 -113 68 -56 519 -294 -87 174 7 497
2455D97n51P1K65n57L17O4J68j72k14K73K3l09L37n2l68L41o16M86m7m9J86J86
$$ 497 -54 17 282 -275 42 106 274 102 -112 161 184 -125 212 160 -208 133 -483 3 -44 -93 93 279
2477B79m79J34n6m0M44o28N8M17j05M2k33k21O50o6p72Q32l44L84l86k86P07k12
$$ 279 -200 -66 -122 -162 282 -346 -288 129 24 66 -167 -388 262 196 -576 256 -88 296 -90 -376 331 119
2499A19j63N0l16M71k30m17O03n7j26J46k33L06k49j05L66qL9k60q8N5L16j35
$$ 119 -44 6 -310 161 -69 -486 117 60 -66 80 -153 153 -96 -201 165 157 196 -64 -152 -97 219 84
2521H4P3m0nj76j31K0L03K1l05K96j23K04k81J0L76l45O5Q7j58m6k1K25L9j38
$$ 84 157 117 112 -64 -195 -175 128 149 -156 140 17 221 -60 -50 326 -19 46 133 -25 -71 -92 133 172 34
2545C4j74K43j62j25k38N04R1k12O0j32P3Rq2K15j00J52k91K16k88M30k33l47
$$ 34 -140 103 -59 -184 -422 82 173 -39 21 -111 -38 -29 -111 104 4 156 -135 81 -207 223 -10 -357
2567c57N92j54k75P0mK08J47n36M85l05m3P3J27O4K25o54L78J8J06j89j21L80
$$ -357 235 81 -194 -124 -128 80 227 -309 176 -129 -172 -99 28 92 317 -337 41 59 165 -24 -145 235
2589B35k23m8J76j95J61Q3j39M9j2q5j0O8q9k6J36j48k2P8K69l6k30P8k57K73
$$ 235 12 -36 140 -55 106 189 50 99 87 2 -8 60 -29 -55 81 -67 -89 -11 258 222 -8 70 -187 86
2613H6J27r7j10Q1j55J45j09P6k3M9j13O8k4q0K02m24J58L40l19k1nJ93l0j09
$$ 86 213 116 6 87 -68 77 -32 44 21 70 -43 25 1 -79 123 -301 -143 197 -122 -143 -148 45 15 -94
2637i4ML7J08m3o8P4m3k49K44j95K61j13j14K54k5m6l9n7L56k53k10M97m8k69
$$ -94 -90 -53 55 12 -56 18 -25 -274 -30 -225 36 -77 -191 63 38 -8 -47 -104 252 -1 -211 286 238 -31
2661c1O3j13rQ6J42j06J63j96j97J76L73q4k77J59o6j77L37o3JJ28k58j27L38
$$ -31 32 -81 -90 -4 138 32 195 -1 -198 -22 351 267 -10 149 83 -94 243 180 181 309 51 -76 262
2684B62j86P3j07l53M93k56pj39K58l26J84J38N8k79M9K94J7j57j23K69p4j35
$$ 262 76 149 42 -311 182 -74 -81 -220 38 -288 -104 34 92 -187 -138 156 173 16 -107 162 88 -47
2706d7l4k44K23K49j52j35J12K10k79p9P3J65J8k16J22nj27L6J52p6J81l04K81
$$ -47 -81 -325 -102 147 -5 -140 -28 182 -97 -176 -103 62 80 -136 -14 -19 -146 -110 42 -34 147 -157 124
2729A24K8l31K44n4J32k36k07M04q4K8p4n7J71K3n0m3p6J50q2l9J90k39L38l56
$$ 124 152 -179 65 11 143 -93 -300 104 20 48 -26 -83 88 111 61 18 -58 92 10 -29 161 -78 260 -96
2753i6K40J15j14j45lk20J28m1J14K26j40J51k09q4L6j23L34k09L67l59J0J39
$$ -96 144 259 145 0 -3 -223 -95 -136 -22 204 64 215 6 -78 -42 -165 169 -40 327 -32 -22 117
2775A17l79M24j35k85J08k7J77n3k26K06mP8L2N7k25J83j34RJ57k5K59j83k05
$$ 117 -262 162 27 -258 -150 -177 0 -53 -279 -73 -77 1 33 90 -135 48 -86 -77 80 55 314 131 -74
2798g4N4P0K50l37k2L63j99l44K84mJ30r8L6OL7k09J09j20Q2K51k94J66P5q9O
$$ -74 -20 50 300 -37 -59 304 105 -239 45 41 171 73 109 115 152 -57 52 -68 14 265 -29 137 212 123 129
2823A29O7k24P3j56J35J09K5n3k39O1M01l69R4o4j22R6j43J37K56m92J91J65p
$$ 129 196 -28 45 -111 24 133 158 105 -134 -73 328 -41 53 -11 -133 -37 -180 -43 213 -279 -88 77 70
2846G0j15r8K85k3l43n6L21O1k70n7L27M7j67jM2m5J85j38j04O4p3m6J22j87M66
$$ 70 -45 -143 142 119 -224 -280 41 102 -168 -225 102 149 -18 -19 23 -22 163 25 -79 -15 -88 -134 -12 -199 267
2871B67l23j70K45K18j99K25l32K70l05j41K95o8J5J90l18L26j2j97L48j76j04
$$ 267 -56 -226 19 237 38 263 -69 201 -104 -245 50 -18 -3 187 -131 195 183 -14 334 158 54
2892E4J49j62J33j12n0J02m6l52N42k52r5q2N1K52P5l21L50k28J37L5l95N0J56
$$ 54 203 41 174 62 12 114 68 -284 258 6 -89 -171 -120 132 207 -114 236 8 145 180 -215 -165 -9
2915im2n0j6L12J12k72J28l5K29j60k01l10P22l27P3kl31L03o34L93K87j2K4k59
$$ -9 -51 -101 -117 195 307 35 163 128 357 197 -4 -314 408 81 154 152 -179 124 -510 -117 170 158 182 -77
2939g7K1L43k43l11K28q1K49k98q1J08K12k45L09k16Q8L90m05P9J44j81K18l14
$$ -77 -56 287 44 -267 -39 -120 129 -169 -250 -142 70 -175 134 -82 6 396 -9 70 214 33 251 -63
2961f3j0j06O2J61J95m34N64j18l90M15k30J33k79l14O43k25R1j18j67L10p7p5
$$ -63 -73 -179 -117 44 239 -195 369 251 -139 276 46 179 -100 -414 229 4 95 -23 -190 120 43 -32
2983c2Mj05L41l09j61L46L09n77K62k33Q7L39n01O9K10R5P1l68M5J79j64j3J99
$$ -32 -28 -133 208 -101 -262 84 393 -184 78 -155 -68 271 -230 -161 49 144 215 -153 -108 71 -93 -106 93
3006I3J90k33J84l55K23n1m2n9j37K24j58q5M19l80J48J06l17N58j55l30K32k38
$$ 93 283 50 234 -121 102 51 9 -50 -187 37 -121 -206 213 -167 -19 87 -230 328 173 -157 75 -163
3028a63K33J00m19L01K19l05L79n35jN49l97K10k65Q0R8k05j1K74n4j41J77l81
$$ -163 70 170 -249 52 271 -34 345 -190 -191 358 -39 171 -94 -14 84 -121 -132 142 88 -53 124 -257
3050b57M56r1N9J88l47J77j06k47J6J41l5N6l90O27m2k14K49k27J38Q8m68J53
$$ -257 199 108 167 355 8 185 79 -168 -152 -11 -46 10 -380 247 205 -9 240 13 151 239 -229 -76
3072g6J84l38J39J45j50J26j71k5K39k98J41N7p7O7N1J8k4jlj07j37L72m43l6
$$ -76 108 -230 -91 54 -96 30 -141 -166 73 -225 -84 -27 -104 -37 14 32 8 7 4 -103 -240 132 -311 -347
3096c47M12J61k04M6o3kRM6J80k18p3n0O1M99l28q0L0j74j3J27j38K28k8j00O8
$$ -347 65 226 22 68 5 3 12 58 238 20 -53 -103 -42 457 129 49 79 -95 -108 19 -119 109 81 -19 49
3121D9j35N1j8j79M69j47j68N04n95K42K24j60j73K65j07k31o2Q1r2K38j34J69
$$ 49 -86 -35 -53 -232 237 90 -78 426 -169 73 297 137 -36 229 122 -109 -171 -90 -182 56 -78 91
3143I1Nj61K47k5p7k46N0L31k47Q5j14N3J49j10j78J77k05L88l23K37J4l07M0
$$ 91 96 -65 182 157 80 -166 -116 215 -32 53 -61 -8 141 31 -147 30 -175 213 -110 127 141 -166 -126
3166a26L39j71O8o7j07K59p7q9K60l46Q5k89K92J62j92k1k05K71o7n5K98o0k71
$$ -126 213 42 110 43 -64 195 118 29 289 -57 28 -261 31 193 1 -20 -225 46 -21 -76 222 162 -109
3189a09R3k2N5K23l71o8M12r5j80k4J28n2O7r5K17k51N8n3MNo8R6J3N6k38J41
$$ -109 -16 -38 17 240 -131 -199 213 118 -62 -86 42 -10 57 -38 179 -72 -14 -67 -63 -58 -126 -30 -17 39 -199 -58
3215e8Q9j22J94k01K30k99K62q5p9M3j46K89j99J86m2R4k95O6J8j00J87j72L80
$$ -58 31 -91 103 -98 132 -167 95 10 -69 -26 -172 117 -82 104 62 156 -139 -73 -55 -155 32 -140 240
3238B40l25J2R6j6o6n6J99k14J42j25PJ80J3k55K95k4K5r1l82L60J20k16J87q1
$$ 240 -85 -73 23 7 -59 -115 84 -130 12 -113 -106 74 87 -168 127 103 128 37 -345 15 135 -81 106 25
3262B5L8j31m4J00k74K16J0L79p6k44n0J36lj18Q3N0N1l50L33j16Q4k66o2K11
$$ 25 63 -68 -112 -12 -286 -70 -60 319 243 -1 -51 85 82 -36 47 97 148 -202 131 15 99 -167 -229 -18
3286a8K10l55O2J73k01K28j95jK31j0j93m2q0J52J88l40K12p8m3Q7j19L12L3k71
$$ -18 192 -163 -101 72 -129 99 -96 -97 134 124 -69 -111 -191 -39 149 -191 21 -57 -100 -13 -132 180 213 -58
3310e8k8q7L7K07k5j81o5J32j31L14j00R4j68L0j03q4L18O6j77R3j07j19L56j91
$$ -58 -86 -173 -136 71 46 -135 -200 -68 -199 115 15 109 -59 -29 -132 -216 102 168 -9 84 -23 -142 214 23
3334B3jP5j37P5p7J82j40j5O1j50N2pop9K49j72n8K9L1J19R6k71K94j72j27K95
$$ 23 22 97 -40 35 -42 140 0 -15 46 -104 -52 -59 -65 -144 105 -67 -125 -96 -65 54 150 -121 173 1 -126 169
3360A69m25R9R0N5QR1j05L7r2K11q8j80K06o2J7p2k0K20R2n37M14l22R5K06l57
$$ 169 -256 -157 -67 -12 -4 87 -18 19 -73 138 50 -130 76 14 31 -41 -61 159 251 -286 128 -194 -99 107 -250
3385b50J89J68o7nJ46m32K56j22n3R4k31N49N9n58L89k30J67J63n29M49nk00J7
$$ -250 -61 107 40 35 181 -251 5 -117 -170 -76 -307 242 301 -257 132 -98 69 232 -297 152 147 -53 -36
3408c6jJ78J59l64Q2q3K63j89k72L66K58n34K46K9k42K73l96K20J36j54L7M0K0
$$ -36 -37 141 300 -64 18 -65 198 9 -263 103 361 -173 73 102 -140 133 -263 -43 93 -61 -24 16 36
3431C6K65l18K10J07k62J3k78K54K63l05k67J45K58J17k9l49O5R2l7jj89L35j4
$$ 36 301 -17 193 300 38 51 -227 27 290 -15 -282 -137 121 238 209 -140 -75 17 -20 -21 -210 125 111
3454A11l74M18j5k35J14j75R8J27l40K89n2q2L35m76M05J92n63K62o6l23K20K51
$$ 111 -263 155 140 -95 19 -156 -58 69 -271 18 -34 -116 219 -257 148 340 -223 39 -27 -350 -130 121
3476A21k93J62o2N9J61j69j46PK19j48N7j33K10k75R3M2J03K44l21J81j37R2k59
$$ 121 -172 -10 -72 -13 148 -21 -167 -160 59 -89 -32 -165 45 -230 -137 -95 8 252 -69 112 -25 67 -192
3499a92R7m2L44l35QJ10k0K39k83P0J53J1O7q6k66M0k87M20k4l08M20k02j56L36
$$ -192 -95 -137 207 -128 -120 -10 -30 209 -74 -4 149 160 227 141 -125 -85 -372 48 24 -284 136 -66 -222 114
3523A14k53J95Q2j57k85M31m30N37l81n8J76J67k88K20k18J37J84l07R3J43j50
$$ 114 -139 56 138 -19 -304 127 -303 234 -147 -205 -29 138 -150 70 -148 -11 173 -134 -41 102 -48
3544d8O0l8J62j48K7J47j8j15k33k7K30N3r6k3KN3J12j94M4l6o8J46r7J20J71
$$ -48 12 -26 136 -12 15 162 144 29 -204 -231 -1 52 -44 -67 -65 -12 100 -94 -50 -86 -154 -8 -105 15 186
3569A86m15n1L74j39j07M9J34J70j99J94M8k78k42J7M70j68j52K3L89k98M2R0
$$ 186 -229 -280 94 -45 -152 -103 31 201 2 196 244 -34 -276 -259 211 43 -109 -86 303 5 47 137
3591A37j06J80l02R8J14j09J8j13J03J59k68l3K45L8k60o0J9J68Kk95L95j20m0
$$ 137 31 211 -91 7 121 12 30 -83 20 179 -89 -122 123 161 -99 -159 -140 28 30 -265 130 10 -30
3614c0K7J92M0j96o3J45K0k34l0J12J06j04j12o1J89R3m4j77R8J12m15L04PJ9
$$ -30 -3 189 229 33 -30 115 135 -99 -129 -17 89 -15 -127 -188 1 94 50 -127 -29 83 -332 -28 -21 -2
3638bP6q9j10J82k19J48n6L15j2k32m4J44l31J63o1J20K71l87J48K8k6J32j47
$$ -2 74 -15 -125 57 -162 -14 -70 245 233 1 -43 101 -230 -67 -128 -8 263 -124 24 52 26 158 11
3661A1j70K68L1j5l13L53k15L9L6K05l17J5n3L78k04k01K17J81r4k83l8K20j3
$$ 11 -159 109 140 125 -188 165 -50 -11 25 230 -87 -72 -125 253 49 -152 65 246 152 -131 -169 51 38
3684C8k19K52L5K75l77Rl9Qp1j23J41K58l49L96k3j33j15n6J81q1K3j81K43j20
$$ 38 -181 71 106 381 4 13 -26 -18 -89 -212 -71 187 -162 234 211 78 -37 -93 88 7 30 -151 92 -28
3708b8r2k6J16oJ06m0K7K5MM3k76Q2k8J32NjO4k56j29N65k18j01p0L25J55k74
$$ -28 -120 -146 -30 -36 70 30 57 82 86 129 -147 -65 -93 39 44 43 107 -149 -278 287 69 -32 -102 223 378 104
3734A04l20K50K0j2j31J31m7k9q4K30j57oJ19j59L85o79L60k31J41J84m3Q9l5
$$ 104 -216 34 54 42 -89 42 -5 -34 -118 112 -45 -51 68 -91 294 -385 -25 -256 -115 69 26 115 80
3757H0O1j2l09J3K55k47K25j04M4J45k54J52r4j30J90l09K75l5J65k54N5J45j
$$ 80 141 129 -180 -167 88 -159 66 -38 6 151 -103 49 -45 -175 15 -294 -19 -54 111 -143 -88 57 56
3780E6j47J62J78m33K10K4Jj81J7K67p4l19P6J99o7k1Q9M1O7j34O5k65J31J19
$$ 56 -91 71 249 -184 26 50 51 -130 -113 154 80 -239 -163 36 -31 -52 37 78 145 11 76 -189 -58 61
3804F1n8l7J25n9k71K08L4R4j4o6Q6j19J32k65J50K96k80k9K0l8J10j40O4J33
$$ 61 3 -34 91 32 -239 -31 3 97 83 17 103 -16 116 -149 1 297 17 -12 8 -30 80 -60 4 137
3828A37q3pj7N4k76R2K52l68N62j96l8N9l34k3K67Kj6j37q3L63k79J00O8k93L66
$$ 137 54 47 30 84 -192 -100 152 -216 346 150 112 171 -163 -186 81 83 67 -70 -153 210 -69 31 99 -194 172
3853A72l77J14L58l13j64J61k19K57J47m65M23nOj80M5K43k71n6K30L8Oj37k3
$$ 172 -205 -91 267 -46 -210 -49 -268 -11 136 -329 94 89 95 -85 -40 203 -68 -124 106 144 150 13 -10
3876a0L0k69L67k77K5k0J48k88K48K37j29M8l43J53L15l53Q7K07j50R0j5r5o0
$$ -10 20 -249 118 -159 -134 -154 -6 -294 -46 191 62 110 -233 -80 235 -118 -31 176 26 116 101 6 -54
3899e4J36J68M0m58K30j35J44j27j83M46j14j6k04K16J35qo65M45O3j44L45n72
$$ -54 82 250 290 -168 62 -73 71 -56 -239 207 93 77 -127 89 224 216 -449 -4 59 -85 260 -312
3921c12K39K01p0j52k4J59J6L9k17L62l4n31J88j45K17r7K5K96k64J93r5m31N64
$$ -312 -73 128 58 -94 -118 41 57 96 -121 241 207 -324 -136 -281 -64 -161 -136 160 -104 89 -6 -437 127
3944A27j76k16J70J23J08Q3n29K79Rk00K92k04M6K8m5K27j45j12L83r3j84K06
$$ 127 -49 -265 -95 28 136 219 -310 -31 -22 -222 70 -134 -88 -60 -105 122 -23 -135 248 155 -29 177
3966A77j56o8j02J27R4K1l69L39k00L16l5Pn8j38n3R3j8J84J27m09L04P1k4j63
$$ 177 21 -47 -149 -22 72 93 -276 63 -137 179 144 151 93 -45 -98 -5 -23 161 288 -121 183 254 230 67
3990F7l13L47j11kK22j65j12J54j52o7J64k75j35M30k72K91k03o1K29k17J82j74
$$ 67 -246 101 -10 -12 210 45 -67 87 -65 -132 32 -243 -378 52 -220 71 -132 -193 36 -181 1 -173
4012a73J68J99l34J88j05o4L34k03j20J59J7j13p1J14rm1j57K9L31j20M4l0j39
$$ -173 -5 194 -140 48 -57 -121 213 10 -110 49 66 -47 -118 -4 -13 -54 -211 -182 149 29 73 43 -96
4035i6J0p1K53k5pO4q3J07k57J7L42m4m12K22O8q3K32m89L19K10m03J57j8m7R2
$$ -96 -86 -157 96 71 64 128 45 152 -105 -88 254 210 -202 20 88 5 237 -252 67 277 -126 31 13 -34 58
4060E8k40K42L0j91J6L7J3L23l11M1J40n3k37k25J71J31PJ77k01P8R1l27J94R8
$$ 58 -182 60 90 -101 -85 -48 -35 288 -23 18 158 105 -132 -357 -186 -55 -48 129 -72 6 97 -230 -36 62
4084F2l92M48j4j83K93k09l59K82K2l63M85O7k50K81k77J76k5m6QQ2J13n03L05
$$ 62 -330 118 104 -79 214 5 -354 -72 -50 -413 72 139 -111 170 -107 69 44 -2 6 88 201 -302 3
4107CM0N8j45n2m4L96m67O9J13J12q2L8o4K89l07Mj64N01k64J68l24N6J20k22
$$ 3 43 101 -44 -96 -140 256 -211 -142 -29 83 1 39 -25 264 -43 -39 -203 298 34 202 -122 -66 54 -168
4131a68K8K63J09j60j20R5J80m16J22M0J31p3j70J11K21l41J68o3R0l52L18j59
$$ -168 -140 123 232 72 -48 47 227 -189 -67 -27 104 31 -139 -28 193 -148 20 -43 47 -305 13 -146
4153a46R5j27k2R8K22L2l26l7J32n5O5K68k35M4nMj38J60j00q7R6J97nj60MK32
$$ -146 -51 -178 -200 -102 120 152 -174 -211 -79 -134 -69 199 -36 8 3 7 -131 29 -71 -158 -62 135 130 -30 -26 206
4179B06o6o0k9n1j51n4L53k07L5n5mQ5O3m5q0J28r1P4J73k09K35j61J9Q0j86R1
$$ 206 140 80 51 0 -151 -205 148 -59 -24 -79 -83 2 65 20 -60 68 -23 51 224 15 250 89 108 188 2 93
4205I3j41J20k79J85K53k87L03j54j53Q3k1N0J51O1k13l8K6o3N7k7O8k21J74J00
$$ 93 -48 72 -207 -22 231 -56 247 93 -60 23 2 52 203 264 51 13 39 -24 33 6 74 -147 27 127
4229A27n09L19K08k87M9p4R1%Jj49J29J04r4k17J91J84r9j4r0J23n5r2K77J6N2
$$ 127 -382 -63 145 -142 -93 -167 -76 -76 -75 -224 -95 9 -85 -302 -111 73 -26 -40 -130 -7 -62 -154 123 139 191
4254A91j49K39k55J49Lj11q8J84m55L72j64J46M0p8J07j74k1J17Q7r5R8k55L35
$$ 191 42 281 26 175 178 67 -21 163 -292 80 -84 62 102 24 131 -43 -64 53 140 45 143 -112 223
4277B23j00k50J70m4L4n2l60N55j23j58K82k69L33k0l77J93L7q3O2n3J47k76J54
$$ 223 123 -127 43 -1 33 -19 -379 176 53 -105 177 -92 241 221 -156 37 74 -9 53 0 147 -129 25
4300B5r0R1rJ04m81M21M0k79j29J61Q3K45k73l1P1J6J42k97K9K58j24j49L22k95
$$ 25 -65 26 17 121 -360 61 101 -178 -307 -146 -63 182 -91 -122 -51 -35 107 -190 -161 97 -27 -176 146 -149
4324a49J04Q2j11J26j19p6J00j95K79K89l33L28l07j63K29j22N5J02K4j8j28Q3
$$ -149 -45 37 -74 52 -67 -143 -43 -238 41 330 -3 325 18 -145 84 -38 17 119 143 125 -3 80
4346H0r6K15L1j93qL24k15j28L17j73j8o1k07J47l8l38K89QK76o4j73P7Qj05J52
$$ 80 -16 199 230 37 29 353 138 10 327 154 136 75 -132 15 -23 -361 -72 -64 212 148 -25 52 60 -45 107
4371A07k65J73K5l28K28J14k20M00n28J93J1l50M18K2o4N1j68K48L07m91L84k52
$$ 107 -158 15 40 -288 -60 54 -166 234 -294 -101 -90 -440 -22 0 -64 -13 -181 67 374 -117 267 15
4393A5n3K40k31J32j67j80R6J63k39K57j44R4k40nL64J2j47O7j17K99N6l99J21
$$ 15 -38 202 -29 103 -64 -244 -148 15 -224 33 -111 -17 -257 -262 102 114 -33 34 -83 216 272 -127 -6
4416fJ25j7P9k26l2M21m55J1O0RK13j71n6K36k01j53M34l78K22k12k05M13r1r
$$ -6 119 102 181 -45 -77 344 -111 -100 -40 -31 182 11 -45 191 -10 -163 271 -107 115 -97 -302 111 20 11
4440A1N1l10J18L88j61J25l26o7K68l88J29MqJ99m4k34K34k60L4L09l00J05r5
$$ 11 62 -248 -130 258 97 222 -104 -171 97 -291 -162 -158 -166 33 -11 -245 -11 -271 -237 72 -228 -123 -218
4463b18J35J49l41J02J55k72J90K0J51q3k67J70Q9j37QM9J27R8l80L25L42n92
$$ -218 -83 66 -275 -173 -18 -290 -100 -80 71 -12 -279 -109 -20 -157 -149 -100 27 125 -255 70 412 -180
4485a80L46k16p0N30l58o4J82K0k97J4K72K2J2k46J61k95K45kj0J58l18J76J22
$$ -180 166 -50 -120 410 52 -12 170 190 -107 -93 179 201 213 -33 128 -167 78 76 66 224 -94 82 204
4508B04m24M38k9k67J22J21l28J37J4K87j64j45R5j22j85K20J65l49N3J30lJ73
$$ 204 -220 218 189 -78 44 165 -163 -26 -12 275 111 -34 61 -61 -246 -26 139 -210 -157 -27 -30 143
4530A43k16J32j29%J73m02O03m68K45q7K9j87L03m14M71kj27j77K76k41J2J17
$$ 143 -73 59 -70 -70 103 -299 304 -164 81 -6 23 -164 139 -275 196 194 67 -110 166 -75 -63 54
4552E4j08L43l45j46R5J35k4j75J53J19n4J67j85M7j05J79j38K44l19J67j5k28
$$ 54 -54 289 -56 -202 -107 28 4 -171 -18 101 47 214 29 76 -29 150 12 256 -63 104 89 -139
4574a39K84l80M79j06j71K4J46l40M87j69p8k07J61J02j38K7K45k13J14N8k84
$$ -139 145 -235 244 138 -33 -9 137 -203 284 115 37 -170 -9 93 -45 -18 227 14 128 186 -98
4595i8K71j45j5K1J06n8J9k58J91j06Pj56J39K36l15J9J8K99m52K57j16M4J11
$$ -98 173 28 13 34 140 82 101 -157 34 -72 -65 -221 -82 154 -161 -142 -124 175 -277 -20 -136 -92 19
4618A9r9Q4K43j54j66J53j02J57l05m3K17j0J83j34R2k1o0j35j59K88k46K31P1
$$ 19 -80 4 247 93 -73 80 -22 135 -170 -213 4 -6 177 43 135 114 54 -81 -240 48 -198 33 104
4641A04jl39M27N5k24J6o2Q5j03J42j38J90Q4k51n5l3K77l77L0L00l08K69n5K95
$$ 104 103 -236 191 246 22 38 -24 61 -42 100 -38 152 236 -15 -70 -103 174 -203 -173 127 -181 88 33 328
4665C28l56Q1k13L28k39J78j05k37K24k37P1K77Q1j78R4l53L89j80k15J90J69
$$ 328 -28 53 -160 168 -71 107 2 -235 -11 -248 -177 100 181 3 97 -256 133 -47 -262 -72 97
4686I7q8r3J07k3n2J99j58j74K96l3j53%n2k4P9m8J23K19k46k25R5J42j08Q0J28
$$ 97 9 -84 23 0 -52 147 -11 -185 111 78 -75 -75 -127 -151 -72 -120 3 222 -24 -249 -154 -12 -120 -40 88
4711H8R9r8k8o2J41p9J01Q1k79K65m5R5j04oo4k51K41l5L7O7k48Q9j78J79k14
$$ 88 187 89 61 -1 140 61 162 243 -36 229 184 279 175 169 105 -146 95 60 97 164 -84 5 -173 6 -208
4736b08K49L53m77j1J7j35K57J28j88J71k73o7J03J56J27j35j65Q1L14m49L21
$$ -208 41 394 -83 -94 -77 -212 45 173 -15 156 -117 -184 -81 75 202 67 -98 -17 297 -152 169
4757A69k73K8J13L2j77j5K38k20J35k44K91J19k12M5j43K01j08p8q9O9J00R0k79
$$ 169 -104 -76 37 69 -108 -123 115 -105 30 -214 77 196 -16 29 -114 87 -21 -99 -188 -119 -19 71 -208
4780b08L88n2k50K93o7j36J55k51oK40k44Q2L30m86K96R8j40M58m81K26k94r9
$$ -208 180 128 -122 171 104 -32 123 -128 -134 106 -138 -56 274 -212 84 182 42 500 19 245 -49 -148
4802a48K78j88R8j8r6M23l51P9N4m0m00L79k51J98Jk13P6N9K2J12j08n8P9p4J12
$$ -148 130 -58 40 22 -74 349 -2 77 131 91 -309 70 -181 17 18 -195 -119 -60 -38 74 -34 -92 -13 -87 25
4827B5n7K8j0O6n9L3p7J64k27J31K5l62M91j85O1J45k55j06K14r1J50j00j20J90
$$ 25 -32 -4 -14 52 -7 26 -51 113 -114 17 42 -320 171 -14 47 192 -63 -169 45 -46 104 4 -116 74
4851G4J06m80M09k81L30m5k58K53opJ16k25J86j02k21K21k1j27J34p6j53N2n0
$$ 74 180 -300 109 -172 158 113 -145 108 102 95 211 -14 172 70 -151 70 49 -78 56 -20 -173 -121 -171
4874a71L63N2m35L21k15Q4J25k15J58j6j32K46k18J14r1r5J95P3q4j40J11j7P6
$$ -171 192 244 -191 130 -85 -1 124 -91 67 51 -81 165 -53 61 -30 -125 70 143 59 -81 30 13 89
4897H9j99r5Q1N8l7K2K2L51n99lK20K5K25l64R0R5l2j16N6N0K61j47l38M27q4
$$ 89 -110 -205 -124 -66 -103 -81 -59 292 -307 -310 -90 -65 160 -204 -114 -19 -51 -167 -111 -61 200 53 -285 142 58
4922E8K1O6k35J28J41l77L08N9m28J33M4K37j85k9J35%Qk05p4L04j78J45j81j32
$$ 58 79 145 -90 38 179 -198 110 169 -259 -126 -82 155 -30 -59 76 76 84 -121 -195 109 -69 76 -105 -237
4946b37M04k55L59j46q0o7J1j05M09j41qm2jk3j05N8n9K10k27K35m4m74L83j16
$$ -237 167 -88 271 125 45 -22 -11 -116 293 152 144 102 101 78 -27 31 -28 182 -45 190 146 -328 55 -61
4970f1J82k41M2L46k74J48%j55m65N31j22R5k39J06J21l06O7L16j77J14J7j89
$$ -61 121 -120 -78 268 -6 142 142 -13 -478 53 -69 26 -213 -107 14 -292 -225 91 -86 28 45 -144
4992a44q2K19q3J14M6r7r5J82o0Rk34M38L0k04pn9OQ8KJ10m6k56R4j61K78j02
$$ -144 -226 -7 -90 24 70 -27 -122 60 0 9 -225 213 243 39 32 -27 -21 67 69 179 133 -123 -29 -190 88 -14
5018a4KJ4K0K8K0l10N40l03j29K16K26l44N4J81l4p3l24L63J2l7J18l53O7J60
$$ -14 -12 2 22 50 70 -240 300 -3 -132 84 310 -34 20 201 167 94 -230 133 145 108 226 -127 -60 100
5042A00k5q0p6K14k09J74n4l11J61n8q5K92M6j26L2J15J29l31M9j35L2l4J16L0
$$ 100 75 -5 -81 133 -76 98 44 -267 -106 -164 -249 43 89 -37 -5 110 239 -92 -43 -178 -146 -180 -64 -34
5066c4q8K25j03p4o1m2K82O8lj92L09l48j9J15j52M3K1j4j09N1K84k15M4J97j16
$$ -34 -122 103 0 -74 -135 -177 105 173 170 -22 287 -61 -80 35 -117 -74 -53 -67 -176 -125 159 -56 -12 185 69
5091F9J17j09J45J62k89j25p0J25o3K96k45J49j77k4J7O5r3O1J00J0nk32K04j18
$$ 69 186 77 222 384 95 -30 -100 25 -38 258 13 162 -15 -39 -22 43 -50 11 111 121 116 -116 88 -30
5115c0j89J34r4J03j35J88K3NN5p2k4j23Q8J90k29P4j42K75k59K44j4q5J4k00
$$ -30 -219 -85 -179 -76 -211 -23 0 5 60 -12 -36 -159 -71 119 -110 -36 -178 97 -162 82 68 -17 -3 -203
5139b03L28p6J11l62J63r1J75j40Q3J92l58J85l8J61j24k0l7P2J21j50j5J4J73
$$ -203 125 49 160 -202 -39 -130 45 -95 -12 180 -178 7 -31 130 6 -14 -51 21 142 -8 -23 -9 164
5162A64k90J73J04j13K53m38J52P6j91O2P5K01m81K50k9J47K29j86l0M5m8k1r8
$$ 164 -126 47 151 38 291 -147 5 81 -110 -48 27 228 -253 -3 -32 115 344 158 128 173 125 104 6
5185FQ4j01J30J55l95L03j08j34O9j28L27k79M1m6K45j45J39m34J75Q5kL4l0N0
$$ 6 90 -11 119 274 -121 182 74 -60 9 -119 208 -71 -30 -76 169 24 163 -271 -96 -11 -13 21 -9 41
5209D1q0L52n00K52L2k4j23M8J29j06j22L2J39j17J84k66m4K11j6o7m5J69L5K9
$$ 41 -39 313 -187 65 97 73 -50 -2 127 21 -101 -69 70 -47 137 -129 -173 38 22 -45 -90 79 114 143
5233A43k17J88j1o1MR7q4pj72N6nK59k01k68M16l03J67q1J77j49K37k05J40j13
$$ 143 -74 114 103 42 46 143 59 52 -120 -64 -69 190 -11 -279 137 -166 1 -80 97 -52 185 -20 120 7
5257Gj48J20K2Q6k61J27J67N5k79K80r0k11J54P5l1l5O0l9p2j6J71j24K1J69k13
$$ 7 -141 -21 1 87 -174 -47 120 175 -104 176 86 -125 29 104 73 38 98 59 -13 -29 142 18 39 208 -5
5282ek08R6J74k39j97N26P2n0p9k89j52M89l51J14NJ98k90P7k4J92m05L78Q2Q3
$$ -5 -213 -117 57 -182 -379 147 219 169 90 -199 -351 138 -213 -99 -94 104 -186 -109 -133 59 -346 32 114 197
5306A97O9j65l9m8J42j5j69j28K70j21J08j82N9j50J94J19j12K66l41L76l81J87
$$ 197 266 101 62 14 156 141 -28 -156 114 -7 101 -81 -22 -172 22 141 29 295 -46 330 -51 136
5328A36O4m17J22J10Nm2R6k66O6%J24r9o8N3P8J05j31lK65k32j33Q8J52Jj21j52
$$ 136 200 -217 -95 15 20 -22 74 -192 -126 -126 -2 -101 -169 -116 -38 67 -64 -67 198 -34 -167 -79 73 74 -47 -199
5354a99J75J51j39NP9j03O4j08J48L4j83J44k86K37n7j07Q2M57m69L03j30m4k5
$$ -199 -24 127 -12 -7 72 -31 33 -75 73 107 -76 68 -218 19 -38 -145 -63 394 -75 228 98 54 29
5377B9j04P7J22l08L14l0j83J64j72nK57m8J9q9j51K58j3k03K05j64j36K11K9
$$ 29 -75 2 124 -184 130 100 -83 81 -91 -96 161 113 132 43 -108 150 137 -66 139 -25 -161 50 79
5400G9R5n1R5K3l85J47o2J00J49k15j6J54j89K85p5M6k58j37J46K11k52k7K05
$$ 79 174 123 218 241 -144 3 -59 41 190 -25 -41 113 -76 209 134 180 -78 -215 -69 142 -110 -137 68
5423F8j49N2j79N5qo9N5L45l40L25l46K98l10J36J63j81J01P9j23k71L93K6l8
$$ 68 -81 -29 -208 -153 -161 -230 -175 170 -170 155 -191 107 -203 -67 96 -85 16 95 -28 -299 94 120 82
5446H2k28j5Q0jJ7J90J37p4j60n97N54j59P7P8R7j4J51k69K19j21L7Q0k6p7L62
$$ 82 -146 -161 -81 -82 -65 125 262 188 28 -569 -15 -174 -97 -19 78 64 215 -54 165 44 81 161 135 58 420
5471D20l73m7%M1J21l38J65j6l8lJ82r9J61j88M7J56j14Nl6J8j0r4j93L19J00
$$ 420 47 0 0 41 162 -176 -11 -27 -65 -68 114 15 176 -12 35 191 77 82 46 64 54 -40 -233 86 186
5496A86k52k12J49K37m3j39j09l9K36j94J74N4k30J54J3K62m30K13j61J53r0J43
$$ 186 -66 -278 -129 108 65 -74 -183 -222 14 -180 -6 48 -182 -28 -15 247 -183 30 -131 22 -68 75
5518G5k13R7j33L78k66j07J57M2m6J21p2n4K33k22J01j34K7k29K77j4o3j15L17
$$ 75 -138 -41 -174 204 -62 -169 -12 30 -16 105 33 -21 212 -10 91 -43 -16 -245 32 18 -45 -160 157
5541A57k25Q3j93L55j69j42K99j69J2K6o4k4N9n9j9k8O2L0k57K70J85l02K0J61
$$ 157 -68 15 -178 177 8 -134 165 -4 8 34 -30 -54 5 -54 -73 -101 -39 -9 -266 4 189 -113 -93 68
5565F8J29m40K87j22j9qrJ08l4o7p7l7J15J23k49J10j8m3J34j69oP0K95r2qJ9
$$ 68 197 -243 44 -78 -97 -105 -114 -6 -40 -107 -184 -221 -106 17 -232 -122 -140 -183 -49 -218 -224 -154 141 49 41 60
5591F0o8j69J32j22N0K94j13k62J15K4M9%R8q0j64J37mLJ16Rr3j67J98j2L28l95
$$ 60 -8 -177 -45 -167 -117 177 64 -198 -83 -59 -10 -10 88 8 -156 -19 -23 -20 96 105 12 -155 43 31 359 -36
5617c6J13m3j08L96l77J81k31J78l3L8j15L3j22K8Q2J64j42J00k8j42j94J71K39
$$ -36 77 34 -74 322 -55 126 -105 73 40 78 -37 -4 -126 -98 -16 148 6 106 78 -64 -258 -87 152
$$ [...]
8191a09
##END NTUPLES=NMR FID
##END=
