##TITLE=1H_Pr 687
 CDCl3, 8 sc, 
 9.07.2021
##JCAMPDX= 6.0         $$ Bruker NMR JCAMP-DX V2.0
##DATA TYPE= NMR FID
##DATA CLASS= NTUPLES
##ORIGIN= UXNMR, Bruker Analytische Messtechnik GmbH
##OWNER= root
$$ XWIN-NMR		Version 3.5
$$ Fri Jul  9 12:43:56 2021 Russian Standard Time (UT+4h)  she@DPX200
##.OBSERVE FREQUENCY= 200.131506
##.OBSERVE NUCLEUS= ^1H
##.DELAY= (6, 6)
##.ACQUISITION MODE= SIMULTANEOUS
##.ACQUISITION SCHEME= undefined
##.AVERAGES= 8
##.DIGITISER RES= 18
##SPECTROMETER/DATA SYSTEM= spect
##.PULSE SEQUENCE= zg30
##.SOLVENT NAME= CDCl3
##.SHIFT REFERENCE= (INTERNAL, CDCl3, 0, 15.7039)
##AUDIT TRAIL= $$ (NUMBER, WHEN, WHO, WHERE, WHAT)
$$ ##TITLE= Audit trail, XWIN-NMR		Version 3.5
$$ ##JCAMPDX= 5.01
$$ ##ORIGIN= Bruker BioSpin GmbH
$$ ##OWNER= she
$$ F:/spectra/data/she/nmr/H-F/1/audita.txt
$$ ##AUDIT TRAIL=  $$ (NUMBER, WHEN, WHO, WHERE, WHAT)
(   1,<2021-07-09 12:42:20.34 +0400>,<she>,<DPX200>,
      <created by zg, POWCHK disabled, PULCHK disabled
       configuration hash MD5:
       00 E9 B6 7A A2 85 ED C7 34 08 36 98 17 FE 4E 26
       data hash MD5: 16K
       CF A9 82 4D 67 80 42 84 01 A8 EC 2A 31 89 D6 79>)
$$ ##END=
$$ 
$$ hash MD5
$$ C7 01 05 FF 1B 78 67 3C 04 2B BB 62 7B 17 53 D9
##$RELAX= 
##$RELAX= 
##$RELAX= 
##$RELAX= 
##$RELAX= 
##$RELAX= 
$$ Bruker specific parameters
$$ --------------------------
##$DU= <F:/spectra>
##$EXPNO= 1
##$NAME= <H-F>
##$PROCNO= 1
##$TYPE= <nmr>
##$USER= <she>
##$AMP= (0..31)
100 100 100 100 100 100 100 100 100 100 100 100 100 100 100 100 100 100 
100 100 100 100 100 100 100 100 100 100 100 100 100 100 
##$AQSEQ= 0
##$AQ_mod= 1
##$AUNM= <au_zg>
##$AUTOPOS= <>
##$BF1= 200.13
##$BF2= 200.13
##$BF3= 200.13
##$BF4= 200.13
##$BF5= 200.13
##$BF6= 200.13
##$BF7= 200.13
##$BF8= 200.13
##$BYTORDA= 1
##$CFDGTYP= 0
##$CFRGTYP= 5
##$CHEMSTR= <none>
##$CNST= (0..31)
1 1 145 1 1 1 1 1 1 1 1 1 1 1 1 1 1 1 1 1 1 1 1 1 1 1 1 1 1 1 1 1 
##$CPDPRG= <>
##$CPDPRG1= <>
##$CPDPRG2= <>
##$CPDPRG3= <>
##$CPDPRG4= <mlev>
##$CPDPRG5= <mlev>
##$CPDPRG6= <mlev>
##$CPDPRG7= <mlev>
##$CPDPRG8= <mlev>
##$CPDPRGB= <>
##$CPDPRGT= <>
##$D= (0..31)
0 1.2 0 0 0 0 0 0 0 0.06 0 0.03 0 0 0 0 0.0002 0 0 0 0 0 0 0 0 0 0 0 0 
0 0 0 
##$DATE= 1625820139
##$DBL= (0..7)
120 120 120 120 120 120 120 120 
##$DBP= (0..7)
150 150 150 150 150 150 150 150 
##$DBP07= 0
##$DBPNAM0= <>
##$DBPNAM1= <>
##$DBPNAM2= <>
##$DBPNAM3= <>
##$DBPNAM4= <>
##$DBPNAM5= <>
##$DBPNAM6= <>
##$DBPNAM7= <>
##$DBPOAL= (0..7)
0.5 0.5 0.5 0.5 0.5 0.5 0.5 0.5 
##$DBPOFFS= (0..7)
0 0 0 0 0 0 0 0 
##$DE= 6
##$DECBNUC= <off>
##$DECIM= 32
##$DECNUC= <off>
##$DECSTAT= 4
##$DIGMOD= 1
##$DIGTYP= 9
##$DL= (0..7)
0 120 120 120 120 120 120 120 
##$DP= (0..7)
150 150 150 150 150 150 150 150 
##$DP07= 0
##$DPNAME0= <>
##$DPNAME1= <>
##$DPNAME2= <>
##$DPNAME3= <>
##$DPNAME4= <>
##$DPNAME5= <>
##$DPNAME6= <>
##$DPNAME7= <>
##$DPOAL= (0..7)
0.5 0.5 0.5 0.5 0.5 0.5 0.5 0.5 
##$DPOFFS= (0..7)
0 0 0 0 0 0 0 0 
##$DQDMODE= 0
##$DR= 18
##$DS= 0
##$DSLIST= <SSSSSSSSSSSSSSS>
$$ [...]
##$SUBNAM2= <"">
##$SUBNAM3= <"">
##$SUBNAM4= <"">
##$SUBNAM5= <"">
##$SUBNAM6= <"">
##$SUBNAM7= <"">
##$SUBNAM8= <"">
##$SUBNAM9= <"">
##$SW= 20.0188882624521
##$SWIBOX= (0..15)
0 0 2 0 0 0 0 0 0 0 0 0 0 0 0 0 
##$SW_h= 4006.41025641026
##$TD= 16384
##$TD0= 1
##$TE= 0
##$TE2= 300
##$TE3= 300
##$TEG= 300
##$TL= (0..7)
0 120 120 120 120 120 120 120 
##$TP= (0..7)
150 150 150 150 150 150 150 150 
##$TP07= 0
##$TPNAME0= <>
##$TPNAME1= <>
##$TPNAME2= <>
##$TPNAME3= <>
##$TPNAME4= <>
##$TPNAME5= <>
##$TPNAME6= <>
##$TPNAME7= <>
##$TPOAL= (0..7)
0.5 0.5 0.5 0.5 0.5 0.5 0.5 0.5 
##$TPOFFS= (0..7)
0 0 0 0 0 0 0 0 
##$TUNHIN= 0
##$TUNHOUT= 0
##$TUNXOUT= 0
##$USERA1= <user>
##$USERA2= <user>
##$USERA3= <user>
##$USERA4= <user>
##$USERA5= <user>
##$V9= 5
##$VALIST= <valist>
##$VCLIST= <CCCCCCCCCCCCCCC>
##$VD= 0
##$VDLIST= <DDDDDDDDDDDDDDD>
##$VPLIST= <PPPPPPPPPPPPPPP>
##$VTLIST= <TTTTTTTTTTTTTTT>
##$WBST= 1024
##$WBSW= 4
##$XGAIN= (0..3)
0 0 0 0 
##$XL= 0
##$YL= 0
##$YMAX_a= 51478
##$YMIN_a= -73532
##$ZGOPTNS= <>
##$ZL1= 120
##$ZL2= 120
##$ZL3= 120
##$ZL4= 120
##$ABSF1= 10
##$ABSF2= 0
##$ABSG= 5
##$ABSL= 3
##$ALPHA= 0
##$AQORDER= 0
##$ASSFAC= 0
##$ASSFACI= 0
##$ASSFACX= 0
##$ASSWID= 0
##$AUNMP= <proc_1d>
##$AZFE= 0.1
##$AZFW= 0.1
##$BCFW= 1
##$BC_mod= 2
##$BYTORDP= 1
##$COROFFS= 0
##$CY= 11.3945322036743
##$DATMOD= 1
##$DC= 2
##$DFILT= <>
##$DTYPP= 0
##$F1P= 17.5019972093344
##$F2P= -2.517084195857
##$FCOR= 0.5
##$FTSIZE= 0
##$FT_mod= 4
##$GAMMA= 1
##$GB= 0.15
##$INTBC= 1
##$INTSCL= 1
##$ISEN= 128
##$LB= 0.24
##$LEV0= 0
##$LPBIN= 0
##$MAXI= 10000
##$MC2= 0
##$MEAN= 0
##$ME_mod= 0
##$MI= 1.114404
##$NCOEF= 0
##$NC_proc= 0
##$NLEV= 6
##$NOISF1= 3.799351
##$NOISF2= 2.8
##$NSP= 1
##$NTH_PI= 0
##$NZP= 0
##$OFFSET= 15.70392
##$PC= 1
##$PHC0= -12275.83
##$PHC1= 12.20101
##$PH_mod= 1
##$PKNL= yes
##$PPARMOD= 0
##$PSCAL= 0
##$PSIGN= 0
##$REVERSE= no
##$SF= 200.130013532006
##$SI= 16384
##$SIGF1= 3
##$SIGF2= 2
##$SINO= 400
##$SIOLD= 16384
##$SREGLST= <1H.CDCl3>
##$SSB= 0
##$STSI= 0
##$STSR= 0
##$SW_p= 3612.71676300578
##$SYMM= 0
##$S_DEV= 0
##$TDeff= 0
##$TDoff= 0
##$TI= <>
##$TILT= no
##$TM1= 0
##$TM2= 0
##$TOPLEV= 0
##$USERP1= <user>
##$USERP2= <user>
##$USERP3= <user>
##$USERP4= <user>
##$USERP5= <user>
##$WDW= 1
##$XDIM= 8192
##$YMAX_p= 0
##$YMIN_p= 0
$$ End of Bruker specific parameters
$$ ---------------------------------
##NTUPLES= NMR FID
##VAR_NAME=  TIME,          FID/REAL,        FID/IMAG
##SYMBOL=    X,             R,               I
##VAR_TYPE=  INDEPENDENT,   DEPENDENT,       DEPENDENT
##VAR_FORM=  AFFN,          ASDF,            ASDF
##VAR_DIM=   8192,          8192,            8192
##UNITS=     SECONDS,       ARBITRARY UNITS, ARBITRARY UNITS
##FACTOR=    0.0002496,     1,               1
##FIRST=     0,             0,               0
##LAST=      2.0444736,     0,               0
##MIN=       0,             -73532,          0
##MAX=       2.0444736,     51478,           0
$$ Real data points
##PAGE= N=1
##DATA TABLE= (X++(R..R)), XYDATA
0@%%%%%%%%%%%%%%%%mJ2j6J6j6J6k4L2l2L9m7M8n6O9p7Q8j04J18j31J48j67J84
38I6k05K29k56K86l17L51l88M28m71N20n75O35o99P70q48R35j032J140j264J405
58G40j567J758j983K255k595L026l599M405n617P695j2200M1059m3703n1763Q9604
73B7515J9907n5747j5391M6595l591k9041r53J3973K640J2251j3673l4894Q244
86b2165N0693n031n2291K357M5718j2494l5839K0185L1466k0609k5717J1055J6146
99C474J47L314o311j8324P416K3916n804j6208P816Q247j2722m174J4333M573
113I693n800l481j0740k378K3298R612k7099j4202K4148R643k4157l40K6831p283
127G745k8674O872K4061l001j1433L241l841o986J5729R888j7814l777J6648o861
$$ plain form
0 0 0 0 0 0 0 0 0 0 0 0 0 0 0 0 0 0 -4 8 -8 8 -8 8 -16 16 -16 23 -24 24 -32 37 -40 48 -56 62 -69 79 -88 96
38 96 -109 120 -136 150 -167 184 -204 224 -247 273 -302 333 -366 404 -444 491 -541 599 -665 740
58 740 -827 931 -1052 1203 -1392 1634 -1965 2440 -3177 4518 -7682 33377 -10326 -62089 27515
73 27515 47422 -8325 -23716 22879 19288 -9753 -10706 3267 5907 18158 4485 -30409 -22165
86 -22165 28528 23497 -28794 -26437 19281 6787 -29052 -8867 22599 1990 -23727 -12672 3474
99 3474 3621 6935 624 -17700 -10284 13632 7828 -8380 -564 7683 -5039 -9213 5120 9693
113 9693 3893 412 -10328 -12706 10592 20204 -6895 -21097 3051 12694 -11463 -11803 15028 7745
127 7745 -20929 -14057 10004 7003 -4430 -1189 -5030 -12016 3713 13601 -4213 -7990 8658 1797
141A797j6181J8510K0372k3050k0135K2626J2359j8916N98J8820j0613k1616J3279
154b150K1710j1293j5174Q163L463q629L083R564l628q355L34p90k52J1862K659
169A0567j9287n183J7677L781j3239K150J1943q783j3586J0465J4128m865r651
182c883j938K684M167L523j897m118O94K03n076M382J0903m950j4209J840J1425
197C750j047o016M937R76j1292m44J2638K027q282j934J826k570J919P891j835
212B544p904J294K228j807M588O233n981j0065M675R790k349l351L874k179o943
227e353L309R749o79p754j3J966k977K984P019l385q362l83N455J725l06N18m045
244e32l476L486K644p84K182o9p393l364R269P287p336o930L942K850k501O23
$$ plain form
141 1797 -14384 4126 24498 1448 -18687 3939 16298 -2618 -2020 16800 6187 -15429 -2150
154 -2150 19560 8267 -6907 1256 4719 -3910 -827 8737 5109 -3246 -2912 -3702 -3954 7908 10567
169 10567 -8720 -13903 3774 7555 -5684 -3534 8409 -374 -13960 -3495 10633 5768 -3883
182 -3883 -5821 -3137 1030 4553 2656 -1462 -768 -565 -5641 -1259 9644 4694 -9515 -7675 3750
197 3750 2703 -3313 1624 2600 -8692 -9136 3502 5529 -2753 -4687 -2861 -5431 -3512 4379 2544
212 2544 -5360 -4066 -1838 -3645 943 7176 1195 -8870 -4195 5595 3246 -105 3769 1590 -5353
227 -5353 -2044 7705 7026 -728 -741 1225 -1752 1232 8251 4866 -3496 -3879 1576 3301 2995 3513 -532
244 -532 -4008 -522 2122 1338 3520 3451 -3942 -7306 1963 9250 1914 -5016 -1074 1776 -725 -102
260a02M796n02o662k605M339N051J716m636o754J605O453N58m126J261K125n983
276c466l787Q249N568o022n868P37K540J566J791o0m301k017K085J437J924J892
292B268k792m890o6N557L010k387j483j260k278K512N179K36m364k019J770n0
308a057J103M391p23o611j389M005L430J38j703k117k564J687L877L39p66j109
324I31l125j196M134M668j673n585o63K423P40J731J736k097m241m86L998K578
340C873l99j348l190j975L477L461m39k168j884j191K07L498K623k967l610k85
356b317P62K071K119m21l525l268J957L781M75q84j879k191k94K505L182l03l161
373a391j778k52J634L915K45l487k450O07J817J692J347o18l915j464K847K730
$$ plain form
260 -102 4694 4192 -2470 -5075 -736 4315 6031 1395 -5359 -3754 2699 3257 -869 392 2517 -3466
276 -3466 -7253 996 6564 542 -5326 -4589 -2049 -483 1308 1248 -3053 -5070 -2985 -1548 376 2268
292 2268 -524 -5414 -5480 77 3087 700 -783 -2043 -4321 -1809 3370 3606 -758 -2777 -1007 -1057
308 -1057 46 4437 3714 -2897 -4286 -281 3149 3287 1584 -533 -3097 -1410 2467 2806 2040 931
324 931 -2194 -3390 744 5412 3739 -1846 -2509 -86 654 2385 4121 2024 -2217 -2703 1295 3873
340 3873 3474 2126 -1064 -3039 438 3899 3460 1292 -592 -1783 -1576 1922 4545 1578 -2032 -2317
356 -2317 -1555 516 2635 2214 -1311 -4579 -2622 1159 1634 750 -1129 -3320 -3614 -1109 2073 1770 -1391
373 -1391 -3169 -3421 -1787 2128 2373 -1114 -3564 -2957 -1140 552 1899 1281 -2634 -4098 -1251 1479
389A479O31j181k713j452Q61L627J875k250k502j066R58K321J646j20k368k371
405b625M02K513K250O89k852l379J019L497J660j148j307q40j099O33K977J587
421C977j410l572j626K935L282J42k386k382J82J082Q56J718k9k442k638L56L462
438A507K161j769k604j882Q63K474J696r06k051j280m13J039K675J305k995k810
454b990N41J683J910N23j346k387j340K213K887N1j947j698m99O74J368K223m96
471A370l188j509J071K214J996n10k880k211J330L365O24j672p56l15r78J82K842
488I75K586k619m612M40L868K651j620k349l85L35Q65J102L56L59r42k879n12
505b381L939L735k466n907J57N123J335k955q27K386r06l880J153N431M91m507
$$ plain form
389 1479 2110 929 -1784 -3236 -2375 1252 3127 877 -1625 -2691 -1733 588 2234 2114 -254 -2625
405 -2625 -2223 290 2540 3229 377 -3002 -1983 1514 3174 2026 719 -121 -1220 -587 2390 3977
421 3977 2567 -1005 -2631 304 3586 3728 1342 -1040 -858 224 1080 2798 2769 327 -2311 -1955 1507
438 1507 3668 1899 -705 -2587 -1724 750 2446 1540 -511 -1791 -2204 -1165 1510 2815 -180 -2990
454 -2990 -2449 -766 1144 1667 321 -2066 -3406 -1193 1694 1745 -202 -1900 -2399 -1725 -357 1866 1370
471 1370 -1818 -3327 -2256 -42 1954 1444 -1436 -3647 -2317 1048 1672 0 -756 -1071 -2049 -1867 975
488 975 3561 942 -3670 -3230 638 3289 1669 -680 -1065 -730 135 1237 1593 1952 1010 -1869 -2381
505 -2381 1558 5293 2827 -3080 -2923 2200 3535 580 -247 2139 1233 -2647 -1494 3937 4428 -79
521g9l201J454L719J659j864l139l27K668P1k043J901K633l056n245J994P148
537D293K52o460k047L673J465j561L48J619j786k567P65J934J658k7k428k976
553c845P44M222J883l622k411J941M30j044J144K531j216m278K45L751Q13q93
569C95k54j464j699J470M102j56l918o56K139j39n46K121J388l124l053K331L469
586B406j87j388j043j239qK879K132k627k518J827N36j517J335L140j323n052
602b647m25N005K014k646j836j48N21M89J121L67j221o31j2j360J177L782m29
619C121n291k082M965L634l766k823K490R60k942m53L855J920m494k968J977K840
635I43R61j378k274r26J764J584r24p59J743o41l745N30N241J216m783k638L084
$$ plain form
521 -79 -3280 -1826 1893 3552 1688 -1451 -1778 890 961 -1082 819 3452 396 -4849 -2855 4293
537 4293 4545 -1915 -3962 -289 1176 -385 -37 1582 -204 -2771 -2006 -72 1586 1559 -869 -3845
553 -3845 -3101 1121 3004 -618 -3029 -1088 -658 -1702 -558 1973 757 -3521 -3276 475 1288 395
569 395 141 -1323 -3022 -1552 2550 2394 -1524 -2180 -41 -180 -726 1395 2783 -341 -3394 -1063 2406
586 2406 2219 831 -212 -1451 -1459 1420 3552 925 -1593 234 770 -747 588 3728 2405 -2647
602 -2647 -3072 1933 3947 1301 -535 -683 -162 327 1448 1815 594 -37 -49 -1409 -232 3550 3121
619 3121 -2170 -4252 713 4347 581 -2242 248 1208 -1734 -2187 1668 3588 -906 -3874 -1897 943
635 943 1904 526 -1748 -2674 -910 674 -250 -1009 734 93 -3652 -3122 2119 3335 -1448 -4086 -1002
652a002K119j541Q9J186j078k505Q78L011L84j510q28r44O7K305J385j227k235
669a446J68J000M66P24Q25j439j987K87K357J185j155q50l73q04P13K284P36k011
687F80k141O15J668Q33q1n18j164p36N81J848P70j205j261o54l2J757J680o58
705A982k968r52K286J255j106j6N03j492j478J575K376L6k504j484M47J813J235
722A508j010j395m12P30N2k55J495J046l102k246K318L365p41k633p72J350L6
739f66J40Q56K48q60j663k40K044J869o27k672p12J675J215r3j20n97p13m62R00
758d78J713K19j210j336l60J382J602l6j229j197J74R44P48Q08p53j382n44P61
776a74J003R30k4j788j318R02K236J12j226o27l65p5P29J298K81j583j398J99
$$ plain form
652 -1002 1117 -424 -335 851 -227 -2732 -1854 1157 1541 31 -797 -1741 -1674 631 2016 789 -1446
669 -1446 -1278 -278 188 912 1737 298 -1689 -1402 955 2140 985 135 -238 -1042 -329 1955 2691 680
687 680 -1461 -846 822 1655 1574 1056 -108 -844 -263 1585 2355 1150 -111 -765 -797 960 2640 1982
705 1982 -986 -1938 348 1603 497 481 984 -508 -1986 -411 1965 2001 -503 -1987 -1540 273 1508
722 1508 498 -897 -1309 -579 -527 -782 713 1759 -1343 -3589 -1271 2094 1353 -1280 -2052 -702 -666
739 -666 -526 330 578 -282 -1945 -2185 -141 1728 1101 -1571 -2283 -608 607 514 394 -203 -916 -1378 -478
758 -478 1235 1454 244 -1092 -1452 -70 1532 1496 267 -930 -756 188 936 1744 991 -391 -935 -174
776 -174 829 1759 1735 -53 -1371 -469 1767 1879 653 26 -339 -414 315 1613 1894 311 -1087 -888
794h88J351J241k24j529j027L06J065N43P9k34j300j182J320J746L3j270j068
811a038j53L86J017J011q14j553k02M20R88P49l58j235r39M51J319O31m54o98
829d72j385L21J359R94m23j016n17j50L69J499O52j403j404J96J306Q82l8m19
847C51j186l69Q39Q07P09j52j466q42Q08J421O97j035r80j95K72O86Q61n0q85
866B91j335M69J332O89k17r85r97L43Q77O49J30p67r16k44O59J272J51r39r51
885d89k10O56Q88M19m86j402n09P73Q58N11k81j311l61J1J302O71m78j208n47
904a193J1J146P22k48r15p48Q3O85P87L01r78j055pR15R07R5p61p02l93N05J296
925D53J72n13j066m07P90R71K75l70q88n23M56P81O54p6r71p36Q5J310P87m12
$$ plain form
794 -888 463 1704 1480 -49 -1076 -770 295 838 917 683 -617 -1799 -479 1267 1300 30 -1038
811 -1038 -1191 -805 212 1223 409 -1144 -1346 -926 62 811 453 -782 -1721 -1270 49 680 226 -472
829 -472 -1857 -1536 -177 817 394 -622 -1139 -1289 -920 579 1231 -172 -1576 -1380 -74 808 770 351
847 351 -835 -1204 -365 442 1151 999 -467 -1309 -501 920 1617 582 -398 -593 -321 365 1226 1176 291
866 291 -1044 -575 757 1446 1229 244 -753 -410 467 1116 1246 479 -437 -681 -22 1250 1401 462 -489
885 -489 -699 -43 845 1264 778 -624 -1133 -360 498 1009 728 -583 -944 -933 369 1040 562 -646 -1193
904 -1193 -1182 -36 686 438 -477 -1225 -1142 -457 330 631 -347 -1402 -1409 -494 413 508 -253 -955 -1348 -843 453
925 453 625 112 -954 -1361 -571 400 675 305 -583 -1106 -650 131 785 709 -262 -998 -913 397 1184 772
945G72r00o98K60R65O34J3q34p54j05O29J123K80r38r72l0O97J102o4p94n48k48
966d10L31R43K92k31j034p59M21J134Q85q70j275k30O35N87K93n8n29r22k00J006
986IR78k44q27r16l6J006O89K6j178n09L02K48N57L76k88j160n90Q91J426j89
1006E71p81o06l84L70R34N97m93r37l78M86N25N94jr37p74K49J141O51m91p09
1026c73m50k5J019M18J52m91r15J53N37N81M10m81q94m28M57J617J27j354l94
1045c34J96K58L11M93K32j193q71Q18R67J73j67p76q61J19J572M45j048o73N06
1064A67k48m50J032J100j049j845M09J533J80m19l23o36k72N79R75l31o07K2n92
1083g75k46J047J233p53j742k18J440N62p63J79j7q58j92P81R66k12j064m55R4
$$ plain form
945 772 -128 -826 -566 399 1033 1046 212 -542 -647 -18 1105 1385 447 -525 -555 142 1244 1180 386 -162 -410
966 -410 -79 864 1156 925 -109 -868 -447 687 1572 702 -573 -803 -168 419 712 654 125 -797 -997 9
986 9 987 743 -84 -1000 -1036 -30 659 685 -493 -1002 -700 -452 105 481 193 -967 -1557 -666 760 571
1006 571 -210 -816 -1200 -830 104 701 208 -729 -1107 -621 -96 498 497 -440 -1214 -965 176 827 336 -373
1026 -373 -823 -848 171 589 741 250 -665 -512 25 606 1016 535 -359 -787 -330 1287 1414 60 -334
1045 -334 -138 120 431 924 1156 -37 -908 -90 877 1050 883 107 -754 -635 937 1382 334 -339 167
1064 167 -81 -531 501 1601 552 -1293 -884 649 829 410 87 -549 -821 -242 733 402 -205 -183 -775
1083 -775 -1021 26 1259 506 -1236 -1454 -14 548 -215 -36 -53 -911 -1103 -322 644 432 -632 -1087 -993
1102i93Q60O46m3r33o27M14P67J6R2J0p09o20M91J370K84j210p68M89M95O0O16
1123G07p6p42r16Q45J084l26k99M8n72n99J157J180n83j549L22N90j58M99P31
1142A343r73j291M76J251P0o64L22l26j115N56J554p5j242m57O34r8J16O66n7
1161F90j080m29P45N68k7j42l33j077K98J348K80p68q43J32L51l7L94O34p06r91
1181i93j18R96O42l74o24l64P5M46M07J32l15o65l7M41L11L98L4r91n29O20J194
1202F86j17p79j27N2k47M88J006j80j211k87N49M73J59K71n21r69K25J014M53
1221I38o43j45q0l91J66J082K49j115n42K25L76N03J64j57q99k39O70M87p3n3
1241E23n72l72L9R84L43p90l59j53m3N88L85J0p57n57M67K63M44M7o91n75pN84
$$ plain form
1102 -993 -133 513 470 -463 -1090 -676 91 107 199 209 -500 -1120 -629 741 1025 -185 -953 -464 31 91 707
1123 707 631 -111 -1027 -182 902 576 277 325 -247 -846 311 1491 908 -641 -319 271 113 612 1343
1142 1343 370 -921 -445 806 876 212 534 208 -907 -351 1203 1128 -114 -571 63 -35 81 747 690
1161 690 -390 -819 -74 494 467 325 -8 -1085 -787 561 841 73 -770 -638 -287 -324 70 704 -2 -993
1181 -993 -1111 -115 527 153 -471 -835 -760 -314 93 225 -90 -755 -792 -351 -40 358 392 -599 -1128 -508 686
1202 686 569 -210 -337 -285 -532 -44 962 782 -429 -716 -167 306 465 736 215 -754 -529 485 938
1221 938 295 150 70 -321 -155 927 1176 61 -481 -256 120 623 787 630 -269 -508 162 649 576 523
1241 523 -49 -421 -382 602 945 155 -204 -357 -400 188 573 583 -174 -731 -264 -1 443 490 -201 -776 -783 -199
1263a99P23j89m34o54lM71P07j73l80n03j69L45N62M52o18o75l7M45L84K35o7
1284B23r09j76L95N91J84j42k76n27j24Q97N83l63n14k47J9L00P41M7p31m74R7
1305d06N57K70K56j36p64k19M83O76p5j85m89m91L30Q60K33o09m05j56J96M09
1325C35N19k28o12m16K66N71J43j84k29o33k0P70M85k03n96m34p7L57N98K33o98
1346e3l66m7L33M45R1l14o75o4N57K31J39j61n16m34K58N21L84m82k10k40LN65
1368c5L59l07m90k71K56L09L11P5n77k14J9M90K74K23m93n18q1M76O75k05k20
1389E6l80j77L14N47L15l09o57l4K99L35L65k16o10l53N03L55L63k15k74m45j54
1410c72P24M35l53m20p8p0K82M09M9n57l83K16J89M40P4l77m61k22N28M03j8k84
$$ plain form
1263 -199 524 335 -99 -753 -756 -285 422 249 -131 -634 -803 -458 104 556 -62 -737 -774 -329 55 290 223
1284 223 -686 -862 -467 124 308 166 -110 -637 -761 136 719 356 -158 -405 -386 -86 655 702 -29 -503 -406
1305 -406 151 421 677 541 -223 -442 41 717 642 457 -32 -523 -193 667 900 291 -114 -270 -74 335
1325 335 854 626 14 -402 -136 435 578 394 165 -468 -488 282 767 564 -32 -466 -543 -186 412 645 -53
1346 -53 -419 -466 -133 312 403 89 -586 -650 -93 138 277 116 -400 -834 -576 -55 329 -153 -363 -603 -600 -35
1368 -35 324 17 -473 -744 -488 -179 132 207 -370 -584 -565 -75 199 422 -71 -589 -670 -194 481 276 56
1389 56 -324 -501 -187 360 675 366 -291 -325 -26 309 674 458 -152 -505 -2 353 716 501 227 -218 -372
1410 -372 352 787 434 14 -64 -134 148 557 606 49 -334 -118 71 511 585 208 -253 -475 53 456 438 154
1432A54l42k65K42O06Q8m15n13j04J64M30L45j26p83k07K28N25K52o4m90l57L3
1453e99N80J24j20k42l02j29M79M85R7n21j99k72L87M69J60m32m92m8L61M12J88
1474C86j19m64n36N21M60J44j13l09k71m1O07L97l69l17k72J75K91L82l0m08m14
1495c00J73M60J37m8k03m22j3K98M36O3l23k30l29J78O34j4l37k95r0K95K08R2
1517C70N1o63k36L70K93K90k39l32m19J00M79K01j41l77j63k9L37L09Q3n27k16
1538d59J37R0M25Q2l74m14j16L46L72Nk54j78j93Q5O59J63k57n88j03L05K23L19
1560B75n3n32j50ML78M41ml98j96j6L25K56N9l50k96N2L03K32J21k99k94j46L32
1583D4M70j9l40p5k30Q1M90L1j15l96p6J51K91J36j01k40n44L06L21K50L8o53
$$ plain form
1432 154 -188 -453 -211 395 483 68 -445 -549 -385 45 390 264 -519 -726 -498 27 279 215 -275 -632 -599
1453 -599 -19 105 -15 -257 -559 -688 -209 276 373 -148 -347 -619 -232 237 397 -35 -527 -575 -214 198 386
1474 386 267 -197 -733 -212 248 392 279 -30 -301 -342 265 662 293 -24 -296 -121 170 552 522 114 -300
1495 -300 -127 333 470 422 219 -203 -216 82 518 581 258 28 -301 -123 511 497 160 -135 -225 70 278 370
1517 370 421 -242 -478 -108 185 475 236 -96 -515 -415 64 265 124 -253 -416 -445 -108 201 284 -243 -459
1538 -459 -322 -232 193 275 -99 -513 -629 -283 89 94 -160 -338 -531 -446 213 376 119 -469 -572 -267 -44 275
1560 275 222 -310 -460 -456 -78 363 359 -39 -235 -251 74 330 389 39 -257 -205 98 330 451 152 -142 -288 44
1583 44 514 495 155 80 -150 -69 421 452 337 -59 -135 16 307 443 342 102 -442 -136 185 435 473 -180
1605a80jM6J53M45j30l52m00R1L41L03Lj56m84j61M15K71J01n41j72J06O9K87
1627E4J68q7m90j83M30M75l02p2k33j87l7O31J96l89l99l0Q8J03M28K08n73l88
1649e89J38O01l4K0j66j94j05L05N32k37l13p7q8O0K97M35l97m17l1L80J63M5
1671C28K2k20l36P8N80M1k23k31j80P8K14K75J31o95j1J06K25K44j09k32j60j11
1693a86J67M56k48j03m42J17L21J05L9j08l02k02K40M17p6l07m5k53m4L79M86
1714D11l46k93j24J01N9K17J73m51l31K26L85N4j36Qk60k38L56L79Ln26j6R2j
1737b58L47K12r4n95Q6J82K33J81j29j76l94J88O28k4k07k02k51K30J95J79j30
1758B01k30j72J45K04K69o5l07j72k1K69K36K7l40Kk80L86J13K4o2k46k02J34
$$ plain form
1605 -180 -181 -135 18 463 333 -19 -419 -328 13 316 319 163 -321 -482 -67 204 305 -236 -408 -302 -233 54
1627 54 222 135 -355 -538 -108 367 65 -7 -240 -427 -464 167 363 -26 -425 -455 -367 -264 164 372 -201 -589
1649 -589 -451 150 116 136 -30 -224 -329 -24 508 271 -42 -119 -207 -147 150 585 188 -229 -260 120 283 328
1671 328 350 130 -206 -128 452 493 270 39 -141 -63 151 426 557 -138 -149 -43 182 426 317 85 -75 -186
1693 -186 -19 437 189 86 -356 -239 82 187 226 118 -184 -386 -146 271 195 -112 -157 -410 -454 -75 411
1714 411 65 -228 -352 -251 -192 25 198 -253 -584 -358 27 81 -55 -47 -307 -545 -189 190 193 -333 -349 -257 -258
1737 -258 89 301 207 -388 -302 -120 113 294 165 -11 -405 -217 411 387 180 -22 -273 -43 152 331 201
1758 201 -29 -201 -56 148 417 352 45 -127 -148 121 357 384 44 46 -234 152 265 289 227 -19 -221 -87
1780h7M13J09k03l84k4J05K20K69j07n36J7L7L56J6l7k64l50J22N17j03o4k9j70
1803a77j64J43M04j3l84j44K7Q6L21J21l33j93K5J74K54j24p0o8k06L2L69K40
1825C20l64j76nJ53R1K36p3l35J9k1K73l3R1l36j60J54K71J64p6j26j26j82K52
1848A1L38o7k09J1k49J72L34J02k99k00j18J76L52O9q8j85k85K06J93J57j74j68
1870G9k41P0L46Q8k22k47J4j71K41K93L5k46k41M2K37J85ok88j49l79N32J63O5
1893B00k24k92j52L41K07K80l85k46o2k2L90J01n3m29r7K92Q8J00q3o6l81L19
1915a74J96J78j86%l94P8K74K15j18j45j34N2J44J09K51k77l15O1J76K64j69J73
1937B59l69j13J60K49k7J33k76j04j23N72N5l64k50KK15J16K34k41K5k16K4J79
$$ plain form
1780 -87 326 435 232 -152 -176 -71 149 418 311 -225 -208 -171 185 201 164 -100 -450 -328 189 86 22 -7 -177
1803 -177 -341 -198 206 193 -191 -335 -308 -222 99 220 -113 -306 -281 -107 147 23 -47 -115 -321 -289 80 320
1825 320 -44 -220 -225 -72 19 255 182 -153 -134 -155 118 85 176 -160 -320 -166 105 269 193 67 -59 -241 11
1848 11 349 282 73 84 -165 7 341 443 144 -56 -174 2 354 423 335 150 -135 71 264 421 247 79
1870 79 -162 -92 254 342 120 -127 -113 -284 -43 250 285 39 -202 -160 77 262 256 -32 -181 -560 -28 135 200
1893 200 -24 -316 -468 -127 80 360 -25 -271 -333 -355 35 136 83 -346 -443 -151 -63 37 -46 -112 -493 -174
1915 -174 22 200 14 14 -380 -302 -28 187 69 -76 -210 -158 -14 95 346 69 -246 -185 -9 255 86 259
1937 259 -110 -223 -63 186 159 292 16 -88 -211 361 416 52 -198 -196 19 135 369 128 153 -63 -39 140
1959A40J77j6k50j03p3J51L11j23j62p2k60L14K10j07m1k30j68J69J74K61k41
1980F1k21k10J83K33Q8J1m23k0R1K74m%k37q7R7N7J95j00J3l87J36K66J6J78k07
2005Ck50J2J55K47n1p0k76p9K32K76M1j49j89q4J03K57N4j27j42l2J1K21J05m7
2029B21j84j57K4J75K47n7r9l42K0K10J73O1k62n4j06K41K06l2k41j96J32r3L42
2052B29Nk17k01m2K06J42P1m4m05R2K1Q1J88Lj65k07J03O4J35j6j21k48j2L76
2076C8J0n8p0j13q4L18pN3k92j07Q9J47J19J06j16k21kK02n7K29j43k22j17L31
2100C3J04oj39j86j8K00l8L27j63j12p2k3J48L38k54j53l5p1J35K21P3k78j51
2123a20N0J13N3J75k97k5j4L7J40J94k60l3r3R9J87j28M6k17j06K38J60l9J02
$$ plain form
1959 140 317 301 51 -52 -125 26 337 214 52 -20 -280 34 244 137 96 -134 -302 -133 41 302 61
1980 61 -160 -370 -187 46 134 145 -278 -298 -207 67 63 63 -174 -261 -164 -107 88 -12 1 -386 -250 16 32 210 3
2005 3 -247 -235 -80 167 116 46 -230 -309 -77 199 240 91 -98 -182 -79 178 232 105 -37 -69 -58 163 268 221
2029 221 37 -120 -96 79 326 269 170 -172 -152 58 231 292 30 -24 -130 111 317 285 44 -152 -20 -113 229
2052 229 234 17 -184 -226 -20 122 193 149 -256 -164 -143 -62 126 129 -36 -243 -140 -76 59 43 -78 -326 -338 38
2076 38 48 -10 -80 -193 -277 41 34 87 -205 -312 -223 -76 43 149 33 -188 -190 12 -45 184 41 -181 -298 33
2100 33 137 131 -8 -194 -212 -12 -50 277 114 2 -70 -93 55 393 139 -14 -49 -120 15 236 309 31 -120
2123 -120 -70 43 96 271 -26 -51 -65 -28 112 306 46 13 -80 19 206 78 124 -93 -199 39 199 160 262
2146B62l14q6J39J60m4qj19j79J21J22l9O3l9k85J1L27k6k1k0k02p1J48Q9J19
2170A08j31k30Q9J59m1n0L4r8o4L6K10J49j59j33qO2K7P2J19j93j24m1K99R8l5
2195A55k36oN2J33J33r8j47n3o9P2J47K01p2k90J6P1O0J69j44q2j73K05J94Kj76
2220F4K8j58p6K46J48n8j69j18O5R7J1P4j69j22O1M4K29j79p9P0j66J63J34J15
2244B55k99k11J61P7o2R1ok6k07J14J68L3r5j43j8M2K02p2P0j39j22j3J47P9P6
2269A02k43k9k4J13P5M4o0K0o3mJ51om3J6k14J12K04P6k02j69O8MK86o8k4j70
2295d8J09J7K0J56j47r5r6J54j11K13J54l12n2N4J17J63j29k19Qo6J35K17j87
2318E5j2j30K9J76m6O9P8k76o3R6J04jm0j02j17J53N5J01j12n5j57J42J42l2K4
$$ plain form
2146 262 -52 -138 1 161 117 109 -10 -189 -68 54 15 78 39 -246 -235 92 66 45 25 -177 -248 -100 -11 108
2170 108 -23 -253 -164 -5 -46 -96 -62 -160 -224 -188 22 171 12 -121 -129 -67 -40 32 151 -42 -166 -207 92 190 155
2195 155 -81 -87 -35 98 231 133 -14 -67 -136 -64 83 284 212 -78 -62 9 69 238 94 12 -161 44 238 240 64
2220 64 92 -66 -142 104 252 194 25 -93 -28 69 80 154 -15 -137 -76 -32 197 18 -61 9 -157 6 140 255
2244 255 -44 -255 -94 -17 -79 12 6 -20 -227 -113 55 88 -7 -150 -168 -126 76 4 74 -65 -187 -200 -53 26 102
2269 102 -141 -170 -194 -81 -6 38 -22 -2 -65 -69 82 76 33 49 -165 -53 151 227 25 -144 -76 -72 214 146 122 -48
2295 -48 61 78 98 254 107 12 -84 70 -41 172 326 14 -38 16 133 296 167 -52 -44 -110 25 242 55
2318 55 43 -87 -58 118 72 141 219 -57 -120 -24 80 79 39 -63 -180 -27 28 129 17 -38 -195 -53 89 57 81
2343H1j32k02L9J87Q7m1j7k74N3J85J52r0k96J71l8R3J29j3j05j44R1O9m2K44
2367A87j82k11K20j40K40J6o7r8j28J42N3OKM1j54P2J19R8j63n6j19P5J33m5L11
2392C52l56m0R0K1N2J3L3j84q0J91L1j44l5l2PQ7M2K01k82n7R7r1K32m5m7r3J62
2419A25r1p2K19L0k33q8O2l6J36o9P4j91M2j0J79q2l6k6N7j11Q8rm8p9j0K31Q4
2446A36o5r9j74J14J4O9N6j3j40j39J48J72m9o1j12NO6P8Q7M0l14J96j39J02J03
2471H1QQj58O3j13K68O7j63q4j1J9J03P4j4k37P2K05m1Pj2k82J08M4P2Q5j35j51
2498a17qJ15J17M1j34k4r8L7Q7O0l7J6j56n9R7K20j33o9r7Q0P8O2m1n0q0j05J94
2525dRl3j79J53m6N6K34j36k2m9m4O6J8p7J38k52jk0J17rP0r8o7M3K20K7j6j0
$$ plain form
2343 81 -51 -253 -214 -27 60 19 2 -272 -219 -34 118 28 -268 -97 -135 -42 87 74 -31 -175 -84 -15 -57 187
2367 187 5 -206 14 -126 114 130 63 -35 -163 -21 32 38 40 81 -73 -1 118 216 53 -3 -122 -47 86 41 352
2392 352 -4 -44 46 67 119 132 165 -19 -99 92 123 -21 -56 -88 -81 6 48 249 -33 -90 7 -84 148 103 56 -37 125
2419 125 34 -38 181 211 -22 -110 -48 -84 52 -17 57 -134 -92 -102 77 -5 -41 -67 -10 -121 -33 -42 -90 -169 -179 52 136
2446 136 71 -28 -202 -88 -74 -5 51 38 -102 -241 -93 79 30 -31 -143 -138 -72 6 93 133 -181 15 -124 -22 81
2471 81 89 97 -61 2 -111 157 224 61 -23 -34 -15 88 162 148 -89 -17 188 147 154 142 -140 -32 12 84 169 34 -117
2498 -117 -125 -10 107 148 14 -10 -108 -71 16 76 39 55 -101 -160 -63 157 24 -45 -142 -62 16 78 37 -13 -93 -198 -4
2525 -4 5 -28 -207 -54 -100 -44 190 54 32 -17 -61 5 23 -54 84 -168 -169 -189 -72 -81 -11 -109 -176 -133 87 114 98 88
2553H8k66J86K3j8J6L9j24m2k7J84M0q8l8J1J34j7lp0Nj01J13P4M0j52r8K6j3
2580g8J31J52j54k1j28M8K07l6j28m2l3Q0K5O3k8m4j59Q9J25n7J41q5j46k2R0
2605a0J4O4l3j17l2L4J41r5Q3j30o6l7J34Q7j14l9j3r4J80J05m2j4j06J50Qj08
2631e0J01pj70P6NO1P8M0j79m4RQ9J26l2j77n0O4J60J52k83K4N4O6n7J36j20j42
2658g0R9%mP6M1j17j3n4J33J36j98K7r1rJ41rM7k00l0J43k4K0M2k5j11PK1J17
2686I5o0J09k52R1k1O0l5o8q3J09j7N3J33n7o8k36J05PL46k31q2j43J05N5J45
2711F0j2q0r2K6Q6j0J00j85M8j20N9J47N7j33N4j46P9J39j34K25k82o3J39N1L9
2736E2j08qp6J08r3K04M6m1j58J6K21m1P2j71j06J4J98j8j4k7j54K3O8J35l1n0
$$ plain form
2553 88 -178 8 31 13 29 68 -56 -98 -125 59 99 11 -27 -16 118 101 98 28 33 -68 45 119 159 7 -91 -65 -78
2580 -78 53 205 51 30 -98 -50 157 121 -7 -49 -82 -2 23 86 58 14 -145 -56 69 12 153 68 -78 -100 -10
2605 -10 4 68 35 -82 -114 -80 61 -34 49 -81 -147 -184 -50 37 -77 -116 -129 -223 -43 62 20 6 -100 50 58 -50
2631 -50 51 44 -126 -50 -45 16 94 134 -45 -89 -80 9 135 103 -74 -124 -60 100 252 -31 -7 47 113 56 192 72 -70
2658 -70 29 29 25 101 142 25 12 -42 91 227 29 56 -35 -44 97 88 135 -65 -95 48 24 44 86 61 -50 -43 -22 95
2686 95 35 144 -108 -17 -38 22 -13 -81 -164 -55 -72 -19 114 57 -11 -247 -142 -135 211 -20 -102 -245 -140 -85 60
2711 60 48 -32 -124 -98 -12 -22 78 -107 -59 -179 -120 27 84 -49 5 -141 -62 77 -57 168 -114 -177 -38 13 52
2736 52 -56 -64 -140 -32 -125 79 125 84 -74 -58 163 122 194 23 -83 -69 129 111 97 70 -84 -61 7 142 111 61
2762F1q1rn5R1J48j01j0j56J26K6Mj11M9n0R1l2J06L2j62q9Q1K9P6J62j07l61
2788b42J01R8J84j5j41l5Qj65L11q6q4N0q1k8J03J06j82R0j61L0O7J40J0j72J10
2813A6j11J17J68j43KK2j56L9O0m1J4j23Q5J19P9r4J70k27K9m0K9L7r1M8J4J1
2839C3J42j03pL4q0J14m9k6O1k8k81J50P3J05k7j50PP0M6jL5p4j51J12j04J36
2865C7N1j59j30J81j06K01pq4J8j01P9k5J07j22N3nn3J00Qj6r7M6p3O3R3j65N4
2892e2M2m7l5P3m2L2m5o5N3l0K7P3j4N0R5pj26j29Q4O9q8n4J03J1LN0j41O5PK0
2922a8j2q1MJ78r3R0k6j67J57MO8n7J04n8k7nJ10l7j26j0J3J50k8j06m8R1j25
2949e5R3j3J77k57k3l7J31K3r7M6J0m8k4J29mm0l5q4Qp8Q7K15k34M0J20N2p3j4
$$ plain form
2762 61 -20 -29 -84 7 155 54 44 -112 14 40 44 -67 -18 -68 23 -9 97 129 -33 -122 -41 -12 64 226 119 -242
2788 -242 -141 -43 141 126 -15 -50 -42 -207 104 18 -66 -16 -97 -125 -22 84 -98 -8 -169 -139 -72 68 78 -94 16
2813 16 -95 22 190 47 49 71 -85 -46 14 -27 -13 -136 -51 68 147 53 223 -4 25 -15 14 51 -40 8 22 33
2839 33 175 72 65 99 19 133 84 58 119 91 -190 -40 33 138 111 -39 -32 38 84 83 118 44 -107 5 -99 37
2865 37 88 -71 -201 -20 -126 75 68 -16 2 -99 -20 -45 62 -60 -7 -12 -65 35 43 27 -70 -24 -97 -34 59 -106 -52
2892 -52 -10 -57 -92 -19 -61 -29 -74 -139 -86 -116 -89 -16 -30 20 115 108 -18 -147 -63 6 -82 -136 -33 -22 -19 31 -110 -45 -38 -18
2922 -18 -30 -111 -107 71 -22 68 42 -125 32 36 104 47 151 93 66 61 171 134 8 -2 11 161 133 27 -21 70 -55
2949 -55 38 25 202 -55 -78 -115 16 39 -58 -12 -2 -50 -74 55 51 11 -24 -108 -100 -178 -91 124 -110 -70 50 102 29 15
2977A5J2k33K08O0Q9j24j5m7m1J02MK3m1j32JO7J06kj78N3LK2R1j23O6Q7j74%
3005a01J58m1L7m0m2q0J63J63j33j48l9M6K94j69j30k8Q8J87k32J92j64J03q4
3028@J11j10J05J7n3j0j17Q4J95Jj96j03m2J72p8Q6o9p7p3J53J15p6k8j63j1L21
3054A54r9Qj44N3n2OJ14k00J36k2K7Qj09J10j9j75R4Q9L2KNOq2M6m4N8On1MR4
3084E5m6o1J00J39k28j30Q9J65o9M1l7j6N0K4n7r2J92j22n7J57j77N8J8NL8Q5
3110A24j05m8Nk6l5J07K1oQ3o1p5qJ27n9j31J38j0p7J09o2l4k7l9m1J31N4N9j37
3138b3o2K6NM9j01K05j91NL2J35j13m1j9J54j29R3N9j20J8O2j37pJ07qp4L5n7
3165i7Q7r1p2R8l4J7O4J3J52Ml53K37k1JK3n7p4J06m3J62K2j21l1n2J58n9p1p4
$$ plain form
2977 15 27 -206 2 62 151 27 12 -35 -76 26 30 53 12 -120 -119 -52 54 52 -126 -73 -70 -48 43 -80 -14 73 -101 -101
3005 -101 57 16 53 13 -29 -109 54 217 84 -64 -103 -57 237 68 -62 -90 -2 185 -47 145 -19 84 0
3028 0 111 1 106 123 70 60 -57 27 222 223 27 -76 -118 54 -24 62 -7 -84 -157 -4 111 35 7 -156 -167 154
3054 154 55 63 -81 -28 -80 -74 40 -160 -24 -46 -19 -11 -120 -10 -29 -204 -110 -21 11 13 18 24 -58 -12 -56 2 8 -43 -39 55
3084 55 9 -52 48 187 -41 -171 -82 83 14 55 18 2 52 76 19 -73 119 -3 -60 97 -80 -22 -4 1 39 124
3110 124 19 -29 -24 -50 -85 22 43 37 120 59 -16 -24 103 44 -87 51 41 -36 73 11 -23 -50 -89 -130 1 55 114 -23
3138 -23 -85 -59 -54 -5 -106 99 -92 -87 -55 80 -33 -74 -93 61 -68 25 84 -36 -18 44 -93 -100 7 -1 -75 -40 -97
3165 -97 -10 -101 -173 -75 -109 -92 -28 -15 137 141 -212 25 4 5 28 -29 -103 3 -40 122 144 23 -8 -60 98 39 -32 -106
3193a06L9J29J0j31K4N8lj16N6Q7n1oL4Q6j36P9L0rK5n0j1m9K40j42j11l7k9M6
3221d4Q4PP9o6j35N0J2J76j76n2Q2J2J0o0n0N6J2J0o1J3J0j1N9k16J55K4l9j3
3249g2Q3j13N5P5L8ok31J58o5P9o6O2j14M4M5k5J16j63J9n6J84K0qJ0j46N4k0
3276d3N1J6Nj03J32M8l3L5j55R5l7j34K10m5P9q5Jj3MP4o6J8j00Q7L8l7QPp3k2
3306c8N9r9J91j03%j52J79k7LJ77p5k18J97n0j3J0j31J56o1J0r7K5N9j42N2J40
3332E2m7m3pj3j7j5K16j35n4j2M2m0j2N9n1oL5O2o9j8J77k16J70j28J21J9l1o6
3360b7j11J34k6O5J25k86K0O3Q0P0j41J17j11O5j8L4R2j46p1J05j3l7O2N1j55
3385e9M5J7l3J80o3n4m7M2J08j04J51j94J80j78r8K46J04k40o8O2P9r0j07K37
$$ plain form
3193 -106 -67 62 72 -59 -35 23 20 -96 -40 47 -4 -10 24 110 -26 53 83 74 99 49 38 -11 229 87 -24 -61 -90 -44
3221 -44 40 47 126 60 -75 -25 -13 163 -13 -65 17 29 39 -21 -71 -15 -3 7 -54 -41 -31 -42 17 -199 -44 -20 -59 -72
3249 -72 11 -102 -47 28 66 60 -171 -13 -78 1 -65 -3 -117 -73 -28 -53 63 -100 -81 -137 47 67 59 69 -77 -23 -43
3276 -43 8 24 29 -74 58 106 73 108 -47 48 11 -123 87 42 121 36 37 24 28 102 36 54 -46 41 79 42 50 57 -16 -38
3306 -38 21 -78 113 10 10 -142 37 10 13 190 115 -103 94 44 31 41 -90 66 5 15 -82 -57 2 -140 -88 52
3332 52 5 -38 -45 -58 -75 -90 126 -9 -63 -75 -33 -73 -85 -26 -77 -83 -48 14 -55 -73 104 -112 58 -70 51 70 39 -27
3360 -27 -138 -4 -30 35 160 -126 -106 -43 37 107 -34 83 -28 37 19 53 145 -1 -72 33 20 -17 45 96 -59
3385 -59 -14 3 -30 150 87 33 -14 28 136 32 183 -11 169 -9 -107 139 243 3 -65 -3 76 -14 -121 116
3409A16j04p4l3K3pj35K37n3J4l3n7K10j69M3l6P4m4J00k10P5O6j7J41k49J27
3434Ep6J04K2l0R1r1r4J49K4j19p2J34l9n3J6opp7J20P8j00Q%O9r2Q6O9n4l0p6
3464d1n1QMK52j63N2q7Q9j19M6K4pm3Q4p5J52j1r7R7j56PK3oJ35j52J2R7j42Q0
3493A2j48K54k6q8q4N3L5j9K1r6J08n3J72j44l1P1m1O9j09J83j71L4j31J62k1
3518A2p7K6L4j51R2J75k03J43j55qK6j2J4N5k5J4j37J69R2j53L0k1nK7J16r5o5
3545h2j38J51P2R4k25J12K8j00P7J77k73J90k0j32Q4J12M4k03M6p6KN9m2O3l3
3570a3m8J87j41Q0qmr0j25J31J34j49R3l1J54j51k4j2P3j59q%J41j4Rj17r5K51
3597F4l2k5j56O9%O5Q2m3j11R5q6J86J18k86J0k4J2k7J02J43l4l17J53m9J13q4
$$ plain form
3409 116 12 -62 -95 -72 -79 -214 23 -30 -16 -49 -106 104 -65 -22 -58 16 -28 72 -138 -63 3 -14 127 -122 5
3434 5 -71 33 55 25 116 25 -69 80 104 -15 -87 47 8 -45 -29 -35 -42 -119 1 79 -21 -13 -13 56 -36 50 119 65 35 -41
3464 -41 -92 -84 -80 172 9 61 -26 63 -56 -10 14 7 -36 48 -27 125 114 17 114 -42 -35 -12 -18 117 -35 -23 74 -68 12
3493 12 -136 118 92 4 -80 -27 8 -11 10 -86 22 -31 141 -3 -34 37 -4 65 -44 139 -32 2 -129 33 12
3518 12 -65 -39 -5 -156 -64 111 -92 51 -104 -112 -86 -98 -84 -29 -54 -40 -177 -8 84 -69 -39 -60 -65 -38 78 -17 -82
3545 -82 -220 -69 3 97 -128 -16 12 -88 -11 166 -107 83 63 -69 15 127 171 -32 14 -62 -60 -1 -43 20 -13
3570 -13 -61 126 -15 65 57 53 -37 -162 -31 103 -46 47 16 170 19 -5 -17 56 -103 -111 -111 30 16 25 -92 -187 64
3597 64 32 7 -149 -80 -80 -15 67 24 -87 8 -78 108 226 -60 -50 -74 -62 -89 13 156 122 -195 -42 -91 22 -62
3623f2K5O9j29J16k00K06j2j42N8m1L41j58j03M3J05p2q4J13l0p5K7k2K4rN4j1
3649C1j10Q7l8R5K7r5P8L9k02O1R2n4J08p4l9L0P0N0j88M6o0K2K4Q8q6n4K6R7
3677G1j04N1j00J77Nj08p3oO2j4ok1N2M4J2r6LJ4J50j55mm7m7K37l2Q6k11J06
3705D6j02J37J0k27J99j98O8o9K44l7k2K3j55N1J23j60l3K55j43LMo3O1J29j78
3730c4N0q0O3J18J3q3r7N7K6Q4nj7m9j8p4J73k6n9M9k7R5j87N5lr0J17J19k15
3758d5O9M1M2k5Mn4J8l5q1N2N5P5j58M8n8r8Q4L7lR0m3m8o1N5p3J05O8j14LJ0
3788d0l7q5O2P5J05p8k2O0q7k3J6p2K19r2Ql5K6k8J08p9J9p0j09K3K03r7k6K3
3816c3r0j1J66Mk5m2M2m7K31j02N2j50l9J08n4Q8L6q1N7o2j3j06J52r9l0J99j05
$$ plain form
3623 -62 -37 32 -97 19 -181 25 13 -129 -71 -112 229 71 -32 11 116 44 -40 73 43 -32 -5 -27 -3 -12 42 31
3649 31 -79 8 -30 65 92 -3 75 114 -88 -27 65 11 119 45 6 36 106 156 -32 14 -46 -24 0 88 2 -52 -26 71
3677 71 -33 18 -82 95 100 -8 -81 -87 -25 -39 -45 -66 -14 30 42 -54 -51 -37 113 -42 -46 -93 -140 97 65 151 -60 46
3705 46 -56 81 91 -136 63 -135 -67 -136 108 71 49 72 -83 -32 91 -69 -102 153 10 13 17 -46 15 144 -34
3730 -34 16 -64 -1 117 130 47 -50 7 33 117 112 95 46 28 -46 127 101 42 91 64 159 -28 27 24 -66 51 170 -45
3758 -45 24 65 107 82 86 32 50 15 -66 -14 41 116 -42 6 -52 -150 -66 -29 -32 58 15 -33 -94 -39 -112 -7 61 -53 -50 -40
3788 -40 -77 -162 -100 -25 80 2 -20 40 -47 -70 -54 -126 93 1 9 -26 0 -28 80 1 20 -50 -159 -136 67 -30 -56 -33
3816 -33 -123 -134 32 36 11 -31 11 -36 195 93 145 -5 -44 64 10 98 134 53 110 48 35 -71 81 -18 -48 151 46
3843D6J75j55j69P7%J0J74q7j35R6j9n5j5Q1J8L8k6j20J28J4j98J38j2q6J05L8
3869F1L0p6j19%J62m7L4j62OJ34l6L8Rr2o8J28o9L4m9J5Q3%J02p8l1j03P2N4o3
3898c1J31l7Mj17N7pQ5l5Nk0q9j7L2K8L5K9o3j79J48N9KQ0j22J74j91J67n9j31
3926f2M1Q7j14M2P7j30j4%J72j38K8K8m7k4L4O2J04k04M9O6j78O6J0m3m0K1MK26
3954A23k5m2j14j0jqL9KJ03mj40R3m2N1J4j28L1N5L9J7o0l1j8L0q5J80r8O9j30
3983i0J36Ro6k8J82k70J02P8j33J39j42J37n7M1O3l4ro6J25K3j00N1j07j5P2L2
4009G3k02J49R3k9l4k1L8M0q1J18j75%J41j37P1r5j4K4J51p6k1Nj67nJ08P4N8
4036H6j42j8O6q0J20O4j86P3o0OJ7J21J1o2k4J3M8r0m8Q0r4J4J65o5O3o2j1p3
$$ plain form
3843 46 221 66 -103 -26 -26 -16 158 71 -64 32 13 -42 -57 24 42 80 54 -66 62 76 -122 16 4 -82 23 61
3869 61 91 15 -104 -104 58 11 45 -117 -111 23 -13 25 34 -58 -126 2 -67 -33 -82 -67 16 16 118 40 9 -94 -22 32 -31
3898 -31 100 63 67 -50 7 0 85 50 55 35 -54 -71 -39 -11 24 53 -10 -189 -41 18 20 100 -22 152 -39 128 69 -62
3926 -62 -21 66 -48 -6 71 -59 -73 -73 99 -39 -11 17 -30 -54 -20 42 146 -58 -9 57 -121 -55 -45 -88 -128 -107 -103 123
3954 123 98 56 -58 -68 -69 -77 -38 -36 67 63 -77 16 -26 25 39 -89 -58 -3 36 53 -7 -38 -56 -26 -111 69 -29 40 -90
3983 -90 46 55 -11 -39 143 -127 -25 53 -80 59 -83 54 -3 38 101 67 58 -8 117 140 40 91 -16 -31 41 73
4009 73 -129 20 113 84 50 29 67 107 26 144 -31 -31 110 -27 44 -51 -65 -41 110 34 13 18 -149 -154 -46 28 86
4036 86 -56 -74 -8 -88 32 96 -90 -17 -77 -71 -54 67 78 16 -8 5 53 -37 -85 -5 -99 -85 80 15 78 16 5 -68
4064f8Q5J37o7p0n3L0K0O3L3q2J4l8L8j7L7o3n4J16p3J95k49O5m1K1Q9j53J80
4091I5j87o2J16pL5P1k7o3N0n8J24J18j39j1oL4j05L14k47N7j67J00n8lJ11j55
4117g0N4JM2k4J03q8j20J8k9K32k11J37m7n0m0o4J68r9J7L9j3j17P2N0K44k60
4143e5J04r0Q3r7Oj0P3j37O7n4J69j1j6j9L3J3j22J44j0Nj29J11o3J2j09J79n
4170G2j4Lk2j41J82p5N8j56J17nj8j55K48Lj27K03k22P9r4O6J5L9o2RR2k2m2k2
4198Ir3J19j14J43j8L0j73J55l9N2q7j1q1N7J09L6q9L3m2n0O7k7l1r5MJ41j03
4225i8K2OP1j0N0o1J30j77Q4l7o6K8J97j11j77J77j34l6L6K11r4L6jj36R2j4j8
4252c0M7m6P4n0j31J96j68J37j03J78j59M5j14N2K35k40RQ0L4O1n5j23K12j34
$$ plain form
4064 -68 17 154 87 17 -36 -6 14 77 110 28 42 4 42 25 62 -1 -55 61 -12 183 -66 -1 -42 -21 68 -85 95
4091 95 -92 -154 -38 -45 -10 61 34 -29 21 -37 87 205 66 55 49 83 -22 292 45 102 -65 35 -23 -26 85 -70
4117 -70 -16 -15 27 3 106 18 -102 -84 -113 119 -92 45 -2 -52 -92 -156 12 -87 -70 -31 -44 -161 -89 -39 205 -55
4143 -55 49 -41 42 -55 -49 -59 14 -123 -56 -110 59 48 32 13 46 59 -63 81 71 76 -53 58 -5 7 -102 77 72
4170 72 58 61 39 -102 80 5 63 -93 24 19 1 -154 94 97 -30 173 -49 30 -64 2 17 56 -6 3 95 73 31 9
4198 9 -84 35 -79 64 46 76 -97 58 19 71 -16 -27 -108 -51 58 94 5 38 -4 -54 13 -14 -45 -140 -136 5 -98
4225 -98 -76 -70 1 -9 41 -20 110 -67 17 -20 -86 -58 139 28 -149 28 -106 -142 -106 105 11 47 46 -90 2 -12 -30
4252 -30 17 -29 45 -5 -136 60 -108 29 -74 104 -55 -10 -124 -72 163 -77 -68 12 46 107 52 -71 141 7
4276GP2l2J5k11J77J44k28K3L8J29j30R1o7r6J8J13j11P4n9K5o5R1K1L4j40O3
4302dM9rqm5l8R8o0J2lL8p4j11R1O5K5K3j34Lk6O5k4J44k13K39qr7L6l6K10k15
4332gq1j7J04j74L08j37P6m1l2O9o0m0r7J66k5K6m5K5j60J32l2P8k1n8Q1J7p7
4359b2O4qj00J35j40oO1M6L0j25j2j2J09K1L1r6l4M6J3R0q9m3P9K3m2N5j14K5
4387a5M4j70J05NJ86nj11r2j58K62n2M2J1l5n6rJ96q6j85J26n7p2K67j5j71Q6
4413D1l1J8r9j3N7m6m9K8J24P0j01o2O4l6m5J35n8L7j42P5Q8k9o9N2m1J37j00
4440EL2Q1q1Mo5J50j40Q4l5j2P2k4j36P0n8K8Q4pK5K1j26Q1R8q0L9j55M5NR5r
4470I1k6l4O5k09Q7J39j79M5J76q6j29R6n1O2J40k10L6j33K5R5O8l6j10J87j25
$$ plain form
4276 7 79 47 62 -149 28 172 -56 -33 5 134 4 95 28 -68 -50 63 -48 26 -33 -8 -73 18 39 73 -67 -4
4302 -4 45 36 28 -17 -55 43 -17 -5 -8 30 -44 -155 -64 1 26 49 -85 -82 -108 -43 -67 77 -136 103 95 -2 34 -2 208 -7
4332 -7 -88 -105 -1 -175 133 -4 72 31 -1 68 8 -32 -129 37 12 38 -7 18 -142 -10 -42 36 15 -43 38 55 -22
4359 -22 42 34 -66 69 -71 -77 -16 30 60 -65 -77 -89 20 41 72 -24 -58 -12 1 91 2 -41 38 61 19 74 -40 -15
4387 -15 29 -141 -36 -31 155 150 39 -53 -211 51 -1 41 52 17 -39 -48 148 62 -123 3 -54 -126 141 126 -45 41
4413 41 10 28 -71 -84 -27 -73 -122 -94 30 100 -1 -63 1 -35 -80 55 -3 34 -108 -33 55 26 -43 9 -32 105 5
4440 5 37 118 37 41 -24 126 -14 70 35 23 95 71 -65 5 -53 -25 59 52 77 98 -28 53 151 71 110 -45 0 5 100 91
4470 91 65 31 96 -113 -26 113 -66 -21 155 69 -60 36 -15 47 187 -23 13 -120 -95 0 68 32 -78 109 -16
4495a6K3Qo3j19N4J35Kp3m0M5L8l6m9P3R2p4j19J8J48P4j20M6j5Q8k14R5R7j12
4523a4ln7J53o6k9K25j49Lq9M5J5M9p3l8N7O5o4lJ5q7N3p8Q0J7j25J73n0k5K9
4552B9J40j91j83K01J24r1j37J35k8M4p4M9m8l4NP6R6n8j41K8k9J17Pp2L2Np4
4579g2J51n1p0k5Q1q5J53p1K1p5P0M9q9q1k4P8L8P3j84J15o5J05j4p2j06P2K1
4606e7N6L9j57O0QR0p0MN9J39k03kLJ0r1O0Q6J2r6J24o3N8N2l5k0j73J76p6J14
4635A07q2n8N7N1j19j7O2m5l0J38r0J55l34K82lM7j31%j57RJ05j65K00M0mq6M9
4662a9j2J10l7q0PM2J4l5N3m9J5p0J90j59J24Jj12K1n0j35K00L6j15j4L8p1J50
4689D3j74N1J00qj18Q9K5m5J7l8J00L0j9o1p1J6J66n8p7P9l5J0J02k13P7n7j2
$$ plain form
4495 -16 7 15 -48 -167 -113 22 24 -49 -89 -44 -6 -42 -91 -18 74 0 -119 -101 47 121 1 47 32 120 -94 1 98 -14
4523 -14 -17 -74 79 13 -16 209 60 63 -26 19 34 83 10 -28 29 94 30 27 42 -45 8 -70 10 27 -98 75 25 0 29
4552 29 169 -22 -205 -4 120 29 -108 27 -1 43 -31 18 -30 -64 -59 17 113 55 -86 -58 -87 30 37 -35 -3 2 -72
4579 -72 79 28 -42 -67 14 -71 82 11 32 -43 27 76 -13 -94 -118 -40 -2 71 -113 2 -63 42 28 -44 -150 -78 -57
4606 -57 -1 38 -119 -59 -51 39 -31 -27 32 171 -32 -34 -31 -21 -112 -52 34 46 -50 74 11 69 121 86 66 -107 69 -7 107
4635 107 25 -33 24 75 -44 -61 1 -44 -74 64 -26 129 -205 77 74 121 -10 -10 -167 -158 -53 -218 -18 22 18 -68 -19
4662 -19 -31 79 42 -38 -31 11 25 -10 43 -6 9 -61 129 -30 94 95 -17 4 -46 -181 19 55 -60 -74 -36 -107 43
4689 43 -131 -80 20 12 -106 -17 8 -37 -20 -58 42 72 53 -8 -79 -63 103 45 -32 47 12 22 124 -89 -12 -69 -81
4716h1J3O8l8J16n7r6J95k7o4k8L5k9nP7Ml8jR8q8j12J83k6j9k37n4J20J36k6
4744A9L9p2L9l4o9J3P0q7J20L5k08J90qj21L6J49j17M2j13J6O2l4lJ3qK2j5J11
4772H7Lq1L7l5L5m1j06J69J4r3k0J4kN7m5M2k08Q3J17r5M1P4j51J95J8j31K3K32
4800B33l30Q0J15q7J48m5j25l4N5J49l0k1r5N8p1j5o1J78j40L8l9L8Pj2q2J8L5
4827c5M4P2rq6l7J12p7KlM4P9q5n2K8Q9j33J09k5j23R1p9J36j49k4J37M1j2r9
4855d4L8kN3m3j46J33J15j17N6J8j04N3J4j9m2O2j10J85o6k12K14o6O2P3r4q2
4881g1J25j0j44K09j20n8L1M4k1J67j84Q6J1r3J26j8j12L5M2L0n8N9qN1j15Rq4
4908g1QJ25j01K2M7m9K0J81m2k49M4M3M9R3j76J15n3j1l6P9J06j33k3J47j11j68
$$ plain form
4716 -81 -68 0 -38 78 21 -75 120 93 29 1 36 7 2 79 83 45 44 142 54 -58 125 99 80 -157 -211 -91 45 19
4744 19 58 -14 25 -9 -78 -65 5 -82 38 73 -135 55 47 -74 -38 111 -6 36 -77 -61 1 -33 -36 -23 -31 -9 -24 87
4772 87 90 9 46 11 46 5 -101 68 82 -11 -31 -17 -19 38 -7 35 -173 -90 27 -68 -27 47 -104 91 109 -22 1 233
4800 233 -97 -17 98 11 159 114 -11 -45 10 159 129 108 13 71 0 -15 -76 102 -38 0 -39 -1 6 -6 -88 -70 -35
4827 -35 9 81 72 -14 -51 61 -16 -14 -17 27 106 21 -31 -3 86 -47 62 37 -86 5 -74 62 -87 -111 26 67 55 -44
4855 -44 -6 -8 45 2 -144 -11 104 -13 43 61 -43 10 24 5 -37 25 -85 100 34 -178 36 -30 32 105 11 -71
4881 -71 54 44 -100 109 -11 -69 -38 6 -15 152 -32 54 65 -28 98 80 -32 3 45 75 17 76 68 119 4 13 -71
4908 -71 -63 62 -39 -17 30 -19 1 182 140 -109 -65 -22 27 120 -56 59 6 -5 -41 38 144 11 -12 135 24 -144
4934a44J63k19Q9Q1r7L0J07r8J15j09N8m1J30Lj99J05j9J1O2o2m9J46j3p7o4J03
4960A2P7j36P1L9O3r8l1M3n8Q3j70M5Jq8P9l3L28j21k13J39k5M7m4Q9j04J9o5
4987e1K34o8j67J85q8Jj1M0N6m0k1j41nL5N5R1j13L1q4O4j2Q6o9p9J6R9l7j35
5015a28j5J83q4L5J50j03n4q0J04j08Q5M0p2lL0j09J45m4Oj4L8K1j8J49k19K8
5041c7j13J10K4Q9o2Pj27J45k4J0J7Q0o7pM0k12N9J34r9P8j35j7M9p9J03p2Q1
5068b5J74q0j82K10j87O0K30k83K35k24M1M6K1L0j70J69mPj85Q2J00j34J76jj50
5093d4P0R0k25Q0J27n9k3j6L2q5j6J4k0J40l4j28J54n4L4j10j8J46P1j33jmQ4
5120G2j15P2j28M5Q9j89J12r3J78j4pr7Q1n7n8N8Q5Lo9o4J8J23q0J75j66%J43
$$ plain form
4934 -144 19 -200 -111 -30 -127 -97 10 -88 27 -82 -24 -65 65 68 -131 -26 -45 -34 28 -34 -83 63 50 -27 -91 12
4960 12 89 -47 24 63 126 28 -3 40 -18 65 -105 -60 -59 -147 -68 -101 227 106 -107 32 7 54 10 99 -5 14 -51
4987 -51 183 115 -52 133 45 46 35 75 131 91 70 -71 -76 -41 14 105 -8 23 -61 3 -9 77 8 -71 -55 44 7 -128
5015 -128 -143 40 -44 -9 141 38 -16 -96 8 -100 -15 25 -47 -50 -20 -129 16 -28 -22 -36 2 23 5 154 -65 -37
5041 -37 -150 -40 -16 73 11 18 -109 36 12 22 39 119 52 45 85 -127 -68 66 -33 45 -90 -107 -58 -137 -34 -106 -25
5068 -25 149 69 -113 97 -90 -30 200 -83 152 -72 -31 15 36 66 -104 65 61 68 -117 -35 65 -69 107 106 -44
5093 -44 26 116 -109 -29 98 39 16 0 32 -53 -69 -55 -75 65 31 -97 57 3 37 -73 -91 55 126 -7 -8 -12 72
5120 72 -43 29 -99 -54 35 -154 -42 -135 43 29 22 -75 6 -51 -109 -51 34 37 -32 -96 -78 45 -35 140 -26 -26 117
5147A17j16kJ4lk2j03J17J11r5o0K9M2p8J0R4k8N4n5l6n6R7p4J29N5r6L8j32J73
5175A24k31K5J9k7k9J46k7j39J14qO6j07J4J67k1p3M8o8m8N1k3l1J0o3qJ21K7
5202B9r5RP4pj48Q7o9J89k9j2k14J26J37p6j0Q5k3Rj50J25j03L7N7j17P5nJ25
5229A06j14p2Q2j17J02J9J3m5l9K18q5r9R7j36J00j35Q4l9J51l7r2l1N1oQ5k3
5255C8K5r2P8j53J84j19M8O6p3r5P1O8j52J10r5L5K10j67mJ89k16p7J74m1l4J02
5281H0j74K8J05j29R3j8lj07J36M9RL9o4p0q6Q2q0J5M8k2J40p7o9O8q6KJ06N8
5309G3k0j20R3r5l4J31j10J30p2j1J04j04N0k8p4l3J00K7N6q6N8j57J41nj49J11
5335b4o9J55k19O3pq0J40q7K78j82j1N3j3m6q5J70m7kk1N3K0L5n8N4k3J4j09P8
$$ plain form
5147 117 1 -1 13 10 -12 -115 2 113 18 -42 -13 29 -49 -39 55 27 81 26 -10 -66 31 -43 86 141 45 83 -49 124
5175 124 -107 -82 -63 -90 -119 27 0 -139 -25 -33 33 -74 -60 107 86 13 61 -7 -55 -4 -27 -58 -48 -111 -119 2 29
5202 29 -66 -57 17 10 -138 -51 -120 69 40 28 -186 -60 77 1 -9 76 53 62 -88 37 -66 -29 28 -89 -14 -19 106
5229 106 -8 -80 2 -115 -13 6 19 -26 -65 153 68 -31 66 -70 30 -105 -21 -60 91 54 -38 -69 -18 -24 61 38
5255 38 63 -29 49 -104 80 -39 9 75 2 -93 -22 46 -106 4 -91 -56 154 -13 -17 172 -44 -121 53 12 -22 80
5281 80 -94 -66 39 -90 3 -15 -18 -125 11 60 69 108 44 -26 -112 -30 -110 -95 -47 -69 71 -6 -75 -7 -93 -91 15 73
5309 73 53 -67 26 -69 -103 28 -82 48 -24 -35 69 -35 15 -13 -87 -120 -20 7 63 -23 35 -122 19 14 -135 -24
5335 -24 -93 62 -157 -94 -101 -181 -41 -128 150 -32 -43 10 -3 -49 -134 36 -11 -13 -34 19 39 74 16 70 47 61 -48 30
5363C0jl5qP6J6r4k6P7k3O%q8J20m6j6lJ1l4M9Q4r6J3l3j46L01k70K06j24L2K8
5393Fj01J31r1oQj08K17m6L1l4m8L2k5P7j40j15J14N0k1N4k2Q0q7qK2M1L2J89
5421B32k38l1N9P0K1j78M3J30r5k7P6P4j67r7J74p9J09j18N6r6l9M4M5Q0J6M2
5447A06j68l2J65o9M0k5k3J01k07J56J9Rj41J4M8r7J01j6j0R7k1m6r9J17m8J11
5473H2j83J33N3l8N4o2l5o5K8L8o7o4J68K0k15J7J41J5m2K57k09por1R6lQ7j54
5501e2j35K19k5Q2k7l2N9j02J1mMO3j01J8j0Q8pQJ0n8J4%j47J20j7k3J84j55O5
5530E0O6j16o8J49j57j1K3J88r3p7L4KJ21m8N4n6j79K28r7NnJ1j01NR4k9J5K40
5558B48l18p8Q0N1N4j51J05o6J00L3M0j45l8R0O5j10m4L3J7l7K3J2LJ15qm9%n5
$$ plain form
5363 30 29 -6 -14 62 78 -16 -42 35 12 18 18 -70 50 4 -12 -15 -4 -38 11 95 -1 12 -21 -167 134 -136 70 -54 -22 6
5393 6 -95 36 -55 -61 -53 -161 56 10 41 7 -41 -9 -34 43 -97 -212 -98 -48 -69 -15 -37 43 -44 -52 -30 11 43 232
5421 232 -6 -37 22 92 113 -65 -22 108 13 -14 62 136 -31 -128 46 -33 76 -42 14 -82 -121 -77 -32 48 64 106
5447 106 -62 -94 71 2 42 17 -6 95 -112 44 63 72 -69 -55 -7 -104 -3 -19 -29 68 47 1 -98 19 -29 82
5473 82 -101 32 85 47 101 39 4 -61 -33 5 -62 -126 42 62 -153 -136 5 20 -22 235 26 19 13 -78 18 15 102 -52
5501 -52 -187 32 7 89 62 30 89 -13 -2 -6 -2 61 -40 -22 -32 56 49 57 67 9 23 23 -124 -4 -21 -44 140 -15 50
5530 50 116 0 -68 81 -76 -87 -64 124 31 -46 -12 -10 111 63 117 61 -118 110 13 18 13 24 -77 -72 22 -7 8 248
5558 248 -70 -148 -68 -17 37 -114 -9 -75 25 58 98 -47 -85 5 70 -40 -84 -51 -34 -71 -48 -36 -33 82 74 25 25 -30
5586c0LM8l3j05M9Q7k0M4L2J0j43k9M2L3k7k0N1No8pQ6M9j2J9j11l3J06M7j08
5615c5j3K02l8k10K23l4n1J2L7n9r3q2J38rp2P1J07o7k3Q5q8r8J75o2N0j54N7
5642c1J3M8j26R3J1l4J06j57J02j5R4o8p4J4J87k84Q7r5J19q3Q2or1J62m5m5J19
5669H3k75J70J27q9j00J83o2L7M6j03np3J64j63M7K0J45j08o4J41q9j03K4OMl3
5695g0J01p3jR0p0Q5j32J11o5J07o5l9R1j32L2O7J04j82P8N7j12n9k3J51j84l
5721a36J99L7p3Nn5L5j6k7PJ60k22l4K05j50J2L5Mq0R8n8p2P4P1p8O1m4R8q4n5
5750h3L0K71j79r9KJ8J46j05N1j36O7j06O3J12Ll5P7N0P8k27OJ77j19M6j71o0
5776a23J05j24K00j21l9J51l7O5k55LJ35L7J30p7LJ8oMj7j41kL7J8N2M0p5KqJ37
$$ plain form
5586 -30 -27 21 -12 -117 -68 19 -1 43 75 85 -58 -87 -45 -12 -39 -59 -8 -3 -71 -78 8 57 45 64 -47 -80 26 73 -35
5615 -35 -48 154 116 -94 129 95 44 56 93 34 -59 -141 -3 -12 -84 -13 94 27 4 89 1 -97 78 16 66 -88 -31
5642 -31 -18 30 -96 -3 8 -26 80 -77 25 10 104 36 -38 -24 163 -121 -34 -129 -10 -93 -11 -17 -108 54 9 -36 83
5669 83 -192 -22 105 16 -84 99 37 74 120 17 12 -61 103 -60 -13 7 152 44 -20 121 32 -71 -47 -41 -37 -70
5695 -70 31 -42 -43 47 -23 62 -70 41 -24 83 18 -21 70 -62 -30 37 141 -41 37 94 -18 -77 -100 51 -133 -136
5721 -136 63 100 27 32 -23 12 -4 -31 -24 136 -86 -120 85 -65 -53 -18 -14 -94 4 -54 -126 -52 19 -59 2 -42 56 -28 -83
5750 -83 -53 218 39 -60 -58 -40 106 1 52 -84 -17 -123 -60 52 55 20 97 147 225 -2 4 181 62 108 -63 -123
5776 -123 -18 -142 58 -63 -102 49 12 77 -178 -175 -40 -3 127 50 53 71 65 69 52 -89 -91 -54 -36 16 56 -19 -17 -25 112
5805A12j50M2j37l7K12r8K9O3j27Q3l6J62j18j15J62l8M8n4j4M6m3O4j26P2r2
5830i0J51p2jm7l6Q5k4N0r9R7m1N4j45M2N1j37O4K05q0k8Jr2L9O8q4K2J11j62
5858i8J49p6M7m1m0l6lJ14o1Q3O8k33J08Q6m5j07J76J24k41J01j65Q0mN9m4J14
5884A15j09J0L9j05Q1o7J35l9k5Rq2O7j32J8J98j27k8k9N8j32K00p4l4L3m6rM2
5911c3p1J01J02n8J5n7J32j91J48j51l9L1K19j13p1j6L9J24j96O3J0j1K4L0p8
5936d7J58o5j08J35p9l4j7J38r8Qp3MJ96k29J37l3J1n3J70q1k6o3N3n3k9Q1j8
5963a5K2m6Q8k3l6J98j17q4O7p9Q9K0k9k8j33J22l8o5N9J13j2r1Q0k4Ro9Q0RQ
5992G5j04N2o6J38j82mJ27P6l2k03J92j40N7R7j12J03Ro6k5K00l24O6J66q6P1
$$ plain form
5805 112 -38 4 -133 -170 42 -56 -27 36 -91 -8 -44 118 0 -115 47 9 57 3 -11 35 -8 56 -70 2 -90
5830 -90 61 -11 -12 -59 -95 -10 -34 16 -83 14 -27 27 -118 -76 -25 -162 -98 107 27 -1 0 -92 -53 15 -69 -47 64 -98
5858 -98 51 -25 22 -19 -59 -95 -98 16 -45 38 106 -127 -19 67 22 -85 91 215 -26 75 -90 -10 -14 45 1 115
5884 115 6 16 55 -50 31 -36 99 60 35 44 -38 29 -103 -85 113 -14 -42 -71 -13 -145 55 -19 -53 -20 -66 -75 -33
5911 -33 -104 -3 99 41 56 -1 131 -60 88 -63 -102 -71 148 35 -36 -52 -13 111 -85 -22 -12 -23 1 31 -47
5936 -47 111 46 -62 73 -6 -40 -57 81 -17 -9 -82 -78 118 -111 26 -7 4 -49 121 40 14 -49 4 -49 -78 3 -15
5963 -15 7 -39 49 26 -10 188 71 -13 54 -25 64 84 55 27 -106 16 -22 -87 -28 85 73 -18 62 38 47 -22 58 67 75
5992 75 -29 23 -43 95 -87 -91 36 112 80 -123 69 -71 -14 83 -29 74 83 17 -8 192 -132 -66 100 14 85
6017H5p0M1o3J17k20K04n6j38J54p2j9Q6m3L8L7j62j10J25J82j37j29J41m8J31
6041G4n3r2Q3k1j7Pj7RQ8k9O6p7j20L9J14j38L0OR2R7j30k3j09J44O0J3k46J96
6069D6J3j5K2r9K6q4J06j23O2M2J08j52J6%On5nN6O8j9J8l0k9J10j72R0m0Q9k9
6098B6j51K0K55j26j83J39Q0l8P8l5q1Q4j07P1j0p1J33j02m8K9K2J3j00J25p2
6123d9n1q3J39O7J9lj4K2n7P4L3K2j55N0J31j52m2P1m6R1j74M0J2J96k6j65r5
6150a45R4P3L8r2r3K5K57j93Q2n9O2m9k0jM9R1k02M4ok0K16j59M3q9J16j9M0o6
6178A7j25L8l7J20j58K06q4q0J18p9J05N8p9J3N4k59Q9J18j84J53J6O0K6j54K36
6203A88j62o1M7p4J39j34N9n9P9p7Q7qJ7m9R9j24P8Q2j18q2O5J00q3j7J23j0k98
$$ plain form
6017 85 15 56 -7 110 -110 94 38 -100 54 -18 -37 49 6 44 81 -81 -191 -66 116 -21 -150 -9 -57 74
6041 74 21 -71 12 -9 -26 -19 -36 -27 61 32 98 21 -99 -60 54 -84 -54 -48 44 141 11 -12 -121 23 83 96 -150 46
6069 46 59 44 66 -33 -7 -91 15 -108 -46 -4 104 -48 -32 -32 -26 -81 -86 -30 38 19 37 7 -22 88 -84 6 -34 55 26
6098 26 -125 -105 150 24 -159 -20 60 22 100 65 -16 68 -39 32 22 -49 84 -18 -66 -37 -15 -2 -102 23 -49
6123 -49 -100 -183 -44 23 42 39 25 47 -10 64 97 119 -36 14 145 -7 -49 22 -24 67 -107 -67 -55 141 115 -50 -145
6150 -145 -51 22 60 -32 -125 -100 157 -36 46 -13 49 0 -20 -21 28 119 -83 -39 -45 -65 151 -8 35 -54 62 43 83 17
6178 17 -108 -70 -107 13 -145 61 -23 -103 15 -64 41 99 20 33 87 -172 -83 35 -149 4 20 80 106 -48 188
6203 188 26 -35 12 -62 77 -57 2 -57 22 -55 32 24 41 -8 91 -33 45 127 9 -73 -8 92 9 -8 115 105 -193
6230a93K33j02O8j0n5jJ1J01j40R0O3k5l4m1J7r2J83j38O1P1j02m3K2J29j15j21
6256a63J33Kj0L1J0K5qn6P1k03J72oO2Q4j42j0pR8j14J03r5J0k8K7J24j16l3N3
6284A4l1n0M6J9k2N9J6o5m0O8j25P3O2k1l9o0K82j41J10j97k9J30L9J2r5J5J7
6311D7q1J5P3O6j10N5J0O5j41r8J74n1r6K34k66K23j06r1R4J14j76J69n3q8K1
6336CLR5j63P3k1j2P4pOK7k4Q4n1j30k6J01mJ1J2L2j65Q9n8K8j8N1j15K45j17
6365B3Pn8j7m9J40kj00K8l2R2j00N6j5N4p2l9O6oJ7L1J30n5k34K38j06Lm1L3n0
6394e8J23j7r4N7L0j93J38q8l0J24q3O1P1j46N7pJ76j66K0K9m8J6J76j12l7j13
6420a14K10j60j18K23L9m1k3K0j37R7K6j3k3p9J64jn3k0J7j6r0K43m0p2m5Q5J43
$$ plain form
6230 -193 40 -62 6 -4 -59 -60 -49 52 -88 2 65 40 6 -35 -18 -110 73 -65 -4 67 -35 -78 -56 73 -42 -163
6256 -163 -30 -28 -38 -7 3 28 20 -36 35 -168 4 -2 60 144 2 -8 -15 83 -31 72 -23 -13 -41 -14 110 -6 -39 14
6284 14 -17 -67 -21 -2 -24 35 51 -14 -54 14 -111 -38 24 3 -36 -96 186 45 155 -42 -71 59 98 110 15 30 47
6311 47 -34 -19 54 120 10 65 75 140 -1 -99 75 24 -72 162 -104 119 13 -78 16 130 -46 123 70 -18 3
6336 3 6 101 -62 11 -10 -22 52 45 51 78 54 138 87 -43 -69 32 28 39 51 83 -82 7 -51 -23 -41 10 -105 140 23
6365 23 30 -28 -45 -94 46 44 -56 -28 -60 32 -68 -12 -27 27 -45 -84 -18 -24 -7 24 154 99 -135 103 -3 0 -41 -8 -58
6394 -58 65 48 -46 11 41 -152 -14 -102 -132 -8 -91 -30 41 -105 -48 -55 121 -45 -25 4 -44 -28 148 36 -1 -114
6420 -114 96 -64 -182 41 80 39 16 36 -101 -4 22 9 -14 -93 71 70 17 -3 14 -2 -92 151 111 39 -6 79 222
6447B22k81J53k33J82J2j0p5k6M6k7q7J83j00o8K3k8J74o0q4K03j54k7R9P0k33
6472a26J34Nj07J07o0m6J24P9j63N0Q9%P8k30R9%J07k66K55q2rJ1J24k11j1rM9
6499im2j4J67j16R1k7nm5J8n5P3o6k2K3J45o7J3j04O4K7k6n4lL0o9M5L4M3l0K
6529B1k9M9n6J0n1P5q6M0J04j69Q2R3k1j62M6j30J98j4j5q7J77l3J1j66LQ8l9
6556f1KJ65o4l6J8j17K3m8J35l0O1j74K19n4r7q8R9M0P8r3M4O2q6M0m3J24q7P5
6584A07j30l4J85j18Jp2J32N4j68M2J04j63N8r4J56j63J65k5k04J95k4l2N4m9
6608b3O9j17J58j46j8Q1Rp6P4J22r7j54J70J03j87J1M7j18J16j00J5l6M4JQ0M9
6634G7J9j89J24K1j3n0l6K2Qp6R3K26k24M4r7J91p4n5j35R9J59j89L6l1n9PK71
$$ plain form
6447 222 -59 94 -139 43 55 45 -30 -56 -10 -37 -124 59 -41 -109 -86 -114 60 0 -84 119 -35 -62 37 107 -126
6472 -126 8 13 -94 13 -47 -93 31 110 -53 -3 86 86 164 -66 33 33 140 -126 129 47 38 49 173 -38 -49 -58 -9
6499 -9 -51 -65 102 -14 77 50 45 0 18 -37 36 -30 -52 -29 116 49 62 -42 22 49 23 -31 -34 -4 -73 -28 6 49 19 21
6529 21 -8 41 -15 -5 -56 19 -67 -27 77 -92 -10 83 62 -100 -54 -184 14 0 -15 -102 75 42 53 -113 -110 -22 -61
6556 -61 -59 106 42 6 24 -93 -70 -118 17 -13 48 -126 93 39 -58 -146 -47 -7 71 -22 22 84 -2 38 -5 119 32 107
6584 107 -23 -57 128 10 11 -61 71 125 -43 -1 103 -60 -2 -96 60 -103 62 37 -167 28 4 -28 26 -23
6608 -23 46 -71 87 -59 -77 4 13 -63 11 133 36 -118 52 155 -32 -21 26 -92 24 -76 -61 -97 -53 -52 28 77
6634 77 96 -93 31 52 39 -11 -47 -25 -17 -93 0 226 2 46 -51 140 66 11 -124 -25 134 -55 -19 -50 -109 -102 169
6661A69j62j7O9l6Jm6N1M9o0pj25K9k5J89j44J00j9n1nk8J38l2o8JO6m0N8N8k09
6690i6Q6K4J4j16l5J83p6l4M7K1J2o3J08j28J17Q7r8L6M2k61M9K9J29k4r9K8J16
6717I8q4j10J11m0j3L6p6L8Q2n0j63M4J26k5n6O3K1JJ33j70J96k45K89j21j43
6742e8J30m8r7J50r4J00j12J17k06K19r3J6l2J6K3J7o6k3M6J09j70J49j18q8J38
6767B5j8Jj8M4r1J4KL8M4k6j14J63j2j6q4J04Q4j96J8L8M0O4j40j0j6O9J05m7
6795F5ko1O3r9M0j13K37m5l6M9p7p1P7k1j33J33l2JR7%k16J44Qo7n4P3K3N9N4
6824I6r0J3r1N0J7N8j07P8m5n0J51l7j32N4J5J2J08r5O5j11k9K0J2N3m5J21J5
6851A06j90j01K07l9J5N1r7Q2L2q0JN3m3Mo3J52o5oP8p0O5j53J09N8k54K12j13
$$ plain form
6661 169 7 -10 59 23 24 -22 29 78 18 11 -114 -85 -110 79 -65 35 16 -35 -40 -68 70 38 -30 -29 37 -3 55 113 -96
6690 -96 -10 14 28 -88 -123 60 -16 -50 -3 18 30 -33 75 -53 64 151 53 89 131 -130 -81 -52 77 53 -46 -18 98
6717 98 14 -96 15 -25 -38 -2 -78 -40 42 -8 -171 -127 -1 -26 -82 -19 2 3 136 -34 162 -83 206 85 -58
6742 -58 72 24 -73 77 -17 83 -29 88 -118 101 8 24 -8 8 31 48 -18 -41 5 114 -56 93 -25 -113 25
6767 25 7 8 -10 34 -57 -43 -41 -3 41 15 -99 64 52 36 -48 56 140 -56 -38 0 40 104 -36 -46 -62 7 112 65
6795 65 63 2 65 -34 6 -107 130 85 49 98 21 -50 27 6 -127 6 -26 -25 72 72 -144 0 8 -59 -113 -40 -17 42 96
6824 96 6 19 -72 -22 -5 53 -54 24 -21 -71 80 43 -89 -35 -20 -8 100 5 70 -41 -70 -50 -38 15 -30 91 106
6851 106 -84 -185 22 -17 -2 49 -48 34 66 -14 -13 40 -3 1 -62 90 25 19 97 27 92 -61 48 106 -148 64 -49
6878d9%J84o3j19J17k0j18MjJ68j39jo2J00J6J6Q4j24M9j99K34n6o0lJ48j88M7
6905c5O9l7j1q8J57j18J62j82P9J21k46J52O2q5K2j7L8RK1q6j7J28J7j48l7Q4
6931A4j00r0J13P5j14m7M5R8n5Q9p7J59l3Pl5j19N5Q3o3r5J00j05Qj2Q4J09q7
6958GM6p0K1P4q9Q9k9j45N9O0O5j01P9k03J58J19k20N3N2Qj04J81j89J73j67P9
6984FJ3P6Mk83J11P9L7k1N6q5k0J0o4J26l3Q6j50L0K1m0L1o5J93J3j20l6J48j65
7012d2J08m1k6m4J16n9N1j23J73j0r6M4q0J0R8j24k2J7K7PN2j35J1J95l2j53P3
7039eJ44o5k8j70K08j10Q5j61J35qL1pj7q9NM9Q1j34m0J57k39K05M6n3R4l7l2
7066D5Jq7m2l7K23j31l3K7J0K23j58J03j44j5J20j01Qm1q6O2q9J33K5J38j26K8
$$ plain form
6878 -49 -49 135 72 -47 70 50 -68 -64 -65 103 -36 -37 -99 1 17 33 117 -7 42 -157 77 21 -39 -42 106 -82 -35
6905 -35 34 -3 -14 -102 55 -63 99 -83 -4 117 -129 23 85 0 22 5 43 52 73 -13 -30 98 115 -33 -70 14
6931 14 -86 -176 -63 12 -102 -149 -104 -6 -61 28 -49 110 77 84 49 -70 -15 68 5 -90 10 -95 -87 -99 -15 94 7
6958 7 53 -17 4 78 -11 78 49 -96 -37 23 88 -13 66 -137 21 140 -80 -27 25 33 -71 110 -79 94 -73 6
6984 6 19 95 99 -184 -73 6 43 22 78 -7 -27 -17 -81 45 12 98 -52 -22 -1 -41 -10 -75 118 131 11 -25 123 -42
7012 -42 66 25 -1 -45 71 12 63 -60 113 103 7 51 -29 -19 79 -45 -67 -50 -23 -16 36 -99 -88 107 75 -78 -5
7039 -5 139 74 46 -124 84 -26 59 -102 33 25 56 49 32 -57 -52 -3 78 -56 -96 61 -178 27 73 20 114 77 45
7066 45 46 -41 -83 -120 103 -28 -61 -34 -24 199 41 144 0 -15 105 4 12 -29 -115 -53 -142 -9 16 154 28 56
7092E6j32M6j00J10nl8J29j61J25j00R0j07O7K1J54j34K6L0jj30J42m8j37J07
7116A0l7k4Q8l2Nn9J26L0j42l1n1J4K17k51J73orn2K0J01j1j34P8k0k4Q1l7M6
7144F9q1R4n5L4N2Ql7l2Mj58J70r8Oj17M7K03q0n7J7kQ9P6k20n8J41p5J28j90
7172a22J35J28j04l0m8M6k2N4m0J38j3m8o1N7k26J38O2q0QL2q8J55q4j2M7Moq9
7200f9J49j22O5m9j01P0L3j0QJ20j96J22o0J12p3nM4j7o9MlJ4J07j34m1P4K1M8
7228D2n1J36j40%k4J41J7j13J27k30J26P7j62J54n1J6P1l1j89L4j8J04k4J4Rj00
7254f5P3M3n7j50J69o7R5q5O1O1m2n6O0q0J35%k50j6K22o8l1JQ3R0j55rM9J9K8
7283E8j8l3m9O2p4M1O3Kk2q4R0O9m3j0k25N1Q5M1K1Qj70J83k23J55kj4mJ24j04
$$ plain form
7092 56 -76 -30 -130 -20 -25 -63 66 -95 30 -70 20 -87 -20 1 155 21 47 77 76 -54 88 40 -97 10
7116 10 -27 -51 37 5 10 -49 77 107 -35 -66 -117 -103 114 -137 36 30 21 -31 -11 90 79 -55 23 3 -21 60 23 69
7144 69 -12 82 27 61 113 121 84 52 56 -102 68 -30 -24 -141 -94 109 29 -28 -11 -13 76 152 -68 -126 15 -60 68 -122
7172 -122 13 141 37 7 -41 5 -17 37 -3 135 122 74 13 70 -156 -18 44 -36 -28 4 -84 71 -13 -25 22 26 20 -69
7200 -69 80 -42 23 -26 -127 -57 -24 -34 -26 94 -102 20 -40 72 -1 -6 38 21 -48 -44 -47 -33 74 -60 -101 -27 -6 42
7228 42 -9 127 -13 -13 -37 104 121 8 135 -95 31 108 -54 100 49 65 136 105 -84 -50 -68 36 12 26 35 -65
7254 -65 8 51 -6 -156 13 -54 41 -44 17 78 36 -20 40 -40 95 95 -155 -171 51 -17 -48 -47 36 126 -29 -38 11 30 58
7283 58 40 7 -42 20 -54 -13 50 52 30 -54 36 105 62 52 -173 -122 -37 4 25 33 -137 46 -177 -22 -24 -38 -42 82 -22
7312b2r7L6O4J00r0K0l1J52j05Ql8lj6p0J39m0QJ5m7m0Q0M6j31O5O5o5ol2L5o0
7342f0L2j8J09k01J68j4rM0o8RN0o0N2Rk5J05j18L0n7j25K13j43nJ5qRJ69j23
7370b4L8J02n3J7l5j6N8k6rr2Kj3j04J92n5j9Om1o0l2J85o3L4R4k1j29J07rR7
7399A31j84J22r3j25R5n5Q0N1L6j2p7J21q6M4n2j2Q2r8M9l2Nj77K12J6P3j86P3
7426ApJ4PM2No0O4k4j27J71j13Nj07J16J00l5q2L7ok1J5K1l1o0J53j32J81r7o5
7455c5J52k55Q4K1R5l5q1J69j93J29n5P2q8jNjL2J17j59Q0pM0o2j16p4K00P6q3
7483B7q9M1j4M5O6j92J51L6j84J97q2n2Q0j44R9pJ25k04P1n6k0P1K3R1l1J6L8
7510A02r1NM6l3l1n9J04N9q4o5O4Om1n1R7O5j53M8N7j01k9K7j5O1l2P6o8Q2k19
$$ plain form
7312 -22 -119 -83 -19 81 -9 11 -20 132 27 35 -3 -6 -22 -92 47 7 15 30 -17 -57 23 69 -62 3 68 3 -3 -35 0 -60
7342 -60 -28 -46 63 -138 30 16 7 47 -21 -12 38 -22 30 39 14 119 1 31 -26 -151 62 -81 -86 -71 -79 -70 99 -24
7370 -24 14 116 63 80 45 29 87 61 52 -40 -38 -51 -155 37 -18 -37 -31 -72 -132 -164 21 -42 -8 86 65 -64 43 34 131
7399 131 -53 69 -24 -149 -54 -109 -29 22 58 46 -31 90 4 48 -4 -16 66 -32 17 -15 -10 -187 25 41 114 -72 1
7426 1 -6 8 15 57 62 2 66 42 -85 86 -27 -22 -129 -13 87 52 -30 7 1 -20 -5 16 -15 -75 78 -54 127 30 -35
7455 -35 117 -138 -54 -33 62 27 -54 115 -78 51 -4 68 -20 -21 -16 -17 15 132 -27 53 46 86 24 -92 -166 34 110 27
7483 27 -62 -21 -35 10 76 -116 35 71 -113 84 2 -50 30 -114 -15 -22 103 -101 -30 -86 -106 -35 -12 79 48 64 102
7510 102 11 16 62 29 -2 -61 43 102 18 -47 17 23 -18 -69 28 93 -60 -12 45 -56 -85 -58 -73 -12 -44 32 -36 46 -173
7539a73N4J5K6O7nJ45j75J53j74o1j5J14L7O5r5p1J33j02n6J71m9M1Ol6j24MK18
7566A13j48K6J33j69J7R4Lmn7l4L6J21k65J63n6O6M5j50P7L1k4j88J99j22oJ08
7592Ir0O6J13n4PK4L3p8M1m1ol1rO2ml8J07q8J3j05j4J81j69P5L9M4j83J38M8
7621I0j13J06j01J11j7k32J26L2j0J37j79J07j13j01O1KK3O9n3P4k6m5J35j52
7645f9O7L1M9j39M1J61j74j30J29R3j53L2J56j10MM6r8J07m0RK0M6n8M2q3r9J49
7672B9j02O9j21O6O3q7R5q1l1L2L4l5nR7m9N8q4O7R5j63J00q8J10l5j45P6Q4j26
7700g7M3l2J30rM1j33J09o2Qr0M0Q8n0j78L00O7k77O2LP4O8q0m0j01J07R2k66
7727a63J27n8k4K17k04P4MM3m3P1p0O2J2l3j4J24q7Q4j08O9j16QJ34j45R8k9m7
$$ plain form
7539 -173 -119 -104 -78 -11 -16 129 -46 107 -67 -128 -143 -29 8 73 -22 -93 40 -62 -118 53 4 45 51 15 -109 -105 113
7566 113 -35 -9 124 -45 -28 66 69 65 8 -26 10 131 -134 29 -27 39 84 -66 11 42 18 -170 29 -93 -99 9
7592 9 -81 -15 98 44 51 75 108 30 71 30 24 -7 -16 46 42 4 111 23 36 -69 -83 98 -71 4 43 87 -96 42 90
7621 90 -23 83 -18 93 76 -156 -30 2 -8 129 -50 57 -56 -157 -96 -94 -71 -2 -55 19 -7 -52 83 -69
7645 -69 -2 29 78 -61 -20 141 -33 -163 -34 59 -94 -62 94 -16 -12 34 -64 43 3 12 32 78 20 62 -21 -120 29
7672 29 -73 -4 -125 -59 4 -83 12 -69 -100 -68 -34 -69 -74 23 -26 32 -52 15 110 -53 47 -41 69 34 -111 -35 49 -77
7700 -77 -34 -66 64 55 96 -37 72 10 18 -72 -32 56 6 -172 128 195 -82 -20 -17 57 125 45 5 -96 11 103 -163
7727 -163 -36 -94 -118 99 -105 -31 -27 16 -27 44 -26 36 48 15 1 125 38 122 14 83 -33 -25 109 -36 62 33 -14
7754a4r0Q9Q4j04J32l1p0P0R0r9o6J14Lr4j8p8K83k19M4O1j24Q9k8J06k85J85
7780C0K5j38R8R7j84j3K6P1k8j2J70k6j30q0J8J29n2K9k1P7j00k4N5L7J1j52J75
7807H8j13M2Np0L1P4j27j05J21J34q6rQ8k5N6p8l8J8p0k8K1J60o9K2Kk8r4Q9Q5
7836I6m9N1j48Q6j34J67M3q7m9n6K6J63m1j23K06j21ROO1j97J36m8J7J39j88J37
7862A02j63N8J1Mj6O4r5j7k9N6O4Q3pk15J90l4n7J0J5pK1j99K83l1m3J10l3r7
7890B8m4J68p8j07J03j8K7m7N8k79K48n7l1Q5O3k21PJ61j54J28l5j14k3J22L0
7915B0O0k01J02q5J29r2m1K26j74M3n3R0r7M2K3j35J85m9N1m6l9kQ8O9q4m9R4
7942G5P3p9j14N2o0J0J9M3J3k9j43J34M2o5J7m6q1O1M3Q8k35J51J82k34J79k26
$$ plain form
7754 -14 -104 -15 69 -35 97 66 -4 66 156 57 -9 105 108 14 -4 -82 201 -18 26 87 -37 52 24 130 -155 30
7780 30 55 -83 15 112 -72 -85 -59 12 -16 -28 142 116 -14 -94 -76 53 1 30 9 86 -14 -38 17 54 65 -87 88
7807 88 -25 17 22 -48 -17 57 -70 -175 -54 80 -6 -15 73 48 104 26 -12 6 -64 -92 -71 89 20 42 44 16 -78 11 96
7836 96 47 98 -50 36 -98 69 112 25 -24 -80 -54 109 68 -55 151 30 39 45 106 -91 45 -3 14 153 -35 102
7862 102 -61 -3 8 12 -4 60 -35 -52 -81 -25 39 122 115 -100 90 56 -1 9 24 17 38 -161 122 91 48 158 125 28
7890 28 -16 152 74 -33 70 52 79 32 90 -189 59 2 -29 56 119 -102 -95 66 -88 40 5 -109 -132 -10 20
7915 20 80 -121 -19 -104 25 -67 -108 118 -56 -13 -66 24 -73 -31 -8 -143 42 -7 44 -2 -41 -43 45 114 30 -19 75
7942 75 148 69 -45 7 -53 -43 -24 19 32 3 -140 -6 36 -29 -12 -58 -139 -78 -35 53 -182 -31 151 -83 96 -130
7968a30P1R2k22J26K2j08P1J39o9%kL6n8M4j44J63j67J79m0JN0j7jo1O0j10O0
7995a5p7L2Q9o0J5Pm5Q2j16J12j12L8L4%L0p9M8M0n0NQ9o7o9N0J01j51L2l5j6
8024h8P9Q9r7N5p4J23K0m8n9P6m8oLm3N2k5o2J30q6l2ML6j33J53l5r3P0J06k5
8053D2k09K38o3n7M8O8l8o7m1J8O6J59k16P3J02j30K4j77J58J8m0R7Ql7K8l9m2
8080iM0K9r1lj0R5m6lPj09j9J62l9K7M1j38N0P9m3K9j17P9j29O9K2o5K19j11m
8109A2o3O1j27J87Ml07K52m7O0k9k1J03j34Q7O6Ko8L5L2m0l0o8QN2M6r4J85j03
8137F1j52J19j01J19p5J82j09l3K3q8r1J92j91K29j47P5j6K1k6l1K9K4o6q5J20
8162a7j58J12O3j9J2q8N2N6L1O7n0M8k00L3N8M4m4k2k63L18k3q3k0Q8M6q2L6r2
$$ plain form
7968 -130 -59 33 -189 -63 -41 -149 -78 61 -8 -8 -10 26 -32 12 -132 31 -136 43 3 4 54 37 36 -25 35 -75 -15
7995 -15 -92 -60 29 -31 -16 -9 -54 28 -88 24 -88 -50 -16 -16 14 -65 -17 23 -27 -22 67 0 -69 -19 82 -69 -37 -72 -88
8024 -88 -9 80 -17 38 -36 87 107 59 0 76 28 22 25 -18 34 9 -53 77 -9 -41 -37 -1 -134 19 -16 -109 -39 67 42
8053 42 -167 71 8 -49 -1 67 29 -38 -79 -61 5 164 -52 21 123 -7 17 -160 -2 16 -24 73 81 44 72 33 -9
8080 -9 31 60 -31 -34 -44 51 5 2 9 -100 -119 43 4 31 72 -66 -16 63 20 49 -68 11 -118 -49 -27 -92 127 16 12
8109 12 -51 10 -117 70 74 -233 19 -28 32 3 -18 85 -49 38 104 106 38 73 105 65 35 -33 -25 27 73 -21 164 61
8137 61 -91 28 -73 46 -29 153 44 11 34 -54 -145 47 -144 85 -62 13 -3 18 -8 -39 -10 14 -52 -137 -17
8162 -17 -175 -63 0 -19 -7 -95 -43 13 44 111 61 109 -91 -58 0 44 0 -22 -285 33 10 -73 -93 -5 41 -41 -5 -97
8190i7J20
$$ plain form
8190 -97 23
8191B3
$$ Imaginary data points
##PAGE= N=2
##DATA TABLE= (X++(I..I)), XYDATA
0@%%%%%%%%%%%%%%%%%%%jRj6J6j6J6j6K1k9L2l2M0m8M9n7O4p2Q2r0J03j16J27
41F6j40J56j73J92k10K31k56K83l13L46l81M18m61N09n64O26o97P81q80J002j150
62f15J336j584J923k420L222m719Q412l3344m5743R4683L0327o7355k0181N3338
76A7280L460l5775J818K3465O15n01r707k3736J1010M4491p539n3006J540M9489
90B2904p519m0802J6167L2908k2414k9211J6274K2022n757o726m140j1468P688
103a0074K3072o213k0342O472J2518r420n080J5448M700j0947m032j507J536J8434
117A4565O507k6313j2373K5741J3021k3487n423K4811m552k8420P699K7014n281
130A3509j8870J818L342n234J0442Q869j7936q047J7211j370j5945J3142J8258
$$ plain form
0 0 0 0 0 0 0 0 0 0 0 0 0 0 0 0 0 0 0 0 0 -1 8 -8 8 -8 8 -8 13 -16 16 -16 24 -24 25 -32 32 -40 42 -48 55 -61 66
41 66 -74 82 -91 101 -109 122 -134 149 -164 182 -199 219 -242 267 -297 329 -368 413 -467 535 -615
62 -615 721 -863 1060 -1360 1862 -2857 5555 -27789 -73532 21151 51478 -15877 -36058 17280
76 17280 20740 -15035 -13217 10248 10863 10362 655 -23081 -12071 32420 24881 -28125 -26585 22904
90 22904 15385 -25417 -9250 23658 1244 -27967 -11693 10329 4572 -2154 -6294 -17762 -10074
103 -10074 12998 6785 -13557 -7085 5433 -3987 -9067 6381 11081 134 -3898 -5405 -3869 14565
117 14565 21072 -5241 -17614 8127 21148 -2339 -7762 17049 12497 -15923 -8224 18790 13509
130 13509 -5361 -3543 -201 -5435 5007 13876 -4060 -12107 5104 3734 -12211 931 19189
143A9189k1603k1156K3660J7403k0509n699J8581o177k0078J3130K2726j2683
155F784j9243R634R191p879M00R262m318r709J613M246J45O089P63j6777m471
170a4270J9148M815j5721j560J1853n986j2609J0521J4240q272j2407J025O617
183b606M106R45l100m322J177K797k032K781Q304n301j2741L759J3701n36q914
198a982K545L336q362rJ2540J233j0894k798M951j6L45N753k617q858J538N312
214B017j142J333L746n923q570N690J0559l184o745K618K69n125L580Q789j969
229E943r143k44N195r69J087N060l826q237J667P308J609l161j066k626k499M321
245D19L290k123p03n66n195j482Q633N619r018p927N535N068k872p40L412j154
$$ plain form
143 19189 -2414 -23570 90 17493 -3016 -8715 9866 3689 -16389 -3259 19467 6784
155 6784 -12459 -2825 6366 -1513 -1113 8149 3831 -5878 -4265 -19 126 6215 6978 -9799 -14270
170 -14270 4878 9693 -6028 -7588 4265 -1721 -14330 -3809 10431 2159 -10248 -9223 -2606
183 -2606 1500 2445 -655 -4977 -3800 -1003 -3035 -254 8050 2749 -9992 -6233 7468 6932 -1982
198 -1982 563 3899 -4463 -4472 8068 9301 -1593 -4391 560 544 889 6642 4025 -4833 -3295 2017
214 2017 875 2208 5954 31 -8539 -2849 7710 4526 -2219 399 668 -4457 -877 7912 5943
229 5943 -3200 -3444 1751 782 1869 6929 3103 -5134 -3467 3841 5450 2289 1223 -1403 -3902 419
245 419 3709 1586 883 317 -4878 -6360 2273 7892 -1126 -9053 -3518 1550 -1322 -2062 1350 196
261A96o101p82O208M074j173n192m650L290P425j09n084k42K623l192k474P805
277B622M789p684o066L348M713Q48l30j143l694j137L766K182j68M6k937l565
293d410J634N579K140m113k886M74l59K497M201j232n341j211L386J633k8K415
309D379j431o000p3N797K723k011k674j652n58K416L552p76k796j173j512L40
325a449M063K878l537n784L16M313P94j74K46k690l060P40M327K185k558k357
341a747j666m43L916L018k105l065j116O37J426K623J369l615l693J576K590J511
357A216R19j743l133j609K988L813o33k601j416q14R49K586K034j468l439j120
373c471J572K307K343q32m231j167K040K782Q19m41j230k863k82L920K374r54
$$ plain form
261 196 -5905 -6687 -479 3595 2422 -2770 -7420 -4130 3295 3186 -1898 -2140 483 -2709 -5183 2622
277 2622 7411 -273 -6339 -2991 1722 2570 2240 1097 -2597 -3734 32 2214 2046 2092 -845 -4410
293 -4410 -2776 2803 4943 830 -2056 -1582 -1941 556 4757 3525 -1816 -3027 359 1992 1964 4379
309 4379 2948 -3052 -3125 2672 5395 3384 710 -942 -1500 916 4468 3692 896 -277 -1789 -1449
325 -1449 2614 5492 1955 -3829 -3513 800 1594 1420 1666 -1024 -4084 -3344 983 3168 610 -1747
341 -1747 -3413 -3856 60 3078 973 -2092 -3208 -2571 -1145 1478 2847 -768 -4461 -2885 -295 1216
357 1216 2135 392 -2741 -4350 -1362 2451 1818 -783 -2199 -3013 -2064 522 2556 1088 -2351 -3471
373 -3471 -1899 408 2751 1919 -2312 -3479 -1439 1343 2162 1721 491 -2372 -2654 1266 3640 2686
389B686k185j990j91K283K745P17l002k785P08J840K092M31j430k284j548J468
405d45K878J085j080l073k241K048L699N01k529k095J23J04R94K506J10k789k681
422b885O3L493K742j484l254j678J379K182N40K60o36k591j377J558L308J200
438B820k911k931j51J954K536K82k070j829l90Q13J615J658j09l241k183J898
454b239K833R33o18k125j583lK624K692j115k668j043Q17J581J360P04j100l033
471a983m91K494K276M78j518k632r29K380L222m52k825p36P45l58Q84K011Q54
488C420l168l559J658M663J157k860k897M77J506Q48O50l02p68q69j737N70L707
505B496J986l405n302J184N960Q51m294j328K443N0l141J257M761p45n191j931
$$ plain form
389 2686 501 -1489 -1680 603 3348 4065 1063 -1722 -1014 826 2918 3349 1919 -365 -1913 -445
405 -445 2433 3518 2438 -635 -2876 -828 2871 3372 843 -1252 -1129 -1025 -31 2475 2585 -204 -2885
422 -2885 -2822 671 3413 1929 -1325 -3003 -1624 558 1098 1358 722 -1869 -3246 -1688 1620 2820
438 2820 -91 -3022 -3173 -1219 1317 1599 -471 -2300 -2690 -1877 -262 1396 1287 -1954 -4137 -2239
454 -2239 594 1527 909 -1216 -2799 -2802 -178 2514 1399 -1269 -2312 -1495 86 1446 2150 1050 -1983
471 -1983 -2474 20 2296 2774 1256 -1376 -2305 75 3297 2845 20 -716 29 -329 555 2566 3420
488 3420 252 -3307 -1649 3014 4171 1311 -1586 -1109 397 1245 1895 1593 825 -44 -1781 -1211 2496
505 2496 4482 1077 -4225 -3041 2919 3770 -524 -1852 591 641 -2500 -1243 3518 2773 -2418 -4349
521d349K962L816K88l192k733O13K977M36k240Q52K069k846l690K581O503q16
537C231p222j279N215J969k231p78J546j258k205J649K659L09r68k189j723J896
553a379M046O13m271k077K728J455j229N44J841j567l627R25M621L41k424r56
569d16k08o36J593L133q30m168m18K916O64j036R45O23k655k268K890L649j281
586B497k509q55M6Q04K273R28k906k600K109J702j554L88K214j603m165N20N047
603B336J470m106k153J211J143N55M14l31j367r48P54m0Q02K422r60m819q55N421
621I49L137m641l300L146J637k495m58L463J012m495k398L379L208j81k445j857
637b339J36K072J650j098j511J231o1k685R74M597L43n160k210M238K743k221
$$ plain form
521 -4349 -1387 2429 2717 -475 -3208 -2595 382 818 -1422 -570 1499 -1347 -5037 -2456 4047 3231
537 3231 -3991 -5270 -55 1914 -317 -1095 451 -807 -3012 -1363 1296 1605 637 -1552 -3275 -1379
553 -1379 2667 3280 -991 -3068 -340 1115 -114 430 2271 704 -2923 -1998 2623 2964 540 -416
569 -416 -624 -1260 333 3466 2636 -1532 -1950 966 1630 594 1539 2162 -493 -2761 129 3778 2497
586 2497 -12 -867 -821 -17 2256 3184 278 -2322 -213 1489 -65 323 2537 934 -3231 -2711 2336
603 2336 3806 -300 -2453 -1242 -99 456 870 539 -828 -1776 -1022 -1062 -260 2162 1202 -3617 -4472 949
621 949 4086 -555 -3855 -709 928 -1567 -2025 1438 2450 -2045 -4443 -1064 2144 1963 -482 -2339
637 -2339 -2203 -131 1519 421 -1090 141 80 -2605 -1631 2966 3309 -1851 -4061 177 2920 699
653F99j133J345q64j736J226K911j34k434p76L25N48J832Q34j848k115L45K086
670A111M49j05j4j375j535J060K281N03j653j390K58l3Q44J618j90k372j529J173
688h99K382M4j188n02j038o3J136J392J44j926j170L47P12J336Q69j393k415l53
706b585K846J337j880p21M28o93p25J668K013p77k826o92J466J982M60j408j870
723a977M41J221M20k61P18L45k524j425K869K989j514l017k41K050M00j86M33
740G41K7j043j082N64K175Q85j448k317n5K283J261p38q61l85m62K53R39J295
758B032m69j763q36O23J585R96p58j780o14P00J193L71j39q56j304J66J297P09
776A153J51p39j558m74J519J716l49k000m27K78L88O99Q30m20j554j251J294J335
$$ plain form
653 699 -434 911 47 -1689 -463 2448 2314 -120 -896 -571 -23 1809 2643 795 -1320 -975 1111
670 1111 1560 1455 1441 66 -1469 -409 1872 2375 722 -668 -410 -443 401 2019 1829 -543 -2072 -899
688 -899 1483 1527 339 -163 -1201 -1264 -128 1264 1408 -518 -1688 -1341 -629 707 1576 183 -2232 -2585
706 -2585 261 1598 -282 -1003 -575 -1268 -1993 -325 1688 911 -1915 -2607 -1141 841 1301 -107 -1977
723 -1977 -1536 -315 105 -156 562 907 -1617 -3042 -173 2816 1302 -1715 -1956 94 494 308 741
740 741 768 -275 -1357 -793 1382 2267 819 -1498 -1553 730 1991 1253 392 7 -455 -202 737 2032
758 2032 1563 -200 -1036 -413 1172 2168 1410 -370 -984 -284 909 1280 1141 285 -1019 -853 444 1153
776 1153 1304 565 -993 -1467 52 1768 1419 -581 -1008 -730 -342 357 1187 767 -787 -2038 -744 591
794E91M61p63j626m70R14J309J41m69o64p15o00J619J706q27j671n77M58J033
812a50O27L25j188j253K52J067Q99M13r44j102m30J096J326K27r55r14n31O85
830e50J449M41q35j211j78P29O71P33J62j553r70O19J529O31p15q68o01M2J139
849F64O84n5o41j219m01J339J211j0j425r40M57N53Q07K86o95r79o73O48J607
868A218J51r67r43o66Q90R03M10m72q97p52K41R98R12m37j333o33M02Q52P89j90
888D76r58r53j09J362O28N1r05r19M2P47Q28L91q73j149P0O58J072N00j001q46
908h88m97R10Q87M28k80j049r14P38J245M79o00q60m38L12P17Q75Nj081p05k8
928g44J038Q63n8q70p46MR41N68J66m57j057k28N70J154M84j073q90k41O17R26
$$ plain form
794 591 1052 289 -1337 -1807 -893 416 557 88 -576 -1291 -1891 -272 1434 607 -1064 -1641 -1183 -150
812 -150 477 802 -386 -1639 -1387 -320 579 992 48 -1054 -1484 -388 938 1165 210 -704 -1235 -550
830 -550 899 1340 505 -706 -884 -155 516 1249 1411 -142 -1112 -493 1036 1667 952 84 -517 -475 664
849 664 1348 1293 652 -567 -968 371 1582 1572 147 -793 -336 217 1024 1310 615 -364 -1037 -389 1218
868 1218 1369 402 -541 -1207 -317 586 996 524 -373 -1125 -884 114 1026 589 -744 -1377 -975 -123 666 476
888 476 -482 -1435 -1544 -182 446 497 -408 -1327 -1285 -538 290 681 -192 -1341 -1271 -613 459 959 -42 -888
908 -888 -1385 -475 412 840 560 -489 -1403 -665 580 1059 459 -401 -839 -527 190 1065 1070 -11 -716 -744
928 -744 294 1157 1099 229 -517 -513 428 996 1162 705 -352 -580 -10 1144 1628 555 -335 -576 41 967
948I67J70n33p85m18L72Q49M86j23j296p30M50J039P42n19j134l46K41N66P29
967G27l3p67q36l16Q09J055P5q05j324J68J097N43p7n75m54l53J22R40R37r82
987d9j022l39P17J093L32o29r43n16Q18Q18k9L01p41q23j41J200J098l80j199
1006d34l00J39N80Q02L5o19r17o7R47N79kk15r31m08P04J107L68p92q96r7M87
1027G0Q14L10o56p76k13M01O97L06k25m83p97q2R85R49j93j588j88N72N89P4J16
1048F82k33r51o04J091R03j01p90o73l51N28J310K58j348q86P68J35k21P77M38
1067G32j001j495O33K006j34j085j80l56J96M10P88l31r64M0J47q9Q77Q20r26
1086H8j657L68J849K70j003k37K89o91J30J039N39o07j047r9P21M44O69n53j029
$$ plain form
948 967 1137 604 -181 -599 -227 622 1108 985 -311 -1041 -591 448 1190 671 -463 -809 -568 -2 727
967 727 694 -73 -909 -1225 -416 639 714 -91 -1415 -1247 -150 393 316 -259 -713 -1066 -944 -4 933 -49
987 -49 -1071 -1410 -693 400 732 103 -840 -1356 -538 280 251 552 -189 -1012 -1153 47 1145 765 -434
1006 -434 -734 -595 -15 787 822 203 -714 -781 166 745 743 528 -403 -811 -107 1000 1368 576 -320 -417 70
1027 70 884 1194 538 -238 -451 -50 647 953 728 245 -552 -634 351 1300 1107 -481 -669 -97 492 566 682
1048 682 449 -502 -1106 -15 888 787 -3 -676 -1027 -499 811 1069 -279 -1165 -397 -262 -483 294 732
1067 732 -269 -1764 -1131 875 741 -344 -524 -880 -684 -274 514 183 -781 -741 -594 -683 194 1014 88
1086 88 -1569 -1201 648 918 -85 -322 -33 -724 -594 445 984 377 -670 -769 -48 396 1065 512 -517
1105e17j13P70O82J19o14k21l06k96P20J037k5j260q52R73O43l7k4l95n02l89
1125f07Q49J070m72q56m0j25l6O94J000j021j654O17J120p8k59M64p88r58N82
1144d98J412l30p91J4ko43M26J442k83j690l57J258K84l21L17j28j120j04J101
1163a3N12m15l82j92o89N36J285J22j180p23M19P34J7k1M33p85q03N25J062L64
1183H06p11p60q1N64N22L07k98n01k67kP69L30l9k21r95j13J051P96k42j138l47
1204e70P84j05K11P41m53j053k04J137M64m32Km47q03P60R21J17r17l89J79j30
1224a87J07R11K2j364l09O86N66j38j63J2r94J00J051L39l40m07l28k83L16P15
1244C12L83j030m71J17M39M42K41o07n94k55P38M25R9k88m99k83M32O13K69k68
$$ plain form
1105 -517 -630 140 822 941 327 106 -200 -496 224 1261 1236 -24 -876 97 740 703 679 284 -218 -607
1125 -607 242 1312 840 -16 -56 -181 -217 477 1477 456 -1198 -581 539 461 202 666 -122 -1080 -498
1144 -498 914 584 -207 -193 -195 -838 -412 1030 747 -943 -1300 -42 242 -79 238 110 -1010 -1114 -13
1163 -13 499 84 -298 -490 -1179 -643 642 764 -416 -1139 -720 14 31 10 443 -342 -1145 -620 442 806
1183 806 95 -665 -746 -182 340 647 349 -152 -419 -421 348 678 639 418 -577 -690 361 1157 915 -223 -570
1204 -570 214 109 320 1061 608 -445 -649 488 952 520 522 75 -728 32 953 1070 153 -236 -57 -187
1224 -187 -80 831 853 -511 -820 -134 432 294 131 143 -851 -751 300 639 299 -108 -436 -719 -403 312
1244 312 695 -335 -806 -689 -250 192 433 -174 -768 -1023 -285 140 239 -49 -548 -831 -399 214 483 215
1264B15o26l14J02O95N70l25p20j65J94N13L36m2l84p01K31N76K27L96n32p69
1284e23j6O71P88l89m21j68j56J08P82K64o06n93L1M39K76L23k42p34l65N85N14
1305E68R3k01m08l42j25P38M63m11l26k98j57N33M52N4o65n91K82L40K27K40l67
1326I9o95k30O74N07m2k52m97l49L95O10R4l91m78j37L22L07N17k55p23j94L25
1347c93M29J98o8l86n46%O97L00o7k47m60m6M45L53K23n53k87J19J62M08L30m99
1369A12n36J45K05M86J39k74l88m22M70O11M1j74l42l75K13M62M08k72n40r5j9
1390a45K96M32N9m77m71J29M53K96m9k46n58j74O66L41q6l87l57m5K25L97J40
1411D39n38l68PJ61L55L73l39n15l08N44K61J21K5n34l16Q9N84K85k90l77j22
$$ plain form
1264 215 -411 -725 -623 72 642 317 -403 -568 -374 139 475 433 49 -652 -421 155 382 778 246 -523
1284 -523 -539 132 920 531 110 -58 -214 -106 676 940 334 -259 -228 211 487 810 568 -166 -531 54 568
1305 568 661 460 52 -290 -415 323 786 375 49 -249 -406 127 579 633 -32 -623 -341 -1 226 466 99
1326 99 -596 -826 -152 355 313 61 -436 -785 -390 220 314 -77 -555 -692 -370 -63 454 199 -524 -718 -393
1347 -393 36 234 166 -220 -766 -766 -69 231 164 -83 -543 -589 -144 209 432 -121 -408 -289 -127 281 611 112
1369 112 -424 -279 -74 412 551 277 -111 -533 -63 548 589 415 73 -302 -89 373 781 509 -31 -126 -145
1390 -145 151 583 642 165 -306 -177 276 572 523 277 -281 -455 211 552 466 79 -278 -323 -98 299 439
1411 439 -99 -467 -460 -299 56 429 90 -425 -733 -189 72 193 218 -316 -632 -543 41 326 36 -341 -463
1432d63q8L49L87R0o26l39K04L79K51J75l50m08r6M48K88J47k36m94j34K91M09
1453A84P4q4m12r7J76L33L22j57n71j33M23R2K99p4l99k85J26M52L04j07m43j54
1475a31j49M54M73j62j97m85L1L70K11L02m19m98Q6M2K86L63j75m86k98J64N65
1496C47o6O9n00j56kL25L56p9m78k17J75J83L40J97p74j98R6K45K90l6j76n49
1518f08pM24K85J66l00l89j70K66N77J2k76m20n9J21M67L32l01l36m46M22N28
1539B88L6j28l55j92J03L70L18j0n33o5j49L71M20J5l85k71l6M84K12j22j61m98
1561b88K4K83L90J57l74k64lO4K60K68k07m83J2O4N53l4j10l32k21O0L49L10j35
1584C43m53k51K26K48K17ql47m58J40M02J81j32j5l01j82J83M47J73m59l49M1
$$ plain form
1432 -463 -551 -202 185 275 -351 -690 -486 -107 144 319 -31 -439 -535 -87 201 348 112 -382 -516 -225 184
1453 184 258 174 -238 -335 -159 174 496 339 -232 -365 58 150 449 375 -24 -309 -183 269 573 466 23 -131
1475 -131 -280 174 647 485 288 -197 -166 204 415 717 298 -200 -114 -72 214 577 402 -84 -382 -218 347
1496 347 281 350 -150 -306 -308 17 373 294 -184 -401 -226 -43 297 494 -280 -478 -382 -137 153 117 -59 -608
1518 -608 -615 -191 94 260 -40 -429 -599 -333 244 256 -20 -440 -499 -378 89 421 120 -216 -662 -240 288
1539 288 324 196 -159 -351 -248 122 440 430 -103 -168 -317 54 474 489 104 -167 -203 281 493 371 210 -288
1561 -288 -264 19 409 566 192 -72 -75 -11 249 517 310 -173 -161 -97 456 422 312 -20 -241 -181 168 478 343
1584 343 -110 -361 -135 113 330 322 -25 -483 -343 59 240 108 93 -208 -390 -207 240 413 -46 -395 -354
1605c54J06K23K50r6o43O4K30K79Q5j54j74k88L5M56L66k96l55k91L09J90K37
1626A79pk75k57M2L22K80j83j00j88j62K72M88k4l38l61R3L85j93K46J43n40j95
1648c73M35L21O1l59j7k00P4L66M90m40m85m6K07P6L06J48m76l51J26L31J94j2
1670C76k85k26j15J67M72k6l62l61J34J71K22J29j05n23r5K94L27N7k82j42j07
1691b80j02M24J86M0m90l07L34M6J31O7j50l53k1N00J52j65k37n4o8Q1N77n4l51
1714i4l68J83J46J78J91J17n27k88L68M21n4m70P5Mm1J74L06p2m37p3L05J80K4
1737B48K28l59m46K01N23pj65j65k27n1L15M66j41l86nq4j1M28O9k51l33Q9P7
1760A3L50m1r7m03n1L96J29J2j83k15k44L60kK52j42k36k02n1L08K20n3l09k15
$$ plain form
1605 -354 -248 -25 225 129 -514 -450 -220 59 144 -10 -184 -472 -437 19 385 89 -266 -557 -248 -58 179
1626 179 172 -103 -360 -318 4 284 101 1 -187 -349 -77 411 387 49 -312 -219 166 -27 219 362 -178 -373
1648 -373 62 383 444 85 68 -132 -58 308 798 358 -127 -173 34 110 416 564 88 -263 -137 194 388 376
1670 376 91 -135 -250 -83 389 363 1 -360 -226 -55 167 296 191 -332 -427 -133 194 251 -31 -173 -280
1691 -280 -382 42 228 268 -222 -529 -195 -149 -18 49 -101 -454 -475 25 177 12 -225 -279 -347 -266 311 257 -94
1714 -94 -462 -279 -133 45 236 353 -174 -462 -94 327 273 -197 -122 -118 -159 15 321 249 -188 -261 44 224 248
1737 248 476 117 -329 -128 395 388 223 58 -169 -220 95 561 420 34 29 -55 -66 362 431 180 -153 -64 13
1760 13 363 322 225 -178 -229 167 296 308 125 -90 -334 26 24 276 134 -102 -304 -355 -47 173 120 -189 -404
1783d04J17J93K46j08q1l50J9K84K08p0j56j95k03K31M33k9k09l9j16kJ90K19
1805A78j52l97J6K40J31J69j08j88k65J68L41J41j66j68j20LL18K08j27j46j56
1826h0O4jL20J87l07l61J32J65K56qJ6l37j04R3L65j16j17k51j27K44J53K51k07
1849B30l63K1O5J28J65pk43k12O2R8L41k55P3m21P0K45J97m3k03l26R5o8O16J0
1873B75m26r9P1J18J3J74r4l52j5L36NR8q0l00j82R9M26J09k61P6j98n6K52K42
1897B31j21k12k8j18L84J63o2k49r2j99L94O8P4k96l8M9J10K29o6k10k7r0M0K72
1921B06O6K0m17j15K84K86K4j31k51n4P2J95J69j45k18o6J22J41N4r0j26k02L5
1944a41K45k4M7J7l62J5J67K04O7k45k42o2K33K36l0k26l6k24J69J82R0k0k71
$$ plain form
1783 -404 -287 -94 152 44 -37 -387 -368 -84 124 54 -102 -297 -500 -269 164 135 -74 -113 -229 -231 -41 178
1805 178 26 -371 -355 -115 16 185 77 -111 -376 -208 133 274 108 -60 -180 -177 141 349 222 76 -80
1826 -80 -16 -17 303 490 183 -178 -46 119 375 367 383 46 -58 35 400 284 167 -84 -211 33 186 437 230
1849 230 -133 -112 -47 81 246 239 -4 -216 -154 -56 285 30 103 -318 -248 -3 194 151 -52 -378 -283 -351 265 275
1873 275 -151 -250 -179 -61 -48 126 32 -320 -335 1 6 104 24 -276 -458 -359 67 176 -85 -9 -207 -263 -11 231
1897 231 110 -102 -130 -248 136 299 237 -12 -104 -303 91 159 233 -63 -101 -52 58 287 221 11 -16 -106 -66 206
1921 206 272 292 -125 -240 44 330 354 223 -28 -82 -10 185 354 209 -9 -75 47 188 242 152 26 -176 -141
1944 -141 104 80 127 144 -218 -203 -36 168 235 -10 -252 -314 -81 155 125 -101 -137 -361 -192 -10 80 60 -211
1967b11P8m0J36J79m0m77J03R9P3K03k3j98j83r2M62L4Rj88n0JJ25J81J0j60k18
1992a87l4J65Q9K01j54k11p5J67K33K6j75N0k02O2J54J47J46l75p9k3K71J03j37
2015A62j19M8k02K58J86j23o2p8k17J76L45k22K2k13m3Q1K02%o4j97j56J61J39
2038H4J18k06k65J32l1L10M0j44Kk43j1M7K09N0j68j62P9L2J45k3M3l32l3L74
2062D7j00J48p7k98O2J69R4J39k18l8k47J86J87J36j40j84p8Q6K33Q9j38j74j19
2085b35K24J13P6N6k29k97K51K14J14o6j58k17K07N0N1J53j55j35k3Q7J05q3n7
2108D6M7j57J75l7J92j24k53L8JJ26K37k28j06p4N5K75l9j43j53O8k2j6K35R3
2132B36k95k60J48K35J12m6j23k79O6K23M2J35k52j54J24j72J91P0j52o6p0K04
$$ plain form
1967 -211 -133 -173 -37 142 102 -375 -272 -173 -100 103 80 -118 -301 -393 69 103 112 -76 -126 -125 0 181 191 31 -187
1992 -187 -221 -56 33 234 80 -131 -206 -39 194 220 45 95 -107 -45 109 256 402 27 -52 -75 196 299 162
2015 162 43 91 -111 147 333 210 148 70 -147 29 374 152 174 -39 -82 -1 201 201 137 -60 -216 -55 84
2038 84 202 -4 -269 -137 -168 142 182 38 40 -203 -214 -167 42 92 -76 -238 -159 -127 18 -5 38 -294 -327 47
2062 47 -53 95 18 -280 -218 -49 45 184 -34 -72 -319 -133 54 190 50 -134 -212 -126 107 196 58 -116 -235
2085 -235 -11 102 178 234 5 -292 -41 173 287 221 63 -154 53 103 154 307 152 17 -6 81 186 103 46
2108 46 93 -64 111 74 266 142 -111 -73 -72 54 291 63 -43 -117 -62 213 174 31 -122 -54 -76 -92 143 236
2132 236 -59 -319 -171 64 176 130 7 -272 -206 17 59 194 -58 -212 -88 -260 -69 1 -151 -217 -287 -83
2154h3J74j2l9k02k4k5J91J89j67m0j86Q9Q2O1J11k64q8R5K09L3Jk53J97j11j9
2179h1L07j93Pj71J11J9R8j0R5l04J02J7J95Mn0j99m7Q6K39j3j04k25O6M6J33
2204A28q8J61j74j64J37J04K7j06O4k56Q8J71K4M7k67r6J52M5kK7o5j75j7K59
2228B4r9J24n0j68j19K42J09j2j01j32n1J97kP9j5k21j4J5K66m2P7k38l3j4J76
2253bK70k19j24j20J51K9N8P5p6n7k6K0K06p3p2j27K0J04L4J84j53j33J9J93q9
2278I2J15j3k7k26QJ50L1r3P0j21j06J54J39l4j45p8oJ18J07m8k7j98L7K18n3
2303F4K0j14M6j29j4J47J3K0n9k56L31n7J32j48j54p7R3J43k5n7j19k0LJ65Q7
2328C5n0L6j62j9J36R7n3p9j45j0K41J20j11n7rm2j0Q4Q8j87k6l5O3Q2O1kj08
$$ plain form
2154 -83 91 79 40 -162 -186 -211 -20 169 2 -38 -224 -135 -53 8 119 -145 -233 -138 71 104 105 -148 49 -62 -81
2179 -81 226 33 40 -131 -20 -1 97 87 182 -122 -20 -3 192 196 146 -53 -100 -14 225 212 108 -117 -51 -5 128
2204 128 40 201 27 -137 0 104 131 25 89 -167 -79 92 116 163 -104 -200 -48 -3 -5 22 -43 -218 -235 24
2228 24 -75 49 -1 -169 -288 -46 63 51 -50 -182 -233 -36 -38 41 26 -195 -209 -194 72 30 107 -131 -164 -178 -2
2253 -2 268 49 -75 -195 -44 -15 43 118 42 -15 -41 -21 185 112 40 -87 -67 37 71 255 102 -31 -12 181 92
2278 92 207 194 167 -59 -51 99 130 37 107 -14 -120 34 173 139 -6 -84 -90 28 135 87 60 -138 -101 117 64
2303 64 84 -30 16 -113 -127 20 33 53 -6 -262 69 12 144 -4 -158 -235 -142 1 -24 -81 -200 -220 -217 -52 35
2328 35 -15 21 -141 -160 -24 73 20 -59 -204 -214 27 147 36 -21 -30 -72 -82 2 90 -97 -123 -158 -95 -13 48 46 -62
2355f2q3J57K8J50j90On1N0J40J31j90j16j11K28Q3n2J11k47m0QJ63m6J01j20
2379D8J1j41J87O3j5l3k01Q7j02J57O3pj17o0J30k1J50k10m0Ko3R8K5l1j6j44
2405a80M1J08NL6j10j5l6j3K13j02l3r7P1J84j88J42n6r6m2J48J24K0j63j18j25
2430b82L80j08j3K50k89j05J29L2O6q5o7J9L5j21L58j20J7j92n7J52J32J4r5j55
2454a05KJ83R8R9l13L4k3K1K70n5j74r4K3J9K38q6J4p6j93J43Q9M8j3o1j40J29
2480G7O2j44L7n2p1J2K11p8p9q6n7N2L4J79k7j35m8L7m7J61N6n7j05kQ1R8r4k1
2508fj75K5K1L80k06k8J16j58K1m1J22o6p3n4m7J64M6L6j27q5kO1J19j5l2p8J6
2535f6J7J38k0q4m1j3O9J19J55j02k12ML6P7J8Q7k71R8MR6j8M1M3k44NJ54n7L1
$$ plain form
2355 -62 -145 12 40 190 0 6 -45 5 145 276 86 -30 -141 87 170 118 229 -18 -58 -50 113 67 168 48
2379 48 59 -82 105 168 153 120 -81 6 -96 61 124 117 0 -60 70 49 199 -11 -51 -49 -112 -14 11 -20 -36 -180
2405 -180 -139 -31 -26 10 -100 -115 -151 -164 49 -53 -86 -183 -112 72 -116 26 -30 -126 -168 -20 104 124 -39 -157 -282
2430 -282 98 -10 -23 227 -62 -167 -38 -6 60 -25 -92 -73 -38 -159 199 79 96 -96 -153 -1 131 145 50 -105
2454 -105 -103 80 178 277 -36 -2 -25 -4 266 211 37 -57 -34 -15 223 137 151 75 -118 25 114 162 149 88 -52 77
2480 77 139 -5 32 -20 -91 -79 132 54 -25 -111 -168 -116 -82 97 70 -65 -113 -76 -123 38 94 37 -68 -70 11 109 15 -6
2508 -6 -181 -156 -135 245 39 11 127 -31 -10 -51 71 5 -68 -122 -169 -5 41 77 -50 -135 -137 -76 43 28 -4 -82 -66
2535 -66 -49 89 69 -15 -56 -69 0 119 274 172 -40 -36 0 77 95 182 -89 9 13 109 91 132 175 -69 -64 90 33 64
2563F4k0m2J54j45J90j77P5k68R4K51n0n5j72J22k02J34J47L2j45o1n8J3K32q1
2587C2p6m4J20j93J68J4J4j11p4j17K42J97j18r1j35O4J4J24QQ7l01J13M5J40
2611A22j28j04Ok5M9O2M1j68P7n0J31J45J17k41qm8J88j99P7l6K6j49Q4M4J62
2636A75q4j25j2j53P6K10q3J5r5K7N6J89o7n5j19K8O4mJ60j30l5q8N9J15No4r0
2663b5L8m2K50k33j3pj9m2J95j09J8Q1k52J32J0O9m2m4j64J95k6N1P2j46m2j20
2689b15K98k33J78j4j31l4J79M5n8L1j51K0OO5l1J1Kn1J03N3N6n2p1m8J53l4K1
2716I8p8O8r3m3O8J05o1q5o6Q6J3Q6J6p0J9K8n9Q5j2J07l04L5J12q5J89j14l4
2743A1l0r4K24J43k11k4j76J70R6K9j07J0k20K40m1N3o2K4j52J0k7J51n8K5j79
$$ plain form
2563 64 44 2 156 11 201 24 99 -169 -75 176 126 71 -101 21 -181 -47 100 132 -13 -74 -132 -119 113 32
2587 32 -44 -88 32 -161 7 21 35 -76 -150 -267 -25 172 54 -37 -172 -108 -94 30 38 125 -176 -63 -18 122
2611 122 -6 -110 -104 -129 -80 -18 23 -145 -68 -118 13 158 275 34 26 -22 166 -33 44 8 34 -115 -31 13 175
2636 175 91 -34 -46 -199 -123 87 4 19 -76 -49 7 196 129 74 -45 -17 47 43 203 73 38 -50 9 124 129 65 -25
2663 -25 13 -29 221 -12 -25 -32 -51 -93 102 -7 11 92 -160 -28 -18 51 9 -35 -199 -4 -30 21 93 -53 -95 -215
2689 -215 83 -150 28 14 -117 -151 28 73 15 46 -105 -85 -79 -14 -45 -34 -32 -83 20 73 129 77 6 -42 111 77 98
2716 98 20 88 -5 -48 20 125 64 -21 -87 -1 12 98 114 44 63 91 32 117 105 212 -92 -57 55 -30 159 45 11
2743 11 -19 -113 111 254 43 19 -157 13 109 138 31 41 -179 61 20 73 11 35 -117 -107 -134 17 -41 -16 -195
2768a95M6J87J14j03j57M3rj20K44k4l4j52K4J48LJ7J55k75J40j94R9J29l8qj42
2793a02J48n1J13j08q9j57J75J04O6Mk7j48Q0O4j46J00j81O5n9L02R9r9j35L6
2817E4p7k0O9l8N4o8k8J33n0R5j10K4J50k28K08l4j57J2J21l9o6K5J44n3j41k2
2843d2L0K19j6j64j21j4J62kon1J1r5R5k0L2kq1j7J02j78J22qn7K6n1J46j6l9
2871c5r7KP2lK8kL9l4l4J8L8p5R4M4j02q0K2J80l0n8k29L67k5kr1M9r6J51j7J
2901I5m5j43P0R3JJ3l7o8J07j46P5lO3j4j7L5P6J3j8j61m0M3Q7J83j73n4J8Ll5
2930B1R0k06J48r9lN1N5rK9j69J9K02j32J5N8l8j15J13j34K3Q2r3O2j6k2J34j52
2957h6o9P0MN3pN4n3m1l9M6O8q6J77k16L0jJ06L4j01l2N9j19K09J11j35J47k01
$$ plain form
2768 -195 -149 38 152 49 -108 -65 -74 -194 50 26 -8 -160 -136 12 15 32 187 -88 52 -142 -43 86 48 40 -102
2793 -102 46 -5 108 0 -89 -246 -71 33 99 103 76 -72 8 72 -74 26 -155 -90 -149 153 252 153 18 54
2817 54 -23 -43 26 -12 42 -26 -54 79 29 124 14 38 188 -40 168 134 -23 -11 110 71 5 30 174 121 -20 -42
2843 -42 -12 207 191 27 -94 -108 54 52 46 -5 6 -89 6 -14 18 16 -65 -82 20 -158 -36 -44 -101 -75 -126 20 4 -35
2871 -35 -132 -130 -58 -61 -33 -35 4 -30 -64 -46 -8 -83 11 55 -47 -127 -105 75 45 -13 -242 125 100 98 7 56 -40 111 94 95
2901 95 50 -93 -23 70 71 84 47 -21 86 -60 15 12 75 61 44 79 155 168 150 -11 -51 -8 79 262 89 35 53 56 21
2930 21 111 -95 53 -46 -49 2 57 48 77 -92 -73 129 -3 12 70 32 -83 30 -104 -81 1 -92 -30 -46 -68 66 -86
2957 -86 -155 -85 -81 -28 -35 19 -34 -75 -114 -68 0 -86 91 -125 -95 -96 10 44 -57 -89 -30 -149 60 171 36 183 -18
2984a8m6K6J27j09K2M7q1K4K6J04k5k19k2J85R1K8j29l3q2J68j51J69n0o5L0J12
3010A29P5Kk46J13j33O3k1J19L9k22M6J21j56J83j06j62J05J4J07l0p0R6k21L9
3034a16J78P3l3k45M2K2J84j64p6K25j27p4J24m9O8Rm3k3P1k56K30Op4k9r3J17
3060e3J53k31R8j94J74q2J65n3O8j01p6J9K02Qk8L6K5J8k05K12j43Mm9K1R2o8
3086A2R6j44j16O1P7J18oj28n9J88p5jP5j27Q3q0K12j04q6K14l23Q2%j9K52j74
3112B8r4Q7P2j44J76j76J84j53j6Q0l0n2r1K0M3MJ33r1j04M5o4K28k02J33k6K3
3138A3k5P1q0j9N4j27J06J9J3Lk8Rj29JJ01l3J6k8K8J9j5j2P0j47J78l6J24m5
3166A01m4j57L8M4J0J28m9j25Q6r8j15J62J00l1j0l3J8J7O0j3j44J12J6ml5l0
$$ plain form
2984 -18 -64 -38 89 -20 2 49 -32 -8 18 122 97 -122 -144 41 132 160 31 -2 -84 84 -67 102 52 -13 17 129
3010 129 204 206 -40 73 -60 3 -18 101 140 -82 -36 85 -71 112 6 -156 -51 -37 70 40 -30 66 -155 -116
3034 -116 62 135 102 -143 -101 -79 105 -59 -135 90 -37 -111 13 -36 32 41 -2 -25 46 -210 20 26 -48 -77 -170 -53
3060 -53 100 -131 -33 -227 -53 -135 30 -23 45 -56 -132 -113 89 97 69 105 130 148 -57 155 12 16 -33 -12 80 12
3086 12 108 -36 -152 -91 -14 104 98 -30 -89 99 24 23 98 -29 54 -26 186 82 -4 210 -113 -31 -31 -50 202 28
3112 28 -66 21 93 -51 125 -51 133 -20 -36 44 14 -38 -129 -109 -66 -62 71 -20 -124 -79 -143 85 -117 16 -10 13
3138 13 -12 59 -21 -40 14 -113 -7 12 25 28 0 9 -120 -119 -18 -51 -35 -63 -35 -16 -31 -43 27 -120 58 22 146 101
3166 101 57 -100 -62 -18 -8 120 71 -54 32 -66 -181 -19 81 50 40 7 25 42 102 89 -55 57 73 69 34 4
3192Dj29J44j0R8qk28K26j66J23o8J01r5r3J65l6p0M4r2K7L0R1L0L4j98J03p1
3218d4N7n9K7nJ8J09j14k5J09j02n7j1QK8J19k30M1P9j77P9K2J38j05J9p8J46
3244hJ0J9N6k17K00j18J77m9j24R6j07k0J42j8K8n8j07%P9R2K5k2j25O1lJ77k16
3271c0J20r1q6K16j36J88j31k53J88J17k5O8k70J15l4J11j82K49k02R7j14M1M6
3294Bk8N6M7j81N4J22J7j81J4k4P4RJ27j6j37J1p7L5j4N9L7j15N0J05J5j13j35
3321a87k8K64j17NJ61p7Qj4p2Q6r0P8j28j8Q4J06p3Mj33J73l9k8n5J91r2n4J56
3348A11k8k1J3o9j2N9J17l8Pj37J01q0j24K42p0n5k5MO7J4k0j1p9j35P8J12j0
3375A1n7O1j7J18j23J6J08l2p2n5M3J09p9j36J18j67J40o7J85k24n5J33R8M1k7
$$ plain form
3192 4 -125 19 9 107 99 -129 97 -69 54 -14 87 -8 -101 64 28 -42 2 -90 -63 -33 58 88 122 -76 27 -44
3218 -44 13 -46 -19 -24 -6 103 -11 -36 73 -29 -86 -97 -89 -61 58 -172 -131 -52 -229 -150 -128 10 -95 -76 -154 -8
3244 -8 2 21 77 -140 60 -58 119 70 -54 42 -65 -85 57 39 67 9 -98 -98 -19 73 98 76 -49 12 9 186 -30
3271 -30 90 -1 -87 129 -7 181 50 -203 -15 102 77 145 -125 -10 -44 67 -115 134 -68 29 -85 -44 2
3294 2 -26 30 77 -104 -50 72 89 -92 -78 -102 -28 -19 108 92 -45 -34 -111 -76 -90 -31 6 -109 -59 46 61 -52 -187
3321 -187 -215 49 -68 -63 98 21 29 15 -57 29 -61 17 -111 -129 -45 61 -12 -8 -141 32 -7 -35 -90 101 9 -45 111
3348 111 83 62 75 6 -6 53 170 132 139 2 103 23 -101 141 71 16 -9 -5 62 76 56 45 -34 -169 -91 21 11
3375 11 -46 15 -2 116 -7 9 117 85 13 -42 1 110 31 -105 13 -154 -14 -81 104 -120 -175 -42 56 97 70
3400G0l2P7k98P1J66l1L6j5j36j6J70k0o8O0l5m7N1o9PJ11K2j33R0M0p3q6Q7N7
3428E6m0JM6j31L3j9L4k9R0K2o0j39M5J01M8p8m3jP9J50N7k07J01j16J09N7n1
3455A15k4p9J5k2N1k2J4rq9K2o2K28o2j09J01Kj12N1J09j17l3pL9J2m1n9J63q9
3483a4K6J64k2j03r6%q8R8J22j29l7L9j10J49Q9p6j37J03M9Q4j64K6l3jL5J40
3509A14j22l8qk5O8q3Q8mk4M8r3L1J29r3N5o5p6J17l0J33k2Rj03j84K25m4k9N
3537b1L6j7PJ97k15P8j9j79J80l2Q6l6m8m3M5P7k0j15J36Qj49J05J12j90J01j99
3563a15K35o1k2o4j35J27LR9O4j76k8J24j7Q0r4j2j46J59j2m5J24K8k44J01K3
3588do9J08j03J50j08o7J86j17J4m2j45K16j80J98l4J02o3j36nJ71r8M7j09rL5
$$ plain form
3400 70 38 115 -183 -112 54 23 59 44 -92 -108 62 42 -26 34 -1 -48 3 -66 -59 52 74 -59 31 71 -2 -88 -1 56
3428 56 16 17 63 -68 -35 -54 -20 -49 41 63 3 -136 -91 10 58 -20 -63 -64 15 165 222 15 116 0 109 166 115
3455 115 91 12 27 5 56 34 48 39 -50 -28 -90 138 76 -33 68 70 -42 9 118 1 -32 -39 0 12 -29 -88 75 -14
3483 -14 12 176 154 51 -45 -45 -133 -35 87 -42 -79 -40 -150 -1 88 12 -125 -22 27 111 -53 -27 -60 -61 -26 114
3509 114 -8 -46 -54 -79 -11 -94 -6 -10 -34 14 -79 -48 81 -12 43 -22 -98 19 -11 122 100 109 6 -178 47 3 -26 -21
3537 -21 15 -2 5 202 -13 65 46 -133 47 15 101 65 17 -26 19 96 76 -39 97 105 -44 61 173 -17 84 -115
3563 -115 120 59 37 -27 -162 -35 -32 67 131 -45 -73 51 34 114 20 8 -138 21 9 -36 88 116 -128 -27 -4
3588 -4 -73 35 -68 82 -26 -93 93 -24 -10 -52 -197 19 -161 37 3 105 42 -94 -99 72 -26 21 -88 -97 -62
3613f2K22j3j08J2n3p1J7J98q1l0j48R1O7oO4k55K59j66J46L8j33Q8k8j5m9K6
3639A0P0M8j61j02J36J37qj27k1m7M4J08K6k5j27q5QK09m6J17j62J0mj07J55n5
3665Aj1n0rn7NR2J3o7j3J5J06j83J69j7j27j3J53J0lK3j39J4R3J1L4j12RO8R4
3694A09j39J39l11K14q0J02L3j9p6K2j07K44k74J99k2m5J18k56K59j4l9l3q5K3
3718c8K00l8j60J17p3N5jQ2j35O3p2j8J42j16k9p7J09Q3k3p5J08j99J22L5rkj43
3745i2j01J02k1M5J58j0m5j01r6JN0J32m6l8o4J20L9M0Q9k63j22J54MJ59k7q2
3771a5n2J35j6J7j65K7J24o7L5k0j06N7J10p3J01nj25j7j2O5n4R2k4q8O6p3L2
3798e1N3J1K7l4j5N9m5N6Jk8j31J14J6Jq4L26j49j50J73j06j1q1o6J55Kj27J05
$$ plain form
3613 -62 160 147 39 51 -2 -73 -56 142 61 31 -117 -26 41 35 99 -156 103 -63 83 121 -12 76 48 33 -16 10
3639 10 80 128 -33 -135 1 138 130 3 -18 -65 -21 87 113 88 -39 -124 -116 93 47 164 2 12 8 -99 56 1
3665 1 -10 -60 -69 -126 -121 -29 -16 -83 -96 -81 25 -158 11 -6 -133 -146 7 17 14 37 -102 -88 5 16 50 -62 -53 15 109
3694 109 -30 109 -202 12 -68 34 67 48 -28 -6 -113 131 -143 56 34 -11 107 -149 110 96 57 24 -61 -38
3718 -38 162 124 -36 81 8 63 62 144 9 72 0 -18 124 8 -21 -98 11 94 71 -4 104 -95 27 62 53 51 -92
3745 -92 -193 -91 -112 -67 91 81 36 -65 -161 -160 -110 22 -24 -62 -126 -6 33 73 162 -101 -223 -69 -65 94 67 -15
3771 -15 -67 68 52 69 -96 -69 55 -12 23 3 -103 -46 64 -9 92 87 -38 -55 -67 -2 -56 36 12 -76 -10 -83 -51
3798 -51 2 13 40 6 -9 50 5 61 62 34 -97 17 33 34 -50 276 127 -23 150 44 33 -48 -114 41 43 -84 21
3825B1n1K9q6k0J60P4j02Q0j68K06q6p7l0N7k24J17k6J52M2N0j34P2j53J79j79
3850i7J14j57K17j00Q3j23k6R1j61J88L3j19Jk3M0J01j5M2k5M0j22l4J4M9n0J91
3876A52j80o1J89j14J36j81J09N6j06j07Q6o1K8J59l8J5K1k34J11q7K30k0l0M3
3900A16oq8L5Q0q1k5r2J52k4L5j45R3o1o4K4P8N8q0p2Q2P0k13J27m0J93k53J20
3927A9j53K21j73K7J00j14J64j91J66j41m1k3R4%J8L1L8n3q9P5l7J00k03P5J6
3952g4p0K05j21R6l5M7Qm3o9jJ46k85K83K3l6n2m3r9J04j3J40j07m4p7M2J53K
3979H0o5j21J21M7O8o1mq0j1N8J02n9m1N8j43K7O4N6o6M9k61J21N5O9r3KJM1m9
4008c5P3m2j29K01q1P0m6j41J12J2q1Q0Nr1J04m9m2pQ0qM3Rq0Q3M4j56J9j11J33
$$ plain form
3825 21 -30 -1 -87 -107 53 127 25 105 -63 143 57 -20 -50 7 -217 -100 -126 26 68 118 -16 56 -97 82 -97
3850 -97 17 -140 77 -23 60 -63 -89 2 -159 29 62 -57 -56 -79 -39 62 47 89 64 104 -18 -52 -38 11 -39 152
3876 152 -28 -89 100 -14 122 -59 50 106 0 -107 -21 -82 -54 105 67 82 103 -131 -20 -107 123 103 73 116
3900 116 110 22 57 137 56 31 -61 91 67 102 -43 50 -11 -75 -51 27 85 5 -67 15 85 -128 -1 -41 152 -101 19
3927 19 -134 87 -86 -59 41 -73 91 -100 66 -75 -116 -139 -45 -45 -27 4 42 -11 -100 -25 -62 38 -165 -90 -74
3952 -74 -144 61 -60 36 1 48 56 13 -56 -57 89 -196 87 110 74 22 -21 -120 -16 -29 111 4 -40 -117 -75 78 80
3979 80 15 -106 15 62 130 69 65 -15 -26 32 134 75 34 92 -51 -24 40 96 30 79 -182 -61 -6 63 -30 -28 -27 14 -35
4008 -35 38 -4 -133 68 -13 57 11 -130 -18 -6 -87 -7 -2 -93 11 -38 -80 -87 -7 -15 28 37 -43 40 84 -72 -53 -164 -31
4037c1j02K2K67j56RL0j6M8n5p5J57j90R2J48q1o6KM0q8P0m2J72j00o5K0N3N5
4064A18J1Qp9l6K1M5q8M8j21M3Q7j61J55j08L0J9K0L5r6L2P3j2j8J6r6M6K2l7
4092b3n5J94j00l1N5p1J58j11Q9p3n6l5J0J23o6R5qQ0l06K61j81j03J93p1r1J14
4118iJ4K5j12j4N5J2j2o0Q2k2p7K7J48K5o7R9k28O3K5O0J0p5j1J09q3Q0j17R9
4146D6P8k04J64k8J05k12J68k22J29m3j1Jq8J85lj9j2j44K47j59J5L5Pn1N7l7
4172DK10k35rJ98j85J18k7j29J02J4M8j89N0o2J36m7L2M0j00Kl0J61j11j9l1m2
4198a01O9Q1kk02K5J88p1k4P4l8J08p8l9j18J61j19Q8k03Q1J31k7k1o9l9J11N2
4224A8j12K54j20j72L8m1J74l1p7N4n8L3J36o3qP8j02MO9P3q2j29mJ6j9K2n0P
$$ plain form
4037 -31 -133 -111 156 0 9 39 23 71 16 -59 98 -92 0 148 67 1 3 43 -45 25 -17 155 55 -10 10 63 118
4064 118 129 137 58 22 43 88 0 48 -73 -30 57 -104 51 -57 -27 -8 12 47 -49 -17 56 44 26 42 -54 -8 14 -23
4092 -23 -78 116 16 -15 40 -31 127 16 105 32 -24 -59 -49 74 8 103 95 175 -131 130 -51 -154 39 -32 -123 -9
4118 -9 5 30 -82 -96 -41 -29 -41 -101 -19 -41 -118 -91 57 82 15 114 -114 -51 -26 34 44 -31 -42 67 -16 64 -53 46
4146 46 124 -80 84 56 161 -51 117 -105 24 -19 -30 -29 -117 68 65 46 34 -110 137 -22 -7 28 35 -16 41 4
4172 4 214 -21 -30 168 -17 101 74 -55 47 61 109 -80 -30 -92 44 -3 29 69 -31 -29 -59 102 -9 -28 -59 -101
4198 -101 -32 49 47 -155 -130 58 -13 -37 37 -1 107 29 -10 -128 33 -86 2 -201 -120 11 -16 -37 -106 -145 -34 18
4224 18 -94 160 40 -132 -94 -135 39 8 -69 -15 -73 -40 96 33 25 103 1 5 74 147 65 -64 -68 -52 -71 -49 -99 -92
4252i2N5O4J09o0j05j9M1N1n0O1l3p4J30r8Q3Oo7j91K98j26o0Q3m0J4n3j4J65
4279G8J3o6J7m9J3KK0jqK6n0L6j20P4o9P3pn8J57m4n8j08J01K2r8K00q1p9k7Q1
4309a0L8o3P4j57K56j48RR3o8p7j06J43R7q7j33J85m0r6J33o6O4q9J9Q7l3L9R0
4336A54j23j12N4n4J59P3j0k58J32l1n4J04J3K0m7K4LJ3p9J0j14J61j23J09J04
4361A28j29N1j33J15r1R1j19N4j44J42K7rm5m8K40q7JJ1om1n5L9J07j00O9j09
4387d1k6PP5K6r3o0M6m8N3J0P1q8P1m4J3J70j12j13L8L2j01R2J7k8o1N3N5n3O9
4416C0q5N7M5m4L0Q9r5L1N9j90J17R7j77K1rP6l8M5l1n4J15K5j41N9KJ02r6J4
4444E4KN7m1j20K9N2k7k4q1Q2N4L7n5j18K03p1j39M9L2J16n5j18P1K4Qnj0P5r0
$$ plain form
4252 -92 -37 27 136 76 -29 -48 -7 44 -6 55 22 -52 78 -20 63 69 2 -189 109 -17 -77 6 -34 -20 -73 -87 78
4279 78 91 25 42 -7 6 8 28 27 19 45 -5 31 -89 -15 -84 -11 -18 -76 81 37 -21 -129 -28 -6 -104 96 15 -64 -91 -10
4309 -10 28 -35 39 -118 138 -10 -1 92 24 -53 -159 -16 81 -6 -139 46 6 -90 43 -23 41 -48 -29 58 25 64 154
4336 154 31 -81 -27 -81 78 151 141 -117 15 -16 -70 34 47 67 20 44 47 60 -19 -9 -123 38 -85 24 128
4361 128 -1 50 -83 32 -59 32 -87 -33 -177 -35 -8 -17 -62 -110 130 43 44 55 49 8 -47 -8 99 -1 68 -41
4387 -41 -67 -60 15 41 -52 -112 -66 -114 -61 -51 20 -68 3 -41 -28 142 30 -83 -45 -13 -114 -22 -5 -33 -94 -41 14 -39 30
4416 30 -55 2 47 3 33 122 27 58 117 -73 44 141 -36 -15 -24 52 14 59 28 -26 89 114 -27 32 34 136 40 54
4444 54 56 113 72 -48 -19 33 6 -18 -99 -17 37 74 19 -99 104 33 -106 -57 -25 91 36 -82 -11 13 21 16 6 81 -9
4473iK5j47J07J00N0k26J20P5k09N5kJ31K1k7Kq7Nn2R1j68O1R0q4O8j33Q9jJ9
4501c6jO4j00J04j5M3j65J10j6o9J57K0k71J57O8m1o8J91n6r6J01n1LM9m9L5p4
4528fMr6J70n5LJ0k18J93L0jj16K8q2J4N6K10j65J2O1j40M4PJ53j53N7o2J99j33
4556B4R9j74n3Q0Pn3J43j05J15r5n4P8J3P7j69k2l5J06J4J6K2o8J65j07m4NR6
4583H1n9O7k17K8J69NOq3mO0j02J22j1j34N0l0P4J6n0R1j10J58j15o7Q9l3p8J22
4611D5R0j11m5o3Q0J3RO4j73Q9P7l7l7J9q9N4P9j4Lo1n5LM9M8j36K60j52n0o0
4640a01L1K1L5j43J62Om0MK7J19k5L3o1p4q0J17q2R0j0L2O4l4l8n5k6K0J2m9N6
4669A1J15j35J10l2n1l3j50P9Q6j48K34j01j15N2K5K02k40J19p2K2P1l3J2Lj19
$$ plain form
4473 -9 16 -131 -24 76 126 -100 20 95 -114 -59 -61 70 91 64 66 -21 -16 -68 23 -145 -84 6 -78 -10 -143 -54 -55 -36
4501 -36 -37 27 -73 31 16 59 -106 4 -12 -81 76 96 -175 -18 50 9 -59 132 76 -20 81 30 33 82 33 68 -6
4528 -6 -2 -98 72 17 20 30 -188 5 35 34 -82 -54 -136 -122 -66 144 -21 -9 52 -88 -44 -37 116 -37 20 -42 157 24
4556 24 123 -51 -104 -24 -17 -70 73 -32 83 -12 -66 12 25 102 -67 -89 -124 -18 -4 12 34 -34 131 24 -20 -15 81
4583 81 22 89 -128 -100 69 74 80 -3 -7 53 -49 73 62 -72 -22 -52 22 38 -12 79 -31 127 12 -55 34 1 -77 45
4611 45 135 24 -21 -84 -4 9 18 82 -91 -2 75 38 1 20 -69 -15 64 50 53 -8 -63 -60 -11 37 -99 161 9 -41 -101
4640 -101 -70 -49 -14 -157 5 11 -29 -25 2 121 96 129 68 -6 -86 31 -51 39 29 61 125 91 53 -2 -28 -8 4 -45 11
4669 11 126 -9 101 69 18 -15 -165 -86 0 -148 86 -15 -130 -78 -53 149 -91 28 -44 -22 49 16 28 31 -88
4694h8K0R3P8q1n6q0N5J3L8J17l8j39o9J89O0j24q3K02j29M1J4P4L0r9j10P0q2
4721h4J03L8j37j5j06J83j7N9l7q5N8Q8n4p5J18o3Q8j95J21J32j49N2m4l2J26
4746G3m3r6J09r1K1J5jo7J20l0R3m3k01J66L4j51J10l0j6N8J03o9j21n1P5N9M9
4773G5j18n5J35j22L0k3P3J2l8m0J82k16J21k5J70j73O3n4qJ19q6j5K1o4J5Rr3
4800a05o3K59n3p0M1l6Q3j1l8M7j43J48j68N5J1m5J20j59J66k5j03K37k08J05
4824D5j76K4J66j73Q8r5J27p7j9K1m3J74Nk07K7O7j0O9r9L4o2n5L62k39j3m9K0
4851h8R8J6p2j39K13p8J39n3M0j42J51j14J59K4k49O6j64L30l5p2r1J49k23J80
4875D5j9K2r7Q7ONn8n9R5N5r8j03K29J2q8p0Q1J0q7K47k70M9o0N0R1p2l9Q5J2
$$ plain form
4694 -88 -68 25 103 22 -34 -114 -59 -46 -8 109 71 -68 -137 52 112 -12 -95 107 -22 19 33 107 137 38 -72 -2 -84
4721 -84 19 57 -80 -95 -201 -18 -35 24 -13 -98 -40 48 -6 -81 37 -26 62 -133 -12 120 -29 23 -21 -53 73
4746 73 30 -66 43 -48 -27 -12 -13 -80 40 10 103 60 -141 25 59 -92 18 -12 -28 30 133 64 -57 -108 -33 26 75
4773 75 -43 -98 37 -85 -55 -78 -5 7 -31 -71 111 -105 16 -9 161 -12 51 -3 -11 108 22 7 28 -36 -21 -12 -105
4800 -105 -168 91 38 -32 9 -27 56 45 7 54 -89 59 -109 -54 -43 -88 32 -127 39 14 -89 148 -60 45
4824 45 -131 -107 59 -114 -26 -121 6 -71 -90 -69 -112 62 67 -140 -113 -46 -56 13 -86 -52 -114 -169 193 -46 -59 -108 -88
4851 -88 10 26 -46 -185 28 -50 89 36 76 -66 85 -29 130 154 -95 -29 -193 137 102 30 -61 88 -135 45
4875 45 26 48 -49 38 44 49 -9 -68 27 82 -16 -119 110 122 34 -36 45 55 -32 215 -55 -6 -66 -16 75 3 -36 49 61
$$ [...]
8191C5
##END NTUPLES=NMR FID
##END=
