##TITLE=1H_Pr 68-H2O
 D2O
 8 sc, 
 17.11.2022
##JCAMPDX= 6.0         $$ Bruker NMR JCAMP-DX V2.0
##DATA TYPE= NMR FID
##DATA CLASS= NTUPLES
##ORIGIN= UXNMR, Bruker Analytische Messtechnik GmbH
##OWNER= root
$$ XWIN-NMR		Version 3.5
$$ Thu Nov 17 16:23:12 2022 Russian Standard Time (UT+4h)  she@DPX200
##.OBSERVE FREQUENCY= 200.1313499994
##.OBSERVE NUCLEUS= ^1H
##.DELAY= (6, 6)
##.ACQUISITION MODE= SIMULTANEOUS
##.ACQUISITION SCHEME= undefined
##.AVERAGES= 8
##.DIGITISER RES= 18
##SPECTROMETER/DATA SYSTEM= spect
##.PULSE SEQUENCE= zg30
##.SOLVENT NAME= D2O
##.SHIFT REFERENCE= (INTERNAL, D2O, 0, 15.7039)
##AUDIT TRAIL= $$ (NUMBER, WHEN, WHO, WHERE, WHAT)
$$ ##TITLE= Audit trail, XWIN-NMR		Version 3.5
$$ ##JCAMPDX= 5.01
$$ ##ORIGIN= Bruker BioSpin GmbH
$$ ##OWNER= she
$$ F:/spectra/data/she/nmr/H-F/1/audita.txt
$$ ##AUDIT TRAIL=  $$ (NUMBER, WHEN, WHO, WHERE, WHAT)
(   1,<2022-11-17 16:22:08.57 +0400>,<she>,<DPX200>,
      <created by zg, POWCHK disabled, PULCHK disabled
       configuration hash MD5:
       00 E9 B6 7A A2 85 ED C7 34 08 36 98 17 FE 4E 26
       data hash MD5: 16K
       EA 89 C5 4F 87 8F 37 1A 25 B1 72 70 90 3C 1A 71>)
$$ ##END=
$$ 
$$ hash MD5
$$ 21 2B C8 F6 9E E0 64 76 3F 2B A4 04 04 D7 43 7F
##$RELAX= 
##$RELAX= 
##$RELAX= 
##$RELAX= 
##$RELAX= 
##$RELAX= 
$$ Bruker specific parameters
$$ --------------------------
##$DU= <F:/spectra>
##$EXPNO= 1
##$NAME= <H-F>
##$PROCNO= 1
##$TYPE= <nmr>
##$USER= <she>
##$AMP= (0..31)
100 100 100 100 100 100 100 100 100 100 100 100 100 100 100 100 100 100 
100 100 100 100 100 100 100 100 100 100 100 100 100 100 
##$AQSEQ= 0
##$AQ_mod= 1
##$AUNM= <au_zg>
##$AUTOPOS= <>
##$BF1= 200.13
##$BF2= 200.13
##$BF3= 200.13
##$BF4= 200.13
##$BF5= 200.13
##$BF6= 200.13
##$BF7= 200.13
##$BF8= 200.13
##$BYTORDA= 1
##$CFDGTYP= 0
##$CFRGTYP= 5
##$CHEMSTR= <none>
##$CNST= (0..31)
1 1 145 1 1 1 1 1 1 1 1 1 1 1 1 1 1 1 1 1 1 1 1 1 1 1 1 1 1 1 1 1 
##$CPDPRG= <>
##$CPDPRG1= <>
##$CPDPRG2= <>
##$CPDPRG3= <>
##$CPDPRG4= <mlev>
##$CPDPRG5= <mlev>
##$CPDPRG6= <mlev>
##$CPDPRG7= <mlev>
##$CPDPRG8= <mlev>
##$CPDPRGB= <>
##$CPDPRGT= <>
##$D= (0..31)
0 1.2 0 0 0 0 0 0 0 0.06 0 0.03 0 0 0 0 0.0002 0 0 0 0 0 0 0 0 0 0 0 0 
0 0 0 
##$DATE= 1668687727
##$DBL= (0..7)
120 120 120 120 120 120 120 120 
##$DBP= (0..7)
150 150 150 150 150 150 150 150 
##$DBP07= 0
##$DBPNAM0= <>
##$DBPNAM1= <>
##$DBPNAM2= <>
##$DBPNAM3= <>
##$DBPNAM4= <>
##$DBPNAM5= <>
##$DBPNAM6= <>
##$DBPNAM7= <>
##$DBPOAL= (0..7)
0.5 0.5 0.5 0.5 0.5 0.5 0.5 0.5 
##$DBPOFFS= (0..7)
0 0 0 0 0 0 0 0 
##$DE= 6
##$DECBNUC= <off>
##$DECIM= 32
##$DECNUC= <off>
##$DECSTAT= 4
##$DIGMOD= 1
##$DIGTYP= 9
##$DL= (0..7)
0 120 120 120 120 120 120 120 
##$DP= (0..7)
150 150 150 150 150 150 150 150 
##$DP07= 0
##$DPNAME0= <>
##$DPNAME1= <>
##$DPNAME2= <>
##$DPNAME3= <>
##$DPNAME4= <>
##$DPNAME5= <>
##$DPNAME6= <>
##$DPNAME7= <>
##$DPOAL= (0..7)
0.5 0.5 0.5 0.5 0.5 0.5 0.5 0.5 
##$DPOFFS= (0..7)
0 0 0 0 0 0 0 0 
##$DQDMODE= 0
##$DR= 18
##$DS= 0
##$DSLIST= <SSSSSSSSSSSSSSS>
$$ [...]
##$SUBNAM2= <"">
##$SUBNAM3= <"">
##$SUBNAM4= <"">
##$SUBNAM5= <"">
##$SUBNAM6= <"">
##$SUBNAM7= <"">
##$SUBNAM8= <"">
##$SUBNAM9= <"">
##$SW= 18.0517283424941
##$SWIBOX= (0..15)
0 0 2 0 0 0 0 0 0 0 0 0 0 0 0 0 
##$SW_h= 3612.71676300578
##$TD= 16384
##$TD0= 1
##$TE= 0
##$TE2= 300
##$TE3= 300
##$TEG= 300
##$TL= (0..7)
0 120 120 120 120 120 120 120 
##$TP= (0..7)
150 150 150 150 150 150 150 150 
##$TP07= 0
##$TPNAME0= <>
##$TPNAME1= <>
##$TPNAME2= <>
##$TPNAME3= <>
##$TPNAME4= <>
##$TPNAME5= <>
##$TPNAME6= <>
##$TPNAME7= <>
##$TPOAL= (0..7)
0.5 0.5 0.5 0.5 0.5 0.5 0.5 0.5 
##$TPOFFS= (0..7)
0 0 0 0 0 0 0 0 
##$TUNHIN= 0
##$TUNHOUT= 0
##$TUNXOUT= 0
##$USERA1= <user>
##$USERA2= <user>
##$USERA3= <user>
##$USERA4= <user>
##$USERA5= <user>
##$V9= 5
##$VALIST= <valist>
##$VCLIST= <CCCCCCCCCCCCCCC>
##$VD= 0
##$VDLIST= <DDDDDDDDDDDDDDD>
##$VPLIST= <PPPPPPPPPPPPPPP>
##$VTLIST= <TTTTTTTTTTTTTTT>
##$WBST= 1024
##$WBSW= 4
##$XGAIN= (0..3)
0 0 0 0 
##$XL= 0
##$YL= 0
##$YMAX_a= 1022619
##$YMIN_a= -1025512
##$ZGOPTNS= <>
##$ZL1= 120
##$ZL2= 120
##$ZL3= 120
##$ZL4= 120
##$ABSF1= 10
##$ABSF2= 0
##$ABSG= 5
##$ABSL= 3
##$ALPHA= 0
##$AQORDER= 0
##$ASSFAC= 0
##$ASSFACI= 0
##$ASSFACX= 0
##$ASSWID= 0
##$AUNMP= <proc_1d>
##$AZFE= 0.1
##$AZFW= 0.1
##$BCFW= 1
##$BC_mod= 2
##$BYTORDP= 1
##$COROFFS= 0
##$CY= 11.3945322036743
##$DATMOD= 1
##$DC= 2
##$DFILT= <>
##$DTYPP= 0
##$F1P= 2.36226072786647
##$F2P= -0.459571619588291
##$FCOR= 0.5
##$FTSIZE= 0
##$FT_mod= 4
##$GAMMA= 1
##$GB= 0.15
##$INTBC= 1
##$INTSCL= 1
##$ISEN= 128
##$LB= 0.24
##$LEV0= 0
##$LPBIN= 0
##$MAXI= 10000
##$MC2= 0
##$MEAN= 0
##$ME_mod= 0
##$MI= 1.114404
##$NCOEF= 0
##$NC_proc= 0
##$NLEV= 6
##$NOISF1= 3.799351
##$NOISF2= 2.8
##$NSP= 1
##$NTH_PI= 0
##$NZP= 0
##$OFFSET= 15.70392
##$PC= 1
##$PHC0= -18190.98
##$PHC1= 9.8007
##$PH_mod= 1
##$PKNL= yes
##$PPARMOD= 0
##$PSCAL= 0
##$PSIGN= 0
##$REVERSE= no
##$SF= 200.130013532006
##$SI= 16384
##$SIGF1= 3
##$SIGF2= 2
##$SINO= 400
##$SIOLD= 16384
##$SREGLST= <1H.CDCl3>
##$SSB= 0
##$STSI= 0
##$STSR= 0
##$SW_p= 3612.71676300578
##$SYMM= 0
##$S_DEV= 0
##$TDeff= 0
##$TDoff= 0
##$TI= <>
##$TILT= no
##$TM1= 0
##$TM2= 0
##$TOPLEV= 0
##$USERP1= <user>
##$USERP2= <user>
##$USERP3= <user>
##$USERP4= <user>
##$USERP5= <user>
##$WDW= 1
##$XDIM= 8192
##$YMAX_p= 0
##$YMIN_p= 0
$$ End of Bruker specific parameters
$$ ---------------------------------
##NTUPLES= NMR FID
##VAR_NAME=  TIME,          FID/REAL,        FID/IMAG
##SYMBOL=    X,             R,               I
##VAR_TYPE=  INDEPENDENT,   DEPENDENT,       DEPENDENT
##VAR_FORM=  AFFN,          ASDF,            ASDF
##VAR_DIM=   8192,          8192,            8192
##UNITS=     SECONDS,       ARBITRARY UNITS, ARBITRARY UNITS
##FACTOR=    0.0002768,     1,               1
##FIRST=     0,             0,               0
##LAST=      2.2672688,     0,               0
##MIN=       0,             -1025512,        0
##MAX=       2.2672688,     1022619,         0
$$ Real data points
##PAGE= N=1
##DATA TABLE= (X++(R..R)), XYDATA
$$ plain form
0 0 0 0 0 0 0 0 8 0 8 -8 8 -16 16 -24 32 -32 48 -56 71 -88 104 -120 148 -168 204 -233 272 -319 360 -420
30 -420 479 -543 621 -700 791 -891 996 -1123 1251 -1395 1556 -1724 1916 -2121 2344 -2593
46 -2593 2857 -3153 3475 -3825 4217 -4643 5122 -5652 6243 -6918 7678 -8556 9581 -10784
60 -10784 12237 -14018 16273 -19229 23280 -29227 38821 -56914 103193 -481281 -891923 5744
72 5744 479649 954605 947966 466138 -274916 -763077 -1025512 -741584 -53501 619049 924040
83 924040 907706 432213 -272240 -817180 -936223 -644692 -11982 589100 887906 796230
93 796230 350969 -301493 -783565 -893784 -594543 10038 607433 849122 723388 294803
103 294803 -321331 -778708 -804167 -498043 18888 582677 835208 632834 199435 -312462
$$ packed form
0@%%%%%%QqQj6J6k4L2m0N6o4Q0j04J27j59J92k24K68l16L72m37N05n91O79p80
30d20Q99j022J164j321J491j682J887k119K374k646K951l280L640m037M465m937
46b593N450o010O628p300Q042q860R765j0774J1895j3161J4596j6234J8137k0365
60a0784K3021k6255L0291l5502M2509n2507O8048r5735J60107n84474m10642Q97667
72E744M73905M74956o639m81828p41054m88161k62435K83928O88083O72550L04991
83I24040j6334m75493p04453n44940j19043K91531O32710O01082K98806r1676
93G96230m45261o52462m82072j10219K99241O04581N97395K41689j25734m28585
103B94803o16134m57377k5459L06124N16931N63789K52531k02374m33399n11897
$$ plain form
113 -312462 -747104 -802043 -434036 85292 557900 796348 615849 138885 -348539 -685489
123 -685489 -715325 -368134 138993 552934 746709 591142 119572 -376640 -666728 -667803
133 -667803 -340400 164861 553272 674823 502225 71433 -396716 -646915 -611210 -312042
143 -312042 159238 554134 659313 459138 42983 -402648 -630270 -547763 -238247 180812
153 180812 533451 622866 409372 10969 -392862 -602873 -520110 -208235 202397 534444
163 534444 593669 355066 -23604 -380663 -571358 -478860 -154721 225075 508138 563073
173 563073 333313 -52905 -392240 -550161 -452556 -131443 241244 487478 509123 282557
183 282557 -87547 -402150 -522603 -410268 -105533 250024 480813 486408 259514 -98105
$$ packed form
113c12462m34642n4939L68007N19328M72608K38448j80499m76964m87424l36950
123f85489k9836L47191N07127M13941J93775j55567m71570m96212k90088j075
133f67803L27403N05261L88411J21551j72598m30792m68149k50199L5705K99168
143c12042M71280L94896J05179k00175m16155m45631k27622Q2507L09516M19059
153A80812L52639Q9415k13494l98403m03831k10011Q2763L11875M10632L32047
163E34444N9225k38603l78670l57059j90695R2498L24139L79796K83063N4935
173E63073k29760l86218l39335j57921R7605L21113L72687K46234K1645k26566
183B82557l70104l14603j20453J12335L04735L55557K30789N595k26894l57619
$$ plain form
193 -98105 -396403 -493685 -366116 -65721 274695 475799 447953 219776 -112202 -390054
203 -390054 -471663 -337145 -52468 271433 466615 419664 177198 -135048 -387793 -455636
213 -455636 -300747 -13246 275593 440884 392403 154900 -146060 -379678 -439780 -283226
223 -283226 9516 288164 427429 361150 120381 -168606 -374526 -411224 -250485 31590
233 31590 289207 411042 344833 107953 -179001 -368688 -385991 -221926 57925 304641
243 304641 395789 309757 82474 -191275 -367795 -364333 -198881 61127 298567 384800 284145
254 284145 55614 -203448 -367641 -347389 -165448 85271 298464 368767 259032 34944
264 34944 -202027 -350749 -329767 -147065 99778 299879 359827 240780 9419 -216005
$$ packed form
193i8105k98298r7282J27569L00395L40416K01104k7846k28177l31978k77852
203c90054q1609J34518K84677L23901J95182m6951k42466l12246k52745o7843
213d55636J54889K87501K88839J65291m8481k37503l00960k33618o0102J56554
223b83226K92742K78648J39265o6279k40769k88987k05920l6698J60739K82075
233C1590K57617J21835o6209k36880k86954j89687j7303J64065K79851K46716
243C04641R1148q6032k27283k73749j76520L462J65452K60008K37440Q6233j00655
254B84145k28531k59062j64193K0252J81941K50719K13193P0303j09735k24088
264C4944k36971j48722K0982J82702K46843K00101N9948j19047k31361k25424
$$ plain form
274 -216005 -342023 -307819 -121597 115656 291010 336942 224204 -1272 -220443 -332230
284 -332230 -291689 -106467 132826 297179 318834 197556 -20280 -228459 -320489 -264956 -90032
295 -90032 132154 290337 306327 180973 -31351 -234002 -318379 -247034 -65356 146324 289347
306 289347 289158 154636 -45437 -227297 -302707 -229645 -50759 149646 284657 281495 138384
317 138384 -64723 -233004 -293094 -210860 -28998 158292 271016 259985 122857 -72178
327 -72178 -229619 -281849 -200378 -18089 169576 271007 245779 103571 -88462 -231498 -262913
338 -262913 -175289 -4328 169733 260571 230187 93125 -92456 -233568 -258210 -161331 9941
349 9941 177177 255836 210237 70287 -100934 -226452 -243254 -145758 17139 174497 250566
$$ packed form
274b16005j26018L4204J86222K37253J75354M5932j12738k25476k19171j11787
284c32230M0541J85222K39293J64353K1655j21278k17836k08179r2030N5533J74924
295i0032K22186J58183J5990j25354k12324k02651q4377P1345J81678K11680J43023
306B89347j89j34522k00073j81860p5410P3062J78886K00405J35011l162j43111
317A38384k03107j68281o0090Q2234J81862J87290J12724j1031j37128j95035
327g2178j57441n2230Q1471J82289J87665J01431k5228j42208j92033j43036l1415
338b62913Q7624J70961J74061R0838l0384j37062j85581j41112k4642R6879J71272
349I941J67236P8659m5599j39950j71221j25518j6802R7496J62897J57358P6069
$$ plain form
360 250566 203029 58589 -110662 -227010 -232959 -125717 36342 177579 237002 184430 44786
371 44786 -112648 -217915 -222514 -118494 42744 180858 233237 173764 29076 -125220 -215083
382 -215083 -204998 -99346 53641 178293 218787 159711 23122 -127136 -213854 -198027 -89692
393 -89692 62150 182308 211206 141016 6500 -131639 -205815 -181800 -76029 65155 178383
404 178383 205934 134885 926 -134774 -204548 -171586 -58062 78874 179279 194614 116535
415 116535 -12526 -133647 -195092 -163288 -52499 80573 175776 188919 107863 -25585 -142018
426 -142018 -190450 -149972 -37468 89479 170875 175201 97840 -29036 -140630 -184312 -142750
437 -142750 -31018 97500 174740 166790 82174 -41755 -144374 -175065 -125748 -20140 97798
$$ packed form
360B50566m7537j44440j69251j16348n949J07242J62059J41237N9423n2572j39644
371D4786j57434j05267m599J04020J61238J38114N2379n9473j44688j54296q9863
382b15083J0085J05652J52987J24652M0494n9076j36589j50258q6718J5827J08335
393h9692J51842J20158K8898p0190j34516j38139p4176K4015J05771J41184J13228
404A78383K7551p1049j33959j35700o9774L2962J13524J36936J00405J5335p8079
415A16535j29061j21121o1445L1804J10789J33072R5203J3143q1056j33448j16433
426a42018m8432M0478J12504J26947Q1396M326p7361j26876j11594m3682M1562
437a42750J11732J28518P7240p950q4616j23929j02619l0691M9317J05608J17938
$$ plain form
448 97798 169800 159608 75941 -43675 -144291 -172922 -117140 -8038 105691 169291 148340
459 148340 58981 -53026 -142153 -166023 -109328 -2754 103566 163235 143067 50939 -62836
470 -62836 -145285 -160524 -97661 11093 110065 157650 133254 43773 -64503 -139084 -151039 -92271
482 -92271 15145 115084 157257 125811 33971 -74577 -143374 -143115 -78333 23516 114286 148760
494 148760 114924 28568 -74626 -142406 -139339 -70963 30452 118897 148197 104761 14682 -81009
506 -81009 -139307 -130615 -61467 34232 114924 142041 99609 9409 -85269 -140223 -126056 -49963
518 -49963 46608 119390 137043 89554 1046 -84742 -131499 -117489 -45407 48741 118597 133425
530 133425 84444 -7045 -93216 -132839 -111028 -36730 55067 117264 122723 73589 -10527 -92148
$$ packed form
448I7798P2002j0192q3667j19616j00616k8631N5782J09102J13729O3600k0951
459A48340q9359j12007q9127k3870N6695J06574J06320N9669k0168r2128j13775
470f2836q2449j5239O2863J08754R8972M7585k4396q9481j08276p4581j1955N8768
482i2271J07416R9939M2173l1446r1840j08548o8797K59O4782J01849R0770L4474
494A48760l3836q6356j03194o7780L067O8376J01415Q8445K9300m3436r0079r5691
506h1009n8298Q692O9148R5699Q0692K7117m2432r0200r4678n4954J4167P6093
518d9963R6571P2782J7653m7489q8508q5788m6757J4010P2082R4148O9856J4828
530A33425m8981r1489q6171l9623K1811P4298R1797O2197N459m9134q4116q1621
$$ plain form
542 -92148 -129482 -104689 -30635 59099 120510 122023 65374 -20279 -95456 -124899 -94859 -21198
554 -21198 61398 114887 114259 60206 -22064 -95348 -123869 -91428 -14158 69033 117752 109290 50086
567 50086 -29945 -94966 -116073 -81883 -9162 66783 112265 105807 46989 -35814 -99782 -115513
579 -115513 -76998 -2151 72087 109490 95524 38422 -36978 -95446 -108801 -71473 425 74115
591 74115 112037 94818 32582 -44158 -98398 -103823 -60638 8625 73643 104784 86292 27650
603 27650 -43822 -96032 -102844 -59093 12778 77861 105508 81312 18369 -50561 -94426 -94698 -50389
616 -50389 17010 75367 99591 77583 16509 -53194 -96284 -93180 -45317 24126 79958 96212
628 96212 68125 8632 -54382 -90643 -85270 -40942 24402 79397 95593 66549 5431 -59433
$$ packed form
542i2148l7334K4793P4054Q9734O1411J513n6649q5653p5177k9443L0040P3661
554b1198Q2596N3489o28n4053q2270p3284k8521L2441P7270Q3191M8719q462n9204
567E0086q0031o5021k1107L4190P2721P5945M5482o458n8818q2803o3968j5731
579a15513L8515P4847P4238L7403j3966n7102p5400n8468j3355L7328P1898P3690
591G4115L7922j7219o2236p6740n4240n425M3185O9263O5018L1141j8492n8642
603B7650p1472n2210o812M3751P1871O5083K7647k4196o2943o8930m3865k72M4309
616e0389O7399N8357K4224k2008o1074o9703m3090L104M7863O9443N5832J6254
628I6212k8087n9493o3014l6261N373M4328O5344N4995J6196k9044o1118o4864
$$ plain form
640 -59433 -93586 -80698 -31544 30927 78914 88535 57110 1100 -56830 -90136 -79158 -30053
652 -30053 32447 80563 89441 52896 -7150 -61205 -86664 -71249 -22076 35098 76090 83521
664 83521 50723 -7043 -60930 -86780 -70844 -18404 41685 78975 79436 42541 -14391 -62167
676 -62167 -80347 -63352 -16211 39891 76236 76862 41663 -15813 -65672 -81450 -58630 -9141
688 -9141 45124 76328 70192 33706 -17965 -62778 -77372 -55078 -7610 45127 77339 69970 28893
701 28893 -24239 -66062 -75253 -47704 -234 46118 72321 64135 25431 -23954 -63295 -74206
713 -74206 -47424 2907 50092 73408 61259 18710 -30770 -63648 -68060 -41064 5614 48426
725 48426 68949 58410 18611 -31428 -65026 -67312 -37468 11248 53309 68011 52093 13269
$$ packed form
640e9433l4153J2888M9154O2471M7987R621l1425n6010n7930l3306J0978M9105
652c0053O2500M8116Q878l6545o0046n4055k5459J5415M9173N7174M0992P431
664H3521l2798n7766n3887k5850J5936N2440O0089L7290M61l6895n6932m7776
676f2167j8180J6995M7141N6102L6345O26l5199n7476m9859j5778K2820M9489
688i141N4265L1204o136l6486n1671m4813j4594K2294M7468N2737L2212p369m1077
701B8893n3132m1823r191K7549M7470M6352K6203q186l8704m9385l9341j0911
713g4206K6782N0331M7185K3316j2149m2549m9480l2878m412K6996M6678M2812
725D8426K0523j0539l9799n0039l3598k286K9844M8716M2061J4702j5918l8824
$$ plain form
737 13269 -32231 -61567 -61647 -34309 10122 51594 67522 50530 9746 -36641 -65100 -60469 -28282
750 -28282 15141 51493 63069 44330 6310 -34704 -61146 -58125 -26512 17213 53243 64106
762 64106 42736 1428 -38469 -59939 -53120 -20918 19793 50681 59178 39732 506 -38780
774 -38780 -59634 -52433 -18808 24226 53953 57478 34561 -4532 -40353 -56048 -46338 -15635 23112
787 23112 51177 54658 32294 -6385 -43083 -58257 -45018 -11183 27156 51756 50860 26529 -9089
800 -9089 -40751 -53522 -40667 -8627 28259 52778 51824 25359 -12384 -43066 -52754 -36692 -3694
813 -3694 29561 48731 45823 21175 -13715 -42284 -51652 -36741 -3398 31773 50567 44719 17535
826 17535 -17721 -43419 -47897 -30654 271 31209 47431 41545 16289 -17569 -43739 -48362 -29500
$$ packed form
737A3269m5500k9336q0K7338M4431M1472J5928j6992m0784m6387k8459M631L2187
750b8282M3423L6352J1576j8739l8020m1014k6442L021L1613M3725L6030J0863
762F4106k1370m1308l9897k1470O819L2202M0711L0888Q497j9446l9226l9286
774c8780k0854P201L3625M3034K9727L525k2917l9093l5821j5695R710L0703L8747
787B3112K8065L481k2364l8679l6698j5174J3239L3835L8339K4600q96k4331l5618
800i089l1662j2771J2855L2040L6886K4519r54k6465l7743l0682r688J6062L2998
813c694L3255J9170k908k4648l4890k8569r368J4911L3343L5171J8794n848k7184
826A7535l5256k5698m478J7243L0925L0938J6222n886k5256l3858k6170m623J8862
$$ plain form
839 -29500 3110 34019 47911 38162 11373 -19571 -41313 -43572 -25260 4656 33167 47273
851 47273 38523 10904 -21493 -43426 -43981 -22611 8546 33912 43237 32399 6205 -22459 -40964
864 -40964 -41589 -22645 8038 34604 44191 32516 4531 -25277 -41536 -37630 -16517 12116 34647
877 34647 40961 29172 3955 -24144 -40868 -37656 -16403 13313 36669 40966 25315 -1144 -26564
890 -26564 -39135 -32927 -12356 13474 34006 39046 25109 -818 -26964 -40648 -33634 -9891 17325
903 17325 35429 36506 19957 -5012 -26781 -37000 -30576 -9352 16370 34660 36911 20693 -6141
916 -6141 -29015 -37141 -27415 -4665 19549 33643 32755 17522 -6239 -27346 -35755 -27704 -5858
929 -5858 19854 35389 32884 14554 -10453 -29837 -34200 -22735 -2078 19381 32268 30175 14117
$$ packed form
839b9500L2610L0909J3892r749k6789l0944k1742k259J8312K9916K8511J4106
851D7273q750k7619l2397k1933n55K1370L1157K5366R325j0838k6194k8664j8505
864d0964o25J8944L0683K6566R587j1675k7985k9808j6259L906K1113K8633K2531
877C4647O314j1789k5217k8099j6724L212K1253K9716K3356M297j5651k6459k5420
890b6564j2571O208K0571K5830K0532N040j3937k5927k6146j3684P014K3743K7216
903A7325J8104J077j6549k4969k1769j0219O424K1224K5722J8290K251j6218k6834
916f141k2874q126R726K2750K4214J4094q88j5233k3761k1107q409Q051K1846
929e858K5712J5535k505j8330k5007j9384m363J1465K0657K1459J2887k093j6058
$$ plain form
942 14117 -8884 -28775 -34754 -22888 -42 22610 34102 28492 9644 -12238 -27920 -31142 -20058
955 -20058 289 20626 32268 28444 9889 -13593 -30235 -32013 -18124 4227 23073 30271 24088
968 24088 7045 -13128 -27202 -29145 -17662 3231 23464 32122 25006 5680 -16252 -29301 -27583
981 -27583 -13419 6170 22800 28561 21387 4887 -14759 -28393 -27965 -13653 7109 24711 29888
994 29888 19657 894 -17108 -27041 -24450 -10671 7318 22193 27648 19601 1198 -17938 -28785
1007 -28785 -25636 -9375 10862 24488 26248 16069 -1212 -17124 -24734 -21638 -8152 10354 24550
1020 24550 27233 17005 -1773 -19579 -26625 -20744 -5707 11835 23024 22802 12729 -3185 -19022
1033 -19022 -26369 -21137 -6309 11754 24647 24309 11567 -5569 -19638 -24215 -16720 -2184 12662
$$ packed form
942A4117k3001j9891n979J1866K2846K2652J1492n610j8848k1882j5682l222J1084
955b0058K0347K0337J1642l824j8555k3482j6642j778J3889K2351J8846P198o183
968B4088j7043k0173j4074j943J1483K0893K0233Q658p116j9326k1932j3049J718
981b7583J4164J9589J6630N761p174j6500j9646j3634M28J4312K0762J7602N177
994B9888j0231j8763j8002r933K591J3779J7989J4875N455q047j8403j9136j0847
1007b8785L149J6261K0237J3626J760j0179j7281j5912p610L096J3486J8506J4196
1020B4550K683j0228j8778j7806p046N881J5037J7542J1189k22j0073j5914j5837
1033a9022p347N232J4828J8063J2893l38j2742j7136j4069m577P495J4536J4846
$$ plain form
1046 12662 22696 22642 11566 -4737 -19054 -25018 -18141 -1715 14854 23788 21498 8631 -7564
1059 -7564 -18869 -21830 -14974 -645 14245 22688 21270 9291 -8001 -20876 -23164 -14773 750
1072 750 15188 20829 16658 5438 -9274 -20287 -21854 -14281 4 15256 22990 18837 6046
1085 6046 -9359 -19946 -19552 -9335 4467 16659 21665 16806 5012 -8733 -19306 -20602 -11233
1098 -11233 3207 16084 21215 15027 1300 -12070 -19890 -18838 -8951 4392 15258 19878 15244
1111 15244 2630 -11339 -19951 -19312 -8672 6257 16853 18823 12107 -513 -12575 -18409 -16642
1124 -16642 -7698 5656 16706 20004 14261 1435 -12030 -18489 -14914 -4006 9092 17921 18203
1137 18203 10913 -536 -12267 -18715 -16439 -6806 6033 16000 17153 8804 -4008 -15108 -19237
$$ packed form
1046A2662J0034n4j1076j6303j4317n964O877J6426J6569Q934k290j2867j6195
1059g564j1305k961O856J4329J4890Q443j418j1979j7292j2875k288Q391J5523
1072G50J4438N641m171j1220j4712j1013j567P573J4285J5252P734m153j2791
1085F046j5405j0587L94J0217J3802J2192N006m859j1794j3745j0573j296R369
1098a1233J4440J2877N131o188j3727j3370p820J052R887J3343J0866M620m634
1111A5244j2614j3969q612O39J0640J4929J0596J970o716j2620j2062n834J767
1124a6642Q944J3354J1050L298n743j2826j3465o459L575J0908J3098Q829K82
1137A8203p290j1449j1731o448K276R633J2839R967J153q349j2812j1100m129
$$ plain form
1150 -19237 -14151 -3326 8105 15936 16900 9884 -1392 -12130 -17526 -13742 -2382 10197 17906
1163 17906 16891 7648 -4711 -13816 -16483 -11844 -1726 8985 15865 16049 8540 -3642 -13893 -16963
1177 -16963 -11366 212 11464 16579 13855 5115 -5664 -14039 -16461 -12044 -2397 8617 15191 13634
1191 13634 4558 -7447 -15924 -16265 -8780 2119 11601 15826 13277 5660 -4095 -11956 -14043 -8555
1205 -8555 2148 12519 16954 13088 2959 -8151 -14733 -14373 -7859 1500 9824 13652 11008 3018
1219 3018 -7356 -14735 -14897 -7495 3523 12664 15050 9937 777 -8186 -13461 -12810 -6667 2217 10436
1234 10436 14153 10497 1152 -8904 -14638 -12851 -4171 5975 12930 14204 9483 1198 -6687 -11497
1248 -11497 -11224 -4726 4927 12445 14097 8618 -1795 -11141 -14515 -11663 -4358 4305 9950 10754 7040
$$ packed form
1150a9237N086J0825J1431P831R64p016j1276j0738n396L784J1360J2579P709
1163A7906j015r243j2359r105k667M639J0118J0711O880J84p509j2182j0251l070
1177a6963N597J1578J1252N115k724q740j0779q375k422M417R647J1014O574j557
1191A3634r076j2005q477l41P485J0899R482M225k549p617r755p861k087N488
1205h555J0703J0371M435l866j0129j1110o582L60O514R359Q324L828k644p990
1219C018j0374p379j62P402J1018R141K386n113r160q963n275O51O143Q884Q219
1234A0436L717l656r345j0056n734J787Q680J0146O955J274m721q285p885m810
1248a1497K73O498R653P518J652n479j0413r346l374K852P305Q663N645Q04l714
$$ plain form
1263 7040 -763 -9248 -13467 -11348 -3542 6738 13654 13167 6794 -1867 -9265 -11619 -8330 -2061 5504
1278 5504 11486 12031 6687 -1753 -9964 -13464 -9437 -892 7443 12381 11278 4876 -2631 -8531 -11287
1293 -11287 -8545 -1364 6276 11454 11338 4534 -4909 -11515 -12894 -8445 -235 6870 9873 8977 3821
1308 3821 -3548 -9168 -10921 -7676 322 8982 12956 10921 4139 -4415 -9814 -9574 -5304 1031 7459
1323 7459 10430 8583 3138 -4678 -11100 -11711 -6638 1130 8434 11081 7599 1220 -5213 -9546 -9514 -5057
1339 -5057 1171 7373 10866 8568 1728 -5776 -10931 -10529 -4479 3054 8243 9794 6927 702 -5236
1354 -5236 -8742 -8878 -4281 3068 9078 11023 7962 743 -6515 -9706 -8238 -3133 3420 7861 8535
1369 8535 5761 31 -6627 -10227 -9285 -4158 3354 9060 9497 5234 -1129 -6962 -9003 -6772 -1965
$$ packed form
1263G040p803q485m219K119P806J0280O916m87o373q661p398k354L289O269P565
1278E504N982N45n344q440q211l500M027Q545Q335M938j103o402p507n900k756
1293a1287K742P181P640N178j16o804r443o606j379M449Q210P105L003q96n156
1308C821p369n620j753L245P998Q660L974k035o782q554n399K40M270O335O428
1323G459K971j847n445p816o422o11N073P768P304K647l482o379o433m333L2M457
1339e057O228O202L493k298o840p504n155M02O050P533N189J551k867o225n938
1354e236l506j36M597P349O010J945l061p219p258l191J468N105O553M441O74
1369H535k774n730o658l600R42N127P512N706M37m263o363n833k041K231M807
$$ plain form
1384 -1965 3661 8303 9280 5860 -72 -6426 -9863 -7799 -1749 4771 8860 8666 4033 -1908 -6438
1399 -6438 -8435 -6775 -1759 4195 8384 8973 4853 -1911 -7548 -9224 -6437 -487 5098 7839 7081
1414 7081 3406 -2064 -6720 -8512 -6694 -1454 4938 8822 8072 3361 -3044 -7719 -8026 -4607 415
1429 415 5236 7832 6890 3279 -2107 -6868 -8500 -5620 176 5814 8531 6702 1640 -3676 -6985
1444 -6985 -7339 -4378 342 4883 7565 6914 2505 -3419 -7648 -8090 -4142 1801 6464 7562 5436 1093
1460 1093 -3578 -6339 -6556 -4151 554 5638 7832 6124 1295 -4523 -7918 -6917 -2834 2010 5736
1475 5736 6715 4635 895 -3459 -6754 -6869 -3443 1905 6548 8023 5028 -266 -4726 -6707 -5540
1490 -5540 -1981 2070 5087 6408 4864 612 -4192 -7226 -6775 -2469 3208 6652 6584 3562 -1061 -4697
$$ packed form
1384a965N626M642R77l420n932o354l437K064O050O520M089j94m633n941m530
1399f438j997J660N016N954M189N89m120o764n637j676K787N950N585K741p58
1414G081l675n470m656j792J818N240O392L884p50m711o405m675l07L419N022
1429D15M821K596r42l611n386m761j632K880N796N638K717j829n062n316l309
1444f985l54K961M720M541K682o51m409n924m229m42L948N943M663J098k126m343
1460A093m671k761k17K405M705N084K194j708m829n818l395J001M083M844L726
1475E736R79k080l740m354l295j15L426N348M643J475k995n294m460j981J167
1490e540L559M051L017J321j544m252m804l034M51M306N677L444o8l022m623l636
$$ plain form
1506 -4697 -5911 -5019 -2176 2098 5673 6573 4395 -479 -5404 -7348 -5424 -1104 3435 5891 5400 2910
1522 2910 -481 -4010 -5853 -4928 -1592 3101 6885 6969 3328 -1579 -5348 -6228 -3903 -88 3077 5024
1538 5024 5025 2679 -1145 -4795 -6761 -5430 -937 3767 6234 5468 1814 -2420 -4867 -5075 -3392 -229
1554 -229 3263 5526 5603 2923 -1715 -5477 -6221 -3801 638 4531 5624 4147 1253 -1945 -4303 -4779
1570 -4779 -3425 -223 3778 6201 5438 1785 -2721 -5749 -5496 -2514 1090 3747 4539 3453 839 -2337
1586 -2337 -5026 -5831 -3663 479 4290 5876 4318 434 -3133 -4607 -3968 -1661 1400 3909 5108
1601 5108 4453 1568 -2455 -5258 -5274 -2484 1776 4813 4997 2766 -353 -3264 -4537 -4058 -2127 790
1617 790 3902 5224 3820 389 -3382 -5453 -4415 -1227 2108 4172 4235 2347 -327 -2824 -4605 -4379
$$ packed form
1506d697j214Q92K843M274L575R00k178m874m925j944J924M320M539K456m91k490
1522B910l391l529j843R25L336M693L784Q4l641m907l769q80K325L815L165J947
1538E024Jk346l824l650j966J331M493M704K467p66l654m234k447k08J683L163
1554b29L492K263P7k680m638l762p44K420M439L893J093j477k894l198k358m76
1570d779J354L202M001K423p63l653m506l028K53K982L604K657P92j086k614l176
1586b337k689q05K168M142L811J586j558l884l567j474O39K307L061K509J199
1601E108o55k885m023k803j6K790M260L037J84k231l119k911j273M79J931K917
1617G90L112J322j404l431l771k071J038L188L335K064O3j888k674k497j781K26
$$ plain form
1633 -4379 -1901 1615 4503 5392 3234 -619 -3567 -4410 -3194 -299 2488 4010 4227 2913 -42 -3072
1649 -3072 -4719 -4315 -1521 2394 4493 4013 1648 -1662 -4088 -4287 -3016 -944 1838 3992 4143 2612
1665 2612 -426 -3672 -4716 -3067 -132 3098 4597 3626 1203 -1124 -3125 -4034 -2888 -633 2068
1680 2068 4353 4365 1780 -1517 -3940 -4374 -2412 731 2935 3736 3288 1200 -1306 -3182 -4106 -3238 -317
1697 -317 2680 4015 3490 825 -2478 -3983 -3575 -2030 509 2713 3506 3235 1703 -1249 -3535 -3778
1713 -3778 -2262 797 3712 4348 2660 273 -2125 -3536 -3123 -1703 119 2349 3685 2980 741 -2092
1729 -2092 -4144 -3867 -1365 1330 3191 3573 2113 -86 -1770 -3080 -3283 -1687 777 2942 4007 2886
1745 2886 -140 -2759 -3706 -3014 -739 1649 2769 2990 2237 292 -1833 -3183 -3230 -1534 1495 3662
$$ packed form
1633d379K478L516K888Q89k158l853k948q43J216K895K787J522K17j314k955l030
1649c072j647M04K794L915K099m80k365l310k426j99J271K072K782K154J51j531
1665B612l038l246j044J649K935L230J499r71k423k327k001r09J146K255K701
1680B068K285J2k585l297k423m34J962L143K204Q01m48k088k506j876r24Q68K921
1697c17K997J335n25k665l303j505M08J545K539K204P93k71j532k952k286k43
1713c778J516L059K915O36j688k387k398j411M13J420J822K230J336p05k239k833
1729b092k052K77K502K695J861L82j460k199j684j310k03J596K464K165J065j121
1745B886l026k619r47O92K275K388J120K21p53j945k125j350m7J696L029K167
$$ plain form
1761 3662 3671 2001 -720 -2923 -3311 -2286 -753 1104 2584 2903 2053 113 -2483 -3757 -2960 -635 1984
1778 1984 3563 3050 1187 -684 -2151 -2724 -2156 -685 1224 3019 3436 1951 -777 -3070 -3706 -2279
1794 -2279 190 2068 2782 2307 916 -652 -2061 -2859 -2498 -634 1788 3442 3222 1168 -1323 -2973
1810 -2973 -2887 -1495 354 1821 2574 2433 1313 -606 -2480 -3276 -2244 89 2396 3349 2335 323
1826 323 -1586 -2438 -2262 -1403 43 1555 2645 2713 1211 -1257 -3113 -3190 -1653 811 2544 2650 1668
1843 1668 166 -1208 -2157 -2318 -1656 59 2067 3111 2514 579 -1780 -2981 -2246 -598 1019 2104
1859 2104 2207 1576 508 -1023 -2529 -2868 -1655 489 2479 3102 1668 -475 -2029 -2543 -1912 -524
1875 -524 747 1646 2344 2045 511 -1340 -2729 -2597 -862 1431 2571 2452 1232 -553 -1643 -1971 -1883
$$ packed form
1761C662Rj670k721k203l88J025J533J857J480L19q50j940k596j274P97K325K619
1778A984J579n13j863j871j467n73N68J471J909J795M17j485k728k293o36J427
1794b279K469J878P14m75j391j568j409p98L61J864K422J654k20k054k491j650
1810b973Q6J392J849J467P53j41j120j919j874p96J032K333K307R53j014k012
1826C23j909q52J76Q59J446J512J090O8j502k468j856p7J537K464J733J06r82
1843A668j502j374r49j61O62J715K008J044n97j935k359j201P35J648J617J085
1859B104J03o31j068j531j506l39J213K144J990O23j434k143j554n14O31J388
1875e24J271Q99O98k99j534j851j389J32J735K293J140j19j220j785j090l28Q8
$$ plain form
1892 -1883 -964 693 1984 2552 1913 -84 -2207 -2679 -1821 -150 1553 2196 1700 924 -142 -1417 -2173
1909 -2173 -2044 -1043 837 2528 2491 1105 -739 -2236 -2418 -1160 144 1108 1986 1985 1178 -24 -1378
1926 -1378 -2433 -1880 -80 1539 2465 2116 441 -1150 -1761 -1822 -1406 -217 899 1693 2144 1165 -746
1943 -746 -2140 -2512 -1592 415 1906 2050 1464 452 -809 -1522 -1586 -1469 -367 1256 2192 2016 756 -1086
1961 -1086 -2300 -2012 -742 474 1602 1868 1307 616 -399 -1643 -2025 -1257 77 1633 2387 1568 -160
1978 -160 -1328 -1989 -1719 -638 266 1009 1517 1450 503 -745 -1879 -2158 -1048 817 1997 2103 1307 -133
1996 -133 -1189 -1323 -1282 -746 354 1291 1820 1584 336 -1421 -2177 -1703 -511 1014 1717 1418 713 -8
2014 -8 -871 -1554 -1533 -880 331 1706 2119 1183 -327 -1638 -2024 -1258 -40 814 1266 1265 870 150 -788 -1676
$$ packed form
1892a883R19J657J291N68o39j997k123m72Q58J671J703O43m96p76j066j275p56
1909b173J29J001J880J691l7j386j844j497j82J258J304R64Q78jq07j202j354
1926a378j055N53J800J619R26l49j675j591o11o1M16J189J116P94M51r79j911
1943g46j394l72R20K007J491J44n86j012j261p13o4J17J102J623R36j76j260j842
1961a086j214K88J270J216J128K66n61o91j015j244l82P68J334J556P54q19j728
1978a60j168o61K70J081R04P43N08o7r47j248j134k79J110J865J180J06p96j440
1996a33j056j34M1N36J100R37N29k36j248j757p56M74J192J525P03k99p05p21
2014hq63o83K1O53J211J375M13r36j510j311l86P66J218Q54M52jl95p20r38q88
$$ plain form
2034 -1676 -1599 -455 950 1971 1955 838 -656 -1380 -1378 -961 -243 583 1214 1395 1132 -84 -1439 -2036 -1499
2053 -1499 -137 1318 1772 1201 288 -599 -1064 -1175 -968 -441 633 1616 1766 949 -438 -1701 -1838 -821
2071 -821 395 1167 1295 1048 358 -266 -888 -1512 -1222 -170 1070 1812 1626 341 -1066 -1476 -1254 -532
2089 -532 321 809 1002 1104 692 -351 -1314 -1808 -1170 197 1527 1751 1045 -72 -918 -1194 -856 -525 -31
2108 -31 769 1305 1307 637 -704 -1785 -1614 -468 661 1357 1310 570 -5 -440 -953 -1250 -853 -4 1026 1776
2128 1776 1237 -41 -1175 -1514 -1079 -66 760 877 952 815 262 -423 -1110 -1422 -813 486 1466 1512 780
2147 780 -470 -1205 -1166 -762 -327 180 731 1022 1016 253 -935 -1514 -1205 -180 1055 1583 1135 395 -253 -620
2167 -620 -860 -702 -393 156 1137 1417 908 -272 -1237 -1617 -913 261 905 938 727 334 -46 -574 -928 -1114
$$ packed form
2034a676P7J144J405J021j6j117j494p24KM17P18Q26O31J81k63j216j355n97N37
2053a499J362J455M54n71r13q87m65j11K07N27J074R83J50q17j387j263j37J017
2071h21J216P72J28k47o90o24o22o24K90J052J240P42j86j285j407m10K22P22
2089e32Q53M88J93J02m12j043r63m94O38J367J330K24p06j117q46k76L38L31M94
2108c1Q00N36Ko70j341j081J71J146J129O96m7p40n75m35n13k97L97Q49J030P50
2128A776n39j278j134l39M35J013Q26J17P5j37n53o85o87l12O09J299R80M6p32
2147G80j250p35L9M04M35N07N51K91op63j188n79L09J025J235N28m48p40o48l67
2167f20k40J58L09N49R81K80n09j180r65l80P04J174O44L3k11l93l80n28l54j86
$$ plain form
2187 -1114 -363 681 1382 1268 375 -785 -1317 -1088 -561 52 490 672 793 626 45 -848 -1318 -897 176
2206 176 1282 1613 1068 183 -450 -737 -601 -371 -49 366 942 1043 437 -582 -1382 -1563 -783 317 827
2225 827 835 554 -27 -334 -649 -835 -733 -29 816 1262 1146 264 -877 -1211 -874 -199 409 770 634 563 439
2246 439 -166 -775 -945 -546 232 1280 1487 836 -20 -723 -948 -562 -187 5 369 679 479 -74 -737 -1461
2266 -1461 -1475 -525 428 921 945 383 -198 -359 -464 -502 -141 400 894 1284 1120 168 -761 -979 -820 -25 720
2287 720 769 516 233 -188 -594 -722 -863 -503 306 1064 1036 609 -225 -1019 -994 -491 -104 265 530 384 208
2308 208 -31 -782 -1274 -980 -265 597 1237 967 241 -240 -352 -390 -14 397 504 877 1152 721 1 -693
2328 -693 -1208 -863 42 573 540 292 -283 -701 -789 -797 -790 -336 372 760 934 524 -445 -932 -722 -230 396 795
$$ packed form
2187a114P51J044P01j14q93j160n32K29N27O13M38J82J21j67n81q93m70M21J073
2206A76J106L31n45q85o33k87J36K30L22M15N76J01o06j019q00j81P80J100N10
2225H27Qk81n81l07l15j86J02P04Q45M46j16q82j141l34L37O75O08L61j36p1j24
2246D39o05o09j70L99P78J048K07o51q56p03k25L86L75J92L64L10k00n53o63p24
2266a461j4R50R53M93K4n62n81j61j05l8L61N41M94L90j64r52r29k18J59P95P45
2287G20M9k53k83m21m06j28j41L60Q09P58k8m27q34p94K5N03L87L69K65j46j76
2308B08k39p51m92K94P15Q62O40k70p26m81j12l8L76M11J07L73K75m31p20o94
2328f93n15L45R05N31l3k48n75m18q8qPM54P08L88J74m10r69m87K10M92O26L99
$$ plain form
2350 795 540 328 238 -105 -611 -790 -709 -156 712 1188 841 148 -366 -765 -323 244 387 489 665 585 322
2371 322 -184 -963 -1212 -714 -20 528 590 68 -537 -717 -671 -536 -345 -21 383 858 1044 437 -351 -737 -482
2392 -482 166 900 937 618 224 -85 -288 -405 -628 -632 -96 611 862 504 -174 -881 -855 -365 176 448 519 380
2414 380 270 128 -312 -811 -876 -472 214 790 706 61 -501 -684 -525 -156 5 225 480 741 841 369 -340
2435 -340 -714 -476 274 869 888 436 -61 -463 -423 -477 -570 -476 -131 481 616 338 -420 -909 -847 -246 306 537
2457 537 466 290 188 87 -236 -544 -637 -112 555 878 741 14 -622 -670 -417 -101 265 328 368 535 566 86
2479 86 -420 -753 -484 174 758 752 268 -229 -497 -554 -363 -355 -264 126 486 475 280 -385 -861 -676 -30 457 696
2502 696 573 243 43 112 -185 -407 -342 -43 452 829 582 -68 -599 -718 -460 54 352 288 256 279 112 -160
$$ packed form
2350G95k55k12r0l43n06j79Q1N53Q68M76l47o93n14l99M42N67J43J02J76q0k63
2371C22n06p79k49M98O94N48O2n22o05j80M6J35J91L24M04M75J86o07p88l86K55
2392d82O48P34L7l19l94l09k03j17k23mN36P07K51l58o78p07K6M90N41K72P1j39
2414C80j10j42m40m99o5M04O86N76q4o45n62j83J59L69J61K20K55K61J00m72p09
2435c40l74K38P50N95J9m52m97m02M0n4r3R4L45O12J35k78p58m89O2O01N52K31
2457E37p1j76j02j01l23l08r3N25O67L23j37p27o36m8K53L16L66O3M0J67L1m80
2479H6n06l33K69O58N84om84m97k68n7J91QR1L90L60j1j95o65m76J85O46M87K39
2502F96j23l30k00O9k97k22O5K99M95L77k47o50n31j19K58N14K98o4l2K3j67k72
$$ plain form
2524 -160 -462 -656 -397 312 647 629 351 -277 -579 -411 -174 -160 107 263 355 426 189 -420 -697 -499 -73
2545 -73 509 792 403 40 -140 -324 -257 -163 -184 -38 488 663 385 -110 -582 -741 -343 169 381 370 283 33
2567 33 -53 -164 -402 -518 -159 303 622 662 214 -394 -516 -463 -152 135 249 174 275 302 30 -329 -526 -549
2589 -549 -70 572 600 284 -36 -354 -480 -217 -61 -67 151 345 493 361 -44 -597 -636 -201 273 486 491 108
2611 108 -158 -167 -225 -370 -300 -151 129 573 515 85 -471 -682 -464 6 361 324 220 193 90 -40 -224 -418
2633 -418 -398 127 535 614 376 -88 -520 -391 -108 82 133 217 308 327 290 -108 -533 -514 -183 329 642 431 -50
2656 -50 -307 -305 -288 -220 -198 -167 103 453 340 49 -437 -644 -326 153 557 489 329 122 4 -6 -128 -331 -226
2679 -226 132 522 579 231 -217 -616 -448 -108 145 180 137 146 177 149 -112 -429 -454 -187 406 665 348 -111 -356
$$ packed form
2524a60l02j94K59P09L35j8k78o28l02J68K37J4K67J56R2P1k37o09k77J98M26
2545g3N82K83l89l63j80j84O7R4k1J46N26J75k78m95m72j59L98N12K12j1q7k50
2567C3q6j11k38j16L59M62L19M0m48o08j22N3L11K87J14p5J01K7k72l59j97k3
2589e49M79O42K8l16l20l18j26K63J56oK18J94J48j32m05n53l9M35M74K13Nl83
2611A08k66rn8j45P0J49K80M44n8m30n56k11K18M70L55l7j04k7j03j30j84j94
2633d18K0N25M08P9k38m64m32J29K83J90N1Q4R1J9l7l98m25J9L31N12L13k11m81
2656e0k57KJ7O8K2L1K70L50j13k91m86k07L18M79M04o8j60k07j18j0j22k03J05
2679b26L58L90N7l48m48l99J68L40K53L5m3RL1k8k61l17k5K67N93K59l17m59k45
$$ plain form
2702 -356 -482 -302 -4 -79 -94 120 306 290 74 -334 -574 -226 324 533 533 290 -63 -43 42 -127 -226 -99 114
2725 114 384 532 151 -487 -623 -472 -183 240 242 -16 15 61 43 -118 -289 -385 -81 485 605 381 -52 -376
2747 -376 -417 -90 74 99 62 135 233 291 25 -343 -493 -182 266 591 470 83 -231 -162 -45 -68 -68 -113 -12 288
2771 288 369 -43 -393 -624 -529 -85 291 273 51 9 -34 12 -31 -223 -181 162 471 537 393 -52 -427 -341 -32
2794 -32 131 184 68 105 136 137 -136 -390 -518 -169 220 513 420 -25 -259 -286 -154 3 9 -18 39 221 216 8 -336
2819 -336 -499 -361 23 384 372 175 -43 -56 -132 8 -122 -69 121 402 472 264 -101 -434 -381 -71 152 235
2841 235 94 -23 -17 -26 -163 -333 -358 -183 196 440 369 5 -283 -285 -186 72 163 109 68 184 160 -1 -246 -392
2865 -392 -252 100 354 304 125 -108 -239 -108 -15 -42 36 137 270 348 234 -181 -418 -308 -94 140 311 168
$$ packed form
2702c56j26J80K98p5j5K14J86j6k16m08k40L48N50K09%k43l53K0Q5j69r9J27K13
2725A14K70J48l81o38j36J51K89M23Kk58L1M6j8j61j71r6L04N66J20k24m33l24
2747c76m1L27J64K5l7P3R8N8k66l68j50L11M48L25j21l87l14O9J17k3%m5J01L00
2771B88Q1m12l50k31R5M44L76j8k22m2m3M6m3j92M2L43L09O6j44m45l75Q6L09
2794c2J63N3j16L7L1Jk73k54j28L49L89K93r3m45k34k7J32J57Ok7N7J82nk08l44
2819c36j63J38L84L61j2j97k18j3p6J40j30N3J90K81P0k08l65l33N3L10K23Q3
2841B35j41j17Orj37j70k5J75L79K44p1l64k88kR9K58R1n4m1J16k4j61k45j46
2865c92J40L52K54n0j79k33j31J31R3k7P8J01J33P8j14m15k37J10K14K34J71j43
$$ plain form
2887 168 -133 -143 -150 -151 -156 -140 -95 196 445 272 80 -288 -336 -164 235 209 157 116 100 72 111 -121 -415 -158 102
2912 102 327 351 143 -305 -355 -193 -52 60 50 -19 141 292 125 -151 -289 -287 -88 306 428 155 -81 -152
2934 -152 -234 -43 4 -160 -25 181 270 252 33 -312 -339 -63 177 234 199 30 -145 19 -23 -142 -251 -142 22
2957 22 334 409 71 -265 -362 -257 44 297 111 -32 30 143 85 -21 -228 -283 84 344 370 189 -95 -371
2979 -371 -228 19 0 -46 -18 34 222 297 -60 -373 -343 -165 137 360 178 -74 -185 -34 -18 -14 -87 -165 97 341
3003 341 338 67 -210 -343 -211 94 221 95 9 37 -34 94 -67 -262 -224 62 270 377 215 -163 -324 -147
3025 -147 29 80 55 -44 -22 139 142 -70 -281 -370 -110 264 453 247 -85 -164 -69 72 74 -69 -76 69 262 274 108
3050 108 -293 -397 -198 150 219 108 -27 -141 -16 45 -53 -222 -178 29 321 425 128 -175 -350 -151 64
$$ packed form
2887A68l01j0pjnJ6M5K91K49j73j92l68m8J72L99k6n2m1j6k8L9k32k94K57K60
2912A02K25K4k08m48n0J62J41J12j0o9J60J51j67k76j38KJ99L94J22k73k36p1
2934a52q2J91M7j64J35K06Q9j8k19l45k7K76K40N7l5j69j75J64m2j19j09J09J64
2957B2L12P5l38l36r7J05L01K53j86j43O2J13n8j06k07n5L67K60K6j81k84k76
2979c71J43K47j9m6K8N2J88P5l57l13L0J78L02K23j82k52j11J51J6Mp3p8K62K44
3003C41lk71k77j33J32L05J27j26q6K8p1J28j61j95L8K86K08J07j62l78j61J77
3025a47J76N1k5r9K2J61Lk12k11q9K60L74J89k06l32p9R5J41Kj43pJ45J93J2j66
3050A08m01j04J99L48O9j11j35j14J25O1r8j69M4K07K92J04k97l03j75J99K15
$$ plain form
3071 64 249 160 25 -11 88 136 -99 -252 -298 -37 245 370 197 -82 -158 -138 62 84 35 -20 42 219 165 -32
3095 -32 -261 -369 -193 162 261 181 -43 -142 -106 29 -37 -153 -76 50 254 302 152 -118 -312 -162 75 251 238
3118 238 -11 -82 10 -1 -72 -137 -240 -66 206 241 103 -141 -255 -184 1 66 30 56 46 79 160 9 -272 -289 -80
3143 -80 145 247 232 1 -137 -127 -51 22 70 15 21 245 292 113 -107 -253 -202 76 257 184 21 -58 -143 -56 -18
3168 -18 -173 -226 -45 146 212 146 -81 -300 -248 54 109 143 89 -38 43 150 30 -146 -196 -140 43 326 233 -36
3192 -36 -163 -212 -84 80 131 -42 -37 120 122 76 -69 -247 -206 118 206 176 51 -157 -163 -26 28 -75 -53 -73 2 267
3218 267 156 -98 -275 -163 -5 225 277 84 -106 -59 6 13 -90 -146 -100 73 310 242 -35 -198 -320 -116 140
3241 140 88 -18 -78 47 33 96 -69 -252 -130 43 220 229 57 -196 -201 -46 100 68 -10 -62 22 210 150 -16
$$ packed form
3071F4J85q9j35l6R9M8k35j53m6K61K82J25j73k79p6K0K00K2m9n5O2J77n4j97
3095c2k29j08J76L55R9q0k24r9L6J35o6j16P7J26K04M8j50k70j94J50K37J76j3
3118B38k49p1R2j1p1o5j03J74K72L5j38k44j14P1J85O5l6K6j0L3Q1j51k81j7K09
3143h0K25J02j5k31j38J0P6P3M8n5OK24M7j79k20j46N1K78J81p3j63p9q5Q7L8
3168a8j55n3J81J91O6o6k27k19N2L02N5L4n4j27Q1J07j20j76n0N6J83K83r3k69
3192c6j27m9J28J64N1j73NJ57Km6j45j78M1L24Q8l0j25k08oJ37N4j03K2k0P5K65
3218B67j11k54j77J12J58K30N2j93j90M7O5Pj03n6M6J73K37o8k77j63j22K04K56
3241A40n2j06o0J25j4O3j65j83J22J73J77Rj72k53nJ55J46l2p8n2Q4J88o0j66
$$ plain form
3265 -16 -233 -229 -110 188 231 37 -89 -125 -43 87 53 -116 -109 81 220 232 8 -214 -246 21 177 120 42 -67
3289 -67 -41 91 123 -85 -230 -160 -4 192 264 12 -216 -224 -79 76 165 18 -112 -2 110 55 -8 -224 -220 -13
3313 -13 239 234 46 -126 -238 -33 161 73 -95 -19 90 243 274 38 -234 -243 30 148 215 59 -133 -176 -11
3336 -11 22 -83 -141 -252 -47 191 171 13 -206 -248 -96 113 175 47 9 37 76 140 -9 -181 -167 -6 234 175
3360 175 55 -190 -167 -53 63 11 -20 -56 -27 153 202 18 -209 -164 -113 125 241 59 -122 -141 -92 17 27 -122
3384 -122 -156 -5 138 96 17 -118 -236 -24 187 190 146 36 3 85 165 43 -58 -132 -26 136 211 85 -178 -215
3408 -215 -177 -20 87 -12 -113 -151 115 52 -7 -70 -167 -60 142 195 83 -128 -185 -110 17 37 -107 -75 -21 125
3432 125 213 54 -142 -155 -22 147 257 189 13 -35 59 126 84 -55 -120 -93 88 88 2 -155 -284 -170 -43 56
$$ packed form
3265a6k17MJ19K98M3j94j26l6Q2J30l4j69PJ90J39J2k24k22l2K67J56n7p8j09
3289f7K6J32L2k08j45P0J56J96P2k52k28qJ45J55Q9j47j30J10J12n5o3k16MK07
3313a3K52nj88j72j12K05J94q8j68P6J09J53L1k36k72rK73J18O7j56j92m3J65
3336a1L3j05n8j11K05K38k0j58k19m2J52K09O2j28l8K8L9O4j49j72J4J61K40n9
3360A75j20k45K3J14J16n2l1l6K9J80M9j84k27M5N1K38J16j82j81j9M9J09J0j49
3384a22l4J51J43m2p9j35j18K12K11Lm4j10l3Q2Q0j22j01p4J06J62P5j26k63l7
3408b15L8J57J07r9j01l8K66o3n9o3r7J07K02N3j12k11n7P5J27K0j44L2N4J46
3432A25Q8j59j96j3J33J69J10o8j76m8R4O7m2j39o5K7J81%q6j57j29J14J27R9
$$ plain form
3456 56 20 -120 -89 101 64 49 -93 -166 -21 199 235 86 -66 -126 -69 108 81 -1 -55 -18 57 60 82 -164 -190 -75
3482 -75 78 194 161 -3 -121 3 37 18 -29 -104 -70 32 77 -24 -177 -199 -165 -50 163 115 -69 -54 -29 146
3506 146 117 77 -35 9 159 193 236 19 -192 -91 83 82 47 -17 -94 -57 71 42 -111 -166 -108 -24 156 131 -18
3531 -18 -100 -119 -50 158 45 -39 -87 46 81 56 -24 -167 -173 74 96 49 38 -57 -93 52 121 36 8 47 109 206 147 9
3559 9 -190 -150 -36 89 133 -89 -253 -60 35 23 -31 -120 -157 139 139 101 20 -109 -153 76 210 70 -24 3 -14 95
3585 95 164 -52 -247 -116 32 152 180 4 -134 -74 31 80 29 -9 -110 -12 213 69 -56 -150 -155 -88 136 149
3609 149 -77 -118 -154 -25 42 4 -157 -58 86 138 112 34 -95 -62 70 128 100 65 -36 -47 119 51 -59 -167 -127
3634 -127 -22 142 163 -87 -150 -92 -29 79 65 -88 -107 32 116 47 -57 -125 -119 34 208 127 -26 -91 -114 54 95
$$ packed form
3456E6l6j40L1J90l7j5j42p3J45K20L6j49j52o0N7J77k7q2n4L7P5LK2k46k6J15
3482g5J53J16l3j64j18J24L4j9m7p5L4J02M5j01j53k2L4J15K13m8j84J5K5J75
3506A46k9m0j12M4J50L4M3k17k11J01J74jl5o4p7L7J28k9j53n5N8Q4J80k5j49
3531a8q2j9O9K08j13q4m8J33L5k5q0j43oK47K2m7j1r5l6J45O9q5k8L9O2R7n9j38
3559Ij99M0J14J25M4k22j64J93R5j2n4q9l7K96%l8q1j29m4K29J34j40r4K7j7J09
3585I5O9k16j95J31J48J20K8j76j38O0J05M9n1l8j01R8K25j44j25r4nO7K24J3
3609A49k26m1l6J29O7l8j61R9J44N2k6p8j29L3J32N8k8l5j01j1J66o8j10j08M0
3634a27J05J64K1k50o3N8O3J08j4j53j9J39Q4o9j04o8OJ53J74q1j53o5k3J68M1
$$ plain form
3659 95 -31 -62 -54 65 181 136 -49 -154 -136 16 150 123 47 -72 -37 67 85 -13 -157 -134 -14 135 108 -2
3683 -2 -92 -144 -64 89 125 -1 -82 13 102 96 11 -179 -135 27 171 132 -2 -92 -101 12 85 27 -53 -6 -15 98 155 -43
3711 -43 -84 -122 -50 103 50 63 -45 -65 -17 42 1 -45 -106 -30 92 172 -26 -90 -154 -30 139 85 39 -85 -75 48
3737 48 96 14 -136 -168 68 98 133 28 -101 -92 -43 99 74 48 -82 -57 73 88 33 -128 -118 -42 79 119 -19 -62
3763 -62 -110 -13 29 78 -75 -55 11 80 140 23 -102 -128 -9 99 78 -2 -67 -137 0 56 -25 -81 -78 -86 65 161 85 -46
3791 -46 -92 -48 98 126 74 -48 -78 57 57 43 -52 -160 -68 41 72 -12 -79 -140 -110 3 62 -2 -74 14 63 109 55 -52
3819 -52 -110 -36 70 77 24 -40 -98 -45 77 98 -71 -80 -89 68 156 52 42 -54 -57 64 139 21 -40 -84 -15 47 66 -63
3847 -63 -125 -110 -4 16 41 -83 -198 -71 46 88 40 1 -50 62 147 78 21 -56 -83 63 141 117 -41 -71 -27 11
$$ packed form
3659I5j26l1QJ19J16m5j85j05J8J52J34k7p6j19L5J04J8r8j44K3J20J49k7j10
3683br0n2Q0J53L6j26q1R5Q9oq5j90M4J62J44l9j34r0rJ13P3n8q0M7rJ13N7j98
3711d3m1l8P2J53n3J3j08k0M8N9m1m6o1P6J22Q0j98o4o4J24J69n4m6j24J0J23
3737D8M8q2j50l2K36L0L5j05j29RM9J42k5k6j30K5J30J5n5j61J0P6J21M0j38m3
3763f2m8R7M2M9j53K0O6O9O0j17j25k6J19J08k1q0o5p0J37N6q1n6LqJ51R6p6j31
3791d6m6M4J46K8n2j22l0J35%j4r5j08R2J09L1q4o7o1L0J13N9o4p2Q8M9M6n4j07
3819e2n8P4J06Pn3o4n8N3J22K1j69rrJ57Q8j04j0r6lJ21P5j18o1m4O9O2J9j29
3847f3o2J5J06K0K5j24j15J27J17M2m8l9n1J12Q5o9n7p7k7J46P8k4j58l0M4L8
$$ plain form
3873 11 76 -13 -66 -14 -17 107 94 25 -109 -107 16 91 100 6 -79 -10 -7 63 -73 -181 -86 65 65 82 -111 -145 -47 72 113
3902 113 224 -16 -78 49 155 101 21 -18 -52 51 167 56 -73 -106 -67 -34 52 18 -147 -81 -7 82 104 -37 -155
3927 -155 -62 37 132 136 44 -81 -42 84 81 8 -55 -122 19 117 92 -52 -54 -34 12 115 103 -42 -76 53 66 121 -34
3954 -34 -45 -49 54 150 63 -31 -140 -166 30 110 -17 -45 -85 -42 62 48 -11 -111 -75 49 66 165 5 -110 25 23
3980 23 135 57 -85 -50 33 94 58 -42 -122 -87 19 112 47 -50 -64 -84 70 131 14 -81 -28 -26 61 86 5 -122 -124 60
4008 60 53 38 -15 -96 -48 9 49 13 -67 -25 58 165 87 21 -77 -49 16 68 90 -49 -64 19 31 73 19 -143 -19 34 59
4037 59 79 26 -34 -74 94 117 -9 18 -43 27 37 87 68 -28 -93 -27 72 67 21 -60 -60 -25 68 49 -50 -60 49 116 33 30
4067 30 -31 -83 24 76 60 35 -76 7 29 26 12 -61 -126 -34 45 119 -7 -91 -91 3 110 56 33 -62 21 0 99 5 -89
$$ packed form
3873A1O5q9n3N2lJ24j3o9j34KJ23P5Rr4q5O9LP0j36j08R5J51%J7j93l4R8J19M1
3902A13J11k40o2J27J06n4q0l9l4J03J16j11j29l3L9L3Q6l4j65O6P4Q9K2j41j18
3927a55R3R9R5Mr2j25L9J26lp3o3o7J41R8k5j44kK0M6J03j2j45l4J29J3N5j55
3954c4j1mJ03R6q7r4j09k6J96Q0j27k8m0M3J04j4n9j00L6J24J7R9j60j15J35k
3980B3J12p8j42L5Q3O1l6j00q0L5J06R3o5r7j4k0J54O1j17r5N3KQ7K5q1j27kJ84
4008F0pj5n3q1M8N7M0l6q0M2Q3J07p8o6r8K8O5N2K2j39j5Q3J2M2n4j62J24N3K5
4037E9K0n3o0m0J68K3j26K7o1P0J0N0j9r6o5O6R9nm6q1%L5R3j9r9j0J09O7q3l
4067C0o1n2J07N2j6k5j11Q3K2lj4p3o5R2P9P4j26q4%R4J07n4k3r5Q3k1R9r4r4
$$ plain form
4096 -89 -28 -54 15 81 -48 -137 -99 -22 23 20 -24 -118 -17 71 66 10 -59 -82 -34 74 62 10 -34 -36 69 137 43 31 -66 -32
4126 -32 30 91 66 -22 -83 -8 20 104 9 -88 -26 1 108 23 -17 -90 -41 64 125 51 -55 -63 -19 108 73 -25 -81 -60 63
4155 63 103 86 -37 -90 -11 73 136 70 14 -102 -1 70 31 8 -77 -99 29 100 34 -108 -69 -98 36 107 3 -89 -19
4182 -19 -12 117 128 -50 -92 62 77 148 58 -58 -111 -31 83 111 -41 -83 -31 -1 124 72 -40 -91 -11 57 133 30
4208 30 -56 -81 -10 4 108 -20 -63 -49 63 79 -2 -46 -143 -88 23 37 23 -73 -34 -7 94 69 10 -110 -34 32 130
4235 130 81 -24 -95 -85 57 81 -17 -84 -64 -26 99 49 -3 -124 -57 54 35 94 -35 -76 -63 92 97 50 -87 -10
4261 -10 7 56 62 -82 -115 -40 85 65 82 -34 -59 51 65 32 -24 -30 -5 -6 123 42 -48 -98 -30 -15 116 45 -77 -123
4289 -123 -18 109 59 9 -71 -35 10 59 73 5 -58 -29 93 137 -39 -12 -50 -25 111 4 -58 -66 -54 4 54 61 9 -72
$$ packed form
4096h9O1k6O9O6j29q9L8P7M5lm4r4J01Q8nn6o9k3M8J08j2n2m4kJ05O8r4j2r7L4
4126c2O2O1k5q8o1P5K8Q4r5r7O2K7J07q5m0p3M9J05O1p4j06qM4J27l5r8n6K1J23
4155F3M0j7j23n3P9Q4O3o6n6j16J01P1l9k3q5k2J28P1o6j42L9k9J34P1j04r2P0
4182a9PJ29J1j78m2J54J5P1r0j16n3Q0J14K8j52m2N2L0J25n2j12n1Q0O8P6j03
4208C0q6k5P1J4J04j28m3J4J12J6q1m4r7N5J11J4j4r6L9K7J01k5n9j20P6O6R8
4235A30m9j05p1J0J42K4r8o7K0L8J25n0n2j21O7J11j9N9j29m1J3J55Nm7j37P7
4261a0J7M9Oj44l3P5J25k0J7j16k5J10J4l3n6oK5jJ29q1r0n0O8J5J31p1j22m6
4289a23J05J27n0n0q0L6M5M9J4o8o3K9J22M4j76K7l8K5J36j07o2qJ2N8N0Pn2q1
$$ plain form
4317 -72 -64 16 124 55 -60 -28 5 26 93 -20 -59 -21 54 50 70 -31 -44 -11 7 67 -19 -9 -10 11 64 75 61 -71 -7
4346 -7 22 72 11 -12 -69 -36 47 36 14 -68 -96 -30 71 56 -29 -49 -26 -13 38 -18 15 -56 -54 75 64 33 -86 -31 -29 95
4376 95 50 -20 -15 -48 15 69 75 -37 -70 11 45 56 -16 -97 2 47 62 49 -41 -143 -105 -2 54 32 -45 -69 -15 18 71 35
4406 35 -36 -34 -31 38 53 -9 -25 55 49 51 50 -96 -77 2 3 62 18 -55 -122 10 0 9 -15 -102 -7 51 83 57 -52 -91 -54 39
4438 39 36 25 -32 -48 24 50 76 -31 -72 -27 75 125 43 -77 -58 -25 74 23 45 5 -49 4 96 76 -11 -93 -24 32 47
4467 47 5 -48 -48 -26 37 75 23 -102 -23 65 80 10 -38 -59 -32 71 60 29 -28 -23 22 50 28 -37 -52 -55 36 -4 34 -64 -98
4498 -98 -31 25 66 28 -81 -72 59 40 48 -18 -63 -44 28 55 -7 -48 -28 -15 65 54 3 -30 -26 25 52 -26 -53 -111 -21 49 -2
4529 -2 -35 -50 -100 -55 43 40 -6 -21 -41 54 67 -6 -75 -55 -14 44 88 36 -75 -41 34 68 25 11 -52 -67 -10 92 -11 -56
$$ packed form
4317g2QQ0J08o9j15L2L3K1O7j13l9L8P5mK0j01j3L3J8O0q6J0jK1N3J1j4j32O4
4346gK9N0o1k3n7L3Q3j1k2q2k8O6J01j5q5k0K3J3N1n6L3p1KJ29j1l1j19N5KJ24
4376I5m5p0Nl3O3N4Oj12l3Q1L4J1p2q1R9M5J5j3r0j02L8J03N6k2p7k4N4L3N3l6
4406C5p1KLO9J5o2j6Q0oKjj46J9P9JN9m4p3o7J32j0Rk4q7R5N8L2k6j09l9L7R3
4438C9lj1n7j6P2K6K6j07m1M5J02N0q2j20J9L3R9n1K2m0n4N3R2k0q7q2O9N6J5
4467D7m2n3%K2O3L8n2j25P9Q8J5p0m8k1K7J03j1l1n7NM5K8k2o5j5lR1m0L8r8l4
4498i8O7N6M1l8j09RJ31j9Qo6m5J9P2K7o2m1K0J3Q0j1n1l3MN1K7p8k7n8R0P0n1
4529bl3j5n0M5R8lm6j5k0R5J3p3o9K0M1N8M4n2j11L4P5L4m3j4o3j5N7J02j03m5
$$ plain form
4559 -56 -26 -13 79 19 -15 -91 -85 -45 45 39 -64 -83 -6 1 61 43 -111 -47 1 50 13 10 -50 1 32 103 14 22 -86 12 -4
4590 -4 90 58 -67 -23 35 15 126 -36 -60 -29 20 95 -12 22 -95 19 16 47 -12 -37 -88 -7 50 51 -70 -24 -37 -23
4618 -23 90 -34 -26 -25 -41 2 83 44 -41 -8 29 59 42 39 -42 -55 85 86 20 -93 -57 -37 64 28 -10 -11 -92 -16 93 29
4648 29 -12 -27 -60 37 58 32 0 -66 -47 52 20 33 -44 -78 -31 9 9 -20 -67 -25 82 58 35 -17 1 39 71 76 45 -29 -39
4679 -39 -18 40 33 -31 -97 -48 51 89 -14 -51 -74 -22 30 5 -30 -47 -22 34 22 26 -30 -61 17 85 0 -36 -33 -34 -36 3 -17 -22 -26
4712 -26 -87 21 23 83 43 -45 -5 37 86 54 33 -100 33 38 63 11 -106 -62 -30 21 36 43 23 -20 67 69 51 -45 -86 77
4742 77 78 75 -33 -80 -31 20 20 46 -38 -76 -41 -32 43 11 -21 -87 -13 -1 116 -4 -4 -89 45 67 51 3 -72 -89 55 104
4772 104 26 -48 -70 24 71 71 32 -48 19 -25 36 -13 -62 -75 3 53 62 -22 -32 -57 34 19 26 -49 -60 13 1 35 31 -68 -60 -17
$$ packed form
4559e6L0J3R2o0l4p6OM0R0oj03j9P7PO0j8j54O4M8M9l7lo0N1L1P1q9Qj08R8j6
4590dR4l2j25M4N8k0J11j62k4L1M9P5j07L4j17J14lL1n9k5n1Q1N7Jj21M6j3J4
4618b3J13j24QJj6M3Q1l9q5L3L7L0j7lq1j3J40Jo6j13L6K0J01l6l8jq1P6J09o4
4648B9m1j5l3R7K1k6l2o6J9R9l2J3p7l4M7M0%k9m7M2J07k4k3n2J8L8L2Nl1p4j0
4679c9K1N8po4o6M9R9L8j03l7k3N2N2k5l5j7K5N6j2Mn6l1P8O8q5l6LjkL9k0nm
4712b6o1J08KO0m0q8M0M2M9l2k1j33J33NK5n2j17M4L2N1J5Pk0m3Q7Kj8r6m1J63
4742G7Jlj08m7M9N1%K6q4l8L5RP5l2l2o6P4J2J17j20%q5J34K2j6m8p5j7J44M9
4772A04p8p4k2R4M7%l9q0O7m4O1m9m9j3P8N0Rq4j0k5R1j5Pp5j1P3j2L4mr9QM3
$$ plain form
4804 -17 26 72 -23 -30 -23 0 40 5 -14 -54 -79 52 23 11 9 -25 33 69 73 8 -42 -4 22 32 4 -68 -49 34 55 13 -11 -71
4836 -71 -48 15 41 127 -15 -62 -62 49 91 11 40 -13 -19 46 82 18 -45 -56 19 25 39 14 -94 -34 50 65 15 -12 -16 57 112
4867 112 50 53 -17 -25 34 65 39 -54 -65 -43 56 28 8 11 -7 9 40 43 -32 -38 -85 16 53 56 27 -35 6 82 8 21 -38 21
4899 21 -31 42 29 -24 -64 -53 21 31 40 -1 -19 24 23 43 34 -4 -14 27 19 19 -7 -1 21 7 23 28 -14 -79 16 -4 14 49 -37 -5
4933 -5 0 -23 2 26 -40 -12 41 21 124 -13 -39 0 40 40 -31 -21 -23 16 25 25 -29 -62 -26 -14 42 24 -40 -46 -83 5 47 -24 -38
4966 -38 -10 -38 13 18 46 -43 -11 13 15 27 -18 29 56 61 67 15 -7 -32 -2 119 37 -18 -24 -73 9 58 35 -12 -35 -19 -33 53
4998 53 -34 3 -42 -26 62 44 -63 -45 8 -1 66 16 -44 -65 11 29 40 -8 -21 -33 0 37 29 42 -20 -17 63 109 -15 -11 -27
5029 -27 -48 62 18 -9 -48 -75 -2 96 62 -23 -23 -24 35 36 32 -47 -57 2 69 -9 -4 -37 -25 47 89 44 -20 -30 -14 20 34 8
$$ packed form
4804a7M3M6r5pPK3M0l5j9m0k5J31k9j2kl4N8L6Mo5n0L8K6J0k8p2J9Q3K1m2k4o0
4836g1K3O3K6Q6j42m7%J11M2q0K9n3oO5L6o4o3j1P5OJ4k5j08O0Q4J5n0k7mP3N5
4867A12o2Lp0qN9L1k6r3j1K2R9k8k0Lj8J6L1Lp5om7J01L7Lk9o2M1P6p4J3n9N9
4899B1n2P3j3n3m0J1P4J0Rm1j8M3jK0rl8j0M1q%k6OK2j4J6Nm2o5R5k0J8L5q6L2
4933eNk3K5K4o6K8N3k0J03j37k6L9M0%p1J0kL9R%n4l3L6J2N6j8o4ol7Q8M2p1j4
4966c8K8k8N1NK8q9L2K4KJ2m5M7K7NOn2k2k5L0J21q2n5om9Q2M9k3m7k3J6j4Q6
4998E3q7L7m5J6Q8j8j07J8N3rO7n0o0k1P6J8J1m8j3j2L3L7qJ3o2LQ0M6j24Mj6
5029b7k1J10m4k7l9k7P3R8l4q5%jN9Jmp9j0N9O7p8Nl3J2P2M2m5o4j0J6L4J4k6
$$ plain form
5061 8 -77 -55 -35 26 14 10 -34 -33 37 62 5 -25 -19 -15 33 48 -2 -19 -46 -42 20 -9 -41 -74 -14 22 51 72 -44 -42 -12 43 16
5094 16 18 -21 -53 63 22 44 12 -74 -49 40 59 -11 -49 -34 39 19 -1 -6 -68 7 -1 95 10 -51 -47 -60 51 69 -11 -10 -43 26
5126 26 19 19 12 -29 -32 28 66 -18 -59 2 4 61 7 73 -55 17 10 33 0 -6 -24 -4 58 62 15 6 -15 1 60 27 -53 -48 -53 -28 54
5161 54 9 -45 -43 -20 14 77 -14 -70 -60 8 49 3 -2 -51 -9 36 66 -4 -28 -36 -41 -12 60 27 -48 49 33 33 26 -13 -14 26 61 12
5195 12 -13 51 -64 -22 103 -40 7 -33 -19 25 39 15 -22 -12 -20 58 119 -9 -60 -4 -28 12 116 31 -52 -29 42 58
5223 58 35 33 -51 -37 1 46 14 -6 -4 -7 30 21 -29 -37 -49 -3 5 7 4 -53 10 9 10 67 17 -37 -11 27 -22 16 -3 25 6 54 26
5258 26 -29 -4 -28 33 56 22 -27 -41 -18 59 48 24 -5 -29 22 96 34 24 -6 1 -21 45 28 -23 -24 21 18 47 -19 24 -21 -11
5290 -11 33 -49 20 -22 -78 -4 44 -4 -22 -57 46 34 72 15 -3 4 17 -17 19 -16 -56 18 35 66 18 -40 -3 -52 5 33
$$ packed form
5061Hq5K2K0O1j2mm4JP0K5n7l0OMM8J5n0j7k7MO2k9l2l3O0L6K9K1j16KL0N5k7
5094A6Kl9l2J16m1K2l2q6K5Q9J9p0l8J5P3k0k0no2P5qR6q5o1Mj3J11J8q0Jl3O9
5126B6p%pm1lO0L8q4m1O1KN7n4O6j28P2pK3l3oj8K0O2Mm7rk1J6N9l3q0NnK5Q2
5161E4m5n4KK3L4O3r1n6J0O8M1m6nm9M2M5L0p0k4qnK9P2l3p5R7j6%pl9jM0L5m9
5195A2k5O4j15M2J25j43M7m0J4M4J4k4l7J0qP8O1j28n1N6k4M0J04q5q3K3P1J6
5223E8k3kq4J4L8M5l2k0KlL7rn0qj2M6QKln7O3jJN7n0n4K6L8m9L8j9K8j9M8k8
5258B6n5K5k4O1K3l4m9j4K3P7j1k4k9k4N1P4o2j0l0Pk2O6j7n1jM5lK9o6M3m5J0
5290a1M4q2O9m2n6P4M8m8j8l5J03j2L8n7j8PJ3l4L6l5m0P4J7L1m8n8L7m9N7K8
$$ plain form
5320 33 -52 -25 -59 35 54 55 1 -13 14 68 19 11 -13 -28 -12 -20 20 -4 -49 -41 2 44 16 -67 -33 -11 18 -12 -41 5 -42 -2
5352 -2 67 41 -25 -39 -63 -10 53 10 -17 -69 -17 44 55 37 -81 16 17 53 -15 -3 34 -41 31 37 50 -30 -24 42 46 4 -5 -43 -44
5385 -44 19 47 33 -58 -58 -32 17 65 60 -6 -5 -32 29 55 3 -15 -32 21 48 11 -4 -24 -13 27 57 2 -24 -71 24 21 113 29
5417 29 -14 -34 -15 50 14 -6 6 -42 39 -3 -7 25 -19 15 6 17 -21 -17 -73 -1 35 -33 27 -38 -33 11 23 0 -38 12 45 10
5449 10 26 46 -10 -9 70 34 -33 -12 -46 14 104 31 21 -51 -58 -2 29 29 -10 -48 -21 66 31 -1 -94 -14 -36 -26 -22 -41 -29 -24 18
5482 18 14 11 -15 10 -2 30 1 3 -26 -46 73 73 -20 -35 -22 -28 57 55 32 -51 -27 4 -15 18 26 -51 -13 8 -11 11 -34 -31 -66 -9
5516 -9 -10 -29 -88 -17 -19 12 -18 -63 -63 13 -14 7 61 28 -32 -6 -15 38 -30 -51 -61 30 39 57 76 -27 -38 4 3 0 -38 -11 41 -31
5550 -31 -40 6 -37 1 -30 -37 25 1 -18 -17 12 40 8 7 -62 -13 47 51 12 -58 -32 36 22 25 -58 -54 -58 52 37 -5 33 -52 -14 51
$$ packed form
5320C3q5K7l4R4J9Jn4j4K7N4m9qk4j5J6qM0k4m5QM3M2k8q3L4K2K9l0k9M6m7M0
5352bO9k6o6j4k4N3O3m3k7n2N2O1J1j8j18R7JL6o8J2L7p5P2OJ3q0OO6Mm2rl8j
5385d4O3K8j4r1%K6M9M8no6Jk7O1K6n2j8j7N3K7l7j5k0J1M0L0n5k6m7R5lR2q4
5417B9m3k0J9O5l6k0J2m8Q1m2mL2m4L4rJ1l8Mn6P2L6o8O0o5NM4J2k3l8N0L3l5
5449A0J6K0n6JP9l6o7K1l4O0R0p3j0p2pN6L1%l9l8K7Q7l5l2r3Q0k2J0Mj9J2NM2
5482A8mlk6K5j2L2k9Kk9k0J19%r3j5J3oQ5kk3q3K4L1j9L3Qp7L8K1j9K2m5Ll5N7
5516ijj9n9P1kL1l0m5%P6k7K1N4l3o0K6rN3o8k1j0R1RJ8J9j03j1M2jll8K7N2p2
5550c1rM6m3L8l1pO2k4j9JK9K8l2jo9M9O0Ml9p0K6O8j4Lq3MmJ10j5m2L8q5L8O5
$$ plain form
5584 51 74 -5 31 53 41 1 48 -28 -18 3 -25 8 28 -32 -41 -44 31 41 -29 -26 -22 -21 -16 24 4 -49 -52 -39 17 31 -17 27 23 77
5618 77 62 -17 19 -5 -22 64 44 -61 3 27 11 23 -27 -60 -45 -13 59 67 8 -30 -67 -4 17 -55 44 -12 -14 -13 -4 10 -1 -90
5650 -90 -18 -7 74 -34 -60 -24 -18 -5 29 -54 -56 2 -31 -29 -17 -35 -28 39 12 57 -22 6 -50 41 18 -18 -16 -97 -29 -47 13 8 -48
5683 -48 -50 30 76 -19 -53 -32 12 10 63 -3 5 -69 -21 39 16 25 -49 -29 64 63 -24 5 -36 9 29 1 -10 -28 24 -17 22 1 -46
5716 -46 -18 -72 33 45 24 -7 13 -14 -35 47 1 -65 -92 -56 87 63 -36 3 -41 -5 60 -37 -65 -2 -3 32 67 11 11 -62
5746 -62 35 64 41 -12 -35 -32 -10 75 9 -24 -15 -15 15 9 53 -49 -73 -39 18 46 -24 -61 -30 7 39 53 -25 -2 7 -3 2 15 -29
5779 -29 -18 5 52 -7 -10 -2 -11 55 -4 2 32 8 21 87 27 26 -61 -45 -1 27 -25 -26 -8 -11 29 10 4 20 -32 -14 -16 13 14 -56 -3
5814 -3 12 2 56 -15 -47 4 69 46 29 -22 -13 -23 29 68 -28 -12 -24 -56 12 -4 -3 -18 60 -37 -27 -17 -78 7 6 59 -8 -23
$$ packed form
5584E1K3p9L6K2j2m0M7p6J0K1k8L3K0o0rlP5J0p0LMJNM0k0n3lJ3N6J4m8M4mN4
5618G7j5p9L6k4j7Q6k0j05O4K4j6J2n0l3J5L2P2Qn9l8l7O3K1p2R9n6kJRJ4j1q9
5650i0P2J1Q1j08k6L6OJ3L4q3kN8l3KJ2j8PO7k7M5p9K8n6R1k3l6Kq1O8j8O0nn6
5683d8kQ0M6r5l4K1M4kN3o6Qp4M8O0k3Rp4K0R3jq7K9m1M5K0k8j1j8N2m1L9k1m7
5716d6K8n4J05J2k1l1K0k7k1Q2m6o6k7L6J43k4r9L9m4L6O5r7k8O3jL5L5n6%p3
5746f2R7K9k3n3k3LK2Q5o6l3R%L0oM4j02k4L4N7K8p0l7L1L7L2J4p8K3Rj0NJ3m4
5779b9J1K3M7n9lQrO6n9OL0k4J3O6o0jq7J6M4K8n2jJ8lM0j9oJ6n2J8kK9Jp0N3
5814cJ5j0N4p1l2N1O5k3j7n1Rj0N2L9r6J6j2l2O8j6Jj5P8r7J0J0o1Q5jN3o7j5
$$ plain form
5846 -23 -79 -19 -26 14 -15 21 -34 14 -50 75 -5 13 -60 -8 25 60 -8 2 21 45 2 -17 -59 -56 -17 12 58 36 -58 -49 4
5877 4 36 25 7 -43 -6 6 31 42 -44 2 -14 32 67 19 -85 -21 -55 18 12 -39 -60 -16 37 57 -12 -24 -26 29 40 20 46
5908 46 -79 22 33 21 25 2 -17 -26 36 55 -23 -30 -42 5 1 61 1 11 -51 -6 28 27 -44 -17 -29 -43 28 8 -35 -25 14 7
5940 7 -5 -44 14 -3 11 97 17 -55 28 -77 -5 10 6 -41 -72 37 116 41 1 -55 -23 -8 6 -14 -48 -34 -17 14 10 -57 -26
5971 -26 -7 84 31 29 2 -82 -44 27 21 -16 -58 -16 -37 17 56 -20 -48 -10 -26 31 43 -15 -37 13 44 -33 10 -44 -50 9 1 -25
6003 -25 4 5 -55 2 25 -2 -62 -36 -39 49 102 37 -37 20 25 17 13 11 -80 -26 50 40 27 31 -37 -51 28 47 52 -34 -49 24 93 52
6037 52 19 -47 -12 48 19 27 -74 -39 -60 22 40 16 -95 -55 14 41 0 -15 -9 57 23 44 -7 2 15 -3 14 36 -36 -65 0
6068 0 13 -23 84 -63 -56 -8 -32 29 30 -37 -78 14 19 44 -23 4 -21 44 41 32 -34 4 -16 31 70 -11 -3 1 -50 13 65 -11 -11 -23
$$ packed form
5846b3n6O0pM0k9L6n5M8o4J25q0J8p3N2L3L5o8J0J9K4m3j9m2LL9K9M6k2r4RN3
5877DL2j1j8n0L7J2K5J1q6M6j6M6L5m8j04O4l4P3on1k1M4N3K0o9j2kN5J1k0K6
5908D6j25J01J1j2Mk3j9rO2J9p8pj2M7mO0o0J0o2M5L4jp1K7j2j4P1k0m3J0L9p
5940Gj2l9N8j7J4Q6q0p2Q3j05P2J5mm7l1J09P9p5m0n6L2J5J4k0l4J4J7L1mo7L1
5971b6J9R1n3kk7q4L8P1ol7m2M2k1N4L9p6k8L8j6N7J2n8k2N0L1p7M3n4oN9qk6
6003b5K9Jo0N7K3k7o0K6lQ8N3o5p4N7Nqmkr1N4P6j0j3Mo8j4P9J9Nq6j5P3O9m1
6037E2l3o6L5O0k9Qj01L5k1Q2J8k4j11M0O9K7m1j5OO6l4K1n1RJ3j8J7K2p2k9O5
6068@J3l6J07j47PM8k4O1Jo7m1R2NK5o7K7k5O5lro6L8k0M7L9q1QMn1O3N2p6%j2
$$ plain form
6102 -23 -17 14 24 -20 -46 -40 25 -8 0 -14 -1 -24 -12 18 22 -52 -8 6 14 23 -66 -17 28 -19 47 26 -47 26 -38 -36 6 -12 -37 0
6136 0 29 22 -1 -11 -28 -7 27 -30 -47 -31 -20 2 -5 16 21 -62 -25 -34 22 -16 -51 -50 -10 -21 -45 -27 -56 -39 20 52 54 13 10 3 -21
6171 -21 41 10 16 -52 7 60 35 29 -82 9 -27 10 22 -29 -27 -37 41 14 -38 -74 -63 -4 56 78 8 48 -22 -8 16 27 6
6202 6 -65 -59 24 67 -17 17 -49 6 -5 1 75 -18 -35 -11 32 -37 0 -22 -60 34 1 -81 -63 -52 -1 32 -2 -15 -21 -16 14 59 30
6235 30 6 -37 -23 51 17 -13 -31 -23 -17 33 -16 -29 -68 -47 28 44 30 -34 5 -31 22 -57 65 4 28 3 35 -38 -21 -8 -35
6266 -35 35 10 73 -36 -45 23 60 24 -13 -17 -27 27 1 -30 19 31 -28 -10 -3 -42 -9 -37 -4 8 21 7 -58 -5 90 51 -15
6297 -15 -30 -27 5 8 -4 7 -19 -16 24 1 27 -25 -79 -48 -7 -14 8 -34 -63 18 18 -19 26 -54 -2 17 14 39 7 -41 0 1 16 -33
6331 -33 -48 -9 -3 16 20 -19 -36 4 44 53 84 -12 6 46 -14 -11 -35 -13 -60 25 65 25 -28 -75 -45 -3 15 -6 -43 -59 74 -38
$$ packed form
6102b3OL1J0m4k6OO5l3Qj4J3k3J2L0Mp4M4J4QRq9M9M5m7O6k1p3P3o4KM2j8k5L7
6136@K9pk3j0j7K1L4n7j7J6J1K2pK1Nq3L7rN6l8l5JM0j1k4J8k9J7N9L2Km1lpk4
6171b1O2l1Oo8N9N3k5oj11R1l6L7J2n1Kj0P8k7n2l6J1N9O0K2p0M0p0J4K4J1k1
6202Fp1OQ3M3q4L4o6N5j1OP4r3j7K4M3o9L7k2l8R4l3q2J8J1N1L3l4j3oNL0M5k9
6235C0k4m3J4P4l4l0j8QON0m9j3l9K1P5J6j4o4L9l6N3p9J22o1K4k5L2p3J7J3k7
6266c5P0k5O3j09rO8L7l6l7mj0N4k6l1M9J2n9J8Pl9L3k8L3J2J3j4o5N3R5l9o6
6297a5j5LL2Lj2J1k6LM0k3K6n2n4L1M1pK2m2k9Q1%l7M5q0N2J9lK5l2m8M1JJ5m9
6331c3j5L9OJ9Ml9j7M0M0RL1r6J8M0o0Lk4K2m7Q5M0m0n3m7L0M2J8k1l7j6J33j12
$$ plain form
6363 -38 6 12 -84 -33 13 56 -46 22 -30 18 -10 55 -1 -17 -22 -14 41 29 26 -51 6 81 63 4 74 -80 -47 -33 -36 -26 -31 -27 -19
6396 -19 43 -9 -5 -31 -28 23 32 33 13 -2 -17 -7 14 9 -19 -34 -66 23 36 -6 -42 -16 22 39 -10 0 -50 0 -32 50 17 -37 13
6429 13 -66 73 7 13 -1 40 -3 42 -12 -14 -5 -39 -14 8 -91 -14 -11 30 -16 18 -19 -34 8 25 70 12 -43 -15 -3 -14 13 -15
6461 -15 -8 16 61 18 60 49 -5 -1 46 54 16 9 -22 48 6 32 -4 8 -2 -8 51 44 8 -58 -27 22 133 4 -33 -4 -35 4
6493 4 38 18 2 -21 13 30 32 -27 -60 -22 -8 37 17 -15 21 27 45 10 17 20 19 18 17 -6 -30 -58 -36 15 31 57 -20 -17 15 0 17
6528 17 8 16 -14 43 5 -43 21 20 -5 -50 3 -57 -34 17 30 41 31 26 -32 -14 34 70 -2 -16 33 -12 37 -18 -7 -112 -32 -27
6560 -27 30 25 -58 -41 -7 -41 -13 -5 28 7 3 -7 -21 -52 -37 20 -21 27 40 16 -41 23 -17 38 -19 -10 -36 55 48 33 -37 -10 -19
6593 -19 15 49 -6 42 -25 -18 4 21 -25 -1 20 29 61 28 -6 -37 -19 1 40 -20 -40 -6 -41 13 11 9 -28 6 -43 -4 -46 -22
$$ packed form
6363c8M4Or6N1M6M3j02O8n2M8k8O5n6j6nQN5j2lp7N7P5j8n9P0j54L3J4lJ0nMQ
6396a9O2n2Mk6LN1RJk0j5j5J0K1nk8j5l2Q9J3m2l6K6L8J7m9J0n0N0l2Q2l3n4N0
6429A3p9J39o6Oj4M1m3M5n4kRl4K5K2r9P7LM1m6L4l7j5M2J7M5n8n5K8J2j1K7k8
6461a5PK4M5m3M2j1n4MM7Ql8pl1P0m2K6l6J2j0oN9pl6o6L1M9J11j29l7K9l1L9
6493DL4k0j6k3L4J7Kn9l3L8J4M5k0l2L6OJ8l5PLjjjk3k4k8K2N1J6K6p7LL2j5J7
6528A7rQl0N7l8m8O4jk5m5N3o0K3N1J3J1j0nn8J8M8L6p2j4M9m5M9n5J1j05Q0N
6560b7N7nq3J7L4l4K8QL3k1mj0j4l1J5N7m1M8J3k4n7O4m0N5n7Rk6R1pj5p0K7r
6593a9L4L4n5M8o7PK2J7m6K4K1RL2l3l4l1J8K0L9o0k0L4l5N4kkl7L4m9L9m2K4
$$ plain form
6625 -22 -52 -28 25 14 6 11 -36 -6 21 29 -16 21 0 -6 20 67 -24 -69 -4 -7 20 -31 -20 -54 33 -5 63 34 12 8 0 0 -6 -15 -11 -64
6661 -64 0 20 -20 -41 28 3 -20 -50 -50 -49 -52 25 27 27 0 -14 5 41 -13 43 28 -13 4 21 35 -29 -26 2 51 66 12 -28 -61
6694 -61 6 57 65 -2 0 -35 39 30 -2 30 -21 -20 18 35 1 -6 -28 45 -28 19 -22 -30 6 -21 6 -20 22 -34 1 17 -24 3 -21
6727 -21 1 7 1 44 21 24 11 -11 -92 -2 -47 40 -23 23 51 10 -42 -26 -36 7 32 -14 -63 -63 3 69 30 14 6 -36 19 61 26
6760 26 -9 -26 43 53 -30 -37 41 -43 -6 35 19 -13 3 -13 33 9 -16 -20 -95 71 14 -13 -3 6 -22 23 2 64 -35 -35 6 12
6792 12 46 13 -2 -75 20 -2 36 33 -20 6 -10 25 43 21 5 -29 41 -3 39 28 -29 -27 34 -10 37 8 42 11 9 69 -22 8
6824 8 -77 -19 38 0 -30 44 24 39 19 -75 8 -16 6 33 -15 17 -2 51 -17 54 24 -59 -44 25 33 6 -15 -40 45 4 34
6855 34 13 -44 4 -10 54 37 1 -67 -19 -21 41 -13 -43 9 -22 21 87 8 -66 -11 -39 2 11 1 -66 -22 -24 56 3 -44 -87 -36
$$ packed form
6625b2l0K4N3j1qNm7L0K7Qm5L7k1oK6M7r1m5O5lK7n1J1l4Q7l8O8k9k2mq%orMn3
6661f4O4K0m0k1O9k5k3l0%JlP7K%k7j4J9L6n4N6j5m1J7J7J4o4LK8M9J5n4m0l3
6694f1O7N1Qo7Kl5P4rl2L2n1JL8J7l4pk2P3p3M7m1qL6k7K7k6M2n6L5J6m1K7k4
6727b1K2OoM3k3Lj3k2q1R0m5Q7o3M6K8m1n2J6j0M3K5m6m9%O6O6l9j6qm2N5M2l5
6760B6l5j7O9J0q3pP8q4L7M1j6l2J6j6M6k4k5mp5J66n7k7J0Rk8M5k1O2r9%M1O
6792A2L4l3j5p3R5k2L8ln3K6j6L5J8k2j6l4P0m4M2j1n7KO1m4M7k9L4l1kO0r1L0
6824Hq5N8N7l8l0P4k0J5k0r4Q3k4K2K7m8L2j9N3o8P1l0q3J5O9Qk7k1k5Q5m1L0
6855C4k1n7M8j4O4j7l6o8M8kO2n4l0N2l1M3O6p9p4N5k8M1Rj0o7M4kQ0n3m7m3N1
$$ plain form
6887 -36 -1 38 17 -32 -36 -10 25 -6 -6 16 -11 -27 -18 34 -48 13 24 -24 -3 -28 34 27 -15 64 -6 17 27 -19 -19 18 -26 -22 -7
6920 -7 4 17 15 -28 -61 -18 8 18 22 -39 -30 24 7 -5 15 -15 -19 7 -12 -24 63 -46 3 7 -12 -12 11 -9 16 11 -5 -5 -54 -46 -6
6955 -6 31 -9 25 -11 -9 -18 0 8 -17 -17 -27 -1 17 36 -55 0 2 -1 20 15 -48 11 34 2 9 -14 -28 6 3 -10 53 16 21 39 1 -31
6991 -31 -29 -3 0 -52 -22 17 -91 -22 -3 21 -13 31 14 -11 2 26 30 16 -19 -38 3 0 3 -8 -30 -61 50 42 -14 -31 11 46
7023 46 26 7 31 -67 34 11 34 22 -27 9 32 35 -45 -11 -7 24 34 22 -5 -13 -68 -9 62 39 48 30 -17 28 -28 39 -33 -21
7055 -21 -22 13 0 -38 -33 0 -22 20 -26 5 -34 -34 11 47 42 -20 54 2 -5 46 -6 -14 22 18 6 -10 -14 -15 -16 64 -3 22 -47 4 -1 17
7091 17 -1 8 27 -18 40 -20 13 8 -8 -11 -51 36 31 -43 -43 -11 0 29 48 -70 -15 -28 41 -4 11 -38 -32 37 8 10 -17 -17 3 -1
7125 -1 20 26 -41 -49 40 24 4 1 -36 32 66 -7 25 -7 -42 -6 -13 -2 -10 -4 -10 29 29 51 -49 2 -39 40 35 -15 5 21 -9 1 -14
$$ packed form
6887c6L5L9k1m9mK6L5l1%K2k7j6RN2q2O1J1m8K1k5O2pm2P9p0K3J0m6%L7m4MJ5
6920gJ1J3km3l3M3K6J0Mo1RN4j7j2K0l0mK6j9j2Q7j09M9Mj9%K3k0K5nj6%m9QM0
6955fL7m0L4l6KrJ8Qk5%j0K6J8J9r1N5KlK1no3N9K3l2Pk3j4L4lj3O3l7NJ8l8l2
6991c1KK6Ln2L0L9j08O9J9K4l4M4j7k5J3K4Mj4l5j9M1lLj1k2l1J11qn6j7M2L5
7023D6k0j9K4r8J01k3K3j2m9L6K3Lq0L4ML1J0j2k7qn5N9P1k3Rj8m7M5n6O7p2J2
7055b1jL5j3l8NL3k2M2m6L1l9%M5L6no2P4n2pN1n2qL6mj2j6mjjQ0o7K5o9N1nJ8
7091A7j8RJ9m5N8o0L3nj6lm0Q7np4%L2J1K9J9j18N5j3O9m5J5m9OO9k9Kk7%K0m
7125aK1Oo7qQ9j6k0ll7O8L4p3L2l2l5L6pJ1qOoL9%K2j00N1m1P9nn0K0J6l0J0j5
$$ plain form
7160 -14 -38 27 -40 -12 39 7 3 36 -14 50 -25 -9 -32 24 -20 52 -21 -29 21 -63 18 16 14 -10 -4 -21 57 11 49 -3 -8 -8 49 23
7194 23 8 32 -3 12 6 7 -18 7 -12 28 32 38 0 2 -14 31 -4 17 13 -5 -40 -1 -21 -14 -15 -63 28 52 10 -12 10 15 10 17 9 28
7230 28 25 -1 -24 -17 60 -37 6 4 -6 -8 -74 -5 20 29 9 -16 -37 -32 3 45 25 -10 -6 31 23 40 12 -20 -8 23 33 2 -34 -62
7264 -62 15 31 -31 -53 -10 -34 19 42 -14 -26 -8 -10 19 16 -20 -41 35 -10 -13 6 -59 -20 21 40 49 73 2 8 -50 -9 -1 21 5
7297 5 -8 23 25 -6 -32 -36 7 -24 -27 82 -19 -2 26 19 34 8 -18 -26 3 5 12 33 -25 -58 38 93 36 -28 16 28 5 -18 2
7330 2 -20 -59 -54 -4 -4 24 -32 -12 -21 41 29 11 42 36 -6 15 -8 11 67 -50 61 24 -15 -11 -5 10 -16 -39 -34 35 -23 -12 -8 -35
7364 -35 -1 -18 39 3 57 -16 -5 -35 55 35 13 -22 5 -15 -4 5 37 15 5 -24 -7 -35 -17 19 36 56 40 -17 -36 -24 14
7395 14 -14 42 49 42 2 -18 10 -9 -6 -21 -13 36 35 -57 25 -14 -65 17 11 -18 -4 -30 37 0 24 -39 7 46 29 17 -18 -27 38 40
$$ packed form
7160a4k4O5o7K8N1l2mL3n0O4p5J6k3N6m4P2p3qN0q4Q1kkk4Oj7P8m6L8n2n%N7k6
7194B3j5K4l5J5oJk5K5j9M0MOl8Kj6M5l5K1mj8l5L9k0Pjm8R1K4m2k2K2NnPqJ9
7230B8lk6k3PP7r7M3kj0ko6O9K5Rk0k5k1NL5M2k0l5ML7qJ7k8l2J2L1J0l1l6k8
7264f2P7J6o2k2M3k4N3K3n6j2J8kK9ll6k1P6m5lJ9o5L9M1J9RK4p1On8M1QK2j6
7297Ej3L1Kl1k6mM3l1lJ09j01J7K8pJ5k6k6qK9KPK1n8l3R6N5n7o4M4J2k3k3K0
7330Bk2l9NN0%K8n6K0rO2j2j8L1om2K1k3J9N6j17J11l7l9MOJ5k6k3NO9n8J1Mk7
7364c5L4j7N7l6N4p3J1l0R0k0k2l5K7k0J1RL2k2j0k9J7k8J8L6J7K0j6n7j9J2L8
7395A4k8N6Ppm0k0K8j9Lj5QM9jr2Q2l9n1Q2ok9J4k6O7l7K4o3M6L9j7j2l5rO5K
$$ plain form
7429 40 -3 33 -33 -43 -20 27 5 60 11 -1 37 23 -14 13 -36 -21 11 73 38 -1 1 58 -3 -2 39 18 -5 -56 45 -2 -15
7460 -15 -66 -14 11 -6 45 -1 -51 36 -64 -13 25 -67 -3 1 53 50 6 -3 -55 54 21 -51 -18 -46 -23 43 21 -5 -25 -17 3
7491 3 9 80 -8 -23 -30 -33 41 -16 65 -18 37 -1 -24 -32 42 12 36 34 -16 0 61 -3 19 50 26 -21 -33 -44 -3 -11 -15 18 -38 13
7525 13 0 -41 -20 -18 19 -2 -54 -35 -1 -41 -48 57 22 7 -42 -21 24 -2 3 9 23 -8 -1 10 9 -21 20 -25 -21 -23 -37 30 -13 -47
7559 -47 5 40 14 -53 26 -9 -22 25 -59 -38 32 27 -24 -34 -20 27 -8 16 -19 -25 10 -49 35 33 -40 -7 -35 33 -2 11 0 20
7591 20 30 33 -15 30 34 9 -24 -19 12 -28 -22 -35 1 48 48 -23 -2 50 -36 -54 6 -27 -38 -41 48 34 21 15 -7 -3 18 7 15 -9 17
7626 17 42 21 15 40 -33 30 10 16 -11 -74 -37 14 -2 28 -3 16 -8 26 26 -22 -9 -49 -12 -19 15 -24 -50 -38 -5 11 61 -1
7658 -1 -2 -51 59 49 0 -15 30 27 -34 43 32 33 -1 -44 32 -11 -22 -65 14 -19 -39 -12 -26 -2 -28 -8 16 4 -21 13 15 5
$$ packed form
7429D0m3L6o6j0K3M7k2N5m9j2L8j4l7K7m9J5L2O2l5l9KN7o1JM1k1k3n1J01m7j3
7460a5n1N2K5j7N1m6n0Q7j00N1L8r2O4MN2lm4rn2J09l3p2L3k8K3O6k2k6k0QK0
7491COP1q8j5plP4n7Q1q3N5l8k3qP4l0K4kn0J6O1o4K2L1k4m7j2j1M1qmL3n6N1
7525A3j3m1K1KL7k1n2J9L4m0pJ05l5j5m9K1M5k6NOJ4l1PJ1jl0M1m5Mkj4O7m3l4
7559d7N2L5k6o7P9l5j3M7q4K1P0nn1j0J4M7l5K4l5oL5n9Q4kp3L3k8O8l5J3j1K0
7591B0J0Lm8M5Mk5l3NL1m0Oj3L6M7%p1K1N2q6j8O0l3j1lQ9j4j3ok2MK1j1Qk4K6
7626A7K5k1oK5p3O3k0Ok7o3L7N1j6L0l1J9k4L4%m8J3m0L7pL4l9k6J2L3J6N0o2
7658ajm9J10j0m9j5M5lo1P7j1Jl4m3P6m3j1m3P9l3k0K7j4K4k6K0K4j2k5L4Kj0
$$ plain form
7690 5 -4 3 -28 57 39 17 3 67 -38 52 44 26 2 -44 20 -17 -10 -31 -8 14 27 39 -14 -1 -2 -15 -15 38 -8 -37 -33 -16 -23 39
7724 39 -10 -66 -27 32 23 13 -61 -1 13 46 25 18 28 -60 -57 41 49 -16 9 -4 -10 17 3 -11 20 15 -44 27 16 8 17 -83 26
7757 26 -33 -43 1 -15 -13 -20 -20 -72 -23 -29 -3 44 18 10 11 5 32 20 24 -14 -27 -38 49 19 -24 -39 2 25 34 44 -36 -41 -16 -7 35 -8
7793 -8 -36 -6 9 41 -15 -11 56 -25 20 50 20 -19 47 0 31 -15 21 -3 -35 21 -13 28 -36 -15 -7 17 -37 -3 -1 18 -61 48
7825 48 20 37 -8 -17 31 -18 32 -25 -32 -22 -16 -22 45 -44 30 18 1 -7 13 27 7 28 -4 -10 -34 3 1 -22 27 -23 -19 -11 47 -46 -31
7860 -31 -36 -80 -49 1 33 -26 -19 -9 14 4 13 -15 -18 20 2 49 1 4 26 -13 -29 7 47 -3 -25 30 25 -19 -35 -31 -31 20 68 -24
7894 -24 -35 -24 20 -2 13 20 -30 -15 67 11 15 -7 3 -1 53 47 20 31 -23 8 7 5 35 -2 -23 11 86 41 -9 45 50 -3 33 12
7928 12 8 -22 42 24 45 -37 -63 -12 -34 -44 -75 -32 -3 52 -13 9 25 -51 15 12 32 -34 15 -50 -36 1 12 -42 -57 -36 9
$$ packed form
7690ErPl1Q5j8k2j4O4j05R0qj8k4m6O4l7Pk1K3K2J3J2n3J3jj3%N3m6k9MJ7pO2
7724C9m9n6L9N9rj0p4O0J4L3k1pJ0q8LR8Qo5K5j3oK7j4j4L1nn9P1j1qRj00J09
7757B6n9j0M4j6Kp%n2M9oK6M7k6qJoK7j2Ml8j3j1Q7l0m3j5M1K3RJ0q0nK5RM2m3
7793hk8L0J5L2n6MO7q1M5L0l0l9O6m7L1m6L6k4l2N6l4M1o4K1QK4n4L4KJ9p9J09
7825D8k8J7m5rM8m9N0n7pJ0OoO7q9P4j2j7qK0J4k0K1l2ok4L7kk3M9n0MQN8r3J5
7860c1nm4L1N0L2n9PJ0K3j0Rk8lL8j8M7m8LK2l9j6L6M0n0k2N5nm4j6M%N1M8r2
7894b4j1J1M4k2J5Pn0J5Q2n6Mk2J0mN4ok7J1n4L1jkL0l7k1L4P5m5n0N4Nn3L6k1
7928A2ml0O4j8K1q2k6N1k2j0l1M3K9N5o5K2J6p6O6lK0o6M9o5J4L7J1n4j5K1M5
$$ plain form
7959 9 -7 -13 13 -11 -34 14 -6 -18 51 -2 -20 29 20 -43 2 5 -13 0 45 -23 26 -21 -1 -22 -10 -34 -13 7 -9 27 15 28
7991 28 19 13 8 -25 -25 -25 -22 61 20 26 -6 -12 -8 24 -19 25 -50 -25 44 -24 -2 30 -40 -17 -17 15 21 27 13 -18 -10 22 8 -20 -36 11 -7
8028 -7 24 -7 -35 -37 23 -7 16 21 18 -14 55 40 47 -41 8 46 1 -15 -37 -22 -20 7 -12 53 9 -2 18 43 24 37 -23 -3 -38
8061 -38 5 10 5 -14 -48 -11 -43 32 20 30 -42 -38 53 -19 15 3 34 39 25 -57 30 2 19 6 53 6 7 44 15 16 3 -52 23
8094 23 0 18 47 -22 8 -48 -38 22 15 -16 -45 9 -46 -34 0 -28 -39 -54 -1 -18 -8 -7 17 46 27 35 -39 -25 -26 16 22 -7 -7
8127 -7 -1 21 34 56 13 12 10 26 27 16 -2 25 -3 -15 12 -12 -2 11 -28 -9 9 -32 63 35 1 -17 -10 -11 34 -47 13 -28 -42 15
8161 15 -27 -27 -55 9 -65 25 -51 30 -30 -19 63 3 -33 60 4 -38 58 4 20 5 1 17 -12 -21 62 -14 -24 21 -6 8
$$ packed form
7959Ij6oK6k4k3M8k0j2O9n3j8M9ro3M5Lj8J3M5o8M9m7K0k1J2k4K1K0j6L6j2J3
7991B8ronl3%%LQ3m1Ol2oML2m3M4p5K5O9o8K2L2p0K3%L2OOj4l1QL2j4k8j6M7j8
8028gL1l1k8kO0l0K3Nll2O9j5Pq8M9L8m5j6k2J5KK7j9O5m4j1K0K5j9J3o0K0l5
8061c8M3Nnj9l4L7l2P5j2J0p2MR1p2L4j2L1Nj4q2Q7k8J7j3M7m7JL7k9Jj3n5P5
8094B3k3J8K9o9L0n6J0O0pl1k9N4n5J2L4k8j1j5N3j7J0JK4K9j9Qp4J4jM2Ok9%
8127gOK2J3K2m3jkJ6Jj1j8K7k8j2K7k4J0J3l9J9J8m1R5k8l4j8PjM5q1O0m1j4N7
8161A5m2%k8O4p4R0p6Q1o0J1Q2o0l6R3n6m2R6n4J6j5mJ6k9rQ3p6j0M5k7J4
8191H
$$ Imaginary data points
##PAGE= N=2
##DATA TABLE= (X++(I..I)), XYDATA
$$ plain form
0 0 0 0 0 0 0 0 0 0 0 0 0 2 0 5 0 0 -8 0 -8 8 -8 13 -8 13 -16 13 -21 21 -25 29 -29 39 -39 45 -54 54 -64 73 -75 88
40 88 -95 106 -119 127 -141 155 -170 190 -206 229 -251 274 -309 337 -377 422 -471 534 -608 698
60 698 -816 963 -1169 1460 -1900 2632 -3989 7090 -17195 119302 822396 1013629 780611
73 780611 320702 -402794 -960181 -981279 -613391 12233 715619 1022619 767702 234241
83 234241 -391994 -903043 -952916 -514197 129845 715153 962077 724864 183587 -409778
93 -409778 -843614 -870979 -460553 144678 690060 916700 657784 106697 -433473 -809446
103 -809446 -819128 -378328 210695 651444 841915 630637 61525 -475957 -745066 -734736
113 -734736 -370745 226079 666558 761238 536100 33086 -506816 -757656 -660158 -293968
$$ packed form
0@%%%%%%%%%%%KkNn%qQqJ6j6K1k1K1k9K9l4M2m6N4n8O8p8Q4r9J08j18J37j48J63
40H8j83K01k25K46k68K96l25L60l96M35m80N25n83O46p14P99q93J005j142J306
60F98j514J779k132K629l360M532o621J1079k4285J36497P03094J91233k33018
73G80611m59909p23496n57387k1098L67888O25624P03386L07000k54917n33461
83B34241o26235n11049m9873M38719O44042N85308K46924k37213n41277n93365
93d09778m33836k7365M10426O05231N45382K26640k58916n51087n40170l75973
103h09446r682M40800N89023M40749J90471k11278n69112n37482k69109J0330
113g34736L63991N96824M40479R4680k25138n03014n39902k50840R7498L66190
$$ plain form
123 -293968 233769 646857 715672 474721 26605 -472392 -728731 -602302 -218611 264068
133 264068 648738 702248 416493 -25320 -458112 -686437 -559959 -176907 257791 592444
143 592444 657855 381112 -72965 -477168 -665830 -526786 -128844 295138 569305 599624
153 599624 340921 -91793 -468484 -619935 -478549 -105816 301438 558910 568657 297373
163 297373 -133527 -475394 -578290 -431016 -79978 316758 545592 518309 262896 -129049
173 -129049 -462203 -551821 -379633 -38674 329995 541266 487236 214520 -154153 -455880
183 -455880 -529208 -345346 -15604 316013 503320 445729 175152 -177290 -453826 -510393
193 -510393 -315629 14457 327307 492560 419212 140839 -191246 -428683 -467476 -277134
$$ packed form
123b93968N27737M13088O8815k40951m48116m98997k56339J26429L83691M82679
133B64068L84670N3510k85755m41813m32792k28325J26478L83052M34698L34653
143E92444O5411k76743m54077m04203j88662J39044L97942M23982K74167L0319
153E99624k58703m32714l76691j51451J41386L72733M07254K57472R747k71284
163B97373m30900l41867j02896J47274L51038L96736K28834k7283k55413l91945
173a29049l33154q9618J72188L40959L68669K11271n4030k72716l68673l01727
183d55880p3328J83862L29742L31617J87307n7591k70577l52442k76536n6567
193e10393J94764L30086L12850J65253p3348k78373l32085k37437l8793J90342
$$ plain form
203 -277134 41384 329742 474131 399700 118163 -215599 -427285 -440362 -251144 62715
213 62715 339179 447769 353697 92468 -217101 -414305 -413341 -224448 76491 345640 441061
224 441061 325042 59144 -234490 -410211 -388184 -192277 92416 336873 413194 291329
234 291329 38901 -237454 -405146 -370779 -163423 112456 341278 406046 266919 11440
244 11440 -238261 -382684 -343391 -132729 132532 332628 385214 250762 -7527 -252595
254 -252595 -377161 -327221 -114865 149779 331418 358364 218839 -29115 -257870 -359769
264 -359769 -300395 -99010 155561 330539 345781 201382 -43033 -266722 -353024 -274090 -72098
275 -72098 168145 325755 321492 172847 -53232 -261595 -343166 -256967 -55050 174529 325702
$$ packed form
203b77134L18518K88358J44389p4431k81537l33762k11686j3077J89218L13859
213F2715K76464J08590r4072k61229l09569j97204R64J88893L00939K69149R5421
224D41061j16019k65898k93634j75721K2027J95907K84693K44457P6321j21865
234B91329k52428k76355j67692L4367K07356K75879K28822O4768j39127k55479
244A1440k49701j44423L9293K10662K65261K00096N2586j34452k58289k45068
254b52595j24566M9940K12356K64644J81639K6946j39525k47954k28755j01899
264c59769N9374K01385K54571J74978J5242j44399k44415k23689q6302P8934K01992
275g2098K40243J57610m263j48645k26079k08363q1571Q6199K01917K29579J51173
$$ plain form
286 325702 312428 148641 -73856 -261033 -327978 -232939 -30092 178995 308082 293861 135253
297 135253 -84278 -261426 -319366 -221608 -13727 192139 302840 273474 111548 -101971
307 -101971 -259626 -297427 -199311 -2634 193751 294038 259738 101864 -110013 -264017
317 -264017 -286722 -177456 15489 202080 286055 234874 79922 -114386 -256565 -273429 -162841
328 -162841 22698 202017 283297 223521 60260 -128508 -257357 -260029 -138461 41587 200486
339 200486 267578 206085 48079 -129236 -248470 -250344 -127491 54735 206729 261608 191196
350 191196 28524 -141646 -241323 -230659 -111157 61189 201300 247491 178705 21244 -147309
361 -147309 -241820 -221291 -96075 75300 206194 235612 157179 6665 -147639 -229798 -203798
$$ packed form
286C25702j3274j63787k22497j87177o6945R5039K02847K09087J29087j4221j58608
297A35253k19531j77148n7940R7758K07881K05866J10701k9366j61926k13519
307a01971j57655l7801R8116J96677J96385J00287l4300j57874k11877j54004
317b64017k2705J09266J92945J86591Q3975n1181j54952j94308j42179j6864J10588
328a62841J85539J79319Q1280n9776j63261j88768j28849k672J21568J80048J58899
339B00486O7092o1493j58006j77315j19234j874J22853J82226J51994N4879p0412
350A91196j62672j70170r9677J0664J19502J72346J40111M6191o8786j57461j68553
361a47309r4511K0529J25216J71375J30894K9418p8433j50514j54304q2159K6000
$$ plain form
372 -203798 -84485 77027 203918 230545 147156 -4862 -155715 -229773 -190299 -64046 88591
383 88591 200122 216106 129910 -13622 -151224 -220224 -181699 -54834 95662 200871 210169
394 210169 116815 -29625 -157630 -211770 -166106 -41568 98613 190442 195285 106712 -35146
405 -35146 -159550 -208567 -158596 -30101 110799 193514 185196 91557 -45727 -158143 -193329
416 -193329 -140515 -21264 111112 189253 177205 83832 -51723 -163699 -192540 -128994 -8187
427 -8187 116284 184171 162092 66840 -57450 -158318 -184154 -120302 -1440 118495 184291
438 184291 158523 55342 -69989 -160729 -175739 -105529 11763 119108 172590 145793 46940
449 46940 -73156 -157765 -169930 -99570 20461 127367 173058 138399 35985 -81518 -154335
$$ packed form
372b03798J19313J61512J26891K6627q3389j52018j50853p4058L9474J26253J52637
383H8591J11531J5984q6196j43532j37602o9000L8525J26865J50496J05209R298
394B10169r3354j46440j28005n4140M5664J24538J40181R1829M843q8573j41858
405c5146j24404m9017M9971J28495J40900Q2715q318r3639j37284j12416l5186
416a93329N2814J19251J32376P8141j2048r3373j35555j11976k8841O3546J20807
427h187J24471O7887k2079r5252j24290j00868k5836O3852J18862J19935O5796
438A84291k5768j03181j25331r0740j5010P0210J17292J07345N3482k6797r8853
449D6940j20096q4609j2165P0360J20031J06906M5691l4659j02414j17503p2817
$$ plain form
460 -154335 -155307 -85963 26663 127091 165688 128318 29839 -86258 -158685 -153138 -77672 34226
472 34226 129736 159115 113166 17164 -88811 -153432 -142759 -67390 37328 128748 159472 110259
484 110259 9661 -93680 -153025 -136768 -54391 49456 129036 149307 97732 1180 -93594
495 -93594 -146758 -131211 -49897 54657 131117 146663 91640 -8644 -101093 -143039 -118960 -38527
507 -38527 60080 128173 136878 82590 -12928 -103352 -143718 -116487 -33178 66560 130893 130291 69981
520 69981 -22905 -105069 -135517 -103199 -24447 67722 129260 127853 66661 -25151 -106389 -135140
532 -135140 -96670 -13746 74269 128148 119482 53679 -33615 -104447 -129030 -92229 -10281 75653
544 75653 125619 115675 48681 -41261 -109058 -124457 -81475 -285 79690 120971 105703 41056
$$ packed form
460a54335r72O9344J12626J00428L8597l7370r8479j16097p2427N547P5466J11898
472C4226R5510K9379m5949r6002j05975o4621J0673P5369J04718R1420L0724m9213
484A10259j00598j03341n9345J6257Q2377J03847P9580K0271n1575r6552r4774
495i3594n3164J5547Q1314J04554P6460J5546n5023j00284r2449m1946K4079Q0433
507c8527R8607O8093Q705n4288r5518r0424m0366K7231Q3309R9738O4333o02o0310
520F9981r2886q2164l0448L2318P8752R2169O1538j407o1192r1812q1238k8751
532a35140L8470Q2924Q8015N3879q666o5803q7294p0832k4583L6801Q1948Q5934
544G5653M9966r944o6994q9942o7797j5399M2982Q1190P9975M1281j5268o4647
$$ plain form
556 41056 -42767 -106387 -120829 -78511 2773 83444 122631 101667 32176 -50866 -107347 -112881
568 -112881 -66838 10581 83459 116432 95325 30672 -49814 -107733 -111971 -61494 17052 86829
580 86829 114706 86639 18705 -55534 -104165 -105060 -56560 17995 84117 111504 84967 15905
592 15905 -60435 -106480 -100962 -46906 28054 87137 105108 75396 10312 -59397 -100721 -95382
604 -95382 -44891 28726 88719 105120 71411 3312 -66125 -101692 -88099 -34997 33755 86741
616 86741 98224 64439 1425 -64241 -100221 -86562 -31104 38463 89457 96305 56279 -8533
628 -8533 -67866 -95503 -77971 -24709 38713 85141 92564 54405 -10066 -69310 -96319 -75844
640 -75844 -17261 47083 86648 86451 45879 -15782 -67876 -88818 -70057 -16598 46154 85700
$$ packed form
556D1056q3823o3620j4442M2318Q1284Q0671L9187k0964o9491q3042n6481n534
568a12881M6043P7419P2878L2973k1107o4653q0486n7919m238N0477P8546O9777
580H6829K7877k8067o7934p4239m8631q95M8500P4555O6122K7387k6537o9062
592A5905p6340m6045N518N4056P4960N9083J7971k9712o5084o9709m1324N339
604i5382N0491P3617N9993J6401l3709o8099o9437l5567J3593N3102O8752N2986
616H6741J1483l3785o3014o5666l5980J3659N5458O9567N0994O848m0026o4812
628h533n9333k7637J7532N3262O3422M6428P423l8159o4471n9244k7009K0475
640g5844N8583O4344L9565j97m0572o1661n2094k0942J8761N3459O2752L9546
$$ plain form
652 85700 84844 43332 -20871 -73568 -88492 -62608 -8682 49325 82536 76880 37390 -20195 -70171
665 -70171 -86210 -61170 -7165 52185 85833 75596 30374 -27098 -71821 -81284 -52028 -1096
677 -1096 50218 80117 71375 28321 -27280 -71547 -82170 -50866 4335 55038 79801 66243
689 66243 20399 -32561 -68952 -75170 -45875 6013 54225 77568 65011 19251 -36206 -71976
701 -71976 -73111 -39676 13131 57477 73276 56632 13929 -36428 -68615 -68916 -38187 12778 59021
714 59021 74978 54683 9293 -41030 -70370 -64235 -29693 17205 57013 69526 49149 7013
726 7013 -39710 -69444 -64560 -28364 20284 59481 69310 44253 -163 -42253 -65478 -58008 -22726
739 -22726 21959 56826 67083 44700 -2 -43569 -66255 -56956 -18767 27412 58179 61906
$$ packed form
652H5700q56m1512o4203n2697j4924K5884N3926N8007L3211n656l9490n7585m9976
665g0171j6039K5040N4005N9350L3648j0237m5222n7472m4723r463K9256N0932
677a096N1314K9899q742m3054n5601m4267j0623L1304N5201N0703K4763j3558
689F6243m5844n2960l6391o218K9295N1888M8212K3343j2557m5760n5457l5770
701g1976j135L3435N2807M4346J5799j6644m2703n0357l2187l01L0729N0965M6243
714E9021J5957k0295m5390n0323k9340O135L4542M6898L9808J2513k0377m2136
726G013m6723k9734M884L6196M8648L9197R829k5057m4416m2090k3225P470L5282
739b2726M4685L4867J0257k2383m4702m3567k2686R299L8189M6179L0767L727
$$ plain form
751 61906 37111 -5537 -44507 -62396 -52859 -18210 26247 57555 61075 35736 -7903 -47628
763 -47628 -62567 -47856 -11727 29900 56698 56210 30798 -8743 -45525 -60697 -46467 -10616
775 -10616 31101 58150 55651 26211 -14230 -47384 -57632 -39900 -4478 32198 54852 52412
787 52412 24874 -14163 -46627 -57442 -39622 -2055 35404 55014 48158 18097 -19871 -47504
799 -47504 -53537 -35509 -885 34111 52800 46664 17780 -20642 -48565 -52088 -30737 5133 38254
812 38254 52279 42064 13627 -20874 -45924 -49034 -29096 4528 37059 52137 41065 10006
824 10006 -25158 -48030 -47373 -24024 9259 37396 48358 36798 8082 -24240 -45727 -45953 -23543
837 -23543 10589 39075 48391 34181 3286 -28245 -45481 -41934 -19452 11918 37298 45466 32904
$$ packed form
751F1906k4795m2648l8970j7889R537L4649M4457L1308L520k5339m3639l9725
763d7628j4939J4711L6129M1627K6798m88k5412l9541l6782j5172J4230L5851
775a0616M1717K7049k499k9440m0441l3154j0248J7732L5422L6676K2654k440
787E2412k7538l9037l2464j0815J7820L7567L7459J9610o856l0061l7968k7633
799d7504o033J8028L4624L4996J8689o136k8884l8422k7923l523K1351L5870L3121
812C8254J4025j0215k8437l4501k5050l110J9938L3624L2531J5078j1072l1059
824A0006l5164k2872O57K3349L3283K8137J0962j1560k8716l2322k1487k26K2410
837b3543L4132K8486R316j4210l0895l1531j7236L547K2482L1370K5380Q168j2562
$$ plain form
850 32904 4164 -27393 -45245 -40713 -16400 16323 40820 44757 28175 -184 -28177 -42603
862 -42603 -36906 -14841 14242 37907 43253 27014 -2352 -30952 -44892 -36359 -10728 18330 38150
875 38150 39828 22824 -3972 -28674 -41064 -33918 -9755 19251 39333 40681 21464 -8024 -31974
888 -31974 -40232 -29931 -5546 20518 36358 36260 19628 -7022 -30661 -39813 -29984 -4733 23280
901 23280 39004 35358 15442 -11202 -31822 -36767 -25341 -3078 21300 36047 33481 14972 -11470
914 -11470 -33191 -38317 -24339 497 24562 36324 30340 11046 -12214 -30197 -34498 -22310 453
927 453 23646 36643 31530 10252 -15391 -32881 -34264 -18924 4704 24545 32937 26671 8029
940 8029 -14551 -30760 -33239 -19567 4506 26250 34785 26347 5123 -18044 -31227 -29421 -14899
$$ packed form
850C2904k8740l1557j7852M532K4313L2723K4497L937j6582k8359k7993j4426
862d2603N697K2065K9083K3665N346j6239k9366k8600j3940Q533K5631K9058J9820
875C8150J678j7004k6796k4702j2390P146K4163K9006K0082J348j9217k9488k3950
888c1974q258J0301K4385K6064J5840r8j6632k6650k3639r152R829K5251K8013
901B3280J5724l646j9916k6644k0620m945J1426K2263K4378J4747k566j8509k6442
914a1470k1721n126J3978K4836K4065J1762n984j9294k3260j7983m301J2188K2763
927D53K3193J2997n113k1278k5643j7490j383J5340K3628J9841Q392o266j8642
940H029k2580j6209k479J3672K4073K1744Q535q438k1224k3167j3183J806J4522
$$ plain form
953 -14899 6352 24851 31974 24668 5632 -17164 -31951 -30503 -14209 8873 27461 31658 20641
966 20641 1083 -18338 -29539 -27185 -12602 7514 25062 31311 21756 1188 -19912 -31202 -26743
979 -26743 -9078 11840 26303 28616 17844 -793 -18552 -28210 -25386 -9748 11315 26834 29278
992 29278 17423 -3370 -21764 -28457 -21977 -5911 12764 25159 26086 15807 -2247 -20356 -28668
1005 -28668 -22832 -5982 14208 27092 25531 11620 -6697 -21931 -26833 -19378 -4070 12897 24776
1018 24776 25067 12914 -5462 -21508 -26985 -18111 -334 16836 26121 23406 9840 -7112 -19969
1031 -19969 -24592 -17689 -1605 15106 24734 22697 8653 -10433 -23487 -25064 -15375 1266 16512
1044 16512 23084 19547 7646 -8594 -21082 -23480 -15149 1125 17740 25034 19543 5148 -11589
$$ packed form
953a4899K1251J8499P123p306j9036k2796j4787J448J6294K3082J8588M197j1017
966B0641j9558j9421j1201K354J4583K0116J7548O249r555k0568k1100j1290M459
979b6743J7665K0918J4463K313j0772j8637j7759r658K824J5638K1063J5519K444
992B9278j1855k0793j8394o693O480J6066J8675J2395R27j0279j8054j8109q312
1005b8668N836J6850K0190J2884j561j3911j8317j5234m902P455J5308J6967J1879
1018B4776K91j2153j8376j6046n477Q874J7777J7170R285k715j3566j6952j2857
1031a9969m623O903J6084J6711R628k037j4044j9086j3054j577R689J6641J5246
1044A6512O572l537j1901j6240j2488k398Q331J6274J6615P294n491j4395j6737
$$ plain form
1057 -11589 -22469 -21858 -11655 2869 16624 22996 18386 5682 -9917 -21473 -21903 -10586 5583
1070 5583 19289 23974 16679 2330 -11665 -20555 -20523 -10529 3766 15883 21203 15670 1033 -14360
1084 -14360 -22945 -21124 -8965 7096 18231 20599 14008 1007 -11955 -18978 -17620 -7427 7611
1097 7611 19312 21998 14424 -106 -14546 -20739 -16780 -5783 7911 17665 18701 11690 -525
1110 -525 -13571 -20398 -17014 -5580 8926 19557 19810 10167 -3320 -15047 -19741 -15097 -4359 7448
1124 7448 16289 17435 9526 -3349 -15415 -20863 -15680 -2547 10926 18973 18183 8792 -3446 -12880
1138 -12880 -16349 -12018 -1088 11138 18727 18335 8880 -5218 -16280 -19023 -13025 -1014 10463
1151 10463 15841 13722 5392 -6163 -15450 -18001 -12659 -1196 11546 18348 15769 5727 -7059
$$ packed form
1057a1589j0880O11J0203J4524J3755O372m610j2704j5599j1556m30J1317J6169
1070E583J3706M685p295j4349j3995q890L2R994J4295J2117N320n533j4637j5393
1084a4360q585J821J2159J6061J1135K368o591j3001j2962p023J358J0193J5038
1097G611J1701K686p574j4530j4440o193L959J0997J3694R754J036p011j2215
1110e25j3046o827L384J1434J4506J0631K53r643j3487j1727m694M644J0738J1807
1124G448Q841J146p909j2875j2066n448N183J3133J3473Q047p90r391j2238r434
1138a2880l469M331J0930J2226P589l92r455j4098j1062k743N998J2011J1477
1151A0463N378k119q330j1555r287k551N342J1463J2742O802k579j0042j2786
$$ plain form
1164 -7059 -15986 -16358 -9228 1445 11483 16266 13677 4938 -6334 -15508 -17135 -10031 2132 13423
1178 13423 18144 13724 3494 -7216 -13822 -13770 -7206 2777 12011 16456 13296 3178 -8959 -17133
1192 -17133 -17138 -8681 3081 11810 13987 9156 -42 -9244 -14767 -14257 -7499 3380 13243 17037 12561
1207 12561 2115 -8862 -14533 -12294 -3900 6087 13216 14544 9681 679 -8851 -14785 -13968 -6072
1221 -6072 5056 13507 15068 8859 -1595 -10439 -13869 -11095 -3531 5532 11988 13282 8608 -808
1235 -808 -10732 -15644 -13052 -4267 6393 12969 12262 5837 -3056 -10447 -12885 -9683 -2408 6740 13969
1250 13969 14713 8679 -1130 -10190 -13234 -8552 106 8222 12631 11260 4777 -3304 -10421 -13962 -10947
1265 -10947 -2746 6426 12514 11960 4273 -5355 -11662 -12650 -7731 672 7902 11621 10968 5235 -3595
$$ packed form
1164g059q927l72P130J0673J0038M783k589q739j1272r174j627P104J2163J1291
1178A3423M721m420j0230j0710o606N2O564R983R234M445l160j0118j2137q174
1192a7133nQ457J1762Q729K177m831r198r202n523N10O758J0879R863L794m476
1207A2561j0446j0977n671K239Q394R987P129J328m863r002r530n934Q17P896
1221f072J1128Q451J561o209j0454q844l430K774P564R063O456J294m674r416
1235h08r924m912K592Q785J0660O576p07o425q893p391k438L202P275R148P229
1250A3969P44o034r809r060l044M682Q658Q116M409j371o483q081p117l541L015
1265a0947Q201R172O088n54p687r628o307r88M919Q403P230L719o53n733q830
$$ plain form
1280 -3595 -10425 -12615 -8799 313 9057 12587 10108 3011 -5559 -10711 -10544 -6348 874 8652 12471
1295 12471 10856 4566 -4504 -11343 -11575 -5923 2223 9311 11361 7501 950 -5980 -11192 -11574 -6939
1310 -6939 201 7662 11650 8801 1105 -6700 -11437 -10327 -3634 4003 9401 11334 8454 1826 -5030
1325 -5030 -9698 -10192 -4812 3492 9699 11279 7312 -618 -7676 -10388 -8873 -3635 3357 8469 9930
1340 9930 7330 710 -6900 -10866 -9476 -3519 4613 9974 9715 5107 -1387 -7623 -10152 -8125 -3304
1355 -3304 3236 8828 9992 5969 -796 -7508 -10416 -7450 -807 5770 9831 9542 4964 -994 -6381
1370 -6381 -9315 -7579 -1962 4606 9297 9463 4169 -3232 -8545 -9965 -6887 -697 5038 8044 7916
1385 7916 4110 -1984 -7243 -9271 -7030 -652 6330 9722 8375 3255 -3398 -7981 -8424 -5385 -277
$$ packed form
1280c595o830k190L816R112Q744L530k479p097q570n152J67M196P222P778L819
1295A2471j615o290r070o839k32N652Q146P088K050l860o551o930n212l82M635
1310f939P140P461L988k849p696p805m737J110O693P637N398J933k880o628o856
1325e030m668m94N380Q304O207J580l967p930p058k712J515N238O992N112J461
1340I930k600o620p610l966J390N957Q132N361k59m608o494o236k529K027M821
1355c304O540N592J164m023o765o712k908K966O643O577M061k89m578n958n387
1370f381k934J736N617O568M691J66n294p401n313j420L078O190N735L006j28
1385G916l806o094n259k028K241O378O982L392j347n120o653m583m43L039N108
$$ plain form
1400 -277 5270 8501 7793 3601 -2772 -8120 -9158 -5376 929 6747 9097 6816 1922 -3356 -7242
1415 -7242 -7972 -5022 44 5383 8670 7453 1994 -4434 -8710 -8674 -4251 1888 6278 7765 5919 1418
1431 1418 -3575 -7014 -7597 -4497 1373 6776 8786 6502 938 -4990 -7936 -6885 -3009 1974 6031
1446 6031 7280 5499 1265 -4202 -7977 -7759 -3520 2442 7223 8037 4643 -493 -4947 -7039 -5923
1461 -5923 -2417 2039 5917 7594 5490 343 -4961 -7920 -6889 -1946 3624 6726 6783 3781 -861
1476 -861 -4762 -6650 -6118 -2614 2563 6516 7372 4490 -1125 -6006 -7310 -5149 -773 3753 6171 5951
1492 5951 3595 -315 -4708 -6910 -5836 -1776 3660 7344 6861 2770 -2111 -5811 -6499 -4076 -411
1507 -411 3159 5778 6124 3385 -1087 -5329 -7221 -5076 -58 4470 6462 5358 1575 -2531 -5146
$$ packed form
1400b77N547L231p08m192o373n348j038L782O305N818K350k281m894n278l886
1415g242p30K950N066N339L287j217n459o428m276L6M423O139M390J487j846m501
1431A418m993l439n83L100N870N403K010k284n564n928k946J051L876M983M057
1446F031J249j781m234n467l775K18M239N962M781Q14l394n136m454k092J116
1461e923L506M456L878J677k104n147n304k959J031M943N570L102N7l002m642
1476h61l901j888N32L504N177L953Q56k882n615m881j304K161M376M526K418k20
1492E951k356l910m393k202J074M060N436L684m83m091m881l700o88K423L665
1507d11L570K619L46k739m472m242j892K145N018M528J992j104l783m106k615
$$ plain form
1522 -5146 -6001 -4471 -850 3338 6117 6165 2835 -2450 -6072 -6300 -3310 1291 4946 6006 4680 1975
1538 1975 -1749 -4756 -5603 -4105 -261 4337 6587 5093 1012 -3529 -6293 -5639 -2637 809 3810
1553 3810 5294 4418 1675 -2272 -5497 -6111 -3298 1383 5184 6212 3941 -39 -3344 -4995 -4666 -2448
1569 -2448 849 3776 5534 4837 1274 -3209 -5786 -5318 -1855 2610 5368 5305 3348 254 -2898 -4604
1585 -4604 -4580 -2681 952 4434 5483 3410 -588 -4512 -6035 -4536 -1337 2015 4137 4540 3058 401
1601 401 -2725 -4923 -4630 -1623 2530 5563 5772 2854 -1064 -3802 -4633 -3513 -875 1902 3844 4570
1617 4570 3132 -355 -3755 -5369 -4404 -799 3157 4998 4418 1985 -1261 -3640 -4308 -3519 -1317 1921
1633 1921 4305 4393 2349 -1436 -4771 -5332 -3282 17 3132 4472 3685 1744 -629 -2999 -4099 -3000
$$ packed form
1522e146q55J530L621M188K779M8l330n285l622k28K990M601L655J060j326k705
1538A975l724l007q47J498L844M598K250j494m081m541k764O54L002L446L001
1553C810J484q76k743l947l225o14K813M681L801J028k271l980l305j651L29K218
1569b448L297K927J758o97l563m483k577M68L463M465K758o3j957l094l152j706
1585d604K4J899L633L482J049k073l998l924j523J499L199L352K122M03j482k657
1601D01l126k198K93L007M153L033K09k918l918k738q31J120K638K777J942P26
1617D570j438l487l400j614R65L605L956J841n80k433l246k379o68P89K202L238
1633A921K384Q8k044l785l335n61K050L299L115J340p87j941k373k370j100J099
$$ plain form
1649 -3000 -296 2959 5348 4794 1635 -1887 -4249 -4480 -2456 351 2437 3647 3387 1248 -1640 -3944
1665 -3944 -4914 -3291 324 3484 4548 3638 737 -2293 -3643 -3497 -2245 257 2798 3927 3703 1529
1681 1529 -2053 -4372 -4318 -2290 984 3809 4196 2674 607 -1893 -3423 -3189 -1837 378 3248 4489
1697 4489 3327 658 -2469 -4506 -3877 -1384 1055 2877 3468 2201 38 -1951 -3747 -4010 -1893 1054
1713 1054 3576 4457 2904 -357 -2718 -3504 -2788 -723 1606 2892 3422 2733 323 -2369 -3891 -3693
1729 -3693 -1467 1893 3703 3548 1869 -751 -2831 -3147 -2537 -1093 1257 3228 3528 2391 -173 -3120
1745 -3120 -4083 -2815 -400 2114 3436 2815 1178 -580 -2271 -3282 -2721 -913 1473 3627 3805 1787
1761 1787 -975 -3098 -3534 -1960 368 2080 2889 2658 1352 -615 -2439 -3532 -2859 -449 2240 3551
$$ packed form
1649c000K704L255K389n54l159l522k362k31K024K807K086J210k60k139k888k304
1665c944r70J623L615L160J064r10k901l030j350J46J252K502K541J129k24k174
1681A529l582k319N4K028L274K825L87j522k067k500j530K34J352K215K870J241
1697D489j162k669l127k037O29K493K439J822N91j267k163j989j796k63K117K947
1713A054K522Q81j553l261k361p86P16K065K329J286N30o89k410k692j522J98
1729c693K226L360J810j55j679k620k080l16O10J444K350J971L00j137k564k947
1745c120r63J268K415K514J322o21j637j758j691j011N61J808K386K154J78k018
1761A787k762k123m36J574K328J712Q09k31j306j967j824j093O73K410K689J311
$$ plain form
1777 3551 3031 841 -1698 -2895 -2729 -1681 25 1714 2815 2931 1660 -803 -3071 -3549 -2097 527
1793 527 2817 3283 2150 294 -1409 -2454 -2528 -1761 -249 1801 3170 2917 971 -1690 -3366 -3096 -1286
1810 -1286 961 2436 2676 1876 532 -1069 -2396 -2813 -1843 382 2561 3404 2423 36 -2172 -2971 -2244
1827 -2244 -756 796 1951 2452 2011 747 -1258 -2894 -3060 -1446 1084 2885 3072 1548 -510 -1968
1843 -1968 -2465 -1970 -953 469 1923 2772 2077 167 -2022 -3130 -2635 -512 1665 2581 2377 1249 -149
1860 -149 -1326 -1987 -2111 -1072 900 2580 2979 1817 -568 -2563 -2824 -1794 -175 1346 1986 1756 1174
1877 1174 -24 -1613 -2639 -2318 -862 1384 2934 2564 1000 -870 -2119 -2222 -1238 -194 891 2035
1893 2035 2229 1307 -233 -2086 -3016 -1937 163 1911 2549 1968 453 -836 -1516 -1896 -1549 -329 1061
$$ packed form
1777C551n20k190k539j197J66J048J706J689J101J16j271k463k268m78J452K624
1793E27K290M66j133j856j703j045p4P67J512K050J369k53j946k661j676K70J810
1810a286K247J475K40q00j344j601j327m17R70K225K179Q43r81k387k208p99P27
1827b244J488J552J155N01m41j264k005j636j66J614K530J801J87j524k058j458
1843a968m97M95J017J422J454Q49o95j910k189j108M95K123K177R16k04j128j398
1860a49j177o61j24J039J972J680L99j162k385j995k61J030J619J521O40k30n82
1877A174j198j589j026L21J456K246J550l70j564j870j249j03R84J044J085J144
1893B035J94r22j540j853r30J079K100J748O38n81j515j289o80l80L47J220J390
$$ plain form
1910 1061 2182 2567 1187 -1054 -2466 -2550 -1457 419 1770 1842 1417 562 -768 -1688 -2085 -1727 -103
1927 -103 1876 2693 2142 635 -1251 -2246 -1676 -668 376 1377 1863 1530 790 -609 -2213 -2421 -1361
1944 -1361 323 2014 2462 1262 -224 -1292 -1859 -1595 -718 201 1208 2099 1872 442 -1170 -2290 -2332
1961 -2332 -785 979 1750 1796 1084 -167 -993 -1539 -1693 -1002 522 1731 2261 1777 87 -1657 -2123 -1429
1979 -1429 -312 957 1562 1392 930 159 -1082 -1899 -1885 -1023 561 1978 2061 985 -431 -1661 -1878 -1068
1997 -1068 -101 678 1444 1756 1139 155 -1177 -2121 -1748 -285 1195 1909 1705 517 -607 -1242 -1386 -1202
2015 -1202 -414 609 1483 1972 1233 -367 -1701 -2046 -1365 164 1393 1627 1104 387 -451 -1240 -1498 -1374
2033 -1374 -574 862 1911 1762 722 -753 -1797 -1556 -632 351 1001 1403 1213 639 -161 -1193 -1828 -1350
$$ packed form
1910A061J121L85j380k241j412q4J093J876J351P2m25q55j330r20l97L58J624
1927a03J979Q17n51j507j886r95N70J008J044J001M86l33p40j399j604k08J060
1944a361J684J691M48j200j486j068n67K64Q77R19J007Q91k27j430j612j120m2
1961b332J547J764P71M6p12j251q26n46j54O91J524J209N30m84j690j744m66O94
1979a429J117J269O05j70m62p71j241q17J4Q62J584J417Q3j076j416j230k17Q10
1997a068R67P79P66L12o17r84j332r44L73J463J480P14k04j188j124o35j44J84
2015a202P88J023Q74M89p39j600j334l45O81J529J229K34n23p17q38p89k58J24
2033a374Q00J436J049j49j040j475j044K41R24R83O50M02j90n74q00j032o35M78
$$ plain form
2051 -1350 -53 1382 1999 1401 -5 -1073 -1419 -1271 -670 53 660 1214 1449 735 -575 -1616 -1825 -1049
2069 -1049 522 1571 1521 872 -7 -856 -1082 -1078 -839 -81 1060 1708 1520 451 -1014 -1842 -1410 -331 635
2088 635 1144 1112 667 230 -384 -1208 -1523 -974 150 1461 1939 1169 -281 -1202 -1506 -970 -75 479 803
2107 803 1111 1031 302 -646 -1525 -1640 -602 834 1613 1414 589 -433 -996 -988 -877 -478 256 997 1374 1267
2127 1267 115 -1295 -1753 -1206 -91 1026 1326 859 333 -102 -679 -1041 -1000 -544 399 1499 1697 786
2145 786 -364 -1331 -1414 -598 263 704 865 937 527 -31 -909 -1555 -1390 -333 898 1471 1222 211 -789
2164 -789 -1004 -831 -548 -41 565 980 1209 951 -169 -1212 -1507 -920 196 1197 1291 673 21 -488 -776
2183 -776 -809 -630 -271 664 1386 1296 491 -609 -1286 -1182 -336 412 784 764 491 93 -335 -941 -1334 -1098 -206
$$ packed form
2051a350J297J435O17n98j406j068l46J48O01P23O07N54K35p14j310j041k09P76
2069a049J571J049n0o49q79q49k26MK39P58J141O48j88j069j465q28M32J079R66
2088F35N09l2m45m37o14q24l15N49J124J311M78p70j450r21l04N36Q95N54L24
2107H03L08q0p29r48q79j15J038J436P79j99q25j022n63QJ11L99P34P41L77j07
2127A267j152j410m58N47J115J117L00m67n26m35n77l62M1M56R43J100J98r11
2145G86j150r67q3Q16Q61M41J61P2m10n58q78o46J65J057J231N73k49j011j000
2164g89k15J73K83N07O06M15K29k58j120j043k95N87J116J001R4o18o52n09k88
2183g76l3J79L59R35P22r0q05j100o77J04Q46P48L72k0k73l98m28o06l93K36Q92
$$ plain form
2204 -206 916 1410 1043 -62 -942 -1052 -638 -104 521 838 946 1012 638 -261 -997 -1191 -596 437 1218
2223 1218 1105 414 -317 -856 -972 -788 -516 -136 614 1088 909 186 -799 -1400 -1071 -73 637 905 802 241
2243 241 -191 -413 -808 -1013 -576 142 891 1345 899 -157 -823 -931 -556 227 889 886 925 753 233 -413 -927
2264 -927 -1048 -539 435 1003 723 43 -713 -1266 -1060 -670 -368 96 612 780 676 212 -680 -1141 -587 198
2284 198 900 1350 971 113 -239 -498 -705 -495 -187 253 849 1124 438 -301 -867 -1045 -411 498 849 806
2304 806 693 230 -207 -513 -892 -997 -337 412 770 689 -107 -1046 -1291 -840 -450 110 496 558 604 653 113
2325 113 -514 -610 -293 351 1254 1403 798 79 -487 -756 -555 -240 -184 197 619 537 128 -543 -1157 -1159 -301 445
2347 445 730 792 330 -230 -267 -441 -643 -496 -27 402 857 767 -136 -888 -1064 -712 -48 609 733 544 528
$$ packed form
2204b06J122M94l67j105q80j10M14N34O25L17J08O6l74q99p36j94N95J033P81
2223A218j13o91p31n39j16J84K72L80P50M74j79p23r85o01L29R98P10K68j03n61
2243B41m32k22l95k05M37P18P49M54m46j056o66j08L75P83O62lL9j72n20o46n14
2264i27j21N09R74N68k80o80p56n53K06L90L02M64N16J68j04m64q92m61N54P85
2284A98P02M50l79q58l52k59k07K10L08M40N96K75o86p39n66j78O34R09L51m3
2304H06j13m63m37l06l79j05O60P49L58q1p96r39k45M51L90N60L86O2M6M9n40
2325A13o27r6L17O44R03J49o05p19n66k69K01L15N6L81M22q2m09o71o14kQ58P46
2347D45K85O2m62n60l7j74k02J47M69M29M55r0r03p52j76L52O64O57J24j89j6
$$ plain form
2368 528 332 20 -257 -474 -259 525 1127 1064 579 -301 -945 -791 -469 -294 -116 100 164 207 -6 -712 -1239
2389 -1239 -928 -241 603 1039 759 171 -134 -246 -234 -155 -60 191 612 909 655 -26 -742 -1016 -608 227 694
2410 694 638 390 102 -97 -162 -395 -557 -182 414 822 848 271 -600 -959 -775 -329 -15 152 124 132 159 -69
2432 -69 -595 -893 -718 21 786 1116 765 113 -297 -298 -87 138 151 306 489 636 426 -218 -864 -991 -513
2453 -513 179 652 470 71 -186 -292 -334 -408 -460 -165 422 846 720 175 -572 -922 -524 -8 357 492 302
2474 302 53 81 -76 -431 -623 -419 161 702 987 577 -117 -488 -463 -226 81 223 195 395 424 144 -335
2495 -335 -804 -908 -397 335 588 446 42 -347 -446 -246 -244 -219 78 399 694 726 129 -608 -776 -377 54 517
2517 517 590 269 9 -73 -188 -378 -422 -343 88 670 738 317 -273 -624 -672 -158 253 237 286 284 149 90 -238 -686
$$ packed form
2368E28j96l12k77k17K15P84O02o3m85q80o44J54L22J75J78K16O4M3k13p06n27
2389a239L11O87Q44M36k80n88l05j12J2P9R5K51M21K97k54o81p16k74M08Q35M67
2410F94n6k48k88j99o5k33j62L75N96M08K6n77q71l59J84M46L14J67k8QK7k28
2432f9n26k98J75P39P65L30l51o52m10jK11K25J3J55J83J47k10o44o46j27M78
2453e13O92M73j82l99k57j06m2p4n2K95N87M24j26n45p47l50L98N16L65J35j90
2474C02k49K8j57l55j92K04N80N41K85m10o94l71K5K37L07J42k8K00K9k80m79
2495c35m69j04N11P32K53j42m04l89r9K00KK5K97L21K95L2n97p37j68L99M31M63
2517E17P3l21k60q2j15j90m4P9M31N82O8m21n90l51m8N14M11j6M9kj35n9l28m48
$$ plain form
2541 -686 -687 -113 416 681 588 -1 -491 -377 -280 -128 52 232 256 534 405 -120 -520 -629 -457 137 641 553
2563 553 243 -22 -245 -341 -247 -286 -121 245 504 568 252 -355 -686 -503 -70 181 381 382 138 50 -17 -249 -415
2586 -415 -438 -68 395 691 496 -73 -490 -587 -390 5 217 137 211 243 110 -132 -433 -667 -315 227 628 600
2608 600 288 -157 -396 -194 -121 -53 3 260 441 523 190 -389 -747 -533 -135 325 520 222 -59 -141 -163 -285
2630 -285 -228 -210 -15 444 639 367 -126 -449 -597 -284 196 304 184 181 127 51 -72 -371 -457 -225 308 642
2652 642 610 211 -311 -416 -205 3 165 153 176 249 330 55 -402 -658 -608 -125 358 534 163 -171 -304 -255
2674 -255 -147 -107 -131 70 406 520 382 -32 -458 -528 -63 296 414 293 66 -68 -27 -51 -299 -435 -133 184
2696 184 547 534 35 -410 -472 -285 72 230 161 47 107 151 -140 -357 -563 -513 -47 522 466 145 -190 -391
$$ packed form
2541f86jN74N29K65r3n89m90J14R7J52J80J80K4K78j29n25m00j09J72N94N04q8
2563E53l10k65k23r6R4l9J65L66K59O4l16o07l31J83M33K51K00Jk44q8o7k32j66
2586d15k3L70M63K96j95n69m17r7J97L95K12q0P4L2j33k42l01k34L52N42M01k8
2608F00l12m45k39K02P3O8N6K57J81Q2l33n79l58K14L98M60J95k98k81q2k2j22
2630b85N7J8J95M59J95k72m93l23j48L13M80J08j20ln4p6j23k99q6K32N33L34
2652F42l2l99n22j05K11K08J62j2K3P3Q1k75m57k56N0M83M83J76l71l34j33M9
2674b55J08M0k4K01L36J14j38m14m26p0M65L59J18j21k27j34M1k4k48j36L02L17
2696A84L63j3m99m45o2J87L57J58o9j14O0M4k91k17k06N0M66N69n6l21l35k01
$$ plain form
2718 -391 -163 28 5 30 199 468 496 411 -124 -554 -380 16 364 509 273 -97 -267 -181 -189 -303 -320 -186 174
2741 174 506 381 -84 -379 -482 -247 136 322 155 93 130 112 -41 -199 -486 -359 147 477 466 165 -249
2762 -249 -374 -171 53 164 127 210 213 445 311 -129 -522 -433 -96 310 439 151 -235 -311 -339 -246 -184 -187 -186 199
2786 199 365 273 -26 -370 -480 -167 304 361 290 127 35 52 43 -205 -266 -164 150 427 449 124 -351 -503 -210
2809 -210 10 235 219 145 134 177 136 -242 -389 -382 -121 317 369 117 -196 -378 -364 -210 -57 -10 5 212 331 301
2833 301 -29 -339 -424 -65 294 431 345 63 -56 -103 -27 -170 -255 -151 88 332 329 24 -371 -481 -295 38
$$ packed form
2718c91K28J91k3K5J69K69K8q5n35m30J74L96L48J45k36l70j70Q6qj14j7J34L60
2741A74L32j25m65k95j03K35L83J86j67o2L7j8j53j58k87J27N06L30j1l01m14
2762b49j25K03K24J11l7Q3LK32j34m40l93Q9L37M06J29k88l86p6k8R3O2lJL85
2786A99J66r2k99l44j10L13M71N7p1j63r2J7rk48o1J02L14K77K2l25m75j52K93
2809b10K20K25j6p4j1M3m1l78j47PK61M38N2k52l13j82J4J54J53M7J5K07J19l0
2833C01l30l10q5L59L59J37q6k82j19m7P6j43q5J04K39K44ll05l95j10J86L33
$$ [...]
8191I
##END NTUPLES=NMR FID
##END=
