##TITLE=1H_Pr 68-D
 DMSO
 8 sc, 
 17.11.2022
##JCAMPDX= 6.0         $$ Bruker NMR JCAMP-DX V2.0
##DATA TYPE= NMR FID
##DATA CLASS= NTUPLES
##ORIGIN= UXNMR, Bruker Analytische Messtechnik GmbH
##OWNER= root
$$ XWIN-NMR		Version 3.5
$$ Thu Nov 17 16:29:29 2022 Russian Standard Time (UT+4h)  she@DPX200
##.OBSERVE FREQUENCY= 200.1313499994
##.OBSERVE NUCLEUS= ^1H
##.DELAY= (6, 6)
##.ACQUISITION MODE= SIMULTANEOUS
##.ACQUISITION SCHEME= undefined
##.AVERAGES= 8
##.DIGITISER RES= 18
##SPECTROMETER/DATA SYSTEM= spect
##.PULSE SEQUENCE= zg30
##.SOLVENT NAME= DMSO
##.SHIFT REFERENCE= (INTERNAL, DMSO, 0, 15.7039)
##AUDIT TRAIL= $$ (NUMBER, WHEN, WHO, WHERE, WHAT)
$$ ##TITLE= Audit trail, XWIN-NMR		Version 3.5
$$ ##JCAMPDX= 5.01
$$ ##ORIGIN= Bruker BioSpin GmbH
$$ ##OWNER= she
$$ F:/spectra/data/she/nmr/H-F/1/audita.txt
$$ ##AUDIT TRAIL=  $$ (NUMBER, WHEN, WHO, WHERE, WHAT)
(   1,<2022-11-17 16:28:09.04 +0400>,<she>,<DPX200>,
      <created by zg, POWCHK disabled, PULCHK disabled
       configuration hash MD5:
       00 E9 B6 7A A2 85 ED C7 34 08 36 98 17 FE 4E 26
       data hash MD5: 16K
       46 B1 D9 AE 38 59 B0 E5 5A 5D 72 15 68 57 FA 82>)
$$ ##END=
$$ 
$$ hash MD5
$$ B9 FC FC B1 FF 9A 62 BD 11 3D FF DD D4 67 15 98
##$RELAX= 
##$RELAX= 
##$RELAX= 
##$RELAX= 
##$RELAX= 
##$RELAX= 
$$ Bruker specific parameters
$$ --------------------------
##$DU= <F:/spectra>
##$EXPNO= 1
##$NAME= <H-F>
##$PROCNO= 1
##$TYPE= <nmr>
##$USER= <she>
##$AMP= (0..31)
100 100 100 100 100 100 100 100 100 100 100 100 100 100 100 100 100 100 
100 100 100 100 100 100 100 100 100 100 100 100 100 100 
##$AQSEQ= 0
##$AQ_mod= 1
##$AUNM= <au_zg>
##$AUTOPOS= <>
##$BF1= 200.13
##$BF2= 200.13
##$BF3= 200.13
##$BF4= 200.13
##$BF5= 200.13
##$BF6= 200.13
##$BF7= 200.13
##$BF8= 200.13
##$BYTORDA= 1
##$CFDGTYP= 0
##$CFRGTYP= 5
##$CHEMSTR= <none>
##$CNST= (0..31)
1 1 145 1 1 1 1 1 1 1 1 1 1 1 1 1 1 1 1 1 1 1 1 1 1 1 1 1 1 1 1 1 
##$CPDPRG= <>
##$CPDPRG1= <>
##$CPDPRG2= <>
##$CPDPRG3= <>
##$CPDPRG4= <mlev>
##$CPDPRG5= <mlev>
##$CPDPRG6= <mlev>
##$CPDPRG7= <mlev>
##$CPDPRG8= <mlev>
##$CPDPRGB= <>
##$CPDPRGT= <>
##$D= (0..31)
0 1.2 0 0 0 0 0 0 0 0.06 0 0.03 0 0 0 0 0.0002 0 0 0 0 0 0 0 0 0 0 0 0 
0 0 0 
##$DATE= 1668688088
##$DBL= (0..7)
120 120 120 120 120 120 120 120 
##$DBP= (0..7)
150 150 150 150 150 150 150 150 
##$DBP07= 0
##$DBPNAM0= <>
##$DBPNAM1= <>
##$DBPNAM2= <>
##$DBPNAM3= <>
##$DBPNAM4= <>
##$DBPNAM5= <>
##$DBPNAM6= <>
##$DBPNAM7= <>
##$DBPOAL= (0..7)
0.5 0.5 0.5 0.5 0.5 0.5 0.5 0.5 
##$DBPOFFS= (0..7)
0 0 0 0 0 0 0 0 
##$DE= 6
##$DECBNUC= <off>
##$DECIM= 32
##$DECNUC= <off>
##$DECSTAT= 4
##$DIGMOD= 1
##$DIGTYP= 9
##$DL= (0..7)
0 120 120 120 120 120 120 120 
##$DP= (0..7)
150 150 150 150 150 150 150 150 
##$DP07= 0
##$DPNAME0= <>
##$DPNAME1= <>
##$DPNAME2= <>
##$DPNAME3= <>
##$DPNAME4= <>
##$DPNAME5= <>
##$DPNAME6= <>
##$DPNAME7= <>
##$DPOAL= (0..7)
0.5 0.5 0.5 0.5 0.5 0.5 0.5 0.5 
##$DPOFFS= (0..7)
0 0 0 0 0 0 0 0 
##$DQDMODE= 0
##$DR= 18
##$DS= 0
##$DSLIST= <SSSSSSSSSSSSSSS>
$$ [...]
##$SUBNAM2= <"">
##$SUBNAM3= <"">
##$SUBNAM4= <"">
##$SUBNAM5= <"">
##$SUBNAM6= <"">
##$SUBNAM7= <"">
##$SUBNAM8= <"">
##$SUBNAM9= <"">
##$SW= 18.0517283424941
##$SWIBOX= (0..15)
0 0 2 0 0 0 0 0 0 0 0 0 0 0 0 0 
##$SW_h= 3612.71676300578
##$TD= 16384
##$TD0= 1
##$TE= 0
##$TE2= 300
##$TE3= 300
##$TEG= 300
##$TL= (0..7)
0 120 120 120 120 120 120 120 
##$TP= (0..7)
150 150 150 150 150 150 150 150 
##$TP07= 0
##$TPNAME0= <>
##$TPNAME1= <>
##$TPNAME2= <>
##$TPNAME3= <>
##$TPNAME4= <>
##$TPNAME5= <>
##$TPNAME6= <>
##$TPNAME7= <>
##$TPOAL= (0..7)
0.5 0.5 0.5 0.5 0.5 0.5 0.5 0.5 
##$TPOFFS= (0..7)
0 0 0 0 0 0 0 0 
##$TUNHIN= 0
##$TUNHOUT= 0
##$TUNXOUT= 0
##$USERA1= <user>
##$USERA2= <user>
##$USERA3= <user>
##$USERA4= <user>
##$USERA5= <user>
##$V9= 5
##$VALIST= <valist>
##$VCLIST= <CCCCCCCCCCCCCCC>
##$VD= 0
##$VDLIST= <DDDDDDDDDDDDDDD>
##$VPLIST= <PPPPPPPPPPPPPPP>
##$VTLIST= <TTTTTTTTTTTTTTT>
##$WBST= 1024
##$WBSW= 4
##$XGAIN= (0..3)
0 0 0 0 
##$XL= 0
##$YL= 0
##$YMAX_a= 48725
##$YMIN_a= -38116
##$ZGOPTNS= <>
##$ZL1= 120
##$ZL2= 120
##$ZL3= 120
##$ZL4= 120
##$ABSF1= 10
##$ABSF2= 0
##$ABSG= 5
##$ABSL= 3
##$ALPHA= 0
##$AQORDER= 0
##$ASSFAC= 0
##$ASSFACI= 0
##$ASSFACX= 0
##$ASSWID= 0
##$AUNMP= <proc_1d>
##$AZFE= 0.1
##$AZFW= 0.1
##$BCFW= 1
##$BC_mod= 2
##$BYTORDP= 1
##$COROFFS= 0
##$CY= 11.3945322036743
##$DATMOD= 1
##$DC= 2
##$DFILT= <>
##$DTYPP= 0
##$F1P= 2.36226072786647
##$F2P= -0.459571619588291
##$FCOR= 0.5
##$FTSIZE= 0
##$FT_mod= 4
##$GAMMA= 1
##$GB= 0.15
##$INTBC= 1
##$INTSCL= 1
##$ISEN= 128
##$LB= 0.24
##$LEV0= 0
##$LPBIN= 0
##$MAXI= 10000
##$MC2= 0
##$MEAN= 0
##$ME_mod= 0
##$MI= 1.114404
##$NCOEF= 0
##$NC_proc= 0
##$NLEV= 6
##$NOISF1= 3.799351
##$NOISF2= 2.8
##$NSP= 1
##$NTH_PI= 0
##$NZP= 0
##$OFFSET= 15.70392
##$PC= 1
##$PHC0= -18182.46
##$PHC1= 2.0007
##$PH_mod= 1
##$PKNL= yes
##$PPARMOD= 0
##$PSCAL= 0
##$PSIGN= 0
##$REVERSE= no
##$SF= 200.130013532006
##$SI= 16384
##$SIGF1= 3
##$SIGF2= 2
##$SINO= 400
##$SIOLD= 16384
##$SREGLST= <1H.CDCl3>
##$SSB= 0
##$STSI= 0
##$STSR= 0
##$SW_p= 3612.71676300578
##$SYMM= 0
##$S_DEV= 0
##$TDeff= 0
##$TDoff= 0
##$TI= <>
##$TILT= no
##$TM1= 0
##$TM2= 0
##$TOPLEV= 0
##$USERP1= <user>
##$USERP2= <user>
##$USERP3= <user>
##$USERP4= <user>
##$USERP5= <user>
##$WDW= 1
##$XDIM= 8192
##$YMAX_p= 0
##$YMIN_p= 0
$$ End of Bruker specific parameters
$$ ---------------------------------
##NTUPLES= NMR FID
##VAR_NAME=  TIME,          FID/REAL,        FID/IMAG
##SYMBOL=    X,             R,               I
##VAR_TYPE=  INDEPENDENT,   DEPENDENT,       DEPENDENT
##VAR_FORM=  AFFN,          ASDF,            ASDF
##VAR_DIM=   8192,          8192,            8192
##UNITS=     SECONDS,       ARBITRARY UNITS, ARBITRARY UNITS
##FACTOR=    0.0002768,     1,               1
##FIRST=     0,             0,               0
##LAST=      2.2672688,     0,               0
##MIN=       0,             -38116,          0
##MAX=       2.2672688,     48725,           0
$$ Real data points
##PAGE= N=1
##DATA TABLE= (X++(R..R)), XYDATA
$$ [...]
480a87l10j47J377L31j651l5n4r0J190j64o00l63k02J302M99l90J53j242K41J483
500A141j12m27r70n93R40J64K49n9j732M33J050L08L94q69p50L95M53J068n69
519E14j471M03J54M84P20q87l09J17O4J132j18o27j84m35R55L66q87j49p62L28
539e92R80n87R7rr54P13Q92K69l32j273L39Q04J15M77j124r83J066N29L23l00
559D50j039L59L24J67O15q70n19K33r8P23j2o97j01n08Q73R14q88o6r6k33J026
580E57J70j82o57p02J037M43n36J48p60l63Q25L75K79n86q37M89L24O63L27j559
600e45m32O33M40M94o87n36K03LJ026K64j117J59n2K08P20l90l13m13k88J031
620D08R0n13j33o55O04O88k64M7q10k26J048Q3K0j66j081K93P30N95j70j231J08
$$ y = [-187, -497, -644, 733, 1064, -587, -622, -676, -766, 424, 260, -340, -703, -905, 397, 896, 506, 659, -583, -342, 1141, 1029, 602, -368, -961, -21, 143, 392, 333, -1399, -966, 84, 392, 786, -83, -833, -438, 15, 1083, 514, -957, -554, -400, 84, 804, -83, -392, -275, -211, 921, 803, 176, -8, -443, 512, 878, -9, -158, -920, -592, 388, -199, -102, -111, -1065, -352, 540, 809, 477, -796, -457, 347, 462, 939, -185, -1168, -102, 427, 750, 450, -589, -230, 94, 261, 876, 6, -513, -280, -378, 345, 333, -364, -465, -973, -100, 814, -74, -140, -236, -469, 557, 727, 545, -112, -814, 223, 666, 130, 278, -482, -845, -20, 355, 634, 48, -789, -300, 24, 687, 1014, -545, -977, -344, 96, 590, -97, -633, -430, -427, 599, 863, -254, -95, -147, 61, 781, 391, 78, -335, -623, 408, 498, -15, -148, -803, -199, 489, 225, 272, -538, -764, 284, 367, 387, 221, -860, -567, 163, 758, 588, -643, -535]
641e35N85m4Q59m52j260M02N49M30Pq20p3j06L03R71o46o17J0l0R49J21o16o1
663g4n76M43J064m55m77l82p4Q65L5J29l69j163P21Q20j86J13p15m99N85M23N47
684G75n88r09N13J75M58L55j034k72K07K36P90n13o16J84k42O76N81p10l22j61
704d17K57O76l16q0n40m12J224K80n70j32m81K43P41J0J2p89m11Q66J75J18l39
725A15q14K55K90L83M48j130l92P77J23M63l0p95j23J61R63P3j004N9j41q7J129
746G23k83o88j29k8P30L32l99k84o94L71Q78k79j81n72m54R51K80Kn1r00K98P28
768C51J37J89p46l68M08J54N74l79j027L96J06J54N96o13l63M7K50O91l35m75
788b53J68l78M66M82n61k37l55L89P85k72n7j02n11P14N05k83l13n46J63L65j25
$$ y = [-535, 50, 6, 865, 413, -847, -445, 104, 534, 541, -279, -352, -458, -155, 816, 170, -447, -437, -467, 482, 603, -13, -74, -650, -207, 857, 402, -75, -457, -531, 334, 369, 498, 129, -1034, -313, 507, 321, 434, -281, -780, -195, 228, 775, 187, -722, -209, -34, 424, 779, -255, -527, -320, -84, 706, 193, -423, -239, -481, 195, 776, 66, -256, -417, -160, 516, 200, 120, -420, -832, 392, 672, 102, -30, -511, -268, 473, 483, 495, -294, -705, 161, 336, 454, 115, -699, -444, -154, 229, 677, -453, -845, -68, 55, 518, 488, -307, -430, -269, 694, 767, -237, -178, -319, -406, 723, 440, -248, -377, -405, 325, 657, 258, -26, -720, -349, 529, 250, 69, -503, -957, -6, 274, 276, 225, -675, -377, 351, 488, 677, -69, -437, -29, 125, 699, 320, -707, -311, -205, -51, 545, -68, -431, -384, -134, 557, 222, -253, -85, -463, 3, 485, -76, -313, -668, -279, 506, 234, 177, 75, -436, 278, 783, 500, 187, -359, -196, 169, 44]
809D4L63p49o07P33K62J80M5p33R6K72L28N08p94m03K52O1N29n9n45J8j86N98
831B13N58p51j31qk02Q06J21n14l91l94O67K81l28R9p78N3R55J18n0l05m70M89
853C8K37K65Rr36lL61J91K68n44l47L02L5O01P1q50M0J22K21L69m70l37j05J3
876d49Q33j46n42J66k53M26N36k14j87m40K3P86k32j46r2o04K90M54km0o68Q1
898d20M58q1M68l11o68L79K91K32k7o01j6K5J91O00m58m41L09p2N51Q7m31p4l20
921c29K39O31m71k01j97k59O62J46r3k26n01N39M58k17J52m98l61N82J75J69l35
942F5n71L92R5K44K99o41l56K82K39M04l80l66J43j89N20L46o84r6j4J44N87l26
964A37j72j72j98P19J55m46k5m08K44M94j02o4m98k12O93K8J8j62n90L05L75J02
$$ y = [44, 407, -342, -949, -216, 46, 226, 271, -462, -366, -94, 234, 742, -52, -455, -203, -142, 387, 328, -217, -199, -385, 213, 771, 20, -111, -119, -321, 485, 606, 92, -299, -693, -26, 255, -73, 26, -752, -699, 256, 374, 324, 19, -451, 38, 275, 540, 549, -387, -390, -29, 162, 430, -114, -461, -159, -124, 477, 548, -302, -262, -140, 81, 450, -20, -357, -462, -449, 384, 238, -304, -138, -391, 35, 571, 357, 170, -270, -247, 539, 307, 161, 69, -535, -245, 209, 207, 167, -501, -420, 38, -43, 425, 114, -554, -175, 116, 348, 321, -280, -296, -271, -80, 520, 62, -379, -70, -142, 409, 496, 65, -9, -329, -90, 541, 70, -131, -328, -587, 75, 221, 128, -98, -599, -60, 398, 181, 333, -165, -526, 56, 231, 400, 65, -506, -114, -19, 225, 524, -117, -473, -191, 48, 452, 72, -294, -151, -340, 180, 526, -158, -254, -268, -124, 463, 137, -35, -207, -405, 314, 469, 23, -2, -410, -166, 328, 226, 162, -336, -548, 145, 173, 191, 29, -561, -256, 119, 221]
986B21J94o41o9L55J6M81k43o57J07J04L98J10o38k0m0R6O72k16n71J00N4M38
1008B51J65l02n0n07K47P05l07j70j77j76L78K00N6j39o32L47L67j36J91m72l74
1029e35L08J80L45k56o47L01J44K32L41m05j37lJ64O32k72m73J40k76L08L62m73
1050b0k46p6J33N22k32rk22l18O13J68k49q7m21oM84Q9M3m46k10N94J24J85P7
1073D90n71O4K41J47K30p02l89L25o9L70On91o6J44M28L25n05q7P2q8N87n2l99
1096i0j79j20N05J81k76J31l61M3O57Nj23l00k86M04p3J8j09p07L3N09k3Q5j47
1119b23k52K52K43M06Rn75K38J2K2M50m39k66rk1M94r2l55P1j52L11L22l13r2
1142D1l51L5L77k53m2q9l78L35L73o6N6k37K18K89J20L07l93n35L85OK3j6n31
$$ y = [221, 415, -226, -295, 60, 76, 557, 314, -343, -236, -132, 266, 376, -262, -282, -322, -226, 446, 230, -341, -241, -187, 251, 416, 114, 64, -443, -196, 509, 202, 32, -145, -321, 57, 257, 313, 174, -458, -111, 256, 120, 311, -161, -535, -227, -47, 298, 42, -605, -304, -160, 72, 413, 8, -129, -132, 32, 664, 392, -81, 59, -217, 91, 453, -20, -266, -342, -209, 313, 81, 72, -150, -468, 145, 313, 64, -23, -444, -450, 34, 123, 166, -280, -490, 104, 228, 413, 490, -81, -17, 224, 371, 601, -101, -490, -165, -234, 136, 142, -449, -515, -371, 57, 382, -123, -210, -138, -226, 361, 309, -90, -269, -389, 116, 297, 21, 152, -209, -166, 491, 496, 373, 73, -213, 191, 118, 136, 27, -680, -647, -138, -161, -76, -223, -475, -223, 20, 426, 435, -140, 98, 110, 132, 582, 143, -123, -132, -153, 341, 249, -106, -35, -187, 124, 446, 133, 41, -310, -275, 102, -151, -193, -282, -660, -325, 48, -18, 38, -199, 19, 308, 428, 735, 342, -193, 192, 198, 221, 205, -326]
1165c26j04R9K08L67l37l15K72J7L82M4m53n1k14K63L69l76k3j12l4N76J83j48
1187B87q4k16L96K36k97k5m55j95M21p1r3k71l15L28J89J16K09m09l2L63J56J64
1209D02k72k84P4j02M58O2n20P0J05R9M40j90k03p1o4L56j29l56p0l24R6L30k29
1232c22K5j52k8O08Q8j6M7l19J59K55Q5j08m67n4K70j61K97k5n24K70J05J77L5
1255B45k41j27j02Q1L74l08l57M9r1L58J81j86P2j54K73M42r3j37l9k50L16jj26
1278A79j92m22K15K14j03J56k77k29L60J51J97j55l98J47J02N4K31m44j36J31
1298b19K05L11j12j97J41r5L12K85m45j90j5J2J66j74j78k10j78N09J09j91Jo7
1320b20J01M56j07m5k72j05L48K6m3j2m66J59K79O0K23m14j50K94L8J46j23m25
$$ y = [-326, -430, -331, -123, 244, -93, -408, -136, -119, 263, 307, -146, -197, -411, -148, 221, -155, -178, -290, -324, 252, 435, 287, 203, -13, 383, 619, 322, 297, -158, -353, 68, -3, -96, -367, -682, -354, -165, -49, 160, -249, -281, 82, 238, 402, 130, -154, -80, -182, 276, 338, -182, -112, -7, 92, 532, 342, 139, 68, 4, 360, 231, -125, -195, -519, -423, -93, -322, -297, -449, -477, 131, 219, 203, 250, -69, 90, 345, 430, 322, -145, -199, 71, -90, 207, 182, -342, -72, 33, 210, 245, 4, -123, -225, -144, 230, -78, -435, -386, -477, -119, 62, -124, -52, -206, 67, 509, 416, 279, 240, -10, 306, 305, 179, -13, -435, -220, -6, -109, 47, -230, -459, -99, 52, 249, 94, -304, -157, -55, -1, 230, -214, -350, -219, -14, 297, 185, -12, 129, 34, 346, 631, 186, -4, -19, -7, 159, -15, -193, -403, -581, -72, 37, -154, -153, -220, -119, 337, 230, 185, -87, -192, 156, 182, 139, 127, -339, -180, 99, 159, 382, -32, -182, 112, 150, 296, 173, -252]
1342b52JpJ97J27l60K5k6L9M65l5k38J17n9J74K25j66r0k91M9L33j73m1q6k12
1366b84K76J23Jm6l82J55L11n4J1k07k73J55J13J71K2m27K09J55O4K69j46k68
1388e2P5R3K63j41l01k7j23J31K91k46j04j67J27L84p5p5o2k97K77K54j47n0k11
1411a83K0K54QJ03k24l04L82P2J05M7l65j05J78J29P1j78k76J50MK23m8k15l0
1434a82K3K46K19k83r5M9o7K47L4k19j22l2K05J71j17n3j74l8L17L3q7j24j43
1457a92J18J53PN6l84PK71P2R8k23k13R3Q4J96J05l55m9J13N1K10j31k20l1L8
1481a26L28j01j47rj19J05K88j98nj66l3L46k6o1k7k96J25K65m8j3l27P3K06K2
1505E6Q6l4m20K07J71P5M9k68m7N5P2K98j80k36O4p2K72M3j42j03j38J93K56j50
$$ y = [-252, -251, -258, -61, 66, -294, -269, -295, -256, 209, 174, -64, 53, -6, 168, 393, 227, 137, -154, -105, 228, 55, 14, -72, -284, -8, 115, 116, 70, -312, -157, 154, 100, 111, -96, -369, -214, -101, 70, 92, -335, -126, 29, 93, 362, 216, -52, 23, 116, 379, 238, -63, -90, -213, -82, 209, -37, -141, -308, -181, 203, 128, 53, -9, -306, -29, 225, 78, 28, -183, -163, 91, 99, 202, -22, -326, 56, 128, 233, 280, -85, -190, -12, 117, 188, 10, -266, -116, -112, 111, 63, -152, -182, -159, 87, 306, 23, -72, -23, -90, 157, 191, -28, -150, -182, 23, 194, 77, 24, -150, -188, 129, 162, 75, -49, -192, -74, 79, 86, 142, -242, -235, 36, 108, 206, -17, -230, -137, -53, 143, 248, -107, -156, -43, 8, 218, 87, -133, -164, -126, 202, 101, -46, -55, -174, -69, 219, 21, 16, -150, -183, 163, 137, 76, 49, -247, -122, 143, 95, 82, -245, -172, 34, 56, 142, 108, -312, -105, 66, 141, 190, -78, -125, -70, 2, 300, 120, -116, -52, -124, 148, 191, 49, -54, -192, 1, 257, 107]
1529A07j38n2j11K57N9j02j37j74K51J35p8R1k31m7K37J29J8j28k91K17L4K1O1
1552A28k22j84K45M5J21q1k30R9PJ39J56l81lJ24K0J37k0j44r3j8K99M7j40K6
1576G7j67O5K22j7j00j78j08K77rj00j9j92R5J74J02qj73r9Q9J34J46p5l63R1
1600a36J26J25R4k66q6Q1M1L13j15k35lo7J66J51k22k6k08O2L24j72n9M2q4J63
1624IJ43rnl02J67J62k1J1j73j82J69J43N3j43k18J58O2K7J43j90j92J34K6J13
1648H5o2j61j11R8J16K34k36m9M7QK28l4l0r1k12K00J28j23o7j35M4J74k3M1j44
1673g5j72L03J9l4Qj56q6Q1K10R3l07j20K33j06K50K3k31kN6J25J03j81o0m5m9
1698a20K94k1k38mj23J73J80j30k2j02RK66o8J1j00j65J42N3O3ol09O6K59L3j7
$$ y = [107, -31, -83, -194, 63, 122, 20, -117, -291, -40, 95, 17, 108, -123, -170, 67, 196, 214, 86, -205, 12, 46, 67, 128, -94, -278, -33, 12, 133, 52, -178, -79, -72, 67, 223, -158, -161, -37, -17, 120, 100, -44, -137, -155, 144, 191, 51, 77, -90, -25, 197, 180, 80, -98, -206, 71, 62, -38, -57, -249, -154, 20, 122, 114, -59, -158, -69, 65, 211, 136, -227, -136, -10, 115, 209, -57, -143, -62, -21, 292, 177, -58, -61, -128, 38, 189, -33, -59, -267, -205, 119, -53, -112, -70, -154, 9, 152, 143, 138, -164, 3, 165, 144, 155, -18, -200, -31, 112, 165, 22, -196, -38, 24, 51, 194, 4, -188, -54, -28, 85, 23, -138, -249, -151, -35, 199, -37, -86, -39, -31, 197, 163, 133, 42, -170, 30, 158, 35, -32, -167, -123, 51, 28, 69, -75, -247, 56, 75, 41, 49, -107, -193, -112, 98, 191, -116, -236, -3, -109, 141, 164, -67, -69, -13, 112, 215, 34, -26, -71, -120, 174, 153, -85, -89, -212, -39, 141, 11, -11, -113, -104, 162, 94, 105, 5, -160, -18, 35, 98, 92, -217, -151, 108, 141, 124]
1723A24p6j71O0J4J88o3k18J7MK5K63j09k64J17L3J52J3k09L6k9J28J73j16p5
1747A7j27J6K25m2m5q4k45K24K29q1l5j47j7J20M2Q7j42k08J68J12K1M3k33pJ38
1772B9O6J45j91j88J81n9J02Q6j77r5k0J27K18k70pj9o4K15O6k22j2l8J21J12
1796A06q1O3j73q9K77M8o1j36j20K11L9Lk3j70l2J55R1j0n1j18rK9J48J05l25
1821a23N9J9M6Q9J2j19j15J21R9m5k2l7j54R2K06l7q2j24k5J86nj4q0r8O0K41
1847A50o5K6j88rJ36QP0m0k94J08J71N4l9j41%j1O6J67o8j96M0LR2P2j11l8m3
1874h0O4K22j98n2Ln2R8J12l3p6j79J13J22p0N9j24j81J93J87o7Jj68O2R7m1J43
1900A55j51q8N2m2K39j30j67R6K1N1J34k29l3P1K2J06m6p9mj89K66P1k00N8j09
$$ y = [124, 48, -123, -63, -49, 139, 76, -142, -125, -121, -96, 167, 58, -206, -89, -56, 96, 109, -100, -64, -93, 35, 208, 92, 17, -110, -94, 131, 89, 44, -40, -285, -61, 168, 87, 52, -95, -112, 8, 50, 137, -5, -213, -45, 67, 88, 131, -102, -109, 29, 95, 240, 49, -139, 42, -17, 85, 171, -6, -101, -121, 6, 224, -46, -53, -72, -136, 79, 145, -77, -89, -127, -6, 106, 25, 88, -85, -174, 103, 151, 90, -46, -166, 45, 84, 87, 64, -106, -138, 17, 108, 98, 47, -71, -80, -51, 97, 202, -123, -64, -45, 1, 90, 102, -17, -132, -11, 88, 43, 21, -16, -170, -78, 128, 91, 9, -115, -140, 46, 41, 27, -53, -151, -91, 150, 85, 111, -77, -86, 50, 58, 128, 88, -206, -98, 73, 127, 88, -53, -53, -64, 2, 169, 101, -95, -55, -52, 40, 112, 1, -37, -80, -16, 206, 8, -44, -41, -93, 5, 117, 84, 8, -171, -58, 64, -6, 53, -71, -252, -59, 128, 61, 62, -106, -44, 53, 12, 155, 4, -84, -32, -74, 165, 35, -132, -36, -15, 36, 170, -59, -92, -21, 1, 107, 61, -18, -22, -211, 55, 126, -74, -16, -125]
1925a25K3J91j3j04j8l0J54j8L4L9k81NJ50P9P1k00q3R2L8R6Lk06M0N6L7J01j51
1952b0k9n0k5J90M1j82P4o2J37O3q6oj25O9J43n0r4j2p6P3O9L0m2k41J03K32p5
1979D9j6o3j08R6M1J42n1j86L9M1N8J18j69j49J19M8J24q4r1l6M1K3J57j67j7
2004d1n2J6J17L9p5l6j91K38J52j15n1n4J9R9J6l1pj60J42QJN4j01r4J59K3op0
2032aj06Q0l0Q4J13j50n2J0J5J97r7q2On0J60j4o7l6o3N3R0n3N3j82K7Q0J17o0
2060D2m4j81J75R1m7J8j64QP5M1N%q2K0K4J58Mj90j0J8N7J03k9j58l7O1P4M3p7
2089bo2m7k1K07M3j10p1p1J98j2n5lr7J09Q6l3p7oq4J01J4O9l3j79J02M7M2M0
2117I5j50l7R4k2J38p4j44J23l8J3J39r8r5poK02j01n5j4p0J34K9m1j1j16J01
$$ y = [-125, -102, 89, 76, -28, -46, -76, 78, 60, 94, 133, -148, -143, 7, 86, 157, -43, -126, -34, 4, 100, 103, -103, -63, -7, 30, 131, -20, -49, -99, -124, 66, 107, -75, -1, -63, 74, 137, 51, 45, -80, -11, 132, 82, -12, -24, -100, -27, 42, 72, 30, -211, -108, 124, 49, 33, -30, -138, -42, -1, 141, 90, -96, -57, -16, 42, 160, -9, -158, -39, 9, 133, 49, -42, -78, -37, -14, 143, -24, -41, -93, -77, 40, 79, 4, -32, -223, 15, 167, 52, 1, -53, -34, 65, 81, 50, 43, -117, 25, 33, 34, 88, -13, -107, 52, 75, 69, -1, -107, -27, -57, 27, 140, -10, -62, -52, -37, 160, 63, -19, -13, -63, 97, 83, 16, -20, -83, -30, 60, 7, 60, -122, -95, -15, 102, 42, -2, -183, -8, 83, 36, 54, -110, -102, -27, 14, 19, 19, -63, -43, -19, 139, 143, -47, -57, -39, 18, 121, 92, -66, -103, -42, 32, 75, -2, -64, -111, -132, 75, 118, 8, -63, -134, 64, 52, -3, -6, -103, 6, 92, 59, -18, -24, -108, -7, 7, 76, 43, -136, -34, 13, 55, 95, -55, -92, 2, -20, 118, 44, -100, 23, -15, -2, 137, 39, -56, -63, -69, 133, 32, -23, -37, -107, 27, 56, 15, 4, -112, -11]
2143a1O6ok0q4p9J92Mrm4r3O7P6m3P4r4q5J03n3R2J6j61K4KR1Q9j19j9K8k0J19
2173A03o1p8K2q5J16M5o4J6p4n0K17l4ro3j45J65oM7O6k25K2J74m6J8j85MJ30
2200B0RM9Mj19J4R8o6J32j27q2L7j3J61J5j57p0PQ1J43j35mo8pJ38j6p1k3p0R8
2229b2Q9lm3n4M1Q9k4n2m1l6N3L6J0l3q1N2l4L2J15k9j50M7N5J13r5q9O2q6P1
2258gQ1j02l4K6k3J13L6p4k1r4J90O7j42L3j09J1O7q8L2m4o3Q1Q8k7P5j00o3J56
2286F5K9M1p4j60Q2J9P0Q1k11k8K6M7J05n7j04L3l2J85j9j81lj8J4J36n9k1p1
2313a05OJ94l7J5lr7M8K5j3K0j59P8O4q0N9j7j00O8K5R8K8j25k0o4P3R6o8j27
2341a18N6L4JK7k3j3L8l6J89o9l1p7m1J41j4j18m4n6P3J54p4k8l7m6J24j9P1J2
$$ y = [-11, 55, 49, 29, -55, -134, 58, 62, 53, 9, -84, -17, 59, 16, 90, -4, -89, 14, -39, 53, 69, -92, -68, -66, 25, 114, -5, -24, 4, -16, 103, 42, -36, -14, -99, 17, 62, -2, 14, -60, -110, 107, 73, 64, 1, -144, 21, 15, 62, 128, -97, -75, 99, 53, 71, -114, -110, 20, 29, 78, 82, -37, -23, 75, 9, 141, 14, -68, -31, -44, 117, 132, -25, -95, -88, -7, 136, 1, -3, -71, -78, 60, 44, -27, -50, -120, -22, 67, 64, 21, -33, 8, 97, 73, 21, -20, -56, -3, 33, 43, 10, -71, -19, -53, -21, 94, 65, -85, -38, 17, 130, 35, -54, 8, -78, -7, 74, -28, -62, -36, -59, 54, 90, 16, -5, -99, 91, 158, 16, 49, -60, -49, 18, -70, -38, -82, -145, -64, 24, -3, 72, -28, -91, 65, 94, 135, 61, -99, -17, 2, 72, 153, -58, -86, -60, -13, 92, 35, -69, -36, -68, 117, 98, -83, -86, -104, -90, 46, -13, -34, -105, -99, 95, 58, 73, 70, -27, 21, 46, 33, 53, -106, -28, 36, -44, 15, -2, -102, -34, -9, 89, 117, -8, -28, -92, -19, 77, 9, -118, -62, -28, -27, 0, -23, -36, 2, -34, 155, 86, 55, -22, -63, 78, 64, -54, -98, -154, -81, 73, -1, -29, -66, -112, 12, -7, 64, 76]
2369G6j34O6N5n3O4p2p5Q2L1K9j9o2j6O6ML4q1p7L5K6O6r0l8L4r6J02J01o8k7
2398c7kj2J38okl8j06J13L0l6J0j43N2P0n6J21j55m5J11L4M1Lj47L3k9N1O3r8
2426d2n2J0O8Q2K2j18N3o9J31K8r6j9n3K6Q8Oj16l2MO3RO4p0j06Q6O8l2L8o0j00
2456a19J05KL6N2j56N9M3K2R1j30n2M7PJ19q1p9k6j5L7M5k9m8Pj9J00J8j4j2n1
2485d1P6Qk8lj00L3Q1m5Q4l7j06R8NK9Or5k0P6qK0q6o7J30K1n1J1k3p1K5J07O5
2516I4q1k2K3J0K1L4o3j4o0L0R3q5N6j05j4J47j2p1j4Jk1P4K5mj17ON8K0K6qo0
2547c3J7L6M5Oj18l5J17l4K0J1j2q0L4Q1M5j48J8k9P7L1p9L5k5l4P0Ml0ko3O4
2577a1N2j4n5j7pP5J5m3J0p8N7NP5l4n4k6J4N8L3m1q4J8M1N2J6o2M1k8oN4o6k1
$$ y = [76, -58, 8, 63, 10, 74, 2, -73, 9, 40, 69, 50, -12, -28, 38, 42, 76, -5, -82, -47, -21, 45, -45, -83, -49, -145, -43, 58, -10, -37, -39, -51, 87, 81, 79, 41, -65, 48, 78, 42, 52, -91, -39, 31, -25, 96, -59, -104, 7, 41, 82, 85, -62, -29, -58, -7, 56, -42, -94, -84, -16, 66, 88, -30, 23, -46, 85, 113, 17, -2, -55, -29, 59, 65, -51, -83, -79, -16, -7, 57, -13, -119, -33, 35, 3, 41, -19, -119, -14, -12, 24, 76, -80, -21, 22, 44, 135, 5, -47, 0, 7, 126, 45, -34, -60, -75, -38, 7, -22, -70, -63, -82, 18, 36, 22, 10, -41, 35, 43, 15, 12, -88, -55, 26, -19, 65, 28, -78, 20, 25, 54, 60, -35, -55, 21, 13, 33, -53, -120, 10, 31, -20, -9, -32, -103, -78, 29, 94, 13, -9, 14, 24, 45, 79, 16, 2, -58, -28, 65, -20, 36, -69, -83, 64, 52, -19, -33, -32, -53, 21, 46, 42, -75, -69, -11, 9, 35, 27, -33, -16, 20, 65, 71, -47, -82, 35, 1, 21, 32, 20, -60, -26, 55, 100, -48, -30, -59, 18, 49, -30, 5, -20, -54, 16, 20, -10, -12, -75, -11, 41, 27, -28, -45, -52, 23, 38, -5, 5, -73, -16, -11, 64, 30, -24, -50, -36, 22, 55, 14, -70, -52, -11, 41, 57, -5, 36, 8, 2, 56, -10, -31]
2609c1l1J2M8M1q3N5q6M7R4n7nn1r5J69K2j1n9j0M5qQN9n2j09J03kJ2k3l3j4M2
2640cM4K9j03l6J5P0K1j2o6lj4N4O6r5ol5K1Q8mn4j4RP3J1k7m4n0L3J3L5J8k7
2672Gn4P0J6L8p1m3K2M7K0K3j39L5K2NM7m3n7l0J15K1L0j42L6p0N7L2Ol2k3kR6
2703C9j7j0L0q1L2K3K1k6m0l9J7N1J5j6p4J4R5p5J19j36L1J8k3P9m5jrJ4L6mq0
2734d2L3l9K8Q8Kl9Mm6K0J4Qr1J3j5Q3Krl9n2J17KNj0o7k1O2l4J08j04m7M6N1
2766C1M5oj00llM7M1o4l8J7j6L5L5p9l1P0k1N3j8j7J1n3J40j4k5n4n7N1J33p8
2796C2K4r2kN9K4J9p4n2R9m4N9N4j38qO2kj0l4k0J1jR3l4n4j3K6L1J4M3j23pM1
2828a7N2k4m7O6p3L7N9nk6o7K4N4J2m6J5o7JO3M2j2o6pM7mQ3l4k7p5K7J7N8p8
$$ y = [-31, -62, -50, -2, 39, -44, 11, -75, -28, 66, 9, 4, -47, -142, 27, 49, 38, -21, -31, 14, 6, 14, 73, 21, -88, 15, 13, 25, 2, -31, -45, -3, 41, 70, -33, -69, -54, 16, 37, 25, -41, -44, -58, -4, 62, -33, -39, -74, -53, 35, 31, -23, -37, -28, 45, 56, 29, -15, -65, -32, -19, 16, 34, 7, -47, 23, 39, 77, 6, -37, -15, 32, 52, 75, -64, -29, -7, -2, 45, 2, -55, -85, 30, 51, 81, -61, -25, -95, -38, -6, 0, -32, -55, -57, 39, 22, 12, 42, -39, -7, 16, 37, 11, -29, -68, -51, 0, 15, -1, -75, -61, 34, -41, 78, -58, -27, -9, -32, 47, 2, 1, -8, 6, 42, 38, -42, -9, -48, -20, 68, 70, 31, 35, -11, 9, 23, 31, -60, -47, -62, 21, 23, 14, -25, -77, 40, 42, 47, 37, -30, -51, 11, -23, 85, -19, -66, -20, 31, 76, 70, -30, -33, -36, 11, 52, -12, -50, -33, -49, -14, 21, -58, -89, -19, -40, 13, -5, -22, -11, -64, 76, 62, 37, -17, -74, -23, 110, 32, 56, -36, -38, 21, 45, 64, -10, -62, 37, -7, 52, 106, -32, -40, 22, 20, 10, -24, -44, -33, -34, 59, 25, -29, -42, -16, 15, 29, 72, -51, -58, -17, 35, 11, -36, 30, -43, -6, 53, 48, 22, -45, -21, 33, 45, -1, 14, -53, -52, 11, 53, 41, -25, -32, 15, 11, 94, 60, 33, -42, -15, 2, 60, -18]
2860a8j8JQQ5m8l3L2j02J06M9o9J2n5M4P1m9k3R3j30M3K9l6M0q0M1M1Rj1m3k1
2890c2O7J3k9o0nL9j3L8M6j08L6K7l3Q6m4o9%N6K2M3j10j5mK2R3k0p3J3o6J09
2920B9J9o4l7J0N9L8k7M2j02j8P0l4K7j1J0p1J06p2O4q8N6j4l4O4Qp9M5n9O0K
2950akm3kJ2Q0Oj16ON5l5N0k8K5m8K6O5rj3qo5J6J2P6j8o2O2j9OM3j06K2jj9L7
2984DN3n3M2k7o4O4l5l0PRJ04j7l5j0k1oJ21l8p1lj1N5l9M4Nr0K4RM7k7j1j7N5
3017C8k4J2m5k2N1K3m9K4M1r3K9O3k7k6ml0L2R7m5j02K3RN5pNm0k7%R4m3l9Qn5
3050g4L6L0pM4Kj8LJ8p1O4p4k7R3Mqq2O7k9J2L6N4j26M1RO4k3r2M9m3N0O0n7m2
3083c7k2M9RPj1J3m0k6J06Jp1l6J1N9M8o2Np8P5L5lk3l8M8m1K2L8o9k7M7K2K2
$$ y = [-18, -36, -35, -27, 58, 10, -23, 9, -93, 13, 62, -7, 5, -50, -6, 65, 16, -7, 86, -44, -1, 28, -8, 32, -48, -7, 34, 43, 32, -11, -32, 35, 48, 19, -41, -46, -7, -20, 18, 64, -44, -8, 19, -14, 72, 28, -41, -41, 15, 37, 80, -30, -45, -49, -27, 66, 46, -27, -14, -80, 29, 48, -16, -53, -43, 16, 54, 27, 69, -33, -51, 19, -15, 12, 1, 11, -60, 46, -26, 38, -50, 6, -8, -42, 22, 30, -49, -4, -63, -3, -1, -3, -46, -48, -36, 44, 50, -66, -60, -5, -40, 10, -18, 7, -41, -15, 50, 41, 28, 20, -45, -29, -17, 59, 41, -21, 41, 22, 28, 71, -35, -13, -14, -33, 4, 57, 4, 46, 19, -45, 19, -16, -46, -39, -30, 74, 57, 22, 12, -9, -15, 106, 68, -3, -6, -17, 38, -1, 43, 48, -42, -18, -9, 38, 11, 0, -17, 38, 14, 26, -19, -41, 10, 33, -16, 8, 49, -44, -15, 48, 21, -5, -9, -39, -7, 90, 45, -57, -34, -25, 30, 23, 28, -12, -39, -39, 55, 12, -27, -19, -74, -38, -8, -15, 29, 31, 13, 16, 34, -37, 27, -47, -74, 19, 23, 15, -67, 0, -29, -17, 19, 73, -53, -12, -3, 61, 38, -54, -5, -48, 2, 62, 5, -37, -59, -10, -1, 6, -5, 8, -32, -58, 48, 49, -22, -58, -47, 12, 60, -2, 3, -75, 0, 35, 32, 9, -29, 19, -22, 0, 38, -31, -58, -11, 11, 33]
3115C3kk4m9pK9M7k7m4MJ9J7N0q2K9J9nM8j04N2o0O2L2om6K7m3K0l6R0J1p7m7
3147g0P4N7p3O4p5O5m5RM6p0j8LJ4K6kn0k7K1L5poJ0oK6j4K5Qn4K7M5ol2k8M2
3181A4J6k6j7QloO9pn4N0r0K3O3k7L3j38O0k5N7j3k5l0N3pK8J5L2l4p9P6K7k8
3213A5j3J9r6P7N3j1j17L8L9M0o7k4K0k9J03k8M9q9j7N2k3K1Qk8k0kL5K8L1j19
3243e5O4l5M0K9j5r6L5qQ4j6om1o8P0K7pk2k0k3P4MKn8ON1K5p4J8J7l3L7J5J1
3276C2qm1N9Jm1M9j07L3K8m0O1m9K2l9NP1j4m1Nl4M8L7o8J7l1JP9O2j48J00p1
3307b2M1j4l7L7o3%Q0J2k8rl2M4kMj9K2l1J4J3M6k7r3jJ24p5N5q8O7m1J8N3o0
3339a2lkk0K2Q0o0J5l1K3jj1j4k2N7j8N1j33L7K2N2K7o2J2k9K1k1O3j5m7KO5K
$$ y = [33, 31, 7, -42, -49, -20, 27, 0, -44, -40, -21, -4, 46, -36, -7, 12, 7, 55, -49, 3, -57, 5, 37, 31, -15, 12, -31, -11, -47, 43, 54, -23, -70, 4, 61, -12, 52, -23, 42, -3, 6, 52, -18, -36, -33, -19, 7, 5, -45, -72, -51, -16, -23, -29, -19, -25, 1, -13, 12, 20, -34, -7, 38, 32, 0, -28, 14, 30, 4, -13, -5, -8, -14, 55, 48, -6, 44, -46, -23, 40, 13, 46, -92, -32, -57, 0, -13, -38, -68, -15, -22, 6, 21, 53, 19, -60, 16, 43, 15, 2, 21, -75, 2, 55, 44, -73, -35, 4, 44, -23, -47, -27, -56, 47, 19, 68, -21, -38, 14, -9, 12, 20, -8, -28, -30, 5, 33, 64, -55, 9, -26, 14, 43, 28, -68, -33, -41, 43, 27, 21, -20, -88, -18, 9, 2, -20, -40, -63, 11, 15, 17, -41, -35, 16, 41, -33, -15, 2, -31, 6, 21, 32, 24, -17, 42, 43, 2, 51, -56, -23, 5, -35, 26, -23, -1, -40, -35, 36, 22, -19, -14, -48, 0, 37, -31, -14, -45, -44, 35, 97, -51, 49, -22, 19, 5, -32, 5, -58, -58, 22, 34, 6, -3, -35, 9, 7, 11, -8, 14, -17, -3, 10, 56, 29, -64, -65, 59, -16, 39, -49, 18, -23, -5, 48, -12, -15, -17, -37, -15, 65, 5, 20, -11, 12, 11, 0, -14, -36, 21, 3, 54, -79, -42, -20, 32, 59, -3, 9, -20, 1, -20, 43, 28, -19, -17, 48, 50]
3371E0k7n6L1K1j3l3Q7o4MjJ2J7J5o4k2K3k6J08m9k4j0j6O2k3j4K7o3K3Q3n6J8
3402B0o0L5K2Jpl9K1j5OL5oj5n8O7L8l7M2m6n9k1Q2m0O1q5K9M6nJ1p2P1o8P9n4
3435b1J3J4l4%K6j3O4l7j2J4m3K3Om1K0N3m3K0k0m0R9k4k2nj3j5O7k1k7l7O8p2
3467e3mP8J4p7K8k7L8RK5l8L5l3L0K0l6K0q6Q0k2K6m7k2K5M6nj0m3K4J2nL6k6
3499A2o6P1j2j3Rl3qJ7K6L1m7m2lK4Q5Qq4J5n6L0O0m0K5l4l4M9K4m0L8j9JN6j7
3532C3J6p0k7L4L6L0o5j1rN2j0O6n1K%Pk3j4K9o5P4l1J9n8k8O8%M4l1k9l2N4m5
3565c5N3J7k7m7R3l3J2J0l1j7J1N4q1J4K8M0j9o3M3l3j4j4K5l6P0k4J8No0N8j5
3596Bjnj9lj5O6m9l6J6L8o3N4m5M1K5K5o3J8K9p7J51q2K9l6m8P2k5J5Rn4Q8o5
$$ y = [50, 23, -33, -2, 19, 6, -27, 60, -4, 0, -1, 11, 28, 43, -21, -43, -20, -46, 62, 13, -11, -21, -37, 25, 2, -12, 15, -48, -25, 58, 2, 20, -40, -5, 17, 18, 11, -28, -7, -22, -16, 19, 13, -2, -60, 7, 45, 8, 50, 4, -55, -76, 6, -34, 27, -58, -29, 17, 12, 23, -49, 22, -46, 33, -21, -8, 6, -28, -28, -2, -15, 49, 12, 0, 14, -29, -6, 0, -41, -21, 32, -11, 9, -11, -51, 48, 24, 2, -3, -16, -31, 36, 15, -12, -49, 19, -53, -57, 21, 35, -42, -14, -41, -3, 6, 31, -7, 28, -5, 25, 45, 9, 29, -57, 23, 1, 27, -20, -42, -17, 29, 24, 14, -29, -5, 7, 2, 38, 12, -54, 17, 5, -8, 1, -32, -40, -23, 3, 34, -13, -55, -58, -34, 51, 59, -25, -10, -66, -36, 24, -16, 9, -25, -59, -10, 14, -26, 12, -7, -6, 50, 33, 49, -21, -48, -14, 22, 52, -13, -24, -33, 19, 9, 75, 24, 26, 26, 33, 10, -4, 25, -40, 34, 3, 22, -36, -64, 4, 4, 48, 17, -12, -44, 10, -35, 18, 35, 8, -39, 54, 21, 33, 43, 12, -5, 6, 60, -21, -7, 21, 61, 42, -21, 22, -11, -25, -39, -14, -50, 20, -4, 14, 19, -41, 17, 2, 1, -4, -23, -26, -41, 25, -24, -60, -44, -6, -69, -15, -60, -19, 6, 31, -32, -14, 15, -62, 89, 7, 36, 0, -48, 24, -1, 14, 23, -31, 57, -8]
3628hMl7L1j0L5l2J9K0n1K9m9M3M1o3m0P8J2mm8k6K2k9K5O3n9OqL2K9l2ql8j1
3661f4O8N0o5oJQMl2mj2K8L5k8l4O7K3q4L6K6O6j19L0MoJ1j2l1K6l0P4rn3J14
3694H2q8j0L3M2q4J2n2Q7j3L2j9n4PO2l3j7km6M2M9K9n9n0K3L8J9L4n6o5K3K5
3725iL3lpn8L2K0Mk0K3l5J7L5J4q7M5n5M1N9r2M6j3j5J6m5K7O7n7O6k9K3l4j13
3757a04J15j7M3q5K0j2M6qJ9l7j6O3j7l2j0QJJ5j0kN2l5l5J4J5K4n8N0J3l2N0
3788C8jPk2o8O3p6N9k6l0O2k4R7r8L1l9PJ7M0k2l8PM1m1M9j5m0J8k7M6J7o4M4
3820A2k9L9j2Mk4km4N2p3O7L5n7O5j2j3L6j0j07O7kL0Nk6J8K1j4m0o4P7MN2qo
3853D1j07P8M2m7L7o7L8l3LL0n4J0L1j0J8Kj1OK0K%O1q3m7M6o9N2N0j0m4k1lJ1
$$ y = [-8, -4, -41, -10, -20, 15, -17, 2, 22, -29, 0, -49, -6, 35, -28, -68, 10, 22, 18, -30, -56, -34, -63, -38, 25, -34, -28, -36, -4, 25, -7, -15, -53, -64, 4, 54, -11, -17, -16, -8, -4, -36, -40, -52, -24, 11, -17, -51, 16, 39, -45, -9, 17, 83, -36, -6, -2, -8, 3, -9, -40, -14, -44, 30, 21, -32, 82, -6, -16, 17, 59, -25, -13, -65, 22, 9, 41, 22, -32, -25, 37, 4, -13, -15, -61, -19, 30, 59, 0, -50, -27, 11, 30, 64, 8, -57, -34, -9, 24, 21, 14, -44, -12, 8, 12, -8, 15, -20, -3, 32, 46, -41, 4, -51, -10, 49, -43, 3, -10, -25, -9, -54, -27, 40, -17, 49, 20, 43, 9, -104, 11, -6, 37, -48, -28, -40, 6, -2, 17, -20, -36, 27, 10, -22, -32, -24, -23, -8, -18, -20, 32, -3, -38, -24, -9, 15, -43, 7, 20, -12, 38, 37, 44, 22, -46, 17, -59, 0, -26, -56, 6, -18, 79, -19, 12, -27, -20, -3, 37, 15, -23, -16, 25, -16, 33, 18, -22, -4, -31, 15, 32, -32, 12, -17, 22, 10, 14, -10, -12, -56, -4, -77, -10, 25, -32, 33, 21, 8, 44, 34, -73, -6, -8, 22, 27, 1, 19, 40, 26, -14, -78, -1, 3, 55, 47, 41, -66, 12, 54, 7, 44, -23, 15, -18, -15, 15, -39, -29, 2, -8, 10, 12, 1, 7, 27, 29, 29, 90, 7, -40, 6, -63, -11, 39, 29, -15, -36, -39, -28]
3886b8M6o0K1j5K4jN5o2J4Pl3L4q3R8n0M2M1j0k5%n8K1Q4k3n0k5OP0l4j3l2j4
3918e3R1p0M0k2j9P8o7k0kL0l6K7rJ3O7n5k6M2Jm6QJ0L3kj9j7P0j3l8QL2nm7q
3952b4j4Q4Ql8l8l0P3l4qj2J5K4NK1j2Jp8N0K1J2K6q1k2loJ24o4l8L7M6Ll0j5
3985Ck1K2NM4p0O3q0RN0m3MK0kK1Nk6l2K5m3Q6m1m7Q0%j6k4J1P2r6k4L5J9k3l3
4019d7N7n6O5mPr3N6j8M9j2n0Q9k4k0mJ7j4k4j4Q2J7m3L2m7j1N7n8K5J6m0J0J4
4051A4K4j0o4k9L7J2Nl7P2n2Nm6R9n8m2P0l0J00j09M6l5k3L2L4J1k5l1L0P1q3
4081a2l3J1K2j2kK8j3K0nL2l4ml1qN2K9p2M6l3L5K8m9J4J6m0%k8J10o9j1MrN7
4114C9m4L8p3L1L0kL1o9NJ0jM5M2p5n9L1L9m3N5Jo1O9l9m3J10q7K5l7j8K1%K4
$$ y = [-28, 18, -42, -21, -36, -12, -13, 42, -20, -6, 1, -32, 2, -81, 17, -33, 9, 50, 40, 15, 15, -43, -22, 62, 39, -11, -36, -30, 40, 6, -7, -39, -53, 38, -32, 8, -14, -33, 45, -22, -42, -44, -14, -50, -23, -32, -19, 48, -7, -33, 9, 10, -36, -28, -18, 15, 13, -6, -23, 47, 34, -4, 4, 36, 31, -16, -24, -38, 46, 54, 16, -22, -52, 21, -13, -21, -33, -18, 6, 11, 32, 20, 21, -57, -7, 14, 26, 52, -29, -51, -54, -60, 64, 0, -38, -1, 45, 48, 18, 3, -18, 4, 9, 53, -17, 46, -34, -25, 25, -18, -14, 6, 4, 25, 30, 4, -28, -3, -46, 40, -1, -48, 32, 32, 16, -8, 3, 75, -21, -45, -10, 9, -14, -47, 10, -46, 19, 15, 22, -71, -15, -33, 16, 4, -46, 43, 19, -1, -5, 12, -2, -26, -40, 42, 59, 16, 48, 1, -10, 47, -11, 14, 30, -10, 0, 14, 38, 28, -36, -65, -28, -16, -11, -48, 24, -28, -23, -69, 30, -28, -70, 0, -30, 70, -39, 7, -28, -51, -19, 15, 26, 1, -30, 0, 71, -12, -45, -34, -12, -24, -26, 2, -11, 9, 4, 36, 2, -2, -33, -41, 11, 40, -32, 14, -19, 16, 44, -5, 9, 25, -15, -15, -43, 67, -2, -13, -9, -18, 39, -5, 33, -40, -9, 21, 19, 50, -19, -14, -4, -5, 40, 82, 7, -52, -21, 18, -25, 30, 31, -30, 39, 0, -43, 67, -20, 5, -32, -50, -29, -29, -5]
4146eJ6m7LM7j8nlJ3J2jrKk4R5n9k6J7m6J00j15O0J2M1r4P5l0M4j6o5MlO0m0P
4180Bk9M1k4K2m2K5O0j0j5j7q9P5jmJ6j3k9Ok6J0K8k3nL4K8po9L2KJ9K4p2P4l7
4214a4J4K7m9MK3j1J8J1Jl2K0j6L1J9j9j8j2j6j0J9J1m4ok2M8LM6o9P4k1J5n5
4246c0Lkl1M9L2Ll6Kn4N8L1j7rqROO6p9qj4oJ8kK7l7L4%L0m2l8J4mP3k3j0n4L5
4283a4J4n1N7m7K4M6n5j8K6Nj1oK6NJ1ko0K5R7n1k7N8q3M8l6M2k6j2l5kP3o4L1
4316a2n1N0K7J2LK9r8P2k4k2N2j00P8o3Q5j3n0jJ9K5%Rk7l9L4L3l2oN7n4J8j3
4348bj7L9j8K1j1KK0l8m7M1L3o1L6j6m1O1J7Jq4J1P4n2M3L2o0ok4M9O5p0rll4
4381d8N0jMr9R0J3lJ1n8K7nJL2m7L4k9jN4n6R4j21NL4K0ro7K4K9L4Jk3J3k4P4
$$ y = [-5, 11, -36, -33, 14, -4, -9, -12, 1, 13, 12, 3, 5, -19, 76, 17, -9, 8, -38, 62, -53, 7, 19, 60, -34, 41, 11, 55, 39, -26, -22, -25, 35, -5, 2, -27, 14, -10, 12, -30, -5, 55, 45, 30, 13, -76, -1, -2, -6, 10, -3, -32, -26, -52, -42, -14, -37, -42, -8, 20, 13, -56, -24, -22, -3, 21, -51, 23, -14, 0, 27, -22, -18, 5, -6, 12, 23, 24, -8, 12, -4, 27, 46, 27, 9, -3, -19, -29, -10, 1, -43, -49, -71, -23, -20, 26, -43, 31, 10, 25, -30, -27, -29, -60, -11, 21, 24, -12, -10, -64, -6, 25, 8, -1, -9, 0, 6, 72, -7, -15, -29, -35, -17, -19, 8, -29, 5, 5, 35, -7, -45, -31, -35, 38, 15, 5, -49, -14, 0, -51, 6, -41, -17, 29, -26, -44, -18, -13, -24, -30, -4, 1, 12, 10, -50, -25, 72, 21, -6, 52, -31, 17, -19, 23, -3, -15, -50, -52, 21, -43, -12, -63, -13, 14, 26, 29, 58, -40, 32, 8, -14, 38, -62, 16, -47, 38, 25, -25, -26, -7, 18, 18, 27, 0, -39, -5, 28, -4, -10, 47, -7, 11, -2, -19, 20, 2, 23, 12, 14, 34, -4, -51, -10, 23, -38, -2, -18, -59, 2, 19, 20, -64, -53, 21, -31, 12, 44, -16, -22, -46, 3, 68, -2, -11, -14, -48, 2, 1, 5, -94, -4, 9, 6, 17, -41, -14, -19, -18, 14, -33, 1, -28, -29, 25, -31, 63, -58, -53, -19, 1, -8, -75, -51, -22, 12, 13, -10, 3, -21, 53]
4415E3j8n2L1Ll7J3M6J4j28R2n9L0Q6j7o4K2n1L8j4L9m3K1mJ5M0q2k8N6K8o1K1
4446a0m0M7NN2n5Qj2n0jM1M0m2l7M1k3O9m0p4R7J1l2J6j4J1K0m7M5l7M8j6m6K9
4478D%L4k2l9kM3Jk5L4p7M3qK6K0k9l6M2m2L6J7j12J05k7K4J2p4M5l7oL9O1l6
4510A4kk6Q4m8m0qO0p0N7K8o8L6o8L5N8k8k2MPmJ2l8P9o3j3M5k8NrokL0pMl4P
4546a9L6J3l5oPN0p9M0l4L7NJ4l2Rj9K1OpJM1m1o7P6Lk5l7Ln1K9N1K0qk5L0K5
4581C2j13Q2j0OJpL9Ro9O4o1M4Km1j4K0%Q8n1l7l4N8Jj8J2k8jj3L7l5O3r1N4k9
4615d0J3L7L3q4NL6Jk3N0o2oP8p1M0NL5o0%M1L2m0Nk7Kl5N3ln9N1J6J6j06M0Q
4649a9NK9l4k3l1O1N1l7K8m5lK7l2j8M7n5N8q2J03o3L4op1Q1j4N3o8K9k8N7o0
$$ y = [53, 35, -17, 14, 17, -20, -7, 39, 53, -75, 17, -42, -12, 74, 57, -7, 15, -36, 2, -12, 27, -16, 5, 1, 16, 56, -26, -54, 2, 30, -31, -10, -50, -3, 2, 54, -1, 7, -5, -55, -56, -15, 25, -17, -54, -13, -36, 33, -7, -81, 16, 27, -5, 11, -3, 8, 28, -19, 26, -11, 37, 21, -25, 4, 4, 38, 16, -23, -25, 18, 19, -6, 28, -49, -6, -14, 12, 32, 3, -33, 9, -33, 3, 20, -92, 13, -14, 10, 22, -52, -7, -44, -50, -11, 50, 14, 12, -14, 70, 22, -18, -26, 34, -36, 21, 49, -19, 17, -51, -16, 42, 14, -8, -4, 3, -1, 11, -27, 52, -11, -24, 21, -7, -2, -11, -17, -19, 11, 4, 8, -26, -19, 17, 30, -5, -11, -4, 46, -33, 7, -27, 10, 15, 29, -3, 6, -13, 8, 14, 7, 8, 49, 8, -59, 17, 20, -5, -42, -39, -90, -61, -10, 10, 2, -23, 7, 32, -81, 1, -9, -3, -2, -9, 30, 39, -30, 34, -27, 17, 19, -22, -36, -16, -16, 72, 21, -16, -50, 8, 9, -9, 3, -25, -26, -39, -2, -37, 26, -65, -11, -40, -27, 10, 43, -41, -36, 0, 1, -22, 28, -34, -40, 38, -33, 7, 12, 47, -13, -13, 28, 60, 20, 25, -2, 0, -35, 18, 15, -44, 7, 23, 39, -67, -27, -19, -14, 15, -19, -42, -73, -12, 39, 2, 30, -15, -18, 9, -23, -41, 6, -49, 9, -73, 30, -33, 1, -5, -76, 5, -9, 44, -24, 5, -23, 34, -26]
4680b6K9L6o3L2L8oJ3m8n2M8K5Pk6n0L6K7p2L6qK0k3M6rJ0m2K6mJM9o3nL6l3n
4714b0Q3j19K0N1l9N4l9M7Oq6MJ15p2L2n5M0K9o9K2l4L7OJ2l1%k9L0oJ6Om9J7
4746b1j2L6rl2rN5k7oN6l9M4n9P4j07O7l8Q6n4KP9r3L3l1J1jmqK6l0K4p5O8L1
4779C7k3j6J7o1L9K1Ok9L2K5q0k1K8J3L1l7j6K6L9n0K4J0q6Q8j8L5j9o0N3j4L
4810cR8j12rN1m0J0J4k8mPKL6Jk5O5o1j9l9P5j0q0L2R3k7q3L0j8Q7n2M4n9L1O
4843A3L0k9o1QL4K6nQk7k5M2p0N7N6m3km4K0O0p3k7L3rQ5p8m3O0o5M0K7j9M3r6
4876g4L0L2J3M1j8l0rQ0l5n1J1OrR3p2k8PK3k8O7Nl7M9k6k8%l9M9o9Rl0Q0No8
4910e1M9j4Lk2L5MM0m0K2k2ko0N1l4k3N0j4K9M4m1M1j12R1pm5j8O7l1L3n2L8j7
$$ y = [-26, 3, 39, -24, 8, 46, 40, 53, 5, -47, 1, 26, 33, 7, -43, -7, 20, -52, -16, -24, -4, -27, 19, 10, 20, -22, 4, 0, 1, 50, -13, -18, 18, -15, -20, 63, -56, -36, 15, -24, 30, -9, 38, 44, -42, -38, 77, 5, 37, -18, 22, 51, -18, 4, -30, 7, 13, 25, -6, -6, -35, -5, -11, 5, 11, -38, -21, -33, 3, -6, -38, -47, 8, -19, -25, 31, -8, 36, -23, 51, -56, 11, -27, 59, 5, 7, 86, -7, 26, -5, 6, 5, 1, -7, 19, -11, 13, -62, 6, 37, 14, -2, 15, -46, -7, 14, 20, -9, 23, 48, -32, -53, -25, -12, 19, -18, -34, -8, 31, -19, 5, 15, -71, 17, -1, 34, 15, -45, 8, -6, -3, 95, -17, -26, 25, -15, -5, 9, -19, -23, -16, -14, 22, 23, -2, 63, 2, -17, -56, 19, 9, -71, -39, 54, 27, -56, -26, -44, 43, -9, 35, -24, 7, 13, 43, 14, -47, -39, -5, 21, 16, 24, -3, -28, 14, -56, 1, 57, 14, 12, -32, -12, 48, -25, -52, -19, -28, 57, -21, -64, -4, -69, -29, -2, -21, 22, -74, -44, -12, 1, 42, 24, -6, -15, 65, 30, -21, -10, -4, -13, 80, 8, -20, -13, 10, -18, 49, 54, 17, 66, 40, 12, 12, -27, 22, -47, -38, -68, 12, 17, -51, -2, -16, -13, -35, 0, 4, 44, 4, 26, 4, 2, -58, -7, -41, -64, -14, -28, 1, 45, 4, 45, -67, 24, 17, -28, -46, 21, -10, 23, -29, 9, -8]
4942hN2K1o7j1L2k4nJ3n2O1j0l8M5l0p7J11j0k8L5m4O4J2l3jN3o2qNM2l5noL6
4975B8m6QJ6k5J4lJ2KK1lKk6O1m7k1L1L1l9Qm2rk9M1J0M6n4K9n2L7J5ml6o6J30
5009D0m9M2l0k7L5rL2ll1J1MKrk2j9J1j1J03k1r1P5Jo3J04j15O3j7Nj3RJ9m2j
5042a7lJ0nj1pk9J0L4O4m3K4r7P7l3K4l8M0j4J3O2j02K3PO3n8J6J6l6K2lk8N9
5074D0q8N2j8K0L0K3m7o8O0k6jj0j2mK0K8KJk6l1L9j8K0k8K6J7K3l5M9Mn3K1j0
5107@L5o0O1j2k8kL5o1pP2l3L1k5M8q8l1J38j17L7m8L5j2KJ7lJ2J3j3j2l2N1N4
5139E7o6k8L4J4j5K0m5J0l0N3oj8j4N3l9nL9qLlK5K4m5j6k0O1Mo6l5L5Pk3N6j5
5173bmN2n3j0lL1k9J3K0Kk6j2jL4j2m6L5jO0K1k5l0%p3Q1Qj2k5L1m0K4K4j4l9
$$ y = [-8, 44, 65, -2, -13, 19, -5, -10, 3, -49, 12, 2, -36, 9, -21, -98, 13, 3, -25, 10, -34, 30, 42, 9, 8, 61, -1, -9, -4, 38, 3, -2, -8, 28, -18, -10, 6, -19, -5, -8, 4, 6, 27, 24, 26, 0, 61, 14, -7, 24, 55, 16, 24, -18, -27, -56, -15, -5, 41, -13, 16, -36, 1, 16, 12, -24, -90, 40, -9, 33, 3, -24, 11, 2, 34, 31, 0, 11, 15, 17, 8, -14, -33, -22, -33, 70, 49, -42, 33, 34, -29, 75, -40, 23, 6, 11, -2, 7, 26, -16, -17, -20, -10, -15, -26, -33, -62, -52, -18, 46, 3, 27, -70, 7, -26, -2, -40, 0, -14, -1, 61, -41, -18, -11, 52, -6, 10, 26, -10, 12, 9, -19, 40, -48, 4, -14, 6, 36, 59, 12, -56, 4, -22, -23, -33, -45, -49, -29, -1, 1, 2, -24, -55, -16, -34, -14, -42, -16, 1, 24, -11, 38, 42, -11, 10, 0, 35, -25, 36, 24, -4, -6, 29, -32, -39, 33, 0, 31, 6, 54, -34, -65, 73, -44, -7, -55, -20, -32, -30, -13, -16, -4, 9, -4, -16, -48, 3, 57, -9, -37, -3, 11, -4, 16, -29, -19, -49, 4, -2, -20, -34, 19, -20, -25, 14, 6, 9, 6, 31, 55, 10, -6, -26, 35, 39, -27, -62, -27, -20, -43, 13, -2, -6, 46, -7, -17, -20, 11, -18, -5, 15, 17, -9, -21, -22, 12, 0, -46, -11, -12, 48, 69, 44, 14, 14, -59, 22, 30, 18, -7, 24, -16, 8, 32, 18, -21]
5207b1K6J8n0P8j10J5L9M0m7l7L3M5p6P5k7l0L6j1j6L3jk5Jk5O4kK2o9K5J1m1
5238b7nO3o3N0k0J4K6l4m6N4j8L3j5p9O4m0%L1O5o3L0l0M2l0J9n0l7J22k9n9L1
5269al6K9J5l2M4J4r0J04%rl7J8j3jj2K4j4NJl0M1k8mK4l4%M2o8j1J09Nn2l7L4
5303@M3p0J2LpK1J5o8O0K2j8l6M8k7j5J3m4K0K1OO3o7j3L7ojMn3l2N5O1q5R9m8
5337A3k6lk5rJ8L9j2mj4M1j6nk6J0l3M4Rn4K5M7K2m9K0Jo1M1l0N0J2nj08J21o2
5370b9Q0k0l8KOL9k2l6j1j7M2J0k3l9NN4k9l1M1N0r0Q8l0n3K6J4n2P5n9O2J0k0
5402EOpm3K9pK8k0J6Qj0j4k7M7%j8J7j9K4q9M7l2M5K8K0l4NOn3O1k9K1j8jRm6
5437d5R1n3O7n5j1n3L0K9j0l7oN3m0M2j2JKN7n1L0q9O6j9j1J6K1m0ok2Q0j7n0
$$ y = [-21, 5, 23, -27, 51, -59, -44, -5, 35, -12, -49, -16, 29, -47, 28, 1, -29, 7, -4, -20, 13, 12, -13, -12, -37, 27, 25, 47, -22, 3, 14, -27, -32, 31, -32, 18, -2, 12, 38, 4, -42, 12, -6, 27, 12, -67, -3, -43, -43, -12, 53, -10, 20, -10, 32, 2, 21, -29, -66, 56, 27, -32, -1, -37, -8, 7, -25, 19, 33, -57, 47, 47, 38, 1, 19, 6, 5, -7, 17, 3, 8, 9, -21, 20, -8, -12, 12, -22, -22, 20, -48, -59, 50, 55, 3, -34, 0, 43, -27, -15, -12, -19, 2, 17, -51, 9, 31, 13, -23, 25, -2, -17, -4, -48, -28, -7, -1, 62, -5, -18, 19, 13, 12, 16, -37, -69, -14, 47, -38, 61, 13, -13, -16, -41, -50, -32, 7, -5, -9, -23, 18, 2, -3, -29, -19, -52, -8, 1, -53, -28, 19, 41, -8, 12, 13, -48, -7, -37, 13, 25, 20, -88, 33, -29, 51, 31, -7, -5, 1, 40, 18, -18, -29, -46, -4, 6, -17, -56, -51, 3, -26, -57, -16, 34, -56, 32, 2, -51, -25, -11, -63, 12, -47, 15, 25, 5, 11, 4, -39, -10, -17, 11, -9, 7, 15, 5, -9, -36, 11, 11, -7, 10, -9, 15, -74, -27, -59, -14, 14, 34, 0, 5, 11, -42, 19, -10, 11, -7, -8, 1, -45, 46, -7, 60, 5, -6, -59, -29, 0, -10, -47, -53, 0, -40, 2, -10, -9, -7, 50, -1, 29, -60, 6, -13, -24, -8, 13, -27, -33, -55, 25, 8, -42]
5469d2RM1M6n0j2Kj9L7jo6M7k6J6J7J2OL9n9j1K6n6Q2q2L5K7l3k0L7J1j3Rl0%
5502b1MJ1NK5j6LqK7o2l4P1on3N1m7jM9J7l8Ql5K7N8j3lm2M1k6K5KJ6K7j27J36
5536G1o0l7L7J4k0njJL1p9N7j2n2O9l4jM6Ljj7Pn2L1L6o0J9L1o6L3O8j09M2M4
5569C4j4Rk0m8M6KQK9k2nj3j4L9n5J3rO0k6l4O3l4Qj4N8l5Nn6K4Ml7lO0l0O1k5
5604B9n6j1MP6k6k7j8N4J8p3J7M1l3QjQM1n1J5m2O5l6l0M2j5k1MjJ2J3j0j5K6
5637Gk1Nqk9N4o1MO4%Pp5O8l4k1K8Ln4O7p3Q3J1l9M2k3Nl6L9K6m7J1j9P0q7N6
5671B3k5J6pRk0j1Rkk2J1N7o6l1P0q7O6kjkj5M1m5PJ7kJ5J5po0P7j7j1J8J4m8
5706a6L6l6mL0j2PM6m0n4O9o4L2j5m6N3krPOMk9qP5k4L6j02Q9k1K2pl8K6j3L0
$$ y = [-42, -33, 8, 54, 4, -8, -6, -25, 12, 11, -55, -8, -34, -18, -1, 11, 17, 56, -3, -14, 12, -44, 38, -44, -9, 18, -15, -35, 2, 13, 0, 9, -21, -21, -17, -6, -1, 24, 8, 11, 3, 30, -32, -66, 5, -1, -54, -3, -50, -51, -2, 15, -23, -15, -50, -23, 35, 22, 19, -23, 18, -8, 17, 19, 35, 62, -65, 71, 11, -26, 11, 25, 5, 0, -1, 0, 31, -48, 9, -3, -55, 14, -20, -21, 25, 28, 27, 10, 17, -35, -4, 32, -28, -9, 22, -44, -11, 57, -52, -10, 34, 20, 29, 9, -39, 7, 9, 17, 46, 24, 19, 6, -8, 31, -24, -11, -20, 40, 14, -20, 43, 9, 17, 3, 61, 26, 31, -25, -1, 3, -34, -37, 23, -7, 54, 29, -27, -38, -34, 42, 16, -11, -29, 25, 43, -30, -13, 28, -5, 3, 2, 10, 51, 0, 15, -27, 38, 2, -28, 14, -1, -22, -18, -19, -7, 6, -4, -19, 7, -14, -9, -17, -46, 8, -53, -49, 15, 15, 22, -53, 15, -19, -40, -12, -9, -63, 4, -69, 14, 25, -14, 28, 5, 10, -26, 13, 39, -8, 3, -16, 54, -33, 23, -2, 14, 7, 16, -4, -15, -6, -8, -30, -19, 38, -28, -59, 11, -76, -10, -12, -13, -15, -30, 11, -34, -27, -10, -12, 3, 18, 11, -49, 28, 11, 0, 18, 32, -16, 20, -16, -20, 10, -2, 5, 51, 11, -43, 26, -38, -6, -21, -67, -14, -16, -25, -18, -12, -8, -37, -45, 30, 6, 42, -60, 29, 8, 30, 23, -15, 11, -2, 28]
5740B8q6KR9j31P3J3m7N7L4J1l5j9N2m1lk2J9m3M2K2o1j4Q6l4M7m2J2nRl4J8k5
5772a8K8o8N4N7q2K8kM2k3m6k3OP1L0p5K8rK3k9M8o2K0j5k0L5j1oK8K0Pl1J2j1
5805Fk8M4m9M8m6NM1m9L4o6M6ML1m4Lj2jM8l1OK1nj5j2jN0r8M8M2k4j3k6P0m4
5839a7L3j9K3J4m6N8q1Jk0M3l1P1k2J5k6Qk5rPnP0n1J1l0K0M6k8J4Q1j41J6j9
5871c9M9N7p0lk2M9l4N4n3k2L5K8l9J9K1l3Po3Q2k3k6JM7o4K1%J7l9O3J4p0O6
5903C0n6KL2Rqmm2L5K8k1ml2N6n9K8QJ8J0q1L1O6m6l2N3Pm8K4%J9rp7J49q8J1
5937Ik2rJ3k9L8n2N0ML3k9L4n7l1L8J4j9QK7l4k1L3j1N2m1O6q6K3j1PqN0Nq2K
5971c6k9J08j1l5j0K0M7p4l6R4p5K7N0j19J05Jo3K6nM5n6M2p0M2j7k4P8j6m7J6
$$ y = [28, -58, -56, 43, -88, -15, -2, -49, 8, 42, 53, 18, -1, 51, 10, 7, -15, 4, -39, 3, 25, -36, -50, 36, 2, 49, 7, 19, 14, 23, -11, 7, -18, 10, -58, -4, 53, -29, -1, -3, 39, 16, -30, -53, -47, 24, 54, -21, 7, -2, 21, -8, 40, -22, -2, -17, -37, -2, -13, -19, 9, 29, 36, 5, 17, 6, -22, 22, -27, 21, -25, -20, 21, -28, 6, -60, -14, -10, 21, -23, -20, -32, -33, 15, -16, -10, 11, 6, -9, -21, -22, 28, -70, -22, 20, -4, -17, -43, 27, -17, 16, -3, 20, 34, -12, 46, -35, -34, -54, -11, -42, 29, 7, 22, -4, 4, -21, -30, -23, -28, 42, -9, 2, -28, -8, 38, 10, 24, 105, -36, -20, -39, 10, 67, -3, -6, -28, 21, -13, 41, -12, -34, 1, 29, -10, 9, 30, -3, 4, -59, 23, 0, -26, -25, 22, -42, -21, -21, -4, -43, 20, 34, -36, 30, -26, -24, 8, 17, 9, 5, -37, -2, 26, 5, 1, -31, 25, -34, -6, 2, 20, 30, -51, -20, 46, 0, -32, 21, 28, -20, 4, 4, 23, 14, -63, 86, -2, 9, -13, -22, -9, -38, 0, -52, -2, 2, 35, 6, 40, -17, -48, -10, 4, -15, -7, 20, -14, -35, -2, -13, 39, -2, 64, -22, 1, -10, -3, -11, 39, 44, -38, -36, -65, 43, 32, -3, -13, 7, 54, -20, -56, 38, -37, -10, 40, -79, 26, 27, -36, -10, -15, 30, -26, 16, -54, -12, -29, -53, 25, 9, -38, -22]
6001b2K6m1L6K1l0RK2J5m3N5k1o2J8J8K3k3j1nM5k6OJ1nl9oL7m0K9K6rM0n9l3
6034c8K6n4J25j8n7O4l3m9OK3kL1K1k0q2O3l0K7k8K5J1j9L0ol1O5l5oM2r2ML1
6066fqM8o0L5o6L7%j8qk3N1K7oJ3Ok3o4P2L6m6j5K2jj3l4O4mm8L1%m7L4nO5o3
6101a7ql3J4R2n2O3j8q0%N4Kn0R9q8QK5l9J4kl0J2Q8r6PJ02p4jM6p3M8M8o9OL8
6135C6p7N8J2m3K2J4k9k6j2K4K1LK8J1n3KL3m3P4p1nJ4o9O0O6p1M1p9J0N4m7l8
6167h0J03l4m3O4qJ5MJ4mOm0rK9k0MJ7k2j1J0j1K4k6OLJ9k3m2M1L4ol1J9Jj5L4
6202B2k4kPN4p9M4k9M1o9M4L8n0O3o6l5K1k5R4p1M5l7K6J7k4lK2l6P3kn3lK1K5
6235D9q3L2LJ6l1K2J9j3k6j9P2q0J5J2l1O7l3mj1L2k8K9l4J7l2O5Opp0N7MkJ5
$$ y = [-22, 4, -37, -1, 20, -10, -1, 21, 36, -7, 48, 27, -35, -17, 1, 24, 1, -10, -15, 30, 4, 10, 21, 16, -23, -29, 8, -32, -3, 23, 14, 54, -5, -38, -12, -66, 59, 41, -16, 48, 15, -34, -28, -5, -7, 24, 45, 25, -57, 6, -24, 3, -25, 0, 11, -8, 22, 16, -15, 50, 15, 9, 51, -41, -37, -6, -14, 34, -26, 9, -57, -20, -20, -38, -46, -69, -18, 9, 3, 16, 22, -1, -65, 7, 43, -3, -18, 4, 3, -10, -44, 20, 16, -32, -1, -1, -48, -14, -19, 46, -17, -25, -58, -44, 48, -4, 59, 41, -39, -39, 15, 17, -33, 66, -22, -14, 11, -28, -14, -16, -46, -34, 54, -42, -35, 67, -7, -8, 38, -35, 13, 61, -8, -2, 36, -41, 17, 29, -14, 8, 22, -7, -33, -45, -21, 0, 3, 31, 42, -11, -9, 24, -19, 55, -16, -21, -7, -76, -16, 50, -21, 20, -59, -49, 5, -42, -80, 23, -11, -54, 10, 2, 17, 21, 35, 31, 37, -3, -12, 17, -3, 1, 18, -4, -15, -5, -16, 8, -18, -12, -9, 10, -13, -55, -14, 20, 14, -17, 2, 3, -12, 22, -2, -4, 3, 57, -22, 22, -7, 34, -35, 9, 47, -3, 60, -6, -41, -20, -45, 49, -22, 23, -14, 12, 29, 5, 2, 24, -12, 61, 59, 6, 3, 24, 49, -34, -2, 1, 17, -14, 8, 27, 14, -12, -31, 41, -39, -24, -12, -43, 24, -9, -13, -24, 8, -20, 9, -25, -8, -40, 25, 31, 24, -46, 11, 15, 13, 28]
6268B8l6Lj8nM3j0L2p4K2M4l3QN0j04P6m1K6j3j3Qj2L1l8k4N7K3qK2o6LM5K4k8
6301B2k2nj5oL7L2j8mk0Pj9QK1n3L8qL1m1L4On6J2l3N3l8M2ON1r3K6MqkK0j5N
6337ak0L1Lj8j8J5j1QPk2L0k1L0l9O7l3Jk3J0K5j9No1M7M7o9pL5K1J5n3k9R3l1
6371A5m0M0j3PmK0p5M2M4pJok6L3k8j0K8n1N7jk6k9J5oPM8n0MQK3o3P8l9L4lm7
6407b0N3Np0K0M5m2JqL7l9j4LL5pj0M7l7l2J7L7o4L5M7k5k6J3n5PO6n6M4M6l8
6440A5k4J5Rnj5N1n2n3N2m8M0J9j9J1k9l3M8qM4j8O5q7O5j5j2J9L4k4j4l0j7k7
6472d3L6K8j5Klj4M6p9L6L3k0KL7o3J2J9J7n2Qk1M3j4mj4J4L6n0LJ9k0k0M0M0
6505C9q1j0L5k1k5Q4O0j34Q0oj2l0Q8m5l4JL2m9k6N8m3j1M0J3k7K1Rj2k4L5j1
$$ y = [28, -8, -5, -23, -28, 15, 5, 37, -37, -15, 29, -4, 4, 54, -50, 26, -15, 11, -2, -15, -7, -19, 12, -26, -50, 7, 30, 22, 44, -22, -19, 26, 50, 22, 0, -5, -20, -26, 11, 43, 25, 21, 1, 8, -11, -3, 18, -35, 3, -5, 26, -15, 19, 25, -31, -19, -52, 1, -37, 5, 11, 62, -31, -5, -1, -9, -11, 9, -6, -1, -21, 10, 13, -5, -23, -8, -19, -11, -4, -26, 4, -17, 13, -26, 41, 8, 9, -14, -4, 21, 2, 7, -54, -7, 40, -29, -36, -1, 20, 35, -18, -47, 46, 15, -25, 15, 2, 9, 5, 25, -50, -8, 36, 29, 30, 24, -2, 31, 3, -7, 21, -30, 27, 26, 0, -29, -14, -20, -13, 35, -15, -11, -3, 20, -43, 35, -4, 30, 27, -20, 33, 38, -32, -12, 33, -9, -8, -16, 21, -18, -32, -29, 6, -1, -11, 36, -1, -33, -16, 21, -43, -8, 39, 14, -12, 1, -54, -47, 19, -37, 7, 53, 15, -9, 6, 15, 10, -5, 46, -6, -59, -7, -55, -15, 4, -15, -4, -33, -66, -18, -26, 18, 0, 65, -22, 43, 28, 16, 35, 69, 45, 31, 1, -16, -43, -7, 21, 6, 8, 5, -9, 37, -42, -6, 27, 7, 9, 46, -17, -5, 14, 31, -21, -13, -34, 9, -5, -9, -23, -9, 27, -23, -20, -1, -21, -41, -1, 39, -42, -52, -17, -38, -63, 21, 81, -53, 27, 21, 9, -21, 67, 22, -12, -11, 21, -28, -54, 4, -39, -50, -10, 3, -24, -3, 6, -6, -30, 5, -6]
6536fo4M0OK4N9o6L9k6n2L6K2k6Qj4O4m7K2L%j2N1n4j1Kl4M7K6l7n7J2L4L2j4
6569GJ6m2j3o1Q7jj0Nl7j0L9k7K2J2N8q5L5Jlk7N8rL0l4Mo6K0K0P5n9J3PjL8l8
6604B4j5n3Q7n6N2k7o4M6l9Q1l0l6KK9J4o5O4n2L8j9Jk5K8M2q0N9L7o2lK7kj1
6636hM2j08KR4o7QLM4j5j4K4Oj6jk5NP0o9PK9L8o9O1n2Rj6O0m2j2J1k0Q4r5j6
6670d8N3n6L5J9k5Pk3M6m4O8p4pR2m3KK7n8L0KL3l0L0n3ONjM5j6l3kL9M5o4k9
6704b2J5n0O3K1k4m8P1k0l8OL8o4oN0qN1K3p0J9j6J9m9NL4N0m1J7o7O1J2n6J7
6736gKl1L8J3jK7k9rj6n4R1l0J7M7o4K9l2k1N2K6n3n5M6L0j4Q1p5m6M0rOm2k5
6769f8Q5k9l9M6N1k1j4k3P9o0Jk9QM4m0J6o5O6MK0l1N6q3L0j5J3j0J4m9K2J0K4
$$ y = [-6, -70, -30, -24, 0, 59, -7, 32, 6, -46, -10, 12, -14, -6, -20, 44, -3, 19, 22, 22, 10, 61, 7, -4, -2, -36, 11, 37, 0, -57, -45, -11, 21, 7, 23, -19, -32, -93, -6, -7, -17, -12, -49, -59, -20, -47, -25, -13, 45, -40, -5, -4, -7, -34, 24, 15, 45, 11, 15, -51, -31, -11, 64, 5, 18, 25, 24, 62, 24, 9, -44, 43, -13, 39, 12, -52, -6, -45, 36, 6, -30, -28, 1, 15, -50, 14, -38, 0, -19, -18, -43, -15, 27, -53, 6, 43, -19, -22, 5, 3, -8, 34, -74, -72, 22, -45, -37, -34, 10, -5, -19, 5, 11, -5, -6, -31, -26, 44, -25, -18, 11, 49, -20, 41, -11, -2, -18, 42, 0, -12, -1, -21, 63, -32, -48, 5, -51, -16, 3, -22, -15, -38, 8, -36, 32, -42, -49, 43, 0, 2, 29, -29, 1, 3, 36, 6, 36, -17, -11, -6, -7, 38, 22, -11, -13, 26, 71, 7, -22, -7, -57, 6, 27, 3, -45, 26, 6, -32, -26, 12, -52, -58, -8, -16, 35, 58, -12, 7, -9, 10, -39, -34, 0, 50, 9, 26, -41, 20, 32, -24, -7, -5, -36, 2, 15, 14, 41, 12, 3, -13, -67, 24, -6, 11, 58, -6, 23, -9, -30, 22, 48, -5, -60, -14, 16, 2, 83, 8, -38, 2, -7, -1, -43, -68, 17, -12, -51, -5, 46, 25, 11, -12, 67, 7, 8, -21, -13, 31, -9, 7, -58, 8, 12, 32, 1, 57, -26, 4, -11, 2, -8, 6, -43, -21, -11, 13]
6801A3j8ppJ4K2n3lK9O6o4K5j0k0L1J6r1N8L8L0p3L9k9L2m7K5L0n6O3n4O0m1k5
6833gKM3n6K7pK9nl5J8j8j7j5K8OJM6k5J8n2M1o6J0O3k2j0j5O3K6l7q1Q0m3J6
6866FKl1M7K8q5N5k4k2l0J4ON7k3J6n1P1k5No3QO4k7k4N3l0Nj1pOj2J9l3O0J5
6900C9j6k8pj9N0Nj5j2M4n8M2k4L9n8n1Q6l3L4n5K0m0O3j8l0K5JPn4M8Oqj9M6
6933A0L1l6k9j7Q8m5KK4K1n2rK5jj5oNNj8k1M8j4Np7P9j4K6J1J2p4K1J9l9L2m7
6967e0QO2o0j3J9k1N9m4J2l4M7j3L2jj6J5j7K7Rj6Lj5JM6K1p1l2Q8m9K5j5o5L8
7000b0LJ6j7j3M6k3l1P3j7o1OJ0J2%LKj5M4J4j2%k9m0M5M9n3J2K0j9Jk6kQ0o0
7034bqO5p3j2L7l1L4k6J1N8n3PJK0m6M7m9roN2j6l5L4m9O9j9K1l5j1%PjN4m7J5
$$ y = [13, -5, -12, -19, -5, 17, -36, -39, -10, 56, -8, 17, 7, -13, 18, 34, -57, 1, 39, 69, -4, 35, 6, 38, -9, 16, 46, -10, 53, -1, 59, 18, -7, -5, 38, -18, 9, 2, 31, 26, -9, 9, -9, -26, -41, -13, -7, -6, 40, 15, 33, -19, 22, -44, -34, 29, 7, -3, -18, 45, 71, 34, -47, 33, -10, 6, 8, -23, 24, 52, -33, 22, -2, -24, -54, -40, -34, 23, 0, 16, -35, 36, 11, 16, -47, -39, 25, -2, -26, 27, -3, 2, -9, -16, -10, -22, -3, -36, 24, 39, 23, -5, -12, -31, 19, 24, 9, -3, 41, -17, 25, 1, 40, -18, -69, 17, -16, 18, -37, -17, -57, 6, -12, -42, -17, -16, -9, -63, -15, -9, -17, -36, 10, 41, 5, -24, -41, 47, 2, 4, 28, 49, -3, -12, 13, 12, -3, -9, -4, 1, -17, -38, 10, -4, 1, -76, 3, -11, 15, 26, 38, -36, -15, 4, -35, -3, -50, -42, 20, -40, -53, -34, -55, 4, -40, -28, -62, -15, -28, 4, 3, -13, 2, -15, 12, 21, 5, 8, -7, -6, 40, 61, -10, -42, 46, -3, 22, 7, -58, -20, -17, -1, -18, -31, 15, -8, -39, 34, 17, -44, -38, -28, -16, -16, -13, -11, -26, 18, 32, 20, 20, -9, -49, -4, 45, -8, 4, 24, 5, 6, -20, -22, 58, -2, -10, 55, -18, -30, 7, -24, 10, -16, -5, 53, 0, 7, 8, 28, -18, 29, -20, -29, -35, 17, 1, -34, 0, -49, 20, 1, 22, -13, -24, -24, -17, -18, 36, -11, 4]
7069Dj3K0rJ4L1n8N1k3l9j6M1mj2j6PM2m4O7p3M1k9qK9ll5N4k3n3L7JNL1m2j4
7103c9J5J7QPq7L0K1J2kL9Nj6N5l2p4R0k5o4O1n3ok0P9n2K8kk9P7lJj7m8N8m2
7137hQl5M9L8l8NK4n9P8k7p6L6j9N2m4L4k0k6j6M9rlk1mk7O9lqJ7j1m1M3m4L2
7171eO7o0l7N1m3QO3o1MNn9O0oj8Q8j12N1Ml8R3m4O4n6l1K1O0l5J5l4l8k6L9J7
7204Gm8O7J7m8j4L8l0k2M0K8j07M4K7J1L7p3J5J3k9O7o7L2j5nk9PM8omPK1k0M
7237A3l8L5j8L2m4K2j1n6M1J4oJ5J5J3J1n1M1m4n1jJ02r3N3OKN0n1Jj1Jj5M7k
7270B2m4L8ok7K9lP3q4jl6L5k1oJ1N7p4%M4J2L1m4n9J07o3PQM4J1q2rN3Jj9L7
7304D2o4pMQL0k6K4j6J1m9M8l1M0M8r0Qj5N1m1J0m1L6M7l3q6R6j1j6qL4k2L3%
$$ y = [4, -9, 11, 2, 16, 47, -11, 40, 17, -22, -38, 3, -1, -13, -29, -22, 20, -24, 43, -30, 11, -18, -26, 3, 0, -35, 19, -4, -57, -20, -19, -14, 17, -25, -39, -24, -7, 1, 8, -79, -49, -28, -16, -18, 21, 26, 10, 65, 33, -41, 49, 24, -40, 21, -32, -38, -58, 21, -31, -3, -5, -34, 43, 40, 41, 24, -24, 34, -8, 0, -35, 14, 52, 14, 19, 43, -16, 62, 35, -41, -5, -24, 28, -16, 18, -2, -28, -44, 5, -4, -7, -28, -32, -59, 10, 7, -1, 16, 5, -36, 7, -37, -5, 62, 2, -35, 16, -27, -19, 44, -17, -13, -8, -67, -7, -13, -31, 57, -55, -4, 0, -38, 55, 11, 75, 19, -12, 9, 69, 34, 49, 15, -23, -49, -10, 7, -41, 26, 43, -5, -19, 19, -11, -33, 7, 35, -72, -28, -1, 10, 47, -26, -11, 2, -27, 40, -27, 5, -10, -15, -44, -37, 11, 5, 1, 8, 29, 9, 13, -25, 10, -8, 24, -20, 2, -9, -65, -24, -10, -16, -1, 14, 27, 38, -13, 28, -16, -67, -68, 34, -59, -6, 0, 2, 52, 1, 2, -9, -8, -23, 24, 22, -22, 16, 10, -17, 12, 9, 82, -2, -3, -39, -4, -25, -31, -20, 37, -37, -37, 7, 19, 50, 6, -53, 54, -9, -2, 6, 50, 61, -21, -30, 23, 24, 5, 42, -22, -29, -25, -17, 13, -13, 11, -5, 6, -43, 5, -26, 14, 62, -28, -20, -35, 16, -25, -15, -56, -20, 27, -6, -92, 4, -7, -23, -31, 3, -19, 14, 14]
7337A4k9J1L5K0J0m6k3J8K3k6pk1L7q6P7l1K9pk0P5l4n9NO2k9lN7m9J9oj7PmN9
7371F1o6kJKMj8M5m4OLN5Rm6L4l3Mqk6L3o3J2M8k7J3%ql3RJ4OJ8MK8k7k2K5j6
7408eLJ1K8o8lN3mJ6Pqm9O0l1j8N0k8n3K2l9P2n2j9N6lk9L1k2oL5o4J3M8o5N5
7442fKJ3m4jK0RJ3n7P3n1N1l2L3J3l9O7o1l4OKJ2k2N3kl7M1m6J6L6l0L1p8R3k4
7476B0m0k9L5%r5O5Q2po8M4j2O0k2m6O6k6J8j7p6P2m0J0K7l0j0L0m0J3j6O6o2
7507b8O0Kl9J9n8L0J3MJ0Nkl8K2k1j0PM6k8JK5J8q7N2J5j6M8j1n6mL8p0L1M6n7
7541c3J3j8J14o0n3J9L9l0O0J4o2k6PK9J0lj2k1J6ojn5P7l7J3N0p9J7m3P5K8n3
7573a1j8L1L7m2rPL4k7o2M3oP0n9l0L7N5K7m8m4k%J4QJ9p4pJ6O6p8Q9j3p4PJ8
$$ y = [14, -15, -4, 31, 51, 61, 15, -8, 10, 33, 7, 0, -21, 16, -70, 7, -24, 5, -2, -22, 53, 19, -40, -35, 27, -2, -5, 52, 3, 22, 16, -1, 6, 2, 61, -5, -7, -6, -4, 0, -18, 27, -17, -11, -8, 47, 56, 10, 44, 11, 15, 7, -19, 14, -49, -37, 11, -16, -3, -3, -11, -44, -35, -21, -15, 3, 7, 35, 8, -14, 11, -5, -2, 9, 37, -31, -34, 19, 15, 31, 38, 30, -19, 41, 10, -8, 42, 14, -39, -17, -56, 16, -36, -55, 1, -2, -31, 0, -22, -28, 7, -57, -44, 4, -61, -6, -4, 9, -35, -36, -16, -7, 6, -51, 22, -29, 22, -10, 23, 36, -3, 64, 3, -31, -25, -23, -11, -33, 20, 18, -19, 22, -24, -8, 28, -2, 29, -49, 44, 20, -20, -49, -14, -14, -109, -44, 38, 31, -37, 7, -5, 55, 33, -13, 53, 27, 45, 28, -48, 24, -16, -6, 21, -9, -19, 11, -29, -16, -32, 34, -28, 32, 34, -5, 14, -44, -14, -1, 3, 13, 18, 16, -22, 0, -21, -31, -24, 22, -6, -5, 20, 38, -49, 3, 18, 2, 50, 39, -17, -21, 17, -53, -22, 24, -33, -20, -38, 76, 16, -37, -18, 21, -9, 51, 65, 3, -23, -16, 13, 23, 20, 8, -13, 3, -3, -4, -59, 18, -19, -6, 44, -35, -18, -61, 14, 42, -11, -29, 2, 39, -3, -12, -5, 29, 2, -60, -17, -23, 47, -12, -42, -5, 50, 77, 29, -15, -17, -17, -3, 5, 24, -50, -57, -41, 25, -53, 36, 23, -51, -44, -26]
7607b6K4j1Ok5K5pj9J5J9PM2m3n8Q4m1J3ml0J8P6n3plK6j9Jk3Rk3LK2M7p0L7r
7642CJ4om9Q7q7N3k5M4L1o4m1O2l4J4q1P1j7M0o4P5Kk7l7P3pp0M5j9Lj2K0k0j8
7675d1P2k0l8J0N1q1L6J2J9j1qk3Q2o1jJ0m5L9j5M9mp3K1NNJ1n6O8l1P0p8O9m5
7708bN4n3L9j7o1Q3l5L5o0P6Or2L5l7lN8l7L2k7J7jK4o5K7m8N6m1N8p0J0Q2l8
7740Ek6m3O8K6p6J1R9j02N4K4j1j5KL8m8J4kp2Q5nm1O5l3j0M1m5N6m4l1L5m5k3
7772d9O2j9l1JK5oO2j5m2K8p6M5l2M4O0q4L6K9Kmj5k2J5J2m3MRjJ4Mj6K5omj2
7807@j2pK3J7%pK5n9J8K1Kk9J2Ro6Q5p2N2j1Ll9L7%k2l3L8K6l3L7l3J8J8k5Qj4
7842a3N3l2k5N5Nl8On0N6jo0K0K9Jj4LL4n1j7O2Jo2K0L6M7j00K5K6j0L1j05J38
$$ y = [-26, -2, -13, -7, -32, -7, -14, -33, -18, 1, 8, 50, 7, -51, 33, -8, 5, 1, -29, -11, 65, 12, 5, 2, 28, 9, 10, -13, -4, -27, -24, -2, 45, -25, 12, 3, 17, 11, -38, 49, -38, 15, -10, 34, 65, 1, -40, 22, -12, 2, -79, -8, -25, 15, -49, 26, 28, 1, -36, 37, 30, -40, 5, -14, -11, -23, -3, -23, -41, 31, 11, -27, -17, 34, -47, -11, 1, 20, 9, 1, -22, 60, -1, -2, 8, -37, 2, -13, 36, 32, -41, -20, -15, -10, 1, -55, 13, -18, 52, -26, 43, -2, 52, -1, 38, 21, -40, 43, 8, 43, -17, 59, 65, -27, 8, -29, -32, 26, -11, 21, -6, 11, 10, 34, -31, -4, -52, 4, -37, 21, -49, -39, 43, 5, -21, -64, 4, 30, -46, -35, 64, -38, 16, 40, 29, 14, 16, 54, 6, 20, 18, -54, 31, 26, -15, 50, 17, 7, 48, 3, 59, 15, -16, 19, -26, -49, 13, -6, -37, -36, -11, -17, 45, 30, -12, 16, -60, -15, -47, -3, 57, -27, 9, 38, 40, 36, 21, -1, 14, 26, -17, -13, -4, -5, 9, 13, -3, 22, 16, 12, 0, -12, -19, 4, 21, 21, 14, 39, -20, -2, 19, 21, -8, 4, 13, -53, 32, -40, 12, 1, 4, -35, 2, 2, -20, -53, -15, 11, -22, 15, -18, 0, 18, -7, 1, -13, 40, 8, -17, 38, 43, 5, 11, -39, 17, 16, -44, -24, 5, 6, -8, -5, 29, -22, -39, 23, 24, -38, -18, 18, 65, -35, -10, 16, 6, 37, -68, 70]
7874G0j14L5j8O5m4k7J3K8Ll9M5n7J03o6J8k0k8O3n1K3M9q0J2M8%o0J0K2j5L4
7904B2k9Qk6J3Lj6M2K1q4N2j5qM1m7nM6ml4J5m3J03j10R5k2l8j7J5l3nN1J4K8
7936C3m2M9m8L0qLm6K1Pl2P6k4o6J2O8q1J2m6P9K9m9j4J00r7L8qm9J3J1Q0n0j9
7968a8PL9l2n4O1L9n6j0Mk4N2LoK9J7l8m9M1K0p3K1j6N0K9m3J4j8%J5k1O0Orp1
8002c1ML3k2L3p6O4qqjM1k5lqM9j0m0L4m9O0n7K3oM0n5J3l1O6l8j8L0nK8m5K2
8036Dn9M3K4j4Qn6K4MK0o8Q4n5J7Mj5Q8o9j9N0l2L2k5JQj2k0L4nk7MM3n4J4M3
8070A9l4J4l1M2o6J3Kl1M8J4kM0j6rqKj1KqM4om0J0J9M6m9J2m2K4j9KJ2K4n8N3
8105A2M0n6M8j3l7KJ1K8j7mk3L4o9K0K7k9k6L1n8M8lM2J5k2K9n2L5L8j1k3m0N3
$$ y = [70, -44, -9, -27, 38, -6, -33, -20, 8, 11, -28, 17, -40, 63, -3, 15, -5, -33, 30, -21, 2, 51, -29, -17, 31, 31, -29, -19, 3, -12, 22, -7, 1, -25, -12, -9, -25, 17, 38, -46, 6, -9, -17, 24, -23, -28, 18, 14, -20, -5, -48, 55, -55, 40, 18, -20, -37, -22, -55, -60, -9, 5, 33, -9, 40, -8, 22, 14, 17, -29, -8, -1, -33, 43, 19, -47, -35, 33, -48, -36, -82, -3, 26, -23, -37, 63, -34, 4, -4, -53, -40, -29, 51, 1, -18, -11, 28, -4, -58, 3, 42, -14, -24, -20, -44, 8, 11, 5, 34, 51, 13, -36, 5, 25, -48, -27, -43, 7, 36, -7, 7, -11, -11, 4, -17, 43, 49, 40, -31, -27, 6, -16, 17, -59, 5, -3, -11, -12, 29, 4, 1, -7, 42, 32, -8, 26, -23, 37, -20, 3, -3, 37, -18, -5, -36, 30, -8, -26, 4, -1, 27, -18, 4, -55, -12, 12, -2, 6, -50, -26, -22, -2, -70, 14, -41, -24, -20, -35, 53, -16, -35, 15, -17, 15, -10, -9, -1, -13, -33, 1, -4, -31, -27, 16, -38, -24, 19, -15, -1, -32, 10, -56, -43, -41, -72, -24, -10, -12, 28, 12, 3, -5, -3, -14, -12, -20, 24, 18, -22, -12, 7, 53, 4, 16, -26, -2, -21, -19, -7, 17, -41, 12, 52, -4, 44, 31, -6, -4, 7, 35, 18, 14, -9, 25, -44, -24, 3, -26, -52, -21, -79, -31, -34, 8, 23, 1, 30, -22, 13, 51, 40, 17, -23, 30]
8137C0k4NK5m5pK3M8l3J1n3L8K8n4K2Kl5LmL1m4j0L6j3L8m3pj6K4M5q2L1k8Q4
8170B6l1k2N1l1K5n6jL8M0J4n1K8r8Q3L2q0K9rp1J24m8
$$ y = [30, 6, 11, 36, -9, -16, 7, 55, 22, 33, -20, 18, 46, -8, 14, 16, -19, -16, -20, 11, -33, -43, -7, -20, 18, -25, -32, -48, -24, 21, -61, -30, -58, 26, -5, -27, 24, -7, 18, -38, -39, -1, 39, 53, 2, 30, -68, 15, 47, -33, -4, -13, -84, 40, -8]
8191h
$$ Imaginary data points
##PAGE= N=2
##DATA TABLE= (X++(I..I)), XYDATA
0@%%%%%%%%%%%%%%%%%%%%%%%%%%%%%%JmQj3J6j6J6j6J7j9K1k6L1l4L7m0M6n1N5
49B9o2O9p5Q2q9R8j06J15j28J40j52J64j77J88j99K04j92J35N8p86O771M2638
71D8725m0223l4671L2007N076k1494K722L664k3422J1407L2691o749j5743K2385
84A6375L177j6897k864j42j0967P01O463j854K480J7008J311j1865O776j092j4336
99e726Q04K807j2752J169J2546M072l455J0793J56j7004J713J3187j4357r039
113a5086R843L822R44J0774M371r956k871P791o175j0670J946m782k31J1535O20
128A875m669J2240N300j3841o598J3263n501j9146O206J1347q173L945J2241n630
142B859n438J0213K633j4284j242J0524n792p439J1021L932m619l72P13k120l32
$$ y = [0, 0, 0, 0, 0, 0, 0, 0, 0, 0, 0, 0, 0, 0, 0, 0, 0, 0, 0, 0, 0, 0, 0, 0, 0, 0, 0, 0, 0, 0, 0, 1, -3, 5, -8, 8, -8, 8, -8, 9, -10, 11, -15, 16, -18, 19, -21, 25, -26, 29, -33, 36, -39, 43, -46, 52, -54, 61, -67, 73, -79, 85, -92, 96, -103, 101, -91, 44, 102, -684, 6087, 48725, 8502, -26169, 5838, 10914, -10580, -7858, -4194, -27616, -16209, 16482, 9733, -6010, 16375, 19552, 2655, -209, -351, -11318, -10617, -4154, -6008, -3528, 13480, 14791, 2926, 9702, 8610, -5726, -4922, -2115, -14867, -13698, -1152, 2920, -535, 10258, 10414, -6590, -4877, 8310, -6047, -15086, -5243, -1421, -477, 10297, 14668, 4712, 1841, 9632, 3457, -7213, -5267, -10049, -10280, 1255, 1875, -2794, 9446, 14746, 905, -5693, 7570, 2069, -17077, -10871, 476, -7697, -3752, 8489, 2859, -2579, 7634, 10267, -4017, -5259, 5265, -527, -7966, 3055, 6987, 2368, 1996, 2709, 589, 257]
157B57j246m253l825N640M027j495K700O42j996L474p39n630j92P70j917p61O312
174A768K395o063K543P314n487k711L618k769m705K262M047j951k106L024k245
189a066j932N396k428n463K398J967o08L014K254k067k558M059O47m178J662r92
205A05o563M212O748l455l684M165L175m322r47L615l878l327L651j185r50L676
221A036K40l793N33M552N2m805O71J543r49K337M84k125J675M93j470N68M13k018
239e63l196K178L003k449J70K267k412J190K364k035j960P69K58j607N79L379
255A935k205k418L698Q64j000L63j728o74J952O34r55j230J537m62j749K843M25
272A830l989L95J112m9J234M99j434j682K037K966k473j100J502k431j98K988
$$ y = [257, -989, -5242, -9067, -3427, 600, -895, 1805, 2447, 451, 3925, 3186, -2444, -2636, -1866, -3783, -4544, 1768, 4163, -1900, 643, 7957, 2470, -241, 3377, 608, -4097, -1835, 2212, 261, -1845, 1179, -1066, -2998, 2398, -30, -5493, -3095, -1128, -1736, 1278, 3532, 1465, -1093, 2966, 3613, -565, 1097, 105, -6458, -2246, 4502, 1047, -2637, 1528, 4703, 381, -566, 3049, -829, -4156, -505, -1690, -2640, 1036, 1276, -2517, -1984, 2568, 2620, -2185, -1514, 29, -920, 1417, 1901, -224, 1451, 1944, 474, 1042, 1455, -563, -3759, -1581, 1422, -1027, -857, 1410, -1002, 188, 2552, 517, -1443, -674, -416, -2023, -1444, 1935, -270, -2688, 1010, 1874, 874, 1237, -491, -1165, 787, 1421, 466, -764, 773, 311, -1438, 1405, 1830, -2159, -1764, -652, -701, 533, 1032, -402, -2084, -47, 2919, 446, -654, 848, -1583, -1781, 1207]
288A207N40k055j414J427J632p04O63j319k030K002J060j017L97n51o53J12Q76
305A73J345j533j306M28N5J875N87k737K47J439O8R2m66k62p95n38K292j80j198
324d14J99r02P91K117j172j411l94Q19J192p43K16j06j334J294P96p10O94j347
342d15j306J308J523J00k109n39J960m70K92R59j964o75J142M86M32n02l47p72
360h97k96K803K14k787L2N17L00J113l94m91q11j69J610R3l18m04k115R06J882
379G88l84l00j098k54J567N86K03p97j259Q37J66M46R87k015q75J206O49P20r06
398B67j223L79M41J126j58j546M66k43m55J919k67j443m58K07J503J80m65m05
416a75j204J510J852j369m88j6o80P09O60J54j133j626J361R61k77L57j401n23
$$ y = [1207, 1747, -308, -1722, -295, 1337, 633, 1296, -23, -2053, -51, 1009, -8, 389, -162, -815, -703, 173, 1518, -15, -1321, -893, -838, 1037, 1624, -1113, -866, 573, 641, 733, 267, 5, -790, -1328, 964, 784, -414, -215, -1117, -326, 1791, 619, -792, -1186, -367, 825, 82, 298, 192, -1142, 152, 948, 238, 932, -415, -1721, -413, 1110, 1210, -899, -1438, 522, 52, 344, 1303, -661, -1336, -194, 292, 724, 222, -125, -897, -1193, 1610, 1824, -963, -931, -414, -114, 999, 605, 114, -697, -866, 744, 837, 519, 115, -2000, -1094, 788, 404, 104, -994, -1248, 319, 905, 1108, 311, -948, -111, 55, 501, 1488, -527, -1402, -196, 453, 1173, 267, -956, -577, -136, 990, 832, -714, -248, -491, -946, 973, 706, -737, -1195, -988, 515, 695, 230, -175, -1379, 131, 1983, 614, 126, 110, -570, 139, 799, 953, -180, -1806, -445, 516, 239, 596, -805, -1328]
434a328J349N50K50r24q42Q34j15N46P89j475o62M98N74J195q15j013K85J31J227
453A054K05j262n5n22J19J178m62n19n94o04J232R17k68n54j036Q72J023j89M04
472I39j169r82J322L43J26j42j070Q3M56Q42N72j693j12Q41m10O43j8j152j54
491g35j22P67M66q27m4m09K43J794k38r65j98j28J183J97n83j07j113K19J374
510G74l62k62n64p15R90N11M20n00j386N87R57p1K43j064n89Q21J15M85j04j024
530g38L78K58O56O99j138j65n3P1J061n60q87J37o93N14J143l09o78q42M96J346
550F96j52j96n48r94J267O83m45j32r53K20Q68j7M70o91p29P64J18L77M2j002
570c54M4k9L19P60r71n21M76j61O01L14n97k66l29R83P35r28r0j70l79R73J69
$$ y = [-1328, 21, 571, 821, -103, -945, -111, -226, 320, 1109, -366, -1028, -530, 44, 1239, 424, -589, -304, -173, 1054, 1259, -3, -58, -580, -461, 717, 255, -264, -858, -1462, -230, 687, 419, -135, -1171, -299, 724, 535, 939, -230, -1212, 110, 453, 579, 437, -633, -550, -94, 748, 1320, -373, -485, 356, -54, 589, 571, -581, -735, -857, -90, 376, -451, -495, -904, -661, 1133, 895, -70, -268, -396, 787, 984, 401, 294, -819, -600, 774, 412, 150, -414, -1129, -139, 372, 792, 292, -1094, -507, 450, 379, 622, -442, -1031, -210, -95, 390, 286, -738, -360, -102, 554, 1253, 115, -50, -103, -32, 1029, 469, -418, -281, -974, -460, 683, 374, -304, -1146, -650, 696, 544, 348, -200, -1194, 73, 756, 311, 179, -774, -554, 314, 297, 767, 76, -653, 111, 229, 606, 648, -354, -310, -339, -20, 740, -231, -752, -276, -437, 164, 478, -119, -385, -714, 269, 1004, 76, -14, -184, -563, 410, 579]
591E79m82l14o65P33O11p6K06j055l82J278K49j04o61p69N31J89M34K39j350L1
611g78P84Q0N92m13n45J36m6P93J88j017m9j95M17Q55n62m04l65k36J235K28o68
632C0j88o79L59J087M0m62r54P0J057o9J87r9j364M87R00J83j26p87j62M07J94
653A11O76n73r15M13J72N22J16r59Q5N8J45R85m66q15L9J03P08J21n01q5p80O10
675b30J168o44l37k97l51Q71K90j21m41q28O31P25r6J40p99k72O45K92K81l67
695B60r67M02K11L03N08r04m40M22L08N23l63n27o8k75R43M09j037p2j06J65Q57
716E52r7m01m92k60J031L75m44j69o70L75O12%J33q84n97J021J21l5mp56l8N35
738i2N98K07j116o4M75q5P57k44j041K04J95M94L05o60j38j40K82R39l97n60j45
$$ y = [579, 97, -217, -882, -149, 462, 386, 592, -463, -845, 433, 682, 578, -83, -852, -321, -132, 302, 541, -809, -778, 6, 86, 678, 265, -280, -144, -190, 603, 791, -226, -275, -470, -53, 802, 240, -164, -529, -765, 470, 698, 30, -158, -837, -478, 609, 649, 187, -767, -697, 360, 291, 478, 379, -985, -498, 402, 585, 459, -328, -490, -83, 111, 787, 214, -701, -288, -116, 406, 522, -437, -352, -294, -149, 836, 370, -445, -406, -303, 405, 526, 25, -60, -840, -230, 938, 294, -43, -340, -691, 180, 470, 349, -92, -920, -289, 436, 340, 480, -319, -591, 54, 346, 627, 260, -707, -305, -94, 209, 717, -187, -627, -205, 103, 626, 263, -264, -332, -607, 336, 745, -292, -364, -470, -305, 552, 455, 54, -438, -698, 333, 708, 264, 95, -575, -200, 412, 412, 545, -339, -936, 85, 206, 171, 167, -589, -627, -92, 506, 713, -403, -467, 8, -77, 680, 436, -605, -401, -206, 288, 593, -67, -205, -345, -63, 876, 479, -81, -226]
759b26l33P68L40o45j86n40K17J029j75k52l78k03P37K46J20j90r13M44N51j97
779B14L10n62o01M86K90L82l52p74M73J29K13N13p45n02K51P3P14m61n37J53l51
800f84N77P72n23k87j35K76P30k13r9l90p06P97M19l94p5o31M2N80K6L41n79m99
822f55N67K15J96J4p09q8K25L14N43p83l04L62j6N47K07p19j22K4N61L36o78k07
844a70j71k14R05j05n15k53j70O08N09k30k9n79K5R38j05j58l56m72M69K15J83
865C25O3r02N6P27J9K81m60m59J51J35M98r9r05J26J69Q6N81m75k81mK7P85N3
888D97n72R4k85K48O26k85j74m85j8O60j72J3j64o80M28N83j07m2m48r1L68N5
910D9M10m33p10M69J61J86K42n79n2J59J95O70n64m03K07j89M74J34n34j52k13
$$ y = [-226, -559, 209, 549, -96, -282, -822, -605, 424, 249, -3, -381, -584, 153, 399, 519, 329, -584, -140, 411, 214, 524, -38, -639, -153, 137, 519, 167, -607, -134, -5, 208, 721, -24, -526, -275, -202, 512, 51, -486, -333, -684, -107, 665, 142, -145, -280, -4, 726, 513, 414, 24, -682, 115, 534, 140, 65, -566, -524, 56, 82, 423, -156, -655, -88, 127, 323, 337, -372, -460, -235, 79, 622, -161, -465, -103, -119, 428, 635, -84, -206, -182, 379, 715, 37, -170, -341, -555, 350, 245, -270, -523, -693, -85, 424, 194, 165, -414, -389, 549, 444, 286, -70, -542, -73, 142, 325, 388, -514, -458, 269, 288, 569, 109, -350, -199, -64, 434, 335, -570, -444, -275, -189, 392, -83, -364, -368, -341, 444, 497, -75, 19, -266, -18, 608, 323, 149, -336, -354, 306, 134, 147, -17, -697, -269, 314, 207, 165, -283, -374, -6, 49, 459, 26, -684, -215, -54, 132, 374, -205, -257, -98, 97, 767, 203, -200, 7, -182, 292, 426, -108, -260, -473]
931d73L80N09l64q1j64l07O80K75l43j93m23M74L90j99J72n44l47O95J49J46l57
952G5n63L48R8K48L39p32l12M41J14L77k79n30J33n2N31L30p98l9O0J13N85k16
974B71k98j96k15P63J11m30o9m31K59N87j55r2n31j02O95M0O3j9o51K22N02J5
996C39R5o35j44L31L6M24k51p74J93K87J88J54l97p2o2J27P44l34n38J43j10L15
1018E9K77k82j91k89K79O58k90p7j29l51N68K13j67j46o58K65M67j48N9l94k82
1039e59L00K14L59j53n63L17J37J56M25n37m44K22J65L30k36l52N1j75M98L70
1059E25m70j61o9J6M94n4l27k73l20N42J77k37Ml39K03N66N6J39l80l61O08J15
1081D54q4N3p12%K25K00J38n13j89K54j5M59Pn23n6J74K67J83n19j21L2q6N96
$$ y = [-473, -93, 416, 52, -29, -193, -500, 180, 455, 112, -81, -504, -30, 360, 161, 333, -211, -558, 137, 286, 432, 75, -488, -140, -42, 206, 545, -187, -499, -58, 56, 433, 154, -376, -243, -295, 236, 566, -232, -271, -211, -98, 487, 271, -27, -223, -438, 325, 436, 6, -63, -494, -235, 352, 197, 105, -426, -528, 167, 207, 270, 251, -400, -178, 324, 339, 434, -201, -345, -14, 22, 446, 195, -579, -386, -99, 89, 243, -154, -226, -288, -161, 583, 249, -289, -146, -256, 59, 336, 54, -137, -426, -147, 511, 221, 144, 15, -336, 232, 445, 278, 132, -526, -261, 206, 58, 117, -277, -559, -259, -45, 314, 161, -402, -85, 52, 208, 633, 96, -348, -126, 39, 369, 133, -219, -168, -343, 155, 525, 55, -106, -175, -159, 335, 281, -46, -319, -639, -97, 80, -157, -153, -492, -289, 277, 333, 472, 92, -269, 339, 454, 370, 423, -289, -289, -64, 136, 274, -239, -428, -174, -189, 270, 277, -246, -302, -128, 139, 322, -197, -318, -286, -372, 224]
1104B24K2l74k5QN41K49k54km41l1N53k03j93k89m34L71J57Q8j32m13K36M66p5
1127D9L20k68k92K36K0K76k3n91Q4J38R4L89l14j91Q8L8M82j94l54J11l99K04
1149i7L55m06l10j70Q2M87j4R1j06l43O06L64j83P1l55j90L21J0J52l83m50L61
1171a07J04J40J67m80M8R2J14L32m58l34J37j40L23P5m27n0N3M21L67k34nN9j14
1194H3M76O2l25j87l50L11J75l43O7m11j17N18J71p5j75k21K75J20J38J23o83
1215c68j6L68q3K26j07k84K21R9L60J12l69N5l5N6K79l38l91p1j82L46J02m10
1237d30K2o0K24M22M2q8k94O4M35j30P4n7n33J34M10r5N5k62nJ54P0K79j38m93
1261b00J54N7j7M6m00j39K9O8L93j26j97J52Q3L57K26j84j34j93J60L62l52j38
$$ y = [224, 246, -128, -153, -145, 396, 645, 391, 389, -52, -83, 470, 267, 74, -215, -649, -278, -121, -33, -165, -578, -342, 124, 49, 369, 101, -191, 45, 65, 341, 318, -273, -189, -51, 43, 432, 118, -73, 15, 53, 535, 341, -13, 98, -301, -97, 258, -148, -458, -628, -546, -59, -73, 18, -88, -431, 175, 539, 356, 427, 72, -118, 203, 213, 365, -18, -468, -107, -3, 137, 304, -176, -128, -36, 78, 410, -48, -382, -245, -385, -62, 13, -414, -464, -411, 10, 377, 143, 138, 197, 83, 559, 621, 296, 109, -241, 70, 245, -98, -31, -442, -559, -41, 130, 55, -120, -341, -66, 54, 192, 315, -368, -384, -16, -99, 127, 20, -264, -43, 56, 416, 528, 159, 214, 179, 235, 514, 176, -215, -286, -468, -122, -20, -430, -408, -468, -244, 178, 220, 132, -162, -98, 337, 207, 281, 224, -309, -175, 235, 140, 195, -67, -72, 82, 152, 431, 293, -200, -46, 11, -6, 40, -360, -499, -470, -402, -9, -135, -332, -180, -97, 260, 486, 302, 168, -25, 135, 497, 145, 7]
1283Gj35k34M24J74j48j49k54J92L05jN5l76l09L89N9N5k16l75L27L3K32K99l19
1306C5j92L10K44R0j08k89o2j21K98J12n62o8K2k9M04j8l01M0j34M80J29j93o5
1329B2k76R7L68j82N3k30k37M78J07L4Q4m46R0K82M7L4m03j48Q6q9J99M1m48J30
1353c07J41O1K57j63r9j2O4M93k70k74L8o3K30J80k19q4k20N7M75n8j36j25k22
1376b56K38K01o9q7l90L7L03q2J50j34k65K41K07J45j2k94Q6P9P6K06k55l15N2
1399a38O0L13j42k95J01j20K41L53l03j47o5k0L43m7j05k19k12M28J94j60rk17
1421a66l7L35R6N3k50k58K62O7K2k1k90m9J59J14J97l13j89K34l3J96J23l79k6
1444a53R9J11K28k82j00m3k6L75j6k33m8r1J76K00l4n6l40JL57rm7j24j89K00
$$ y = [7, -128, -362, 62, 236, 88, -61, -315, -123, 182, 181, 236, -140, -449, -60, -1, 54, -162, -537, -210, -177, 55, 354, 35, -157, 153, 397, 487, 379, 90, 28, -93, 205, 317, -245, -313, -291, -320, 84, 66, -235, -195, -329, 151, 280, 87, 22, -254, -157, 211, 29, 82, -148, -385, 93, 200, 234, 318, -128, -38, 244, 291, 325, -78, -226, -140, -229, -30, 11, -437, -307, -166, -105, 152, -11, -110, -122, -58, 435, 165, -109, -71, -134, 96, 276, 57, -27, -247, -190, 285, 227, 91, -34, -256, -18, 183, 114, 27, -363, -326, -23, -105, 45, -89, -354, -113, 94, 239, 227, -67, 19, 98, 174, 380, 125, -190, -138, -78, 235, 93, -202, -101, -221, 20, 373, 70, -77, -142, -162, 181, 134, 29, -190, -402, 26, 220, 60, 51, -166, -203, 132, 228, 281, 31, -227, 35, 102, 124, 103, -187, -236, -77, 37, 234, -79, -268, -34, -67, 129, 252, -127, -153, -54, 57, 285, 3, -97, -140, -166, 209, 193, -40, -88, -179, -3, 197, 163, 107, -233, -232, 125, 116, 69, -55, -244, -44]
1468d4J51M0L0l74m3K86L2N5j04k09L0J69J68j4l44O0N5J3K28j10j74o7O4K95
1492A93lj91rj39R9K62o3j66r4m3L06J0j9j35l08K08K64n3o3j76n8K07L6O6j16
1517A5k69J99Q1P3R8l11r9R0J66J93k02k02J11L3J64R3k18j46o2J66K75k44p5
1540g1o4j23K69J69j47m9j71J97K18n7m4k38j25L83o0M4j24j72R6J07M1J21k94
1563i4j04K35j7J19j13k01K1J5J73J37k84l1M7qL22j28j10kOK21Lj81M3j84L1
1588h4K49j40n1q9m4K15O2l5J7l54J23K44j1L8k34j03J92n0J94k7k61O4J04J44
1612A63N9j81q5L1k5L15j51k96O1o9P3K09j19m1j46J34K19k4j08j8j36K44J46
1635B55j12j62j37P7J72k8Q8j62j36J78R4J02q5l17J00M1L0J71k81j84K00L4J23
$$ y = [-44, 107, 147, 177, -197, -240, 46, 78, 133, 29, -180, -150, 19, 187, 173, -171, -111, -56, -43, 185, 75, -99, -166, -102, 193, 190, -1, -10, -149, -50, 212, 149, -17, -111, -154, 152, 162, 143, 8, -300, -92, 172, 119, 56, -120, -178, 29, 65, 131, 15, -254, -55, 26, 99, 197, -114, -213, -123, 43, 236, 34, -168, -57, -24, 140, 233, 15, -131, -193, -27, 248, 4, -71, -135, -258, 11, 180, 33, -16, -187, 10, 228, 171, 127, -111, -236, 147, 87, 131, 7, -165, -69, 38, 79, 200, -94, -198, 37, 20, 139, 26, -175, -154, -139, 34, 171, -113, -144, -97, -105, 217, 89, -21, -23, -17, 204, 207, 26, 69, -115, -84, 165, 25, -26, -115, -159, 56, 118, 83, 100, -254, -131, 113, 102, 140, -94, -197, -5, -55, 139, 112, -149, -85, 19, 163, 222, 41, -44, -13, -38, 277, 126, -170, -109, -178, -105, 104, -15, -56, -202, -68, 151, 127, 19, 1, -135, 109, 255, 143, -19, -156, -79, 93, 65, 153, -9, -145, 33, 127, 229, 144, -173, -73, -32, -2, 169, -112, -296, -96, -62, 61]
1658F1Kj38N1p1K78J19k10j42oK2K26l2j49m0j37J73J49j35J1j37j1K10K9k7j69
1683g3k00K66Q4k4J5k38j0K09O8K3r1j11J00L2J56N5k95j7J9L2J71j96j05K0m4
1708a54J94N1j42l1k8J28J10q9j2j47l4L69j13j48K5j21J23J70Jo4j99mJ61kJ20
1733A64j30l01J86J35M6q1k10O4M7N6J97r9j69Q9KJ59J1j87k6j03J77J92j68j10
1757e9p3P0J48J0n8l6j98J84K02p1j06j38m5K00N6N5k40j25K11J02k1M0j52j7
1781f1j6J32J33j81j93J67m3J66L8k86JJ31K1J66j01o2j15j5J84P8q9r4o7P6K44
1806B14j31q8m9o7K18N6j21q8j03Q5J05R1J2k61q2J97Q4N1r8j68R2M1Q6M8j44
1831b0m6J4RK45j20j21oqK23m8j60k8oL6K13j09q7r1OJ34O0QOk97R8J84rj3j66
$$ y = [61, 63, -75, -24, -95, 183, 302, 92, -50, -56, -34, 192, 160, 11, -29, -166, 7, 156, 21, 32, -105, -116, 94, 123, 96, -73, -273, -7, 77, 53, 68, -170, -180, 29, 97, 120, 29, -82, 18, 50, 206, 261, -34, -51, -32, 0, 171, -25, -130, -110, -154, 40, 91, -51, -82, -110, 18, 128, 39, 27, -120, -154, 215, 102, -46, -21, -142, -19, 151, 152, 88, -111, -115, 46, 44, 164, 34, -267, -81, 54, 100, 19, -191, -127, -80, -24, 173, 74, -95, -6, -4, 155, 166, -21, -47, -150, 27, 219, 51, -59, -132, -62, 86, 96, 38, 2, -196, -12, 190, 119, 13, -125, -170, 30, 86, 141, -99, -224, -13, 89, 68, 108, -44, -61, -77, 55, 188, 7, -186, -19, -62, 104, 142, -144, -143, -12, 9, 175, 74, 12, -103, -118, 66, 144, 55, -39, -106, -30, 214, 83, -5, -54, -121, 97, 153, 32, -56, -159, -74, 31, 122, 134, -127, -209, -12, 72, 123, 25, -143, -51, -10, 76, 124, -20, -66, -52, -43, 202, 82, -39, -45, -53, 170, 122, -38, -66, -72, -36, 177, 68, -19, -110, -104, 30, 90, 98, 104, -193, -95, 89, 80, 67, -99]
1860i9lJ00k1J34n8j93J08J02o4J51j99j33Q1O5J90j42j37J01J2K0J64j42r2k7
1884h2Q2J38j9q4o3j39K22J53j98p3j09J21J23l6J6j06q2J02J49jJk43R9M7L0
1909D8P1j99J3M7M5P0J7j04Rr8J15J45k28o6L6l0J75Lk08K1j2J60L8o2k3j47J42
1936b2J34pjj15j22J69K9k3M8k14j3J76j3M3p4q7J14q1J86m7k09j8P6Q8R3j56
1962d6j9qM6J49Pj64P8l1lJ59q6j03r6qK52j5j43Kr5N9J33L6r8j04j5J98J4m0
1990E9m4k12J73R2L1j0j86O5M2K6P9r8q7L9J8J39m3j49Np4R6J56j52o0P2l4J38
2017H1n5k3J3j32J31Q7p8K3j26rJ79M%p2j75J71k1N5O7k04K7P1k5J10p2j43Q2
2044c4L0J05Q2k39K6N0M3P8q4m8n5l9J47L2j01l2k2Q1M6j9k3n1j21K45qm2p0o2
$$ y = [-99, -102, -2, -23, 111, 53, -140, -32, 70, 6, 157, -42, -175, -94, -29, 161, 19, -118, -17, -5, 15, 179, 37, -55, -82, 0, 138, 119, 35, -28, -167, 55, 208, 10, -63, -172, -51, 72, 36, 52, -54, -136, -34, 115, 114, 115, -128, -29, 18, 48, 119, -80, -67, -20, 25, 95, 112, 8, 17, -81, 34, 179, -49, -115, -79, -109, 66, 69, -139, -118, -130, 30, 68, 6, -17, -164, -22, 112, 105, 104, -11, -133, 36, 65, 42, 90, -124, -137, 39, 26, 69, -5, -92, 22, -59, 127, 80, -129, -147, -71, 17, 110, -46, -65, -73, -27, 122, 129, -35, 43, 12, 9, 168, 82, -21, -117, -125, 127, 112, -31, -29, -124, -65, 68, 104, 6, -98, -113, 85, 99, 59, 15, -197, -24, 68, 99, 89, -97, -32, 10, 36, 115, 17, -70, -31, -13, 126, 83, -66, -61, -135, -39, 117, -35, -95, -23, -57, 81, 26, 3, 16, -116, 15, 102, 24, 47, -79, -88, 91, 95, 95, 23, -152, 19, -2, 53, 120, -84, -57, 14, -11, 99, 27, -116, -34, -4, 101, 183, -56, -30, 20, 63, 141, 57, 9, -46, -85, 62, 94, -7, -39, -61, 20, 66, 47, 24, -27, -148, 97, 89, 47, -23, -85]
2072h5J5P1J17o4k00kJ63M2O9o4j47N4M9Q1J1j67J5kMJ95j14q2j4k6J65L6j60
2099d0K3k6OJ74j16m8o4pJ62O0o3m6j77J09K04j37L4p5j15J63K5K0n6r4O1k4O8
2126B1N1j03p0N4R0J09j32j24R9j7k0J02o9r7P7J0J22n4m2n6n3J19J09r3n8k3
2152d8j4J26K3qr4o8J05ML6k4j47j7R3N9M3j51l0J50l3K4Q3j82K6j4J05K1j06
2179c8k5O2LQ6L8j71k3P2P9N9j10Nr5n3K28o0o0j36K8J40L9l8n8j15P5J46J9r8
2207aj1p6P1K6N8j7j59M0J19J4O0j64l7N0O0J28o5j46P0j10J41O5j48k0q6J7K39
2234A18j11PJp7R7J07o3n0r2M5K8K3M1j17p4L9J31k5M4j50pL8N6L2rj23O7n5Q8
2263IM8j49K6L1N6K6l5L0lp0J22L1o1o5q2N5N3j9J0j15LQ7J14j02pp8Q8O8k0k2
$$ y = [-85, -70, 1, 118, 54, -146, -148, 15, 57, 126, 62, -85, -31, 18, 99, 110, -57, -42, -44, -40, 155, 41, -41, -55, -81, 84, 120, -40, -17, -43, -37, 137, 21, -27, -91, -98, 64, 124, 61, 15, -162, -53, 151, 14, 48, -27, -142, 21, 46, 66, 10, -84, -23, -47, 21, 72, -31, -101, -47, 43, 152, 20, -104, -5, -22, -42, 60, -9, -106, -29, -19, 103, 49, 7, -49, -102, 17, 126, 33, -25, -48, -62, 64, 87, 79, -15, -83, 22, 26, 62, 38, -109, -126, -33, 26, 69, -82, -112, 38, 5, 29, 112, -70, -44, -58, 47, 68, -38, -63, -1, 2, 88, 126, -45, -68, 4, 83, 142, 32, 37, -58, -111, 117, 57, -3, -139, -111, 29, 68, 30, -28, -143, -68, 78, 97, -1, -12, -88, -17, 9, 67, 50, -109, -69, 50, 64, 124, -40, -77, -27, 33, 161, 96, -50, 20, -90, 51, 116, -32, -52, -138, -121, 118, 7, 14, 15, -62, 35, 142, 79, 29, -63, -18, 10, 33, 74, -43, -117, -78, 53, 28, 72, -78, -85, -47, 9, 41, 32, -91, -24, -79, 9, 57, -92, -66, -35, 21, 47, 12, 42, 39, -31, 91, 122, 61, -4, -86, -31, 22, 3, 13, -102, -99, -12, 102, 0, -7, -85, 3, 71, 51, 29]
2293B9m4j08J52nN9p1l9NK1J15j2j48l5J57q4J09m3q2k4l5Q9K2j00L1l2O1P8O
2321G2K3p6J5R9l2n6j0j95J75j5N2o4o3JJ07o7M5mj79J58J3j3K5j30j2O2k8J37
2349D0l4m6O8mM1O3m0q1K2lO9r1l6K1p0L6P8o0j3p1J15R8q7k0l3l2R5qM3p5p5
2380i0M4L6L1N4n5m7P8M1Onj38jQL6L0r8k7L6J8Q1J0o2m2k0J45k2L2n2n1J9J00
2411I5n0m4rq5O3J65r5L9j25J9Q6k4O0j66k6M8PR1p6j02k1J40K8L7o1K0Ql6M1
2440B7O0q3n2J4M2M2n1J1j13M6J64j18J1k1o0J25L4p9Pj32P0J17m6o5L5p6R6K7
2468C2O7Lr9K6K4M1M7j02q5O7l0O0lj80O4K4K5J11r0k2l8P3L7K0j11L8r4J23P2
2497A00j14K2N0j36R9J3M1r2l7M2M8n2j6n4k2J10K1Pn8o5O0M6qJ03r8q1L9O7P2
$$ y = [29, -15, -123, 29, 24, 83, 12, -27, -22, -1, 114, 102, -46, -81, 76, -8, 101, 58, -24, -48, -83, 6, 28, -72, -41, -73, -12, 66, 72, 95, 19, 34, 133, 101, 45, 35, -160, 15, 0, 52, -12, -75, -74, 33, -34, 11, 7, -172, -14, -1, -14, 11, -119, -131, -69, -97, 40, 6, -40, 28, 24, 65, 128, 88, 7, 29, 26, 95, 4, -32, -11, -81, -45, 33, -27, -40, -111, 4, 102, 15, -5, -38, -70, 25, 17, 60, -15, -90, -46, -10, 21, 75, 20, -27, 51, 92, 98, 93, -45, -46, -38, -2, 28, -70, -97, -61, -43, 38, 48, -14, -56, -76, 69, 47, 79, 27, -24, -5, 95, 45, 1, -8, -93, -30, 135, 40, 79, -46, -27, 59, 35, 95, -71, -97, -49, -42, 49, -27, -129, -150, -10, 18, 55, -6, 14, 22, -14, 27, 87, 4, -48, -34, 8, 50, -1, 10, -103, -57, 107, -11, 0, -21, -81, 44, 78, -1, 6, -126, -56, 61, 15, -50, -15, -91, 5, 32, 99, 102, 3, 29, 53, 94, 141, 39, -46, 21, -9, 51, 48, -132, -68, -44, -19, 92, 2, -20, -58, 15, 52, 72, -39, -1, -95, 28, 100, -14, 8, 58, -78, 21, 34, 75, -17, -54, -12, 36, -16, -32, -86, -108, 2, 23, 30, -28, -93, -33, 13, 5, 108, 10, -71, -32, 35, 107]
2526A07j17pJ1n9J30j5m6J0r4O7R0r4N6o5l2Q3j1p4l3K6M5N3j0l7mQLJ15p8L4
2556F2j18K6J4L4L0q7m3O4J3O0n3o0K6mJ21n3Mm8L7m4N6m8O8q4k9Q5j7J4n8k9
2586f1O8nN4J0j28MR5l3J3Oj05J01j2j1K9l4J3J8rL0m4o4M0P2k9K1q5jNM5R7p1
2618B9n9j7j5J18jn9k0MO2j7L0k5j6r4P7L5rn2l3K4M4M3l1p2K3j0%J07l3j22M7
2649d2mNJ12n5k6kO8k5J1q1R5r3R2O8j47K5J0p3Q5J3o8j9k6O6M0l4No2K7P1K5
2680F1jj17L5K3M4J8j9j28P0J5M1L0o9oJ5l2N1m2k8n7J07j2O2j11K0n2N3P2K1
2709F4r5L3L1pL6q3L4q7M7P0l1J2o5j5pR5k5j5m5K4L8j3K3k7l3n6Q7Q7l6p5M1
2740Gkk5J04p0n2L7KJ14n0n4Ro6J8O6o9K0j0k5M9J8J2p7n7J26mMj8n9k2R4K6l1
$$ y = [107, -10, -17, -6, -65, 65, 50, 4, 14, -80, -13, 77, -17, 39, -26, -58, 25, 14, -60, -93, -67, -22, 31, 21, -16, -20, -12, -9, 106, 28, 62, -56, -30, -16, 18, 48, -39, -82, -18, -5, 55, 2, -58, -32, -36, 85, 32, 36, -12, 25, -19, 37, -11, 57, -27, -56, 29, 12, 26, -32, -61, 7, 2, 56, 66, -62, -58, 37, 4, 17, 23, -82, 19, 7, -4, 25, -9, 4, 22, 13, 43, -1, -65, -25, 47, 18, 39, -46, -47, -42, 3, 100, 29, -30, -47, -62, 56, 55, -4, -24, -20, 42, 25, 55, 30, 14, -80, -3, 32, 23, -29, -62, -38, 6, 49, 18, -54, -31, -41, -41, 66, 33, -89, -42, -46, -41, 71, 16, -10, -12, 56, 31, 42, -39, 56, -37, 55, 123, -24, 1, 11, -62, 23, 36, -32, -51, -77, -11, 29, -5, 0, -62, -35, 36, 61, 60, -57, -22, 1, 45, 63, 44, -84, -14, 1, 42, 72, 3, -3, 12, -20, 31, -11, -39, -96, 11, -1, 61, -50, -30, -82, -29, 43, 64, -31, 2, 33, 26, 62, -21, 13, -74, -27, 43, 12, 24, -41, -56, -63, 32, 7, -8, -53, -29, 9, -4, 19, -8, -41, -97, -10, 77, 41, -34, 7, 5, -20, 84, 14, -38, -1, 1, 115, 65, 11, 20, -46, -28, 38, -31, -11, -21, -46, 3, 21, 33, -44, -101, 25, 21, 25, 7, -52, -74, 20, 46, 15]
2772A5jk5O6l8Q4o7p2j8M2N1M2r7l9NoR3prrk5N2J1o5Kk6m4R1L6Nr1QN6O8j4m4
2807C0o8l3J90j29Ll0l7O7N1m9L1j00L4O5pL2K3j00N6k8P3j7o9m3kN5M9n5pj8
2837c3k5J31J9r1k2JjP1o9L6r5K0L6N3K4m4o2P3M7qM0j14K5k4k9R8Oj28J10p9
2867c4O7n0N1Mo3N5N9p5m1J5L7l1O0q3K6qJ3N1j0m0j2j3O5Nm5j6J6k0K4l7L5m6
2899d1j4O1oqmJm1P2M6Lm4l3k9R5j4k8l0M5n2K7O1j10Rn7Q4J2J2l5Pl9N4M7n7
2932fJ8q9N4Q0q0L7p3L2L8NJ7k5p1M7J9j4P5j10k7O7rJOk2M1J2Ro0L8l7K4J6O4
2965G7n3r0L5J8J5N7p5ljK0J2rlJn2L8P4j9pj29J06L6o8O9jp7JQ9L8j33n8O4L7
2998IM6k2k1n4N8Pm6Q0j09M8n8O6O5n0jk8m3J26l8j6n6J5N2j0Qm8j8k3Q7rJ2n7
$$ y = [15, 14, -11, 55, 17, 101, 34, -38, -56, -14, 37, 79, -18, -57, -52, -58, 35, 28, 19, 10, -15, 37, 48, -17, -15, -41, -85, 6, 42, 47, -44, -36, 20, 88, 74, 30, -38, -71, 119, -10, -7, -37, -74, -7, 44, -5, 26, -74, -40, 25, 18, 50, 73, -27, 29, 1, 74, 57, -12, -55, -57, -2, 47, -8, -15, -33, -58, 73, 92, 1, -21, -20, -21, 50, -19, 17, -78, -58, -22, 31, 55, 11, -51, 22, 69, 61, 101, -13, 12, -12, -41, 57, 63, -65, 45, -34, 33, -17, 34, 38, -25, 30, 89, 14, -27, -12, 25, -6, 54, -29, -3, -11, 2, 53, 43, 3, -9, -22, 43, 48, 3, -13, 3, -17, 7, -30, 5, -41, -55, 6, 0, -8, -12, -11, -52, 20, 66, 69, 25, -8, -37, 58, 44, 16, -14, 31, -21, 6, 67, -43, -34, -91, -7, 5, 17, -18, -11, -50, 4, 51, -6, 12, -77, -23, 57, -23, 14, -59, -27, 11, 16, 33, 8, -63, -16, 3, -11, 64, -46, -73, -6, -15, -14, -8, -30, 11, 23, 32, -28, 10, -27, -3, 13, 77, 24, -66, -31, -13, 2, 59, -16, -19, -20, 0, 12, 3, 0, 1, -51, -13, 61, 42, 35, -94, 12, 48, -20, 49, 48, -29, -28, 61, 99, -34, -92, -28, 9, 55, 33, 12, -42, 16, 23, -23, 57, -52, -4, -62, 4, 69, 19, 18, -10, -53, 73, 35, 19, -37, -22, 30, 20, 28, -20, -38, -61, 26, 17, 29, -28]
3030b8%M1k9O6p3l3nP9N2k1o6l4Q1j1J7lm8N8l0k6R1j11mm0J7J33m3l6j7K1K3
3061B1Qq4M6m0J5L8K6L3m3r9M1O9O4o7o3K8l5R6J6j0q0N5n5O6on2rJ0l4O5kp7
3093e9R4k0J3j0p2P6j56J32N2p2N3p8j8L7N2Km1p0R3j1PJ2k5l7P9kL8j00K0m6
3123e7P2p4J56q1m7J7N0l5m7N4k9L1J6Q0j18qQlN2rKm0n0O7L5l3o6R%R9l9kl4
3156b4m2O6RM6l2m7Q8q4L5M8k6q0L2n6O0L8n1K6KK0K7q1K3L3o0L8J2q3L3MO4k0
3188A8k5j0n6J0N7M4n8L1m0N0m5L3pp8R4MM4o2m9K9N0J0OQk2o5j8J00k2Rp5M0
3220EJ9jk0PJ4o0O4N4r3qJ2pN1%m4k7k9N2K1l0N7m2Lnl4O2Oo9P3j7Mp2K9M1l1
3255a5L4K5n8k2L4J3l8O3k9l5L2K3O7q0m6J8j3K7M1p8L1l3L3M4l8J5l5NN4k2O7
$$ y = [-28, -28, 13, -16, 50, -23, -56, -61, 18, 70, 49, -17, -51, 30, 19, 36, 33, -15, 43, 13, -13, 78, -33, -37, -77, -60, 73, 30, -6, -23, -2, 21, 29, -55, -9, -49, -34, 4, 30, 63, 20, -79, -38, 31, 95, 28, -35, -7, -42, 54, 70, 60, -20, 35, -20, 46, 40, -12, -21, -11, -45, 20, 18, -59, 35, 15, 28, 18, -54, 22, -134, -2, 50, -22, 31, -47, -65, -28, 24, 26, -15, -85, 8, -3, 4, 16, -9, -46, 33, 31, 69, -31, -11, -57, 15, -59, 97, 16, -31, -14, 36, 1, -46, 8, -21, 10, 26, 106, -12, -20, -12, -15, 37, 28, 30, -10, -60, 7, 42, 9, -57, -48, -48, 51, 12, 10, -24, -66, 0, 9, 55, 23, -24, 64, -20, 15, 63, 37, -43, -11, -67, -7, 31, -20, 6, 8, 28, 55, -26, -3, 30, -30, 8, 20, -63, -30, -26, 38, 18, -7, -17, -73, -63, -6, 38, -20, 11, -29, 21, -24, 9, 2, -76, 18, 22, 66, 4, -45, -16, 34, 44, 50, 58, 36, -29, -47, 53, 31, 40, -35, 5, 24, 23, 3, 10, 24, -36, 28, 82, -11, -19, -7, -14, 37, 37, -7, -34, -63, -11, 10, -20, 37, -5, -2, -7, -41, 21, 27, -42, 31, 14, 18, -54, -25, 16, -15, 19, 44, -14, -36, -2, 11, -27, 36, 7, -28, 4, 27, 94, 14, -32, -14, -27, 0, 41, -37, -6, -39, -6, 38, 0, 15, -20, -15, 39, 17, 84]
3286H4j24J7k0L2j3M8p3OM5l4O7m3LM9q4Q5K5j02M5l0J0K4k6k8M8j2M5o1Jl1Q
3317c9J9P8n4Jl9k6N2j5Q4m9o2l7J36r4M7j7K4K8o5N0m6l2Q1J2o8N7n7L0k3N6
3347C2k2j8J3o1K7K6M3l3P9q5K3J8r0N0Jr2P8J6RPr5J26j2r0N1l5M0j5O7k5j0
3378B3k0k7N4KNo8j2QPL0qm2M9M4nK9o2j5m2Q5rlj6k1J8N0l6j0m7L7Oj9NJ0q5
3413h5pR8J5K0l5kk5J18j12M3n8PN5p3J06o5km1QL1P0j16M9j3J7%Op7K9L1ol1
3445d5K0j6oK7J04j21K6k3k0P3Ml7jjK7QM5kk3p5P6oj6O2r3L4J1l1Nk2k8%l9J0
3479g3L9ljJ5N1J6qj4r9N1P1o6J6m1J0M7KQpk1m7L8J6J4km7K5j2M0l6Ko0Q1%K9
3514C4l3m0L6N3k1L1n7k6l0L9M0n1Pn8K2N8pj8l3k1M6N6o0M1o8m6J78m4ml0l5
$$ y = [84, -40, -23, -43, -11, -24, 24, -49, -43, 2, -32, 35, -8, -5, 44, -40, 45, 70, -32, 13, -17, -7, 17, -9, -37, 11, -1, 44, -17, -16, -47, -39, -20, 58, 4, 5, -34, -60, -8, -23, 61, 12, -50, -87, 49, -45, 2, -15, 9, 37, -28, 22, -24, -56, 25, 37, -31, 26, -31, -1, -24, 32, 10, -8, 5, -56, -29, -3, 40, 7, 86, 1, 24, 42, -48, 2, 3, -89, -11, 5, 14, 21, -74, 52, 40, -50, 1, -34, 6, -9, 58, 33, 23, 3, -24, 30, 32, 37, -31, -43, -35, -28, 2, -6, -48, 1, 45, 40, 69, 7, -8, -50, 35, 26, 23, 7, -14, 4, 54, 18, 8, -39, -2, 4, -15, -10, 0, -85, -92, 6, 21, 41, 6, 4, -21, 97, -15, 28, -30, -23, 32, -41, 65, 0, -2, -43, -35, -4, 66, -50, -1, -14, 3, 3, 9, -68, -39, -8, -14, -45, -25, -41, -47, -20, 84, -37, -11, -34, -54, 19, 23, -14, -15, -16, 11, 19, 64, 62, 39, -36, 40, 34, 18, 80, -13, 21, 32, 1, 6, -16, -44, -44, -83, -73, -34, -37, -38, -23, 28, 44, 36, 22, -77, -26, 45, -21, -5, -46, -36, 11, 13, 21, 14, -7, -54, -16, 0, 14, 12, -35, -10, -22, 18, -18, -16, -76, 5, 5, 34, 1, -39, -3, 50, 29, 60, 3, -23, -53, -14, 26, -25, -18, -76, -54, 4, -3, -21, -54, -75, -29, 27, -33, 8, -60, -106, 72, 28, 24, -6, -41]
3545d1j1R0k7Kn4O4N5r0J6j4MLk3L2l3KJ1J2l9N2K7l7k6J2O6kj11O6J8l7P6j7
3577D6q8l9Q3M0k9Pm6PK6L5k2j3q9Q7N2m8j1K1l7J4K6Orj1K8o9M5kj4r3J12m3
3609b8N4qo8j7j1J16K3J6j13j0nO4j0N4m2n2L6K3k3K3n2pPK8L2l9MO3r9Q9o1J5
3641Bk8J7J0l9O5l6K5J8l1O2k4n1l8O0J6o3N9p7L4M2O8q8l3M5n8M3LK1j8p5Q6
3672A7k9Kj3j5Q2n2J4K8o8OrJ0Q5L0j02nK4j9N6m7j5k4K0RO6n3m4J08l9l6P6j09
3704d6pK8M5j8k4n2N2%j2P5o4rL2j2lO2q3j5M8L0k5%m9N7l0L5n0O1l3j4l8Q4l0
3737eK3nl9L9j4j1kN1k5l0j9M0o2M6J1M5r7Q4k1k1l5O7m2L4j0n0N5K9Lk3Pn0L5
3770HJ6n1ojJM9m5o8O4N3J0j0Kpn9K6N2l3L0m3m9N8N2j32O8no3O7J4n1N1n1L2
$$ y = [-41, -52, 38, 11, 13, -41, 23, 78, -12, 4, -10, -6, -3, -26, 6, -27, -25, -14, -2, -41, 11, 38, 1, -25, -13, 53, 51, -60, 6, 24, -13, 63, 46, -42, -81, 2, 42, 13, 20, -26, -19, 7, 42, 20, 7, -82, 5, 57, 9, -2, 19, -18, -4, 22, 28, 19, 8, 36, -33, 12, 10, -4, -97, 15, -28, 26, 18, -50, -67, -78, 38, 61, 77, -36, -46, -51, 13, 3, 57, 15, -37, -1, 22, -1, 22, -30, -37, -30, -2, 30, -9, -5, 58, -41, 48, -13, 2, -26, -9, 1, -38, 27, -9, 16, 34, 3, 65, 41, -10, -48, 12, 28, -35, 24, -53, -19, 23, 91, 3, -30, 15, -43, 0, 3, 24, 6, -69, 17, -12, -10, -23, -38, 44, -8, 6, 34, -34, -28, -37, -27, 58, 88, -14, -19, 5, -14, 42, -5, -20, -44, -24, -15, 51, -2, -46, 62, 23, -13, 63, -46, -53, -25, 20, 2, -22, -74, -22, -22, -34, 41, -23, -32, 0, -12, -15, 47, -36, -51, -3, 27, 2, 2, -47, 10, -20, 15, -35, 26, -7, -21, -59, 25, -5, 18, 13, -26, 13, -1, -12, -14, 37, 12, -18, -37, 3, -59, -13, -2, 43, -54, 30, 9, -12, -47, 20, -22, 12, 2, -48, 7, 36, 39, 16, 23, -27, 8, 24, -27, -33, -34, -33, 16, -29, -97, -33, 20, 30, 20, 22, 15, -44, -18, 34, 1, 31, -12, -61, -3, 49, -83, -15, -20, -83, -16, -2, -53, -2, -53, -21]
3803b1L7L3k9n9J6N1PL0n6k0L4K0n0M4k4k0k2NJ31p1m1j0N3l4K6o6j5M8o1J09
3833D5o4l3LP5j7j7K1l2m4M5M2rL3n3J2j9MOoo8Q3J9k6n0M1j1QP3o0l5qL1l9M3
3867gM6n3j2K2K2J9ro0L9p7Q5K9m2m6m3J6Q7Ln7N4k5k6N0m8N2m2Qj7PK2k5L3O3
3900F8p4K8l1j3L3j8K3j8K8j9k9j2P3n2mML0k8J4p4O6n4J5M4j0P1o5O2m4l3Jo
3932b4Kk0K8J9K3k3k2k3K5M6Jo3J4RM0K8o8k0K1l8P8k9qJ8m6K4M3j8K0o6N8k4
3964Ekk6j2n1J26p4L3j0j00J29k6L1nlk1QK8k8L5l2k3P5p1L5p1L9K2k1pMmk3K1
3997a9RNN%J8l9k1N3Lm4M9%K3j9l8j0%K6k2L8K4q8J11p8j2N2k5l5Q0n4M2k2r0
4030g8M3N2K5o4LQOn6O2k4J4J6o1L9J9m6L3l5K2Q8o7Mj8j2P6q3J0K8qL5j2M9l9
$$ y = [-21, 16, 49, 20, -39, -23, 28, 35, 65, 9, -11, 23, 43, -7, 37, 13, -7, -29, -24, 107, 36, -5, -15, 38, 4, 30, -36, -51, -3, -64, 45, -19, -52, -49, 26, 9, -8, 13, -19, -63, -18, 24, 15, 48, -5, 7, -12, -8, -2, -8, -76, 7, 26, 0, -50, -9, -20, -12, 61, 1, -34, -42, -11, -50, -7, 39, -14, -26, -4, 18, 37, 28, -32, 7, -70, 15, 44, 2, -44, -87, -71, 16, 19, -38, 16, -9, -35, 15, -33, 19, -23, -15, -32, -25, -3, -28, 5, 68, -6, 22, -9, -22, 11, -7, 16, -2, 26, 7, -22, -34, 39, -13, -17, -13, 17, -11, 3, -71, -5, -59, -44, 0, -10, 61, -4, 58, 14, -19, -18, -24, -22, -42, -14, 5, 28, 5, -17, -40, -15, 31, 32, -31, -17, -8, 32, 60, -8, -28, -7, -45, 33, 4, -4, 14, -32, -8, 35, 17, 37, -29, 29, 5, 3, -23, -35, -86, 40, -34, -1, -11, -111, 18, -8, 23, 18, 15, -6, 2, 30, 2, 37, 5, -18, 57, -14, 21, -50, -11, 11, -10, -17, -13, -17, -40, -19, -10, -5, 0, 0, 18, -21, -42, 11, 14, -30, 19, 19, 42, 23, -15, -25, -25, 1, -21, 17, 41, -47, 64, -14, -26, 26, 1, -34, 46, -8, 34, 12, -78, -35, 17, 42, -22, -19, -11, -5, -61, 1, -23, -9, 7, -54, -15, 4, -42, -9, -44, -22, 66, -1, 3, -15, -27, 49, -34, -24, 4, -4, 31, 19, 68, 29]
4063B9o7k9J7N0N4o8m4M2J7Pj6Rl4M3L%k1k5O8n6QL8o1k6J1k3R9n2K5n0O4l7O7
4096D2n4l1J3j2O6m1j0N7n8J6O7o0n3P5n1J3N6k1k4j2O5q3K5M6o8jPP7l4l1j1
4127c0k7M4K0p9j7N8k0N3jl2M0k7L1J4K1o1J6o8N1K6k9O1j0k0Mj2%o3J5L8oL9
4159B9l2j9JJ9qm2N3KL3K1o7Ro1M5K6l9J6J8l6L5KL9k1l4Rn8N7j8l9N7K2l7O4
4192D6Lk4p4Q1o5Q7n4n3M9KKO2p2pj9N6l3L3l0k1P2j5n7K8M1l9J6l1lJ8Ljl1k4
4226e4N1K6l0k8L9j9M5k7K9n9P0m5L9J4q5JkJ00l0m5n4P1n1LLJ1J3J7J3M3o4O
4258Aj3J3L5n2K4k9m1R4l8j4oj4J3J7J3qj2n0K7N1k7N0l1K6l7j2J7j5rM9K5j6
4290C1m5J9k7K3mP%Pk2J3M4n1J4l4RM5N3n0l2k5mM9n4P5j4j8k0K8ql4m3N5K8r
$$ y = [29, -38, -67, -50, 0, 54, -14, -58, -16, 1, 8, -8, 1, -33, 10, 13, 13, -8, -33, 35, -21, -13, 25, -36, -62, -51, -74, 25, -27, -2, -52, 12, -25, 42, -12, -43, -30, -42, 24, -17, -27, 30, -28, -12, 55, -5, -58, 17, -34, -21, 35, 14, -10, -22, 43, -40, -15, 31, -37, -38, -31, 46, 12, -19, -30, -57, -13, 7, -72, -89, -31, -51, 2, 1, -31, 9, -18, 13, 27, 48, -13, 3, -65, -14, 12, -17, 44, 34, 14, 18, 6, 6, -57, -42, -4, -10, 29, -3, -22, -21, -2, -10, -52, 1, 3, 36, 57, -10, -1, -62, -17, 9, -30, -14, 4, -32, 3, 5, 44, 23, -11, -2, -60, -3, -21, -60, -3, 19, -18, 46, 49, 25, -49, 32, -33, 54, 0, -53, -4, -2, 0, 62, -10, -17, -36, 20, -13, 20, -10, -31, 41, 26, -31, -3, 38, -1, 15, -16, -19, -1, 2, 1, -30, -54, -3, 23, -7, -35, 4, -15, 30, 3, 32, -27, 43, -2, 37, 51, -34, -33, -35, 65, 35, -10, -64, 7, -44, -41, -38, -27, -14, 3, 16, 59, -5, 1, -12, 1, 36, -16, 8, -21, -62, 32, -6, -20, -26, -40, -27, -10, 3, -5, -17, -67, -40, 11, -16, 34, 3, 29, -8, -20, -3, -18, -27, 22, 47, 31, -14, 5, -22, 1, -3, 4, 4, 11, -11, 2, 46, -5, 9, -25, -16, 29, 82, 32, 0, -25, -29, 20, -34, 41, 27, 9, -11, 17, 9, -25, -68, -13, 15, 6]
4324Fj3J6k6k7O3M1p6j7M6M4m8J6p3M4NM7n0j0mJ9p0N4j2l9M9K6n4M3K0m0P8j02
4356d4K0L7mk6l9JP4j9p4M3K1jM2q2J23p5J5nPQj6MNk8Lj2J9o2Q4j4m2j4Lk7Q9
4391A4j4oL7o5J2l1O2J7l0j3J1J7k7k9L2N4rll7O7j10Q3m7j3J3l5M1M3k3J4pl7
4423a9k4J8j2P6k4o4N2l5M9l8j4M3l6K4QNk2m7QK8NKoj1M5k2PqK4l3J7PJm0P8
4458D2n3J6K7o9K6m5N9nj1rk7L6K9J8po2NO1ql8M2ql4j4Q9pm6j4L6k6QN4m4l3
4492a2JK3K4l3L2p4J5N5K6rp1K0m4O9k1rk2j8M2M2L2l0o2J8k7Q1j27O7PK2%Rm4
4525a8L2l3M8rQj3l3j4PP8j7m5n7Q3j9M5o0j7J1R0q2Q5p6m9K2J7KN7n4k5J7jp
4558b7J4j3j6L0J8j4J0km2J1O3Jk4L7n7K8lNl4k4L7k3K7O4q0QJ3J2k5J1kp6R0
$$ y = [6, -7, 9, -17, -44, 19, 60, -16, -33, 13, 57, 9, 25, -48, -4, 1, 48, -2, -12, -16, 3, -67, -13, -25, -64, -15, 11, -43, 0, 20, -20, 58, -44, -24, 13, 9, -17, -56, -55, 19, 0, -74, -31, -10, -11, 31, -51, 72, -3, 12, 7, 14, 22, 6, 10, 15, -13, -10, -22, -3, -65, 19, 5, -37, -51, -48, -75, 14, 0, -6, 31, -34, -22, -53, 9, 26, -4, -17, -6, 11, -16, -45, -13, 41, 32, 29, -8, 59, -51, 32, -15, -28, -15, -50, -9, 34, 11, 25, 18, -19, -43, -25, -37, 39, 15, -49, 3, -32, 17, -21, -35, 8, -28, -4, 4, 9, -13, -60, -52, -24, -19, -17, -23, -34, 11, -11, -4, -12, 12, -21, -4, 3, 4, -36, 42, -11, 5, 32, -37, -11, -56, 3, -2, -13, -22, -49, -13, 16, 34, 27, -35, -30, 31, 23, -15, 27, 19, -15, -29, 60, 53, 7, -7, 29, 3, 11, 65, 21, -12, -11, 12, 36, 3, 35, -39, -24, 31, 57, 48, -23, -3, -47, 22, 1, -8, -30, -48, -6, 36, 68, 38, -24, -6, -33, 48, -79, -12, -5, 17, 17, 26, -18, 14, -19, 29, 20, 28, 15, -18, -32, -25, 53, 36, -9, -66, 17, -2, 43, -17, -34, -23, 67, -15, 70, -6, -55, -33, -16, -14, 43, -11, -36, -19, -20, -27, -13, -26, -42, -12, 6, -8, 2, 0, -42, -31, 32, 33, 9, 46, -11, 17, 14, 19, -15, -39, -2, -25, 2, 66, -14, -6, 7, 19, -6, 5, 3, -73, 17]
4591A7j9J3n3M3o2R9p7L5lm9K8M6j1l1J5o8N6N7J5r0O8j5ML7o2pM6j4KoOO0p9
4624AJ1K3Mj6k2MJ0M9r3M2l6NL3n0K2J2m2mN3k4j2J3j2lQ0o1J0Nk5j9J9KL5m9
4658c5N9l7J3O8l5n1O8j6k8K1n7K9M7p8L%QO3j8j4l2L5m1KO4j0l0j7l9Q6m1M1
4690B8J1r0N9k6O6n6O1n5j9KK9l2K7Nk0P7r1l8M5J3K4Oj1po8N1O6l4J5n3L3l8
4722b0M6qm5j9O0l0L0j6qn2N8n6Q9mq3L9k1O1j2J6J5l6L1o0L5MK7k6J1k7l2J5
4754a8L4m6O7q0J1K6l4M3P6o4K7n2n1M9O%k2L4k5K6j0Pk7L3j7PKn2K5N3j02J15
4786D1L8l4j03J0O2%pk2J7J0Qm3J8Mm6N5j7J8qm5O8K9o9L0o6K5M9l7J2l6mPJ1
4819b5L7mJ1k4l4N7km0L0l3%M1J8l4nJ1Rj0k3N0On1L7L1j0o5J5K2m8K6L0j7jJ0
$$ y = [17, -2, 11, -42, 1, -61, 38, -39, -4, -7, -56, -28, 18, 7, -24, -9, -77, -21, 36, 51, -39, 29, 14, 18, 55, -7, -14, 32, 18, 20, 14, 20, 80, 1, 12, 35, 39, 23, 1, 5, 15, 64, -29, 13, -23, -18, 15, -35, -13, -1, -43, -47, 6, -18, -30, -17, -29, -32, 48, -13, -3, 2, -23, -42, -23, -21, 14, -35, 24, -13, 0, 68, 33, -18, 50, 34, 6, 27, -30, -1, 46, -32, -29, -29, -21, 42, 24, 10, -22, 13, -28, -26, 38, 28, -2, -19, -58, 28, -13, 28, 39, -51, 8, -18, 48, -8, 53, -2, -21, -19, 10, -22, 5, 10, -10, 67, -24, -62, -17, -4, 20, 26, 15, 8, -60, -9, 57, 23, 38, -15, 18, -20, 26, 18, -27, -46, 14, -16, 14, -2, -10, -62, -4, -60, 29, 25, -58, -19, -40, 21, 9, 25, 40, 4, 35, -25, 10, 14, 41, 15, 26, -1, -33, -18, 16, -30, 37, -43, -32, -6, -40, 3, 79, 15, 42, -10, -61, -12, -6, -6, -28, 6, -19, 7, -3, 4, -23, 10, -7, 0, 2, -50, -25, 28, -74, 41, 79, 45, -58, -48, 14, 14, 7, -15, 2, 12, 20, -23, -5, -1, -47, 8, -9, 9, 1, -44, 24, 53, -16, 14, -52, -27, 22, -15, -3, -39, -43, -36, -25, 12, 8, 19, -5, -39, 18, 16, -24, 6, -27, -27, 14, 32, -2, -7, 4, 13, 3, -20, 30, 36, -15, 22, 53, 43, -22, -7, 15, -33, -7, 23, 6, 5, 15]
4853A5k4j7P4o5mkN0j8J9m6L1o4N1J1j9J4l3kM6jm3L6JL0l4k9k4K2J6K3j4N0r3
4886d3O0Lk6j8N9m7K1k3L9Ok9J1Rj2l4m9j7N8M3M8n6k%k0k8K2jM1Orj3k1lN2m4
4921a7Q6m5j2Rl4O4p2K2J0lJ5n8N5K7k7j3n9j1R1no5L1j0J7m0L5M1l5k2N8L9o6
4953FK3J2Oj1o3Q3l7l1J6J3K4l7l0N3m5M4lj8J6k8j2L5n8L8l8oO8J0nnk7k8L5
4986@JM5l4m1RL7l8L6K5n5lL8k9jO6j04O9n9N8K8n1k6l9R4j6k0l0M4jJ2o0K8J9
5019Bj8m1Q1pm5m2O9j2jj8N3m3J3Qk6J1mQ1o3n0K3K3J2l5Q5j24K6M3K2J8J1j6
5051C6l9K6l0qM9l0Rk3L3L2m5k0n6R0k2p3N3M6l4J0K6n1j2J2J1L5mo7l2M0M8K1
5083C1l4Q0o1klJ8m8K5L2o7O9m8K7m8L2Kl2K9q3R2m9Q1o1J5M0m9L3l1j2L5l9j3
$$ y = [15, -9, -26, 48, -17, -21, -23, 27, 9, 28, -18, 13, -51, 0, 11, -8, 6, -27, -29, 17, 16, -27, 9, 10, 40, 6, -23, -47, -25, -9, 14, 0, 50, -43, 17, 20, -6, -24, 35, -12, 9, -14, 25, 31, 2, 13, 22, 10, -24, -73, -90, -32, 11, 59, 3, 1, 1, -19, -47, -25, -26, 15, 21, 12, -1, -22, -25, 27, -17, 69, 24, 12, 21, -13, 51, -21, 1, 11, 8, 23, -35, 20, 47, 20, 7, -52, -63, 28, 23, -42, -11, -21, -4, -44, -9, 32, -3, -25, 33, 72, 6, 29, 41, 47, 36, -27, 56, 19, -12, 4, 17, 41, 4, -26, 27, -18, 26, 23, 5, 21, -7, -19, 16, -42, -4, -42, -48, 20, 30, 25, 20, -7, -35, 0, 1, 46, 12, -29, -20, 17, -21, 15, 40, -15, -18, 20, -9, -10, 56, -48, 21, -38, 20, 48, -3, -29, -68, 26, 10, -10, -40, 4, 3, 15, -45, -17, 2, -16, -57, 24, 17, -28, -70, -1, -13, -14, -32, 21, -22, -9, -1, -27, -16, -20, 61, -2, -52, -29, -6, 6, -29, 56, -68, -42, 1, 23, 41, 52, 36, -3, 23, -7, -15, 34, 4, 13, -10, 23, 55, 10, -10, -66, 24, 2, -71, -18, 28, -6, 4, 30, -21, -33, -21, -10, 25, 21, -46, -78, -38, 10, 31, -3, 77, 16, 14, 11, 29, -19, 6, 38, -29, 40, -8, 19, -29, 3, 5, -27, 2, -81, 11, -38, 43, -18, -3, 37, -12, 21, -10, -22, 13, -26, -39]
5115c9Q3Kp9M0m0J2N0n0j3Qk3L0N8ok7k2Oj6N0n2M5Jj2j8J3K7m8K6j7j1k7R6L4
5148H1m9JQn7Rk4N4m6j9L4K3Pj7l5O0qj7n3M2L3q0O2K8m1l6O3J1l0L6k2JJ5l2
5181BJ3j9J3knn2M7K9k0m3K7jJ1q1O7L9j3l2j8K5L9o6J7%k1M5j4L5Jo9M2j8K1
5214aRj2M4m6j3M1k4M6l0mj6j0N2J9o6krM8m8J7Lk3N2j8n1L8M2p9L1M0r6O8j5
5247a3k5L7k1K9K0l7M2m8mN1l2j3K5j9L5pj2k7K5K9n1j2N7l9k3K1k3RJ2jl3P1
5279B3p2J7P7l2o1L8%n9N3j4%oOM9o8P4m5l2L1K1NM8m0n2RL7l5J2J6J6m4M1j3
5312@j4jjl0M3%ok7QN3J9m8ol6N8r0LM2L8o4M7M6j5l5J5k4L5l3M1q0M8k1N6k5
5346dm5M4JkJ6j5k3L1oK1o4N6k8m1M3l1%M5k1j3M1J4ok2j9mL1J2M6j33Q1l1J7
$$ y = [-39, 44, 46, -33, 7, -33, -21, 29, -21, -34, -26, -49, -19, 39, 33, 6, -16, -10, -26, 24, -28, 17, 18, 6, -12, 1, 28, -20, 6, -11, -22, -49, 47, 81, 32, 33, 41, -16, -7, -31, 23, -23, -42, -8, 15, 22, 5, -30, 30, 22, 5, -48, -6, 27, -53, 9, 37, -4, -40, 23, 34, 4, 40, 18, 19, 34, 2, 15, -4, 9, 7, 2, -50, -3, 26, 6, -37, -10, -11, 0, -81, -14, 25, 12, -20, -38, -13, 26, -40, -23, -23, -44, 1, -13, 22, 23, -46, -4, -22, -1, 8, -4, 40, -6, -19, 22, -2, 44, 14, 10, -6, -16, 36, 55, -11, -13, -22, 26, -22, -5, -2, -25, 27, 9, -42, -4, 38, -41, -10, 30, -66, 2, -13, -38, -1, -22, 7, 27, -10, 32, -16, -20, 31, -1, -14, 11, -8, 27, 20, 8, -19, 6, 35, -16, -28, 29, -10, -33, -12, -35, -26, -14, -15, -48, 23, -49, -32, 45, 13, -48, -10, -10, -69, -16, -30, -30, -36, -30, 19, -49, 25, -20, -52, -21, 0, 5, 53, 13, -39, -30, 7, -28, -16, 0, 16, -28, 13, 0, -14, -15, -16, -46, -3, -3, -9, -36, -28, 25, 44, -4, -10, -46, 12, -78, -75, -33, 5, -59, -12, 34, 19, -16, -1, -25, 10, -23, 18, -62, -14, -35, 21, -4, -49, -5, -4, -6, 10, -5, -28, 3, -3, 18, -46, 10, -18, -59, -16, -47, -47, -2, -23, -36, 5, 19, 13, -9, -28, -32, -1, 11, 57, -76, 5, -26, -9]
5379ij8N2j0m0k7J0N8j0Lp7P5j0J0J4K5l7o4M7P0n2m8L0L2oj0k4l7N8ok1%l3Q5
5412C0p0J4j5R8k4n9kR7l7m9J9k1J3LJ4j2K8r1P5L3l9l8J2L3k8O1m7l2k6N6K0
5443A6L2q1n3N6kO6o6K6j2j6M8K2l3n5L7%j2K5qP3k2n7Q2j15P3q8O7PL1K9q2M
5475hn7Q9Pl4l8J4k8O3J6l0O1r6L6j9J6j3pmJ%M9o3M6M5q6K7K3K6nl9l4J7J0M0
5509B5l5mJ9p6R3Nm5pJ2j3N5L0m9M3n9RJ8k1l0O6j0p3MP8%l0Oj9k2mK3l6PL6j
5544em5N6Lln7L6L4j5j5J7Lp5J27o6k8N9j8l1M9l5J5MqL8l8l0J1j7j1KR5p5J4
5577iK4O5j32O1K2l0j9j7J8L5j4n8Q5k0J5k4Lk7Nj3N1k%LQj1j1Pll8P2q5N2L3
5611D6n1N8p0k5k0M1jL1J8J3j6l8K1L2n6K7p0M0oK6%k6M4k4oj3O7p4JRQ0q1k6
$$ y = [-9, -27, 25, 15, -25, -52, -42, 16, 6, 9, -68, 7, -3, 7, 21, 46, 9, -55, -8, 62, 10, -38, -8, 24, 18, 8, -16, -53, 5, -1, -22, -22, -55, 30, -40, -26, -41, 57, 33, -26, -28, 69, 32, -17, 2, -19, -6, -3, 11, -1, 27, -64, 11, 44, 5, -33, -21, 12, -16, 45, -2, -34, -60, -4, 16, 48, -33, -86, -30, -32, 34, -32, -6, -18, -34, 14, 36, 3, -52, -15, -15, -27, -2, -10, 63, 41, -16, 66, -49, 24, -64, 3, 10, 41, 70, -12, -8, -65, 24, 31, -3, -41, -27, -55, 8, 24, -6, 55, -41, -5, -24, -8, -21, -28, -32, -31, -31, 18, -45, 1, 46, -40, -13, 10, 36, 31, -8, -42, -25, -15, 25, -10, -14, 5, -71, 22, 27, -18, -25, -13, -26, 29, 59, 10, 53, -6, 3, 21, 0, -30, 36, 26, -47, -43, 35, 35, 5, 11, -8, -30, -34, -11, -47, -40, -4, -5, -50, 6, 9, 6, -51, -15, 19, 4, -11, 6, 9, -66, 61, -5, -33, 26, 8, -23, 26, -9, 6, 10, 2, 40, 2, -28, -17, -34, -45, -43, 52, -23, -9, 15, 80, -52, 9, 31, 1, -18, -35, -17, 18, 4, -54, 31, 11, 26, 2, 5, -22, -17, -30, 21, 19, 19, 22, 30, 19, 8, 15, 12, -26, 46, -39, 13, 46, -5, 53, -17, -42, -62, -21, -22, 9, 27, 40, 24, -14, 7, 39, -17, 10, -60, -20, -26, 0, 0, -26, 18, -6, -12, -25, 42, -32, -31, -22, 58, -23, -49]
5644d9J01L5l1o3M9l5l5jPK8j3L9l7j0J5npOK1k4L6k8Ql9j0M3ql8P0k3JJ2oj0
5678aJ6l6L3J0lnm0opK8O1j7n7j9M0K1K7n2J1m6O2Mm6K1L1j9m5M9k0l8LN1k4M9
5712C6k9m0J2O1o0N4l8OJ6kl2N1m3K5J3k0O4j13K0L0j4ORj1k4j0L7N5n2J8J4m4
5744eJ3k1K0j9K8j7J4n0M6k0nK7M8%r5K7pk3jN5L4r7N8m6R7o0m4K9j8QrR5m4m
5778A4k7K9mj2L4JLo0P8o3pj0M9n4K3j9N4o6J6M2rk2o%l2N7M0J1o7KpNj7M1l7
5813b0%JK7NJ8j1l6J3N1n0QPl6O1j09R9n4LO9o6P3p6M0k3M7rp7n8J03%j0l7nK4
5847b8LN4m9KK6J2J3mk2m2P4m8pNm4O3m3K4j9qK7Mk3O7o7M4l8M0j1prJ5k4J7m9
5882e2Q0n6QL8k7OJK6o6N8o7L8Q7j1n3K7m3N9p0O9l6K5Om7N1k8m4K4j5J9Pk3L3
$$ y = [-49, 52, 87, 56, -7, 42, 7, -28, -29, -22, 6, -7, 32, -5, -15, 0, -5, -12, -6, 15, -9, 27, -1, 7, -32, -42, 1, -7, -45, 25, 2, 3, 15, 9, -1, 15, -21, 12, 22, 19, 14, -26, -32, -39, -11, 50, 33, -24, -43, -3, 18, 45, -7, 4, -42, 20, 24, -22, -1, 30, 11, -34, 15, -5, -43, -40, 11, -13, 36, 7, -33, -21, 40, -20, 34, -4, 2, 18, 16, -16, 35, -8, 17, 30, 10, 74, -39, -19, 11, -3, 3, 12, 1, -23, -33, 4, 59, 7, 25, 39, -5, 8, -13, 7, -12, 16, -1, 13, -37, 9, -11, -16, 11, 59, 59, -36, -9, -16, -39, -40, 15, 49, -48, 10, -36, 61, 1, -43, -14, -32, -24, -33, 62, 18, 14, -13, 16, 12, 0, 34, 35, 38, -22, 56, -7, -14, -24, 25, -29, -6, -25, 29, -37, -21, 21, 12, -10, -16, -16, -48, 9, 49, 60, -7, -5, -12, -7, -24, 17, -20, -20, -19, 8, 13, 31, 20, -16, -3, 48, -2, 6, 13, -23, 38, -71, 28, -26, -23, 46, -20, 53, -23, 17, -6, 41, 32, -45, -103, 0, 0, -10, -47, -52, -28, -25, 29, -20, -18, 8, 20, 33, 29, 7, -35, 39, -9, -16, -11, -55, 8, -35, -11, -30, -38, -11, -7, -30, 37, -30, 14, -24, 16, 5, -2, -11, 4, -20, -3, -52, 28, -28, -20, 18, -9, -3, -2, 24, -42, 16, -51, -13, 74, 63, 10, 37, -6, 53, -17, 52, 16, 41, 47, 0, 51, 23, -21, 3, -12, 7, 14, -9, 24]
5915B4m7J7k6klM3l4LM0qj1K4p1L4J7KJ6o4oN1M5Jl3mm6L9J4Kp0L8M8l2O4o2R
5950A2k1k8nM8nj2%J0pk2O9l8Nl0K5K8p8O7l4Ml6N2rK7L7k9j5o9lL2R0q7P2o0
5984a0jJ6K6jp8Q5Qm7J0K9l2QK8k7j4K5j3k1M7p4L2rjN8k1J8r0RL0j5Rj3O0j4
6018A7n0K2Rj9L4r6P5j0k1N3m5K5J2%n3KM5j7L4J7m8m4L0K4j4Rk5ML3l9J0N3m7
6051b0K5L9m7Ok4k4j5Q1P2n6q6M6L1n5P6q0O9n8K8J6l7Lo6N8RJ5K6m1K5q2M2J4
6083a0M9m3K3J2n6mN0j6ro2O2N2n7k1L5l2M9l5o6R6k9jN6j6l7Qj4K3J3K1n6L7
6115B2mk8rP2m7o1M3m0P6m8M7l3K5J0j7rMOJk9JjPl4N1K4l9k5O5k0j2Nm7K3PN8
6151D4o0Rk0N1n0K8n9N5OK3l5J4m9N3m2M1L1kn6M1o9P0m1L9J4l8J1o3P1rk3N7
$$ y = [24, -23, -6, -32, -34, -37, 6, -28, -25, 15, 7, -4, 20, -51, -17, 0, 2, 18, -46, -52, -1, 44, 45, 12, 8, -38, 1, 15, 17, -53, -15, 33, 1, 65, 3, 12, -9, -37, -42, 6, 1, -11, -11, -1, -8, -30, 39, 1, 6, -24, 1, 29, -49, 18, -16, -12, -48, 4, -5, 22, 59, 30, 15, -54, -57, -25, 65, -22, 50, -10, -11, 5, 31, 30, -48, 37, 45, -2, 8, 37, 5, 13, 41, 14, 0, 25, 12, -9, 38, -36, -4, -13, -14, 44, 23, 41, -49, -40, -10, -25, -16, -29, 31, 17, -33, -11, -2, -21, 13, -83, -8, -18, -39, 14, -31, -6, 6, 6, -47, -45, 0, -17, 17, 34, -14, -58, -28, -4, -18, -9, -34, -30, 3, -36, -26, 27, -20, 5, 44, -3, 3, -21, -45, -60, 21, 93, 37, -49, -3, 28, -27, 49, -31, 38, -20, 8, 24, -13, -10, -76, -18, -9, 6, 32, -9, 16, -66, -24, -10, 39, -4, 19, 31, -25, -29, 21, 5, -4, -66, -4, 48, -9, -30, 5, -27, 22, -13, -79, 17, -12, -13, 43, 27, -10, -2, -16, 7, 20, 41, -15, 22, 18, -10, -19, 53, 6, -55, -12, -52, 24, -24, 23, -10, 15, 25, 8, -1, 3, 9, 10, -19, -18, -19, -12, -46, 5, 29, -10, -35, 30, 10, -2, 3, -44, -21, -14, 44, -16, -7, -27, 24, -26, 2, -57, -2, 4, 27, -8, 6, -43, 10, -32, 9, 40, 38, -18, 23, -46, 24, -17, 22, 36, -2, 9, -54, 17, 8, -15, 42]
6183D2n9k8L0K9l1l2N0n3M1jJ3M1l9K2n1NmPJ1L9J8k3Ll4M8l5J2nj3%K8m4M8o8
6217c3Q0m0J2n8P4%L5p5K1k5Qk7l2mR3l2rKM1L3q4K9mqkN7p1Nl8Q2J6m4n6P1p
6252A0jljMj3K3n6L8j1N9p5QO6l1m3J8%qO6q4K2k0L6k2J02q3n2O4m0L7K6M3q4
6285eK3lo5P2l2K9k1K3l4K4J6o0k1K8P3o5L2K2o3oR6o9J3RNK2m2L7Lp4LK9m0L
6319c8M8k6L9Jq3N8OL0p3Q7ol1N9n6m0J1PpK3L6p0l6Q9n7J5j1K2N8l8j11J04q
6351Bk1Q4r8O1j9K3%k0j4lOJ2jL8p6J8j2jM1J6m3L3rj1M2p2j2O4n8KM9n9KN3m7
6386c0M3l3M1j5lo3N3OLK0o9Q7m6nk6O1k4n8O2j5L2j8oj7L3m8N3J9j0%rm7J2J3
6420dK3j4j9K7Nm4Q6p7k4K6M9n5O5m6m1L7K7j2j6Nl6P2j9p9L6l3Q8r5O0J7n5M0
$$ y = [42, -17, -45, -15, 14, -17, -49, 1, -52, -11, -12, 1, 42, 3, 25, -26, -21, -25, -18, -7, 32, 50, 27, 30, -4, 44, 9, 21, 16, 3, 3, 31, -13, 35, -33, 47, 7, 19, -39, 35, 35, 70, -5, 16, -9, -1, -28, -60, -64, 29, -3, -12, -10, 31, 64, -20, 9, 5, -3, -5, 52, -19, -14, -52, 30, 46, 2, -54, 17, 10, 9, 6, 5, 9, -4, 19, -37, 1, -10, 49, -26, -18, 48, 17, -26, -8, -8, -16, 50, -34, -12, -32, 4, -18, 84, 1, -51, 13, -27, 10, 36, 79, -5, 18, 15, -50, 22, -10, 19, -2, 21, -13, 11, 27, -33, -54, -26, 47, -18, 14, 36, -27, -33, 63, -6, 7, 16, 21, 43, 1, 38, 41, -33, -30, -1, -41, -38, 10, -16, 23, 24, -59, -1, 5, 35, -38, 49, 43, 12, 71, 15, -25, -14, -7, -14, 9, 45, -25, -61, 28, -29, -14, -25, -3, 55, 17, -94, 10, 2, -19, 65, -33, 28, 9, 32, 32, 12, -2, -5, 1, 13, 12, 50, -26, -8, -20, -21, 20, 36, -7, 26, 17, 6, 48, -24, -36, 28, -30, -28, 21, -38, -36, 17, -30, 13, -20, 21, 6, 3, -60, -7, -1, 2, 22, -47, 40, -6, -11, -37, 24, 0, -58, 4, -11, 21, 3, -3, -20, 13, -35, 18, 37, 27, 27, 18, -29, -17, -4, 19, 5, -14, 13, 18, -26, 60, -17, -41, -15, 34, -21, 44, -2, -43, -6, 21, 9, -7, -2, -38, 34, 15, -64, -28, -61, 27, -68, -8, 9, -46, -6]
6452fL2k0k9K4NJ0Oj0Nn2K4N4j4o0M0L0j1n4N1j1k1k6J3M1k1Mk1nM8Mr6Q6l1k7
6486c8K9K5K4q4M5j1QJ2J6j6K9k2rj5ooK9n2L4k8N8OL4r0k4N5LrN2n5l6M7klk5
6521b5K9j2k1M1l3M9Rm3l3K9L9m3j3J8K6k0j8kK6l9J5K2J1l4Q6n1n7N4m2N0k5
6552gl5O7l3j5J2K5K0m6l6J00n3%QqK4o4M9Kl8O4n5L0k2p0O8L7k3J8K2p5K9Rj5
6585a1K3m0K4n6O5L9j2k9JJ8l7j2L4KL1m1M7p2LO4j05L7LJ0k3N6mk6N7o3L1l6
6617b2OPK8j6k5K9Mj8J4Rk4Lj5rN1m3J5k9LN5o2Q7l7J8k0j8J5l1L4L3l0j5Mk8
6651b7J5k8K6NKl9N7j0J2k8LJ4j7%L7n5K2k7P9n8O1L4j02K5n5R4l8J9m3M8o7J4
6683b7N5l7%k7P9k4k0pj2j5M7j9K6jk0M2j2l5j1M2k7k3O1m0k4L1k2N0Qm5k7P1
$$ y = [-6, 26, 6, -23, 1, 6, 16, 22, 12, 17, -35, -11, 43, 29, -31, 9, 39, 28, -26, 25, 14, -7, -33, -20, 21, 0, 4, -17, -22, 26, 30, -66, 20, -11, -38, -9, 16, 40, -44, 1, -10, -2, 10, 26, 10, 39, 17, 8, -7, -13, -19, 10, -42, -8, -36, 22, 28, 62, -28, -52, 3, 6, -3, 49, -6, -42, 5, 3, 0, -25, 4, -8, -29, 12, -21, 28, 37, -6, -39, -10, 29, -14, -27, -9, 17, -3, -21, -23, 3, -36, -21, 1, 12, -22, 64, 13, -44, 10, -32, 18, -7, -42, 25, -8, -23, -11, 14, 34, -12, -48, 52, -1, -1, 7, -1, 23, -41, 8, 10, -28, 36, -19, 11, -11, -81, -13, 24, 1, 19, 41, -34, -5, 4, -11, 12, -28, -4, -60, 5, 44, 32, 3, 4, 22, -15, -27, 7, 9, 40, -1, 46, -26, -23, 41, -64, -27, -24, -14, -37, 19, 15, -11, 46, -17, 14, -22, -16, -9, 19, 3, -22, 7, 11, -7, 7, 16, -8, -5, -20, -29, 22, -21, -6, -35, -32, 23, -39, 48, 11, 29, 9, -9, 6, -25, 9, 42, 12, -3, 1, -27, -12, -40, -14, -9, -7, -46, 11, 1, 13, -15, -12, 2, -15, -15, 22, -33, -11, -38, 41, -17, 44, 78, -24, 1, -54, 40, 2, 21, -22, 26, -41, -27, 28, -9, -9, -36, 43, 19, -1, -8, -20, -35, 12, -7, 19, 18, -2, 40, 28, -7, -18, 24, -3, -26, 35, -5, -29, 2, -20, 30, 38, -7, -34, 37]
6715C7Po8k0OK3L7Jo9O8k6L1q6rQ7J6Ol8Qk1N5p0ol7Q9j9L8k0l3J2K6o8QM2J2
6749A9k7O3Jm0k4pj0L0K4lmOn5j5N8o0M3k9Q1m0L9k5pK0m9l1M8oj2Ro9R0jn2N4
6784A9lM8p5k0k2J12n4Rn6N2j6M6o2L4l1%P1qq8J3J36j35L1P5n1j0j6O2k0l5Q
6815A4k3J6j8knqrJ9J2K3l3J2m2K5O4k9mj2O8j09P8k2J3K2k8K1m1PNqj7K6j9K2
6849A8qJ3j0n3M1l4L8Qrj0k0P0o5K3lM3p8O4J1k7m5N0l1K6nRj6K6m9l6O9j9N3
6882D4k2K2o1Lj2L2Pl9P5j4k2QqL4p6l7Q9j3k2P1n9jJ7Pk0j5Pl5K3l4J8Q8q8K9
6916dl1K8j5QN0k4Ll9M0l4pK9j3Rm2L6l2L8LJ0l9oN3pl2LN7n2k7M2K7j7q7J10
6950C8lk9q0L2L8jLL4k8o1L0L1L1k6Kl8L0k2j1J7koOP2p7k8K2M8KJl4NJ7rM2q7
$$ y = [37, 44, -24, -44, -38, -15, 22, 23, -46, 22, -4, 27, -59, -68, 19, 35, 41, 3, 11, -10, 45, -25, -31, -68, 21, 2, 40, 20, -13, -1, 25, -43, -35, 7, 19, -8, 55, 56, 16, -8, -15, -25, 5, 29, 26, 22, 28, -27, -42, 16, -44, -1, -30, 51, 11, 50, 25, 18, 38, -11, -42, 6, 0, -12, -3, -72, 18, 17, -35, 19, 16, 64, -11, -31, -53, 59, 5, 14, -42, 10, -6, 40, -22, 12, -19, -19, 52, 44, -44, -31, 105, -30, 1, 76, 25, 15, -1, 61, 41, 6, 14, -9, 7, -11, -13, -18, -26, -35, -16, -4, 19, -14, -2, -44, -19, 45, 16, 12, 0, 68, -41, 37, 15, 28, 50, 22, 43, 2, 9, 14, 6, -11, 15, -4, 18, 10, 23, 13, -40, 1, -33, 5, 13, 4, -6, -26, 44, -21, 2, -1, 42, -36, 28, 39, 12, -33, 17, -14, 12, 7, 16, 0, 26, -23, -59, 10, -9, 44, 22, 44, -17, -14, -26, 6, 13, -26, 49, 35, 13, 21, 13, 47, -29, -66, 23, 10, -12, 59, 0, -1, 16, 23, 3, -12, -5, -40, -17, -51, -33, 55, -33, -4, -35, -7, -22, -14, 36, 12, 15, -24, 16, -18, -25, 4, -9, 0, -42, -6, -38, 0, 3, 13, -26, -32, 21, 14, -18, -15, 42, -10, -37, 5, 32, 15, -72, 38, 35, 6, -74, -42, -4, -5, -2, 32, 4, -57, -27, 4, 35, 9, 11, -27, 3, -19, -30, -13, -15, -21, -15, 57, -20, -48, -26, 22, 24, 25, -9, -4, 13, 4, 46, -41]
6986d1K6JK9l2J5Nj2P9n3o0M4L1m6k7L4pJ1L6j3j9M4n7nJ4M1p9M9o7Q7m0l8M7
7018cL2o0K3k0M6k8j2rM1JL3q1N6k7J3J5m4P7l5j8J9n1kj9O4Rl7N1q5L8Mj3JP
7052a4K0pJ5j7qRk0J4L0j5K0l8M9Pn5L9o5n8J26n7M1Jm7M7%l5m0K8M4j5Kl7J0
7085b6M0Nq5P5N0n7l3N9l3J1o1K4O0j5J2q3N8m9Q0m7n3O4L8m3J2M0j7n2L4Onn
7117DJ5j0oM0r7N3p6N6%Jrm5O3K7K4l6m6Q6m8qpK6k0m3J4L8L3o1K7j5J5L5j0J1
7151C1no2j5K6P4l9L1Nm3J8J6l4k1nJ5M7n7J7m5K0L2M0o7Q8m1pm3Q0n7K2k9K2
7183A4j3Nj2K2k7RK2n9Q4k1rpjJ7k5j4N0l3k1jMM6m0m6M8kj6L4kJ2om8L0N8l3
7218A9l7K8rOn9L5nJ8M0l1qM9o9K5qPmJ0M1l0k7J2Qn1P6LJKm3l4O5m0J3j6j1L8
$$ y = [-41, -15, -14, 15, -17, -2, 3, -9, 70, 17, -43, 1, 32, -14, -41, -7, -14, -3, 33, 20, 1, 45, -12, -17, -3, 38, -41, 8, -59, 28, -12, -50, -3, 29, -31, -8, -28, 18, -10, -22, -31, 10, 11, 44, -37, 19, -8, 5, 20, -24, 53, 18, 0, 19, -32, -34, -53, 11, 20, -17, 34, -51, -13, -9, -22, -21, -14, 6, -1, 14, -3, -11, -2, -22, -8, 22, 7, 27, -11, 38, 45, -10, 29, -36, -94, 32, -25, 16, 17, -30, 17, 17, -18, -58, -30, 14, -1, 1, -36, -26, 14, 19, -66, 9, 59, 2, -31, 28, -5, 6, -55, -31, 29, 14, 26, -57, 1, -48, 32, -15, -68, -4, 34, -9, 3, 43, 26, -26, 8, 14, 9, 4, 19, 9, 3, 43, -54, -1, -77, -21, -21, -20, -29, -74, -11, 16, 40, 4, -42, 44, -4, -12, -19, 7, -13, -56, -42, -4, 29, -32, -5, -20, -5, 30, 20, 31, 26, -36, -51, -25, 49, 10, 41, 46, 3, 21, 37, 3, -18, -23, -8, 39, -18, -1, -46, -26, 6, 46, -21, 67, 26, 19, -24, 56, -1, 21, -8, 14, 1, 6, -6, 16, -11, -2, 20, -39, 45, 24, 15, 8, 7, 24, -1, -15, 35, 2, -19, -20, -16, 30, -10, -56, -8, -10, -26, 8, 6, 18, 12, -36, -6, 52, 19, -18, 10, 1, 7, -52, -17, -22, -4, 36, 5, -3, 46, -23, 2, -6, 1, -3, 7, 48, 18, -9, 3, 11, -40, 36, 39, 40, 42, -1, -35, 30, -10, 3, -13, -24, 14]
7254A4m3qN7L4n8n5P2n2N8Mm7M1Jk1l5J06p8k3M2J6Nok5k2l4P0K3Oq5P1n3NO7
7287D7j14N0K5j0Rm4K3L9o0M6m5L7l7L2k3M9Lp5L2M4k9Mj4N0m3K0J3qLm9RN3k8
7320In3O3Po6K9j2L3n1K3J8j2K4%k8qQJ8J6j1mrMl4kO0j6M1k8n4KO8l8N4j1n2
7355a2J8M2l7k2K0k2J0K7Qk8lJ8n3N8k1K3m1n2N2K0m0L1j4J8K1Mj4n9O0m4P4p7
7387c5Q6n5l2K3L6L9m3k1kk4O0rk9MK2L8n0J8Lk0mojj0RpJ9k5PM2r2O8NM4n3N6
7423F1p9J7k4L9k2N7j37Q6Jm2K2PK8pm2L6k2n7M8P0o2oN5j3l9J9m2N1l8N4nj6
7455bk9K0j8O1j3k4NL6o4M0j0J8k1NL1j2l7P3r5O5k8p6O8j1L7kPl1k1Q2p0L5j9
7488@j6L4j2J0j6K7j5l8M9n3O0k0k6j1J3K4m9RN0J3l7N6k1k2K5j4J4k5Lo7R9k6
$$ y = [14, -29, -37, 20, 54, -4, -59, 13, -39, 19, 23, -24, 17, 18, -3, -38, 68, -10, -33, 9, 25, 30, 24, -1, -23, -57, 13, 36, 42, -43, 28, -25, -20, 47, -67, -17, 8, -2, 7, -37, -14, 25, -35, 11, -34, 3, -34, -2, -25, 24, 27, -48, -16, 28, -1, 3, -11, 39, -4, 16, 29, 21, 24, -25, -16, 37, 9, -44, 19, 26, -40, -11, -23, 10, -41, -18, 0, -12, 12, 12, -16, -24, -16, 2, 18, 7, 3, -6, -2, -36, -38, 22, 6, 47, 19, -35, -33, 35, -3, 51, 40, -12, 6, 48, 11, -11, 9, -13, -3, 24, 32, 4, 1, 19, -34, 24, 3, 26, -15, -67, -15, 5, -35, -4, -18, 0, 21, 25, 11, -48, 12, -32, 42, -35, 51, -4, -36, -13, 23, 62, 19, -2, -4, -28, 32, 23, -6, -2, 20, 58, 8, 26, 29, 9, 5, -1, -2, -12, -3, -10, 9, -16, -9, 33, -59, 9, 14, 58, 5, 61, -18, -1, -25, 14, -8, 49, -88, -2, -1, -43, -21, -14, 14, 7, -35, 1, -21, -78, -30, 40, -22, -28, 27, 14, -25, -6, -48, 3, -35, 19, 14, -2, -31, -11, -29, 32, 19, -5, 0, 36, -28, 12, 2, 20, -1, 4, 35, 23, -14, 59, -36, 29, 1, -75, -7, -18, 19, 17, 24, -7, -28, 54, -16, 19, 0, -16, 18, 6, 16, 0, 27, 12, -26, 23, -30, 30, 10, -16, -27, -14, 10, -39, -30, 20, 33, -4, 52, 31, 9, 34, 20, 34, 9, 12, -55, 44, 18]
7520A8o5R2l0j5NmklLj3K5L1K0k8l8j7pM3Mpj8L2n6K9ml9N7L2r5M8k6LL2Pj3%
7556AJ1m2K9rO2lp5l0M3K3r0O2M1o9N8okj1J2M3m5p2Q6J0n2J6j4NM2Qm0L6JJ2
7590D1m3j5M3j9K3l2qL3lk5k8K4q6J15Lk8O2o3J1J2j0Rjm6mK9K4k0rM9k2j9Oj1
7624hK2%J6p9J25p0nn1P2n6M8nkj4m0J4R3l1p3P0l1L3k6L5m1J0j9K1K8m0k4JN5
$$ y = [18, -47, 45, 15, 0, 5, 1, -1, -4, -1, -14, 11, 42, 62, 34, -4, -21, -28, 15, 19, 12, -6, 26, -30, -1, -5, -44, 13, 45, -50, -2, -28, -25, 7, 14, 1, 1, 12, -30, -1, -10, 52, 49, -26, -56, -13, 10, -80, -18, 23, -46, 12, 6, 4, -7, 5, 48, 3, -69, 17, 27, -25, -9, -23, -18, 24, 32, -8, 28, 29, 41, -2, -17, 26, 7, 30, -2, -10, 23, 20, -5, -33, -9, -95, 20, 23, -5, 57, -6, 5, 17, 7, 16, 15, -31, -35, -6, 18, -2, -11, 38, 16, -3, 3, -8, 14, 14, 30, -49, 76, 6, 1, -50, 22, -34, 14, 9, 7, -7, -47, -33, 60, 29, -44, 26, -5, 28, 2, 37, -4, 6, -13, 8, 36, -4, -28, -27, 28]
$$ [...]
8190a3%
8191a3
##END NTUPLES=NMR FID
##END=
