##TITLE=1H_Pr 63-AcCN
 CDCl3
 8 sc, 
 15.12.2021
##JCAMPDX= 6.0         $$ Bruker NMR JCAMP-DX V2.0
##DATA TYPE= NMR FID
##DATA CLASS= NTUPLES
##ORIGIN= UXNMR, Bruker Analytische Messtechnik GmbH
##OWNER= root
$$ XWIN-NMR		Version 3.5
$$ Wed Dec 15 11:42:49 2021 Russian Standard Time (UT+4h)  she@DPX200
##.OBSERVE FREQUENCY= 200.131346
##.OBSERVE NUCLEUS= ^1H
##.DELAY= (6, 6)
##.ACQUISITION MODE= SIMULTANEOUS
##.ACQUISITION SCHEME= undefined
##.AVERAGES= 8
##.DIGITISER RES= 18
##SPECTROMETER/DATA SYSTEM= spect
##.PULSE SEQUENCE= zg30
##.SOLVENT NAME= CDCl3
##.SHIFT REFERENCE= (INTERNAL, CDCl3, 0, 15.7039)
##AUDIT TRAIL= $$ (NUMBER, WHEN, WHO, WHERE, WHAT)
$$ ##TITLE= Audit trail, XWIN-NMR		Version 3.5
$$ ##JCAMPDX= 5.01
$$ ##ORIGIN= Bruker BioSpin GmbH
$$ ##OWNER= she
$$ F:/spectra/data/she/nmr/H-F/1/audita.txt
$$ ##AUDIT TRAIL=  $$ (NUMBER, WHEN, WHO, WHERE, WHAT)
(   1,<2021-12-15 11:41:31.00 +0400>,<she>,<DPX200>,
      <created by zg, POWCHK disabled, PULCHK disabled
       configuration hash MD5:
       00 E9 B6 7A A2 85 ED C7 34 08 36 98 17 FE 4E 26
       data hash MD5: 16K
       8C 98 AE 52 2D CF 51 17 FA 38 68 98 AA C5 08 DA>)
$$ ##END=
$$ 
$$ hash MD5
$$ 89 63 4A A7 9B 11 A3 98 08 FE 8A F2 FB 9E 90 27
##$RELAX= 
##$RELAX= 
##$RELAX= 
##$RELAX= 
##$RELAX= 
##$RELAX= 
$$ Bruker specific parameters
$$ --------------------------
##$DU= <F:/spectra>
##$EXPNO= 1
##$NAME= <H-F>
##$PROCNO= 1
##$TYPE= <nmr>
##$USER= <she>
##$AMP= (0..31)
100 100 100 100 100 100 100 100 100 100 100 100 100 100 100 100 100 100 
100 100 100 100 100 100 100 100 100 100 100 100 100 100 
##$AQSEQ= 0
##$AQ_mod= 1
##$AUNM= <au_zg>
##$AUTOPOS= <>
##$BF1= 200.13
##$BF2= 200.13
##$BF3= 200.13
##$BF4= 200.13
##$BF5= 200.13
##$BF6= 200.13
##$BF7= 200.13
##$BF8= 200.13
##$BYTORDA= 1
##$CFDGTYP= 0
##$CFRGTYP= 5
##$CHEMSTR= <none>
##$CNST= (0..31)
1 1 145 1 1 1 1 1 1 1 1 1 1 1 1 1 1 1 1 1 1 1 1 1 1 1 1 1 1 1 1 1 
##$CPDPRG= <>
##$CPDPRG1= <>
##$CPDPRG2= <>
##$CPDPRG3= <>
##$CPDPRG4= <mlev>
##$CPDPRG5= <mlev>
##$CPDPRG6= <mlev>
##$CPDPRG7= <mlev>
##$CPDPRG8= <mlev>
##$CPDPRGB= <>
##$CPDPRGT= <>
##$D= (0..31)
0 1.2 0 0 0 0 0 0 0 0.06 0 0.03 0 0 0 0 0.0002 0 0 0 0 0 0 0 0 0 0 0 0 
0 0 0 
##$DATE= 1639554090
##$DBL= (0..7)
120 120 120 120 120 120 120 120 
##$DBP= (0..7)
150 150 150 150 150 150 150 150 
##$DBP07= 0
##$DBPNAM0= <>
##$DBPNAM1= <>
##$DBPNAM2= <>
##$DBPNAM3= <>
##$DBPNAM4= <>
##$DBPNAM5= <>
##$DBPNAM6= <>
##$DBPNAM7= <>
##$DBPOAL= (0..7)
0.5 0.5 0.5 0.5 0.5 0.5 0.5 0.5 
##$DBPOFFS= (0..7)
0 0 0 0 0 0 0 0 
##$DE= 6
##$DECBNUC= <off>
##$DECIM= 32
##$DECNUC= <off>
##$DECSTAT= 4
##$DIGMOD= 1
##$DIGTYP= 9
##$DL= (0..7)
0 120 120 120 120 120 120 120 
##$DP= (0..7)
150 150 150 150 150 150 150 150 
##$DP07= 0
##$DPNAME0= <>
##$DPNAME1= <>
##$DPNAME2= <>
##$DPNAME3= <>
##$DPNAME4= <>
##$DPNAME5= <>
##$DPNAME6= <>
##$DPNAME7= <>
##$DPOAL= (0..7)
0.5 0.5 0.5 0.5 0.5 0.5 0.5 0.5 
##$DPOFFS= (0..7)
0 0 0 0 0 0 0 0 
##$DQDMODE= 0
##$DR= 18
##$DS= 0
##$DSLIST= <SSSSSSSSSSSSSSS>
$$ [...]
##$SUBNAM2= <"">
##$SUBNAM3= <"">
##$SUBNAM4= <"">
##$SUBNAM5= <"">
##$SUBNAM6= <"">
##$SUBNAM7= <"">
##$SUBNAM8= <"">
##$SUBNAM9= <"">
##$SW= 18.0517287032376
##$SWIBOX= (0..15)
0 0 2 0 0 0 0 0 0 0 0 0 0 0 0 0 
##$SW_h= 3612.71676300578
##$TD= 16384
##$TD0= 1
##$TE= 0
##$TE2= 300
##$TE3= 300
##$TEG= 300
##$TL= (0..7)
0 120 120 120 120 120 120 120 
##$TP= (0..7)
150 150 150 150 150 150 150 150 
##$TP07= 0
##$TPNAME0= <>
##$TPNAME1= <>
##$TPNAME2= <>
##$TPNAME3= <>
##$TPNAME4= <>
##$TPNAME5= <>
##$TPNAME6= <>
##$TPNAME7= <>
##$TPOAL= (0..7)
0.5 0.5 0.5 0.5 0.5 0.5 0.5 0.5 
##$TPOFFS= (0..7)
0 0 0 0 0 0 0 0 
##$TUNHIN= 0
##$TUNHOUT= 0
##$TUNXOUT= 0
##$USERA1= <user>
##$USERA2= <user>
##$USERA3= <user>
##$USERA4= <user>
##$USERA5= <user>
##$V9= 5
##$VALIST= <valist>
##$VCLIST= <CCCCCCCCCCCCCCC>
##$VD= 0
##$VDLIST= <DDDDDDDDDDDDDDD>
##$VPLIST= <PPPPPPPPPPPPPPP>
##$VTLIST= <TTTTTTTTTTTTTTT>
##$WBST= 1024
##$WBSW= 4
##$XGAIN= (0..3)
0 0 0 0 
##$XL= 0
##$YL= 0
##$YMAX_a= 291110
##$YMIN_a= -370563
##$ZGOPTNS= <>
##$ZL1= 120
##$ZL2= 120
##$ZL3= 120
##$ZL4= 120
##$ABSF1= 10
##$ABSF2= 0
##$ABSG= 5
##$ABSL= 3
##$ALPHA= 0
##$AQORDER= 0
##$ASSFAC= 0
##$ASSFACI= 0
##$ASSFACX= 0
##$ASSWID= 0
##$AUNMP= <proc_1d>
##$AZFE= 0.1
##$AZFW= 0.1
##$BCFW= 1
##$BC_mod= 2
##$BYTORDP= 1
##$COROFFS= 0
##$CY= 11.3945322036743
##$DATMOD= 1
##$DC= 2
##$DFILT= <>
##$DTYPP= 0
##$F1P= 2.36226072786647
##$F2P= -0.459571619588291
##$FCOR= 0.5
##$FTSIZE= 0
##$FT_mod= 4
##$GAMMA= 1
##$GB= 0.15
##$INTBC= 1
##$INTSCL= 1
##$ISEN= 128
##$LB= 0.24
##$LEV0= 0
##$LPBIN= 0
##$MAXI= 10000
##$MC2= 0
##$MEAN= 0
##$ME_mod= 0
##$MI= 1.114404
##$NCOEF= 0
##$NC_proc= 0
##$NLEV= 6
##$NOISF1= 3.799351
##$NOISF2= 2.8
##$NSP= 1
##$NTH_PI= 0
##$NZP= 0
##$OFFSET= 15.70392
##$PC= 1
##$PHC0= -15873.4
##$PHC1= 14.40079
##$PH_mod= 1
##$PKNL= yes
##$PPARMOD= 0
##$PSCAL= 0
##$PSIGN= 0
##$REVERSE= no
##$SF= 200.130013532006
##$SI= 16384
##$SIGF1= 3
##$SIGF2= 2
##$SINO= 400
##$SIOLD= 16384
##$SREGLST= <1H.CDCl3>
##$SSB= 0
##$STSI= 0
##$STSR= 0
##$SW_p= 3612.71676300578
##$SYMM= 0
##$S_DEV= 0
##$TDeff= 0
##$TDoff= 0
##$TI= <>
##$TILT= no
##$TM1= 0
##$TM2= 0
##$TOPLEV= 0
##$USERP1= <user>
##$USERP2= <user>
##$USERP3= <user>
##$USERP4= <user>
##$USERP5= <user>
##$WDW= 1
##$XDIM= 8192
##$YMAX_p= 0
##$YMIN_p= 0
$$ End of Bruker specific parameters
$$ ---------------------------------
##NTUPLES= NMR FID
##VAR_NAME=  TIME,          FID/REAL,        FID/IMAG
##SYMBOL=    X,             R,               I
##VAR_TYPE=  INDEPENDENT,   DEPENDENT,       DEPENDENT
##VAR_FORM=  AFFN,          ASDF,            ASDF
##VAR_DIM=   8192,          8192,            8192
##UNITS=     SECONDS,       ARBITRARY UNITS, ARBITRARY UNITS
##FACTOR=    0.0002768,     1,               1
##FIRST=     0,             0,               0
##LAST=      2.2672688,     0,               0
##MIN=       0,             -370563,         0
##MAX=       2.2672688,     291110,          0
$$ Real data points
##PAGE= N=1
##DATA TABLE= (X++(R..R)), XYDATA
$$ plain form
0 0 0 0 0 0 0 0 0 0 0 0 -8 8 -8 8 -16 16 -16 24 -32 32 -40 48 -56 72 -80 96 -112 128 -150 169 -193 223 -253
33 -253 286 -323 365 -408 457 -512 573 -638 708 -784 869 -961 1063 -1173 1293 -1426 1569
50 1569 -1729 1905 -2100 2316 -2559 2834 -3143 3501 -3914 4401 -4985 5697 -6592 7757 -9335
65 -9335 11611 -15191 21676 -37127 154155 -23675 -357361 32740 242884 12434 -209503
76 -209503 -46905 74740 47658 29414 13973 -84753 -10982 148612 70049 -183910 -144232
87 -144232 125252 135165 -110046 -128105 56431 116000 26930 -27535 -38506 -30194 33649 65315
99 65315 -61655 -123323 34022 127046 -5339 -84751 25881 88671 -4965 -41520 2948
110 2948 -27220 -40867 39877 34250 -68180 -41176 97133 73215 -78440 -49617 77461 12944
$$ packed form
0@%%%%%%%%%%qJ6j6J6k4L2l2M0n6O4p2Q8j04J28j52J76k08K40k78L19l62M16m76
33b53N39o09O88p73Q65r69J085j211J346j492J653j830K024k236K466k719K995
50A569l298L634m005M416m875N393n977O644p415Q315r386J0682j2289J4349j7092
65i335K0946k6802L6867n8803J91282j77830l33686L90101K10144k30450k21937
76b09503J62598J21645k7082j8244j5441r8726P3771J59594p8563k53959L9678
87a44232K69484R913k45211j8059J84536N9569q9070n4465j0971Q312O3843L1666
99F5315j26970o1668J57345R3024j32385p9412J10632O2790r3636l6555M4468
110B948l0168j3647Q0744n627j02430K7004J38309k3918j51655K8823J27078o4517
$$ plain form
122 12944 -94749 -12388 70452 -32370 -85338 67424 114614 -60151 -91016 80789 91632
133 91632 -77255 -96747 44408 57899 -44190 -29089 38342 14953 -505 33085 7664
144 7664 -51092 -18154 48328 -3492 -74715 -10125 58235 11418 -27923 11235 30777 -10693
156 -10693 -15247 18289 -13459 -47442 7492 38710 -13313 -27711 31248 43257 -15846 -17386
168 -17386 26166 -3973 -39637 2839 22921 -22394 -28027 32787 40024 -22474 -18232 32524 5536
181 5536 -37202 -6260 18868 -23526 -36487 32781 47557 -32572 -35701 49109 48319 -37374 -52603
194 -52603 18470 35307 -19473 -28614 5156 16433 20667 15936 -12896 -21489 14645 32738 -21138
207 -21138 -56148 2611 44161 179 -33095 -414 32599 12897 -12849 -6734 -8290 -10646 10330
$$ packed form
122A2944j07693Q2361Q2840j02822n2968J52762M7190j74765l0865J71805J0843
133I1632j68887j9492J41155J3491j02089J5101O7431k3389j5458L3590k5421
144G664n8756L2938O6482n1820p1223O4590O8360m6817l9341L9158J9542m1470
156a0693m554L3536l1748l3983N4934L1218n2023j4398N8959J2009n9103j540
168a7386M3552l0139l5664M2476K0082m5315n633O0814P237o2498M242N0756k6988
181E536m2738L0942K5128m2394j2961O9268J4776q0129l129Q4810p90q5693j5229
194e2603P1073J6837n4780r141L3770J1277M234m731k8832q593L6134J8093n3876
207b1138l5010N8759M1550m3982l3274L2681L3013j9702k5746O115j556k356K0976
$$ plain form
220 10330 4902 -25498 -14064 31467 32138 -17403 -21828 23965 21464 -17049 -20082 -2108 2660
233 2660 956 5610 920 -10125 11226 29352 -6111 -31101 -745 21385 -7331 -32988 -2474
246 -2474 25567 1525 -11748 8668 12437 -2625 -5229 3120 -4249 -15715 2023 11686 -6719
259 -6719 -4316 15023 12382 -3368 -3186 7432 -2682 -15017 447 4890 -11353 -5926 13348
272 13348 11817 -7725 -6901 13935 5906 -17911 -10079 4972 -76 -7776 -1189 8759 3292 1735
286 1735 10586 741 -9577 1963 5763 -7337 -12494 3016 13021 -1316 -4646 9776 7146
299 7146 -2969 -2464 -1614 -5414 -8219 145 3601 -7919 -2616 12654 6928 -5822 -4602 5696
313 5696 3351 -10358 -6845 2810 -583 1206 4923 1476 1693 6381 7237 -4229 -10524 3328 5107
$$ packed form
220A0330n428l0400J1434M5531O71m9541m425M5793k501l8513l033J7974M768
233B660j704M654m690j1045K1351J8126l5463k4990L0356K2130k8716k5657L0514
246b474K8041k4042j3273K0416L769j5062k604Q349p369j1466J7738R663j8405
259f719K403J9339k641j5750J82J0618j0114j2335J5464M443j6243N427J9274
272A3348j531j9542Q24K0836q029k3817P832J5051n048p700O587R948n467j557
286A735Q851r845j0318J1540L800j3100n157J5510J0005j4337l330J4422k630
299G146j0115N05Q50l800k805Q364L456j1520N303J5270n726j2750J220J0298
313E696k345j3709L513R655l393J789L717l447K17M688Q56j1466o295J3852J779
$$ plain form
328 5107 -9134 -7221 4978 7950 145 -3060 4651 3264 -4755 -2690 -2697 -5703 -2855 391 1846
343 1846 -1476 548 8941 3085 -4734 497 2358 -2270 -5472 -1559 3951 -305 -222 6809 3072 -277
359 -277 1970 913 -2369 -5540 -2221 1517 -3918 -2772 4015 3114 509 -631 1011 1398 -4199 -3323
375 -3323 5 -3794 -1359 3224 2276 1016 1410 5789 3687 -4506 -1886 1740 -1464 -1971 -1727 442
391 442 3236 2226 2666 254 -2285 1508 74 -3995 -4713 -4144 1586 3328 -1529 -1768 1315 5478
407 5478 4785 -5409 -6882 1990 5204 -713 -8190 -1748 10341 6138 -2438 -2529 1424 5450 1281
422 1281 -5850 -6146 -2147 5525 4629 -6451 -5483 5433 9413 623 -11640 -5468 7916 3768 -7279
437 -7279 -8542 1621 9999 2992 -3815 -1702 1767 5827 2745 -6057 -6510 502 7157 4145 -6672
$$ packed form
328E107j4241J913J2199K972p805l205P711j387q019K065pl006K848L246J455
343A846l322K024Q393n856p819N231J861m628l202L913N510m256Q3P031l737l349
359b77K247j057l282l171L319L738n435J146O787r01k605j140J642L87n597Q76
375c323L328l799K435M583r48j260L94M379k102q193K620L626l204n07K44K169
391D42K794j010M40k412k539L793j434m069p18N69N730J742m857k39L083M163
407E478o93j0194j473Q872L214n917p477O442J2089m203q576r1L953M026m169
422A281p131k96L999P672q96j1080R68J0916L980q790j2263O172J3384m148j1047
437g279j263J0163Q378p007o807K113L469M060l082q802m53P012O655l012j0817
$$ plain form
452 -6672 -4583 7202 9173 -483 -10673 -4312 7671 2307 -7494 -6452 1076 5958 1156 -1822
466 -1822 60 -2026 364 4961 -60 -8151 -6938 7149 12076 -5254 -11593 5283 14625 2689
480 2689 -11360 -5589 7482 4016 -3219 -3997 -3651 1458 7517 4717 -5729 -10713 3700 14339
494 14339 -2652 -18406 -6664 14270 11631 -11692 -13640 8234 14525 1093 -10366 -6472 5458
507 5458 6926 794 -5271 -7591 3002 13761 5101 -10958 -10929 9493 16726 -7097 -20497 -1171
521 -1171 17035 6522 -14709 -9760 10950 9748 -4208 -6979 -1740 1491 898 2115 50 -8599
535 -8599 -2187 13587 8254 -10570 -10702 9596 15212 -7092 -15283 2549 11012 1428 -6141 -1754
549 -1754 3117 339 1975 3729 -6463 -9156 3759 10486 -2440 -15152 -2538 15886 6508 -10817
$$ packed form
452f672K089J1785J971r656j0190O361J1983n364r801J042P528M882m802k978
466a822J882k086K390M597n021q091J213J4087M927j7330o339J6876R342j1936
480B689j4049N771J3071l466p235p78L46N109O059k800j0446m984J4413J0639
494A4339j6991j5754J1742K0934k639k3323j948K1874O291j3432j1459L894J1930
507E458J468o132o065k320J0593J0759q660j6059K9K0422P233k3823j3400J9326
521a171J8206j0513k1231M949K0710j202j3956k771N239L231n93J217k065q649
535h599O412J5774n333j8824j32K0298N616k2304q191J7832Q463r584p569M387
549a754M871k778J636J754j0192k693J2915O727j2926j2712J2614J8424r378j7325
$$ plain form
563 -10817 -8640 5807 10553 -1816 -9376 -2828 3595 6412 3318 -4921 -5666 2765 11222 4561 -12964
578 -12964 -10413 10419 13133 -6341 -17446 -11 18004 4868 -14106 -8323 7724 9726 -4125
591 -4125 -10381 -1793 4214 4301 1460 -4607 -4432 3983 9551 1696 -11828 -5343 11577 7834 -8132
606 -8132 -9706 4480 11665 -400 -8277 -1008 4277 2435 -2128 -4282 -2081 -69 2743 2634 -4217
621 -4217 -3947 3348 4711 -738 -5911 -1913 4759 1567 -2354 -1716 514 3260 2046 -286 -80 -1420
637 -1420 178 3246 587 -3459 -3609 2391 6343 -1942 -6825 411 5981 2299 -5932 -5677 3019 3782
653 3782 -2086 -3614 -1182 3004 2675 -622 -1330 -1985 1120 4566 -546 -4678 -1306 4200 4546 -2814
669 -2814 -4409 2608 4590 189 -4184 -2893 2532 2067 -1997 -2564 -1332 1879 2825 -1562 -2949 -745
$$ packed form
563a0817K177J4447M746j2369p560O548O423K817l094q239p45Q431Q457o661j7525
578a2964K551K0832K714j9474j1105J7435J8015j3136j8974N783J6047K002j3851
591d125o256Q588O007Q7k841o067J75Q415N568p855j3524O485J6920l743j5966
606h132j574J4186P185j2065p877P269N285j842m563k154K201K012K812j09o851
621d217K70P295J363n449n173L998O672l192l921O38K230K746j214k332K06j340
637a420J598L068k659m046j50O000L952q285m883P236N570l682q231K55Q696P63
653C782n868j528K432M186l29l297p08o55L105L446n112m132L372N506L46p360
669b814j595P017J982m401m373J291N425m65m064n67J232L211R46m387j387K204
$$ plain form
685 -745 2299 1893 -3601 -2721 2457 1942 -242 -1197 129 2680 794 -781 -34 -559 803 204 -830
702 -830 509 -204 140 1167 -137 -309 -431 -808 471 -826 -1884 -222 181 634 -21 -1320 1029
719 1029 719 -406 44 -896 288 727 -295 373 181 548 1593 21 -35 660 -420 186 -445 -1118
737 -1118 310 -263 -68 336 -848 92 297 -509 -498 -1512 -32 1104 -1433 -1171 905 1357 428 -1277
755 -1277 409 2046 -197 -824 34 368 1099 -13 -344 715 304 966 -113 -1634 320 540 -871
772 -871 -1010 -1022 860 413 -1746 160 750 -344 13 -547 -14 304 -417 517 75 -184 1413 458 223
791 223 420 18 911 184 -1016 232 85 108 182 -1157 387 419 -483 -31 -1043 -435 434 -1081 -575
810 -575 -13 -93 737 -462 -170 1035 83 179 137 -356 1013 495 -44 582 176 968 459 -432 442 -40
$$ packed form
685g45L044m06n494Q80N178n15k184r55J326K551j886j575P47n25J362n99j034
702h30J339p13L44J027j304j72j22l77J279j297j058J662M03M53o55j299K349
719A029l10j125M50r40J184M39j022O68j92L67J045j572n6O95j080O06o31o73
737a118J428n73J95M04j184R40K05q06J1j014J480J136k537K62K076M52r29j705
755a277J686J637k243o27Q58L34P31j112l31J059m11O62j079j521J954K20j411
772h71j39j2J882m47k159J906N90j094L57n60N33L18p21R34m42k59J597r55k35
791B23J97m02Q93p27j200J248j47K3P4j339J544L2r02M52j012O08Q69j515N06
810e75N62q0Q30j199K92J205r52R6m2m93J369n18n39O26m06P92n09q91Q74m82
$$ plain form
830 -40 -714 122 -639 -334 -150 -978 447 -129 -1093 162 62 -64 -502 -841 495 140 -534 698 21
849 21 268 1194 61 -76 -93 563 1122 -837 -510 1171 205 39 -161 -278 517 -350 -426 -72 -1275 -395
869 -395 551 -668 -619 -471 552 1147 -1000 -532 766 343 521 -520 -505 1122 637 426 -97 -386 1400
888 1400 395 -784 104 -392 77 581 -711 -287 -445 190 1097 -1010 -1477 135 391 22 -1342 -848
906 -848 1364 283 -673 285 141 490 509 308 401 -1120 185 1935 28 -1212 -299 1172 1443 -1101
924 -1101 -1668 781 608 -59 -1172 -1387 827 736 -257 -684 -1144 628 1091 -641 -805 -711 436 1746
942 1746 131 -1435 -572 1903 2670 -1579 -2753 1891 2710 -654 -2216 -236 2219 21 -1508 442
958 442 -258 -792 713 657 -1089 -2449 314 3014 -1076 -3515 463 3075 703 -2534 -850 2773
$$ packed form
830d0o74Q36p61L05J84q28J425n76r64J255j00j26m38l39J336l55o74J232o77
849B1K47R26j133j37j7O56N59j959L27J681r66j66k00j17P95q67p6L54j203Q80
869c95R46j219M9J48J023N95k147M68J298m23J78j041J5J627m85k11n23k89J786
888A400j005j179Q88m96M69N04j292M24j58O35R07k107m67J612K56l69j364M94
906h48K212j081r56R58j44L49J9k01R3j521J305J750j907j240R13J471K71k544
924a101n67K449j73o67j113k15K214r1r93m27m60J772M63j732j64R4J147J310
942A746j615j566Q63K475P67m249j174M644Q19l364j562J980K455k198j529J950
958D42p00n34J505n6j746j360K763K700m090k439L978K612k372l237J684L623
$$ plain form
974 2773 391 -1380 188 404 95 200 1019 933 -1577 -874 2516 1038 -1912 -2072 996 2576 -1216
991 -1216 -3117 277 1971 356 -1653 -1426 1037 585 -691 397 -491 -962 618 1720 901 -2454
1007 -2454 -1157 3994 1781 -3403 -2399 2789 3471 -2093 -3360 1931 2153 -1032 -1048 49 -27 -1017 339
1024 339 1524 -2490 -2538 2616 2506 -1951 -3358 1235 3786 -1025 -3573 648 2338 531 -1150 -635
1040 -635 1169 405 397 979 -810 -846 832 894 66 -1907 -936 2014 669 -1471 -1483 180 1740 -430
1058 -430 -2114 -128 869 435 -445 -745 717 68 -387 1365 110 -1415 84 1747 1392 -1896 -1431
1075 -1431 2576 1375 -1625 -1069 1015 1306 -919 -1029 660 -473 -799 1017 174 -1535 -961 1353
1091 1353 1441 -2077 -1938 1840 1355 -779 -1237 242 1594 475 -551 84 -254 915 1173 -800 -777
$$ packed form
974B773k382j771J568K16l09J05Q19q6k510P03L390j478k950j60L068J580l792
991a216j901L394J694j615k009K27K463m52j276J088q88m71J580J102q19l355
1007b454J297N151k213n184J004N188O82n564j267N291K22l185j6J097p6r90J356
1024C39J185m014m8N154j10m457j407M593K551m811k548M221J690j807j681N15
1040f35J804p64qN82j789l6J678O2q28j973R71K950j345k140j2J663J560k170
1058d30j684J986R97m34q80l00J462o49m55J752j255j525J499J663l55l288M65
1075a431M007j201l000N56K084K91k225j10J689j133l26J816q43j709N74K314
1091A353Q8l518J39L778m85k134m58J479J352j119j026O35l38J169K58j973K3
$$ plain form
1108 -777 200 921 607 -992 -736 632 50 173 -905 -1190 520 475 -189 -1235 -796 1355 535 -1261
1126 -1261 -29 855 219 -270 -67 645 -366 -413 1372 410 -1065 363 970 443 -941 -432 1204 -100
1144 -100 -1206 355 173 -317 -627 248 487 -1158 -533 1200 -199 -1090 83 593 309 -787 145 1065
1162 1065 -461 -239 950 -208 -126 105 632 38 -801 415 840 -878 -375 207 66 -123 -449 -72
1180 -72 -28 -811 264 258 -955 -6 301 -40 -396 -268 620 125 -478 584 159 -132 524 272 162 -237
1200 -237 220 989 -464 -632 901 112 -552 -201 90 245 -752 -264 667 -697 -742 370 4 -392 -561
1219 -561 467 818 -972 -57 1178 -25 -358 342 566 145 -599 485 901 -731 -151 778 104 -453
1237 -453 -415 516 -52 -1152 73 405 -777 -335 -46 34 -258 -304 529 30 -856 680 460 -413 43 165
$$ packed form
1108g77R77P21l14j599K56J368n82J23j078k85J710m5o64j046M39K151q20j796
1126a261J232Q84o36m89K03P12j011m7J785r62j475J428O07n27j384N09J636j304
1144a00j106J561j82m90l10Q75K39j645O25J733j399q91J173N10k84j096R32R20
1162A065j526K22J189j158Q2K31N27n94q39J216M25j718N03N82j41j89l26L77
1180g2M4p83J075oj213R49L07l41l56J28Q88m95o03J062m25k91O56k52j10l99
1200b37M57P69j453j68J533p89o64L51K91J55r97M88R31j364m5J112l66l96j69
1219e61J028L51j790R15J235j203l33P00K24m21p44J084M16j632N80R29o74n57
1237d53L8R31n68j100J225L32j182M42K89Q0k92m6Q33m99q86J536k20q73M56J22
$$ plain form
1257 165 545 121 -222 833 37 -259 601 361 -282 35 215 354 -398 -214 684 -416 -474 92 84 -16
1277 -16 -592 -189 428 -463 -272 403 -183 -114 125 17 143 -287 303 554 -426 292 688 -15 160 -8 284
1298 284 198 -478 67 170 -515 -26 -105 -411 -192 -358 192 -270 -653 272 104 -251 11 198 284 74 -71
1319 -71 581 -31 -176 584 140 -12 64 329 496 -289 -212 597 -158 -413 159 -197 -195 -527 -8 134 -676 -175
1341 -175 369 -270 -428 -99 215 332 -444 121 650 -199 21 461 -17 306 4 213 357 -382 166 355
1361 355 -215 -131 -331 36 325 -477 -340 166 -137 138 -284 -200 390 -361 -105 81 -335 124 275 107 295
1382 295 -160 167 620 -157 75 -128 145 319 -285 67 157 -192 45 20 -340 208 -187 -127 -34 -410 128
1403 128 41 -192 -65 -391 -65 359 -22 -36 -106 146 535 3 -222 440 225 234 -10 -295 550 1 -185 205
$$ packed form
1257A65L80m24l43J055p96k96Q60k40o43L17J80J39p52J84Q98j100n8N66qj00
1277a6n76M03O17q91J91O75n86O9K39j08J26m30N90K51r80P18L96p03J75j68K92
1298B84q6o76N45J03o85M89p9l06K19j66N50m62l83R25j68l55K62J87Q6k10j45
1319g1O52o12j45P60m44j52P6K65J67p85P7Q09p55k55N72l56Kl32N19J42q10N01
1341a75N44o39j58L29L14J17p76N65N29q49K20M40m78L23l02K09J44p39N48J89
1361C55n70Q4k00L67K89q02J37N06l03K75m22Q4N90p51K56J86m16M59J51j68J88
1382B95m55L27M53p77K32k03K73J74o04L52R0l49K37k5l60N48l95O0R3l76N38
1403A28q7k33J27l26L26M24l81j4p0K52L89n32k25O62k15Rk44k85Q45n49j86L90
$$ plain form
1425 205 -235 -168 111 -37 154 -685 -272 417 -184 -536 -298 1 469 -381 -479 419 201 87 -19 -31 406
1446 406 31 50 491 -145 -299 328 159 142 -570 -332 789 -87 -815 -264 360 416 -812 -827 548 -105
1466 -105 -738 51 196 -89 -393 116 736 -471 -580 773 415 -297 -488 299 1118 -159 -705 701 424
1485 424 -260 -407 -17 439 -482 -420 622 -170 -693 -1 357 98 -724 -336 823 83 -598 -154 349 502
1505 502 -224 -327 591 312 -137 232 302 111 -148 79 574 -171 -613 313 238 123 -610 -321 683 53
1525 53 -528 -388 304 188 -303 -250 550 -194 -286 454 258 -313 -194 437 579 -458 -525 724 454 -209 -173
1546 -173 87 478 -109 -317 257 -177 -258 17 -208 -158 -386 -11 295 -302 -415 213 7 77 -79 -235 336
1567 336 194 -16 132 -152 397 286 -206 244 99 113 265 -103 153 -42 -201 215 -189 -518 -174 77
$$ packed form
1425B05m40O7K79j48J91q39M13O89o01l52K38K99M68q50r8Q98k18j14j06j2M37
1446D06l75J9M41o36j54O27j69j7p12K38J121q76p28N51O24N6j228j5J375o53
1466a05o33P89J45k85l04N09O20j207j09J353l58p12j91P87Q19j277n46J406k77
1485D24o84j47L90M56r21O2J042p92n23O92L58k59q22L88J159p40o81M44N03J53
1505E02p26j03R18k79m49L69P0j91k59K27M95p45m42R26p5j15p33K89J004o30
1525E3n81J40O92j16m91N3Q00p44r2P40j96n71J19O31J42j037o7J249k70o63L6
1546a73K60L91n87k08N74m34q1K75k25N0k28L75L06n97j13O28k06P0j56j56N71
1567C36j42k10J48k84N49j11m92M50j45J4J52l68K56j95j59M16m04l29L44K51
$$ plain form
1587 77 130 -472 -426 409 -95 -613 167 163 30 -256 43 506 -433 -185 733 170 -267 -2 396 402 -348 -138
1609 -138 667 -11 -272 239 -27 -107 -197 27 -84 -498 -183 272 -324 -286 -94 82 149 -198 119 75 -87 251
1631 251 289 -144 98 151 274 196 -10 489 119 -263 397 136 -170 159 -18 -158 -213 -270 451 -179 -417 147
1653 147 -130 -35 -126 64 232 -421 -256 657 -18 -346 191 366 13 -393 378 786 -297 -342 569 49 -258
1674 -258 -98 130 29 -464 -8 351 -372 -266 294 -74 -291 -45 167 99 -579 66 347 -193 -25 246
1694 246 285 15 -221 437 223 -524 255 358 -226 20 -58 271 -205 -364 344 -41 -321 62 -39 -182 -33
1715 -33 -131 264 -121 -289 307 -82 -89 58 194 166 -50 248 576 -15 60 399 -38 26 -64 75 108 -393 124
1738 124 179 -370 -140 77 -98 -66 -154 225 83 -340 180 296 -436 -69 99 186 -68 -96 312 68 -415 302
$$ packed form
1587G7N3o02M6Q35n04n18P80mj33k86K99M63r39K48R18n63m37K65L98Op50K10
1609a38Q05o78k61N11k66q0r0K24j11m14L15M55n96L8J92J76O7l47L17m4j62L38
1631B51L8m33K42N3J23p8k06M99l70l82O60k61l06L29j77j40n5n7P21o30k38N64
1653A47k77R5r1J90J68o53J65R13o75l28N37J75l53m06P71M08j083m5R11n20l07
1674b58J60K28j01m93M56L59p23J06N60l68k17K46K12o8o78O45K81n40J68K71
1694B46L9k70k36O58k14p47P79J03n84K46p8L29m76j59P08l85k80L83j01j43J49
1715c3r8L95l85j68N96l89pJ47J36k8k16K98L28n91P5L39m37O4r0J39L3n01N17
1738A24N5n49K30K17j75L2q8L79j42m23N20J16p32L67J68Q7k54k8M08k44m83P17
$$ plain form
1760 302 502 29 24 109 280 -246 -261 479 58 -506 174 153 -173 -245 12 117 -435 -392 389 -93 -435 127
1782 127 166 103 -444 79 621 -172 -164 413 12 24 283 252 221 -236 124 362 -338 -102 241 -51 -233 -82
1804 -82 221 146 -509 8 243 -404 -78 -16 146 -118 -116 249 33 -183 251 366 -47 -109 125 231 6 -63
1826 -63 346 226 -303 206 16 -265 -23 -71 88 -254 -202 331 -310 -248 -1 -3 -117 -232 -58 2 -265 3
1848 3 305 -165 -146 204 311 -38 -146 381 600 -275 -134 309 135 -96 123 164 7 -347 118 290 -499
1869 -499 -228 182 16 -308 -260 211 142 -217 148 89 3 156 62 50 -43 -198 236 217 -294 306 199 -10 37
1892 37 51 89 -40 -126 194 -315 -93 46 150 -109 -293 -122 174 -246 -152 242 -19 171 84 18 174 -52
1914 -52 121 271 -226 -50 254 37 141 43 -103 188 -193 -213 -57 -117 139 -241 -223 34 -159 -171 -53 -244
$$ packed form
1760C02K00m73nQ5J71n26j5P40m21n64O80k1l26p2K57J05n52M3P81m82l42N62
1782A27L9o3n47N23N42p93QN77m01J2K59l1l1m57L60K38p00K36L43k92j82J51
1804h2L03p5o55N17K35o47L26O2J62k64KL65k16k16M34J15m13o2K34J06k25o9
1826f3M09j20n29N09j90k81K42m8J59l42N2N33o41O2K47kj14j15J74O0k67K68
1848CL02m70J9L50J07l49j08N27K19q75J41M43j74k31K19M1j57l54M65J72p89
1869d99K71M10j66l24M8M71o9l59L65n9q6J53r4j2r3j55M34j9n11O00j07k09M7
1892C7J4L8j29q6L20n09K22J39J04k59j84J71K96m20R4L94k61J90q7o6J56k26
1914e2J73J50m97J76L04k17J04r8j46K91l81k0J56o0K56l80J8K57j93j2J18j91
$$ plain form
1936 -244 44 -4 -114 285 -161 -161 231 168 54 -195 19 444 94 -239 174 139 287 -223 -80 346 -127 -238
1958 -238 24 -97 -292 -227 -61 240 -214 -459 302 7 -118 -258 -17 329 -204 -109 455 85 51 130 44 247
1980 247 44 3 371 54 -40 59 122 162 -211 -58 345 -42 -390 -246 151 -229 -234 -76 256 -216 -228 71 187
2003 187 -183 -157 162 286 -33 -20 428 131 10 -66 -78 307 -41 -65 105 -79 185 -61 -133 122 -65 -78
2025 -78 67 -196 -180 -80 -229 232 -91 -364 138 85 7 -86 45 139 67 -91 335 156 -77 105 150 161 -235
2048 -235 -96 235 -172 -187 20 69 -29 -203 -136 74 -177 -233 38 -248 -153 -59 -71 248 -58 -132 307 -54 -102
2071 -102 42 87 125 22 26 103 -52 73 -115 -108 74 86 -48 -134 -166 -70 -76 -72 204 -70 -231 159 36 -73 -115
2096 -115 182 438 -111 -177 354 121 -217 -73 217 229 -202 -115 433 -205 -317 153 99 -61 -223 106 250
$$ packed form
1936b44K88m8j10L99m46%L92o3j14k49K14M25l50l33M13l5J48n10J43M26m73j11
1958b38K62j21j95O5J66L01m54k45P61k95j25j40K41L46n33R5N64l70l4P9q6K03
1980B47k03m1L68l17r4R9O3M0l73J53M03l87l48J44L97l80nJ58L32m72j2K99J16
2003A87l70K6L19J24l19J3M48k97j21p6j2L85l48k4J70j84K64k46p2K55j87j3
2025g8J45k63J6J00j49M61l23k73N02n3p8r3J31R4p2j58M26j79k33J82M5J1l96
2048b35J39L31m07j5K07M9r8j74O7K10k51n6K71k86R5R4j2L19l06p4M39l61m8
2071a02J44M5L8j03MP7j55J25j88PJ82J2j34q6l2R6oMK76k74j61L90j23j09m2
2096a15K97K56n49o6N31k33l38J44K90J2m31Q7N48o38j12M70n4j60j62L29J44
$$ plain form
2117 250 -230 -158 165 5 -192 6 17 3 -217 78 252 -356 65 128 43 48 41 55 288 -97 164 -25 -53 99
2141 99 55 21 -16 85 131 -136 -224 146 -98 -284 -36 -10 -12 -132 -142 353 -79 -278 56 78 -211 161 191 151
2165 151 -154 123 323 -103 -113 326 215 0 -127 -37 204 -195 -205 381 -166 -86 9 -104 -52 -225 -18 141
2187 141 -184 -56 82 -140 -50 -4 235 -135 -85 372 227 -287 136 292 -29 50 -5 97 3 -444 241 372
2209 372 -370 -83 -21 -119 -107 -280 180 -127 -263 79 116 -147 75 129 197 -117 -173 538 -7 -132 291 77
2231 77 131 -52 -144 250 -87 -22 345 -144 13 20 -53 85 -34 -20 -62 -163 -93 2 -111 74 -18 -136 -66 -219
2255 -219 108 87 -117 39 -46 16 81 241 206 14 -252 187 56 -177 92 -75 61 -167 68 141 5 -277
2277 -277 79 70 -231 -20 -26 30 -184 86 459 -120 -62 197 91 -142 35 79 49 -264 85 350 -115 -29 139
$$ packed form
2117B50m80P2L23j60j97J98J1j4k20K95J74o08M21O3q5NpJ4K33l85K61j89k8J52
2141I9m4l4l7J01M6k67q8L70k44j86K48K6kj20j0M95m32j99L34K2k89L72L0m0
2165A51l05K77K00m26j0M39j11k15j27R0K41l99j0N86n47Q0R5j13N2j73K07J59
2187A41l25J28J38k22R0M6K39l70N0M57j45n14M23J56l21P9n5J02r4m47O85J31
2209C72p42K87O2r8J2j73M60l07j36L42L7k63K22N4O8l14n6P11n45j25M23k14
2231G7N4j83r2L94l37O5L67m89J57Pp3J38j19J4m2j01P0R5j13J85r2j18P0j53
2255b19L27k1k04J56q5O2O5J60l5j92k66M39j31k33K69j67J36k28K35P3j36k82
2277b77L56rl01K11oN6k14K70L73n79N8K59j06k33J77M4l0l13L49K65m65Q6J68
$$ plain form
2300 139 71 -189 -237 -7 138 -346 -109 178 -238 -173 126 171 -147 -272 119 229 -243 30 265 -42 -104 -165
2322 -165 296 198 -64 90 116 25 134 156 7 -80 -137 88 -100 -162 57 -10 -122 91 -258 -97 -206 -207 68
2345 68 -135 -46 281 -23 -64 74 32 122 -34 -27 216 -7 -25 126 60 -50 -40 121 144 -222 179 75 -160 -65
2369 -65 -162 -21 -11 -278 -133 -76 -264 -90 49 -58 -21 -46 14 130 -144 77 171 22 169 9 24 69 121 -99
2393 -99 -148 -85 341 -58 -245 71 -155 -91 -142 -142 108 -147 -183 51 -14 -145 -158 138 111 -308 -36 294 -9 -110
2417 -110 56 238 48 114 -56 154 59 -24 183 -7 -1 -138 -7 65 -230 -196 -1 -61 166 -265 -70 6 -36
2440 -36 -56 99 -99 45 -61 51 265 -115 -105 133 -101 125 89 6 176 13 -90 141 -11 -13 -131 -99 184
2463 184 -226 -140 52 -94 -173 60 -44 -26 -57 -51 216 -141 1 21 45 97 -9 7 332 -6 190 89 73 -112
$$ packed form
2300A39o8k60m8K30J45m84K37K87m16O5K99M5l18j25L91J10m72K73K35l07o2o1
2322a65M61r8k62J54K6r1J09K2j49q7n7K25j88o2K19o7j12K13l49J61j09jK75
2345F8k03Q9L27l04m1J38m2R0j56PK43k23j8J51o6j10J0J61K3l66M01j04k35R5
2369f5r7J41J0k67J45N7j88J74J39j07L7k5O0J16k74K21R4j49J47j60J5M5N2k20
2393i9m9O3M26l99j87L16k26O4n1%K50k55l6K34o5j31j3K96k7m19K72L30l03j01
2417a10J66J82j90O6j70K10r5q3K07j90Oj37J31P2k95L4J95o0K27m31J95P6m2
2440c6k0J55j98J44j06J12K14l80J0K38k34K26l6q3J70j63j03K31j52kj18L2K83
2463A84m10Q6J92j46p9K33j04J8l1OK67l57J42K0K4N2j06J6L25l38J96j01j6j85
$$ plain form
2487 -112 53 -117 130 -131 52 109 -159 -4 -254 122 -59 -122 -156 -23 -119 -176 -129 -104 99 -87 -185 84 -79
2510 -79 148 -34 64 118 -146 80 34 -243 45 -19 87 188 -82 -90 134 -90 -26 -103 -332 -73 -134 -98 62 11
2534 11 81 74 -175 154 64 -63 126 79 -16 72 -27 246 -158 -162 270 84 -157 -19 -32 214 -268 -248 -26 -162
2558 -162 -47 147 -58 63 -237 19 145 -180 -117 27 -7 -111 -71 72 8 -19 23 30 -46 133 187 95 116 47
2582 47 -43 134 22 -118 -48 -118 70 -206 -115 -181 -12 9 -131 -87 81 -94 -132 139 84 47 168 148 280 -60
2606 -60 -177 253 106 -83 -37 90 69 -238 -19 187 -101 -27 16 74 -78 45 -72 158 -70 -9 114 -145
2628 -145 -23 55 37 71 -9 158 282 -95 -20 133 -144 26 -11 52 4 -242 175 18 -237 78 -1 -162 -43
2651 -43 76 -116 -94 -201 63 -62 -293 -155 -3 -71 -136 2 114 -19 -74 106 13 -68 -56 22 132 -33 -66
$$ packed form
2487a12J65j70K47k61J83N7k68J55k50L76j81o3l4J33r6n7M7K5K03j86r8K69j63
2510g9K27j82R8N4k64K26m6k77K88o4J06J01k70qK24k24O4p7k29K59o1L6J60n1
2534A1P0pk49L29r0j27J89m7r5Q8r9K73m04mM32j86k41J38j3K46m82K0K22j36
2558a62J15J94k05J21l00K56J26l25O3J44l4j04M0J43o4k7M2Pp6J79N4r2K1o9
2582D7r0J77j12j40P0p0J88k76R1o6J69K1j40M4J68j75l8K71n5l7J21k0J32l40
2606f0j17M30j47j89M6J27k1l07K19K06k88P4M3N8j52J23j17K30k28O1J23k59
2628a45J22P8j8L4q0J67J24l77P5J53k77J70l7O3m8k46M17j57k55L15p9j61J19
2651d3J19j92K2j07K64j25k31J38J52o8o5J38J12j33n5J80r3q1J2P8J10j65l3
$$ plain form
2674 -66 232 69 -139 -66 -66 -104 43 -86 103 -78 -164 -40 -100 24 -8 -50 -65 -50 1 173 -32 123 178 -37
2698 -37 180 144 -142 33 6 2 15 -170 186 20 -126 -33 94 141 120 -101 74 -78 -91 2 118 -79 15 -5
2722 -5 67 128 7 164 -3 -35 115 262 283 14 -57 189 100 77 50 80 -63 -95 -16 83 -300 -94 146 -85 -4
2747 -4 89 -157 84 -94 -111 16 -190 -79 4 88 -14 21 50 -39 -82 94 129 -132 41 143 -93 -63 -70 137 60
2772 60 -170 40 125 -110 -81 17 14 -2 -137 -3 96 -45 189 -18 -48 76 -6 -48 0 30 26 101 -88 76 -51
2797 -51 6 147 -114 51 -151 -18 -30 -123 -108 142 -33 62 -138 135 139 -163 -39 219 -72 -85 36 198 -8
2820 -8 -137 263 191 -134 -13 85 119 -44 60 141 165 -260 85 146 -70 75 -322 -132 -22 -161 -129 -87 -82 -28
2844 -28 -91 -134 17 72 29 -170 -2 47 -20 -134 125 136 -63 131 -101 255 -11 -174 120 -214 -10 19 -126
$$ packed form
2674f6K98j63k08P3%l8J47j29J89j81q6J24o0J24l2m2j5J5N1J72k05J55N5k15
2698c7K17l6k86J75k7mJ3j85L56j66j46R3J27M7k1k21J75j52j3R3J16j97R4k0
2722eP2O1j21J57j67l2J50J47K1k69p1K46q9k3k7L0j43l2P9R9l83K06K40k31Q1
2747dR3k46K41j78j7J27k06J11Q3Q4j02L5K9q9m3J76L5k61J73J02k36L0pK07p7
2772F0k30K10Q5k35K9R8lj6j35J34R9j41K34k07l0J24q2m2M8L0mP5j89J64j27
2797e1N7J41k61J65k02J33j2r3J5K50j75R5k00K73Ml02J24K58k91j3J21J62k06
2820hj29M00p2l25J21R8L4j63J04Q1K4m25L45O1k16J45l97J90J10j39L2M2NN4
2844b8o3m3J51N5m3j99J68M9o7j14K59J1j99J94k32L56k66j63K94l34K04K9j45
$$ plain form
2867 -126 40 -70 25 110 -54 -86 -127 -106 -105 -77 86 9 -281 -5 45 -14 -37 52 9 138 25 159 36 -79 44
2892 44 164 72 23 115 -31 36 27 -27 -21 101 169 -150 -185 116 -10 -216 37 -60 160 -205 -146 236 99 -16 137
2917 137 37 -86 88 -15 268 -124 -133 75 -10 -22 -242 65 -3 -5 -38 11 -114 77 -53 -56 95 -171 0 123
2941 123 -65 210 114 103 -60 -66 86 -34 5 116 196 -163 92 46 105 118 -142 55 29 -78 81 -77 -120 14
2965 14 -85 -156 -61 -20 98 -157 6 33 -13 76 78 -39 110 -37 -19 185 43 -94 123 154 9 -76 24 76 -7
2990 -7 52 -109 49 25 -96 -13 0 -127 -81 -110 -81 -91 -106 71 88 74 -35 -108 -61 67 -71 158 288 49 -130
3015 -130 -31 104 142 -129 19 140 121 -97 96 -62 -104 -30 -53 103 -153 -135 0 59 25 55 -1 101 22 -19
3039 -19 68 153 25 103 -9 1 58 -105 116 -39 26 44 1 80 -78 -80 77 -36 -90 -99 -55 38 -125 -6 62 3
$$ packed form
2867a26J66j10R5Q5j64l2m1K1JK8J63p7k90K76N0n9k3Q9m3J29j13J34j23j15J23
2892D4J20r2m9R2j46O7rn4OJ22O8l19l5L01j26k06K53r7K20l65N9L82j37j15J53
2917A37j00j23J74j03K83l92rK08q5j2k20L07o8kl3M9j25J91j30lJ51k66J71J23
2941A23j88K75r6j1j63oJ52j20L9J11Q0l59K55m6N9J3k60J97k6j07J59j58m3J34
2965A4r9p1R5M1J18k55J63K7m6Q9Kj17J49j47J8K04j42j37K17L1j45q5J00N2q3
2990gN9j61J58k4j21Q3J3j27M6k9K9j0j5J77J7j4j09p3M7J28j38K29J30k39j79
3015a30R9J35L8k71J48J21j9k18J93j58m2P4k3J56k56J8J35N9l4L0n6J02p9m1
3039a9Q7Q5j28P8j12J0N7j63K21j55O5J8m3P9j58kJ57j13n4rM4R3j63J19O8n9
$$ plain form
3065 3 195 29 7 166 -78 -32 177 48 -156 79 -50 87 101 -5 68 110 11 -4 -171 9 -22 27 60 70
3089 70 -91 -86 -16 -1 -30 -220 15 -24 -26 128 -111 1 74 -149 309 146 -177 -184 61 172 -34 11 80 37 -81
3114 -81 22 157 12 -12 -176 231 31 -119 83 52 -83 -9 -43 70 0 -71 77 -90 21 93 -13 214 124
3137 124 -162 58 96 -2 -118 -26 -41 30 -165 -63 67 127 113 -19 35 -140 -84 -10 20 -104 -63 -56 35 -43 -178
3162 -178 180 68 -128 -35 221 -24 -11 101 167 215 -84 173 -111 138 -75 -62 112 -98 -268 93 -56 29
3184 29 3 -91 -21 86 -90 189 26 192 31 -69 41 56 -189 140 -24 50 104 92 53 236 -50 255 68
3207 68 60 -135 5 -3 -101 -302 -86 81 -105 -120 39 -108 -31 68 120 84 -14 126 104 11 126 -10 -20 14 -160
3232 -160 68 -104 25 74 -106 -53 94 -76 94 -64 -66 49 -12 -78 85 -188 75 133 -27 27 -31 -1 88 -28
$$ packed form
3065CJ92j66k2J59k44M6K09j29k04K35j29J37J4j06P3M2r9j5j67J80l1M9L3J0
3089G0j61NP0J5k9j90K35l9kJ54k39J12P3k23M58j63l23pK45J11k06M5O9m3j18
3114h1J03J35j45k4j64M07k00j50K02l1j35P4l4J13p0p1J48j67J11P2j06K27r0
3137A24k86K20L8r8j16R2j5P1j95J02J30O0j4j32N4j75N6P4L0j24M1PR1p8j35
3162a78L58j12j96R3K56k45J3J12O6M8k99K57k84K49k13J3J74k10j70L61j49Q5
3184B9k6r4P0J07j76K79j63J66j61j00J10J5k45L29j64P4N4j2l9J83k86L05j87
3207F8qj95J40qr8k01K16J67j86j5J59j47P7R9N2l6r8J40k2r3J15j36j0L4j74
3232a60K28j72J29M9j80N3J47j70J70j58kJ15o1o6J63k73K63N8j60N4n8L0Q9j16
$$ plain form
3256 -28 -42 -45 -11 106 -199 2 148 -103 36 87 60 -83 -56 30 -33 -4 -16 42 -17 -98 111 32 161 -69 116
3281 116 -33 -9 98 53 107 -41 -118 260 11 -8 94 -98 -62 122 29 87 -73 -249 95 -75 169 50 5
3304 5 -40 73 109 64 -5 -134 62 -154 63 -113 21 -51 122 242 81 -146 23 -49 -151 -78 -47 157 -99
3327 -99 -157 47 78 -77 -6 -49 23 25 -32 -13 -90 -127 78 104 -180 126 74 -72 6 -197 -16 -42 -135 135 -131 -96
3353 -96 -58 -66 82 8 18 148 81 -59 -45 -61 -34 -36 -84 141 -1 0 114 -256 -174 -40 80 -77 -20 103 -15 13
3379 13 -20 23 -20 155 -34 74 1 29 -150 36 -4 -34 -189 9 63 -18 72 90 -109 -13 18 -24 105 -74 -3
3404 -3 -115 -96 -80 12 -57 -7 -5 60 93 30 -27 -270 39 58 -84 -73 28 -25 18 -26 12 43 -18 -47 101 -40 100
3431 100 104 -76 8 88 -126 173 -17 -44 124 -144 22 149 15 -34 -151 63 141 50 6 172 185 154 8 89
$$ packed form
3256b8j4lL4J17l05K01J46k51J39N1k7j43K7Q6o3K9j2N8n9q1K09p9J29k30J85
3281A16j49K4J07m5N4j48p7L78k49j9J02j92L6J84r3N8j60j76L44j70K44j19m5
3304Em5J13L6m5o9j29J96k16K17j76J34p2J73J20j61k27J69p2j02P3L1K04k56
3327i9n8K04L1j55P1m3P2Kn7J9p7l7K05K6k84L06n2j46P8k03J81k6r3K70k66L5
3353i6L8qJ48p4J0J30o7j40J4j6K7km8K25j42JJ14l70Q2J34J20j57N7J23j18K8
3379A3l3M3m3J75j89J08p3K8j79J86m0l0j55J98N4q1R0J8j99R6L1m2J29j79P1
3404cj12J9J6R2o9N0KO5L3o3n7k43L09J9j42J1J01n3M3m4L8L1o1k9J48j41J40
3431A00Mj80Q4Q0k14K99j90k7J68k68J66J27j34m9j17K14P8r1m4J66J3l1j46Q1
$$ plain form
3455 89 -76 -43 -50 137 41 -60 54 -30 82 -92 -35 75 25 123 -89 -75 72 -127 -12 -95 -150 91 10 55 133
3480 133 114 -52 -6 43 127 93 -87 98 -19 -84 142 59 -102 30 4 -21 17 -107 111 85 -37 -10 -116 100
3504 100 -28 119 39 -44 29 8 -164 170 29 7 17 -60 37 62 22 35 -104 -125 -4 74 -4 165 -131 83 -53
3529 -53 -121 56 39 131 -10 92 131 58 2 -123 -96 20 5 -26 161 -13 -16 154 -75 68 105 14 28 26 -4 -61
3555 -61 40 -133 -79 -44 -31 -28 29 88 -52 -99 22 102 182 4 122 176 -12 -30 55 -89 116 129 54 -75 97
3580 97 -14 -75 -22 -56 -82 -54 123 -53 -91 82 -25 -92 47 -38 -32 159 -9 49 -108 -2 11 55 119 -112 71
3605 71 105 -30 -119 -6 -6 155 30 53 122 153 -116 -122 141 -70 -23 -56 119 34 -66 129 -14 62 -81 -86 -29 61
3631 61 -303 3 28 -54 -20 -104 52 48 11 121 -117 -110 79 -145 -27 30 -63 148 -28 79 -6 -102 42 -46 -64
$$ packed form
3455H9j65L3pJ87r6j01J14q4J12j74N7J10n0R8k12J4J47j99J15q3n5K41q1M5P8
3480A33j9j66M6M9Q4l4j80J85j17o5K26q3j61J32k6k5L8j24K18k6j22K7j06K16
3504A00j28J47q0q3P3k1j72L34j41k2J0p7R7K5m0J3j39k1J21P8p8J69k96K14j36
3529e3o8J77j7R2j41J02L9p3n6j25K7J16j5l1J87j74lJ70k29J43L7r1J4kl0n7
3555f1J01j73N4L5J3LN7N9j40m7J21Q0Q0j78J18N4j88j8Q5j44K05J3p5j29J72
3580I7j11o1N3l4k6K8J77j76l8J73j07o7J39q5OJ91j68N8j57J06J3M4O4k31J83
3605G1L4j35q9J13%J61j25K3O9L1k69oK63k11M7l3J75q5j00J95j43P6j43nN7R0
3631F1l64L06K5q2L4q4J56ml7J10k38PJ89k24J18N7r3K11j76J07q5r6J44q8j8
$$ plain form
3656 -64 117 -99 -140 14 32 6 99 18 -32 62 -21 97 -47 108 18 -13 99 -20 83 90 21 110 -12 -53 72
3681 72 123 -43 -241 -58 -25 -11 42 150 -69 -85 -66 47 -27 35 -121 -68 64 -10 -74 -112 -17 32 3 -14 23 -95
3707 -95 -13 -116 -51 5 -89 101 -7 -52 59 -7 -88 36 28 138 53 -45 -18 -181 -121 60 91 -105 -21 119 12
3732 12 -4 155 -60 39 195 -247 68 18 2 -75 43 -22 183 -59 -62 3 -115 -201 -92 4 -92 100 118 128 -48
3757 -48 -21 9 130 98 22 102 36 196 -34 121 -264 8 6 171 89 77 115 -81 63 -34 161 -181 -117 4 70
3782 70 0 -30 -91 174 133 96 3 43 2 27 -42 -41 -93 -167 -9 -223 197 -59 40 200 -28 74 -36 -132 -78 -105
3808 -105 64 -38 -38 28 -120 -291 -20 -52 38 9 25 46 37 33 -54 -82 105 38 14 16 -16 23 71 -63 -218 79 143
3835 143 -89 -109 -164 34 -75 22 95 -35 -48 68 -148 -94 -45 -86 11 96 -194 -48 -116 -38 3 -24 -64 76 64
$$ packed form
3656f4J81k16m1J54J8k6R3q1n0R4q3J18j44J55r0l1J12j19J03Po9Q9j22m1J25
3681G2N1j66j98J83L3J4N3J08k19j6J9J13p4O2j56N3J32p4o4l8R5M9k9j7L7j18
3707i5Q2j03O5N6r4J90j08m5J11o6q1J24qJ10q5r8K7j63O0J81L1j96Q4J40j07
3732A2j6J59k15R9J56m42L15n0j6p7J18o5K05k42lO5j18q6J09R6r6J92J8J0j76
3757d8K7L0J21l2p6Q0o6J60k30J55l85K72kJ65q2j2L8j96J44r7J95l42O4J21O6
3782G0p0l0o1K65m1l7r3M0m1K5o9Jn2p4J58k14M20k56R9J60k28J02j10r6N4k7
3808a05J69j02%O6j48j71K71l2R0k9J6K1rmq7k8J87o7k4Kl2L9M8j34j55K97O4
3835A43k32k0n5J98j09R7P3j30j3J16k16N4M9m1R7Q5k90J46o8P8M1k7m0J40j2
$$ plain form
3860 64 114 1 -72 -15 -2 -91 26 24 -37 -210 -82 -109 -127 28 6 6 -68 -58 3 70 64 -120 -9 124 -6 -102 -124
3887 -124 11 -139 6 50 147 -26 -53 57 54 36 89 25 62 -69 28 -29 -113 -41 -77 -55 -45 -36 11 -108 -40 92 -21
3914 -21 -60 -104 -51 12 -6 132 50 41 33 -114 -37 49 -56 -35 56 12 12 62 2 -24 -6 -4 -112 -50 -128 140 -37 35 -67
3943 -67 62 59 28 -24 -224 -63 -8 8 29 -104 37 78 -55 38 128 105 96 12 27 30 44 -59 0 -189 69 65 -30 -106
3971 -106 63 69 38 -27 81 164 0 177 -166 104 -4 61 93 -34 26 -2 -45 66 7 -124 179 -17 81 -27
3995 -27 30 -90 11 -41 -78 -9 -58 20 -35 -49 15 -19 -33 -86 -95 -119 -48 -97 13 1 28 77 85 -5 -82 250 -17 -12 103
4024 103 -58 -170 -34 -89 -157 62 45 -67 -57 -27 -68 106 -32 -138 -41 20 -32 -16 8 -5 -1 -105 86 14 5 -10
4050 -10 60 121 113 93 -53 179 51 -138 34 -105 -133 23 -55 -66 56 -85 55 -27 -53 32 -61 76 131 -11 -5
$$ packed form
3860F4N0j13p3N7J3q9J17ko1j73J28k7j8J55k2%p4J0O1O7oj84J11J33j30r6k2
3887a24J35j50J45M4R7j73k7J10lj8N3o4L7j31R7n7q4P2l6K2J0RM7j19O8J32j13
3914b1l9m4N3O3j8J38q2rqj47P7Q6j05K1R1m4%N0o0k6J8Kj08O2p8K68j77P2j02
3943f7J29ll1n2k00J61N5J6K1j33J41M1j33R3R0k3rq4J5LJ4j03N9j89K58mr5p6
3971a06J69Ol1o5J08Q3j64J77l43K70j08O5L2j27O0k8m3J11n9j31L03j96R8j08
3995b7N7j20J01n2l7O9m9P8n5j4O4l4j4n3rk4P1m9J10j2K7M9Qr0p7L32k67NJ15
4024A03j61j12J36n5o8K19j7j12J0L0m1J74j38j06R7O1n2J6K4j3Mj04J91p2rj5
4050a0P0O1qk0j46K32j28j89J72j39k8J56p8j1J22j41J40q2k6Q5r3J37N5j42O
$$ plain form
4075 -5 130 -118 39 48 -32 26 29 70 -77 -64 72 -49 43 -99 -55 105 -8 -48 120 82 -10 96 5 -40 -78 47
4101 47 24 186 -35 -65 -30 -36 -32 -132 84 -19 111 5 72 -11 -102 -25 27 42 -50 -88 119 91 -55 -35 28 -96
4127 -96 71 -67 -3 -46 -19 -37 59 146 -40 28 -127 88 50 43 -33 -6 -31 21 19 -16 116 -24 -92 -77 37 113 2
4154 2 86 92 -176 -86 -45 -127 -61 36 82 98 134 72 -96 115 -5 63 94 72 4 -42 119 -128 89 38 -113 -8 40
4181 40 -2 88 1 -30 -55 -130 -7 -169 -58 -62 17 60 53 82 -92 83 37 20 -227 -58 -24 5 -91 80 81 -41 -48 13
4209 13 104 124 -157 68 39 134 171 52 42 27 15 178 22 2 -47 24 13 -2 171 -10 26 77 65 -72 121 -12
4235 -12 101 -149 -9 61 -100 122 -73 64 -178 -131 -122 58 87 -100 -75 -66 -78 13 -108 79 -78 113 -5 90
4259 90 72 49 -39 -10 -16 106 175 -79 -20 350 120 -60 36 -20 138 14 -64 41 16 77 -48 -29 -58 -20 -104 -125
$$ packed form
4075eJ35k48J57Rq0N8LM1j47J3J36j21R2j42M4J60j13m0J68l8r2J06r1m5l8J25
4101D7k3J62k21l0L5oMj00K16j03J30j06O7q3r1P7N2J5r2l8K07k8j46K0O3j24
4127i6J67j38O4m3K7j8R6Q7j86O8j55K15l8pp6K7k5N2kl5J32j40o8J5J14P6j11
4154BQ4Ok68R0M1q2O6R7M6J6L6o2j68K11j20O8L1k2o8m6J61k47K17n1j51J05M8
4181D0m2R0q7l1k5p5J23j62J11mP9M3pK9j74J75m6j7k47J69L4K9r6J71Jj22pO1
4209A3R1K0k81K25k9R5L7j19j0j5j2J63j56k0m9P1j1j5J73j81L6N1j2j37J93j33
4235a2J13k50J40P0j61K22j95J37k42M7RJ80K9j87K5Rj2R1j21J87j57J91j18R5
4259I0j8k3q8K9oJ22O9k54N9L70k30j80R6n6J58j24p8J05k5O1j25J9k9L8q4k1
$$ plain form
4285 -125 8 -77 -187 36 -24 -14 -26 -123 140 -40 -52 -48 -17 -18 21 -1 -21 -65 117 -105 118 27 104 -1 -28 65
4311 65 -119 6 49 -141 -124 56 -128 -39 -5 19 -114 -105 6 115 -8 128 -169 -82 90 19 83 -103 -41 39
4335 39 11 30 165 -8 -109 36 -55 -203 10 -103 -28 45 150 112 186 50 -96 -62 150 -3 114 68 -18 -40
4359 -40 28 21 4 10 -44 -56 -6 -92 0 -7 10 -5 11 81 -42 1 63 -113 37 -66 -170 67 -137 73 -89 -97 -85 -147
4387 -147 -105 185 -34 26 -76 3 -58 -64 106 -114 -32 80 3 -84 -32 -3 -181 -96 99 -94 -93 -59 110 67 41 57
4413 57 132 -93 -82 -29 -139 7 -19 -46 -25 -5 -47 22 70 59 122 -111 65 120 76 12 33 13 9 98 -39 -144 8
4440 8 36 51 86 -61 -22 -68 -80 -111 -158 25 -60 -5 -69 -17 -9 -123 42 -192 72 170 -140 34 20 -35 -101 138 95
4467 95 -107 -21 105 78 -111 -28 -40 43 -146 102 -164 -35 -83 50 -86 -208 72 -190 32 -5 -110 78 62
$$ packed form
4285a25J33q5j10K23o0J0j2r7K63j80j2ML1jL9k2k0m4J82k22K23r1P7j05k7R3
4311F5j84J25M3j90J7J80j84Q9L4K4j33RJ11J09j23J36k97Q7J72p1O4j86O2Q0
4335C9k8J9J35j73j01J45r1j48K13j13P5P3J05l8P4j36j46L4K12j53J17m6q6k2
4359d0O8pj7On4j2N0q6R2pJ7j5J6P0j23M3O2j76J50j03j04K37k04K10j62qJ2o2
4387a47M2K90k19O0j02P9o1oJ70k20Q2J12p7q7N2K9j78Q5J95j93JL4J69m3k6J6
4413E7P5k25J1N3j10J46k6k7K1K0m2O9M8j1O3k33J76N5m4o4K1k0mQ9j37j05J52
4440HK8J5L5j47L9m6j2l1m7J83q5N5o4N2Qj14J65k34K64R8l10J74j4n5o6K39m3
4467I5k02Q6J26k7j89Q3j2Q3j89K48k66J29m8J33j36j22K80k62K22l7j05J88j6
$$ plain form
4490 62 55 88 82 -63 35 -57 164 17 5 73 -194 -141 -71 -43 -109 -46 86 -66 -25 61 -90 -62 -53 170 -96 -32 -4
4517 -4 64 98 -17 77 0 37 -80 -33 -17 7 -92 -116 55 86 -2 2 -79 -98 42 -121 -92 -30 -4 82 -47 45 30 200
4545 200 84 -18 -40 -41 -96 65 -47 178 7 85 14 8 208 -35 144 141 14 -30 29 -119 -60 -78 -58 -135 6
4570 6 16 63 -31 19 -35 -214 -87 122 28 -69 22 5 -67 -229 -61 -31 -20 -111 124 -34 14 -32 52 56 22 -17 -2 -25
4598 -25 76 53 -22 -22 -152 36 29 -68 -77 78 57 -70 186 -39 41 26 40 -154 -46 88 5 -16 -123 115 -38
4623 -38 -40 -49 94 -179 2 53 -25 -74 -29 107 -54 17 -100 -66 -34 4 98 9 22 -70 15 118 49 -51 17 -63 49
4650 49 20 62 98 139 81 69 -116 -86 22 -95 46 -48 -100 -151 -112 33 155 111 -126 -176 -42 -69 6 13 117 -38
4676 -38 10 -72 -26 4 46 -52 -17 53 -120 27 138 -121 -81 -39 -59 109 83 -12 -4 -87 60 132 6 66 -12 -42 215
$$ packed form
4490F2pL3oj45R8r2K21j47j2O8k67N3P0K8o6O3J32j52M1Q6j51K8RK23k66O4K8
4517dO8L4j15R4p7L7j17M7J6K4r9k4J71L1q8Mq1j9J40j63K9O2K6Q6j29R2j5J70
4545B00j16j02k2jn5J61j12K25j71P8p1oK00k43J79lj27m4N9j48N9j8K0p7J41
4570FJ0M7r4N0n4j79J27K09r4r7R1j7p2j62J68L0J1r1K35j58M8m6Q4Ml4l9J5k3
4598b5J01k3p5%j30J88pr7rJ55k1j27K56k25Q0j5J4j94J08J34q3k1j07K38j53
4623c8krJ43k73J81N1p8m9M5J36j61P1j17L4L2L8R4q9J3r2Q5J03o9j00O8q0J12
4650D9k9M2L6M1n8j2j85L0J08j17J41r4n2n1L9J45J22m4k37n0J34k7P5PJ04j55
4676c8M8q2M6L0M2r8L5P0j73J47J11k59M0M2k0J68k6r5Qq3J47P2j26O0p8l0K57
$$ plain form
4703 215 -49 33 -20 21 133 -20 -23 66 44 -31 103 44 -36 -56 -60 -33 -26 22 146 -62 104 52 -37 100 -121 26
4729 26 -53 18 -6 -203 13 28 18 -148 -129 22 55 141 77 107 80 152 -64 -138 39 -47 216 121 -114 52 131 -185
4755 -185 119 46 -24 65 24 38 -107 -38 11 134 -49 42 -25 -21 93 30 224 -117 78 55 -125 16 -108 -22 166
4780 166 -192 24 10 -47 -46 -21 60 57 -58 120 36 -17 -30 21 50 -45 171 25 16 113 -41 1 -61 -116 33 -34 -70
4807 -70 -59 38 -34 -37 -71 -110 14 -45 -64 -21 -41 90 96 -6 -49 21 138 -27 -44 -16 -61 51 134 58 -78 42 113
4834 113 97 106 23 49 31 83 50 7 -103 -27 -56 77 0 -27 114 -51 39 48 52 -50 -235 35 -44 -43 -2 -44 77 86
4862 86 78 -112 28 0 77 17 26 60 -41 89 -9 -27 -32 55 157 2 87 119 46 33 157 112 -82 127 -39 -184
4888 -184 17 122 -31 -3 -136 108 68 39 -111 -29 67 -31 5 -131 41 -96 141 69 35 36 -83 79 -71 14
$$ packed form
4703B15k64Q2n3M1J12j53lQ9k2p5J34n9q0k0mK7PM8J24k08J66n2q9J37k21J47
4729B6p9P1k4j97K16J5j0j66J9J51L3Q6o4L0k7P2k16p4J77q6K63r5k35J66P9l16
4755a85L04p3p0Q9m1J4j45O9M9J23j83R1o7MJ14o3J94l41J95k3j80J41j24Q6J88
4780A66l58K16j4n7JK5Q1lj15J78q4n3j3N1K9r5K16j46rR7j54M2o2n5J49o7l6
4807g0J1R7p2ll4l9J24n9j9M3k0J31Oj02m3P0J17j65j7K8m5J12Q3p6j36J20P1
4834A13j6Rq3K6j8N2l3m3j10P6k9J33p7k7J41j65R0RMj02j85K70p9JM1m2J21R
4862H6qj90J40k8P7o0RL4j01J30r8j8nQ7J02j55Q5L2p3j3J24m5j94K09j66j45
4888a84K01J05j53K8j33K44m0k9j50Q2R6r8L6j36J72j37K37p2l4Jj19J62j50Q5
$$ plain form
4912 14 48 161 56 -26 10 -50 177 -13 7 -17 42 110 133 6 -6 -23 -35 -36 -105 -93 93 146 109 5 213 4
4938 4 73 40 -27 -28 -59 -49 -2 -18 44 26 127 14 -58 60 -24 33 -1 115 193 138 -46 16 141 60 37 98 -55 -41
4966 -41 -162 -184 3 -54 -78 -86 129 -20 -81 48 -105 -5 18 -14 54 -48 -84 -35 -18 29 -56 -55 -114 47 -24 9 -58
4993 -58 -213 -70 63 113 -134 -22 -89 -28 -80 26 -34 -134 -33 -90 -138 -14 -41 25 -6 -56 37 18 -144 9 -109
5018 -109 -29 96 -70 15 79 59 218 28 -139 100 76 136 33 104 21 -29 6 15 -22 33 -66 -54 71 46 49 -78
5044 -78 91 84 43 -16 -149 12 -176 0 -37 -137 7 -136 12 -35 43 -21 -53 -4 165 184 37 131 -51 -79 -29
5069 -29 39 115 78 -103 -126 -127 38 36 9 160 107 -54 -3 91 -10 55 70 -34 -18 19 79 -1 51 -157 -120 105 41
5096 41 -3 -66 -314 -74 44 102 82 -43 -44 -87 74 -25 -110 54 -27 -41 28 75 52 -33 -120 19 -55 -17 129 46 -29
$$ packed form
4912A4L4J13j05q2L6o0K27j90K0k4N9O8K3j27j2j7j2jo9J2J86N3l7j04K08k09
4938DO9l3o7jl1J0M7j6O2j8J01j13p2J18q4N7l4J16P8n5j84O2J25q1k3O1j53J4
4966d1j21k2J87n7k4qK15j49o1J29j53J00K3l2O8j02l6M9J7M7q5Jn9J61p1L3o7
4993e8j55J43J33N0k47J12o7O1n2J06o0j00J01n7m8J24k7O6l1n0R3j9j62J53j18
5018a09Q0J25j66Q5O4k0J59j90j67K39k4O0j03P1q3n0L5Rl7N5r9J2J25k5Lj27
5044g8J69pm1n9j33J61j88J76l7j00J44j43J48m7P8o4l2M9J69J9j47R4j82k8N0
5069b9O8P6l7j81k3jJ65kk7J51n3j61N1R4j01O5J5j04J6L7O0q0N2k08L7K25o4
5096D1m4o3k48K40J18N8k0j25jm3J61r9q5J64q1j4O9M7k3q5q7J39p4L8J46q3p5
$$ plain form
5123 -29 20 -101 34 93 -46 130 -24 -347 66 123 -118 -91 -34 -41 75 50 6 59 118 -109 -103 12 82 145 99 -40
5149 -40 -88 -28 -174 90 38 -113 -56 -120 134 -109 -44 -193 49 -72 85 -40 -27 106 -109 40 18 -69 -56 -32
5173 -32 70 121 16 -194 -62 11 116 -157 -24 37 77 114 -39 126 111 20 -70 166 59 -71 -55 -31 -105 97
5197 97 -13 -41 -40 2 -47 -35 97 -64 6 71 -32 -22 12 33 19 -33 153 -107 -16 114 64 -21 -67 -48 -1 -53 52
5224 52 58 127 -1 -54 -3 -180 -48 118 -132 -140 -25 154 20 -40 -18 -29 -95 -263 -142 32 -30 -85 -145 107 84
5249 84 5 36 -51 -29 72 24 111 66 4 39 11 -129 184 83 142 64 -19 218 0 21 11 87 -155 -96 -62 114
5275 114 -77 89 78 -67 -106 50 -90 -84 -34 -221 -135 54 -45 4 62 133 -42 -10 108 -132 -120 -113 106 32 103
5300 103 59 100 91 -75 20 46 17 -186 52 24 45 39 101 -104 96 -15 104 -34 -93 66 60 -11 -40 -16 -56 64
$$ packed form
5123b9M9j21J35N9j39J76j54l23M13N7k41K7N7pJ16k5m4N3N9k27OJ15P0O3m6j39
5149d0m8O0j46K64n2j51N7o4K54k43O5j49K42j21J57j25J3J33k15J49k2q7J3K4
5173c2J02N1j05k10J32P3J05k73J33O1M0L7j53J65j5r1r0K36j07j30J6K4p4K02
5197I7j10k8JM2m9J2J32j61P0O5j03J0L4K1j4n2J86k60R1J30n0q5m6J9M7n2J05
5224E2OO9j28n3N1j77J32J66k50qJ15J79j34o0K2j1o6j68J21J74o2n5o0K52k3
5249H4p9L1q7K2J01m8Q7m5o2L5k8j40L13j01N9p8q3K37k18K1j0P6k42N9L4J76
5275A14j91J66j1j45l9J56j40ON0j87Q6J89r9M9N8P1j75L2J18k40J2PK19p4P1
5300A03m4M1rj66R5K6k9k03K38k8K1oO2k05K00j11J19j38n9J59op1k9K4m0J20
$$ plain form
5326 64 22 -16 -65 -125 -166 30 -28 -69 49 166 -52 83 14 -3 62 -19 -1 -41 -67 1 17 84 -171 2 3 155 25
5353 25 15 97 -6 2 -5 -1 -54 -5 -32 21 -73 -130 -203 85 -31 115 -138 -36 66 -54 -54 -12 -35 22 89 -27 -37 -44
5381 -44 -24 36 -12 -230 51 -38 86 -55 2 63 50 -26 -32 32 6 100 69 6 -107 -56 -1 154 4 -7 -141 23
5407 23 52 133 48 44 152 98 -59 -65 95 -23 -78 92 22 48 17 -8 19 27 85 -137 9 51 -48 138 53 -46 -10 61
5435 61 32 -59 -54 -22 -52 75 109 38 -1 -27 53 -184 -36 86 -98 8 76 26 -45 8 59 15 -50 -50 -99 -28 84 69
5463 69 10 20 -47 -25 -8 -74 37 -22 -63 59 2 38 47 14 115 -34 -76 239 -31 -16 55 -7 73 -128 -33 33 21
5490 21 4 -64 32 -168 100 30 10 0 -135 9 -125 27 54 19 76 -25 57 1 -59 -117 -40 70 -33 47 -29 -101
5516 -101 -136 19 -41 -61 113 75 -12 61 24 68 33 78 36 41 -27 -39 64 137 -213 -14 7 -141 57 -145 28 42
$$ packed form
5326F4m2l8m9o0m1J96n8m1J18J17k18J35o9j7O5q1J8m0k6O8J6O7k55J73JJ52j30
5353B5j0Q2j03QpMn3M9k7N3r4n7p3K88j16J46k53J02J02j20%M2k3N7O7j16j0p
5381d4K0O0m8k18K81q9J24j41N7O1j3p6oO4k6R4l1o3j13N1N5J55j50j1j34J64
5407B3K9Q1q5mJ08n4j57oJ60j18n5J70p0K6l1k5K7QN8k22J46M2r9J86q5r9L6P1
5435F1k9r1NL2l0J27L4p1l9k6Q0k37J48J22j84J06O8n0p1N3N1m4o5%m9P1J12j5
5463F9n9J0o7K2J7o6J11n9m1J22n7L6Rl3J01j49m2L15k70J5P1o2Q0k01R5O6j2
5490B1j7o8R6k00K68p0k0j0j35J44j34J52K7l5N7j01Q2n6o0n8P7J10j03Q0p6p2
5516a01l5J55o0k0J74l8q7P3l7M4l5M5m2No8j2J03P3l50J99K1j48J98k02J73J4
$$ plain form
5542 42 97 -159 23 -113 -40 -1 -55 137 -23 -90 125 191 48 -26 -73 95 -7 72 -42 29 132 -19 -78 49
5566 49 -22 27 -2 -22 38 54 126 30 -82 -95 39 -54 33 -75 37 -30 -64 -52 -16 234 31 75 46 -23 75 105 -32
5593 -32 -49 -112 10 -13 -24 -15 87 -14 -60 -59 -152 30 -8 -12 -72 -58 -64 -22 -22 61 -275 -89 -41 9 100 159 -151 93 0
5622 0 -96 88 3 -65 16 -34 -126 -19 43 -71 32 149 -89 -104 -10 -13 -10 -23 -30 -6 22 -21 2 3 26 111 -137 -27 -19
5651 -19 -35 73 83 62 -81 -105 -60 62 -24 116 -15 68 175 -106 -77 -105 -100 -181 -151 -161 -116 63 9 6 -105 230
5677 230 -15 -41 75 27 100 2 -114 -148 -121 0 19 9 -51 4 33 -94 45 -104 -144 -138 26 -25 20 168 -38
5702 -38 -35 124 156 23 -138 79 99 93 -145 30 -159 108 65 0 55 23 36 137 -87 9 -47 -3 54 -126 105
5727 105 157 -51 -11 -86 -34 107 -58 8 21 36 5 -7 -53 -50 -27 -42 44 -102 97 55 -57 -26 -21 -162 70 -100
$$ packed form
5542D2N5k56J82j36P3L9n4J92j60o7K15O6j43p4m7J68j02P9j14P1J03j51n9J27
5566D9p1M9k9k0O0J6P2r6j12j3J34r3Q7j08J12o7l4J2L6K50k03M4k9o9R8L0j37
5593c2j7o3J22k3j1RJ02j01m6Jr3J82l8mo0J4oM2%Q3l36J86M8N0R1N9l10K44r3
5622@r6J84q5o8Q1n0r2J07O2j14J03J17k38j5R4lLj3pK4K8m3K3JK3Q5k48J10Q
5651a9j6J08J0k1j43k4M5J22q6J40j31Q3J07k81K9k8Nq1L0j0M5J79n4lj11L35
5677B30k45k6J16m8P3r8j16l4K7J21J9j0o0N5K9j27J39j49m0OJ64n1M5J48k06
5702c8LJ59L2j33j61K17K0ok38J75j89K67m3o5N5l2J3J01k24R6n6M4N7j80K31
5727A05N2k08M0p5N2J41j65O6J3J5l1j2m6LK3j5Q6j46J99m2j12L1Nj41K32j70
$$ plain form
5753 -100 -28 5 -90 -7 25 33 -118 -106 -42 61 41 -53 48 17 -71 -96 73 -57 -79 46 -64 -58 -87 -16 -113 -20 68
5780 68 -117 -92 -198 -6 57 -21 -14 16 -52 36 -46 31 12 55 26 -71 159 -75 3 -1 -34 -100 23 -6 -179 -94 36
5807 36 128 28 -114 48 -40 -55 43 -103 31 -34 -45 -54 -92 -160 57 -62 8 -65 -77 -185 100 -43 -42 -7 70 36
5833 36 38 9 -65 -80 89 19 122 38 69 -11 -40 -5 33 164 -14 -3 54 -8 -28 -134 -80 -5 23 128 -40 70 16
5860 16 -18 13 5 7 -222 -108 -3 59 -81 58 -176 65 29 66 75 11 -69 108 103 -61 -23 88 -43 -39 -19 22 24 165
5888 165 -29 6 -76 72 64 64 59 51 27 -62 23 -32 -133 32 -35 -77 17 71 -16 4 0 -75 -3 50 73 211 -28 101 10
5917 10 -78 -80 56 103 26 22 -18 96 -34 96 116 -77 -7 -58 40 -150 60 -59 -92 31 116 15 -119 -14 -24
5942 -24 39 14 22 38 88 -64 76 8 114 -89 -125 50 -121 -66 17 213 47 -3 -130 -36 -172 43 -118 -32 51
$$ packed form
5753a00P2L3r5Q3L2Qj51J2O4J03k0r4J01l1q8k5J69j30k2J25j10Ok9P1r7R3Q8
5780F8j85K5j06J92O3p8PL0o8Q8q2P7j9M3k9r7K30k34P8ml3o6J23k9j73Q5J30
5807C6R2j00j42J62q8j5R8j46J34o5j1rl8o8K17j19P0p3j2j08K85j43JL5P7l4
5833C6Kk9p4j5J69p0J03q4L1q0k9L5L8J31j78J1N7o2k0j06N4P5K8J05j68J10n4
5860A6l4L1qKk29J14J05O2j40J39k34K41l6L7Ro4q0J77nj64L8J11j31MK0M1KJ41
5888A65j94L5q2J48q%nqk4q9Q5n5j01J65o7m2R4N4q7K0mp5P2N3K3J38k39J29r1
5917A0q8kJ36M7p7mm0J14j30J30K0j93P0n1R8j90K10j19l3J23Q5j01j34J05j0
5942b4O3k5QJ6N0j52J40o8J06k03l6J75j71N5Q3J96j66n0j27R4j36K15j61Q6Q3
$$ plain form
5967 51 -90 -38 -108 91 18 178 -17 163 -33 -106 -216 -32 54 132 50 142 -89 86 0 129 -189 -23 -43 4
5991 4 -31 109 -14 -10 -62 13 -15 -85 89 -27 141 -19 74 -41 198 -161 -23 -13 -47 131 -54 24 74 32 16
6016 16 29 27 28 132 4 124 -30 -87 -64 151 67 23 -83 -49 2 -12 -115 36 124 -103 -48 -71 -120 -89 -12 37 -11
6043 -11 45 -118 62 133 24 132 -187 -13 20 53 105 24 -7 39 2 127 98 -15 -39 14 -139 49 148 -65 27
6068 27 -39 62 -29 96 35 -147 -85 73 26 -140 140 -19 43 -21 47 12 15 -157 -143 78 106 70 -132 -7 -49
6093 -49 120 -51 -21 16 -34 -126 -125 42 127 9 8 -165 -7 41 -15 -136 0 113 54 22 131 -17 -4 15 -54 -137
6119 -137 -97 -78 -49 56 -16 -80 -13 -45 -119 -49 -10 -155 -115 -24 -52 -18 -37 -140 64 70 108 32 -88 38 20 155 21
6146 21 131 77 13 8 -6 39 -56 162 -60 7 -27 86 -6 53 15 -52 29 104 -84 -149 -66 23 -78 -41 -31 -86 63
$$ packed form
5967E1j41N2p0J99p3J60j95J80j96p3j10J84Q6P8q2R2k31J75q6J29l18J66k0M7
5991Dl5J40j23Mn2P5k8p0J74j16J68j60R3j15K39l59J38J0l4J78j85P8N0m2j6
6016A6J3kJJ04j28J20j54n7K3K15q4m4j06L4N1j4j03J51Q8k27N5k3m9L1P7M9m8
6043a1N6j63J80P1j09J08l19J74L3L3N2q1l1M6l7J25k9j13k4N3j53J88R9k13R2
6068B7o6J01r1J25o1j82O2J58m7j66K80j59O2o4O8l5Lj72J4K21K8l6k02J25m2
6093d9J69j71L0L7n0r2JJ67Q5j18jj73J58M8n6j21J36J13n9l2J09j48J3J9o9q3
6119a37M0J9K9J05p2o4O7l2p4P0L9j45M0R1k8L4j9j03K04OL8p6j20J26j8J35j34
6146B1J10n4o4nj4M5r5K18k22O7l4J13r2N9l8o7Q1P5j88o5Q3Q9j01L7J0n5J49
$$ plain form
6173 63 -13 202 -81 21 -34 -44 -25 72 179 110 82 14 -64 -17 -55 42 -17 -57 21 30 -12 -22 -59 -155 86 -60 -203
6200 -203 -14 46 25 -36 -82 -24 -88 -24 -138 89 61 -77 120 27 97 81 82 23 -134 95 212 -132 -63 -91 177
6225 177 85 89 -113 69 -94 -21 78 -20 26 68 122 24 -8 -29 -8 -105 -66 -54 10 59 66 14 -43 25 -52 1 115 -30
6253 -30 72 125 163 95 23 42 -6 -153 -29 -73 40 92 75 -91 -109 3 163 25 -127 102 -28 -148 -78 72
6277 72 -86 4 -30 7 113 109 -9 36 -58 0 -9 91 -94 -4 42 133 219 67 201 13 -14 -16 163 24 -53 38 92
6304 92 82 40 24 20 36 -8 149 -73 -4 23 58 13 111 -63 -171 -83 -73 73 15 -67 -49 63 -27 -29 -73 -23 136 -22
6332 -22 83 72 30 186 -45 -204 1 31 -173 30 -63 -175 2 54 -17 -73 -21 63 10 26 -102 9 16 6 -58
6357 -58 72 46 -58 -19 -63 9 -89 82 -11 -136 -62 -257 2 92 138 -63 86 68 -1 223 29 -58 72 -22 -106
$$ packed form
6173F3p6K15k83J02n5j0J9R7J07o9k8o8p8M7l8R7n9m0P8Rm2j0l7r6K41j46j43
6200b03J89O0k1o1m6N8o4O4j14K27k8j38J97r3P0j6Jn9j57K29J17l44O9k8K68
6225A77r2Mk02J82j63P3R9r8M6M2N4r8l2k1K1r7L9J2O4M9Pn2n7O8p7N3J14j45
6253c0J02N3L8o8p2J9m8j47J24m4J13N2j7j66j8J12J60j38j52K29j30j20P0J50
6277G2j58R0l4L7J06mj18M5r4N8rJ00j85R0M6R1Q6j52J34j88k7kJ79j39p7R1N4
6304I2j0m2j6mJ6m4J57k22O9K7L5m5R8j74j08Q8J0J46n8q2J8J12r0km4N0J59j58
6332b2J05j1m2J56k31j59K05L0k04K03r3j12J77N2p1n6N2Q4n3J6j28J11Pj0o4
6357e8J30k6j04L9m4P2r8J71r3j25P4j95K59R0M6k01J49j8o9K24j94q7J30r4q4
$$ plain form
6382 -106 17 86 140 79 -87 33 2 -131 13 65 40 62 105 2 -43 -90 -63 9 -168 104 12 138 141 -198 -18
6407 -18 83 -67 68 7 8 -113 -63 -100 35 -74 37 9 93 50 -26 -19 18 13 154 -38 169 -83 80 -55 -173
6432 -173 9 121 18 56 96 70 84 28 -62 -19 47 20 -59 -60 186 -29 -80 46 -55 -117 3 -145 -30 8 19
6457 19 -144 72 -79 3 -18 -38 20 -32 68 -152 62 31 20 -54 44 -125 65 101 57 109 24 -13 -2 84 -213 170
6483 170 -25 41 -83 89 99 -189 -20 -74 95 -68 41 69 3 -54 -173 51 81 -137 55 71 4 97 -93
6506 -93 -176 48 45 29 -10 -74 -138 -64 163 -148 101 51 13 -32 -48 -133 -94 -15 -60 -20 -104 63 -35 -9 -118 141 82
6533 82 -162 -58 14 -206 4 -109 -47 115 16 8 30 -33 -73 22 76 -53 94 -72 -22 -103 79 -3 -5 -102 104 207
6559 207 -72 1 -28 -97 132 6 69 10 77 71 142 85 33 -76 -5 65 84 46 -37 20 77 -8 99 -35 80 -53
$$ packed form
6382a06J23O9N4o1j66J20l1j33J44N2k5K2M3j03m5m7K7P2j77K72r2J26Ll39J80
6407a8J01j50J35o1Jj21N0l7J35j09J11k8Q4m3p6PL7nJ41j92K07k52J63j35j18
6432a73J82J12j03L8M0k6J4n6r0M3O6k7p9jK46k15n1J26j01o2J20j48J15L8J1
6457A9j63K16j51Q2k1k0N8n2J00k20K14l1j1p4R8j69J90L6m4N2q5l7J1Q6k97L83
6483A70j95O6j24J72J0k88J69n4J69j63J09K8o6n7j19K24L0k18J92J6o7R3j90
6506i3q3K24lj6l9o4o4P4K27l11K49n0l8m5j6q5L9P9m5M0q4J67r8K6j09K59n9
6533H2k44J04P2k20K10j13O2J62r9qK2o3m0R5N4j29J47j66N0q1J82q2kr7K06J03
6559B07k79P3k9o9K29j26O3n9O7oP1n7n2j09P1P0J9l8q3N7N7q5J07j34J15j33
$$ plain form
6585 -53 2 53 31 -2 131 50 126 179 13 133 -210 -172 -16 -90 45 15 -71 37 13 94 97 163 117 -110 -8 43
6611 43 72 228 22 121 -43 -61 84 154 66 16 -27 61 16 -212 159 62 28 -50 15 -38 105 83 -147 -4 70 -89
6637 -89 209 -27 47 -81 7 -96 119 102 -132 6 -156 -82 -113 -118 -26 -21 28 38 134 17 91 52 -24 -119 -157 -157 5
6664 5 -21 2 34 57 -104 44 20 -141 174 12 -141 -71 -91 126 -15 125 84 40 -20 233 -73 -20 -76 -111 14
6689 14 -36 -7 -45 -30 -19 -60 47 121 -11 69 -1 -61 -38 -142 -16 -93 81 34 -92 -37 165 -70 -193 145 34
6714 34 40 -2 145 -9 -106 78 -34 42 -128 7 94 -99 -36 -173 -59 40 75 -66 90 -47 -77 50 -95 -54
6738 -54 -88 -87 29 83 -88 -87 -93 -101 105 4 92 -54 68 -33 79 -189 -25 88 -45 18 -128 -6 97 -50
6762 -50 96 -130 -93 152 62 -11 -7 162 -271 47 10 203 -61 47 11 -121 46 -59 40 -88 196 169 98 96
$$ packed form
6585e3N5N1k2l3J33q1P6N3j66J20l43L8J56p4J35l0q6J08k4Q1LO6m6k27J02N1
6611D3K9J56k06R9j64j8J45P0q8n0m3Q8m5k28L71r7l4p8O5n3J43k2k30J43P4j59
6637h9K98k36P4j28Q8j03K15j7k34J38j62P4l1nR2NM9J0R6j17P4l9p6r5l8%J62
6664Ek6K3L2K3j61J48k4j61L15j62j53P0k0K17j41J40m1m4o0K53l06N3n6l5J25
6689A4n0K9l8J5J1m1J07P4j32Q0p0o0K3j04J26p7J74m7j26N5K02k35j23L38j11
6714C4Om2J47j54r7J84j12P6j70J35Q7j93O3j37J14R9L5j41J56j37l0J27j45M1
6738e4l4JJ16N4j71JoqK06j01Q8j46J22j01J12k68J64J13j33O3j46J22J03j47
6762e0J46k26L7K45r0p3MJ69m33L18l7J93k64J08l6j32J67j05R9j28K84k7p1k
$$ plain form
6786 96 41 -22 -35 -32 47 5 -208 155 -9 263 72 70 217 128 61 36 -199 35 200 51 -48 77 51 99 88 -7
6812 -7 -32 -26 72 95 -52 61 -15 -55 -67 83 -97 -52 -148 -50 154 -65 -69 -10 -86 -111 83 20 102 -1 -113 7 110
6839 110 47 93 54 -51 -64 105 -135 2 88 -76 24 12 126 54 -119 45 -60 166 40 -140 -107 70 -77
6862 -77 -170 -92 43 46 -73 145 -66 177 -151 -11 24 -84 157 -48 -147 -41 -72 -78 -13 -40 -25 -61 -66 8 -218 -113
6888 -113 -33 -14 69 -30 -22 -47 3 47 20 -8 11 43 34 15 -40 125 -122 -17 -97 186 -59 74 103 -55 34 -8 -49
6915 -49 -36 -30 -56 -93 142 157 68 49 57 21 -80 -36 -31 -51 121 -140 -20 -21 -77 42 114 -144 10 148 0 -51 -97
6942 -97 10 60 -172 78 200 -80 55 -19 -4 -86 62 91 0 -82 2 -54 4 70 -80 -1 121 -114 -42 80 187
6967 187 -38 -46 -83 35 -156 -82 -77 80 -134 120 119 -40 -78 -263 -10 -116 38 145 -227 3 -18 10 33 153
$$ packed form
6786I6n5o3j3LP9m2k13L63j64K72j91kJ47q9o7k5k35K34J65j49r9J25k6M8j1r5
6812gk5OR8K3j47J13p6m0j2J50j80M5r6R8K04k19mN9p6k5J94o3Q2j03j12J20J03
6839A10o3M6l9j05j3J69k40J37Q6j64J00j2J14p2j73J64j05K26j26j80L3J77j47
6862g7r3P8J35Lj19K18k11K43l28J40L5j08K41k05r9J06l1oO5k7J5l6nP4k26J05
6888a13Q0J9Q3r9Qk5N0M4k7k8J9L2rj9n5J65k47J05q0K83k45J33K9j58Q9m2m1
6915d9J3Ok6l7K35J5q9j9Ql6j01M4Nk0J72k61J20jn6J19P2k58J54J38j48n1m6
6942i7J07N0k32K50J22k80J35p4J5q2J48K9r1q2Q4n6N8O6j50P9J22k35P2J22J07
6967A87k25ql7J18j91P4NJ57k14K54jj59l8j85K53j06J54J07l72K30k1K8K3J20
$$ plain form
6991 153 177 -45 89 218 -73 -33 49 -16 -15 102 22 -58 -47 32 -52 50 11 52 48 -33 -62 86 -101 -54 -85 -17 33
7018 33 -60 8 70 57 -63 4 22 -35 -101 -104 38 90 54 -8 -4 15 -132 148 -113 16 -107 106 74 -137 -97 102
7044 102 65 6 -18 13 -104 37 104 -81 24 -33 -14 38 33 -20 -135 -68 -71 9 85 52 100 13 5 -66 91 -79 -138 98
7072 98 -68 -97 29 -19 43 121 -34 -44 45 -205 38 -26 -86 -95 38 18 66 -109 43 -85 -177 3 -147 58 140
7097 140 -60 -18 35 112 45 151 82 40 -66 -173 45 114 60 3 -196 -128 128 6 -123 60 -10 83 0 83 -67
7122 -67 19 -81 110 -197 -99 -38 125 152 79 -29 -56 88 146 33 44 -8 117 36 24 174 -94 -181 41 61 79
7147 79 -115 -97 -123 31 86 -4 -14 -145 91 -81 -77 -4 -18 -50 10 47 -1 25 -180 -11 71 7 23 -47 -55 101 172
7174 172 3 -54 -29 -13 -143 -49 -14 16 -23 136 184 -70 -12 -56 138 -13 157 4 284 62 -26 -51 18 -101
$$ packed form
6991A53K4k22J34J29k91M0Q2o5JJ17q0q0J1P9q4J02l9M1mq1k9J48j87M7l1O8N0
7018C3r3O8O2j3j20O7J8n7o6lJ42N2l6o2MJ9j47K80k61J29j23K13l2k11M0J99
7044A02l7n9k4L1j17J41O7j85J05n7J9N2nn3j15O7lQ0P6l3M8q7qp1J57j70n9K36
7072I8j66k9J26m8O2P8j55j0Q9k50K43o4o0rJ33k0M8j75J52j28r2J80j50K05Q2
7097A40k00M2N3P7o7J06o9m2j06j07K18O9n4n7j99O8K56j22j29J83p0R3q3Q3j50
7122f7Q6j00J91l07R8O1J63K7p3j08k7J44N8j13J1n2J25q1j2J50k68q7K22K0J8
7147G9j94J8k6J54N5r0j0j31K36j72MP3j4l2O0L7m8K6k05J69Q2o4J6p0qJ56P1
7174A72j69n7K5J6j30R4L5L0l9J59M8k54N8m4J94j51J70j53K80k22q8k5O9j19
$$ plain form
7198 -101 -96 -125 -10 146 139 90 134 44 -123 -13 -178 -256 -91 -111 -225 5 63 117 -92 33 -116 -23 160 149 -32
7223 -32 -97 204 8 -101 -28 43 -4 64 -3 -76 -73 -14 189 -51 -83 -12 -25 -170 35 -85 -132 -36 25 -52 26 -21 4
7250 4 19 -5 -28 -9 30 35 87 82 -66 107 -51 5 75 -87 23 141 -32 -51 -52 71 -122 -59 -88 21 103 -42 -68
7277 -68 -27 57 -127 -66 0 -12 17 -110 -10 -83 162 75 113 69 21 139 -12 11 140 -89 -76 240 60 60 38 -28
7303 -28 35 165 18 -149 43 4 -123 63 70 -90 197 -34 28 -164 -20 100 -216 -49 42 77 -29 -34 113
7326 113 -45 -36 -2 34 -42 42 -44 -90 41 -59 110 -20 -29 -61 -20 -38 -99 71 77 1 49 115 5 -90 7 -119 -95
7353 -95 64 -122 -83 128 -51 16 21 -103 129 128 113 -179 -57 -44 81 -155 -87 67 60 32 92 -190 -95 -52 10 53
7379 53 -4 -39 107 56 22 73 1 63 16 -42 173 -51 1 18 0 32 84 96 -118 -118 22 10 -12 -118 -48 -104 -53 87
$$ packed form
7198a01Nk9J15J56pm9M4r0j67J10j65p8J65k0j14K30N8N4k09J25j49R3J83j1j81
7223c2o5L01j96j09P3P1m7O8o7p3LN9K03k40l2P1j3j45K05j20m7R6O1p7P8m7K5
7250DJ5k4k3J9L9NN2nj48J73j58N6P0j62J10J18j73j9jJ23j93O3k9J09Q2j45k6
7277f8M1Q4j84O1O6j2K9j27J00p3K45q7L8m4m8J18j51K3J29k29J3L16j80%k2o6
7303b8O3J30j47j67J92l9j27J86Pj60K87k31O2j92J44J20l16J67R1L5j06nJ47
7326A13j58RL4L6p6Q4q6m6J31j00J69j30rl2M1j8o1J70Op6M8O6j10r5R7j26K4
7353i5J59j86L9K11j79O7Nj24K32jj5k92J22J3J25k36O8J54pk8O0k82R5M3O2M3
7379E3n7l5J46n1l4N1p2O2m7n8K15k24N2J7j8L2N2J2k14%J40j2k2j06P0n6N1J40
$$ plain form
7407 87 -15 -31 61 6 -18 -85 66 -4 69 129 -31 -67 76 -85 -83 77 -24 -58 -57 5 -57 61 12 -27 -170 -98 -34
7434 -34 21 -33 91 -122 78 -107 41 -16 -124 -21 128 39 -35 -79 63 -37 101 153 -59 -43 -58 65 -181
7457 -181 -95 105 -34 -73 12 35 99 164 85 36 -52 -35 -160 71 28 -18 -48 -109 12 19 -38 -69 -55 -27 -22 16 5 32
7485 32 -25 -151 128 -14 -96 105 -77 127 68 -63 75 80 80 -108 -93 -103 -7 -170 61 -61 -105 5 -61 -12 -66
7510 -66 -8 12 64 -84 -89 -15 -49 121 -79 49 -91 -56 51 -176 159 -74 -55 -22 -69 -1 86 -105 -60 -188 35
7535 35 33 28 -48 -22 70 69 -56 36 -51 45 100 -113 63 -25 118 -107 103 -8 57 -39 -59 -14 -157 133 64 -86 -25
7562 -25 121 -177 60 37 -164 -176 -79 45 -82 -88 12 -94 12 119 -18 -76 16 103 127 -37 105 -146 -23
7585 -23 64 23 145 -4 -17 -138 94 -57 60 44 51 -13 81 20 45 -11 124 -70 3 14 -51 69 -130 -41 -55 -18
$$ packed form
7407H7j02j6R2n5k4o7J51p0P3O0j60l6J43j61KJ60j01l4JO2o2J18m9l9j43P2O4
7434c4N5n4J24k13K00j85J48n7j08J03J49q9p4m4J42j00J38N2k12J6j5J23k46
7457a81Q6K00j39l9Q5K3O4O5p9m9q8J7j25K31m3m6l0o1J21Pn7l1J4K8NL8j1K7
7485C2n7j26K79j42q2K01j82K04n9j31J38N%j88J5j0R6j63K31j22m4J10o6M9n4
7510f6N8K0N2j48nP4l4J70k00J28j40L5J07k27L35k33J9L3m7O8Q7j91M5j28K23
7535C5knp6K6R2jj25R2q7R6N5k13J76q8J43k25K10j11O5r6k0M5j43K90o9j50O1
7562b5J46k98K37k3k01j2R7J24j27oJ00j06J06J07j37n8R2Q7K4j64J42k51J23
7585b3Q7m1J22j49j3j21K32j51J17j6Po4R4o1K5n6J35j94P3J1o5J20j99Q9j4L7
$$ plain form
7611 -18 7 50 -131 -121 -1 -47 -47 45 -131 24 -91 -120 89 -22 -44 -22 170 39 -85 120 113 -185 64 74 75
7636 75 53 -84 115 2 12 22 110 99 38 -40 6 -47 -123 51 88 44 -146 -87 -8 134 133 136 -105 -149 51 22 57
7663 57 -84 -165 -57 39 -86 28 26 60 -132 -74 0 -82 82 -239 61 117 18 56 95 78 -143 -60 -23 17 -79 -8
7689 -8 49 -15 -2 180 44 18 -1 -155 1 112 -30 90 -43 -133 -11 -19 120 14 -32 -81 -63 9 24 -15 38 35
7715 35 -158 141 -22 70 122 -98 48 71 9 -16 19 -112 -48 93 -120 -60 -83 54 -14 148 52 -23 -63 -62 25 143
7741 143 -132 26 41 -91 -40 9 7 -15 37 -35 -83 -13 118 -50 106 123 54 -145 -36 -18 -15 27 54 28 -72 -12
7767 -12 -93 -20 -72 24 -20 -10 77 -112 -172 -158 -41 -56 94 56 -75 22 107 -12 5 -29 -33 -48 81 113 1 46 19
7794 19 -71 39 4 22 9 -120 -92 44 83 -21 -122 -1 -42 -72 -53 -96 91 -51 -128 59 45 4 138 143 -18
$$ packed form
7611a8K5M3j81J0J20m6%R2j76J55j15k9K09j11k2K2J92j31j24K05pk98K49J0J
7636G5k2j37J99j13J0J0Q8j1o1p8M6n3p6J74L7m4j90N9P9J42jLk41m4K00k9L5
7663E7j41q1J08R6j25J14kL4j92N8P4q2J64l21L00N6r9L8L9j7k21Q3L7M0r6P1
7689hN7o4J3J82j36k6j9j54J56J11j42J20j33r0J22qJ39j06m6m9J8P2J5l9N3l
7715C5j93K99j63R2N2k20J46K3o2k5L5j31O4J41k13O0k3J37o8J62r6p5m0JQ7J18
7741A43k75J58J5j32N1M9kk2N2p2m8P0J31j68J56J7o9j99J09J8LM2K7k6j00O0
7767a2q1P3n2R6m4J0Q7j89o0J4J17j5J50l8j31R7Q5j19J7l4mj5J29L2j12M5k7
7794A9r0J10l5J8j3j29K8J36L9j04j01J21m1l0J9m3J87j42p7J87j4m1J34Nj61
$$ plain form
7819 -18 20 -149 70 -104 111 95 -78 50 -161 82 68 -20 -160 126 -33 36 -82 -30 -148 13 31 -24 -128
7842 -128 -99 -47 72 -7 -136 76 -228 20 144 -111 -47 49 110 22 -123 -55 27 -115 -66 37 -70 -17 -4 -75
7866 -75 27 -35 24 -83 111 -89 35 80 129 52 3 127 63 7 18 65 -45 60 -90 -91 28 96 -1 1 -77 -33
7892 -33 91 120 -6 -13 -17 115 -160 -117 -46 3 -12 38 -21 36 -152 -20 -71 -106 -43 -39 42 91 -4 -1 28 58 106 44 76
7921 76 -60 17 -77 -33 72 16 181 -149 -37 -97 35 66 90 -58 -65 -2 -17 125 -60 95 -57 13 -58 32 -64
7946 -64 -92 -95 89 -155 59 -188 121 81 -55 -3 -74 11 -47 59 40 -64 -12 -122 88 3 11 -16 -109 -108 -53 -34 75
7973 75 -44 187 -42 91 -35 70 149 -28 64 139 -69 -13 48 29 41 -65 -124 -99 131 163 112 -214 -186 -14
7997 -14 -135 58 -13 134 36 -98 -1 6 135 -57 0 120 -14 -36 209 93 -105 145 120 25 -72 10 -7 -29 112
$$ packed form
7819a8L8j69K19j74K15j6j73J28k11K43j4q8j40K86j59O9j18N2j18J61J8n5j04
7842a28K9N2J19p9j29K12l04K48J24k55O4R6O1q8j45O8Q2j42M9J03j07N3J3p1
7866g5J02o2N9j07J94k00J24M5M9p7m9J24o4n6J1M7j10J05j50jJ19O8r7Kp8M4
7892c3J24K9j26pmJ32k75M3P1M9j5N0n9N7j88J32n1l5O3MQ1M9r5LK9L0M8o2L2
7921G6j36P7r4M4J05n6J65l30J12o0J32L1K4j48pO3j5J42j85J55j52P0p1R0r6
7946f4k8lJ84k44K14k47L09m0j36N2p1Q5n8J06j9j04N2j10K10q5Qk7r3JN5J9J09
7973G5j19K31k29J33j26J05P9j77R2P5k08N6O1j9J2j06n9K5K30L2n1l26K8J72
7997a4j21J93p1J47r8j34R7PJ29j92N7J20j34k2K45j16j98K50k5r5r7Q2j7k2J41
$$ plain form
8022 112 113 47 -168 29 43 -14 -16 47 135 -61 -85 -114 21 21 55 71 26 96 37 26 99 46 -215 -95 0 -28 -73 -5
8050 -5 177 -2 114 -166 21 -68 -134 70 -30 0 -11 -22 64 119 98 -113 5 -17 79 -99 -31 -12 -99 81 2
8075 2 102 63 -41 151 15 34 40 -46 -87 -18 -4 64 55 -27 -27 14 -78 45 39 26 45 158 52 23 59 -60 24 -37 -81
8104 -81 141 113 50 5 77 -67 -76 -54 141 27 85 -76 -111 138 -124 -49 -66 -41 55 -19 -74 -106 -39 77 59 -156
8130 -156 -5 -85 91 -14 85 13 -88 -154 -16 -148 -52 -71 -44 -48 144 -9 -28 61 97 118 -64 -25 34 -73 3
8155 3 -71 -33 108 -136 94 58 -51 -7 17 122 -103 12 58 21 69 -178 16 -28 -22 -17 87 -121 -15 -21 0 -130
8181 -130 -80 115 -81 33 -23 28 -92 77 26 -79
$$ packed form
8022A12Jo6k15J97J4n7kO3Q8j96k4k9J35%L4J6m5P0n9j1P3n3k61J20R5k8m5O8
8050eJ82j79J16k80J87q9o6K04j00L0j1j1Q6N5k1k11J18k2R6j78O8J9q7J80p9
8075BJ00l9j04J92j36J9Oq6m1O9J4O8rq2%M1r2J23oj3J9J13j06k9L6j19Q4o1m4
8104h1K22k8o3m5P2j44rK2J95j14N8j61l5K49k62P5j7K5R6p4n5l2O7J16j8k15
8130a56J51q0J76j05R9p2j01o6J38j32R6j9K7mJ92j53j9Q9L6K1j82L9N9j07P6
8155Cp4L8J41k44K30l6j09M4K4J05k25J15M6l7M8k47J94m4ONJ04k08J06oK1j30
8181a30N0J95j96J14n6N1j20J69n1j05
8191g9
$$ Imaginary data points
##PAGE= N=2
##DATA TABLE= (X++(I..I)), XYDATA
$$ plain form
0 0 0 0 0 0 0 0 0 0 0 0 0 0 0 -8 8 -8 8 -8 16 -16 16 -24 24 -32 32 -40 48 -56 64 -72 80 -92 104 -117 133
35 133 -149 165 -186 206 -230 255 -286 313 -348 384 -425 467 -515 566 -625 689 -761 838 -925
54 -925 1023 -1137 1264 -1414 1588 -1799 2054 -2374 2788 -3345 4132 -5335 7375 -11478 22864
69 22864 -118440 -370563 54685 291110 -19200 -251205 -28819 162666 81290 -8594 -19329
80 -19329 -72242 -12521 124935 43517 -179806 -124869 145880 149481 -103519 -117530 89327
91 89327 120040 -20663 -75855 -36438 -5815 24115 33944 -57060 -92660 62173 140857 -15291
103 -15291 -108282 13229 89861 -13534 -71507 -6388 -1519 -22654 43814 49689 -45778 -32708
115 -32708 85486 60742 -87294 -66185 70771 21115 -94907 -14837 85725 -3272 -72095
$$ packed form
0@%%%%%%%%%%%%%qJ6j6J6j6K4l2L2m0M8n6O4p2Q8j04J20j36J52j72J96k21K50
35A33k82L14l51L92m36M85n41N99o61P32q09Q92r82J081j191J314j450J599j763
54i25J948k160K401k678L002l387L853m428N162o133P477r467J2710j8853L4342
69B2864j41304k52123M25248K36425l10310k32005K22386J91485q1376q9884j0735
80a9329n2913N9721J37456q1418k23323N4937K70749L601k53000j4011K06857
91H9327L0713j40703n5192L9417L0623K9930R829r1004l5600J54833P8684j56148
103a5291r2991J21511P6632j03395n7973O5119M869k1135O6468N875r5467J3070
115c2708J18194k4744j48036K1109J36956m9656j16022Q0070J00562q8997o8823
$$ plain form
126 -72095 52457 101405 -65274 -105408 67609 83048 -89417 -100846 60826 83653 -37569
137 -37569 -38110 47044 26587 -14816 11223 61 -48473 -18665 47429 8790 -59046 1901
149 1901 72815 14859 -39921 727 26973 -15639 -31052 6814 -3916 -35565 12415 46680
161 46680 -7779 -29475 25636 37564 -24187 -35192 15982 2428 -35324 5221 34386 -8438
173 -8438 -19645 33263 39443 -25145 -30668 24898 7614 -39613 -8547 26406 -7694 -24890 31055
186 31055 45633 -31464 -42488 39230 37116 -49607 -55814 24872 44257 -18068 -30330 16823
198 16823 27194 11913 1820 -18272 -20612 11820 24646 -19093 -45073 14145 54958 3011
210 3011 -34905 2219 33867 6121 -26597 -14879 -1686 -5442 7961 7274 -17780 -6925 31344
$$ packed form
126g2095J24552M8948j66679m0134J73017J5439j72465j1429J61672K2827j21222
137c7569n41Q5154k0457m1403K6039j1162m8534K9808O6094l8639o7836O0947
149A901P0914n7956n4780M0648K6246m2612j5413L7866j0730l1649M7980L4265
161D6680n4459k1696N5111J1928o1751j1005N1174j3554l7752M0545K9165m2824
173h438j1207N2908O180o4588n523N5566j7284m7227L1066L4953l4100j7196N5945
186C1055J4578p7097j1024Q1718k114q6723o207Q0686J9385o2325j2262M7153
198A6823J0371j5281j0093k0092k340L2432J2826m3739k5980N9218M0813n1947
210C011l7916L7124L1648k7746l2718J1718J3193l756J3403o87k5054J0855L8269
$$ plain form
223 31344 25030 -24424 -29504 18473 19047 -23973 -22587 7128 13074 5480 5495 3946 -4549 6840
237 6840 20524 -10195 -33013 1136 24670 -3849 -26601 3671 32369 4348 -17911 3762
249 3762 9752 -8789 -12462 -1228 -2167 -10963 3065 15635 -2342 -5859 13229 9315 -9144 -8737
263 -8737 3515 -723 -12289 1627 11951 -3437 -1638 15895 10969 -9238 -9942 9063 4452
276 4452 -19157 -10209 10242 4667 -5277 277 9276 3107 -4282 2278 -2634 -13171 -1467 5954
290 5954 -5493 -8011 7064 15845 601 -7225 7392 6458 -6966 -5461 -877 -2110 -3087 3441
304 3441 7793 -2068 -1527 11876 4691 -10382 -7695 2608 1465 -10463 -7040 6704 3483 193
318 193 4094 443 -1115 2270 1449 -6471 -10307 3283 8441 -5298 -3922 9709 9797 -41 -4535
$$ packed form
223C1344o314m9454n080M7977N74m3020J386K9715N946p594J5j549q495J1389
237F840J3684l0719k2818L4149K3534k8519k2752L0272K8698k8021k2259K1673
249C762N990j8541l673J1234r39q796J4028J2570j7977l517J9088l914j8459M07
263h737J2252m238j1566J3916J0324j5388J799J7533m926k0207p04J9005m611
276D452k3609Q948K0451n575r944N554Q999o169p389O560m912j0537J1704P421
290E954j1447k518J5075Q781j5244p826J4617r34j3424J505M584j233r77O528
304C441M352r861N41J3403p185j5073K687J0303j143j1928L423J3744l221l290
318A93L901l651j558L385q21p920l836J3590N158j3739J376J3631Q8r838m494
$$ plain form
333 -4535 2450 2971 -6498 -4270 -53 -2631 205 3550 2996 -151 -801 4904 378 -8965 -3394 1224
349 1224 -3242 -4506 370 5659 2357 -560 5440 2661 -3374 -296 -12 -2943 -3168 234 4882 648
365 648 -538 5933 3594 -1498 -2078 -1455 -682 -4550 -4245 1012 -915 -560 4214 1811 -781 -480 1576
382 1576 365 -6466 -4019 2707 52 -923 1515 2743 4609 2599 802 -306 -2897 219 571 -3469
398 -3469 -2339 109 3514 4746 -1276 -2230 1441 2474 581 -7318 -7852 2463 4795 -1767 -6295
413 -6295 -6 10677 4885 -6180 -3947 1644 3736 37 -5836 -3186 2836 7167 5247 -4947
427 -4947 -4143 7074 7452 -3023 -11580 -4588 9137 3830 -8305 -6163 4541 9827 702 -7730
441 -7730 -3071 1654 2692 -232 -7132 -4792 3933 7522 3285 -5902 -3282 8400 7328 -3615 -10048
$$ packed form
333d535O985N21r469K228M217k578K836L345n54l147o50N705m526r343N571M618
349A224m466j264M876N289l302k917O000k779o035L078K84k931k25L402M648m234
365F48j186O471k339n092n80O23P73l868L05N257j927L55M774k403k592L01K056
382A576j211o831K447O726k655r75K438J228J866k010j797j108k591L116L52m040
398c469J130K448L405J232o022r54L671J033j893p899n34J0315K332o562m528
413f295O289J0683n792j1065K233N591K092l699n873K650O022M331j920j0194
427d947Q04J1217L78j0475q557O992J3725n307j2135K142J0704N286r125q432
441g730M659M725J038k924o900K340Q725L589m237r187K620J1682j072j0943o433
$$ plain form
456 -10048 -2398 9580 3646 -7288 -3845 4778 7067 802 -4440 -1235 -1082 -1211 2488 -1707 -7758
471 -7758 -3650 7597 9694 -6052 -11999 5883 12997 -1666 -13437 -4716 9596 5490 -4735
484 -4735 -2959 928 4270 7075 1945 -6534 -7759 4512 12447 -3941 -17333 -2137 16413 9375
498 9375 -13241 -13318 9799 13686 -4683 -13647 -5274 7341 6697 -2623 -5829 -3717 5084 12057 1362
513 1362 -12213 -7643 10619 14348 -8138 -18910 3955 19889 4797 -15074 -8006 13289 9981
526 9981 -8163 -9360 -125 3364 1132 -538 -1125 -5589 -1001 11389 4933 -12822 -9786 9697
540 9697 12915 -8597 -15595 5513 14213 463 -7555 -1173 5464 2137 -446 1562 -4597 -6534
554 -6534 5497 9797 -3090 -12819 -51 16015 4321 -14645 -8534 7454 9011 -4466 -10995
$$ packed form
456a0048P650J1978n934j0934L443Q623K289o265n242L205J53j29L699m195o051
471g758M108J1247K097j5746n947J7882P114j4663j1771Q721J4312m106j0225
484d735J776L887L342K805n130q479j225J2271P935j6388j3392J5196J8550p038
498I375k2616p7K3117L887j8369q964Q373J2615o44r320l206K112Q801O973j0695
513A362j3575M570J8262L729k2486j0772K2865J5934j5092j9871P068K1295l308
526I981j8144j197R235L489k232j670n87m464M588J2390o456j7755L036J9483
540I697L218k1512o998K1108Q700j3750q018O382O637l327k583K008o159j937
554f534J2031M300j2887r729J2768J6066j1694j8966O111J5988J557j3477o529
$$ plain form
567 -10995 -843 6605 5078 308 -5906 -4360 4598 8655 1180 -12183 -7366 12706 12348 -7854
581 -7854 -14526 3963 18804 2911 -16299 -6947 10718 9010 -6289 -11112 644 7427 2733
594 2733 -1667 -5096 -3531 4306 6371 -1835 -11305 -4101 11862 6865 -9796 -8153 7002 11564
608 11564 -1648 -9871 93 6853 2055 -2676 -3572 268 2661 2546 1710 -3517 -3724 3722 3745 -2938
624 -2938 -6095 -1642 4855 1212 -3908 -1698 1097 2673 1098 -2003 -1027 -697 161 2835 292 -3083
640 -3083 -1246 3617 5832 -1585 -6196 1554 6515 716 -5995 -4306 4546 4704 -2930 -3854 -94 3330
656 3330 1868 -2512 -2769 -1408 695 2877 -1219 -5016 -55 4761 3431 -3222 -4413 3366 5047
671 5047 -1084 -4086 -1456 3729 3263 -2157 -1825 623 2525 2405 -1877 -3250 49 1869 625 -3483
$$ packed form
567a0995J0152P448j527m770o214J546Q958M057p475j3363M817K0072l58k0202
581g854o672J8489J4841j5893j9210R352J7665j708j5299m823J1756O783m694
594B733m400l429J565P837K065q206r470P204J5963m997j6661J643J5155M562
608A1564j3212q223R964O760m798m731q96L840K393j15q36n227k07P446K3o683
624b938l157M453O497l643n120K210K795J576j575l101R76L30Q58K674k543l375
640c083J837M863K215p417m611P750M961n799o711J689Q852J58p634r24L760L424
656C330j462m380k57J361K103K182m096l797M961M816j330o653j191P779J681
671E047o131l002K630N185m66n420L32K448J902j20m282j373L299J820j244m108
$$ plain form
687 -3483 -2608 2837 2034 -1778 -1799 -23 1767 85 -2051 -356 138 627 744 -578 864 1105 131
704 131 1461 85 -628 116 -270 572 162 -1220 598 943 303 -70 -1290 75 608 -1474 -802 -693
722 -693 -391 621 -548 -257 448 123 1151 -246 -804 746 46 96 435 -466 911 828 224 804 -388
741 -388 30 911 -616 -505 -1061 -226 1220 -1109 -1660 928 867 -542 -1669 -666 1534 -772 -1657 305
759 305 417 876 104 -481 1131 740 278 211 -1149 428 1487 -269 -516 55 1072 845 -1469 -353
777 -353 1004 -638 -740 -797 -505 94 -759 -254 146 -827 675 394 -705 240 -209 211 416 -833 508
796 508 1036 253 768 -166 519 988 -477 -97 -91 -302 584 -328 -691 362 -142 262 -620 -959 302 -259
816 -259 -750 -185 -665 272 523 -703 355 325 303 548 -551 428 733 -500 288 410 31 798 14 777
$$ packed form
687c483Q75N445q03l812k1J776J790j682k136J695M94M89J17j322J442K41r74
704A31J330j376p13P44l86Q42m10j382J818L45o40l73j220J365N33k082O72J09
722f93L02J012j169K91P05l25J028j397n58J550p00N0L39r01J377q3o04N80j192
741c88M18Q81j527J11n56Q35J446k329n51K588o1j409j127J003K200k306q85J962
759C05J12M59p72n85J612l91m62o7j360J577J059j756k47N71J017k27k314J116
777c53J357j642j02n7K92N99q53N05M00r73J502k81j099R45m49M20K05j249J341
796E08N28p83N15r34O85M69j465L80Ok11Q86r12l63J053n04M04q82l39J261n61
816b59m91N65m80R37K51j226J058l0k2K45j099R79L05j233P88J22l79P67p84P63
$$ plain form
836 777 373 -762 180 332 -590 -442 -741 192 316 -939 129 -121 -322 469 -299 -952 -69 210 759
855 759 -490 -639 1448 653 -253 291 -199 634 213 -427 421 -611 -26 942 -361 -605 -128 318 586
874 586 -1252 -1236 853 -94 -375 -591 -793 981 604 -254 -234 -256 1123 696 -836 134 378 298 728 -95
894 -95 -215 439 433 800 -451 -1381 559 629 -320 -1124 -906 1223 273 -1364 -268 -88 -216 207 -520 -91
914 -91 -545 -120 1919 -17 -1323 355 1333 1234 -976 -1292 1556 1438 -124 -608 -697 1234 1174 -626 -851
933 -851 -647 395 1000 -1067 -1200 -465 -65 1081 -306 -2036 -298 1585 1627 -1520 -2984 1874 2916
950 2916 -1267 -2202 482 2594 598 -1735 600 929 -477 629 581 -1014 -1544 503 2708 -764
966 -764 -3721 532 3007 -457 -3210 -1247 2631 597 -2290 -178 566 -37 84 548 576 -1081 -836
$$ packed form
836G77m04j135R42J52r22J48k99R33J24j255J068k50k01P91p68o53Q83K79N49
855G59j249j49K087p95r06N44m90Q33m21o40Q48j032N85R68j303k44M77M46K68
874E86j838J6K089r47k81k16k02J774l77q58K0k2J379m27j532R70K44q0M30q23
894i5j20O54oL67j251r30J940P0r49q04K18K129r50j637J096J80j28M23p27M29
914i1m54M25K039j936j306J678R78r9k210l16K848j18j562m84q9J931o0j800k25
933h51K04J042O05k067j33P35M00J146j387j730J738J883M2l147j464M858J042
950B916m183r35K684K112j996k333K335L29j406J106m8j595n30K047K205l472
966g64k957M253K475l464k753J963L878k034k887K112P44o03J21M64K8j657K45
$$ plain form
983 -836 2504 1065 -2188 -1329 1785 2767 -877 -2977 919 2494 124 -1693 -1290 1074 911 -1062
999 -1062 -402 -344 -1050 441 966 -275 -2345 -1105 3202 1463 -3651 -2174 3115 3123 -2109 -3431 2441
1016 2441 3115 -1191 -1473 532 697 -183 293 1330 -1501 -1984 2429 2406 -2564 -3179 1307 3573 -1337
1033 -1337 -4054 719 2568 -235 -1779 -880 1111 536 -442 478 -597 -676 1222 999 -124 -1196 -148
1050 -148 2567 1059 -1622 -1019 739 1894 -235 -2394 -20 1546 81 -864 -947 412 229 -832
1066 -832 430 79 -1560 -148 1478 573 -1694 -1350 2443 1753 -1926 -1021 1413 1487 -564 -1254 774
1083 774 392 -613 1163 457 -1378 -561 1318 1049 -1884 -2151 1723 1375 -1606 -1360 289 1214 68
1100 68 -1018 -132 116 346 839 -774 -727 828 1040 468 -737 -234 1173 434 -50 -459 -820 529 924
$$ packed form
983h36L340j439l253Q59L114R82l644k100L896J575k370j817M03K364j63j973
999a062O60N8p06J491N25j241k070J240M307j739n114J477N289Qn232j322N872
1016B441O74m306k82K005J65q80M76J037k831m83M413k3m970o15M486K266m910
1033a337k717M773J849k803j544Q99J991n75r78R20j075p9J898k23j123j072J048
1050a48K715j508k681O03J758J155k129k159K374J566j465r45q3J359j83j061
1066h32J262l51j639J412J626r05k267L44L793o90l679R05K434P4k051o90K028
1083G74l82j005J776p06j835Q17J879k69k933k67L874l48k981K46J649R25j146
1100F8j086Q86K48K30M93j613M7J555K12n72j205N03J407p39m84m09l61J349L95
$$ plain form
1119 924 -599 -857 -477 1188 440 -1783 -497 691 -131 -636 -539 429 -64 -608 768 317 -1214 307
1137 307 1079 110 -772 -283 1512 465 -1243 301 837 -381 -50 127 603 -708 -570 1185 138
1154 138 -1330 -36 755 -57 -940 -362 824 -524 -834 555 -323 -678 278 389 207 -644 313 1393
1172 1393 -181 -473 714 252 45 -83 115 483 -328 290 504 -951 -325 565 -294 -501 -504 231 158 -871
1192 -871 51 198 -719 118 236 -226 -105 43 736 -61 -687 917 556 -551 -70 430 486 -340 -170 837
1212 837 -261 -750 454 282 -646 -392 17 499 -833 -660 762 -60 -927 115 439 129 -571 107
1230 107 866 -558 -296 933 148 -320 74 578 527 -760 180 939 -479 -295 338 12 -180 -549 204
1249 204 -40 -1055 4 351 -730 -329 210 66 -163 -519 576 193 -659 433 304 -274 230 314 568
$$ packed form
1119I24j523k58L80J665p48k223J286J188q22n05R7R68m93n44J376m51j531J521
1137C07P72r69q82M89J795j047j708J544N36j218L31J77M76j311J38J755j047
1154A38j468J294P91q12q83N78J186j348l10J389q78l55R56J11j82q51R57J080
1172A393j574k92J187m62k07j28J98L68q11O18K14j455O26Q90q59k07lP35p3j029
1192h71R22J47r17Q37J18m62J21J48O93p97o26J604l61j107M81N00N6q26J70J007
1212H37j098m89J204j72r28K54M09M82j332J73J422q22q67J042L24l10p00O78
1230A07P59j424K62J229p85m68L94N04n1j287R40P59j418J84O33l26j92l69P53
1249B04k44j015J059L47j081M01N39j44k29l56J095l83q52J092j29n78N04Q4K54
$$ plain form
1268 568 -149 -381 846 199 -625 378 281 19 -139 -256 466 -429 -552 241 -192 -736 32 -260 -245 -421
1288 -421 -197 515 -412 -218 355 -145 -159 271 221 362 -287 113 665 -286 201 206 -75 101 -109 143 133 -759
1310 -759 3 346 -541 -204 10 -47 -220 -401 405 -47 -499 293 159 -398 98 258 198 17 -159 620 180
1331 180 -257 445 145 -79 -59 12 427 -302 -397 706 -118 -538 28 -72 -80 -391 -336 485 -194 -441 260 -98
1353 -98 -110 195 34 451 -371 13 517 -46 -64 110 242 451 -234 -238 473 -69 -91 -98 -194 190 -126 -254 5
1376 5 -467 -214 37 -197 -96 -238 -98 398 -140 -246 128 -19 260 -19 -105 439 80 265 -6 -149 340
1397 340 204 -89 129 -338 -23 184 -316 -159 -263 -327 201 -305 -510 1 -85 238 -184 -610 320 283 -107
1418 -107 -88 -249 550 366 -149 409 76 -2 304 78 33 -96 -209 512 48 -453 -199 169 213 -256 -801
$$ packed form
1268E68p17k32J227o47q24J003r7k62j58j17P22q95j23P93m33n44P68k92J5j76
1288d21K24P12r27J94N73n00j4M30n0J41o49M00N52r51M87Nk81J76k10K52j0q92
1310g59P62L43q87L37K14n7j73j81Q06m52m52P92j34n57M96J60o0j81j76P79m40
1331A80m37P02l00k24K0P1M15p29r5J103q24m20N66j00ql11N5Q21o79k47P01l58
1353i8j2L05j61M17q22L84N04n63j8J74J32K09o85mP11n42k2pr6L84l16j28K59
1376Em72K53K51k34J01j42J40M96n38j06L74j47K79k79q6N44l59J85k71j43M89
1397C40j36k93K18m67L15K07n00J57j04o4N28n06k05N11q6L23m22m26R30l7l90
1418a07J9j61P99j84n15N58l33p8L06k26m5j29j13P21m64n01K54L68M4m69n45
$$ plain form
1439 -801 264 144 -368 -95 -211 61 190 -267 247 80 -123 295 301 139 -125 -299 826 176 -852 60
1459 60 560 177 -575 -368 673 470 -614 -102 254 -258 -176 -152 524 -300 -894 614 362 -543 -426 332
1479 332 934 -178 -873 690 864 -324 -291 332 614 -140 -392 456 217 -574 90 378 -117 -443 -509 717
1499 717 117 -806 -314 345 282 -322 -473 258 189 -492 92 317 -117 5 83 393 44 -393 326 566 58
1520 58 -277 -185 906 235 -870 -122 310 150 -313 -376 314 -122 -656 100 61 -633 -305 90 364 -539 -658
1541 -658 563 433 -505 -165 271 360 -35 -437 445 159 -126 329 172 -82 81 106 343 -242 -621 238
1561 238 8 -221 -180 -345 170 80 -338 25 -21 293 220 -397 23 247 -182 184 34 221 169 -201 349 203
1583 203 -316 143 307 94 -341 -607 353 304 -717 -141 255 -116 -267 -136 90 -319 -619 331 91 -588
$$ packed form
1439h01J065j20n12K73j16K72J29m57N14j67k03M18Oj62k64j74J125o50j028R12
1459F0N00l83p52K07J041k03j084N12L56n12Q2K4O76q24n94J508k52r05J17P58
1479C32O02j112o95J563J74j188L3O23K82p54k52Q48k39p91O64K88m95l26o6J226
1499G17o00r23M92O59o3o04j51P31o9o81N84K25m34J22P8L10l49m37P19K40n08
1520E8l35R2J091o71j105P48M32j60m63o3O90m36n34P56l9o94L28L95K74r03j19
1541f58J221j30r38L40M36Q9l95m02Q82k86k85M55j57k54J63K5K37n85l79Q59
1561B38k30k29M1j65N15r0m18L63m6L14p3o17M20K24m29L66j50J87n2l70N50j46
1583B03n19M59J64k13m35k66R60m9j021N76L96l71j51J31K26m09l00R50k40o79
$$ plain form
1603 -588 97 575 256 -91 -18 530 148 -224 235 151 -27 301 23 117 -211 -168 377 -136 -447 -3 69 -24
1625 -24 -228 -211 97 -244 -25 82 -338 -68 228 -106 -123 -89 205 382 -195 203 314 -180 167 270 62
1646 62 -40 5 403 113 -284 362 96 -424 -294 63 -20 -362 -554 444 -109 -639 87 169 -31 -317 -14
1667 -14 536 -144 -403 648 379 -332 163 393 194 -276 174 593 -139 -407 382 109 -255 -144 -26 165
1687 165 -432 -172 190 -425 -329 48 142 -187 -173 361 251 -387 214 494 -135 -20 192 145 -85 -111 404 214
1709 214 -509 122 276 -234 -42 -87 51 -158 -341 164 19 -211 -105 -63 -94 -188 -149 202 -82 -325 359 -10
1731 -10 -276 34 191 111 -84 20 452 -53 -113 421 -96 -187 208 68 -3 -447 14 204 -377 -278 123 -304
1753 -304 -315 -174 42 -71 -437 133 515 -201 -119 186 175 -58 -208 442 331 -561 372 374 -51 -41 114 128
$$ packed form
1603e88O85M78l19l47P3N48l82l72M59q4j78L28k78R4l28M3N45n13l11M44P2r3
1625b4k04J7L08l41K19J07m20K70K96l34j7L4K94J77n77L98J11m94L47J03k08
1646F2j02M5L98k90l97O46k66n20J30L57q3l42j92R98n53n30P26Q2k00k86L03
1667a4N50o80k59J051k69p11M95K30j99m70M50M19p32k68P89k73l64J11J18J91
1687A65n97K60L62o15R6L77R4l29J4N34j10o38O01K80o29J15K12m7k30k6N15j90
1709B14p23O31J54n10J92m5J38k09j83N05j45k30J06M2l1r4L9L51k84k43O84l69
1731a0k66L10J57q0j95J04M32n05o0N34n17r1L95j40p1m44M61J90n81R9M01m27
1753c04j1J41K16j13l66N70L82p16Q2L05j1k33j50O50j11q92R33Km25J0J55J4
$$ plain form
1775 128 -260 -332 270 63 -374 -46 12 -164 -204 -148 338 -154 -283 311 97 -281 -46 -22 63 -191 131 630
1797 630 -134 -88 446 144 -104 -68 97 311 -240 -1 520 -59 -138 272 79 -70 -328 -44 98 -270 -24
1818 -24 14 -341 -119 34 -39 -43 -198 309 273 -127 264 253 0 147 67 15 -7 -35 384 -210 -327 250 138 -124
1842 -124 -160 -25 78 -259 -249 355 -206 -261 169 164 -174 -131 82 486 -152 -279 584 103 -283 183 85 183 -236
1865 -236 101 415 -256 -193 220 -1 -209 -71 41 192 -218 -294 127 -279 -172 -65 -89 -73 64 266 -140
1886 -140 -465 174 196 98 -42 63 171 293 -246 356 129 -299 467 40 -88 -32 -172 259 34 -497 215
1907 215 58 -340 -36 -53 -122 -41 -89 66 -189 -155 272 90 -48 18 -143 457 9 13 255 32 295 96 -354
1930 -354 139 29 -73 -18 -108 139 -45 -157 143 -8 -258 -119 44 38 -176 -323 259 -85 -422 12 219
$$ packed form
1775A28l88p2O02k07m37L28N8j76m0N6M86m92j29N94k14l78K35K4Q5k54L22M99
1797F30p64M6N34l02k48L6J65K14n51K39N21n79p9M10j93j49k58K84J42l68K46
1818b4L8l55K22J53p3mj55N07l6m00L91j1k53J47q0n2k2k8M19n94j17N77j12k62
1842a24l6J35J03l37J0O04n61n5M30nl38M3K13M04o38j27Q63m81l86M66r8R8m19
1865b36L37L14o71O3M13k21k08J38J12J51m10p6M21m06J07J07k4J6J37K02m06
1886a40l25O39K2r8j40J05J08J22n39O02k27m28P66m27j28N6j40M31k25n31P12
1907B15j57l98L04j7o9Q1m8J55k55L4M27j82j38O6j61O00m48MK42k23K63j99m50
1930c54M93j10j02N5r0K47j84j12L00j51k50J39J63ok14j47N82l44l37M34K07
$$ plain form
1951 219 -8 -78 30 326 209 -193 215 216 -86 -23 60 115 -40 -303 170 -18 -148 -159 20 215 -100 -427
1973 -427 192 69 -257 -80 -48 50 -183 -94 269 -87 -337 320 325 86 -125 -87 317 78 -252 140 57 29 -64
1996 -64 -83 144 -23 -178 202 1 -207 -170 58 10 -268 -212 391 93 -135 -50 -51 266 191 -84 384 170 -28
2019 -28 257 -10 37 119 -56 187 66 -167 12 -85 -45 -4 -467 16 144 -228 -216 -124 105 -96 -357 141 129
2042 129 -198 -31 218 227 -118 -74 426 99 -236 209 250 -97 80 44 224 5 -233 323 -20 -300 19 -25
2064 -25 52 -184 -99 146 -210 -252 107 137 210 115 101 258 7 -39 197 -229 133 205 -187 178 196 10 114 -107
2088 -107 173 109 -173 218 -107 -292 -134 -156 223 -125 -450 291 149 -454 -246 187 73 -121 11 551 -20
2109 -20 -283 213 147 -127 -199 58 440 -269 -341 376 102 -229 -95 -11 -29 -125 -75 300 -220 -364 87 -36 -109
$$ packed form
1951B19k27p0J08K96j17m02M08Jl02O3Q3N5j55k63M73j88j30j1J79J95l15l27
1973d27O19j23l26J77L2R8k33Q9L63l56k50O57Nk39k11L8M04k39l30L92q3k8r3
1996f4j9K27j67j55L80k01k08L7K28m8k78N6O03k98k28Q5jL17p5k75M68k14j98
2019b8K85k67M7Q2j75K43j21k33J79r7M0M1m63M83J28l72J2R2K29k01k61M98j2
2042A29l27J67K49Rl45M4N00l27l35M45M1l47J77l6J80k19k38N56l43k80L19m4
2064b5P7k36Q5K45l56m2L59L0P3r5j4J57k51m6K36m26L62P2l92L65J8j86J04k21
2088a07K80o4k82L91l25j85J58k2L79l48l25P41j42o03K08M33j14j94J32N40n71
2109b0k63M96o6k74p2K57L82p09p2P17k74l31J34Q4j8r6N0L75n20j44M51j23p3
$$ plain form
2132 -109 -51 -3 118 -142 -38 276 -82 121 211 71 320 78 38 98 -122 149 206 -276 247 94 -283 0
2154 0 -244 171 -117 -335 107 34 -197 68 29 77 -134 -152 283 4 -292 203 236 -71 8 254 276 72 -94
2177 -94 339 42 -121 159 174 40 24 43 -137 -144 -86 266 -138 -131 90 58 18 -101 14 250 -588 -39 334 -96
2201 -96 -195 198 242 112 -9 147 265 -88 -13 222 -54 -143 109 219 -4 -356 44 89 -272 44 128 96 -120
2224 -120 -399 205 205 -187 20 146 -157 -13 135 44 -81 -119 196 65 5 92 2 118 -57 -77 203 18 2
2247 2 -37 -195 -114 71 -231 -227 -43 55 322 -239 -136 240 -54 -79 -83 248 -9 -239 122 304 -146 44 307
2270 307 -6 43 116 68 -81 -232 293 -55 -221 -80 61 65 -170 -72 44 -28 -304 115 -106 -135 14 -70 16
2293 16 -307 -66 225 -26 -265 170 18 34 -24 96 295 -60 -48 417 -162 -355 33 185 -16 -302 -61
$$ packed form
2132a09N8M8J21k60J04L14l58K03R0j40K49k42m0O0k20K71N7m82N23j53l77K83
2154@k44M15k88k18M42p3k31K65l9M8k11j8M35k79k96M95L3l07P9K46K2k04j66
2177i4M33k97j63K80J5j34j6J9j80pN8L52m04PK21l2m0j19J15K36q38N49L73m30
2201i6r9L93M4j30j21J56J18l53P5K35k76q9K52J10k23l52M00M5l61L16Q4l2k16
2224a20k79O04%l92K07J26l03J44J48r1j25l8L15j31o0Q7r0J16j75k0K80j85j6
2247Bl9j58Q1J85l02MJ84R8K67n61J03L76k94k5mL31k57k30L61J82m50J90K63
2270C07l13M9P3m8j49j51N25l48j66J41J41Mk35R8J16p2k76M19k21k9J49q4Q6
2293A6l23K41K91k51k39M35j52J6n8J20J99l55J2M65n79j93L88J52k01k86K41
$$ plain form
2314 -61 182 -318 -270 125 -96 11 -236 -99 57 -205 -70 53 -210 -75 72 47 165 31 214 118 -227
2335 -227 291 142 -130 189 -74 -8 72 -65 17 -98 -118 231 -25 -82 142 109 -30 -73 126 30 -41 -4 222
2358 222 -18 -92 118 92 116 -121 21 117 -98 -298 110 187 -2 -90 183 120 -246 -34 32 -274 -74 -84 -126
2381 -126 -53 -266 -108 281 -68 -49 164 -44 -38 307 172 16 -11 282 177 -229 99 111 0 111 -92 96
2403 96 -14 -77 -3 42 -296 -203 -232 104 -190 -205 86 -136 -250 -48 38 154 -119 -52 198 48 138 58 165 -20
2427 -20 66 105 208 -23 68 58 -55 13 -90 -14 108 199 -258 -9 50 6 -75 -117 22 -24 -94 147 -61 -141 67
2452 67 46 135 90 -82 245 149 -139 -12 93 62 9 -167 36 -127 -74 99 -25 10 -176 -148 152 -44 -143 115
2476 115 69 -74 -229 89 290 -8 -113 61 -11 96 16 -136 203 39 -64 100 -36 -188 23 -12 -4 92
$$ packed form
2314f1K43n00M8L95k21J07k47J37J56k62J35J23k63J35J47k5J18j34J83r6l45
2335b27N18j49k72L19k63O6Q0j37Q2j15k0L49k56n7K24l3j39m3J99r6p1L7K26
2358B22k40p4K10k6K4k37J42R6k15k00M08P7j89q8K73o3l66K12O6l06K00j0m2
2381a26P3k13J58L89l49J9K13k08OL45j35j56k7K93j05m06L28J2j11J11k03J88
2403I6j10o3P4M5l38R3k9L36k94j5K91k22j14K02Q6J16k73O7K50j50R0q0J07j85
2427b0Q6L9J03k31R1j0j13O8j03P6J22R1m57K49N9m4q1m2J39m6p0K41k08q0K08
2452F7k1Q9m5j72L27r6k88J27J05l1n3j76K03j63N3J73j24L5j86K8L00j96r9K58
2476A15m6j43j55L18K01k98j05J74p2J07q0j52L39j64j03J64j36j52K11l5QR6
$$ plain form
2498 92 -162 183 -30 -29 -80 -158 -12 84 -236 46 23 -193 311 3 97 40 -123 141 -9 -104 197 93 134 54
2522 54 -323 86 0 -17 4 -119 22 -128 -297 -22 28 -52 -118 -113 123 -141 -150 31 -149 -39 41 -109 18 -76
2546 -76 -40 315 13 -185 212 124 88 20 14 248 157 -179 91 203 -75 -61 -37 71 -47 -195 0 -102 -159 -283
2570 -283 63 68 -10 -57 148 -105 -2 149 -35 -143 53 219 -69 254 28 92 -49 158 76 -12 66 42 -3
2593 -3 -11 36 -3 5 -226 119 -107 32 17 -18 -21 115 -81 116 -17 -134 183 238 61 -34 43 209 -14 -176 210
2618 210 190 -78 31 -64 119 -49 -50 86 99 -313 -41 62 -104 -56 -3 105 -133 -9 238 46 26 20 -41 58
2642 58 43 94 132 -99 15 183 -97 -95 -1 65 -45 -106 68 147 -176 -91 20 -65 33 -114 29 69 -191 143 -35
2667 -35 102 17 -10 -3 63 -1 39 141 116 93 17 130 46 -31 169 -248 -65 93 -102 -11 64 -71 48 -48 117
$$ packed form
2498I2k54L45k13Jn1p8J46R6l20K82k3k16N04l08R4n7j63K64j50r5L01j04M1q0
2522E4l77M09q6j7K1j23J41j50j69K75N0q0o6NK36k64rJ81j80J10Q0j50J27r4
2546g6L6L55l02j98L97q8l6o8oK34r1l36K70J12k78J4K4J08j18j48J95j02n7j24
2570b83L46Np8m7K05k53J03J51j84j08J96J66k88L23k26O4j41K07q2q8P8k4m5
2593cqM7l9Qk31L45k26J39j5l5lJ36j96J97j33j17L17N5j77r5P7J66k23j62L86
2618B10k0k68J09r5J83j68jJ36J3m12K72J03j66M8N3J08k38J24K47j92k0oo1R9
2642E8j5N1L8k31J14J68k80KR4O6j10o1J74P9l23Q5J11q5R8j47J43M0k60L34j78
2667c5J37q5k7PO6o4M0J02k5k3p6J13q4p7K00m17J83J58j95R1P5j35J19r6J65
$$ plain form
2692 117 89 -158 -207 162 -105 -32 79 -130 -109 -28 62 167 -114 -46 304 -91 27 75 -57 -45 -81 68 66 -57
2716 -57 -15 80 -87 -60 -112 167 -25 -190 120 128 -128 99 264 -14 89 -19 69 24 -188 64 70 -48 0 1 66
2741 66 46 -176 78 0 -20 105 -173 -254 -17 -117 182 -4 -121 49 -66 40 24 25 42 -159 -7 -1 17 -184
2765 -184 107 -49 -80 87 138 62 -149 39 272 -50 -177 134 -91 42 -186 35 89 -13 35 112 -137 -42
2787 -42 -58 -18 -79 -37 -71 -59 -38 104 50 -175 42 -3 0 99 -210 254 47 7 264 129 7 -47 208 -31 -43
2812 -43 -47 227 -9 6 93 37 -67 -174 54 68 -160 5 100 20 -55 150 119 -51 -111 7 303 -109 30 3
2836 3 28 -11 4 137 68 -113 92 130 -143 -77 208 129 18 -228 70 3 -41 105 -23 26 99 96 30 64 -62 181
2862 181 111 -119 52 110 -6 75 79 77 -51 81 91 151 -151 -157 -152 17 -186 -58 149 -83 -99 76 22 15 -30 -62
$$ packed form
2692A17k8k47m9L69k67P3J11k09K1Q1R0J05k81O8L50l95J18M8j32J2l6J49kj23
2716e7M2R5j67K7n2K79j92j65L10Qk56K27J65k78J03j08Q8m5k12K52Oj18M8JO5
2741F6k0k22K54p8k0J25k78q1K37j00K99j86j17J70j15J06j6JJ7k01J52OJ8k01
2765a84K91j56l1J67N1p6k11J88K33l22j27L11k25J33k28K21N4j02M8P7k49R5
2787d2j6M0o1M2l4J2K1J42n4k25K17m5LR9l09M64k07m0K57j35j22n4K55k39j2
2812d3mK74k36J5Q7n6j04j07K28J4k28J65R5q0p5K05l1j70o0J18K96m12J39k7
2836CK5l9J5J33o9j81K05L8k73O6K85p9j11k46K98o7m4J46j28M9P3lo6L4j26K43
2862A81p0k30J71N8j16Q1Mkj28J32J0O0l02oNJ69k03J28K07k32j6J75n4pm5l2
$$ plain form
2888 -62 7 -1 -61 -19 -74 0 80 -130 143 -89 -48 -82 46 91 -38 -247 38 19 -28 -159 142 88 -52 -140 -5
2913 -5 -13 -345 -110 58 117 -174 -95 249 -65 -227 77 -48 -27 49 61 158 11 -105 209 20 -66 31 -82 234
2937 234 15 -67 226 -67 -201 -39 40 80 -21 -37 38 -131 5 41 -211 -35 82 -38 85 78 -34 121 138
2960 138 96 102 -118 190 45 32 30 35 201 -62 11 72 6 -32 55 -75 -14 -89 -74 53 18 -12 62 75 71 -36 -80 7
2988 7 54 -120 64 -20 74 80 35 -24 29 -104 11 -56 83 138 -203 -19 0 -68 -23 -173 90 2 -203 112 91 -89
3014 -89 258 60 75 45 3 129 160 -102 64 57 -2 103 -35 72 -67 -195 68 22 -244 -68 3 184 -96
3037 -96 -118 11 58 -139 60 -33 78 77 -49 154 95 71 89 76 -11 38 -34 103 48 22 31 169 212 30 0 122
3063 122 3 -227 -5 37 39 -42 -126 -70 69 2 -29 87 -187 110 30 -99 91 -38 120 37 227 132 184 9
$$ packed form
2888f2O9qo0M2n5P4Q0k10K73k32M1l4J28M5j29k09K85j9m7j31L01n4j40q8J35
2913eql32K35J68N9k91P9L44l14j62L04j25K1P6J2R7j47j16L14j89q6R7j13L16
2937B34k19q2K93k93j34J62P9M0j01j6P5j69J36L6k52J76J17j20J23pj12J55J7
2960A38m2Ok20L08j45j3kNJ66k63P3O1o6l8Q7j30O1p5J5J27l5l0P4J3mj07m4Q7
2988GM7j74J84q4R4Om5n9N3j33J15o7J39N5l41J84J9o8M5j50K63q8k05L15k1j80
3014h9L47j98J5l0m2J26L1k62J66pn9J05j38J07j39j28K63m6k66J76P1J81k80
3037i6k2J29M7j97J99r3J11jj26K03n9k4J8j3q7M9p2J37n5k6RJ38M3j82l0J22
3063A22j19k30K22M2Kq1q4N6J39o7l1J16k74K97q0j29J90j29J58q3J90r5N2j75
$$ plain form
3087 9 113 -124 147 -18 111 76 -66 101 -24 -71 188 -63 -77 -56 -3 31 101 -113 68 75 -8 74 -107 134
3111 134 76 -2 40 87 12 76 24 62 186 -9 36 172 -224 134 81 -100 187 -103 66 8 -209 -29 -22 -50 40
3136 40 -53 -73 57 -24 -27 68 203 138 -94 95 -13 48 -24 38 -73 112 9 -62 -34 -127 36 -27 -161 -32 -23 89
3162 89 -127 -168 88 139 49 25 36 193 140 -143 132 63 101 -37 -40 58 -24 -10 232 36 6 23 66 38 26 -40 211
3189 211 -11 -209 120 -150 -172 -123 -171 -4 -199 46 -63 -89 -98 -161 -48 -24 -45 -37 149 -69 97 -24 -143 48
3213 48 20 -95 45 86 -29 187 -94 -35 24 -181 94 -97 115 13 -27 -1 54 -83 -60 91 -34 49 -20 53
3237 53 -22 11 143 -1 -19 183 156 -132 42 -58 96 8 -21 -91 23 -26 -89 68 7 -45 -48 50 23 25 36 -27 -89
3264 -89 27 151 -112 -13 -184 7 -228 149 249 -78 -85 -56 104 56 -106 -66 -73 -183 41 -169 -68 -80 -110 4
$$ packed form
3087IJ04k37K71j65J29l5j42J67j25m7K59k51j4K1N3L4P0k14J81Pq3Q2j81K41
3111A34n8p8M2M7p5O4n2L8J24j95M5J36l96L58n3j81K87k90J69n8k17J80Pk8R0
3136D0r3k0J30q1lR5J35o5k32J89j08O1p2O2j11J85j03p1K8r3J63o3j34J29RJ12
3162H9k16m1K56N1r0k4J1J57n3k83K75o9L8j38lR8q2J4K42j96l0J7M3k8j2o6K51
3189B11k22j98L29k70k2M9m8J67j95K45j09k6ro3J13K4k1QJ86k18J66j21j19J91
3213D8k8j15J40M1j15K16k81N9N9k05K75j91K12j02m0K6N5j37K3J51j25Q3o9P3
3237E3p5L3J32j44j8K02k7k88J74j00J54q8k9p0J14m9o3J57o1n2lR8k7KJ1o3o2
3264h9J16J24k63R9j71J91k35L77J00l27pK9J60m8j62M0pj10K24k10J01j2l0J14
$$ plain form
3288 4 -140 -75 -15 103 1 79 -2 -14 54 42 -42 197 79 -97 -49 -15 28 -145 177 -133 9 248 -129 -129 -83
3313 -83 -24 63 -16 -250 -117 -121 23 -95 2 -46 -72 -51 -38 -179 -153 102 -120 -101 -4 -5 -102 61 -101 -41 -151 32
3339 32 58 -67 152 30 -98 122 -70 6 4 83 130 18 -52 74 100 -123 56 153 -58 -77 -40 42 31 25 51 -98
3365 -98 -121 -42 85 189 15 36 54 -62 113 -168 -38 116 -35 63 130 -71 -50 -64 -73 -24 153 56 71 90 86 125
3391 125 59 75 10 -62 27 75 74 -9 -76 -115 30 -7 91 -13 16 170 -175 52 20 -220 58 87 -218 16 -136
3416 -136 -94 -55 82 139 290 -28 -78 -126 47 45 -50 129 -63 -58 -63 72 46 148 -106 5 -11 156 79 -95 -150
3441 -150 162 30 -15 -113 -21 31 -19 -74 57 -68 -36 1 43 24 -52 -49 136 -61 100 34 39 50 234 7 46 -49
3467 -49 93 -48 85 -29 110 -18 -86 -65 -61 -5 -152 88 -62 -45 7 -3 -138 -127 -55 -70 17 -12 -3 -84 143 0
$$ packed form
3288Dj44O5O0J18j02P8q1j2O8j2q4K39j18j76M8L4M3j73L22l10J42K39l77%M6
3313h3N9Q7p9k34J33mJ44j18R7m8k6K1J3j41K6K55k22J9R7jr7J63j62O0j10J83
3339C2K6j25K19j22j28K20j92P6kP9M7j12p0J26K6k23J79R7k11j9L7Q2j1oK6j49
3365i8k3P9J27J04j74K1J8j16J75k81J30J54j51R8O7k01K1j4rM9J77r7J5J9mL9
3391A25o6J6o5p2Q9M8jq3o7l9J45l7R8j04K9J54l45K27l2k40K78K9l05K34j52
3416a36M2L9J37N7J51l18n0m8J73kr5J79j92NnJ35k6J02k54J11j6J67p7j74n5
3441a50L12j32m5r8R2N2n0n5J31j25L2L7M2j9p6LJ85j97J61o6NJ1J84k27L9r5
3467d9J42j41J33j14J39j28o8K1MN6j47K40j50J7N2j0j35J1P2j5Q7k9Rq1K27j43
$$ plain form
3493 0 -11 -43 -48 38 -134 -12 -1 90 -111 122 -196 7 -72 -35 11 -64 -76 1 -160 -63 75 -47 84 -129 -49 -96
3519 -96 3 -46 34 68 44 -28 -117 33 72 -162 3 -25 -67 -50 -174 93 15 21 -54 -107 -31 -174 -127 101 -24 -90 73
3546 73 189 -78 11 77 -11 86 25 79 -42 -1 166 37 79 -3 -14 12 8 -33 -42 68 27 -160 -80 31 -14 -114 -86
3573 -86 -62 -61 -51 -26 -91 -50 -49 26 209 32 -84 -139 82 144 -93 91 158 -14 11 79 24 7 2 5 -26 9 26 -125
3601 -125 50 -133 -12 -111 -35 -74 -88 -153 -107 34 -105 -60 -148 101 17 -17 -10 34 -50 -10 -1 -125 51 -20 17 -126
3627 -126 71 -171 -10 -96 -65 -2 66 -27 -171 -166 19 69 -85 118 -198 76 -27 175 94 10 10 12 -74 84 49
3652 49 -68 138 15 -29 -65 -24 190 -96 -8 9 -53 178 -95 39 41 -8 110 14 -42 88 162 256 25 -39 48
3677 48 157 -101 -61 117 106 223 107 51 -31 128 17 -94 40 -44 -130 71 -55 7 -16 -106 -111 93 37 -37 6
$$ packed form
3493@j1l2nQ6j72J22J1R1k01K33l18K03p9L7M6p5j2P7j61R7J38j22J31k13Q0m7
3519i6R9m9Q0L4k4p2q9J50L9k34J65k8m2J7j24K67p8Op5n3P6j43M7K28j25o6J63
3546G3J16k67Q9O6q8R7o1N4j21M1J67j29M2q2j1K6mm1rJ10m1j87Q0J11m5j00K8
3573h6K4JJ0K5o5M1JP5J83j77j16n5K21O2k37J84O7j72K5O8n5j7nLl1L5J7j51
3601a25J75j83J21r9P6l9j4o5M6J41j39M5q8K49q4l4PM4q4M0Rj24J76p1L7j43
3627a26J97k42J61q6L1O3O8r3j44NJ85N0j54K03l16K74j03K02q1q4%Kq6J58l5
3652D9j17K06j23m4l6M1K14k86Q8J7o2K31k73J34Km9J18r6n6J30P4R4k31o4Q7
3677D8J09k58M0J78j1J17j16n6q2J59j11j11J34q4q6K01j26O2k3r0nK04n6p4M3
$$ plain form
3702 6 56 24 -11 24 260 51 -34 -74 -132 76 -51 46 66 38 11 -15 44 46 -51 -309 62 -107 32 122 -61 44
3728 44 119 -22 24 9 11 30 70 -145 -32 50 63 -17 -4 120 40 65 -22 -112 3 -129 -164 68 -135 17 53 -183
3754 -183 12 18 -62 45 -52 -102 117 -85 47 -39 -104 5 31 -46 123 -127 -125 59 -139 -5 54 45 54 174 -11
3779 -11 -46 -78 -126 -44 42 27 -62 -31 40 -80 55 -7 29 26 -58 2 62 -72 240 24 -66 134 24 51 73 42 43 120
3807 120 54 -55 107 -35 245 -15 -255 99 -11 -33 -7 -173 13 -155 -55 114 -73 76 14 -52 19 -56
3829 -56 181 46 -8 -137 -66 128 -32 189 -15 112 -16 96 -9 133 -82 143 22 170 17 -59 6 -24
3851 -24 87 -236 139 18 -112 15 -32 44 -70 -17 -58 55 3 192 17 -81 -14 -28 -136 34 16 -77 7 139
3875 139 -11 -168 -25 -77 65 3 31 46 -16 52 -68 -3 36 -36 65 -37 32 -23 -105 14 -97 64 209 -139
$$ packed form
3702FN0l2l5L5K36k09q5m0n8K08j27R7K0k8k7k6N9Kr7k58L71j69J39R0j83J05
3728D4P5j41M6j5KJ9M0k15J13Q2J3q0J3J24q0K5q7r0J15j32l5K32k03J52L6k36
3754a83J95Oq0J07r7n0K19k02J32q6o5J09K6p7J69k50KJ84j98J34N9rRJ20j85
3779a1l5l2m8Q2Q6j5q9L1P1j20J35o2L6lq4O0O0j34L12k16r0K00j10K7K2l1JP7
3807A20o6j09J62j42K80k60k40L54j10k2K6j66J86j68J00J69j87J49o2o6P1p5
3829e6K37j35n4j29P1J94j60K21k04J27j28J12j05J42k15K25j21J48j53p6O5l0
3851b4J11l23L75j21j30J27m7P6j14N3m1J13n2J89j75r8O7j4j08J70j8r3Q4J32
3875A39j50j57J43n2J42o2K8J5o2O8j20O5L9p2J01j02O9n5q2J19j11J61J45l48
$$ plain form
3899 -139 8 -111 -2 -96 -13 64 141 27 39 15 5 -68 55 76 1 -27 6 -42 -98 104 38 -100 108 61 15 211
3925 211 28 86 30 -60 -74 -34 6 31 -125 17 -68 -127 -22 -79 7 77 -89 -69 -173 -109 52 -98 -157 -51 30
3950 30 -28 28 23 -137 15 -34 54 55 159 -22 124 67 5 99 120 -10 -80 11 -143 83 -81 -70 15 41 -132 -116
3976 -116 -22 37 76 89 -20 118 80 -39 -56 -71 -24 39 35 46 -1 -42 -33 77 140 -94 -39 57 53 -4 -4 99 79 62 204
4005 204 -33 -120 70 73 34 20 2 102 -1 60 -64 3 98 -59 -147 75 -29 -12 56 -25 136 41 114 133 -112
4030 -112 -19 56 -72 103 -32 -41 161 -233 68 103 -76 77 -102 -72 1 50 67 -48 87 -44 74 91 -133
4053 -133 128 116 -59 46 128 7 -66 12 -24 52 51 -229 -39 76 25 -20 -111 -44 -62 91 125 148 -41 8 -97
4078 -97 17 188 59 -20 85 -10 11 124 -59 20 54 -57 27 0 -17 75 92 93 27 -28 92 120 -17 107 54 -2
$$ packed form
3899a39J47j19J09r4Q3P7P7j14J2k4j0p3J23K1p5k8L3m8n6K02o6j38K08m7m6J96
3925B11j83N8n6r0j4M0M0K5j56J42q5n9J05n7Q6P0j66K0j04O4J61j50n9J06Q1
3950C0n8N6nj60J52m9Q8JJ04j81J46n7o2R4K1j30p0R1j54K26j64J1Q5K6j73J6
3976a16R4N9L9J3j09J38l8j19j7j5M7O3mJ1m7m1RJ10O3k34N5R6mn7%J03k0j7J42
4005B04k37q7J90Ll9j4j8J00j03O1j24O7R5j57q8K22j04J7O8q1J61r5P3J9k45
4030a12R3P5j28J75j35rK02l94L01L5j79J53j79L0P3M9J7j15J35j31J18J7k24
4053a33K61j2j75J05Q2j21p3P8l6P6jk80J90J15n1m5r1O7j8J53L4K3j89M9j05
4078i7J14J71j29p9J05r5K1J13j83P9L4j11Q4k7j7R2J7Jo6n5J20K8j37J24n3n6
$$ plain form
4104 -2 -6 -69 40 107 -60 23 101 19 -13 -12 -76 -41 82 -99 -107 33 -106 -1 -60 -37 -69 54 29 52 77 85 2 -11 -104
4133 -104 -42 38 171 -43 -55 -37 -76 64 54 49 27 1 30 -18 119 78 85 34 15 -23 -19 -18 -94 171 56 -28 -107 33
4161 33 36 -57 -46 -25 -86 -48 -95 18 3 115 18 38 -68 83 65 98 -1 -88 46 -36 -17 46 143 -135 -24 28 72
4188 72 22 -45 -96 28 11 -90 -189 -6 -123 88 71 -120 -23 59 -21 -111 121 -139 131 32 23 13 114 58 20 2
4214 2 -62 -14 48 -63 -77 45 73 72 135 -22 -109 48 -114 61 -140 43 20 -283 -98 -42 8 2 -39 6 67 23 100
4241 100 69 101 -11 -24 67 -34 -46 -95 21 115 -75 13 107 72 -118 -37 -48 29 -55 -82 -108 243 110 -46 -87 -130
$$ packed form
4104bmo3J09O7j67Q3P8q2l2Jo4L5J23j81qJ40j39J05n9K3l2J23k5K3K5Qq3j3r3
4133a04O2Q0J33k14j2J8l9J40j0nk2k6K9m8J37m1Pn1j9l8MJp6K65j15q4p9J40
4161C3Lr3J1K1o1L8m7J13j5J12r7K0j06J51j8L3r9q7J34q2J9O3R7k78J11N2M4
4188G2n0o7n1J24j7j01r9J83j17K11j7j91R7Q2q0r0K32k60K70r9rj0J01n6l8j8
4214Bo4M8O2j11j4J22K8jO3j57q7J57j62J75k01J83k3l03J85N6N0om1M5O1m4P7
4241A00l1L2j12j3R1j01j2m9J16R4j90Q8R4l5j90Q1j1P7q4k7k6L51j33j56m1m3
$$ [...]
8191A42
##END NTUPLES=NMR FID
##END=
