##TITLE=1H_Pr 6019-0H
 CDCl3, 8 sc, 
 10.4.2019
##JCAMPDX= 6.0         $$ Bruker NMR JCAMP-DX V2.0
##DATA TYPE= NMR FID
##DATA CLASS= NTUPLES
##ORIGIN= UXNMR, Bruker Analytische Messtechnik GmbH
##OWNER= root
$$ XWIN-NMR		Version 3.5
$$ Wed Apr 10 14:36:11 2019 Russian Standard Time (UT+4h)  she@DPX200
##.OBSERVE FREQUENCY= 200.1315
##.OBSERVE NUCLEUS= ^1H
##.DELAY= (6, 6)
##.ACQUISITION MODE= SIMULTANEOUS
##.ACQUISITION SCHEME= undefined
##.AVERAGES= 8
##.DIGITISER RES= 18
##SPECTROMETER/DATA SYSTEM= spect
##.PULSE SEQUENCE= zg30
##.SOLVENT NAME= CDCl3
##.SHIFT REFERENCE= (INTERNAL, CDCl3, 0, 15.7039)
##AUDIT TRAIL= $$ (NUMBER, WHEN, WHO, WHERE, WHAT)
$$ ##TITLE= Audit trail, XWIN-NMR		Version 3.5
$$ ##JCAMPDX= 5.01
$$ ##ORIGIN= Bruker BioSpin GmbH
$$ ##OWNER= she
$$ F:/spectra/data/she/nmr/H-F/1/audita.txt
$$ ##AUDIT TRAIL=  $$ (NUMBER, WHEN, WHO, WHERE, WHAT)
(   1,<2019-04-10 14:35:07.93 +0400>,<she>,<DPX200>,
      <created by zg, POWCHK disabled, PULCHK disabled
       configuration hash MD5:
       00 E9 B6 7A A2 85 ED C7 34 08 36 98 17 FE 4E 26
       data hash MD5: 16K
       DA EA 7F 9D 5A 97 5D 82 20 58 84 26 D5 50 5C B7>)
$$ ##END=
$$ 
$$ hash MD5
$$ C9 AA 7A 66 15 C5 55 94 AD 54 10 DB 2A 83 BC 4A
##$RELAX= 
##$RELAX= 
##$RELAX= 
##$RELAX= 
##$RELAX= 
##$RELAX= 
$$ Bruker specific parameters
$$ --------------------------
##$DU= <F:/spectra>
##$EXPNO= 1
##$NAME= <H-F>
##$PROCNO= 1
##$TYPE= <nmr>
##$USER= <she>
##$AMP= (0..31)
100 100 100 100 100 100 100 100 100 100 100 100 100 100 100 100 100 100 
100 100 100 100 100 100 100 100 100 100 100 100 100 100 
##$AQSEQ= 0
##$AQ_mod= 1
##$AUNM= <au_zg>
##$AUTOPOS= <>
##$BF1= 200.13
##$BF2= 200.13
##$BF3= 200.13
##$BF4= 200.13
##$BF5= 200.13
##$BF6= 200.13
##$BF7= 200.13
##$BF8= 200.13
##$BYTORDA= 1
##$CFDGTYP= 0
##$CFRGTYP= 5
##$CHEMSTR= <none>
##$CNST= (0..31)
1 1 145 1 1 1 1 1 1 1 1 1 1 1 1 1 1 1 1 1 1 1 1 1 1 1 1 1 1 1 1 1 
##$CPDPRG= <>
##$CPDPRG1= <>
##$CPDPRG2= <>
##$CPDPRG3= <>
##$CPDPRG4= <mlev>
##$CPDPRG5= <mlev>
##$CPDPRG6= <mlev>
##$CPDPRG7= <mlev>
##$CPDPRG8= <mlev>
##$CPDPRGB= <>
##$CPDPRGT= <>
##$D= (0..31)
0 1.2 0 0 0 0 0 0 0 0 0 0.03 0 0 0 0 0 0 0 0 0 0 0 0 0 0 0 0 0 0 0 0 
##$DATE= 1554892507
##$DBL= (0..7)
120 120 120 120 120 120 120 120 
##$DBP= (0..7)
150 150 150 150 150 150 150 150 
##$DBP07= 0
##$DBPNAM0= <>
##$DBPNAM1= <>
##$DBPNAM2= <>
##$DBPNAM3= <>
##$DBPNAM4= <>
##$DBPNAM5= <>
##$DBPNAM6= <>
##$DBPNAM7= <>
##$DBPOAL= (0..7)
0.5 0.5 0.5 0.5 0.5 0.5 0.5 0.5 
##$DBPOFFS= (0..7)
0 0 0 0 0 0 0 0 
##$DE= 6
##$DECBNUC= <off>
##$DECIM= 24
##$DECNUC= <off>
##$DECSTAT= 4
##$DIGMOD= 1
##$DIGTYP= 9
##$DL= (0..7)
0 120 120 120 120 120 120 120 
##$DP= (0..7)
150 150 150 150 150 150 150 150 
##$DP07= 0
##$DPNAME0= <>
##$DPNAME1= <>
##$DPNAME2= <>
##$DPNAME3= <>
##$DPNAME4= <>
##$DPNAME5= <>
##$DPNAME6= <>
##$DPNAME7= <>
##$DPOAL= (0..7)
0.5 0.5 0.5 0.5 0.5 0.5 0.5 0.5 
##$DPOFFS= (0..7)
0 0 0 0 0 0 0 0 
##$DQDMODE= 0
##$DR= 18
##$DS= 0
##$DSLIST= <SSSSSSSSSSSSSSS>
##$DSPFIRM= 0
$$ [...]
##$SUBNAM2= <"">
##$SUBNAM3= <"">
##$SUBNAM4= <"">
##$SUBNAM5= <"">
##$SUBNAM6= <"">
##$SUBNAM7= <"">
##$SUBNAM8= <"">
##$SUBNAM9= <"">
##$SW= 24.9337058887773
##$SWIBOX= (0..15)
0 0 2 0 0 0 0 0 0 0 0 0 0 0 0 0 
##$SW_h= 4990.01996007984
##$TD= 16384
##$TD0= 1
##$TE= 0
##$TE2= 300
##$TE3= 300
##$TEG= 300
##$TL= (0..7)
0 120 120 120 120 120 120 120 
##$TP= (0..7)
150 150 150 150 150 150 150 150 
##$TP07= 0
##$TPNAME0= <>
##$TPNAME1= <>
##$TPNAME2= <>
##$TPNAME3= <>
##$TPNAME4= <>
##$TPNAME5= <>
##$TPNAME6= <>
##$TPNAME7= <>
##$TPOAL= (0..7)
0.5 0.5 0.5 0.5 0.5 0.5 0.5 0.5 
##$TPOFFS= (0..7)
0 0 0 0 0 0 0 0 
##$TUNHIN= 0
##$TUNHOUT= 0
##$TUNXOUT= 0
##$USERA1= <user>
##$USERA2= <user>
##$USERA3= <user>
##$USERA4= <user>
##$USERA5= <user>
##$V9= 5
##$VALIST= <valist>
##$VCLIST= <CCCCCCCCCCCCCCC>
##$VD= 0
##$VDLIST= <DDDDDDDDDDDDDDD>
##$VPLIST= <PPPPPPPPPPPPPPP>
##$VTLIST= <TTTTTTTTTTTTTTT>
##$WBST= 1024
##$WBSW= 4
##$XGAIN= (0..3)
0 0 0 0 
##$XL= 0
##$YL= 0
##$YMAX_a= 48003
##$YMIN_a= -72854
##$ZGOPTNS= <>
##$ZL1= 120
##$ZL2= 120
##$ZL3= 120
##$ZL4= 120
##$ABSF1= 10
##$ABSF2= 0
##$ABSG= 5
##$ABSL= 3
##$ALPHA= 0
##$AQORDER= 0
##$ASSFAC= 0
##$ASSFACI= 0
##$ASSFACX= 0
##$ASSWID= 0
##$AUNMP= <proc_1d>
##$AZFE= 0.1
##$AZFW= 0.1
##$BCFW= 1
##$BC_mod= 2
##$BYTORDP= 1
##$COROFFS= 0
##$CY= 11.3945322036743
##$DATMOD= 1
##$DC= 2
##$DFILT= <>
##$DTYPP= 0
##$F1P= 18.9103706918063
##$F2P= -1.10871071338519
##$FCOR= 0.5
##$FTSIZE= 0
##$FT_mod= 4
##$GAMMA= 1
##$GB= 0.15
##$INTBC= 1
##$INTSCL= 1
##$ISEN= 128
##$LB= 0.24
##$LEV0= 0
##$LPBIN= 0
##$MAXI= 10000
##$MC2= 0
##$MEAN= 0
##$ME_mod= 0
##$MI= 1.114404
##$NCOEF= 0
##$NC_proc= 0
##$NLEV= 6
##$NOISF1= 3.799351
##$NOISF2= 2.8
##$NSP= 1
##$NTH_PI= 0
##$NZP= 0
##$OFFSET= 15.70392
##$PC= 1
##$PHC0= -8849.266
##$PHC1= 11.00026
##$PH_mod= 1
##$PKNL= yes
##$PPARMOD= 0
##$PSCAL= 0
##$PSIGN= 0
##$REVERSE= no
##$SF= 200.130013532006
##$SI= 16384
##$SIGF1= 3
##$SIGF2= 2
##$SINO= 400
##$SIOLD= 16384
##$SREGLST= <1H.CDCl3>
##$SSB= 0
##$STSI= 0
##$STSR= 0
##$SW_p= 3612.71676300578
##$SYMM= 0
##$S_DEV= 0
##$TDeff= 0
##$TDoff= 0
##$TI= <>
##$TILT= no
##$TM1= 0
##$TM2= 0
##$TOPLEV= 0
##$USERP1= <user>
##$USERP2= <user>
##$USERP3= <user>
##$USERP4= <user>
##$USERP5= <user>
##$WDW= 1
##$XDIM= 8192
##$YMAX_p= 0
##$YMIN_p= 0
$$ End of Bruker specific parameters
$$ ---------------------------------
##NTUPLES= NMR FID
##VAR_NAME=  TIME,          FID/REAL,        FID/IMAG
##SYMBOL=    X,             R,               I
##VAR_TYPE=  INDEPENDENT,   DEPENDENT,       DEPENDENT
##VAR_FORM=  AFFN,          ASDF,            ASDF
##VAR_DIM=   8192,          8192,            8192
##UNITS=     SECONDS,       ARBITRARY UNITS, ARBITRARY UNITS
##FACTOR=    0.0002004,     1,               1
##FIRST=     0,             0,               0
##LAST=      1.6414764,     0,               0
##MIN=       0,             -72854,          0
##MAX=       1.6414764,     48003,           0
$$ Real data points
##PAGE= N=1
##DATA TABLE= (X++(R..R)), XYDATA
0@%%%%%%%%%%Qj6J6j6J7k5L2l3M1m9N7o7P6r0J05j20J36j54J75j99K24k51K82
33A49l16L56l97M40m90N46o04O68p40Q18r08J007j116J239j378J536j718J932
51A024k185K493k875L363m013M928o323Q734j4089N0027l0328o1276P0512K8011
65D8003l3243l3772J1196K3482K3948k8757m0524K7087M9787l4378m1944L1871
77B756K8046k8258o477J5301j0317p934J4098q036r858J4329l715j4208K4542
90A0269Q689l9889k075M7498p796m6104R160L3505k884j4911j0704p261K5186
103B683K0608m0964k7010M9374K8382m3977j9626L0869J0582j0649n993j4073
115a9794L640L2765o040m0239J1795L6426j6695k3338J6853M966j0982J4056M721
$$ y = [0, 0, 0, 0, 0, 0, 0, 0, 0, 0, 0, 8, -8, 8, -8, 9, -16, 16, -17, 24, -25, 32, -35, 41, -49, 56, -64, 72, -82, 93, -106, 118, -133, 149, -167, 189, -208, 232, -258, 288, -316, 352, -388, 430, -478, 529, -587, 652, -726, 810, -908, 1024, -1161, 1332, -1543, 1820, -2193, 2735, -3588, 5146, -8943, 41084, 10756, -50520, 19992, 48003, 14760, -19012, -7816, 15666, 39614, 10857, -29667, -2580, 47207, 12829, -29115, 2756, 30802, 2544, -3933, 11368, 1051, -6883, 7215, -821, -10679, 3650, -65, -14273, 10269, 18958, -20931, -23006, 24492, 16696, -29408, -20248, 13257, 10373, -4538, -15242, -22503, 2683, 23291, -17673, -44683, 4691, 33073, -10904, -30530, 339, 10921, 272, -5721, -19794, -16154, 16611, 10571, -29668, -17873, 18553, 1858, -21480, -4627, 339, -10643, 3413, 8134]
128H134k1923O558K0940j5770j2986J6902m069j3994K0088P345k8584L828K9038
141A5507j1215k0132J3827M081p759J3545o02k5719J2458K9303k2418k7473K3496
154c101J6191j4930k219K961o729J6067J2458l0947j2047L8428O508l6041Q36
167a2565K5478m851r068L686q896J626K0230r563k2779K0646J9234k5472o869
180i163K4923o136k0679J4161R791j5312Q29Q744q664M464J0605k0077q037L1512
194A6961J805l5088O014L1252j0000k0076O646L143j328R855j1192j7931K2279
207B340J8985k9635j2654K8928K671k1716O159Q639j0754N144Q677j6701k683
220a2600J8758p979j5743J6792N935k1676P474K1300j6489j4501J9232M253j4138
$$ y = [8134, -13789, -7231, 13709, -2061, -15047, 1855, -2214, -16208, 3880, 11225, -17359, -13531, 15507, 4292, -15840, -2013, 2068, -5691, 7854, 7252, -18467, -6009, 23294, 876, -26597, -3101, 13090, -1840, -4059, -1098, -7827, 8240, 20698, -10249, -22296, 16132, 22640, -13401, -12565, 12913, 8062, -1006, 2680, -6216, -4590, 15640, 6077, -16702, 3944, 23178, -2294, -9163, 15760, 9624, -11055, 3106, 12897, -2415, -1586, 7158, -1506, 2958, 13563, -6514, -14551, 16961, 18766, -16322, -10308, 20944, 10944, -9132, -2486, 657, -671, 9184, -2008, -19939, 2340, 21325, -8310, -20964, 7964, 10635, -11081, -4922, 3717, -7037, -1893, 6784, -9917, -12600, 6158, -1821, -17564, -772, 5163, -16513, -9039, 12261, -4228, -18729, 503, 4756, -9382]
233i382M227K535r789J2321J0243k5286o565L0645L50k7486N809J7321n928j145
247b130M490j3810K192K3556j0094k6290J5783J9981j5404q081J0456m376l68
260d095J4486j0504j7768K0330J6063k3088p446J8938k004r176Q563m145j1325
273a1171J5166R029k0469j065J9103o452j0826J3371j059j5627J3202J3785k0955
286c968p548J9772O03j1820M040k654m724J8299K571k8834K382L3908o627k9326
300a3926P257J8109l582l797m486r345J3975J7840k3533j8605K6757J4540k4476
313c272n321J6688l165l432P701q786p461J6560J628j8742O178J3393j3731l405
327e167J7897p911j7491J6558J2409j7888n113J2545k011j246N321j3431n374
$$ y = [-9382, -5155, -2620, -12409, -88, 10155, -15131, -21696, 8949, 9299, -18187, -12378, 4943, -985, -2130, 2360, -11450, -9258, 14298, 4204, -22086, -6303, 13678, -1726, -9807, 649, -3727, -4095, 10391, -113, -17881, 2449, 18512, -4576, -12022, 6916, 4912, -4264, 4299, 154, -11171, 3995, 13024, -7445, -8510, 10593, 4141, -6685, 6686, 5627, -10000, 3202, 16987, -3968, -11516, 8256, 8859, -2961, 1079, -1575, -6299, 12000, 14571, -14263, -11881, 22027, 15400, -13926, -6669, 11440, 7858, 4061, -425, -9770, 4205, 22045, -1488, -20093, 6664, 21204, -3272, -8593, 8095, 4930, 1498, 9199, 413, -7048, 9512, 11140, -7602, -1424, 11969, -1762, -5167, 12730, 4819, -12672, 3886, 16295, -1593, -6706, 5839, 3828, 2582, 7903, -5528, -10902]
340a0902K4309J868l0321K339K8905n603j9887M894O598N24O161q425j6153J6232
354E39J8854k1670j6400K1978P709j6543R12O593p377M581R778j3734o894J8364
368F690m55j5709P880P614j4326K774J5027j1932j2322J6394N514j4601L155O427
382B130q289M953J0634j6549q000K3100L008k3229J555J6238n122m473M270q011
396g785M97J8039o460k2081J3278J8827j4959j1487J3280J308o630P493l790j1152
410a1622J2541J0178j7663m442J8388l659j2290J1018L857j3874N768J1799j2096
423b097n514J2875k600q041J0053q96j3501J0654J3040j7071q676J8920L070j4262
437d046L214M049n420P039M707j7068n6K1270n058k0176R734J2615j0012k420
$$ y = [-10902, 13407, 15275, -15046, -12707, 16198, 10595, -9292, -4398, 2200, 2724, 8885, 460, -15693, 539, 19393, -2277, -18677, 3301, 11010, -5533, -4621, 1972, -5405, -824, 8954, -4780, -11674, 6690, 6235, -9474, -1594, 6020, -8306, -5532, 9495, -2437, -14759, 1635, 7149, -7452, -4297, 2130, -6159, -1206, 9428, -7121, -15121, 7979, 10987, -12242, -10687, 5551, 429, -4044, 226, -7785, -7288, 10751, 4291, -17790, -4512, 14315, -644, -12131, 1149, 2457, -4173, 3320, -470, -11622, 919, 11097, -6566, -11008, 7380, 3721, -8569, 2449, 6306, -7568, -1800, 9999, -2097, -7611, 5264, 2664, -5377, 4676, 3780, -9721, 933, 13973, -3098, -11774, 7146, 10216, -4046, -832, 3217, -2203, 4836, 9543, -7525, -7581, 13689, 8631, -11545, -1811, 10804, 792, -1628]
451a628O658o795L75J2539p989j3624J4089Q456j6247n78J2968p361n951J1682
465F594k106j2101R655P394j2590K97J0475q403l648J3245n037j4705J2249J0913
479A2232j5499m548J2824k680n577P469l903r596J3808O917j9617j909J8679l339
493E261j3116O592K559o477O955K676j4413L537J6613r111j3739J2866N757j1919
507e959K860P111j0046J31J1440p464q915J1723K368j2290N883Q034j2086j091
521h301J4902n867j2753J0151O847j0005M54N457p066K373J0838j0735j0539J7402
535C158O463j7894q42J4301l526n950O057l822m306J2165L2j5936N820J4384r958
550A46p649J1841k66r223Q508L787j2213L350J1191q351n757J0640k136q461R782
$$ y = [-1628, 5030, -1765, -1390, 11149, 3160, -10464, 3625, 12081, -4166, -4744, 8224, 863, -5088, 6594, 4488, -7613, 2042, 9436, -3154, -2857, 7618, -785, -4433, 8812, 3775, -10930, 1319, 12232, -3267, -7815, 5009, 2329, -3248, 4221, 318, -9278, 4530, 11447, -8170, -10079, 8600, 5261, -7855, -1263, 1296, -5181, 1774, 4450, -9963, -6426, 10187, 1076, -12663, 203, 5960, -5959, -3099, 4012, -6034, -5903, 5537, -1927, -10842, 881, 3249, -9041, -3158, 4876, -7210, -8301, 6601, 734, -12019, -1868, 4979, -5026, -4572, 885, -6181, -3808, 7030, -3705, -14244, 3158, 9621, -8273, -9115, 5186, 1660, -4290, 1767, -2055, -6361, 5804, 5836, -10100, -4280, 10104, 146, -7503, 4338, 4072, -5151, 3357, 7144, -5069, -1719, 9472, 1121, -4636, 6004, 3868, -4593, 5189]
565E189L313j4165L193J4698r064r829J1365K464q741M717L064j0266N249J0609
579A1796j1796p940J4905J717j3528M477P365q468R87Q937q710o360J3357Q12
593G551j3352M588Q546q841l78Q023q264n083J3759o97j4764N960J1619r409m671
608e413Q764l651n140R444j478j1460P926Q797j2170k708J1947m645q267R863
622A809K235j2235M472J0184q878m881R171k886n520Q610r31j1804Q021J0727
636H094j3276o355J4460M69j1259M229M327n846L936M503j0985l16J4180n794
650C67j2847J0421P795j1898J41R761o507m309R638k117q995P850L930r901L787
665b884Q691j0671m036J4070j761j3763O956J0123q546k080O690m328j274Q414
$$ y = [5189, 8502, -5663, -2470, 12228, 3164, -6665, 4700, 7164, -1577, 3140, 6204, -4062, 1187, 11796, 0, -7940, 6965, 8682, -4846, -369, 6996, -1472, -485, 8452, -258, -6618, 6739, 7551, -5801, -1213, 7333, -1508, -1886, 6137, -2127, -7210, 6549, 5852, -8912, -2952, 8667, -742, -5413, 3351, -300, -5440, 4004, 2526, -8934, -1008, 7789, -4381, -7089, 4858, 213, -8054, 1809, 4044, -8191, -3719, 6465, -2413, -7294, 1877, -1009, -6529, 2081, 1150, -10654, -2633, 8094, -5182, -11537, 2923, 3392, -7867, -3638, 689, -5157, -1221, 3282, -7703, -8019, 6161, 367, -12480, -2059, 5736, -6162, -6021, 3740, -2767, -7076, 2562, 445, -8550, -700, 3230, -6671, -2884, 5807, -4864, -8900, 5170, 3409, -10354, -3398, 6725, -1821, -3901, 2789, -1539, -2813, 5601]
679E601n645r011J2024O849j4656r81J3409l867q815P597J624q089O046M622r083
694b375J321R698p554n670J0187k38j1021P587P980j1480k371J1694k997q270
708c509O383J456o905N975L743j0694J918J2351p960j0862J1526M430j1100J801
722a447P676o633j565Q425n665o411R515R88j0521N343P600r937k240J2020m741
737B407j0933R130N713j0352R14P641n952j077P454o113o311J1151J553j2973
751g748L492J2124p901o776R034J68p935N378K859q114L997P356q639l139J0877
766E033l242j0228P945O243j1118M29J0653n079o320O879pn943N850J704r601
781f802M951J0133j0229p057J2286J687j1618L183P530o106j34O296n428k860
$$ y = [5601, -44, -9055, 2969, 9818, -4838, -5819, 7590, 3723, -5092, 2505, 4129, -3960, 2086, 6708, -2375, -1054, 8644, 1090, -4580, 5607, 5369, -5652, 1935, 9915, -1565, -3936, 7758, 4761, -3509, 2874, 4330, -2575, 3400, 7143, -3551, -1633, 10718, 2758, -8104, 3422, 7852, -3248, -1447, 6229, -404, -1969, 6456, 791, -5620, 3895, 4883, -5638, -295, 7305, -2632, -4872, 7148, 2407, -8526, 604, 6317, -4035, -3121, 4520, -1432, -2509, 4945, -1168, -7479, 3672, 5225, -7748, -4256, 7868, -33, -6809, 2225, 2393, -5542, -164, 2695, -5419, -1422, 5934, -2705, -5844, 5033, 1791, -8437, -492, 5751, -5367, -4938, 5715, 636, -5684, 1195, 1188, -4755, 1095, 2799, -6802, -1851, 8282, -1947, -9004, 3282, 4969, -6649, -3466, 4064, -2042, -2176, 4120, -1308, -4168]
795d168R222k916r990Q255O567j1269n56J1954m814q453Q270K705q946K909N644
810D414o414J254P491p019m566J1148n31j2752N643J0629q838m648R233r70o328
825b254N451J61p019O184N332j0123l93J2112n232r710Q831L844j0111J637Q375
840G085n962k991P386k591n471O519L76r169N682Q148j0143m176J2388j253j0909
855e081M750N614p043J036N161n824p75Q635m983q352R043M024j1617J158J0781
870F527n840n964Q168k01p249M517K843p631K844P306p650l587J0758k131j1356
885h646P073P046r634j931R756l612m692N936j120o253O556K950j0424K368J1211
900F584p304p535R477K539r757K999N859o410j14P067n180l943Q856j811r110
$$ y = [-4168, 5054, 2138, -7852, 403, 6970, -4299, -4855, 7099, 2285, -6168, 2102, 4807, -4139, -1230, 4414, -2000, -746, 6745, -274, -4840, 6308, 5777, -6975, -1332, 9297, 459, -4189, 5044, 4074, -2254, 3197, 3358, -3661, 2523, 7855, -2268, -2661, 9451, 4219, -5491, 3340, 7184, -2927, -1290, 7085, 1123, -1868, 5518, 2927, -2544, 3975, 4351, -4818, 864, 9012, -1131, -5307, 7081, 5828, -5081, -331, 5283, -1760, -724, 4437, -1387, -2162, 6473, 1490, -6862, 2181, 6205, -5412, -4254, 6527, 687, -5277, 2891, 2690, -4559, -42, 2801, -4830, -1986, 5320, -2330, -5917, 4841, 2710, -8646, -1573, 5473, -4161, -6092, 3664, 52, -4640, 1296, 176, -6077, 479, 3429, -6995, -4627, 6584, -720, -8255, 1222, 3761, -5996, -2997, 2862, -3548, -3662, 3405, -1775, -5718, 3138, 1327, -7783]
915g783O726O605j0382j244J1054l359q413P032K690o797J918M669o581J027Q159
930E321o171o224J0696J522j1702L670R048o952l797P903j409n684O132K93p280
945d634M738N793q357j122J0237l759q492P896M185r510P88Q069n206k902P095
960D819k797n279P299R37j0100M549Q810p994n332J0507k00q871M685L771o518
975a714J345N698o149k159R350l523q124P429M711j0002L2R155m840n769P684
990C124L05p207M220L574p609K098P261p280l744J0119j076j0475N309P134q232
1005b479k185P549l084l820O420j482o966O192M467r969K19J0221n187o930Q180
1020A146J952q364K982N329o147j205P051m113m089P574p02q757N813O545r030
$$ y = [-7783, -1057, 5548, -4834, -6078, 4976, 1617, -6796, 236, 2926, -3871, -1953, 2716, -3865, -2838, 5321, -850, -7074, 3622, 5144, -6558, -2888, 6160, -792, -4589, 3314, 1905, -3779, 2353, 2646, -4634, 104, 5897, -2460, -3582, 6655, 2896, -5596, 2300, 6485, -3025, -2237, 5832, 626, -2276, 4819, 2022, -3257, 4042, 4979, -5121, -572, 8238, 244, -5088, 5419, 5219, -3652, 1033, 4804, -1714, -369, 5329, -820, -2979, 6371, 2848, -5276, 2153, 6864, -3138, -3106, 6049, 1209, -4560, 3124, 3429, -3778, 442, 4016, -3593, -1495, 5766, -1514, -5258, 4861, 3785, -6690, -1381, 5753, -2479, -4664, 2885, -199, -4019, 2401, 919, -6047, 145, 4612, -5357, -5138, 5083, -104, -7034, 1146, 3098, -5266, -2284, 3045, -3102, -4307, 2744, -1369, -5458, 2116, 1414, -7343, -1530, 5015, -4015]
1035d015k312R778k009p546N753K859o717K482M487o568l12Q991m929p202Q933
1050A673K919r891K530P417o189l159P814j774o378O324K392p858L018O149p165
1065b178j700R407l088q576P813M246q805L83P632m970k776P080k903n938P453
1080C080K845j0387K501Q966o110m967Q085j80p019N096L183p477J569O752n776
1095A61l412Q145j579p696O063M515q667O9Q422m388n513P270N44o887M374L157
1111D578p380J444P675o262n087Q901O01q639L350N730o562r70P110m692m313
1126d516P700L48q531M264N623p658o82P682m134n855Q091J155q685L305O236
1141D343o318j924O826l743m554P574M18q767M227O549p543k362Q258k721o079
$$ y = [-4015, -6327, 3451, 1442, -6104, -351, 2508, -4209, -1727, 2760, -3808, -4120, 4871, -58, -7260, 1673, 4592, -5299, -2769, 4648, -1541, -4700, 3114, 1340, -5038, 1286, 3678, -4180, -1162, 4987, -2178, -3878, 5529, 2441, -6135, 1678, 5924, -2881, -2498, 5134, 164, -2612, 4468, 1565, -4373, 3080, 5925, -4462, -1961, 7005, 895, -4072, 4013, 3833, -3186, 1910, 5093, -2384, -815, 5937, 161, -3251, 4894, 3315, -4381, 1682, 6197, -2470, -2401, 6021, 1633, -3880, 3390, 3934, -2953, 1421, 4578, -2802, -1358, 6317, 55, -5032, 3869, 4470, -4169, -819, 4911, -1651, -2621, 4489, -203, -4516, 3184, 3532, -4999, -735, 4888, -2770, -3452, 4230, 96, -5759, 2332, 3487, -5198, -1893, 4343, -1975, -3899, 2927, -816, -5370, 2204, 2622, -6145, -1918, 4631, -2912, -5274, 2984, 263, -5816]
1156e816O546K020q092L266O089o701k429Q333k716o024O304J752p839L203O725
1171D621p082l211Q885j418o933N166L066p152K977N786p110k381R052j970p907
1186e611N929L936p204J224O514n719k928Q073j679p411N961M126p731P69P162
1201E411n261l625P819o34p702N186M503p270K61O728n039l098P736j732p451
1216d168N620N325q176m87P075l316m689O985p73o628N067M322q251m10Q623l852
1232B267n900O974O79o594L783M111p383n3Q218m592n972P657J095p915L709M890
1248D974o881r99Q283m117o066O808J619p288L224N261p659j074Q674l470p140
1263e851O685L012p272J824M701n640q92P387m545n620P761K415q987J705P284
$$ y = [-5816, 730, 2750, -5342, -2076, 4013, -2688, -5117, 3216, 500, -5524, 780, 2532, -5307, -2104, 4621, -2461, -5672, 3213, 1795, -5138, 28, 3094, -4058, -1081, 4705, -2405, -4786, 4266, 2296, -5611, 318, 4254, -2950, -1726, 4788, -931, -3859, 4214, 2535, -4876, 1085, 5211, -2520, -1751, 5411, 150, -3475, 4344, 3710, -3992, 1194, 5697, -1573, -1312, 5416, 377, -2721, 5015, 3283, -4168, 1452, 6777, -1399, -1886, 5189, 1873, -2816, 4169, 3396, -3232, 1835, 6157, -2094, -2504, 6119, 2267, -3633, 3341, 4020, -2574, 1209, 5320, -2063, -2116, 6102, 1510, -4462, 3195, 4290, -3625, 84, 4974, -1907, -2906, 5377, 1260, -4806, 2002, 3621, -3667, -443, 4818, -2841, -3915, 4759, 1289, -5851, 834, 3846, -3426, -1602, 3099, -2541, -3433, 3954, -591, -6211, 1550, 3965, -5022, -3317, 3967]
1278C967n522k969O567k133n139O026J563p470K890O203o635k631P899k008o773
1293f165O286K697p442J037O941n021l137O811j617n615N835K319q566K748P619
1308D730o105m357P506N93o547M055K792o741J975O648o201l738Q414n26p316
1323d818M444M271o599L62O925m993m357P986k03p166M001M491o824N49O925n239
1339b45l999P916K26q426M180N663o692j144O868l537l977O407L86p579M489M656
1355E192o705r91P474m057n024P591N85q109L243O444o503k245O424j935m344
1370b960N499K87p687N230N293p862k450Q766j549p017M963K524n948K001M642
1385C732o228p83P298l530n921O465K464q388K149O777n447l614P037q24n833
$$ y = [3967, -1555, -4524, 2043, -90, -5229, 797, 2360, -5110, -2220, 3983, -2652, -5283, 2616, 608, -6165, 121, 2818, -4624, -3587, 3354, -1667, -4804, 2007, 390, -5225, 610, 2929, -5637, -2889, 4730, -1375, -5732, 1774, 2367, -4180, -125, 2667, -4074, -2099, 4549, -1652, -5390, 3024, 2498, -4818, -374, 3897, -2702, -2340, 4585, -408, -4765, 3221, 3018, -4148, -147, 4344, -2480, -1931, 4994, -245, -4244, 3672, 3898, -4528, -348, 5315, -1377, -2521, 4347, 810, -3167, 3240, 3626, -3953, 536, 5192, -1513, -2504, 4970, 913, -4111, 3480, 4065, -4044, -801, 5643, -860, -3105, 3319, 1384, -2960, 2539, 2826, -4861, 369, 5662, -2200, -4650, 4116, 2567, -4450, 513, 3037, -2911, -910, 3732, -2496, -3279, 4019, 489, -5432, 1033, 3497, -4891, -2742, 4035, -1412, -5026, 2011, 1187, -4646]
1400d646M327K105o150K568N694p402j785R179k478q281N462N280o954p92N389
1415A516l044j924N854l146n302P008K511q666J137P926m510m875O900L92o426
1430d649L735L713o479J052N630m672k538P225j664p105N410M812p790q51Q037
1445C866k691m618M937K34n059M214K742p045J103P687m839n501P693J161p081
1460c197K477N114n839o93O575l083m557O406M95o779L962M244o978j60P501l466
1476B022n870O578K616p449J360N341m511j240N852l596l872O783N74q380L571
1491b21O725o790k944P552j939n555N229K305o761J997M624m606j447O363l427
1506A105n330P426J515q918K056P849n206m408O232l20m278L860K50n775L489
$$ y = [-4646, -319, 1786, -4364, -1796, 3898, -3504, -5289, 3890, 1412, -6869, -1407, 3873, -3081, -3873, 1516, -1528, -3452, 2402, -744, -6046, 962, 3473, -5193, -4056, 3870, -640, -5515, 1385, 1777, -4649, -914, 2799, -3680, -2628, 3002, -1670, -4208, 3017, 1353, -5752, -342, 4470, -3320, -4171, 3866, 1175, -3443, 1494, 1728, -3331, 883, 3625, -3420, -2317, 5370, 531, -4970, 2723, 3884, -3197, -720, 4394, -1445, -2138, 4437, 1354, -3203, 3203, 3698, -3081, 881, 5125, -1853, -2013, 5488, 2022, -3848, 2730, 5346, -2103, -743, 4598, 87, -1153, 4699, 1103, -2769, 4014, 4588, -3792, -221, 6504, -286, -3230, 4322, 2383, -3172, 2057, 4362, -2399, -402, 4222, -384, -1831, 4532, 1105, -4225, 3201, 4716, -4202, -2146, 5703, 497, -3911, 2321, 2001, -2277, 1583, 1833, -3942, -453]
1521d53N363p394k606R193j367q043M472M441o122l92N152l517k036N861k148
1536D04n301N652K109q022K039P757n458n189P282J370o784K215L397m084J034
1551a579L633n494q18Q253k494q030N093N925p111k074O810j812l840M752o4n195
1567d045M201L070o797M45P521m730m815P622R10p497K948N043n126j484N502
1582B768k123l198N231l85o439M852M513p543j249Q084k238n889N006K257n505
1597a858K268L545n497lO290l318m692O084J160o862K644N736o339j901P042j719
1613B580n612M505K544n402J480L891m832n87O318l271n753O330L351p659J23
1628a994O455m079k996N269j109m142M695J345o303J977N313n499k505P556j698
$$ y = [-453, 4910, -2484, -5090, 4103, 2736, -5307, -835, 3606, -2516, -2908, 2244, -1273, -3309, 2552, 404, -4897, 755, 2864, -5158, -3119, 4638, -820, -6009, 1273, 2643, -4141, -1926, 1471, -2613, -1579, 2054, -3440, -4258, 3995, 1501, -6529, -1436, 4489, -2622, -4696, 2114, 302, -3538, 1214, 1150, -4045, 156, 3226, -3571, -3126, 4395, -335, -5150, 2472, 3382, -4115, -1167, 3876, -1250, -2734, 2768, 645, -2553, 2678, 2293, -4146, 706, 5219, -2324, -3573, 4511, 2273, -3616, 1390, 3647, -1858, 410, 3955, -1542, -1545, 4745, 1427, -3265, 2819, 3979, -2883, -239, 5497, -842, -2743, 4299, 2580, -3032, 1473, 4017, -1385, 95, 3986, -846, -1433, 4885, 1614, -4139, 2191, 5542, -2117, -1994, 4461, 382, -2614, 2655, 1546, -2596, 2099, 3444, -2859, -882, 4431, -1068, -3573, 3983, 2285]
1643B285o648M236M432o218r12N370k741k316M407j645m419N553J829p441O97
1658c531Q239m625n540O252J688n273J698K646m699J398M647n390k160P041o79
1673A712p230M484M650o516j079O296k233m340M514N60l850K806K180o027J476
1688b597O960n121n166P376J873o952J145N247l973j249M104k589k564N901m12
1703A983o562M146M935o127k032O971j687n254M633J787n255J999L901m774q25
1718b161N520k404m498O046J345p060K263O132n316k854N833m39m330L625J223
1733B925m991K647M194n700j672O744j690n575M412L048o088J282M759l988k572
1748b265N564r20m784L991K083n965K151M581n116k422P082q33o818L656M054
$$ y = [2285, -4363, -127, 4305, -1913, -2825, 2545, -196, -2512, 1895, 250, -4169, 1384, 3213, -4228, -3531, 4708, 83, -5457, 795, 2483, -2790, -1092, 1554, -3145, -1747, 2900, -2490, -4650, 2391, 1712, -5518, -1034, 3616, -2900, -3979, 2317, 84, -4256, 258, 818, -3032, -226, 1954, -4073, -2597, 4363, -758, -5924, 1452, 3325, -3627, -2482, 2765, -1208, -2457, 1647, -942, -3506, 2395, 1983, -4579, -433, 4502, -1625, -3657, 3314, 1627, -3627, 1006, 2793, -2462, -463, 3438, -1336, -2161, 3359, 955, -3543, 2503, 3848, -3212, -949, 5183, -133, -2987, 2846, 2407, -1923, 1702, 2925, -2066, 581, 4775, -925, -2597, 4147, 2457, -3118, 1294, 4342, -1746, -464, 4295, 307, -2265, 3299, 2379, -2405, 1586, 3669, -2296, -145, 4436, -680, -3102, 3980, 3147, -3671, -15, 4039]
1763D039m914p32M525l305j711M951j376n533M795L439p370N68O383l625l998
1778c864N488M66n518K616L418m604k97M644l471k609N731p43o141M112M466o066
1794b372j545N892j437l937L410Q23m156L107K476o124N53O740l637m814N340
1809C19J986n817J451M362m344q59M850k210l544M727R41o065L014M640n511j852
1825c912O415j440n043M137K139m744J352L382m162l85N478k754m614N561K153
1840C563o500J057N306l458k557M683q43l941M227J680n662J446N078m244k544
1855b709N686q30n100M145K532n180L32N064l267k818M802p40m456M480K165n947
1871a841R17N484l901l514N418L17m976K888L037n138J89N098l274l022N209m10
$$ y = [4039, -875, -1607, 2918, -387, -2098, 2853, 1477, -4056, 739, 4178, -3192, -2624, 3759, 134, -3864, 1624, 2090, -3428, -812, 2606, -1998, -2295, 2349, -1122, -3731, 2000, 1257, -4884, -772, 3694, -2372, -3917, 1975, 538, -3399, 11, 834, -3322, -215, 2261, -3863, -3310, 3430, -207, -5021, 319, 2305, -3512, -2061, 2301, -2043, -2902, 1948, -262, -3806, 921, 1862, -4203, -1189, 3451, -2060, -3912, 2503, 1063, -3980, 157, 2296, -2448, -1096, 2286, -1876, -2261, 3217, 463, -4151, 1410, 3563, -2937, -1880, 3426, -32, -2589, 2094, 1251, -2690, 1537, 3217, -2445, -999, 4079, -165, -2709, 2977, 2147, -2953, 1192, 3724, -1456, -1124, 3940, 673, -2145, 2657, 1917, -2539, 1941, 4106, -1841, -924, 4560, 659, -2855, 2563, 2880, -2096, 792, 3829, -1309, -1120, 3978, 704, -2318, 2891, 2481]
1887B481n126L128L285n027j36N097l392l301M879J015n111K083L097m031n10
1902a569M810l097l349N076O30n439K268M368m829j701N320j941l648M301N68
1917A768m837K207L595m628o90N141k433m177M833J312n679K105M339m363j325
1932b832M483j564l577M316N80m973K326M340m765j883N291r41m221L278K089
1947A947m657J232L891l736j664N304j911l957L854K234n233J046M267l175k531
1962c089N167o33m763L715K337m943P22M655l457k242M855k80n060L567K929m942
1978a462J66M183k756k350N106o60m785L539K938n283n3M987k829k686M697o40
1994B112m494L363L147n159j20M952k812k972M158M98m776K672L167m725l29M656
$$ y = [2481, -2645, 483, 3768, -1259, -1395, 3702, 310, -2991, 1888, 2903, -2208, -125, 2972, -1059, -1569, 3241, 144, -3205, 1871, 2501, -2938, -670, 3698, -1131, -2832, 2488, 547, -3101, 1200, 1768, -3069, -862, 2733, -1895, -2585, 2556, 123, -4054, 779, 2091, -3588, -1483, 2856, -1507, -2832, 1651, 87, -3490, 826, 1406, -3567, -1241, 3099, -1666, -3549, 1742, 801, -3420, -142, 1947, -2710, -1478, 2413, -1323, -2987, 2317, 406, -3551, 303, 2537, -2696, -1650, 2617, -558, -3089, 2078, 1445, -3318, 397, 2734, -2209, -1487, 3168, -289, -2531, 2324, 2044, -3016, 551, 3480, -1462, -1296, 2887, 131, -2219, 2887, 2227, -2558, 981, 3919, -1364, -1417, 3570, 741, -1945, 2752, 2112, -2382, 981, 4128, -1031, -1151, 3801, 989, -1983, 2175, 2673, -2103, 569, 3736, -989, -1318, 3338]
2010C338k447l442M703Q13n119K427L296m412p63M634j849l751M082J005m566
2025b051J821L408l903j178M913k152m147M398J451m896J258L637l615r99M170
2040B115j714l535L973R33m412J204M094l893j803M920j215m016L378J808m522
2055b685Q17L911l725j203M308j317m012L964J746m925Q10M654l569k426M506
2070H54j30m246K823K428m605Q14M023l319k440M876m41m420L345K620m553N6
2086b315M451k525k678M324l70m072K947K387m782J012M285k885l111M871K19
2101A758m874K588L005l620m57L855k094k368M026L58m881K893L012m457n63M838
2117C019k006l497L989J094m103R24L623l718m25M285k595k641M112Q83n277J871
$$ y = [3338, 891, -2551, 2152, 2965, -2154, 273, 3569, -843, -1606, 3028, 1179, -2572, 1510, 2515, -2051, -230, 3178, -725, -1903, 3010, 858, -3289, 1109, 2560, -2336, -1078, 2559, -1056, -2055, 2115, 401, -3134, 839, 1772, -2640, -1436, 2658, -1235, -3038, 1882, 667, -3349, 29, 1837, -2685, -1868, 2043, -1682, -2885, 1423, 106, -3906, 58, 1804, -3121, -2311, 2343, -1226, -3652, 854, 724, -3522, -699, 1729, -2876, -2062, 1961, -1358, -3798, 1078, 637, -3783, -438, 2182, -2371, -2315, 2136, -389, -3067, 1257, 887, -3185, -238, 2149, -2633, -1621, 2664, -221, -3332, 1539, 1758, -3116, -528, 2477, -1143, -1600, 2255, 161, -2207, 1819, 2177, -2704, 189, 3201, -1256, -1819, 3019, 1013, -2484, 1505, 2599, -1504, -580, 3043, -675, -1100, 3185, 590, -2051, 2061, 2944, -2333, -462]
2133d62M333m123j361M371j052l332L002J240m325K153L082m227r81M923j653
2148A588m600M028K262m943R13L658l084j678M036j453k938L654P76m631J428
2163i84M441m154k327N316n53m501K730K300l522k4K997k842j142L957j101l845
2179c254L065K494m908N88M433k613l027M048m4l414K091J701l721Q28L788l339
2195a284k077M667k71m583K642L111m238n78L916j654k254L096o4l201K816J838
2211A882m499L08M651k515l595M440J241m334J101L173k691j033L728k360k453
2226b956M248L72m750K997L470m556j135M997j340l874L117J590l462J440K034
2241B192k817k11L790k290l258M461J114m805J153M327l185j995L640n83k825
$$ y = [-462, 3871, -252, -1613, 2758, 1706, -1626, 1376, 2616, -1709, 444, 3526, -701, -1682, 3241, 1588, -3012, 1016, 3278, -1665, -752, 2906, -178, -1856, 2180, 727, -2211, 1443, 2219, -2412, -984, 3457, -697, -3024, 2292, 1739, -2762, -32, 2268, -1254, -1278, 1719, -1123, -2265, 1692, 591, -3254, -189, 2305, -2603, -2015, 2418, -195, -3222, 826, 782, -2632, -541, 1160, -2561, -1733, 2055, -1284, -3361, 1306, 1035, -3548, -906, 2205, -2033, -2611, 1305, -349, -2603, 493, 429, -2772, 44, 1882, -2617, -2309, 2342, -173, -3768, 672, 1913, -2421, -1320, 1853, -838, -1871, 1857, -503, -2956, 1292, 1664, -3086, -89, 3381, -1175, -2310, 2687, 1347, -2527, 590, 2180, -1282, 158, 2192, -625, -836, 2954, 664, -2594, 1867, 2981, -1824, -671, 3656, 471, -1524, 2116, 1533, -1292]
2256a292K876P24l565J607L409m522r45N001j547m243L439K412m325K62L283k030
2272E44j723L138q18k713L302P84m401J440M185l646k617M540J00l833J924J793
2288A999l039L58K978k747j416L821r78l927L359K103m404m58M514j970l049L526
2304F70P73l592K033J557l139O21K955l001k211M470J06m741K336L763l649j499
2320b548L465j076k315K778K2l340L111J723m111n94N435k724l282L355J823m001
2336b279L99L488k950o97L121j778k045L997l24m327K317L982l841k279M996o23
2352A157l963K827J499k874Q52K206k868m00M217k080l689M120J848m677M64M199
2368B838k278k215K977k51k624K509J151l816J628L482l556j933M881q52m236
$$ y = [-1292, 1584, 2308, -1257, 350, 3759, -763, -1708, 3293, 1746, -2497, 942, 3354, -971, -709, 2574, 544, -1179, 1959, 1141, -1572, 1730, 2514, -1887, -447, 3738, 92, -2525, 2015, 2115, -1718, 206, 1999, -1040, -682, 2296, -451, -1867, 1954, 976, -2951, 408, 2511, -1893, -2351, 2163, 193, -2856, 670, 1443, -2149, -116, 1441, -1698, -1077, 1878, -1123, -3334, 1136, 1242, -3499, -1163, 2600, -1049, -2548, 917, -159, -2474, 304, 326, -3014, 97, 1820, -2291, -2885, 2550, -174, -3456, -101, 1722, -2279, -1880, 1608, -1342, -2039, 1082, -696, -2741, 1256, 932, -3395, -1078, 2904, -937, -3216, 1780, 1157, -2806, 21, 1520, -1354, -502, 1704, -1164, -1564, 2653, 573, -3116, 1004, 2852, -1825, -1361, 2838, 560, -1655, 1322, 1071, -1553, 956, 2107, -1709, -81, 3401, -155, -2088, 2793, 1941, -2295]
2383b295K709K642l534o30L346j481j875L026q61k778L364J250m350L39M811l064
2399F19k735M195K96l878J956K044k967J26K820k293j844M137p08l990K551K904
2415C233m305r48M453j321l041K778P53k975J434J855l517N93L647k888k540M253
2431A464N65m947J996L672l379j395L013r00j962K212N3l148K263K691m097o19
2447b518M459j275m188L265J929l705M79K908k540o98K887j400k529L662O50m312
2463b926J319L984l470k203M301l55l128J929J578k928Q51K416k864o15M023j592
2479C20l485L566K117m267n8L932k134k292L241k56k655K480J190l255J158L148
2495B750l399j825M527k10m011K071K603l193l60L238j892j405K960m88l543L085
$$ y = [-2295, 414, 3056, -478, -1108, 2238, 757, -1118, 1908, 1047, -1731, 1633, 2883, -1467, -1128, 3683, 619, -2116, 2079, 2375, -1503, 453, 2497, -470, -344, 2476, 183, -1661, 2476, 1768, -2222, 329, 3233, -1072, -2020, 2433, 1112, -1929, 849, 1602, -1373, 61, 1916, -1601, -1008, 2639, -249, -2789, 1464, 2029, -2918, -922, 2750, -629, -2024, 989, 89, -1873, 339, 392, -2756, -493, 2198, -1899, -2518, 1941, 666, -3522, -257, 1672, -2033, -1554, 1354, -1186, -1884, 1003, -397, -2926, 736, 1386, -2926, -1607, 2377, -1093, -3296, 1005, 650, -2478, -549, 1029, -1899, -1048, 1368, -1496, -2111, 1912, 320, -3165, 401, 2518, -1749, -1807, 2125, -9, -2301, 940, 684, -1971, 509, 1699, -1556, -398, 2750, -649, -2474, 2053, 1843, -2168, -97, 2506, -687, -1047, 2191, 299, -1106, 1854, 1366, -2177, 908]
2511I08J538l902M08M132k506k785M112O7l349J596K044k847q1L179k508j529
2527a523L741k48m289K678K919l739q72L545q67k892K790N32l309K015J509l160
2543a170l1L928k053k843L442Q22l720P26L366k905j221L432j302k712L412L78
2559A549l586J730K681l560j036M204j398l339K829J563l819J235K517k270j221
2574a921L279j713k486L462J032m266J116L705l058j885L764o17k923K384J152
2589A025l410J116K822l193r17M146r84l812K872K144l961K47L651k279j735K863
2605E95k40k610K413J342l748R18L533k722k279M124K36l924J927K420l287o3
2621a365L080j752k020L780l35l365K240J969l543O2M070k190k717L520N30l334
$$ y = [908, 2446, -1456, -1048, 3084, 578, -2207, 1905, 1972, -1377, 219, 2263, -584, -665, 2514, 6, -1523, 2218, 1970, -2319, 359, 3278, -461, -1333, 2212, 1345, -1547, 1243, 1775, -1534, 481, 1990, -1170, -1201, 2727, 674, -2169, 1273, 2095, -1625, -899, 2467, -438, -1659, 1773, 471, -2241, 1171, 1549, -2037, -307, 2374, -1186, -2222, 1982, 584, -2755, 74, 1637, -2182, -947, 1570, -700, -1921, 1358, -355, -2841, 621, 1653, -2613, -1497, 2208, -850, -2735, 1029, 412, -2511, -127, 1025, -2385, -1269, 1553, -1640, -2557, 1589, 605, -3207, -335, 1809, -2152, -1905, 1746, -533, -2268, 595, 355, -2255, 158, 1500, -2248, -1330, 2203, -519, -2798, 1326, 1562, -2362, -435, 1985, -1302, -1365, 1715, -37, -2057, 1723, 1388, -1977, 263, 2232, -1311, -1249, 2821, 631, -2086, 1434, 1964, -1370]
2637a370J382K174k725L4L402k482k045L721L95l923J827K600k993q06L179j097
2653A273k805L074P94l596J198K821l190l51L211j654k497L263R91l745O93L283
2669B763k732j333L709j360k603L061M05l483J341L048l334j322M058j073l003
2684a858K481J505l251O00K919l040j197L701j002l152K655J449l855J084L281
2699B320l069j264L252k16l488K499J475l539P41L105k787j571L776m05l578K361
2715c88K074l296k54L438k428j648L399q17k626K034K096l759L53L676k375k104
2731b625L353j05l218K000K500l555j34L350j978k197L823q1l272J956K085l310
2747a408p5L222j450k250K715N17l233J605K683l045o99L668j707k672L478N27
$$ y = [-1370, 12, 2186, -539, -505, 2897, 415, -1630, 2091, 2486, -1437, 390, 2990, -3, -809, 2370, 1273, -1532, 1542, 2336, -1260, -62, 2759, -431, -782, 2429, 775, -1722, 1541, 2532, -1213, -520, 2763, 31, -1302, 2407, 1047, -1556, 1505, 1910, -1573, -232, 2816, -518, -1840, 2218, 1145, -1858, 623, 2128, -1123, -523, 2396, -644, -1841, 1860, 858, -2294, 361, 1810, -2045, -961, 2320, -749, -2013, 1239, 1023, -2465, 34, 1509, -2030, -1289, 1816, -971, -2542, 1234, 829, -2749, -388, 1686, -1610, -1864, 1574, -854, -2502, 897, 80, -2546, -512, 1584, -2175, -1822, 1854, -521, -2625, 728, 623, -2595, -595, 1905, -1650, -1784, 1566, -412, -2609, 1214, 1133, -2139, -183, 1902, -1408, -1483, 1739, 289, -1961, 754, 1271, -1962, -357, 2326, -719, -1418, 2250, 543, -2129, 1349, 1876]
2763A876l212J269K311k993n61L532j461k498K748J246l732J010L200k877q98
2778a040L579j604k554K791J087l544J248K635k464j235L246r88k811K580J413
2793B339l346M07L084k244j777L514o90l307L137Q74l365N14L186k353j590L384
2809A767o20l143K339J583l339N36L087k411j828L139l65k863K058J956l485r4
2825a683L436j849k532L753l58k707J829J586l247m1L348k084k106L486p8l116
2841b363J422K364l330k37L708k122k115L529L9l570J879K120k882n68L714j836
2857b48k606L204R97l636J288K419k454q08L211j388k313L039L51l599J870K999
2873B326l381r10L595j265k377K264J263l286J005K721k808p64L409j069l077
$$ y = [1876, -1336, -67, 2244, -749, -1310, 2222, 761, -1737, 1011, 2257, -1475, -465, 2735, -142, -1040, 2539, 935, -1619, 1172, 2259, -1285, -37, 2598, 134, -1101, 2145, 1157, -1654, 926, 2339, -1007, -600, 2484, 240, -1537, 1977, 1287, -2020, 1117, 1991, -1374, -860, 2326, -27, -1617, 1767, 1147, -1996, 343, 1926, -1413, -877, 2210, -201, -2029, 1110, 745, -2118, -60, 1896, -1589, -1683, 1753, -96, -2628, 1125, 767, -1940, -111, 1475, -1772, -1813, 1535, -549, -2655, 831, 753, -2363, -941, 1423, -1907, -2144, 1564, -558, -2673, 856, 895, -2675, -796, 1324, -1558, -2126, 1588, -248, -2854, 350, 1347, -2289, -1001, 1418, -1036, -1844, 1367, -21, -2334, 705, 1056, -2543, -673, 2326, -1055, -1965, 1630, 365, -2012, 252, 1515, -1771, -766, 1955, -853, -1617, 1792, 723, -2354]
2888b354L260J245l555N15L170k398j362L249o62k557K397Q27l224R91K991k727
2904a94j641L885k54l587K360J900l462P76K550k418j044K974p66l129K925J610
2920B485l460N25K927k007k146L269J74l401J978J892l005j11L078k397j401L336
2936A736l56l467K163K667l932j96K966j343j730K341J15k922K093J724l141j61
2952a443L453k027k575L274N24l288J410K445k804o65K961j319j952K956Q2l446
2968b414J826K553l539q39L870j210k969K719J440l170Q38K110k640J9K531j537
2984d12k544L439Q68l959J482K785k752j207L384q67k109K008R92k830J230K101
3000A609k787o33L636j229l005K638J634l450P8L030j496j736K751n00k347K684
$$ y = [-2354, 906, 2151, -1404, -889, 2281, -117, -1479, 1770, 1108, -1449, 948, 1775, -1449, -458, 2533, -194, -1835, 2050, 1796, -1791, 569, 2469, -993, -217, 2333, -85, -1129, 1845, 1079, -2050, 875, 2485, -975, -450, 2477, 470, -1676, 1593, 1767, -1634, 344, 2236, -769, -880, 2198, -199, -1600, 1736, 1380, -2087, 76, 2743, -1189, -1385, 1581, 238, -1492, 849, 964, -1958, 135, 1859, -1282, -1443, 2010, -17, -2592, 682, 1206, -2082, -672, 1773, -1031, -1696, 1265, -54, -2006, 950, 1032, -2414, -588, 1965, -1574, -2413, 1457, 247, -2722, -3, 1437, -1733, -895, 1215, -1425, -1406, 1125, -412, -2956, 483, 1351, -2608, -1126, 1659, -1093, -2300, 1084, 217, -1892, 116, 1108, -1722, -492, 1609, -1178, -1811, 1825, 596, -2409, 229, 1863, -1587, -1509, 1521, 25, -1711, 1040, 540, -1807, 877]
3016H77R79l188N16L683l605j304M081l49l531K168J478k420k35K959j860j072
3032h23K733r98k823K625J740l784N56L358j887k325K798M62k669J514J253k091
3048c61OK834k177k126L774k76l266J558K713l004p48L033j227k098K704k0k799
3065a480J875J578l083J3L567j751k932K979J169l522J237K370k720p07K703r19
3081C77k227K598J41l269K149K299l003j128L771j174k825K326J001k408O08K153
3097A389k397m68K672j255k555L193Q86l800R70K910k639j123L284m91k729J889
3113b64J058k726J367K231l059n47L229r48k968K043K183l092L68K598j881j517
3129a925K750m15k232K153J012l113J095K811k480j880L512P0k959J187J976k737
$$ y = [877, 1856, -1332, -816, 2867, -738, -2042, 2039, 1690, -1841, 327, 1805, -615, -850, 2109, 249, -823, 1910, 912, -1911, 714, 2454, -1330, -774, 2584, 697, -1628, 1170, 1632, -1037, 477, 1730, -361, -355, 2479, 302, -1824, 1950, 1674, -1592, -34, 2679, -325, -1073, 1960, 733, -1365, 1339, 1319, -1480, 395, 1973, -1110, -1097, 2470, 719, -2213, 766, 1935, -1587, -350, 2020, -700, -1407, 1296, 377, -1850, 748, 889, -2380, -231, 2068, -935, -2063, 1708, 534, -2291, 35, 1036, -1372, -764, 1389, -1008, -1476, 1196, -59, -2614, 579, 1465, -2335, -1365, 1545, -1094, -2217, 1067, 576, -2153, -264, 794, -1932, -565, 1666, -1393, -1940, 1289, 341, -2627, -584, 1599, -1493, -1125, 1473, -408, -1925, 825, 410, -1822, 331, 1343, -1770, -675, 2136, -344, -2224, 1288, 1358, -1601, -414, 1562, -1175]
3145a175M90K494j970j097K719n13l001K287K098l642j60L838j678k397K601O44
3161A538k547J479J403k570N79K338k126j813L553J93l686J608K689k642q93K698
3177A801j094j666K086K32k770J768J903l150j26L591j469l021K723J051l069
3192a210Q32K350k132j031K908j136k322L061K48l328J741K442k826j573L261
3207A285l75k463J340J627k730L26K502k199p41K928j241k494K719J378l555K81
3223a412L253k577j206K696m44k132J887P53k617R83K097k546r95L438n98l083
3239b503K056J682k479n72K951j418j440K196l58k161J819J418l088L28L476k279
3255c72k258L202K67k937J409J982k398J25K321j990j140L016n34k944K230K016
$$ y = [-1175, -685, 1809, -161, -1258, 1461, 948, -2053, 234, 2332, -1310, -1470, 2368, 690, -1707, 894, 1538, -1009, 470, 1873, -697, -118, 2220, 94, -1719, 1834, 2027, -1659, -51, 2638, -4, -897, 1801, 707, -959, 1127, 1359, -1411, 357, 2260, -890, -1016, 2575, 1106, -1915, 808, 1859, -1210, -378, 1972, -160, -1191, 1717, 581, -1741, 1320, 1568, -1760, -19, 2423, -403, -1976, 1285, 910, -1553, -213, 1414, -1316, -990, 1512, -687, -1428, 1500, 259, -2235, 484, 1862, -1693, -1412, 1841, -736, -1942, 754, 310, -1822, 65, 818, -1799, -816, 1281, -1265, -2260, 1178, 580, -2503, -447, 1235, -1244, -1816, 1135, -283, -1723, 473, 115, -2046, -227, 1191, -1897, -1569, 1907, -372, -2630, 572, 839, -2098, -689, 1293, -1105, -980, 1341, -649, -1789, 1227, 693, -2251, -21, 1995]
3271A995l046k29K806j157k014K048J007k622J335J373k603K78K579j449k124
3286a823L360P9l276J410K415k437p22K480q59j978K358L33k457J142J999k676
3302f52m88L580j436k618K439J032k717L07K716k644m00K551j253j838K234J107
3318A920l371J397K185k184j314K953o71k531K132J064k751Q16J962k088q91K966
3334A594p22k761K556R31k731p9L101j892j826K723m05j735J275J119k529O99
3350f82K153k114j263K700j21k668J642J666k680k22L021j814j388K299j06k558
3366b135J811J498l038M11K752j619j997K725L65k800J395J575k235K65K287j594
3382c34j588K604J54l148J796J871k662j50K659o63k312K035N98k504R55K057
$$ y = [1995, -1051, -1280, 1526, 369, -1645, 403, 1410, -1212, 123, 1496, -1107, -829, 1750, 301, -1823, 1537, 1616, -1660, -250, 2165, -272, -994, 1486, 627, -1351, 1007, 1340, -1117, 25, 2024, -652, -1140, 2440, 1004, -1614, 825, 1857, -860, -553, 2163, -481, -881, 1670, 417, -1421, 813, 1920, -1451, -54, 2131, -53, -1367, 1586, 915, -1616, 516, 1580, -1171, -355, 1607, -481, -1372, 1594, 872, -1889, 667, 1598, -1133, -1212, 1889, -3, -1829, 894, 489, -1246, 29, 1148, -1381, -682, 1471, -643, -1906, 794, 673, -1995, -353, 1313, -1367, -1589, 1432, -382, -1770, 529, 423, -2135, -324, 1174, -1864, -1453, 1299, -320, -2317, 408, 773, -2027, -632, 943, -1292, -1027, 1260, -334, -1922, 682, 836, -2312, -516, 1355, -1307, -1457, 1202, 539, -1773, 262, 860, -1644, -689, 1368]
3398A368k423J86K509j415k023K717O75l152J027K170j923j018K588p50j898K253
3414H91N71k678J325J900k281j057K860n74k320K184J027k650M90J790j568n98
3430f88K405j101j886K118R69k705N95K105j324j394K464l97k419J915J006k431
3446g68N03K176k257q25K371m04k454J742J600k607L42K364j658j200K169K9k959
3463a836J810J545k365L5K604k245j109K710L7k882J458J652k784Q1K734j253
3479A92j879K192K24k542J488J731k662J79K246j317j971K474K12k220J256J482
3495A085k257k30K461j235j833K469pk353J424J691k268k95K347j153j562K029
3511C13N82k753J253J648k126m72K524o79k141K027R48k567P03K251k288m32K366
$$ y = [1368, -1055, -869, 1640, 225, -1798, 919, 1594, -1558, -531, 1639, -284, -1302, 1286, 536, -1362, 891, 1462, -1216, 109, 2009, -272, -1329, 1531, 957, -1363, 821, 1848, -802, -312, 1478, -90, -688, 1717, 616, -1270, 848, 1817, -888, -293, 1812, 488, -906, 1558, 1161, -1258, 657, 1663, -768, -265, 1911, -346, -1171, 1200, 796, -1658, 84, 1684, -923, -581, 1783, 125, -1075, 1094, 1123, -1836, -26, 1519, -846, -811, 1793, -452, -1561, 1149, 1186, -1696, -238, 1414, -1370, -1289, 1445, 192, -1687, 505, 729, -1813, -325, 1406, -1256, -1077, 1169, -148, -2119, 355, 567, -1653, -397, 1085, -1172, -1402, 1059, -176, -2009, 460, 453, -1900, -476, 1215, -1053, -1348, 999, -154, -1716, 313, 895, -1858, -605, 1043, -1083, -1555, 969, 290, -1851, 176, 1124, -1443, -740, 1511, -777, -1209, 1157]
3528A157o54k068J905O34j912N32K088j950j233K724l60k165J759Q24k147K53
3544f13K468k024q75K497m77j940J393J253k533M52K439j980j057K204j25k374
3560a292J686J253k403L24K201j539j333K394l7k423J803Q66j860j2K042j510
3576A60j300K477l58k366J593J148j901l14K424j359j587K271R4k104J233J326
3592A437k361J20K475j650j253K044N67k716J217J358k028j70K150j044j743K360
3608G63J4k346R90K000k401j48J975r47j468J728L77k245Q09K044k018j93K078
3625A012j032k162K442P98k734P98K176j992r80K378q66j473J614P18k295J003
3641e95J438j661p90K596o12j991J774J025k149j08K193j583o27J827n42j897
$$ y = [1157, 503, -1565, 340, 974, -938, -406, 1682, -268, -1501, 1223, 863, -1302, 457, 1281, -866, -613, 1855, -169, -1044, 1453, 976, -964, 429, 1682, -851, -399, 2040, 60, -997, 1207, 1082, -1292, 394, 1647, -756, -432, 1769, 230, -1103, 1291, 1254, -1169, 634, 1500, -360, -372, 1670, 160, -1140, 1337, 979, -1387, 206, 1354, -547, -861, 1563, 204, -1383, 888, 982, -1122, 111, 1437, -924, -804, 1671, 21, -1232, 812, 1379, -1337, -120, 1238, -790, -960, 1190, 146, -1597, 763, 777, -1569, -579, 1421, -980, -1128, 847, -100, -1568, 160, 537, -1708, -899, 1145, -873, -1066, 1012, -20, -2182, 260, 1058, -1676, -878, 1298, -694, -1674, 704, -162, -1635, -21, 697, -1598, -595, 843, -818, -1608, 988, 376, -1615, 159, 1184, -965, -1073, 1120, -463, -1090, 737, 195, -1702]
3657a702J504J219k065N82J737j585r95K481k93k097J304J239j894K44J500j051
3673A28j259K537o33j928J577J094k230j13K528j385j193J814r8j839J114J580
3689A694k156K68J991j519j209K252k5k444J251J717k109k99K163j137j345J886
3705I79L0k143J621J348k763K81K243j515j090J799L70k284J073J535j910j81
3721f07J912j234j053J857J16k600R98J968j949q50K297l40j888J655M25j617
3737i10N11J404j833n19K410j055j791K219O27k546O47K009j939r25K077l91j478
3754a483J848J23j904R19J883k366p84K783r09j676J230J259k418M52J582j388
3770h49l64J966p69j693J815Q05k402M85K255j503j017J940n0j899R31J534j831
$$ y = [-1702, -198, 1021, -1044, -462, 1275, -310, -1305, 1176, 883, -1214, 90, 1329, -565, -321, 1179, 128, -1131, 1406, 773, -1155, 422, 1516, -714, -827, 1701, 316, -877, 937, 839, -1000, 114, 1694, -462, -194, 1797, 278, -931, 1321, 1296, -1148, 103, 1820, -289, -588, 1575, 438, -907, 979, 1009, -1134, 487, 1835, -928, -647, 1596, 81, -1009, 790, 1160, -1124, -51, 1484, -426, -607, 1305, 71, -982, 875, 991, -1609, -611, 1357, -592, -1442, 855, 515, -1373, 282, 707, -910, -399, 1005, -828, -1347, 1063, 8, -1783, 436, 1063, -1483, -836, 1173, -766, -1691, 386, -5, -1483, 365, 488, -1416, -497, 1386, -980, -1764, 1019, 110, -1566, -336, 923, -1495, -1043, 539, -849, -1213, 753, -16, -1709, 106, 911, -1491, -1006, 1249, -254, -1271, 669, 619, -1280, -349, 1185, -646]
3787f46J37J534j415n15J759k27k095J502J314j916k19K231j039j213J732Mj721
3804g93J227J111k268K36K007j385j213J966N47k431J043J494j654l51J694j073
3820A57q97J838k52j717J340J520k615l85K731j144j784J892O91j947N91J265
3836A284j348k92J519o69j792K122M29k506R41J512j617n94J942j59j785J476
3852D63M62j660O78J320k215P2K109q25k187K190N70k191L20J921j222r93J940
3869G52q79j199J517M71k122J100J478j684j113K231j04k293J408J561k258J18
3885a016J975j382j033J897m28j645J470J333k817N54K223j721j209K137K74j922
3901a310R22Q87j469L51J742j613r86J967J92k311J450J311j634p77K098m95j506
$$ y = [-646, -509, 1025, -390, -905, 854, 627, -1468, 34, 1348, -568, -787, 1444, 405, -808, 924, 928, -793, 434, 1545, -723, -487, 1520, 135, -1078, 888, 1435, -996, 47, 1541, -113, -464, 1230, 157, -740, 1098, 846, -871, 469, 1989, -626, -1011, 1720, 576, -1208, 684, 1375, -572, 19, 1284, -64, -356, 1163, 494, -1298, 824, 1253, -1253, -312, 1200, -417, -1011, 931, 772, -1013, 463, 925, -735, -57, 1263, -952, -880, 1229, 404, -1783, 407, 977, -1214, -894, 1027, -195, -1188, 752, -127, -1326, 191, 662, -1460, -360, 1118, -566, -1679, 552, 448, -1845, -437, 1124, -1134, -1016, 959, -423, -1456, 441, 13, -1632, -162, 1171, -1646, -1092, 1131, -590, -1799, 338, 612, -1310, -388, 499, -970, -619, 1123, -490, -1476, 491, 683, -1628, -178, 1133, -501, -1278, 820, 325, -1181]
3918a181J315O05j874J007J699k152l4K301j744j195J964N66k195O16J805j848
3934c45k11J624p81r98J872m27j702J084J389j841m77K180o28j697J433R63j815
3951c77M11J552j769l38K229j191j581K107M20k606J123J742j873q05K341m14
3967I71j817J406K80j658R49J331j895n58K081k19k358J568J145k072J35K031
3983A320j339r09J621o44j339R87J245k120O14K171j652j592K545k94j784J032
3999a38P62j407J03J578j095r11K038m85j943J665P85k265J20K362j486j081J716
4016C18M40j711L99J217j541Q7J557j302j129K321p5k324J200J761j896n20J818
4033F20r77r62J650L8j555J544O54k211K37K096p03k119K046P41k401R57J262
$$ y = [-1181, 134, 739, -1135, -128, 1571, -581, -615, 1686, -58, -1253, 711, 1277, -918, -302, 1503, -345, -556, 1068, 287, -711, 1161, 734, -968, 116, 1505, -336, -813, 1367, 739, -958, 475, 1438, -377, 34, 1586, -183, -521, 1708, 517, -1064, 1043, 1463, -1143, -20, 1722, -151, -956, 1385, 971, -846, 560, 840, -818, 131, 1462, -433, -991, 1090, 871, -1487, 81, 1226, -846, -711, 1320, -19, -928, 693, 49, -1290, -303, 942, -1178, -564, 1607, -45, -1637, 908, 614, -1170, -138, 624, -783, -680, 898, -197, -1108, 930, 445, -1498, 167, 952, -1313, -1193, 1169, -317, -1398, 318, 758, -953, -554, 663, -878, -791, 766, -536, -1665, 656, 581, -1743, -543, 1218, -678, -1198, 620, -357, -1319, 331, 369, -1186, 358, 1012, -1199, -962, 1134, 431, -1688, 358, 1099, -1302, -345, 917]
4050I17j281m62J914r71j239J433J77j739R96J683j966m76K349o86j518J211P90
4067A132j774O30J227j659M4J614p60j660J884M86j891M66J725j432r61J923r5
4084H99j627J389M33j741N52J825j779n29J959n65j989J826N34j560j8J774p53
4101F30j559J930k79j493J106P07j795M26J773j280j485K499m79j973J293R56
4117I77j448j11J270j193k88J281k19j816J537J325k164k14K122j063j366J785
4133D15K27j766Q39J111j692n3J754j059j324J786L10j853O29J775j731q23J883
4150D28l43j775K028J89j854J141J143j872n45K283q07j580J775M57k222Q63J848
4167A157j665p38K101p76j421J756N76k060Q38J705j924q13K406o43j627J106
$$ y = [917, -364, -826, 1088, 117, -1122, 311, 488, -1251, -255, 1428, -538, -1014, 1335, 649, -869, 342, 1132, -642, -12, 1215, -444, -400, 1214, 454, -1206, 678, 1164, -727, -261, 1464, 32, -929, 994, 899, -728, 661, 1094, -647, -95, 1730, -49, -578, 1381, 816, -1173, 653, 1187, -373, -391, 1383, 630, -929, 1001, 722, -771, 335, 1042, -753, -327, 1446, 166, -1319, 1180, 701, -1272, 21, 977, -471, -582, 688, -505, -793, 488, 269, -1547, -10, 1315, -849, -1063, 1059, -4, -1370, 415, 642, -1124, -285, 826, -866, -919, 835, -224, -1548, 238, 548, -1305, -676, 1099, -632, -1455, 428, 85, -1690, 338, 527, -1327, -186, 957, -915, -1460, 823, 16, -1564, 211, 668, -1554, -691, 1157, -508, -1246, 855, 79, -1342, 414, 990, -1070, -232, 1473, -451, -1264, 1142, 499, -1128, -22]
4183b2R28k013O76J595j281o12J552l63j417J293J108k311O19J826j685p80J794
4200I07k97j303J233N28j686O36J402j465r84K236m68j552J028J300j944N7J615
4217A243j146o43J515k03j774J453R18j847M0K219j493j371J947J2j761J141R71
4234A221j754J35J563j007j233J909J10k316J544R35j495m76K054q51j427J213
4250A25P79j828O60J357j739l08J720p24j371J759J05j647P17J281j578n34K124
4267H98m24j886J369N81j659M19J506j318n53J809p08j221J130N52j734N47J643
4284I51j337o83J834n35j427J096Q58j659J36J559j144q90J942n14j541J529M89
4301F64j629J35J767j155q87J835j31j852J724N80j885M41J435j230p88J726k86
$$ y = [-22, 906, -1107, -431, 1164, -117, -729, 823, 460, -957, 336, 1444, -867, -248, 1578, -107, -887, 907, 610, -693, 540, 1068, -618, 18, 1420, -45, -1029, 1207, 739, -813, 215, 1515, -429, -372, 1243, 97, -546, 969, 766, -1008, 445, 1363, -484, -444, 1775, 282, -1089, 858, 870, -891, 250, 1221, -533, -398, 1165, 158, -1075, 834, 944, -1372, 172, 1107, -388, -864, 1190, 339, -1088, 125, 904, -924, -264, 1093, -646, -954, 766, 42, -1329, 430, 535, -1112, -395, 886, -692, -1226, 898, 474, -1412, -43, 538, -1121, -702, 804, -514, -1067, 742, 34, -1187, -57, 495, -1239, -692, 951, -386, -1069, 765, 230, -1197, -101, 757, -902, -766, 793, -351, -1241, 701, 187, -1354, 175, 664, -965, -830, 937, -218, -1105, 730, 599, -1253, 471, 1051, -834, -393, 1042, -188, -976, 750, 464]
4318D64j745J274J058j927N25J594o90j734J820K42j609Q59Q24j474l2K055j353
4335A51j145J807M29k231J054J054j402p3J786r12j231J668m8j666R81J182j284
4352A20o36J824j023j187J733K73j829J093R12j225q38J965j173j306J760M13
4368H76k089R09J681j893n64K034o16j424J839J19j454mJ946j916r4J655p88j692
4386a475J671P12j895N62J639j453o99J625n37j527J430O91j802M85J572j512
4402e13q15J893j24j665J196P19j816M68J563j217j171K104m60j582J520Q13j943
4419a030P2K020j301j058J618M24k069J252P31j368j58J732q20j260J718j57j783
4436a437J429J077j692r8J294l71j408J689K10j601Q85J111j624k23K024j253
$$ y = [464, -1281, -7, 1051, -876, -351, 1243, 553, -1181, 639, 881, -728, 131, 955, -519, -551, 1504, 151, -994, 813, 1242, -989, 65, 1119, -283, -356, 1430, 518, -713, 955, 907, -759, 222, 1404, 120, -516, 1308, 285, -902, 831, 1104, -725, 368, 1280, 55, -783, 1182, 9, -1297, 463, 876, -1213, -304, 1377, -516, -1080, 954, 338, -1086, 753, 872, -582, -586, 1360, -556, -650, 1005, 217, -1475, 196, 908, -987, -425, 1214, -239, -938, 687, 150, -1377, 53, 744, -1058, -573, 999, -513, -1328, 565, 441, -1224, -28, 691, -1125, -657, 906, -311, -1482, 622, 162, -1420, 100, 913, -1030, -958, 1062, -239, -1297, 321, 745, -1324, -72, 659, -709, -867, 865, 45, -1215, 503, 346, -1437, -8, 1069, -623, -721, 573, 202, -1206, 483, 693, -908, -23, 1088, -536, -759, 1265, 12]
4452A2r89J834K27k026Q76J166j696J56J244n15j012J120L82j723R95J204j287
4469c2o39K049m75j795J670J33j809R49J234j544l67K136r48j494J664N19k089
4486h38R17J431j546r39J797j57j469J138M25j394M25J546j608o91K312q96j645
4503a192J353R94k086M48J293q91p70J751o21j228J283L00j657N93J493j699o77
4520a313J941j00j892J158Q06j465M48J269j541l06J349j71j253R16J215j906
4536h45m50K368j437r92J783m9j350O52R60j267j06J425j215p82K098j05k081
4553a393J544P36j366o19J683n85j075J518J6j633J276P01j757M9J988j053j149
4570a119J571N25j916O44J229j157p16J443o7j588J896P9j766Q76J147j383j29
$$ y = [12, -977, 857, 1084, -942, -66, 1100, -596, -440, 804, 289, -723, 397, 779, -944, 51, 1255, -32, -671, 1378, 903, -892, 778, 911, -898, 51, 1285, -259, -626, 1510, 562, -932, 732, 1251, -838, 79, 1510, -36, -975, 822, 665, -804, 334, 759, -635, -210, 1336, -272, -963, 1349, 453, -1192, 161, 1155, -931, -483, 810, -81, -851, 900, 279, -949, 334, 634, -1023, -430, 1063, -636, -1313, 628, 528, -1364, -206, 600, -865, -417, 852, -689, -995, 354, 183, -1070, -154, 1061, -845, -1295, 1073, -364, -1356, 427, 378, -972, -320, 640, -627, -733, 692, -523, -1305, 793, 688, -1393, 151, 887, -479, -1098, 585, 0, -1075, 443, 459, -1174, 102, 803, -954, -905, 1083, 30, -1119, 452, 977, -939, -295, 934, -223, -939, 504, 437, -1151, 745, 824, -942, -66, 1081, -302, -431]
4587d31J248l83j268J084Q74j670M70J254j303k94J416n33j451K017L22j955N21
4604h2J509j320q95J983n48j376J634J34j695Q97P55j162m10J761m04j653R95
4621A23J357k049M39J341j372n08J414m46j333J462M61j734L73J681j369o86J322
4638D76J82j496P55J093j466J4J464j587j24J186l68j233J188J104j985r2J872
4655I83j079j106J341R2j315R17J059j639K19J335q62j197J880M7j954P14J661
4672A096j791m06J260j62j289J768k52j653J522P36j726m19K251j050j060J417
4688B42K38j359L05J091r66j11J269q68j024J707L90j962R25J264j419n88J529
4705F63m21j047J063M93r42o0R35r62m69J401m26j467J582P81k050M32J767j196
$$ y = [-431, 817, 434, -834, 250, 1124, -546, -76, 1178, -125, -419, 997, 464, -987, 1030, 1352, -603, -82, 1427, 107, -788, 1195, 647, -729, 905, 1039, -656, 241, 996, -166, -576, 1185, 781, -872, 123, 1480, -569, -130, 1211, -161, -669, 745, 299, -1034, 428, 889, -845, -472, 1209, -160, -846, 476, 658, -838, -83, 1010, -456, -442, 1022, -565, -689, 497, 129, -1104, 84, 1188, -797, -889, 983, -96, -1202, 139, 231, -1084, -167, 892, -747, -528, 807, -55, -1252, 628, 675, -1279, -565, 1096, -695, -1101, 159, -3, -1292, 476, 224, -1429, 93, 829, -897, -1316, 935, -115, -1175, 242, 480, -879, -574, 517, -449, -560, 709, -159, -1183, 524, 914, -1048, -123, 1141, -278, -866, 663, 242, -805, 258, 751, -191, -251, 684, -278, -747, 654, 228, -1239, 343, 1124, -926, -494, 1273, 77]
4723G7n35J181Mj468J295M1j249Q01J237j523n28J596p8j740J141P72j414K18
4741a72J093q22l99P32j4j371J386O33j753M42J654r13j116J096K34j395N75R02
4759G92j056j52J357p54j133J693k7j657P79J092j061n98J345m99r55J169L8j284
4777i11P89P61j495L45J294r42q97J289M99j741M75J171j137l07J424o52r37Q35
4795a37M14j259P76R07j336l53J691o01j227J044N57j395L13J029q46l41J213
4812D49o29r76J389O09j521l7J542q79p69J305r4j238J241L52j586L29J144q50
4830b19o19J451q9j734J596O79j551O5J402j161l93J302m2j412J170L85j287L05
4848a52J229j110r28J629o7j283O45J057j106k51J123q16o98J698m36j414R27
$$ y = [77, -458, 723, 727, -741, 554, 595, -654, 147, 1384, -139, -667, 929, 851, -889, 252, 1024, -390, -172, 921, 99, -300, 432, 418, -953, 433, 1066, -687, -245, 1409, 496, -620, 476, 710, -685, -110, 792, -264, -416, 941, 187, -946, 747, 720, -937, -158, 934, -127, -725, 620, 121, -834, 335, 373, -911, -122, 639, -856, -511, 783, -159, -1056, 233, 732, -1009, -534, 637, -500, -807, 617, -35, -972, -137, 277, -982, -206, 701, -635, -988, 703, 102, -1125, -81, 476, -919, -606, 423, -423, -764, 449, -180, -1156, 233, 842, -679, -716, 826, -53, -822, 483, 389, -849, 392, 744, -842, -513, 631, -219, -838, 613, 524, -1210, 386, 1065, -486, -421, 981, -180, -573, 729, 687, -725, 445, 830, -457, -152, 1077, -33, -961, 668, 601, -682, -37, 1020, -86, -337, 786, -30, -728, 970, 534, -880, 47]
4865D7R98j690M51J298r03q03J228k9r50M80R59j374J23J312j229l50J139O4j229
4884d58L03J376j524m7J205n06j237J156M25j362P01Q77j413J13J306r01j074
4901a060J448M85j810N53J281j163l10J177k82j181J179L81j455M14J421j396
4917c18o95J533l13j498J165Q47j541J57J805j587n83J738o86j196J244N63j792
4934a157M29J567j279n51J325K09j265P08N96j163l5J272r77o48J626k32j405
4951i80Q84R49j583L8J537r25q07J501k35j132R56Q05j439K04Q87n65r26J534
4969G03j9j503Q39R24j429m1J370o35p08J134Oj195J156M75j412j37J728p81j123
4988f48J286k0q60K93O19r98M8J265q82l78Q91J28j341R51P19j211m06J458o97
$$ y = [47, 1045, -645, -194, 1104, 201, -602, 626, 597, -353, 127, 1086, -288, -165, 1147, -82, -432, 707, 771, -458, -155, 1221, -303, -350, 855, 349, -888, 268, 693, -669, 32, 909, -504, -391, 915, 14, -1060, 388, 873, -937, -384, 897, -266, -576, 601, 319, -862, 317, 698, -757, -343, 1078, -318, -1013, 520, 207, -1291, -126, 721, -820, -663, 1142, -445, -1028, 710, 24, -1172, 72, 635, -1157, -728, 839, -440, -991, 334, 543, -722, -14, 582, -581, -616, 656, -321, -969, 657, 425, -980, -96, 853, -730, -692, 845, -80, -887, 614, 379, -753, 203, 1008, -431, -227, 660, 95, -831, 703, 684, -819, 20, 944, -485, -526, 844, 209, -499, 635, 641, -554, 602, 1077, -335, -472, 1256, 475, -648, 638, 618, -242, 51, 670, -328, -280, 985, 103, -275, 616, 744, -597, 354, 1073, -138, -544, 914, 217]
5007B17j096J366R4r28L20Q44j286j14J684q33j051J528Q3j597N71J107j034l41
5025d66J272p48r01J108N05j671N64J072j034n67J384l92q24P00N47j346K6J415
5043F44p93p68J450l50j087P96P36j480K88J267j188n61J550m17r51O37O59j212
5061g80J38J561j298n35J243Kj403Q11J101j512P1J227p77j065J694k9j498J028
5079b1P03j477L10R49r41k12J074p3j216R47O46r12l19J281n94q57R53K20j152
5098f91O32Q13j047o8J026m04j076J605m09q16M88Q99j567L21J119l55j419J293
5116C44O48j685Q75R24j360r0J268o15o25N67O90j319O37O61r41l34J121l49j160
5135g43J470M7j301M23Q85r03m40J621p30q41Q16K49q37J81J086r58n71J080k65
$$ y = [217, -879, 487, 581, -347, -27, 817, -469, -583, 1101, 268, -783, 745, 828, -769, -198, 909, -125, -466, 806, 58, -843, 265, 770, -901, -337, 735, -299, -866, 518, 126, -698, 2, 549, -797, -771, 644, -149, -917, 533, 183, -904, -108, 628, -852, -564, 703, -485, -1046, 504, 87, -864, -227, 432, -780, -642, 919, -379, -914, 329, 331, -1072, -261, 840, -672, -601, 626, -151, -1216, 478, 449, -1049, -21, 682, -795, -485, 464, -477, -689, 385, 312, -904, 43, 689, -223, -542, 739, 145, -712, 241, 461, -691, -59, 754, -293, -361, 665, 261, -815, 790, 381, -435, 53, 952, -615, -294, 825, 470, -949, 344, 992, -693, 182, 1106, -254, -344, 924, 309, -316, 251, 941, -378, 259, 920, -21, -355, 766, 417, -743, 727, 774, -527, -104, 781, -122, -562, 1059, 329, -512, 304, 553, -284, -103, 983, 25, -546, 534, 269]
5154B69j057J232L12j403L29J256j152k83J071j75j076M45P44j064J15R33q65
5171c69p13J304m3j039Q37N84j028l1J010q59k48O43J10j097Q65K44r93L19J115
5190F11p00j125J564k66j157J159K22q90k7R11m48o59J229k01j300P14J411j485
5208d37j82J406q87p89J132J88j136M37P78o39m95J249l81j019R88jr51P38J185
5227A184j099m64R94m65p91J133J78j054M84Q85j238q2J231p59q42J225M82j627
5245f25N11J229j070l93R30m08n84J114K07j421L22J345j304j20J360j067p88
5262g62J224M31j255J31Q56m91n33J158j78j083Q76L76j292J26J133o75q03J035
5280B74J53j039O81L90r78L7J019o27m92J180k51j283Q72P63r80j47Q59n15m98
$$ y = [269, -788, 444, 756, -647, -318, 938, -214, -497, 574, 399, -677, -232, 512, -552, -437, 496, -369, -1082, 222, 179, -860, -23, 561, -467, -498, 512, -347, -595, 48, 158, -939, -74, 170, -823, -504, 611, -89, -1214, 350, 84, -1073, 86, 308, -582, -609, 302, -146, -805, 424, 223, -1077, -363, 1048, -437, -619, 787, -100, -889, 243, 431, -705, -268, 510, -129, -624, 625, 244, -775, 213, 212, -739, -1, 1184, 85, -379, 615, 150, -641, 492, 670, -384, 100, 985, -253, -335, 896, 137, -705, 520, 1002, -625, -114, 1115, 45, -348, 582, 174, -410, 704, 911, -510, -188, 1157, -147, -267, 1093, 26, -762, 462, 893, -362, -231, 625, 134, -399, 759, 581, -502, 374, 750, -542, -416, 717, 42, -761, 274, 427, -612, 69, 459, -519, -482, 537, -90, -582, 598, 347, -936, -64, 699, -281, -428, 431, -84, -582]
5299e82Q10k13r54Q38O58j074K0Q92n16q90J517j48j081M39O75o23k63R31o53
5318b17m31J009mj395Q77N67j243K58J318p17j160J470M13j384M17N06j072M48
5336c40Q31l82m43P41K05j507J043N22q18n84J247j37p94N21J18j016O54P30j059
5355d68k98J448n50j271J551L96j275L4J054n89k40J053o08q78J152J50j271N32
5373g8J247j122r23J306K35j234Q48M81j094N49M88p17l15J152l61j122J122J89
5391F51r00K00J107q71n98R48J05j193M69P69j169L17Q77p88j03R12l73p96N40
5410A04Q37j361j48J021l45n14P00J30r24L66O41p32J50Q71o97p63P00M91j079
5429e52M78M94j088M8J015n88m68R56P6j187Q08O26j223j23J330p67p33J028L32
$$ y = [-582, 228, 15, -939, -101, 557, -517, -497, 395, -121, -1011, 506, 358, -723, -284, 391, -232, -495, 436, -217, -648, 361, 357, -1038, -161, 406, -837, -579, 739, 22, -1138, 332, 745, -639, -222, 284, -788, -340, 491, 109, -334, 407, 612, -895, 148, 670, -148, -732, 515, 378, -416, 105, 223, -793, -139, 591, -468, -766, 682, 132, -1139, 412, 808, -467, -433, 621, 32, -208, 845, 237, -641, 511, 661, -610, -78, 1169, 47, -876, 430, 665, -569, 279, 760, -334, 215, 703, -14, -329, 823, 462, -660, 462, 651, -249, -49, 1058, 187, -411, 537, 642, -551, -82, 687, -482, -165, 712, -76, -179, 733, 360, -436, 104, 941, -420, -568, 453, 108, -406, 294, 424, -500, -134, 507, -225, -75, 796, 99, -664, 36, 527, -552, -74, 420, -668, -620, 395, -193, -661, 295, 371, -816, -8, 618, -605, -728, 602, -165, -898, 130, 462]
5448D62j243N35R05j293O1J105o99l58L73R37j255j01J151p85l63Q97k05q07J167
5467D84k2j281O71Q35j026l12J157m20r87J095L85q95P9J000r36l70J215n20q01
5486f49R41L25j111J55J442j102n50R21L10j058N31M08q81J79J009r40m29J181
5504F82l72r32R07N35j335K17J013m87r04J292k78n08L21L59p17Q3O56m28o13
5523e09R59L18j404O93Q08q68l40J085o85o85J122M3j317Q14Q81j250j90J347
5541H22q36p57J041M13j175o4J291r81k53P10j34o24L61M19j102Q98O67j040l21
5560f65J305l34o87N84J17j049N94M2l32m31J448o47q14Q88N2r26K06J288o24
5579A5o95R68q3p93N89L48j088K62Q33o22o58J365l14r65O67O43r64L3R13n16
$$ y = [462, -781, -246, 659, -634, -573, 532, -167, -525, -152, 785, -470, -571, 580, -205, -568, 329, 124, -683, 484, 462, -819, -148, 687, -339, -651, 506, 86, -901, 194, 579, -316, -237, 763, -173, -543, 672, 152, -649, 292, 617, -494, -339, 1103, 1, -549, 372, 682, -376, 155, 563, -318, -139, 870, -70, -499, 682, 310, -622, 285, 820, -515, -298, 715, 228, -676, 616, 338, -170, 151, 510, -207, -124, 532, 104, -509, 450, 768, -636, 57, 865, -3, -343, 742, 57, -628, 494, 537, -780, 34, 915, -335, -525, 822, -14, -771, 270, 683, -492, -556, 735, -246, -499, 211, 77, -547, -186, 233, -869, 29, 696, -344, -665, 640, 306, -381, 203, 320, -729, -135, -93, -425, -856, 592, -55, -869, 19, 71, -855, -649, 639, 15, -680, 288, 205, -588, 1, 349, -739, -477, 356, -266, -924, 441, 127, -838, -171, 472, -492, -459, 454, -62]
5599f2k38P15k18p41N71M22j032L95Q27p20p68J181k7r14M01J021j211J51Q76
5618F29q33o68J467o0j236P03P66q68J19O45o14n51R32K09j128M88O59p74k8O72
5638E29m72m27J090j4j176M41J004j002R7O88o79l68R14n6q98L50O97o95l27J344
5658A040o93r44Q73J89j257P26M33o88j19J064m91p30Q36J92j056M03R41r92n30
5677h03J399m86p85P87J41o79J43P92j019qQ76oj338J285K5r54l8J162p14k33
5697d53J047k86p57N81K29r36J44J108j351l28J453k79r66N06P67q07r1O37q39
5716f21J71Q64l87q65Q67N38j244K07J111n69p00J142l90q75M43Q43o47p0J083
5735I01r28o49R60R0j062O75N50r68j61J047j47q16P13M27j075K35J336j473J2
$$ y = [-62, -300, 415, 197, -544, 27, 449, -583, -188, 639, -81, -849, 332, 305, -609, -208, 813, -398, -247, 629, -204, -872, 595, 535, -701, 2, 768, -100, 19, 664, 50, -501, 431, 640, -488, 0, 659, -115, -143, 529, 57, -370, 720, 706, -470, -29, 975, -27, 70, 758, 79, -289, 625, 569, -329, 21, 718, 23, -304, 1040, 347, -597, 276, 465, -792, -66, 367, -321, -440, 624, 133, -597, 239, 431, -625, -222, 719, -273, -803, 596, 110, -675, 112, 253, -426, -283, 509, -510, -518, 358, 352, -986, 299, 324, -630, -668, 494, -220, -453, 594, 308, -449, 132, 361, -575, -431, 677, -674, -1002, 451, 172, -794, -288, 479, -328, -419, 218, -621, -450, 414, 27, -838, 29, 567, -677, -470, 641, 72, -628, 514, 124, -751, -308, 535, -112, -182, 901, -27, -676, 284, 374, -688, -13, 537, -431, -592, 455, 308, -508, 205, 632, -443, -208, 1128, -345, -333]
5754c33J069p75l58Q17J16j250N97R77o46l48R76n00r47J386J01j244L40O78p39
5773h3l55J222n07p63J053J14j062K31Q19o19k84O86j18j086Q97M29q89J48O96
5792E29n82j70O65k2r64P33O95j342J82J115q01o10J052k56n30J90L56p43L86
5811a17J168j294l13J104j14j028P50Q7q28N19R55j118k24R22l4j206O99O61j067
5830d78J03P53n12l49Q71k98q71O89O31j053O9P64n53n59O46K50q39N03P56j185
5850f62J77J344q43n95P73k39n95L52J068j112k00P91n89n92J294J32j159N97
5868e8O28r39k83J180o99n37J043L5j041M90P37o96l73R53n72l62P01J04o53J7
5888c25J200j138o4R89n07n57R81K43j154M08P61q48l62Q42l43o81Q44K08o12
$$ y = [-333, 736, -39, -397, 420, 536, -714, -117, 860, 214, -134, 842, 342, -605, 781, 882, -362, -22, 656, -83, -438, 784, 277, -486, 567, 681, -381, -150, 669, 50, -234, 452, 334, -752, 145, 574, -315, -167, 529, -53, -223, 442, 420, -544, 189, 884, -458, -276, 839, 38, -572, 480, 224, -306, -116, 240, -503, -117, 1051, -243, -556, 548, 434, -594, 156, 243, -585, -66, 889, -229, -453, 469, 435, -771, -72, 589, -478, -375, 378, -134, -483, 388, 90, -781, -92, 539, -514, -445, 319, -234, -793, -147, 103, -736, -233, 523, -662, -485, 859, 16, -579, 194, -45, -640, -288, 780, -332, -532, 259, -330, -922, 372, 504, -655, -58, 570, -369, -652, 528, -171, -708, 335, 370, -671, -181, 556, -140, -513, 440, -132, -494, 207, 311, -342, -325, 875, -263, -327, 662, 155, -402, 579, 822, -332, 76, 837, -11, -373, 469, 126, -555, 289, 497, -115]
5907a15K69O37q98l42J064l41q92J011L69r60L58M63r06l5Q85j64q02K71P41j147
5927e34O57P56j020m95J111p5j236R42N32j301O70M65j55r96R75Mp26M22Q65j243
5947c82K8R52o13p93J060J56r83L50R63j265K01J154q08m78P15R2j151Q83O07
5966F88o47o65J102k82j071J096j07o52L02M66q12J03J049r01o6N62J76j041M65
5985b35Q83j153k62J192k27q56R84k06o91M75K68n67q7R05k60j013J121J86j019
6004e62L01P27n03m60J063l98o30O81K74j243O77J138j258n00R85p5o97P29M37
6023F86r19L67N28m63l78J096m15r76P87L74r33K63O27o20o59J202j15j137Q22
6042A37K72p22K9P17n14l92R04r4p66M71L92r30j21Q41k2o99O00K00o23M61M03
$$ y = [-115, 154, 791, -107, -449, 615, 274, -618, 393, 762, -198, 160, 623, -283, -318, 567, 403, -399, -128, 613, -534, 123, 879, -141, -636, 475, 400, -836, 106, 638, -663, 7, 472, 317, -679, 296, 300, -426, -4, 861, -382, -354, 598, -15, -808, 252, 408, -575, -225, 738, -527, -326, 828, 20, -458, 257, 349, -802, 81, 688, 41, -624, 478, 196, -875, 221, 114, -538, -236, 230, -582, -479, 570, -331, -397, 165, 341, -700, -235, 648, -505, -767, 425, 198, -658, 326, 120, -571, -96, 172, -395, -482, 423, 163, -850, 271, 457, -562, -261, 466, -37, -497, 566, 168, -462, 219, 493, -750, -73, 1065, -193, -693, 292, 217, -480, 249, 686, -233, 134, 662, 199, -179, 917, 502, -474, 313, 687, -246, 17, 644, 24, -635, 567, 452, -685, 137, 409, -313, -284, 433, -81, -473, 431, 337, -429, 42, 434, -496, -617, 224, 202, -497, 103, 303, -320, 141, 544]
6063E44p36j01J004j34j542J064J82r37M79Q15r50k19J114n42q98R43J71j054
6081g97P91N72q65o4O99oj095J059Q0p78J44N70n74l26J169r61m50J081j03m66
6101c20j10Q57p62l95J262n52o09J028j93o56K84M80p41j48O87J74o31J77N69
6120D01r01J54P42n02o37J136n29k98O78K4o10L5J350j381k98J081J11r20M58
6139I4N60j091K43P74n87o82J130R1j379R81M70q81J0R84o98n3N85k08q22O98
6159B19O70j012k06R81k91o68P15j35q42O55N58q55j53O84m02l04J206k12r66
6178c58O15M45r45q0R47l67o45P10P4o16J13M36k78j19N20o01n52J231J24j532
6198h78J019L41n95LL87j08p39M02O36j013N94K58p25j36J131o23o30P60K42q39
$$ y = [544, -192, -293, 711, 577, -965, 99, 281, -656, -177, 638, -312, -531, 583, 41, -857, 86, 257, -797, -6, 566, -299, -363, 336, 330, -765, 294, 374, -404, -260, 310, -264, -590, 579, -382, -832, 249, 146, -320, -430, 427, -335, -730, 532, -20, -629, 399, 206, -450, -166, 314, -427, -575, 112, 286, -345, -168, 401, -500, -346, 396, -106, -743, 393, -136, -434, 244, 268, -342, -307, 1043, -338, -636, 445, 556, -364, 94, 654, -437, -194, 580, -7, -689, 441, 532, -847, 134, 604, -277, -267, 717, 19, -34, 551, 343, -479, 219, 889, -123, -329, 652, 361, -307, 408, 273, -569, 86, 644, -211, -364, 320, -82, -386, 820, 608, -358, 257, 702, -243, -323, 624, 257, -388, 322, 396, -220, -107, 329, 51, -68, 452, -149, -701, 530, 654, -878, 141, 482, -113, -110, 277, 169, -570, -168, 468, -545, 49, 307, -418, -554, 577, -46, -676, 84, 326, -513]
6218e13J63P95m30l86P55k07r04M26O05r35O1R15q96P1O41j25o39L76N50m14m76
6239e67J092q41j82O74k55k94N19M18j136J60Q09k82p62R06j15o68L37O53l55
6258A11l91Q11m92k42N51P0j019O03O70r41k89R44l8r81J051k21l60M74J25q20
6278c84M04N35k83q14Q08K60q19L70M58r44K01O81k71n35O56j9n76J88O58n32
6298D2%N12l08n72L74L42o32K87L78o06r9Q34l96o68J017J92q03O1O64n65m78
6319d24O87J9o47N97K48r99N07P27j044k41P88J31q83N63N97o59k54Q55m87p22
6339f41Q75j96o75Q11O4o00J25P44j075j8P24L3p00L80K26o32Q2O52n06m14R03
6360A62j39n89J0O87l29l13O78l86n32R45po12M02M62r89K46N26m53k08J001j86
$$ y = [-513, -350, 445, 15, -371, 384, 177, -727, -301, 304, -631, -570, 345, -551, -480, 161, 36, -603, -227, 323, -91, -567, 525, -316, -498, 176, -79, -373, 146, 564, -572, -412, 397, 115, -647, 259, 144, -524, -187, 466, 111, -280, 531, 39, -203, 348, 418, -601, 2, 672, -269, -558, 386, 348, -633, 418, 197, -163, 311, 436, -384, 20, 555, 272, -542, 266, 526, -293, 77, 535, -409, -208, 473, 202, -333, 323, 304, -272, -84, 574, 42, 42, 554, 246, -326, 48, 390, -242, 45, 423, -183, -282, 552, 156, -512, 505, 697, -106, -45, 619, 54, -424, 263, 282, -365, 232, 480, -519, -12, 715, -329, -570, 218, 349, -534, 29, 626, -33, -287, 568, 81, -641, 234, 38, -637, 174, 238, -362, -237, 507, -568, -586, 138, 171, -529, -149, 77, -555, -473, 179, -327, -741, 162, 23, -566, -556, 131, -198, -511, 167, -219, -751, 194, 187, -425, -23, 439, -550, -304, 222, -231, -439, 562, 376]
6381C76r63K50Q24o38k56P73p9j044R05j50n27O17L97n82l30J038n90l96O96J97
6401E18q31R0R94o80k40M97m53n09Q42Pr63P19N79p66k80P45J95r21O40J92q07
6422d32L16O98n39m60J037j0r26P74J96j013L34P23o98j90O01o8n99N50L65q54
6442a95q6R48p75k92J061m99o34P21M24p44m7O07o34j40P81l30p16K14O52q42
6462e26K35O98n60k34M28M5m94J41L26m92j11P19k68m74Q71j93n96J87R20r30
6482c08j92O15k17k82M43R7o86N23L77n23j97P40l77p21Q63P8o31Q1Q57j013J59
6503c14O15k92p20P36K22m59L2O24q23l32R94k72p10P59N57j093M00M58n83K8
6523a73M19k45n29K52L73o62M54Q08p06k91P03m43j85L90P1m22K79N19m35l98
$$ y = [376, -587, -337, 487, -151, -407, 366, 287, -757, 148, -2, -529, 88, 485, -97, -427, 611, 21, -375, 321, 518, -313, -223, 771, 91, -149, 348, -105, -614, 228, 235, -728, -9, 570, -196, -476, 269, 464, -457, 183, 375, -432, -116, 582, 43, -417, 620, 610, -316, 458, 654, -359, -25, 698, 0, -190, 411, 343, -256, 294, 659, -195, -281, 667, -108, -400, 661, 162, -472, 249, 673, -71, -118, 489, -145, -285, 496, 166, -550, -336, 316, -526, -291, 407, -153, -387, 41, 86, -408, -267, 59, -433, -544, 175, -93, -567, 304, 111, -485, -298, 622, -308, -500, 115, -102, -384, 59, 156, -530, -7, 370, -153, -350, 390, 13, -708, 155, 233, -398, -317, 540, -473, -314, 301, 9, -711, 25, 247, -212, -180, 444, -379, -711, 283, 11, -699, 60, 617, -476, -76, 382, -201, -173, 246, 1, -528, -276, 97, -565, -111, 697, -9, -300, 403, -40, -225, 165, 236, -186, 93, 612, 177, -221]
6543b21N33k9o46L63L80p12j42J069o54l37Q65k05p25O85L75r94J97O85m80l67
6563c60Q44r2o98M02N71j079J90Q83m27l97O16k26o51P04P5n52n0Q98o25n06P47
6584B67Jn61P7N58p21J65P78l02o28L78K57o95L17L90n43K81J87j07o70O47Q1
6605A57o43L17M36l50k89O69m39l20N84L13j189L42P85p33j90Q58n67k32O16M
6625A29n79K11L90n29j66J093l00p30O56K49j109L85O83k76o76J018l70n00M74
6644E3L83o66K6M64k81m94J073n52k82K99M02o12P1M87m47qN44j47o03M94L99
6665F03p86K8O01l55k92M97l4r07Q72K46k94j91M06k04k92K93n9P3j88M09m31
6686el24R16j21o77O21qp70P00J89n88j3O67m18p73J141k67o60L37O82m71m61
$$ y = [-221, 312, 283, -363, 0, 380, -332, -474, 595, -59, -396, 469, 264, -461, 224, 599, -395, -198, 487, 7, -360, 484, 392, -306, 96, 667, -412, -222, 661, 234, -163, 453, 227, -424, 280, 355, -197, -247, 651, 26, -480, 267, 268, -293, -216, 342, -379, -214, 564, 262, -366, 12, 269, -426, -109, 281, -262, 19, 206, 99, -571, 76, 157, -486, -169, 267, -83, -372, 297, -142, -462, 122, 435, -754, -412, 373, -360, -550, 308, -259, -491, 125, 129, -450, -239, 151, -378, -544, 549, 249, -481, 175, 424, -685, -300, 383, 107, -569, 449, 79, -421, 53, 436, -230, -204, 260, -21, -515, 558, 6, -276, 23, 425, -187, -116, 371, -76, -84, 460, 313, -290, 204, 603, -183, -155, 446, 91, -201, 296, 262, -645, 227, 473, 179, -12, 394, 190, -102, 191, 132, 205, 17, 426, -5, -329, 587, 466, -211, 410, 402, -368, 332, 521, -67, -80, 587, 169, -604, 537, 270, -390, -53, 629, 158, -303]
6707c03O24n04l09M97M64o39L39K68o43O3M33l28n83O61P7j66j36O82l37j30K12
6728B42m7o76M99M3n82N44K41m28o33J284m65j94R6p3l56R7Q88n00j97M08p0o03
6750d82O17J98j002L66P52n69m35J130m57n21L00J70l39Q4N76o37k0L84j35l60
6770c80J19N76n39l6O86m23l87K81K47p74M51P02o61O1J92j52k64N89j00j37J23
6791A74J19m52j66N95j91n94Q95J24o77K92L10p02l8O27j91m68L70K73m49J61
6811A2L37m06j04M05j70l70R60n11m45M74L77q38K80M13m70m4O9M39m98L54J28
6832C92o01J68O23l35q03O44M89p45K81M12n39j67L48k25k96M07K53n05L27K4
6852A52m48o5Q66o53k33M57L13m83k64P20n82O5L77k74m29O74J2k66j90O84n22
$$ y = [-303, 321, -183, -492, 5, 469, -170, 169, 437, -206, -143, 290, -38, -621, 40, 117, -49, -185, 497, 160, 30, 242, 195, -481, 18, 61, -521, 23, 264, -164, -797, 487, 22, -172, -76, -149, -505, -408, 480, -20, -217, 191, 121, -482, 135, 333, -669, -303, 449, -120, -555, 575, 118, -403, -103, 67, -272, -188, 388, -249, -269, 115, -20, -380, -261, 315, -224, -260, 426, 3, -384, -103, 144, -630, -179, 523, -138, -77, 115, -37, -301, 288, 188, 51, 174, 293, -159, -325, 270, 79, -515, 380, 504, -173, 119, 429, -273, -311, 316, 125, -343, 27, 300, -149, 12, 349, -57, -161, 244, 74, -296, 664, 153, -292, 182, 559, -279, 1, 414, -56, -100, -31, 408, -90, 264, 392, -209, -41, 582, 247, -556, 88, 577, -168, 113, 525, -14, -181, 167, -58, -354, 53, 306, -199, 128, 152, -296, -361, 505, -148, -381, 76, 389, -94, -358, 362, -220, -155, 222, -52, -481, 193, 205, -61, -251, 433, -89]
6873h9j00N54k72k70J61N34q43K52L93k19l26L92m32j80M51L2m66J63O04m08k45
6894c14N74k55l82K55J65k18Q5K26j28m69N95J35m82K07M86q44L27n0J82m30K29
6915a06M57p25K77L77n47k59J010n07K09l2j40j62J33M59m13k97M67j86m68R77
6935E24l90m20N35L23n29j47N55J94q27O45p3m14q7J75l6k77Q24o61k8k4R06j028
6957b60M58M19j010J46N11k63J8K82J72o10r4M52m28O8N54p0q17M25L48o42j09
6978d50Q10k00o70Q40l8n95O13k12k13J3J93k18k82O89N2p36O18J19p69K18R47
6999G29r40k14P51l20j69J99M06o26m77R31k70j07J77K60p66J79Q03p88J11K42
7019A11k29m22P00p9n34L52O07n10k59K48J42m87O35J2p56L73M58p15J90M69k41
$$ y = [-89, -189, 365, 93, -177, -16, 518, -325, -73, 320, 101, -225, 167, -265, -445, 6, 38, -428, -265, 339, -69, -314, 260, 5, -377, -122, 43, -175, -90, 136, 8, -461, 134, 269, -213, -6, 480, -364, -37, -87, 95, -335, -106, 351, -374, -97, 280, -267, -526, 484, -23, 186, 154, 14, -148, -15, 444, 31, -266, 201, 15, -453, 524, 134, -286, 249, 572, 43, -104, 451, 645, -182, 463, 390, -24, -111, 64, 28, -249, 575, -86, -114, -138, 768, -260, 198, 617, -393, -247, 264, 1, 19, 301, 473, -137, -231, 221, -207, -139, 415, 345, -472, -47, 301, -341, -450, 360, 160, -510, 330, 292, -303, 310, 98, -115, -102, 91, -127, -409, 280, 332, -404, 214, 333, -436, -218, 729, -211, -425, 326, 6, -163, 36, 442, -184, -661, 270, 0, -107, 70, 330, -436, -257, 546, -242, -131, 111, -118, -540, 160, 81, -453, -101, 506, -4, -263, -15, 127, -360, 275, 287, -469, -96, 362, -353, -163, 306, 65]
7040F5n30O54P4k69RK27m63l42O55O9l14J97K95p29L7O26n37J39M01N9o83M43
7062H3M33l53N3J87k33n51R00k90l91L54L56r21J48M57l68J24J72j00k20L15K78
7083D33n84J43N31n85j69N70j59l39L39K16k42j22J90j43n65R13k33m74N48K64
7103E32q10M77J17m79J9L25L15q78L98J24k33j53M83j19l92L49j2p9j92P12p79
7124b75J6L80N6p52P99l17k54P2P33m82l27Q29n16k49n5M67m45K65J01j74l20
7145d48P94m38n05O54M2n54pO72l56J68P4j13m54N48J81m28O2M24k12k20K47k68
7167a37r6K18K79m87M3O57n32j91N24k91m76M02M45n43J69M47p02K04O7J71o80
7188e09L18P04n51K60J15M1l33J08J73p8j30Q3l26o5N30N0r44J104j19o71L84
$$ y = [65, -465, 189, 263, -6, 3, 230, -233, -575, 80, 149, -165, 32, 327, -402, -365, 261, -276, -137, 264, 323, -360, 83, 516, 163, 216, 403, 170, -381, 519, 229, -162, 192, 548, -373, -225, 232, -136, -12, 160, 60, -160, 155, 433, -151, -8, 523, -62, -231, 339, 180, -159, 180, 396, 154, 32, 222, 79, -486, 427, 194, -280, 268, 532, -278, 199, 316, -163, -144, 181, 496, -382, 16, 140, -93, -246, 237, 118, -274, 75, 63, -16, -208, 504, -275, -259, 121, 177, -575, 224, -93, -347, -275, 458, -24, -351, 478, -38, -287, -342, 125, -320, -55, 46, -128, -448, 346, -92, -597, 57, 99, -455, -462, 210, -146, 22, 96, -17, -471, 77, 258, -170, -108, 316, 104, -116, 131, -137, -233, -15, 264, -223, -180, 477, -55, -246, 278, -13, -489, -87, 358, -185, -16, 431, -271, -67, 0, 171, -509, -191, 513, -38, 222, 337, 378, 45, 153, 326, 248, 118, 201, -125, -190, 340, 390, -554, 550, 431, -240, 144]
7209A44J93n37J60N81m95k13K92J85p65N67J28l33m0N53m20k43P75n30m20P21
7229C03j35j68j5J59m4o50Q37K91q50L24J26n06J17M74k27l82L33P2n11L31M53
7250C32m48o1N36n04k17O05P4l07k63K17K29m19L81o7l40J59L32n82K38M24l23
7271dk60O36k58l70K97J49k27k38O13l06k58K71J9l66L4L99l63O3R8j6kO47q23
7294b65m8K52M82o50J33M63n94N6M67j46o56P20J92l49n2J97No24Q73k45o91P46
7316B66J75m20j46J83l3Mj92J15l6j0N67p36Q9N78l86l77P05m93l49N96n7l32
7338b89RN58l11m9J28P0l22J65N18m85j25O35m61l48K73P9j44j78O36j42l94O43
7360D66n47k61L99N17q50L88J58l44J13J65l17p6L30L3m93J98N43m52j29O07l56
$$ y = [144, 337, -200, -40, 541, 46, -167, 125, 310, -455, 112, 240, -93, -133, 420, 0, -243, 532, 2, -418, 303, 168, 0, -15, 144, 100, -550, 287, 578, -272, 52, 178, -328, -211, 263, 36, -346, -13, 59, -452, -121, 332, -116, -177, 359, -145, -362, 243, 317, 10, -253, -36, 193, -226, 155, 88, -252, -93, 239, -343, -105, 319, -4, -264, 372, 114, -256, 41, 190, -37, -275, 338, 32, -226, 45, 64, -302, -268, 131, -232, -169, -71, -87, -89, 558, -265, -313, -61, 421, -229, -96, 367, -227, -171, 296, 150, -506, 214, 406, 57, 5, 202, 207, -417, 456, 211, -480, 266, 441, 21, -125, 58, 25, 29, -163, -48, -84, -94, 473, -263, -174, 404, 18, -359, 346, -147, -496, 100, 43, -289, -280, 278, -33, -82, 46, 116, -206, -41, 477, -8, -133, 502, 41, -307, -34, 45, -99, -277, 359, 217, -177, 466, -81, -342, 57, 574, -276, 112, 270, -74, 39, 204, -113, -189, 141, 174, -319, -121, 422, -30, -159, 448, 92]
7381I2l19Q2N17q01J89O43n1p25N94j13n05Q57m03m13K5O45l65m81O80Oj87j09
7403a42O11n79JL43m5m98K80J34n96Q49l10m57L08J33j12o2J39J09Ql95P06o39
7425b14n2O97l02k48J93K42o64M18P7l11lO09o67p7N33L7l61J02M28n89j58L64
7447E4q8j32M98j66j39j53L29k36m3P4J24k72M12j00o11K87N79l50k60N28n04
7468a69o9K74J37l65M92j02k64j88M29j8k22K65J24l10r2L70n18p8O61J21o93
7489b15M00j45m43J74J112p65l08Q52m98m98N78o8k85l30N67m66l38R34J78o90
7509b54M75J0l84J22L06m03K2L19k12m77L58K52l47k21N77m73M25K05m79k5q6
7530b90P03o81K23L23l69n03O82K6m44M22L08l00k33L61k80k17K65M3q1k39N11
$$ y = [92, -227, -145, 372, -429, -240, 403, 352, -373, 221, 108, -397, 460, 57, -356, -331, 314, -51, -532, 148, 154, -33, -142, 469, -110, -109, 234, 189, -309, -29, 105, -491, 358, 48, -409, -101, 32, -80, -142, -3, 106, 114, -281, 425, -214, -266, 431, 129, -119, 74, 316, -348, 70, 147, -164, -167, 442, -225, -302, 231, 268, -93, 9, 437, -152, -310, 54, -34, -166, 332, 166, 27, -126, 203, -33, -76, -2, 122, -150, 262, 162, -449, -162, 417, 67, -193, 335, -169, -238, 36, 173, -192, 300, 198, -66, -254, 175, 157, -65, 200, 324, 14, -78, 292, -226, -304, 357, 478, -215, 185, 40, -403, -229, 883, 118, -190, 662, 164, -334, 244, 176, -109, -439, 128, -338, -676, 258, 436, -254, 221, 231, -153, -31, 275, -128, -106, 213, 1, -476, -118, 134, -213, -434, 143, -330, 95, 300, -179, -204, -290, 413, -268, -45, 278, -91, -594, 88, 114, -330, 92, 400, 100, -133, 228, -52, -269, -4, 39, -42, -281, 230]
7551B30m85R8K95k15m49R21k76q7Q2K81m94j3K91j88j50J99K79m42L1L61o37J42
7573b26P71n00k33J40M00n16K5M79n20j20P31l63j56L89j25l74K00M6K27l60M58
7594C73k03l82K51L59q63O62K01m83m1M61k24l75K73l5k3rN58n86o2N26m10j75
7616b07M80N3k88p2J87l16k02O09m87k1L34K14o33L77l4M9j94M38l62j65M71k65
7638c4o6Q1R8p0k22K65m0l35L51L74n65mQ0l19L38N8J7j4k08L61m00M4L72P1m47
7663b14J74j06l27K20L04j51l0o6j33l21P93J5o65O28O7j60k79M81k32l33N85
7684B50j77l62K75O31o99j72L71M9m04L58L05q64L35L27l52nL21l08j0O6M62m24
7706b7q8O47p67P0M7L75n29M01j4j72n5K44j24j40J93O1l93R5K41l41L41L16n16
$$ y = [230, -255, -157, 138, -77, -526, 395, 119, 32, 114, 395, -99, -112, 179, -9, -159, 40, 319, -123, -92, 269, -368, -226, 545, 45, -188, -48, 352, -164, -139, 340, -180, -300, 431, 68, -88, 301, 176, -198, 2, 48, 275, -85, 373, 170, -212, 39, 398, -465, 197, 398, -85, -126, 335, 111, -264, 9, -26, -49, -58, 500, -86, -148, 378, -32, -207, 273, 326, 38, -34, 153, -163, -365, 244, -243, -264, 70, 284, -349, 28, -6, 43, -151, 287, -75, -240, 231, -34, -100, -19, 79, 9, -213, 52, 12, -323, 28, 402, -163, -167, -87, -406, -68, -10, 7, -7, -215, 146, -254, -210, 162, 233, -214, -40, -146, -473, -253, 51, -100, -130, -196, -329, -650, 143, 158, -507, 121, 188, 28, -251, 230, -2, -335, 250, 73, -289, -14, 617, -82, -254, 117, 166, -238, 120, 425, -439, -104, 223, -129, -134, 187, -121, -131, -65, 397, -27, -115, 532, -235, -165, -118, 257, -272, 129, 115, -57, -112, 132, 8, -132, 61, 122, -271, -176, 65, -276, 65, 381, -135]
7729a35J05K81j41k05J35J45m19J87J69j37K81R1k02k68L3L47l85N6L2k1j85K64
7751B8k03p5L92k24m1J23K47r6k91M72n4l05j41M07k51k06K70l12OK0P27n53J08
7774D8J44o64K42M91l88m63P09op61K53O70k69k17L77m04o5K11q7k75J15L19l31
7796c51J35L41qm06K10L23k17k81OJ58l26O99k17j22Q2J27k22j60M23j91k93M17
7818A27j39n06M97J52l94L94j49j95K7M16N6n32L87P7j76k35L41m56K65L46m02
7839i9J6K40J61n64P6K68M2l8K38q9m98K00K63l72j67M25k4k60L56m2k33MP10
7862F13q16K95P6P3l69RK75Q3k51J09k78J81L36j64m66M93J35n54L47P1l70k51
7884d23M37r3J53r4K47l49J42K8n33K82L47J1k50Q9L05k86k29N69m82j58L46k69
$$ y = [-135, -30, 251, 110, -95, 40, 185, -234, -47, 122, -15, 266, 357, 155, -113, -80, 267, -118, -62, -30, -51, -236, 28, -175, -250, 142, -82, -123, 0, 247, 151, -140, 332, 278, -27, -168, 239, -12, -218, 52, -260, -254, -234, 493, -60, 48, 192, -472, -230, 261, -127, -590, 119, 113, -648, -395, 275, 6, -211, 166, -238, -303, -92, -179, -454, -339, -20, -351, -216, 125, 117, -289, -79, 244, 27, -254, -248, -90, -416, 283, 66, -56, 26, 153, -69, -229, 194, 3, -290, 127, -12, -518, -21, 131, -263, 131, -18, -213, -186, 230, 286, -246, 141, 218, 42, -193, 148, -308, -43, 303, -99, -83, 157, 318, -246, -170, 98, 140, 102, 340, 251, -247, -47, 216, -156, -323, 102, 78, -182, 174, 132, -101, -97, 613, -203, 92, 168, 241, -128, -119, 156, 239, -12, 97, -181, 0, 336, 172, -294, 199, 334, -220, 127, 198, -172, -423, 14, -79, 74, -20, 227, -122, 20, 48, -485, -203, 144, 155, -95, -6, 299, 13, -216, 353, -129, -287, 59, -210]
7906b10K03l1J82k73J32M12n21k66L73J63n63M67k06N1L52l35Q6K6K45j68o68
7927e49N92M29q22J89M99m90J22J63j38l32N44q7k45J15K95j53l06ML15m00Q2
7948a73L94k62j88O50n07p2M23l03o8K62J44o22L99q4J17p5J08o0m61Q02l55l
7970F6K2k9O0l78K29M9j44m2L43l62J11K57k70q9K90P0k01Q1M34l42k25L19m17
7993a68J37p6L32n34N82q3p6k95Q07m24l58L58l0m17M7K11j92Q1L91k05k03K53
8015A38J69l09k01L90j09k04O1M21o12N22p8j98j18L43k52j62L02K62k68l07N10
8036C00o32M43m2k16k91Q97l69k94J79kK1k58N75l80q0L42j0o60O29k2l43J39
8058g4j00j53k91Q46J41p73O00j40j51L2M07l00l55N41k83J83o4n1k22K14k6j72
$$ y = [-210, -7, -38, 144, -129, 3, 415, -106, -372, 1, 164, -399, 68, -138, -87, 265, -70, 16, 42, 287, 119, -549, 43, 472, -350, -161, 338, -152, -30, 133, -5, -337, 207, 120, -125, -10, 285, 132, -174, -170, 145, -255, -173, 221, -41, -229, 421, -86, -158, 265, -38, -106, 156, 300, -322, 77, -7, 110, 35, 143, 83, -378, 424, 69, 66, 88, 59, 119, -259, -30, 19, -125, -167, 176, -186, -75, 182, -88, -177, 113, 183, -18, 63, 497, 155, -70, 249, -168, -31, -107, 225, -309, 273, 190, 114, -181, 626, 202, -156, 202, 172, -245, -198, 13, -179, -98, 293, 88, -115, 138, 307, -2, -203, 187, 78, -126, -65, 356, -256, 266, 188, -10, -128, 215, -37, -199, 103, 365, 97, -210, 300, -332, 111, 69, -147, -438, 459, 90, -204, -25, -27, -6, -264, 311, -69, -149, 193, 183, -477, 152, 130, -213, -74, -174, -327, -618, 228, 369, -404, 196, 56, -95, -63, 344, 44, -311, 230, -53, 130, 66, 15, -207, 7, -19, -191]
8080a91j27L05j7m21M41o7l00K48M91k65l07K93J71o05J43L47k60l4N48k21k16
8101d4K92q9l92L37mm23L50R4l14k84M54J17N6k94K82%l40L59P6m12K0M72n43
8124b30M46j1k53j14K20N1l03M61J1k51k76M22k32j1J58k08P8J36K67n15L71j52
8146F5l4j33J3J46j12N22m83m36N39L60q5o22K61q0j72n9L09j88j20N20k50k34
8168b73L50j15j73N13R6k60l74N10n55K51j3J12l1j73L96m45J97m8J16l94M98
8189A85j90k14
$$ y = [-191, -318, -13, -30, -451, -10, -77, -377, -129, 362, 97, -210, 83, 254, -351, -208, 139, -121, -155, 393, 172, -44, 248, 159, -233, 104, 100, -323, 27, 121, -193, -477, -23, 94, 150, -144, 138, 138, -202, 157, 233, -179, -159, 313, -230, 216, 205, -48, -162, 58, 109, -194, 267, 278, 27, -249, 173, -59, -70, 88, -120, -42, 94, 361, -154, 217, 65, 31, -102, -89, 57, -55, 467, -16, -452, 87, 447, 362, -260, 1, -79, -251, -310, -1, -189, -309, 211, -39, -273, 77, -38, -211, 302, 398, 138, -236, 274, -281, -30, -43, 69, 38, -135, 261, -184, 13, -35, 81, -313, 185, -5, -219]
8191b19
$$ Imaginary data points
##PAGE= N=2
##DATA TABLE= (X++(I..I)), XYDATA
0@%%%%%%%%%%%%%%qJ6j6J6j6J6k1K9l2L4m0M6n3O1o9P9q8R7j08J21j36J52j68
37h8J85k06K29k53K81l12L47l85M28m75N28n93O65p48Q53r81J140j351J640k063
57a159K745m022P184k6825n0777P5193L7096m8839l3164K4968K6813Q497k6832
70i122l3745K6631M7661l2088m6579L2779L6077l1236j7622K1335l182j2232J4446
83f877n22j2018J2640M654j5156J4457J2581l3580n694M5518l730m7704R190M1234
97A4993o801k4277l539L655J8457J5155l2608k3889M7082K9353m8083k4475L8504
110C527J4326k1395q199j615N093K4450l439l7634Q826L9400j3946l0651J8002
123c255J4630j4117N566Q286j9504M41K2315j1761j8136J7475N139j6080J3405
$$ y = [0, 0, 0, 0, 0, 0, 0, 0, 0, 0, 0, 0, 0, 0, 0, -8, 8, -8, 8, -8, 8, -13, 16, -16, 18, -22, 24, -29, 32, -37, 42, -46, 51, -57, 64, -72, 80, -88, 97, -109, 120, -133, 148, -164, 183, -202, 226, -249, 279, -314, 351, -397, 456, -525, 615, -736, 904, -1159, 1586, -2436, 4748, -22077, -72854, 2339, 39435, -9404, -42568, -17600, 9213, 17710, -9122, -42867, -16236, 31425, -663, -47242, -14463, 21614, -9622, -27244, -5909, -9091, -21323, -6877, -7399, -19417, -6777, -2123, -17279, -2822, 9759, -23821, -29515, 16003, 12273, -35431, -26241, 14993, 8192, -16085, -19624, -15969, 2488, 17643, -14965, -38854, 8228, 37581, -10502, -34977, 3527, 17853, -3542, -11741, -13356, -8263, 16187, 12748, -24886, -16060, 23340, 9394, -21257, -3255, 11375, -2742, 2824, 11110, -8394, -7953, 14362, 2601, -15535, 1940, 7079, -9001, 4404]
136D404J2077k5354k277L0192p715k5530J3250J2847j1370M775L565k0456O103
149e489K8476j8606k8829K4364K2694j8981r424J0105l097O422R898k4204j3418
162b0089L5423R725l7819l689L1686l507j7821M921m69j954J6005m930k2469J5366
176C79K1514k4406j3966K5321m59k3894J1010J5481j5487m504J2422n428k863
189d880J0539j2756r741K6820M977l4698K017L4011r329k6816Q525J1802m020
202c549L611m803j3803J7170J9074k6255j6801K9996P927k5754K072J5603r008
215d520j619J0747j1881o730J8897k196j7427J3423J1593j9432J697K1563j2387
228A728j8366J9234R419j7779P46R030p603N070J0989j9154q999K9202M622l0044
$$ y = [4404, 16481, -8873, -11150, 19042, 11327, -14203, -953, 11894, 524, 5299, 8864, -11592, -5489, 22987, 4381, -24448, -84, 22610, 3629, -5795, 4310, 1213, 7635, 17533, -6671, -20089, 15334, 25059, -12760, -16449, 15237, 11730, -6091, -1170, -1639, -3593, 12412, 7482, -14987, 379, 21893, -2513, -16479, 8842, 8383, -15511, -4501, 10980, -4507, -9011, 3411, -2017, -4880, 5659, -7097, -16838, 9982, 14959, -19739, -17722, 16289, 6960, -19856, -11331, 471, -3549, 62, -4741, -18544, -1374, 17700, -8555, -25356, 4640, 12567, -13187, -11115, 4488, -4520, -6139, 4608, -7273, -14003, 4894, 2698, -14729, -1306, 10287, -9145, -7448, 14115, 1728, -16638, 2596, 12015, -5764, -5018, 4012, -3591, 1479, 12468, -6686, -15685, 13517, 18139, -11905]
242a1905L410K3276o191r734O055p005j408J9192o280k5711J3633K4091j6246
255E177j4703J4038J923n675R996n000j6832J6006J7387k2595j2444K1535K382
268A1195j4781N572L265j0721J0240J0775j8437n638K1354k873j6456J0423M804
281H722j5040P734J5226j8298j0937K1051L803j6333J800M778m442J0836M264
294A3164k4426l04L2250m767l2919P561K4017o259j1253o2l291Q710J4723j9191
308b047j9131K5965J7252k6970j0046K1569K68j0321N603k712q773J3093N450
321I200j8936J941J6790j0131q632J6273k659j8071J3095J4905j8118r083J5763
334B337J434p524L751o084o130J9701M270k8764K44L0899m152k5306N668J4052
$$ y = [-11905, -8495, 14781, 8590, -1144, 4911, -2094, -3502, 15690, 9410, -16301, -2668, 21423, 5177, -9526, 4512, 6435, 760, 10756, 5756, -11076, 4930, 22317, -278, -12722, 8813, 11195, -3586, 1986, 5251, -5470, 4770, 15545, -2892, -8530, 12824, 9951, -6505, 3918, 8722, -6318, 1416, 16642, -1656, -12593, 8458, 12261, -4072, -2272, 2506, -1936, 8900, 13164, -11262, -11566, 20684, 15917, -17002, -9441, 14576, 8317, -2936, -2998, -6289, 2421, 17144, -2047, -21178, 4787, 22039, -4931, -14977, 6592, 6860, -3461, 2142, -570, -9343, 3750, 9200, -9736, -7795, 8995, -1136, -9768, 6505, 3846, -14225, -1130, 13775, -4343, -13426, 2337, 3771, -3753, -2, -6086, -12216, 7485, 11755, -17009, -16765, 14134, 9982, -15324, -9656, 4396]
348D396k946k62m058j2074J2527J8391j9950j8128K2706J2528k0060l092J2070
361B048m237j185R667r826q993J6808L220j7459M363J1915j1173k722J5387p410
375D03j4548J5650Q789j5977j373J1052n403m86R749j1511r833K0416O510k4259
389a0821o03K0754l470j1017N286j527k526J4289l506k0496J0076K1168j4336
402C271j6114J4731O686j0084K934J721j0003Q651J1333j5611p271J8911M77j6111
416f479P634Q315j3157J222J3307r613r031J3362J620j1438O513M231j2254N855
430H7J3817j4369j1193J8520N945j7264L9R466m872J314N223j2282k586J9848
444A1693k746k1872Q093J7165j0452q195Q914k530l674J0165m304j3738J1108
$$ y = [4396, 1450, 1188, -2870, -14944, -2417, 15974, -3976, -22104, 602, 13130, -6930, -10022, 2048, -2189, -3374, 6293, -3533, -12526, 4282, 7502, -9957, -5594, 6321, -4852, -7574, 7813, 403, -14145, 1505, 10294, -5683, -7056, 3996, -1407, -1893, 7856, -3655, -13488, 6928, 13438, -10821, -11424, 9330, 5860, -5157, 129, -1398, -3924, 10365, 6859, -13637, -3561, 17607, 3271, -12843, 1888, 8574, -1510, 1424, 3145, -6858, 1793, 13126, -2485, -9756, 9155, 9632, -6479, 1155, 9470, -3687, -2465, 10842, 1229, -7802, 5560, 7180, -4258, 2255, 6486, -5768, 87, 13904, -465, -11658, 6862, 12807, -4457, -4418, 5048, 176, 1490, 6713, -5569, -8155, 11693, 8947, -12925, -4832, 12333, 1881, -6314, 2600, 70, -3604, 6561, 2257, -11481, -373]
457c73J1516j5610m925J5085l617r877R867K187j2992O478J0685j1979m376J2181
471D250m327p798J0951k85j4661Q713J3696j4631p835J5041N97r750N584P48r006
486h713R337Q279j7572m483K0061j010j6604N648Q237p203K650M814j1240M99
500g300J6055o190j5816J1745J0192j3372j421J0134o709l232J1529m148j0988
513i521J0655N826j2529J838J0802r122m781J4201k182j4618Q600J0614j1328
526a545l273R166l952k008R642o309j1022J4898Q643j8319l547J6723j771j0194
540b868N259R30n805Q681K288j4190K836J6088q629j1633J1531M019j0803M427
554B131O553j0941l12J2139o142r601J0471J489r749N673O592j2706OJ4521o493
$$ y = [-373, 11143, -4467, -9392, 5693, 2076, -7801, 2066, 4253, -8739, -2261, 8424, -3555, -7931, 4250, -77, -7875, 3076, 2791, -11870, -3157, 10539, -4092, -11927, 3114, 3711, -6039, -455, 293, -8713, 624, 8903, -8669, -13152, 6909, 5899, -10705, -5057, 3180, -4023, -1373, 3441, -7799, -7300, 8755, 2565, -13251, -1506, 8686, -4686, -6107, 4027, -2682, -5914, 5615, 1467, -9521, 1134, 6960, -5569, -3731, 7071, -2051, -6832, 7369, 5187, -9431, -831, 9783, -1545, -4818, 4348, 396, -1612, 8030, 1721, -9301, 5597, 14240, -4079, -7626, 9097, 7326, -2868, 2391, 3321, -2484, 6197, 8485, -5705, -2869, 13219, 4590, -7043, 4488, 8507, -2296, 2131, 8684, -2257, -2569, 9570, 3428, -6173, 4298, 5787, -3962, 1711, 8303, -4403, -4397, 10124, 3631]
569C631j2614J0638O113j1111J392O088p805M60J0949q746r676J3462M922j4778
583g075J520J0876p168l321R309n187q121J1465L308j4023K179J1443p216m360
597f371Q519m005o964J1365K549j4892L649J3618p880q294Q707M47p102O873K125
612B344j0673M067J1051j0080n995J1953p04j0135P441N431j1417J351J2029p336
626f73p692R288R52p471N876K919j0914N339J1873j1601q957J4753L937j3677
640f048K511P913n633J48N988q139k503J3350k928j4095Q770J0819j1555l614
654e016J1231l315p410Q614J124r598N420P248r872K21R842p424o619J2595J557
669H598j4879N640J1927p856o652Q383j331m500P067k581r455R506Q424j3477
$$ y = [3631, -8983, 1655, 7768, -3343, -1951, 4137, -3668, -3208, 7741, -1005, -10681, 2781, 7703, -7075, -5555, 5321, -1847, -5168, 4141, -1046, -9167, 2298, 5606, -8417, -6238, 5205, -2011, -6371, 2148, -1857, -8821, 2544, 5093, -9799, -6150, 7468, -412, -8706, 1, 448, -6654, 219, 2344, -8329, -4262, 6789, -3291, -9286, 2667, 1963, -8172, -731, 4700, -6717, -5366, 6663, -673, -8365, 923, 1875, -5596, 280, 3199, -7715, -2376, 9497, -2104, -11061, 3692, 7629, -6048, -3537, 4376, -1257, -1109, 4879, -3260, -5763, 7587, 4659, -9436, -666, 10153, -1402, -5016, 6215, 2900, -4510, 4104, 5228, -4370, 1050, 8298, -1574, -1353, 8489, 1065, -5554, 7041, 8598, -6281, -641, 11286, 3430, -3222, 5161, 3830, -670, 6397, 3816, -5639, 3867, 12291, -1186]
683a186m255J4307j851j1673O499M653p587K420O286p987k074J0091m716q829
697e902R243K935j1392M372R604r642n685J1977m73j0745M917N259p045K352N003
712D778q684j036J2174n690j1869R555Q329j1638j229R968m923m774P578k080
726D59p886P867M118j0458K003J0107q350n421J1401j394j1852P712Q474j0193
740c413k094R311l399m582O362k267p481R042M408j2391Q87J3308n724j0118Q885
755G34L619r249L701N431p133N84Q434o995n543J0258k69j1143O274Q929j0111
770b479k713J1277k960q927O649L284p032L085M577q399J980J0139p601r503J2083
785C460M416j2613R49J0156m733l617O577l119m553P462L20j0239N386Q897r667
$$ y = [-1186, -5441, 8866, 7015, -4658, 1841, 6494, -1093, 1327, 7613, -374, -2448, 7643, 2927, -5902, 3341, 6276, -5116, -744, 8860, -782, -6467, 5510, 5037, -5708, -791, 4468, -2577, -225, 4778, -3906, -4942, 7232, 1542, -10327, -772, 7557, -4081, -5310, 4658, -265, -5039, 2539, 459, -7427, 440, 4558, -5900, -3897, 6210, -2140, -7561, 3840, 2446, -9406, -1694, 6780, -3413, -5507, 3804, 405, -4177, 2185, -82, -7563, 1479, 5887, -6504, -5617, 7691, 1967, -8151, 734, 4353, -4896, -1195, 4236, -2897, -2313, 6121, -874, -6417, 3841, 3572, -7571, -1297, 7632, -2479, -5192, 6085, 3125, -5802, 847, 4131, -2901, 184, 4761, -3638, -1658, 8481, 880, -8623, 3460, 7876, -4737, -3788, 6368, 1635, -1982, 4595, 1476, -3077, 4385, 4705, -5534, -148, 8749, -918]
800i18l413J1180k340j0066O696N708q791r4P789m594k204O999m390o923R861
815D500K463j2811L201J2089p192q267R462J758q427L434L172o543L184O462q348
830a863l019J1571k849j1699P170P174j0440o92R888m203o036P003K59p458M928
845b66L355q776K946R202q524o358J1124J667j2305L270Q437o011k405O747l592
860a489l776P913k371q920P253O384j0616r01J1028l668q406P222L043q270K286
875c288N706o131m11Q087n422n492R692L00j1604N320R098q422m287R893l28p886
891e175M873J626o118M469M712q731l01J1470m908r716Q714N051j0312M12Q503
906D569n024k934P207k301n916P072J313r392M492Q520r173m073J1697r34j0504
$$ y = [-918, -4331, 6849, 4509, -5557, 1139, 6847, -1944, -2038, 5751, 1157, -1047, 5952, 1562, -5361, 4500, 6963, -5848, -2647, 9442, 2250, -6017, 3445, 5203, -3224, 210, 3382, -3161, 23, 6485, -1863, -4882, 6689, 3840, -7859, -689, 6485, -3955, -4647, 5241, 1038, -4998, 2005, 2264, -5194, -266, 3089, -5687, -2741, 6461, -2063, -8421, 2703, 4370, -7935, -4665, 3772, -2239, -4644, 2103, -1489, -5265, 2648, 277, -8643, -1390, 4994, -5622, -6523, 4505, 837, -7569, -347, 2696, -5574, -3288, 2418, -3713, -4124, 3963, -1459, -6951, 2741, 3041, -8563, -3243, 5855, -2567, -6854, 3039, 2711, -5175, -302, 1324, -4794, -325, 4387, -4344, -4645, 6825, 1917, -7799, 915, 5966, -4346, -3934, 4569, -455, -3389, 3818, 1517, -4399, 2673, 3986, -5406, -914, 7606, -1567, -5640, 6057, 5123, -5381]
921e381N342N932p394j63O252m418j974P817m016p140Q411M078j1601Q99J1029
936G673n117o877P871J217p170L498L614p391K230P181p194m015J0545j484r940
951e359N815O749r177k113R426l265n764O320K35o568N051K868q874J644R910
966F898o379p382R488K720j0218K320O581o170j142O915m196m332P804m59r103
981f655N326O829r531j795J0283l387p760O893K881q000K090N659o069j148Q167
996C783m853n850R085J343j0636L154R382p416m526Q214m72o127N090J380p263
1011e712M268O077q488k245J0620k885q528P070M385q927P53P938n344l662P432
1026B752j347o154O642J777q101K793Q422p998m495J0449n97r025M566N214o531
$$ y = [-5381, -39, 5893, -1501, -1664, 4588, 170, -1804, 6013, 1997, -5143, 3268, 7346, -4255, -3356, 7673, 2556, -4321, 3550, 4767, -2403, 1095, 4709, -2682, -452, 6729, -465, -4480, 6065, 4581, -5359, 456, 7205, -1972, -4085, 5341, 2076, -3688, 2632, 2867, -3701, 1350, 4218, -4656, -3012, 6898, 519, -6863, 2625, 5345, -4873, -2553, 4028, -2142, -3284, 3631, -565, -4897, 2907, 2448, -6655, -1329, 5500, -4031, -5826, 4457, 1070, -6690, 203, 3084, -4916, -2826, 2833, -3236, -4384, 3783, -1070, -6920, 2165, 3508, -7128, -3974, 5408, -2008, -6534, 1680, 1208, -4919, 171, 1551, -5712, -1444, 4633, -3855, -6100, 4520, 1635, -6893, 177, 4562, -4365, -3612, 4326, -1018, -4680, 2752, 1405, -4749, 1893, 3670, -4431, -1638, 6784, -1214, -5709, 4740, 4143, -4882, -316, 4898, -1633]
1041a633J67O176n226k338P782k165p583O561N050r763J53R253m721n364P315
1056C664Q01p642M494M221p145L57P528n754m348R122p05r093N142O810q356k435
1072c339Q592k957n101N716K49o936N645M420r315k75J0031m735p216P739K310
1087D828q425K893N473o610j337P596l746n740P448J010q528M004O361q076j751
1102d600R020k522p791O261L195p550K235N277o548q87P709l930o659P995L146
1117D351r573J742P403n486l277P249k125o135O620K570q843K442P020o341l004
1132e387Q255j661p569O688L779q857R84P795m756m435P338j040o262O380K492
1147C744q468J955Q082o096m945Q291K73p426M932M301p954R73P278n175m457
$$ y = [-1633, -1466, 4710, -516, -2854, 4928, 2763, -4820, 1741, 6791, -2972, -2819, 6434, 1713, -3651, 3664, 4465, -3177, 1317, 5538, -1607, -1250, 6278, 524, -3824, 5298, 4593, -4500, 642, 7452, -904, -3339, 5253, 2296, -2805, 2911, 3160, -3776, 1869, 6289, -3026, -3301, 6730, 1995, -5221, 2518, 4828, -3597, -704, 4769, -1841, -3178, 4418, 672, -5068, 2380, 3390, -5138, -1134, 5227, -2849, -4600, 4420, 1898, -5893, 368, 3563, -3987, -1752, 3525, -3023, -3910, 3799, -131, -6790, 1205, 4351, -5222, -3480, 3923, -1563, -4840, 2409, 284, -5851, 769, 3339, -5504, -3062, 3958, -2383, -5387, 2868, 1207, -6362, 326, 4105, -4752, -3768, 4027, -729, -5164, 2174, 1134, -5128, 1252, 3744, -4724, -2769, 5313, -783, -5728, 2563, 2836, -4590, 342, 4643, -3311, -2338, 4940, -235, -4692]
1162d692P956j91p818N245M520p762P09P802n224n156Q166J246q372L438N236
1177E103o385M6O693m973m333Q474L90r323M474O316p337j252P313l850m528O932
1193C760P67q410M173O039p085j932P932l320n935P350J409q370L048O450o585
1208g09k548P331k637n367O856P93q295L940O624p537k978Q319j834o313N577
1223A222J931p238K903N958p302k703R169k218p401N989K970p236J578O006o122
1238b494k352Q189k290p389O157L322p548J125O476n580l160Q133j912p055N636
1253g42L747p470J130O534n882k941P896j072q217N587N080p197r65O837l864
1268a539l046O593j685o473O052M298q482j93P931l232n364N775J010o334M448
$$ y = [-4692, 3264, 3073, -4745, 500, 5020, -2742, -2033, 5769, 545, -4611, 3555, 4801, -3571, -133, 5103, -1282, -1236, 5457, 484, -3849, 4625, 5015, -4308, 166, 6482, -855, -2107, 5206, 1356, -3172, 3760, 4527, -3883, 290, 6329, -756, -2688, 5244, 1924, -4011, 3339, 4748, -3622, -574, 5876, -709, -3257, 4074, 1437, -3930, 2926, 3719, -4576, -636, 5988, -1549, -4527, 3792, 1958, -4355, 1222, 3153, -4085, -1182, 4776, -2526, -5229, 3940, 1722, -5679, 310, 3280, -3956, -2378, 3628, -2494, -4846, 3343, 1053, -6336, -179, 3143, -4405, -3280, 3196, -2384, -5544, 2589, 677, -6378, -742, 3005, -4465, -3335, 3199, -2683, -5624, 2272, 1200, -7017, -1430, 3650, -3547, -4512, 2325, -1539, -4585, 2008, 323, -6150, -98, 4200, -4282, -4475, 3456, 224, -5140, 635, 1645, -4689, -241]
1283b41L590o836M86P368m523n319Q026L74p708M189N403p132j157P604l123n352
1299d351O363J019o343L838M018p521j00Q869m467o380P148K863p523J759M968
1314D160n359m78O824m456n359P670J961q538K722O363o143j912P006k881n624
1329d044O881J859p772J807O078n423j798O511k709n521O805J731q514K170P403
1344E464n337l813P063j360o157N333K484p576K436O310n628l484P626j724o353
1359d716N311L079p777R05P730m962m358O523Q6n781L817K356o923K803O659o571
1375a819m306Q727L08q295L614M546n288J3N204m374k568O873j485o967N569M099
1391C851p887R1P815m046n261O470J130o507L011M122n736J083N278n119k951
$$ y = [-241, 3349, -3487, -3001, 4367, -156, -5475, 2551, 2925, -4783, -594, 4809, -2323, -3480, 4124, 1001, -4351, 2012, 3031, -3312, 526, 4544, -2977, -3077, 5792, 1325, -5055, 2093, 4956, -2567, -808, 4160, -1199, -1677, 5147, 691, -4668, 3002, 4963, -3575, -853, 5510, -633, -2545, 4461, 1580, -4044, 2837, 4696, -3076, -1269, 4809, -614, -2412, 4099, 1390, -4131, 2674, 4405, -4109, -1939, 5464, 127, -3686, 3377, 2017, -4140, 1193, 3677, -3899, -1463, 4847, -781, -4265, 3361, 1637, -4716, 595, 3674, -4103, -3198, 4532, -430, -4788, 1735, 1821, -3960, -143, 2213, -4710, -1907, 4752, -1819, -6125, 2602, 2910, -5385, -1771, 2775, -2513, -2500, 2704, -1670, -4238, 2635, 1150, -5817, -248, 3851, -4036, -3945, 3870, -176, -5437, 1033, 2163, -4344, -1333, 2789, -2947, -1864, 3414, -1705, -4656]
1406d656Q363m31r334M664O840o494k904O669j710l656M970o18n779N297M206
1421E427q309q91R501l377o736O029K834o920J877N271n463j117O335k869m361
1436b769O515m6p176L985O031p102l236Q721r01o612M208K403n308J902M231o209
1452a363n81P984l389o949O483L508p376K21O313m024l002O690j764n925N144
1467A970K190o357J335N621n098k472P317j997p260N845L972p439l55O711l268
1482G15l105N324j527n191N263K105p716J524P577n131m495P033j57o798M365
1497b14L836o634j91O215l795l459O093j083o067N736L318q565J7Q730l341o823
1513f227O462J908n569K242K571n081J339N905n276m407Q597P70q858L093O098
$$ y = [-4656, 3707, 3276, -6058, -1394, 5446, -1048, -3952, 2717, 1007, -2649, 2321, 1703, -4076, 1221, 5427, -2882, -3773, 5728, 2351, -4385, 1644, 4478, -2442, -565, 4706, -757, -1874, 4461, 1592, -2769, 3746, 3700, -3476, 509, 6540, -562, -3798, 4923, 4022, -2590, 1618, 4021, -1287, 615, 4846, -1363, -1944, 6040, 2651, -4298, 2185, 5693, -1683, -1462, 4851, 827, -2175, 4515, 2751, -3174, 1970, 4160, -2197, -862, 4759, -339, -2811, 4506, 2509, -4751, 1094, 5066, -2373, -2728, 3983, 715, -2390, 2934, 1407, -3784, 1479, 3584, -4132, -2608, 4969, -162, -4657, 2376, 2219, -4579, -214, 3622, -3012, -3203, 3012, -783, -4242, 1851, 768, -5299, 437, 3755, -4810, -4793, 3937, 596, -6227, 235, 2143, -3426, -1184, 1387, -3694, -2355, 3550, -1726, -6133, 2464, 3234, -5624, -2531, 3567]
1528C567n456k520O162k098l366M898p7n341M141L486o861j33Q086l713o245O788
1544A318K868p156K47N471l100j652M629k730l138P146n43q521L898P364o743
1559f42l920P712J12n638L677J788n308K462M254n711j246P505k792o158N920
1574B015L118p694Q90O665l912l583N495n05m637M440J041o332L165N187o449
1589a096k772Q232l42p363L778M109n728r4M737l655k228O051j534o194N333L368
$$ y = [3567, -1889, -4409, 1753, -345, -3711, 1187, 1110, -4231, -90, 3396, -3465, -3598, 4488, 775, -5470, 1318, 4186, -2970, -2723, 2748, -352, -2004, 2625, -105, -3243, 3903, 3360, -5161, -1263, 6101, -642, -4562, 3150, 3262, -2376, 1301, 3089, -2219, 243, 4497, -1214, -2460, 5045, 2253, -3905, 2015, 5133, -2561, -1671, 4994, 1082, -2501, 2994, 2489, -2148, 2292, 3333, -2999, 166, 5353, -1096, -3868, 4364, 4022, -3341, 437, 4546, -1182, -1276, 3461, -194, -2422, 3629, 2095, -4099, 1234, 4602]
$$ [...]
8191I0
##END NTUPLES=NMR FID
##END=
