##TITLE=1H_Pr 60 mg
 CDCl3, 8 sc, 
 4.08.2021
##JCAMPDX= 6.0         $$ Bruker NMR JCAMP-DX V2.0
##DATA TYPE= NMR FID
##DATA CLASS= NTUPLES
##ORIGIN= UXNMR, Bruker Analytische Messtechnik GmbH
##OWNER= root
$$ XWIN-NMR		Version 3.5
$$ Wed Aug  4 08:44:38 2021 Russian Standard Time (UT+4h)  she@DPX200
##.OBSERVE FREQUENCY= 200.131506
##.OBSERVE NUCLEUS= ^1H
##.DELAY= (6, 6)
##.ACQUISITION MODE= SIMULTANEOUS
##.ACQUISITION SCHEME= undefined
##.AVERAGES= 8
##.DIGITISER RES= 18
##SPECTROMETER/DATA SYSTEM= spect
##.PULSE SEQUENCE= zg30
##.SOLVENT NAME= CDCl3
##.SHIFT REFERENCE= (INTERNAL, CDCl3, 0, 15.7039)
##AUDIT TRAIL= $$ (NUMBER, WHEN, WHO, WHERE, WHAT)
$$ ##TITLE= Audit trail, XWIN-NMR		Version 3.5
$$ ##JCAMPDX= 5.01
$$ ##ORIGIN= Bruker BioSpin GmbH
$$ ##OWNER= she
$$ F:/spectra/data/she/nmr/H-F/1/audita.txt
$$ ##AUDIT TRAIL=  $$ (NUMBER, WHEN, WHO, WHERE, WHAT)
(   1,<2021-08-04 08:43:40.43 +0400>,<she>,<DPX200>,
      <created by zg, POWCHK disabled, PULCHK disabled
       configuration hash MD5:
       00 E9 B6 7A A2 85 ED C7 34 08 36 98 17 FE 4E 26
       data hash MD5: 16K
       3F F1 6D 99 5C 6D 0D E8 F6 84 68 3D 78 59 55 42>)
$$ ##END=
$$ 
$$ hash MD5
$$ 70 6B 31 3C 18 6E 6A 67 04 CA D6 04 6E 35 38 B6
##$RELAX= 
##$RELAX= 
##$RELAX= 
##$RELAX= 
##$RELAX= 
##$RELAX= 
$$ Bruker specific parameters
$$ --------------------------
##$DU= <F:/spectra>
##$EXPNO= 1
##$NAME= <H-F>
##$PROCNO= 1
##$TYPE= <nmr>
##$USER= <she>
##$AMP= (0..31)
100 100 100 100 100 100 100 100 100 100 100 100 100 100 100 100 100 100 
100 100 100 100 100 100 100 100 100 100 100 100 100 100 
##$AQSEQ= 0
##$AQ_mod= 1
##$AUNM= <au_zg>
##$AUTOPOS= <>
##$BF1= 200.13
##$BF2= 200.13
##$BF3= 200.13
##$BF4= 200.13
##$BF5= 200.13
##$BF6= 200.13
##$BF7= 200.13
##$BF8= 200.13
##$BYTORDA= 1
##$CFDGTYP= 0
##$CFRGTYP= 5
##$CHEMSTR= <none>
##$CNST= (0..31)
1 1 145 1 1 1 1 1 1 1 1 1 1 1 1 1 1 1 1 1 1 1 1 1 1 1 1 1 1 1 1 1 
##$CPDPRG= <>
##$CPDPRG1= <>
##$CPDPRG2= <>
##$CPDPRG3= <>
##$CPDPRG4= <mlev>
##$CPDPRG5= <mlev>
##$CPDPRG6= <mlev>
##$CPDPRG7= <mlev>
##$CPDPRG8= <mlev>
##$CPDPRGB= <>
##$CPDPRGT= <>
##$D= (0..31)
0 1.2 0 0 0 0 0 0 0 0.06 0 0.03 0 0 0 0 0.0002 0 0 0 0 0 0 0 0 0 0 0 0 
0 0 0 
##$DATE= 1628052219
##$DBL= (0..7)
120 120 120 120 120 120 120 120 
##$DBP= (0..7)
150 150 150 150 150 150 150 150 
##$DBP07= 0
##$DBPNAM0= <>
##$DBPNAM1= <>
##$DBPNAM2= <>
##$DBPNAM3= <>
##$DBPNAM4= <>
##$DBPNAM5= <>
##$DBPNAM6= <>
##$DBPNAM7= <>
##$DBPOAL= (0..7)
0.5 0.5 0.5 0.5 0.5 0.5 0.5 0.5 
##$DBPOFFS= (0..7)
0 0 0 0 0 0 0 0 
##$DE= 6
##$DECBNUC= <off>
##$DECIM= 32
##$DECNUC= <off>
##$DECSTAT= 4
##$DIGMOD= 1
##$DIGTYP= 9
##$DL= (0..7)
0 120 120 120 120 120 120 120 
##$DP= (0..7)
150 150 150 150 150 150 150 150 
##$DP07= 0
##$DPNAME0= <>
##$DPNAME1= <>
##$DPNAME2= <>
##$DPNAME3= <>
##$DPNAME4= <>
##$DPNAME5= <>
##$DPNAME6= <>
##$DPNAME7= <>
##$DPOAL= (0..7)
0.5 0.5 0.5 0.5 0.5 0.5 0.5 0.5 
##$DPOFFS= (0..7)
0 0 0 0 0 0 0 0 
##$DQDMODE= 0
##$DR= 18
##$DS= 0
##$DSLIST= <SSSSSSSSSSSSSSS>
$$ [...]
##$SUBNAM2= <"">
##$SUBNAM3= <"">
##$SUBNAM4= <"">
##$SUBNAM5= <"">
##$SUBNAM6= <"">
##$SUBNAM7= <"">
##$SUBNAM8= <"">
##$SUBNAM9= <"">
##$SW= 20.0188882624521
##$SWIBOX= (0..15)
0 0 2 0 0 0 0 0 0 0 0 0 0 0 0 0 
##$SW_h= 4006.41025641026
##$TD= 16384
##$TD0= 1
##$TE= 0
##$TE2= 300
##$TE3= 300
##$TEG= 300
##$TL= (0..7)
0 120 120 120 120 120 120 120 
##$TP= (0..7)
150 150 150 150 150 150 150 150 
##$TP07= 0
##$TPNAME0= <>
##$TPNAME1= <>
##$TPNAME2= <>
##$TPNAME3= <>
##$TPNAME4= <>
##$TPNAME5= <>
##$TPNAME6= <>
##$TPNAME7= <>
##$TPOAL= (0..7)
0.5 0.5 0.5 0.5 0.5 0.5 0.5 0.5 
##$TPOFFS= (0..7)
0 0 0 0 0 0 0 0 
##$TUNHIN= 0
##$TUNHOUT= 0
##$TUNXOUT= 0
##$USERA1= <user>
##$USERA2= <user>
##$USERA3= <user>
##$USERA4= <user>
##$USERA5= <user>
##$V9= 5
##$VALIST= <valist>
##$VCLIST= <CCCCCCCCCCCCCCC>
##$VD= 0
##$VDLIST= <DDDDDDDDDDDDDDD>
##$VPLIST= <PPPPPPPPPPPPPPP>
##$VTLIST= <TTTTTTTTTTTTTTT>
##$WBST= 1024
##$WBSW= 4
##$XGAIN= (0..3)
0 0 0 0 
##$XL= 0
##$YL= 0
##$YMAX_a= 131919
##$YMIN_a= -90331
##$ZGOPTNS= <>
##$ZL1= 120
##$ZL2= 120
##$ZL3= 120
##$ZL4= 120
##$ABSF1= 10
##$ABSF2= 0
##$ABSG= 5
##$ABSL= 3
##$ALPHA= 0
##$AQORDER= 0
##$ASSFAC= 0
##$ASSFACI= 0
##$ASSFACX= 0
##$ASSWID= 0
##$AUNMP= <proc_1d>
##$AZFE= 0.1
##$AZFW= 0.1
##$BCFW= 1
##$BC_mod= 2
##$BYTORDP= 1
##$COROFFS= 0
##$CY= 11.3945322036743
##$DATMOD= 1
##$DC= 2
##$DFILT= <>
##$DTYPP= 0
##$F1P= 2.36226072786647
##$F2P= -0.459571619588291
##$FCOR= 0.5
##$FTSIZE= 0
##$FT_mod= 4
##$GAMMA= 1
##$GB= 0.15
##$INTBC= 1
##$INTSCL= 1
##$ISEN= 128
##$LB= 0.24
##$LEV0= 0
##$LPBIN= 0
##$MAXI= 10000
##$MC2= 0
##$MEAN= 0
##$ME_mod= 0
##$MI= 1.114404
##$NCOEF= 0
##$NC_proc= 0
##$NLEV= 6
##$NOISF1= 3.799351
##$NOISF2= 2.8
##$NSP= 1
##$NTH_PI= 0
##$NZP= 0
##$OFFSET= 15.70392
##$PC= 1
##$PHC0= -13512.18
##$PHC1= 10.80099
##$PH_mod= 1
##$PKNL= yes
##$PPARMOD= 0
##$PSCAL= 0
##$PSIGN= 0
##$REVERSE= no
##$SF= 200.130013532006
##$SI= 16384
##$SIGF1= 3
##$SIGF2= 2
##$SINO= 400
##$SIOLD= 16384
##$SREGLST= <1H.CDCl3>
##$SSB= 0
##$STSI= 0
##$STSR= 0
##$SW_p= 3612.71676300578
##$SYMM= 0
##$S_DEV= 0
##$TDeff= 0
##$TDoff= 0
##$TI= <>
##$TILT= no
##$TM1= 0
##$TM2= 0
##$TOPLEV= 0
##$USERP1= <user>
##$USERP2= <user>
##$USERP3= <user>
##$USERP4= <user>
##$USERP5= <user>
##$WDW= 1
##$XDIM= 8192
##$YMAX_p= 0
##$YMIN_p= 0
$$ End of Bruker specific parameters
$$ ---------------------------------
##NTUPLES= NMR FID
##VAR_NAME=  TIME,          FID/REAL,        FID/IMAG
##SYMBOL=    X,             R,               I
##VAR_TYPE=  INDEPENDENT,   DEPENDENT,       DEPENDENT
##VAR_FORM=  AFFN,          ASDF,            ASDF
##VAR_DIM=   8192,          8192,            8192
##UNITS=     SECONDS,       ARBITRARY UNITS, ARBITRARY UNITS
##FACTOR=    0.0002496,     1,               1
##FIRST=     0,             0,               0
##LAST=      2.0444736,     0,               0
##MIN=       0,             -90331,          0
##MAX=       2.0444736,     131919,          0
$$ Real data points
##PAGE= N=1
##DATA TABLE= (X++(R..R)), XYDATA
$$ [...]
851B13J321k483j12K660j307j688K109L91j962N07O24o32N51k49q64J601K11k757
$$ 213 1534 -949 -1061 1599 292 -1396 713 1104 -858 -351 273 -359 192 -57 -921 680 891 -1866
869a866J253K308k589r66L080m79k293J431P01j455M77M64p73J057N5j574J015
$$ -1866 -613 1695 -894 -1860 1220 741 -1552 -121 580 -875 -398 66 -707 350 405 -1169 -154
886a54J218k127n7K454j155j476J811L04j725N08Q37o08J95J83o39Q49K57j657
$$ -154 1064 -1063 -1120 1334 179 -1297 514 818 -907 -399 438 -170 25 208 -431 418 675 -982
904i82O64J728j623j027K280J7k039P72J216j091l90P89k6Q2j56p42P16O14j452
$$ -982 -318 1410 -213 -1240 1040 1057 -982 -210 1006 -85 -475 314 288 370 214 -528 188 802 -650
923f50qJ802m65j646R43J025j245m61R30L56m63l77J47O98l48j118Q19J023j025
$$ -650 -658 1144 679 -967 -24 1001 -244 -705 225 581 118 -259 -112 586 238 -880 -61 962 -63
942f3o56J395J49j472J91J132m54p33M67N78k35p21P4P82j23r59M57R94o39r63
$$ -63 -719 676 825 -647 -456 676 222 -511 -44 534 299 -422 -348 434 311 -648 -191 803 164 -799
962g99P25O88r52l00Q06K07o20q3L20N4l40j89M49L50n25l82P61J19j094J69J162
$$ -799 -74 614 -338 -638 168 375 -245 -328 -8 46 -294 -483 -34 316 -209 -591 170 289 -805 -636 526
983E26k97j049N87Q31o64p30M89O80k14o34J78R13k00j075L31J061m83r94R21
$$ 526 229 -820 -233 598 -66 -796 -307 373 159 -475 -297 616 416 -659 -328 733 250 -744 177
1002A77P64j066k38Q41p7o07K66M64o2l37p0L57K64q33p7J100j67j309O59J147
$$ 177 941 -125 -363 478 401 -206 60 524 462 125 55 412 676 -157 -234 866 699 -610 49 1196
1022A196j125p39J009L54q10r2M03K30l39n95M30O12p86l81J078K0j300L66J099
$$ 1196 71 -668 341 695 -115 -207 196 426 87 -508 -78 534 -252 -633 445 465 -835 -469 630
1041F30q44o16Q54K99n26k67M9M77K38r80j69J511j53j548O03J171q43n63O15
$$ 630 -214 -830 24 323 -203 -470 -421 56 294 -686 -855 656 503 -1045 -442 729 -114 -677 -62
1060f2J61J6ql66K02O24o60m73J028o2q10Q75O7j180P17Q51j309j39J355l48r24
$$ -62 99 115 107 -259 -57 567 -93 -566 462 400 -410 465 532 -648 69 920 -389 -528 827 479 -445
1081d45M57K5NM02q08l65J648k86j921R81J461j446o72J242K0n79R1j56L26M03
$$ -445 12 37 42 444 -364 -729 919 633 -1288 -307 1154 -292 -964 278 298 -281 -190 -346 -20 383
1101C83r99n4J489o29j419J557N03j776M21J474j054n47J106p5o53M01r4j24P74
$$ 383 -616 -670 819 190 -1229 328 831 -945 -524 950 -104 -651 455 380 -273 128 34 -90 684
1120F84p02m71J332l18j399J186Q21j525J78J352j028n61J141k08p79O27j23j92
$$ 684 -18 -489 843 525 -874 312 1133 -392 -214 1138 110 -451 690 482 -297 330 207 15
1138A5P23q33o95J693k02k112J375J532k022o16J794l95r71O81k80k08R23o75
$$ 15 738 -95 -790 903 701 -1411 -36 1496 -526 -1142 652 257 -714 -33 -313 -521 402 -273
1156b73r00J383K09j652P72Q73j023jP86o35j16P59o13j22Q95o42l75J163m11
$$ -273 -1173 210 419 -1233 -461 412 -611 -612 174 -461 -577 182 -431 -553 342 -300 -675 488 77
1175G7j004J251L16j467P27J159j281l10J371m06p62N81J69n0J73o66J68J177
$$ 77 -927 324 640 -827 -100 1059 -222 -532 839 433 -329 252 421 371 544 -122 46 1223
1193A223r29j109J716L58j726M22J177r73k80O60m24J31K84r86N08J190j580o73
$$ 1223 294 -815 901 1259 -467 -45 1132 159 -121 539 115 246 530 -456 52 1242 -338 -1011
1211a011K059m86j831J384P83j662L25R30j040J06J001j126j05J146p67n02J191
$$ -1011 1048 562 -1269 115 898 -764 -439 491 -549 -443 558 -568 -673 473 -294 -796 395
1228C95o95p98J656k84j651J244J050j874K10J307r64o7J049j104n7J535j173
$$ 395 -300 -1098 558 274 -1377 -133 917 -957 -747 560 -404 -471 578 -526 -583 952 -221
1245b21r70K113k63k070J600J109k062J71J601j036l78R27n67n8J014j168m22
$$ -221 -1191 922 659 -1411 189 1298 -764 -593 1008 -28 -406 521 -46 -104 910 -258 -680
1262f80J756n65j402J497K69j761J028R16j569J95J223r86k47R49p02k02J148
$$ -680 1076 511 -891 606 875 -886 142 1058 -511 -316 907 -79 -326 623 -79 -281 867
1279H67j013p05J761l51j607J318O53j757N44J171j211l05J166n29m09O60n99
$$ 867 -146 -851 910 559 -1048 270 923 -834 -290 881 -330 -635 531 2 -407 253 -346
1296c46k2J190r52r21J645R4j750R05R95j306R9R80r31l1R75q49k49J129q06o09
$$ -346 -368 822 -130 -1051 594 688 -1062 -157 838 -468 -369 611 -320 -351 624 -225 -474 655 -151 -760
1316g60J558l30j545J275P73j666K29J135p98j29O74o55O7N81o10j06Q86o97n94
$$ -760 798 468 -1077 198 971 -695 -466 669 -129 -258 416 -239 -172 409 -201 -307 579 -118 -712
1335g12J383l01j336J074O96j302N0R32n86j01M38n62J63O76p92k48J147o38q56
$$ -712 671 370 -966 108 804 -498 -448 484 -102 -203 235 -327 -164 512 -280 -528 619 -19 -875
1354h75J266L1j193N94P63q82m0N65l95J50L20o90K00R05q96m17J222l70r51R86
$$ -875 391 422 -771 -177 586 -296 -336 229 -166 -16 304 -386 -186 719 -177 -594 628 258 -693 293
1374B93K54j142O43O23r80K15N95p25K50O65r79m8J200p31q57J286O7j177O35
$$ 293 547 -595 48 671 -309 -94 501 -224 26 691 -288 -336 864 133 -724 562 629 -548 87
1393H7N70q64J42M27n27K04L21p02K70P84j015l00J354n83j014J137K64j125L59
$$ 87 657 -207 -65 362 -165 39 360 -342 -72 712 -303 -603 751 168 -846 291 555 -570 -211
1412b11O74p59N8M65n14P3M82o64K9Q82q14m78J154j58j014P69M11q55J68N07
$$ -211 463 -296 -238 227 -287 -214 268 -396 -367 515 -299 -777 377 219 -795 -26 385 -470 -302 205
1432B05m64J42L25n36K06N56q13m8J011n59p14J057J12j014N25N34p35J72L61
$$ 205 -259 -117 208 -328 -122 434 -379 -427 584 25 -689 368 480 -534 -9 525 -210 -38 323
1451C23m79K15M37o71L2P81p02l72R89j89q27O84L55p66J77L73l48J40J49m63
$$ 323 -156 59 496 -175 -143 638 -64 -436 553 364 -463 221 576 -190 -13 360 12 152 301 -162
1471a62K61M62p79k5Q64m71n93P91J06q29K64N28m79q8L87k81J06J29m56J64M98
$$ -162 99 561 -218 -243 621 150 -443 348 454 -375 -111 417 -62 -150 237 -44 62 191 -265 -101 397
1492C97o07k59Q58k68o35N59K99o21N3K61j62M6Q2k74K36K16n92J48O25n11m22
$$ 397 -210 -469 389 121 -514 45 344 -277 -224 37 -125 -79 3 -271 -35 181 -411 -263 362 -149 -571
1513e71P93j07n87L52L76m41L4J70j75J09k3j42J99K73m72j08O84j86n53M61K09
$$ -571 222 115 -472 -120 256 -185 -151 19 -156 -47 -70 -212 -13 260 -212 -320 364 178 -375 86 295
1534B95l71l3K85j10O0Rk33K03R9k56J5M50k69l61N36N1n24J63M23k79l13L89
$$ 295 -76 -109 176 66 126 135 -98 105 204 -52 -37 413 144 -217 319 370 -154 9 432 153 -160 229
1556B29k0j59L5N2Jj7j15r0L48m2m51K34L68l87j62K83O1k89M9J03J3j33l4J08
$$ 229 209 50 85 137 138 121 6 -84 264 222 -229 5 373 -14 -176 107 168 -121 -72 31 44 -89 -123 -15
1580a5P8j37j06J08J89k57j59L22N4l42J1M18j83k11J64J34j33J5o5J02O0j66
$$ -15 63 -74 -180 -72 117 -140 -299 23 77 -265 -254 164 -19 -230 -66 68 -65 -50 -115 -13 47 -119
1602a19pK05m5k61J82K82l56o5L80j05k78K32K24k38j26J08lJ20j71j06L77N3
$$ -119 -126 79 34 -227 -45 237 -119 -184 196 91 -187 45 269 31 -95 13 10 130 -41 -147 230 283
1624B83m08k5N55l39l68M28J68l11N9J6j5P4o1l01L95J15n34J79N07n16k55O82
$$ 283 -125 -150 405 66 -302 126 294 -17 42 58 43 117 56 -245 150 265 -269 -90 417 -99 -354 328
1646C28k42m44N52L2m43K38J57l46J69J76l97J77L59n45%O51l62m12N75N5n59
$$ 328 86 -358 194 226 -217 21 178 -168 1 177 -220 -43 316 -229 -229 422 60 -352 223 278 -281
1667b81K92L08m49M2K86l26J24K08l53K4N64m88l31P00p1o35L80K92m48RL11l06
$$ -281 11 319 -130 -88 198 -128 -4 204 -149 -125 439 -49 -380 320 249 -386 -6 286 -162 -153 158 -148
1689a48J34K43n30J53M74n08j93N80j50m49M59M7l65K16J55l22J35K07m50J90
$$ -148 -14 229 -301 -148 326 -182 -375 205 55 -394 65 112 -253 -37 118 -204 -69 138 -312 -122
1709a22K81l94J07M33n28j48P04k38o03O46J86o86K77L20l77J61J33l64K80L41
$$ -122 159 -235 -128 305 -223 -371 333 95 -508 138 324 -362 -85 235 -142 19 152 -212 68 409
1729D09o79J05Q06n82m64Q01j4p32M97K53n68L43J46n21L63L16p15J58O70o50
$$ 409 -270 -165 641 59 -405 396 382 -350 147 400 -168 175 321 -200 163 479 -236 -78 592 -58
1749e8l84Q89k38o04O75N3p69M86L36p01J91N10n92J2N27n07j13P06n16m23Q29
$$ -58 -442 447 209 -395 280 333 -436 50 386 -315 -124 386 -206 -194 333 -174 -287 419 -97 -520 309
1770C09j42p24O43K06p74M27K38n81K66M35p71K18P51p76l22J024k46q23P36K45
$$ 309 167 -557 86 292 -482 -55 183 -398 -132 303 -468 -250 501 -275 -597 427 181 -642 94 339
1790C39p52L09L09n42L55L69p98K54O25o83j30Q14m42n49R54j51q00O55L22q07
$$ 339 -413 -104 205 -337 18 387 -411 -157 468 -215 -345 469 27 -522 432 281 -519 136 458 -349
1810c49M11L64p23K84N11o43j24P28m96k65Q30l77o76Q12J73r09M03N20o08L1
$$ -349 62 426 -297 -13 498 -145 -269 459 -37 -302 528 151 -525 287 460 -449 -46 474 -134 -103
1830a03M79n14J06M32n53j13O93l73m68O85m3o45N68K17o91L22L30n65J84L91
$$ -103 376 -138 -32 400 -153 -266 427 54 -414 271 228 -417 151 368 -323 -1 329 -236 -52 339
1850C39o27J07O91o62l01P59k20m91N89n0n22L95K34n26J56K98l93J37L11o14
$$ 339 -288 -181 510 -152 -453 306 86 -405 184 134 -388 7 241 -285 -129 169 -224 -87 224 -390
1870c90K01N74n89k73P80k40n02N91l9m82M31J50n30K93L40n99J47M83o23k5Q13
$$ -390 -189 385 -204 -477 303 63 -439 152 113 -369 62 212 -318 -25 315 -284 -137 346 -277 -302 511
1891E11n19m84P67l4o01M69J09n38L86J81m85K22L67n23M1N39m79j88P51m12m48
$$ 511 -8 -492 275 241 -360 109 218 -320 66 247 -238 -16 351 -172 -131 408 -71 -259 492 80 -368
1912c68O49j5n39M05J59n39L60L20o75R8N94n73n0N64l62l02N26j02m67M13J94
$$ -368 281 266 -273 132 291 -248 112 432 -243 -145 449 -124 -174 390 28 -274 252 150 -317 96 290
1933B90n30K88J22m29K65K79n99J71N13n44j39O46l75k90N64r8n49N00J45n30
$$ 290 -240 48 170 -259 6 285 -314 -143 370 -174 -313 333 -42 -332 232 134 -415 85 230 -300
1953c00K88K15n29K64M35o78L9N45m23j89N37j60m32M96M8m78L24J95m60K35K76
$$ -300 -12 203 -326 -62 373 -305 -266 279 -144 -333 204 44 -388 108 156 -322 2 197 -263 -28 248
1974B48n56K09M19m89o7N86k74m17N37l3m64L97J96n36K48K75m68J08L88l96n0
$$ 248 -308 -99 320 -169 -236 350 76 -341 196 163 -301 96 292 -244 4 279 -189 -81 307 -89 -139
1995a39M50k58k74M89j23l56L40J07k67J78O6l29K37P8k99J18K89m22L2L70k96
$$ -139 311 53 -221 268 145 -211 129 236 -31 147 213 -116 121 199 -100 18 307 -115 -83 287 -9
2016ij95M19j14j87J73J7k72K00P8k92K57J22l58R9K84l58q7M12k21k06L43n6
$$ -9 -204 215 101 -86 87 104 -168 32 110 -182 75 197 -161 -62 222 -136 -223 189 -32 -238 105 49
2038D9j69J79q4j76K37L4l53K78J64l34O0K88k89j76M24j31k37K99K4k65J57N2
$$ 49 -120 59 -25 -201 36 70 -283 -5 159 -175 -115 173 -116 -292 132 1 -236 63 87 -178 -21 31
2060C1j85J35J14k41K5L30l16q5L38j62j25K31m8j44K22l7j79K31q6j26J55J04
$$ 31 -154 -19 95 -146 -121 209 -107 -192 146 -16 -141 90 42 -102 120 83 -96 135 49 -77 78 182
2082A82l25J08K18j99o7K18o5r8J50l6j18J54pj22Q1K4j39J36J05k62P1Q0r3j17
$$ 182 -143 -35 183 -16 -83 135 70 -28 122 86 -32 122 115 -7 74 98 -41 95 200 -62 9 89 -4 -121
2106a21K45j03PO2r3LJ38j51q8K04J7l07J94J28j56j26K07q4l1O8l0j1M1n0j03
$$ -121 124 21 28 90 -3 0 138 -13 -101 103 120 -187 7 135 -21 -147 60 -24 -55 13 -17 -28 13 -37 -140
2131a40K25j10j37K50J0k03MJ81j49K5J35j35QQ3l0o9N3k5J3N4q4n9J39L3j25
$$ -140 85 -25 -162 88 98 -105 -101 80 -69 -44 91 -44 -36 47 17 -52 1 -24 -11 43 -41 -100 39 72 -53
2156e3J4J47j43l0R5p0K4N8p6jR9n6q3J65k3j55J07L7r1N2J5l7O6nj95J36J71
$$ -53 -39 108 -35 -65 30 -40 -16 42 -34 -35 64 8 -75 90 67 -88 19 56 -35 17 32 -5 61 56 -139 -3 168
2183A68j62n7J67j20p8J62k7o6Q9M1j60J02L0r3j2O8j01M0M6l4k6J28r4j08J56
$$ 168 6 -51 116 -4 -82 80 53 -13 76 117 -43 59 89 -4 -16 52 -49 -9 37 3 -23 105 11 -97 59
2208E9K5j72M1R8jn6l4L4j0N6j10N0J29j28q0Q8R8j55O8K2k5Rl2l1M8jp3L4O8
$$ 59 84 -88 -47 51 50 -6 -40 -6 -16 40 -70 -20 109 -19 -99 -11 87 -68 0 22 -3 6 -26 -57 -9 -10 -83 -49 19
2237A9n5j9jPM2m6K6p8J50p5p1P3O9q7Q4n9j7J26r5o5Q0O2j12L0J5J1N4n3k5O8
$$ 19 -36 -55 -56 -49 -7 -53 -27 -105 45 -30 -101 -28 41 -46 38 -21 -38 88 -7 -72 8 70 -42 -12 3 14 68 15 -10 58
2267E8k6j02N4J39o5j45J10R1j07jL5L3J9o6l6J41l9r9M2Q0n6j7O0o7l2J05o1
$$ 58 32 -70 -16 123 58 -87 23 114 7 6 41 74 93 27 -9 132 93 -6 36 116 60 43 103 36 4 109 48
2294D8q8J42j4j59J50k4p4O7L6j45Q1R8j97Q4R2j03j11J61r3k2J54j35n6J36N5
$$ 48 -40 102 88 -71 79 55 -19 48 84 -61 20 118 -79 5 97 -6 -117 44 -49 -71 83 -52 -108 28 83
2319H3k63J48J63k38jK02j23r8J81o3q4J47r9j33J84N9k60J43J72k48Q3J24j62
$$ 83 -180 -32 131 -107 -108 94 -29 -127 54 -9 -93 54 -45 -178 6 65 -195 -52 120 -128 -45 79 -83
2342h3j1K03j16r1J90o9j08K25j57p4J47K1j07P2P4k32N0K83k30nK14j99j3J70
$$ -83 -94 109 -7 -98 92 23 -85 140 -17 -91 56 77 -30 42 116 -116 -66 217 -13 -18 196 -3 -16 154
2366A54j38n7J58J5k32K58m6k45J72J55k69J00J50j65lJ65j57j14K93j58k23L00
$$ 154 16 -41 117 132 -100 158 112 -133 39 194 -75 25 175 10 7 172 15 -99 194 36 -187 113
2388A13k9k22K09O2k96J39J49k74K1L31k84k1K80j72j89K87p1k75L17rl21K27
$$ 113 84 -138 71 133 -163 -24 125 -149 -128 203 -81 -102 178 6 -183 104 33 -242 75 66 -255 -28
2410b8J57l41J72J79l13o8M05k45j13K74j26j34L54j07k91K41J11l90K05K61k94
$$ -28 129 -212 -40 139 -174 -242 163 -82 -195 79 -47 -181 173 66 -225 16 127 -263 -58 203 -91
2431i1j0K58k55l4L26k29j07K58j84j98M27m5l07K78R9l34J38J98k60K7L10k71
$$ -91 -101 157 -98 -132 194 -35 -142 116 -68 -266 161 116 -191 87 186 -148 -10 188 -72 -45 265 -6
2453fj42M00j23l70M35l9l09K39J75m09J96J85l15O2L04l52n1L18k72j11M35j65
$$ -6 -148 252 129 -241 194 155 -154 85 260 -149 47 232 -83 -21 283 -69 -120 198 -74 -185 250 85
2475H5l84M06M3l39K41J65m55J18L79l08j30L40j91j59M02j68l27L83k4l40K73
$$ 85 -299 107 150 -189 52 217 -238 -120 259 -49 -179 161 -30 -189 213 45 -282 101 77 -263 10
2496A0J13k81J17K29l18N2L12k48j67L02j91j00L24j33k46K90R7l77K02K15l39
$$ 10 123 -158 -41 188 -130 -78 234 -14 -181 121 -70 -170 154 21 -225 65 162 -215 -13 202 -137
2517a37J50J67k89JL16k56o6K64j02k21L44p4l72L88L5k54O7K20k69%L00k66K
$$ -137 13 180 -109 -108 208 -48 -114 150 48 -173 171 97 -275 113 148 -106 -39 181 -88 -88 212 -54 -52
2540e2K47j79j55K89n5k87K78K7k67K77R7l48O5K38k09p8L16k23j11L07j48j76
$$ -52 195 16 -139 150 95 -192 86 113 -154 123 220 -128 -63 175 -34 -112 204 -19 -130 177 29 -147
2562a47K77l1k72K28J07l25J42K17l22N9K11k42L9K12j84r6K61j22k18K52O4k87
$$ -147 130 99 -173 55 162 -163 -21 196 -126 -67 144 -98 -59 153 -31 -127 134 12 -206 46 110 -177
2584a77K64M5l37J68J62k27l2K67j59j17K96j88j58L19o6k38K18N3k85J58J73
$$ -177 87 132 -205 -37 125 -102 -134 133 -26 -143 153 -35 -193 126 60 -178 40 93 -192 -34 139
2605A39k87O9K36k22r4K86j51j41K86o5j65J73J7k80J93J41k57R8J93k78M1K03
$$ 139 -148 -79 157 -65 -159 127 -24 -165 121 56 -109 64 81 -199 -6 135 -122 -24 169 -109 -68 135
2627A35j12j83K97q5k24L34j20j68J67J21k90J28J69k45M5K46j81j33K68j79n0
$$ 135 23 -160 137 52 -172 162 42 -126 41 162 -128 0 169 -76 -31 215 34 -99 169 -10 -60
2648f0J80n5j57K16k8k20J54J93k72J23J32k40l9K22j56m5J36l0j16J39lj56O3
$$ -60 120 65 -92 124 96 -124 30 223 -49 74 206 -34 -73 149 -7 -52 84 54 -62 77 74 -82 -19
2671a9J12k51J64O3j46J9J44j51j01K33r5q6J72o3j53J40M9k21J42jo0R9O7j57
$$ -19 93 -158 6 69 -77 -58 86 -65 -166 67 -28 -114 58 -5 -158 -18 31 -190 -48 -49 -109 -10 57 -100
2695a00m3K19j42j6J65q2p8J28m3j49J90M8j45J3J50j21n0J35n7j00J50o9q4J73
$$ -100 -143 76 -66 -82 83 1 -77 51 8 -141 49 97 -48 -35 115 -6 -56 79 22 -78 72 3 -81 92
2719I2l0j95J47R7k06J7J69q5p8J75j34K9J16l6j11J04O8j81J01J4q3l6J22m3
$$ 92 62 -133 14 111 -95 -78 91 6 -72 103 -31 -2 114 78 -33 71 139 -42 59 73 -10 -46 76 33
2743C3K7k1j6l0N6j1j15J29L3j45O6J3r1O2J5p9J13m2J1l8pJ5p0P3K6n7Jj3K4
$$ 33 60 39 23 -7 49 38 -77 52 85 -60 6 19 -72 -10 5 -74 39 -3 8 -30 -37 -22 -92 -19 7 -50 -49 -62 -38
2772c8N8n9o9K8J20m9r3J05nn6P6Rp3P4K5p3J5Ol9J2R8j20qR1nj00J44J7j72Q9
$$ -38 20 -39 -108 -80 40 -9 -102 3 -2 -58 18 27 -46 28 53 -20 -5 1 -38 -26 72 -48 -56 35 30 -70 74 91 -81 8
2802HN2l7o9J05n8r6J48J6q4J6O5n0K6M3j29j6J87p4j33J49k8k2POq6J06P4j73
$$ 8 60 23 -46 59 1 -95 53 69 -15 1 66 16 42 85 -44 -60 127 53 -80 69 41 19 26 32 -54 52 126 -47
2830d7N0O7o9m5J24o4l7P1j4r9Q6J0o7R4K3j36K6R2j49J4J45j02k2J45j32o1J37
$$ -47 3 70 1 -44 80 16 -21 50 36 -63 23 33 -34 60 83 -53 -27 65 -84 -70 75 -27 -49 96 -36 -97 40
2857D0J7j14J04K7j21J4M1q3M7J14k17M9J47j01l1J17rj36P2O1q0K5N0j04P1O2
$$ 40 57 -57 47 74 -47 -33 8 -75 -28 86 -131 -82 65 -36 -67 50 41 -95 -23 38 -42 -17 33 -71 0 62
2883F2j51J1J24r0o9J57j5j36J62n8j25K12k6j75J06J06j75J7J82j61j0J29p1
$$ 62 -89 -78 46 -44 -113 44 29 -107 55 -3 -128 84 58 -117 -11 95 -80 -63 119 -42 -52 77 6
2906Fr3K23q3j37J73j9j40J45M1j96J26N4j64Q7P1j02j03J81j5j08J58mj44J01
$$ 6 -87 136 53 -84 89 70 -70 75 116 -80 46 100 -64 23 94 -8 -111 70 55 -53 105 101 -43 58
2930E8N8j25O4K6r6J0J42j79n8J71j15o0J77j26M2O7o6j12J06Q6j90J36O3j98
$$ 58 116 -9 55 81 -15 -5 137 -42 -100 71 -44 -104 73 -53 -11 56 -10 -122 -16 70 -120 16 79 -119
2954a19P1J35j30p2J75j15j09K34o3j85K17k3j49J54N2j30l8K32k24J8J54j50
$$ -119 -48 87 -43 -115 60 -55 -164 70 7 -178 39 16 -133 21 73 -57 -95 137 -87 -69 85 -65
2976f5j02K90j11j82K11L2j91J41J26k47L0K66k51L9J64j86q4K27j12p4K02n8
$$ -65 -167 123 12 -170 41 73 -118 23 149 -98 -68 198 -53 -14 150 -36 -120 107 -5 -79 123 65
2998F5k24K88J0j99J01O8j50j1K46k28o7K97j98m9J45J7k07K38o5j52J32J01k14
$$ 65 -159 129 139 -60 41 109 -41 -52 194 -34 -101 196 -2 -51 94 111 -96 142 77 -75 57 158 -56
3021e6k5J80j77P6J49j64j32K55j33k02K99m2j32K05J6k67J17N8j69J11J37k67
$$ -56 -81 99 -78 -2 147 -17 -149 106 -27 -229 70 28 -104 101 117 -150 -33 25 -144 -33 104 -163
3043a63R3K00j81n7J98j85l4J65qr7J00M9k53J69L1j20N2J24j77N0J49j27o6J61
$$ -163 -70 130 -51 -108 90 -95 -129 36 28 -69 31 80 -173 -4 27 -93 -41 83 -94 -44 105 -22 -88 73
3067G3p6m9J10l3r9J52L9k23Q8J25k25J04P9j05K3J10n8q9J73p3p5J41p6j32J81
$$ 73 -3 -52 58 25 -74 78 117 -106 -18 107 -118 -14 65 -40 -17 93 35 -54 119 46 -29 112 36 -96 85
3092H5Rk11J11J39j69L8P3j39%J35r7r3K26q3j26J61K8k08J26J06k51Q4J93k03
$$ 85 94 -117 -6 133 -36 2 75 -64 -64 71 -26 -119 107 24 -102 59 87 -121 5 111 -140 -56 137 -66
3116f6m7K19k14pK47j17j33K56p8k38J90Q3k17R7J57k59J08J63k03m0K08j42m9
$$ -66 -113 106 -108 -115 132 15 -118 138 60 -178 12 95 -122 -25 132 -127 -19 144 -59 -99 109 -33 -82
3139h2J44o1j64K09Rj63J31Rj66R7J52j78kJ58j33o4K24j20q9J58J1j64J04O0
$$ -82 62 1 -163 46 55 -108 23 32 -134 -37 115 -63 -65 93 -40 -104 120 0 -89 69 80 -84 20 80
3163H0j83J00J02j09k6J78j45o3K01j24n3J24n9j01J58j5j17Q3Q3k35J44R2k62
$$ 80 -103 -3 99 -10 -36 142 -3 -66 135 11 -42 82 23 -78 80 65 -52 31 114 -121 23 115 -147
3186a47J74N3j27l6J82q2p7J34o5j05J40j7m1K0N4j32L2J31j02m6J82j59q5J96
$$ -147 27 80 -47 -83 99 17 -60 74 9 -96 44 27 -14 6 60 -72 -40 91 -11 -57 125 -34 -119 77
3210G7k6j01J08o1o7P1L8j50J03J21j76J2J85j94rJ17r3n2J19L7j90J53po8J31
$$ 77 51 -50 58 -3 -70 1 39 -111 -8 113 -63 -51 134 -60 -69 48 -45 -97 22 59 -131 22 15 -53 78
3235G8oj77Q5Q1j13k3J31j43k9K25j14j32J55k4q9J11k8n1kJ53j41%J65j77K0
$$ 78 72 -105 -20 61 -52 -75 56 -87 -116 109 -5 -137 18 -6 -95 16 -12 -63 -65 88 -53 -53 112 -65 -45
3260d5J26q3RJ00j24J8L7K4j21J45j2q3M5M4j92J15O2n2PMko9J42m7j18J67n0
$$ -45 81 -2 7 107 -17 1 38 62 -59 86 74 -9 36 80 -112 3 65 13 20 24 22 -47 95 48 -70 97 47
3287D7r0O1j0k8M0Po3J3O4qp5O5kn0m5O9m6O5M7j04L3J13j18K9O1j42L3P5p7p8
$$ 47 -43 18 8 -20 20 27 -36 -23 41 33 -42 23 21 -29 -74 -5 -51 14 61 -43 -10 103 -15 14 75 -67 -34 41 -36 -114
3317a14J54l9k9M2rq7P6K0j29N0Q3j01J11K8p6KL0p2M6Lkj8R0p4k7R0o9m7Q7L4
$$ -114 40 1 -28 14 5 -82 -6 14 -115 -65 18 -83 28 56 -20 -18 12 -60 -14 -11 -13 -31 59 -15 -42 48 -21 -68 19 53
3347E3r7P2P0r1m3P4K8l8L6p3K0P3q9l5J01j4p0L6N4j37N5O9p4K7N0p4RP6o5m5
$$ 53 -44 28 98 7 -36 38 66 28 64 -9 11 84 -5 -40 61 47 -23 13 67 -70 -15 54 -20 7 57 -17 -8 68 3 -42
3377d2j2M4j4OQl8N9K4p3P0m0O7q4P0j7l6L4po5J7N8m3QK0n5K2K0n0K8J8p1J11
$$ -42 -54 -10 -24 -18 -10 -48 11 35 -38 32 -8 59 -25 45 28 -8 26 19 -46 -29 29 -14 -6 14 -41 -19 1 -49 -21 -3 -74 37
3409C7m7k6rL3J2o0R0o1P2k4j9l6P1n8pL9N1q3J8j1J8k1M4p5L3QK5%L5j6k6K0
$$ 37 -10 -36 -45 -12 0 -60 30 -31 41 17 -2 -38 33 -25 -32 7 58 -25 -7 -18 0 -21 23 -52 -19 -11 14 14 49 33 7 27
3441B7k2l0Q7jn4M7p2J6N8M4n5L8j13Q2j8k5o9R7m3NK6k0%l8Q2o0jj2qJ4N7n2
$$ 27 5 -25 62 61 7 54 -18 -2 56 100 45 83 -30 52 34 9 -60 37 -6 -1 25 5 5 -33 49 -11 -12 -24 -32 -18 39 -13
3473a3k4L7OK5jn8kL0P3j28J8N4l6j7L8m3%R0K2j38N4P7j16l1Q8o3rJ15n5Pj6
$$ -13 -37 0 6 31 30 -28 -30 0 73 -55 -37 17 -19 -36 2 -41 -41 49 71 -67 -13 64 -52 -83 5 -58 -67 48 -7 0 -16
3504a6J1n9M1K8n1P2j8j03O8M0m3k6J07j05PM8K3q7O4mo4J59p1m5N6Ln9N4r%l3
$$ -16 -5 -64 -23 5 -46 26 8 -95 -27 13 -30 -56 51 -54 -47 1 24 -63 1 -3 -67 92 21 -24 32 35 -24 30 21 21 -12
3535a2J4K3l9R7q3n1J40j0j19J04J2j51J21L6j08Q9M3j16M6N0l9j71K18j7j52
$$ -12 2 25 -14 83 0 -51 89 79 -40 64 76 -75 46 82 -26 63 106 -10 36 86 47 -124 94 77 -75
3560g5J26Pj39L3J26j70R3R8j87N8J18j73KP9K3r6J34n5p3J16J6j77J29L6j42
$$ -75 51 58 -81 -48 78 -92 1 99 -88 -30 88 -85 -83 -4 19 -77 57 2 -71 45 61 -116 13 49 -93
3585i3K3R9r6n8J97j18m5J56q7n9Q7L3j34R7P5r5l3J49j58M0M9l9m3J43j06MQ8
$$ -93 -70 29 -67 -125 72 -46 -91 65 -22 -81 6 39 -95 2 77 -18 -51 98 -60 -20 29 -10 -53 90 -16 -12 76
3612G6l8j08J36k9q1O3M0o0M5L0j13P9P1j44l8J97p8j18K04j40n3J27j1j93J75
$$ 76 38 -70 66 37 -44 19 59 -1 44 74 -39 40 111 -33 -71 126 48 -70 134 -6 -59 68 57 -136 39
3637C9Oq7M6J21j49l3J91j65L1R8j37n4K02k2j98J10R4k52J56O1j28oR8j15QR1
$$ 39 45 -42 4 125 -24 -57 134 -31 0 98 -39 -93 109 87 -111 -1 93 -159 -3 58 -70 -76 22 -93 -85 6
3663Fj8p4J00l5j16J81rr4L6P5j46L0J71j67k7J46p7m0R5l5j23R1M1j02Q1O1j63
$$ 6 -12 -86 14 -21 -137 44 35 -59 -23 52 -94 -64 107 -60 -87 59 -18 -58 37 2 -121 -30 11 -91 -10 51 -112
3690a12J75n7j22Q5R3j03NQ9r6m9J66r1k5O5K6j47J11R8k01J31R6k24M4J18j47
$$ -112 63 6 -116 -31 62 -41 -36 53 -43 -92 74 -17 -42 23 49 -98 13 111 -90 41 137 -87 -43 75 -72
3715g2K1J67q5j10K03r0j38K24r4n3K0P5j79J35O2j38J7J30r7n5J61j08o0J40
$$ -72 -51 116 31 -79 124 34 -104 120 26 -27 -7 68 -111 24 86 -52 -35 95 -2 -57 104 -4 -64 76
3739G6kj38J15N3j68J05rr2M9O1j32L4J42q9o8J47q8j23J33j2p7J26K6j56K7J30
$$ 76 74 -64 51 104 -64 41 32 -60 -11 50 -82 -48 94 5 -63 84 -4 -127 6 -6 -83 43 69 -87 -60 70
3765G0j48L8R4j12l7J81p8j20Q6K6r0Q9L7j29J44%j63Q4N9j27J7J42q7j6J18p9
$$ 70 -78 -40 54 -58 -95 86 8 -112 -26 0 -90 -1 36 -93 51 51 -112 -28 31 -96 -79 63 -24 -40 78 -1
3791aq3J62m5j25J73n6j60J26Q9j44mJ21n3q1J50r5p0K30j13q0J15J1j64J30M6
$$ -1 -84 78 33 -92 81 25 -135 -9 80 -64 -68 53 0 -81 69 -26 -96 134 21 -59 56 67 -97 33 79
3816G9j57N8J19j56R6P7j17l8J60q9j08J10n0p0P4N6j33J29jj10J37jr4J6P8p9
$$ 79 -78 -20 99 -57 39 116 -1 -39 121 32 -76 34 -16 -86 -12 44 -89 40 39 -71 66 65 -29 -13 65 -14
3842a4o6J05J3r7P2O5j42P9k8r0Q2J11j35K9R2j98M7J77j28p9J58m0o9L7k6m7
$$ -14 -80 25 38 -59 13 78 -64 15 -13 -103 -21 90 -45 -16 76 -122 -75 102 -26 -105 53 13 -56 -19 -45 -92
3868i2J13Jj62J25J10j11j9P2j3j17J24qr9J12m9q5J31Q7j42K4K2r5M8P5q1L3
$$ -92 21 22 -140 -15 95 -16 -35 37 24 -93 31 23 -76 36 -13 -98 33 120 -22 2 24 -71 -23 52 -29 4
3894DR7o3o5J34j48oR5J2l3j6P5r9K4L1l2k4R5q8k5N6l9j4N8K0o5J9O5j75R7K8
$$ 4 101 38 -27 107 -41 -47 48 60 27 11 86 -13 11 42 10 -14 81 -7 -32 24 -15 -29 29 49 -16 3 68 -107 -10 18
3924A8%n7J16j55J2J26m4m1km0J5J22r5p8O8R7j35L3N5o9j1P9j04L1Q5l1p4J12
$$ 18 18 -39 77 -78 -66 60 16 -25 -27 -67 -52 70 -25 -103 -35 62 -73 -40 15 -54 -65 14 -90 -59 26 -5 -79 33
3952C3j3q3O0n7M0j6O8r5Q2L1n8K3j1mn4J28l9n7L1N2p9R6r2mk0M7L1n8J0L2k6
$$ 33 20 -63 -3 -60 -20 -36 32 -63 19 50 -8 15 4 0 -54 74 35 -22 9 61 -18 78 -14 -18 -38 9 40 -18 -8 24 -2
3983bj4K7L7l1j8k3N6l3l3j0M9P8j47Q1j4l8J7rk0L8L6k4K3p2J13o8J0nl1L4M4
$$ -2 -16 11 48 17 -1 -24 32 -1 -34 -44 5 83 -64 17 3 -35 -18 -27 -47 -9 27 3 26 -46 67 -1 9 4 -27 7 51
4014E1j06R2m7l5k2J03n2LJ2j5L1j2K4o7K2m7P0M6p9O5l9lO7q6J6%m4N8m8MK9
$$ 51 -55 37 -10 -45 -67 36 -16 -13 -1 -16 15 3 27 -40 -18 -65 5 51 -28 37 -2 -5 62 -24 -8 -8 -52 6 -42 -38 -9
4045iL3o5j5M6K4k4L1j9k5O6Pr0K1j8R3j17J15l8oO8j38P1n5L5n2O7O7j26R2k0
$$ -9 24 -41 -56 -10 14 -10 21 2 -23 43 50 -40 -19 -37 56 -61 54 16 10 78 -60 11 -44 -9 -61 6 73 -53 39 19
4075A9K7n6O1n5L5O2q2QM4q0O5j0k9l0O8rq9R8J5m1J4lm8R7no7n4Q7j0l3j1K3
$$ 19 46 -10 51 -4 31 93 11 19 63 -17 48 38 9 -21 47 38 -51 47 62 21 35 32 -16 81 76 9 -45 42 32 -1 -12 11
4107A1OJ2j3l4P5l1q1L2L0p8O5Q0j12k2N9k5j6R9o9n6N9Rj14J07N7j05P5L1o4
$$ 11 17 29 16 -18 57 26 -55 -23 7 -71 -6 74 -38 -60 -1 -26 -42 57 -12 -68 -9 0 -114 -7 50 -55 20 51 -13
4136a3k5J17q5NL9k1j02P2K0l7J5O1q9M5K5m0qO5n1m1J32p1k4P1m1n1J44Kj81
$$ -13 -38 79 -6 -1 38 17 -85 -13 7 -30 -15 46 -43 2 27 -13 -21 44 -7 -48 84 13 -11 60 19 -32 112 114 -67
4165f7J9J11j04J3J11p3j8M4j9o7J06n6m3M2O2r5O4M6j23N8M5q6%J24r1k2L1l3
$$ -67 -48 63 -41 -28 83 10 -8 36 17 -50 56 0 -43 -1 61 -34 30 76 -47 11 56 -30 -30 94 3 -19 12 -21
4193b1j0N1q9m5J38%j02Q0O6j08K2L2n8o5J59r3m7J45j00k8O4O5j19O8rk2K2O2
$$ -21 -31 20 -69 -114 24 24 -78 2 68 -40 -18 14 -44 -109 50 -43 -90 55 -45 -73 -9 56 -63 5 -4 -26 -4 58
4221E8j41L8J04j35k8J44n9o4J24n2m7N6j9j1M4O8j49K7P9p0JJ42j33j1Q3l0m2
$$ 58 -83 -45 59 -76 -104 40 -19 -83 41 -11 -58 -2 -21 -32 12 80 -69 -42 37 -33 -32 110 -23 -34 49 19 -23
4248b3O7L6j05Q0L8j23N3P9j06L1N6r6q3J70o6k8R5mj37J00k6l9N5J6n3l1J08
$$ -23 44 80 -25 55 93 -30 23 102 -4 27 83 -13 -96 74 8 -20 75 71 -66 34 8 -31 24 40 -13 -44 64
4275F4q1J2O1r2j2R8p2j6J19n9j08J12lr6M1O6j08P9J08j62RR4r2o5J28j4p7Q0
$$ 64 -17 -5 56 -36 -48 50 -22 -38 81 22 -86 26 23 -73 -32 34 -74 5 113 -49 -40 54 -38 -103 25 11 -66 14
4303A4L9j06jR3j26R6%j7m9M2K7p5J16mj52J44m5k2O3n6m9R1L7j13L1P2o1j6N8
$$ 14 53 -53 -54 39 -87 9 9 -8 -57 -15 12 -63 53 49 -103 41 -4 -26 37 -19 -68 23 60 -53 -22 50 -11 -27 31
4332C1q6M2KJ9q0R2m1mK6J25j86P2P1j59O0J00o1q4R5J3q8L8O6j24L6P5r0O9J4
$$ 31 -55 -13 -11 8 -72 20 -21 -25 1 126 -60 12 83 -76 -16 84 23 -61 34 47 -41 -3 63 -61 -25 50 -40 29 43
4361D3n1n8J81j73k9J35q6m0J76q9p9P9J14j64M3P5j68J01K9k8LP4j39M4Q7lj11
$$ 43 -8 -66 115 -58 -87 48 -38 -78 98 9 -70 9 123 -41 2 77 -91 10 39 11 14 88 -51 -7 80 77 -34
4388c4O8n4o1R0Kl4OO5j36P9N0j28L6L1j5qJ2L4j46J43O0p6K4M7p6J5R2r5L3J0
$$ -34 34 -20 -81 9 11 -23 -17 48 -88 -9 41 -87 -51 -20 -35 -43 -31 3 -143 0 60 -16 8 55 -21 -6 86 -9 24 34
4418C4r6O5J7K4j31J40p9L2K3n7k8R9K5j15R1O8j01K7P1j13l1P1n2l0L5M0m%K4
$$ 34 -62 3 20 44 -87 53 -26 6 29 -28 -56 43 68 -47 44 112 11 38 109 -4 -35 36 -16 -46 -11 29 25 25 49
4447D9n4M2j5j4QJ4jk4jm5M2J5p5PR4l0j6j3Q2n4m7M0l4j7O3m3MK5k5J4N8l0m6
$$ 49 -5 37 22 8 16 30 29 5 4 -41 1 16 -59 -52 42 12 -4 -17 65 11 -36 4 -30 -47 16 -27 -23 2 -23 -9 49 19 -27
4480b7N7j9m8O3j8o2O5k1K9m8K5m7P2k0L8o5OM1l7L2j1p2M7J9k2JO2m2O4o2j6
$$ -27 30 11 -37 26 8 -54 11 -10 19 -29 -4 -51 21 1 39 -26 -20 21 -16 16 5 -67 -20 -1 -23 -22 40 -2 62 0 -16
4511a6OP7p2K8J7j7k1J1N5j02pP0pK2j0k5N6J0k7K0n5oj0J3qn1J11mj00J6PJ9
$$ -16 -10 67 -5 23 40 23 2 13 68 -34 -41 29 22 44 34 9 65 75 48 68 13 7 -3 10 2 -49 62 58 -42 -26 -19 0
4543@K8k8K6L1m4M1j6l1n0N0j4lpJ0Rk1P5r5P2q6PN1m9J2M0l3M1k0o6L5O1o0j8
$$ 0 28 0 26 57 13 54 38 7 -43 7 -7 -10 -17 -7 2 -19 56 -39 33 -53 -46 5 -44 -32 8 -25 16 -4 -70 -35 26 -34 -52
4576e2L4J7o5Q4lm2K3oL8l8L5j8N7k2j6l2k1%O0m2k1K8K9m0nLK1K6m5P5n2j4q
$$ -52 -18 -1 -66 18 15 -27 -4 -10 28 -10 25 7 64 42 26 -6 -27 -27 33 -9 -30 -2 27 -13 -18 -15 6 32 -13 62 10 -4 -12
4609a2K6j7J4m8N9j3K7m6N3k5l6J0k8M2J9k0L6l4m6Q6m1%m9J05j9j1K4k2L3o0
$$ -12 14 -3 11 -37 22 9 36 -10 43 18 -18 -8 -36 6 25 5 41 7 -39 47 6 6 -43 62 43 32 56 34 67 7
4639Gm1PK4L7p4O6L3n5K5j7o2J7R8j4o0N6k3l1L9n0k4k7O2j5N5m1P5p5j6Q1o8
$$ 7 -34 -27 -3 34 -40 26 59 4 29 12 -50 -33 65 51 -9 47 24 -7 32 -18 -42 -69 -7 -22 33 -8 67 -8 -24 57 -11
4670a1l6O7kk6K7k2Qj9j1M2j1n6O3m1L0j9L5m7M0pl5M4k7m3R7p8K8L6n2J8m6M5
$$ -11 -47 20 18 -8 19 -3 5 -14 -25 17 6 -50 13 -28 2 -17 18 -29 11 4 -31 13 -14 -57 40 -38 -10 26 -26 -8 -54 -9
4702ij6j3L7L2Kl0O5m3M4n6j6J2oJ7mN4q0K0M2Jl0J2J5n4PRnn4J18m8n5Q7p3j1
$$ -9 -25 -38 -1 31 33 3 68 25 69 13 -3 9 3 20 16 70 -10 10 52 53 23 35 50 -4 3 12 7 -47 71 23 -32 55 -18 -29
4736b9J01p5j5N2l5n1J07j3q9J6P4q7J7K0j3KJ6m5M5N2n7k2L9jk1O2j2l1l4P3
$$ -29 72 -3 -18 34 -1 -52 55 42 -47 -31 43 -44 -27 -7 -20 -18 -2 -47 -2 50 -7 -29 10 9 -12 50 38 7 -27 46
4766D6o8l9N9nl0O1n0l0J01n7k1N2k9p4J44%j02O4M6q9k7R0k1J6mm0jOK3l1Q0
$$ 46 -22 -61 -2 -7 -37 24 -26 -56 45 -12 -33 19 -10 -84 60 60 -42 22 68 -21 -48 42 21 37 33 -7 -8 -2 21 -10 70
4797G0l7j02J10J3r2k4J49p9k8N8m0p7Q3J3r0N5k2L6N6J7n0n1J07j23K8lPkJ5
$$ 70 33 -69 41 54 -38 -62 87 8 -20 38 -2 -79 4 17 -73 -18 -40 -4 52 69 19 -32 75 -48 -20 -23 -16 -18 -3
4826cj3M8Qm1JklnmN1j03K4P4r8K6L0l7K1N5p4nM7M0j15O8M5p4K6K8n2L5kn3N3
$$ -3 -16 32 40 -1 0 -2 -5 -10 -14 37 -66 -42 32 -66 -40 -10 -47 -26 29 -45 -50 -3 37 -78 -10 35 -39 -13 15 -37 -2 -4 -57 -4
4860dQj2LM3qo2M8l4PRlm0N0K3l2M8l3K1k8Q1n4k4J2J4q4R4k5m3K1QJ6k8R4m2
$$ -4 4 -8 -5 38 30 -32 16 -18 -11 -2 -5 -45 5 28 -4 44 11 32 4 85 31 7 19 33 -51 43 18 -25 -4 4 20 -8 86 44
4894D4l9L5r3Q4L4l3q8J00pl1N2o5k0L7M0n6QM1m2rP4n5l1J5L9j17J28j0j14Q3
$$ 44 5 40 -53 31 65 32 -56 44 37 6 58 -7 -27 10 50 -6 2 43 1 -8 66 11 -20 -5 34 -83 45 35 -79 4
4924DJ5q8N3k3Rk5M5L1Mj6j6m5J01k1q4R2k1o9N2J9r5N5Q2p7j3R4n9l8J04q0l3
$$ 4 19 -69 -16 -39 -30 -55 -10 21 25 9 -7 -52 49 28 -56 36 15 -54 -2 17 -78 -23 59 -18 -31 63 4 -34 70 -10 -43
4955d3P4l8n7R6ok2%L3q9RM6jn2J00n6J6L7p3k3M8M4r5N2K2J4m1J6k5kJ6L1j02
$$ -43 31 -7 -64 32 26 4 4 37 -52 -43 3 2 -50 50 -6 10 47 -26 -49 -1 43 -52 0 22 36 -5 11 -14 -16 0 31 -71
4987g1J33qr9Q4L6o9n9L7m5Q2k6K4J6L4j14N5L5m0KRL1j3Oj4l3M3N5j33K9Op7
$$ -71 62 54 -45 39 75 6 -53 -16 -61 21 -5 19 35 69 -45 10 45 5 7 16 47 34 40 26 -7 36 91 -42 -13 -7 -84
5018h4N7M2l8mP3o5k7P4p9k6J03L1p2k1L6n3K4M3m4j7J89j36k9L4L5l7Q2l3q9
$$ -84 -27 15 -23 -27 46 -19 -46 28 -51 -77 26 57 -15 -36 0 -53 -29 14 -30 -47 142 6 -23 11 46 9 91 58 -31
5047c1L6Q0j09M1N1q8L1J8n0J8Q6q4J1J0j3mJ5j1j8n8J26j20M2j5N0J0j3L2n6
$$ -31 5 85 -24 17 68 -20 11 29 -21 -3 83 -1 10 20 7 3 18 7 -11 -69 57 -63 -21 -36 14 24 11 43 -13
5076a3L4Ml6P8k8j39J47q8K6O4q5kO9k2l3k3OL3Rkk0m1Q3m1K8J3L8j05J3L3n1
$$ -13 21 25 -11 67 39 -100 47 -41 -15 49 -36 -38 31 9 -24 -47 -41 -8 1 -1 -21 -62 21 -20 8 21 59 -46 -33 0 -51
5107e1O2o8qL2P9p3OM0k4RQJn3J0J05o6k3L8k1o0L9J2k5O1J4q2Q9m3qk3J6K1J8
$$ -51 11 -57 -65 -33 46 -27 -21 19 -5 4 12 13 -40 -30 75 9 -14 24 3 -57 -18 -6 -31 30 44 -38 51 8 0 -23 -7 14 32
5140C2Ok9j9M5l7k7L6K5k8J7o3L0l5N5K6ork7kQ4j11J05j21M7L7rml8K4jn9k2
$$ 32 38 9 -10 35 -2 -29 7 32 4 21 -42 -12 -47 8 34 28 19 -8 -10 74 -37 68 -53 -6 31 22 18 -20 4 3 -56 -78
5172g8J11l6l5K9KQL2r2O7k5qJN9J1q5O1n5N1N0o3J7k0j1j5L5j0Nk0qm2OK9N0
$$ -78 33 -3 -38 -9 -7 1 33 -59 8 -17 -25 -24 35 46 -39 22 -33 18 68 5 22 2 -9 -24 11 1 6 -14 -22 -64 -58 -29 21
5205B1Ol9O3p4K2M5J0m2J0m6QOJ5ql9N0l5jM3J5n1O2mm2KqM1p1M2L2j5N4r9M9
$$ 21 27 -12 51 -23 -1 44 54 12 22 -24 -16 -10 5 -3 -42 8 -27 -28 15 30 -21 41 37 -5 -3 -11 30 -41 1 33 18 72 -27 22
5239B2pjj3M0k9K2p6N2ql6L9Kj8k5N4Km3M4Pk1lK4J4l9k8M9%Kq1J05p4M3o1j9
$$ 22 15 14 1 41 12 34 -42 10 2 -34 5 7 -11 -36 18 20 -23 21 28 7 4 28 42 3 -25 24 24 26 -55 50 -24 19 -42 -61
5273f1O7k7K6rL6p0P0n2M6l9O9r5N3On9M9J9o2K7J5n6Q4n3J0K4j4RL8k2n5J9M4
$$ -61 6 -21 5 -4 32 -38 32 -20 26 -13 56 -39 14 20 -39 10 29 -33 -6 9 -47 37 -16 -6 18 4 13 51 29 -26 -7 37
5305C7k8K1j03M8N1j5p3K0L4K0q1Q3o4J16m2Lj4k9Q1q9P4l7l1j3J7NJ8j6L8k8
$$ 37 9 30 -73 -25 26 11 -62 -42 -8 12 -69 14 -50 66 24 27 13 -16 65 -24 50 13 -18 -31 -14 -9 9 -7 31 3
5335CQ6k8n6j5N2n3k7L8l2L5pm7M7L4k6o2O8j3j9J6nl3J3M6l1K7L3j2l0L2m3k3
$$ 3 89 61 5 -10 42 -11 -38 0 -32 3 -4 -51 -4 30 4 -58 10 -3 -22 -6 -11 -44 -31 15 -16 11 44 32 2 34 -9 -32
5367c2N2Kp0P3%p2J6M9j1kK4n3M0M1m1L4K6j42K8P4k5m1N6J7j20O0j9O1p4Q0p8
$$ -32 20 22 -48 25 25 -47 -31 18 7 5 29 -24 16 57 16 50 76 -66 -38 36 11 -30 26 43 -77 -17 -36 25 -49 31 -47
5398d7qP0NQn4j4J5k4N9n6J00k9j02J04k0m7K9K8q3L4K8mJ7k2P1p5l8O3j2L8l7
$$ -47 -55 15 20 28 -26 -40 -25 -49 10 -46 54 25 -77 27 7 -40 -11 17 -66 -32 -4 -8 9 -13 58 -17 -55 8 -4 34 -3
5429cjJooKKm2L1K1pk3L8K3k1j7O7m2m6J3j5l4R8Mk4k6ok1L8n9j5O9Rk9j9N9K2
$$ -3 -4 -3 -9 -15 -13 -11 -53 -22 -1 -8 -31 7 30 9 -8 59 17 -29 -16 -31 -65 33 37 13 -13 -19 -40 -2 -61 -76 -7 2 -27 -46 13 35
5465C5l0L0r1P1L4q1M4n4J3kN9n7J1N3jj05J13k5p5N8L2n6kk2k8N3K4j0PO4k9
$$ 35 5 35 -56 15 49 -32 12 -42 -29 -31 28 -29 -18 35 34 -71 42 17 -58 0 32 -24 -26 -48 -76 -23 1 -9 -2 62 33
5496C3o3N4j5n0M3k1Ln9J35l6J1l2J2j8LpN4L2r1Jjj7NM8k4K8p3P8lK4nm6RJ1
$$ 33 -30 24 9 -41 2 -19 -16 -75 60 24 35 3 15 -3 0 -7 47 79 -12 -11 -12 -29 -24 24 0 28 -45 33 30 54 49 3 12 23
5530B3Mn6J9L5p7N3K1p0O7pj4%L2m5m4O0Jn8L4K6Nn3O3m7J8k2L5M5on1M8n1kJ2
$$ 23 27 -29 -10 25 -52 1 22 -48 19 12 -2 -2 30 -15 -59 1 2 -56 -22 4 9 -44 19 -28 -10 -32 3 48 42 -9 39 -12 -14 -2
5564bP8j8j08N1J9k9l3R3q4M0M8q7L5P8r9m6P2n9L1L0K4r1R9K2r8L2j2j0poK6
$$ -2 76 58 -50 1 20 -9 -42 51 -33 7 55 -32 3 81 -18 -64 8 -51 -20 10 34 -57 42 64 -34 -2 -14 -24 -31 -37 -11
5595a1K9J4kpJ5L1o2J2Kn9P5J2o5J05p8o5Q0%l6K3J7l1j5O0m6l0K9L0n0K7rM8
$$ -11 18 32 30 23 38 69 7 19 21 -38 37 49 -16 89 11 -54 26 26 -10 13 30 -1 -16 44 -2 -32 -3 27 -23 4 -5 43
5627D3m7L2m2K3j4n4Q7oL3j05L2j0J4m5L8k2M8J8l2N9o9Rj0J9ML5lp2O4MjL1j05
$$ 43 -4 28 -14 9 -5 -59 28 22 55 -50 -18 -28 -14 -59 -21 -43 5 23 -9 50 -19 -10 -20 -1 3 38 35 -37 27 31 30 61 -44
5660d4L5rk6P2o6L0J3j0p7N5J5l9R7lj1k6k3j0L5K9o8K2L3n6J8k2N7r9R6om7P0
$$ -44 -9 -18 -44 28 -38 -8 5 -5 -82 -27 -12 -51 46 43 32 6 -17 -27 8 37 -31 -9 24 -32 -14 -36 21 -78 18 12 -35 35
5692C5m3m8O3j3k0J04r4L7ml6MLL7o0n1J16Lk5k6J3QL0l4J8m3N4n8l0P5kn3M1
$$ 35 -8 -56 7 -6 -26 78 -16 21 17 -19 -15 -12 25 -35 -86 30 33 8 -18 -5 3 33 -1 17 -26 28 -30 -60 15 13 -40 1
5724AmJ2j0O%k5N4m2L6J5j9k3N0q3N3m9k1P1N3r8Ok4J02p3k1K9j6J0LL0m3l3L6
$$ 1 -3 9 -1 5 5 -20 34 -8 28 43 24 1 51 -32 21 -28 -49 22 75 -23 -17 -41 61 -12 -33 -4 -20 -10 -7 23 -20 -53 -17
5757a7K8m4K6RK6%l7J4M9p2j3M3K9n6j9M0k0l1Q5m1J3j3PJ1l5J8L0l7Nn2Q8j9
$$ -17 11 -33 -7 2 28 28 -9 5 54 -18 -31 12 41 -15 -34 6 -14 -45 40 -1 12 -1 6 17 -18 0 30 -7 -2 -54 34 15
5789A5Nj3o2O8K5n1l0K8qK1L6Nl3m7J9L6qk0M0o5O4m1kO6p3J1MJ2mj6M3K4j1m2
$$ 15 20 7 -55 13 38 -13 -43 -15 -23 -2 34 39 6 -41 -22 14 6 -14 26 -39 25 -16 -18 48 -25 -14 -10 2 -2 -18 25 49 38 -4
5823dL3p2o3J07l4J5L8n0J5JRQj2j4K1K1Jo8K3pPN3k8J5J6m0Q3r1j3J8K3M5k5
$$ -4 29 -43 -106 1 -33 -18 20 -30 -15 -14 -5 3 -9 -23 -2 19 20 -48 -25 -32 -25 28 0 15 31 -9 74 -17 -30 -12 11 56 31
5856C1L7rj7p2jJ5L5lJ9r9Q9j3j7Ol4M4J3M5r1O5k9n5J8K4J4Jm3k2P9k6L1m6K2
$$ 31 68 59 42 -30 -31 -16 19 16 35 -64 25 12 -5 1 -33 11 24 69 -22 43 14 -41 -23 1 15 16 -27 -49 30 4 35 -11 11
5889A1o0N8K6k2N7r9K4NJ4KJ9q8J10j9q6P4j0K2l2o7M7J1o8O4n0QR7j2l2J5j1
$$ 11 -49 9 35 13 70 -29 -5 0 14 16 35 -53 57 38 -48 26 16 38 6 -61 -14 -3 -71 -7 -57 -49 48 36 4 19 8
5920Hj9Q1o5Om0N0mrnj8m3Q6m4M2m2j4N0kPn3J5OLlLM4k7J1o2O5K1o3j5Q2j2m7
$$ 8 -11 70 5 11 -29 21 17 8 3 -15 -58 28 -16 26 -16 -30 20 18 25 -28 -13 -7 -4 -7 -4 40 13 24 -38 27 48 -15 -30 52 40 -7
5956gJ3k1Qk6L1kj6K2Qk0J3M6p7M4l8K4M0j4n3K8Jl3N1%j7KJ6Qj6Lk4P6n2ll1
$$ -7 6 -15 -7 -33 -2 -4 -20 2 10 -10 3 49 -28 16 -22 2 42 28 -25 3 4 -29 22 22 5 7 23 31 15 18 -6 70 18 15 -16
5991a6M8q5P1p7R4m7M3j9j2J3j8kl1Q0l9L0nk6p4M4J2j5O2qj9l2J9Mj6L2p8k5
$$ -16 32 -53 18 -59 35 -12 31 12 0 13 -5 -7 -38 42 3 33 28 2 -72 -28 -16 -31 31 23 4 -28 -9 -5 -21 11 -67 -92
6023i2M8Q0p5M2m3Q1l4j8J9qn0N5NL6m6rmJ7K0r4J16p3N7oL2m9m3L3Mo9K5j3K3
$$ -92 -44 36 -39 3 -40 41 7 -11 8 0 -50 5 10 46 0 -9 -13 4 24 -70 46 -27 30 24 56 7 -36 -3 1 -68 -43 -56 -33
6056c3O1l3J1k8K5J7k9j1L6j1Pj8K2k6K1Pl3j3jK0O7l0k6j2K4o6J8P9J1m0m9N2
$$ -33 28 -5 6 -22 3 20 -9 -20 16 5 12 -6 16 -10 11 18 -15 -28 -29 -9 58 28 2 -10 14 -52 -34 45 56 16 -33 19
6088A9mn8N9n2J8J2l0M5MK6p7M2n0L6O5q8L2p2J02l1l6N2k5J6rp6O0L4p1L3M7
$$ 19 15 -43 16 -36 -18 -6 -36 9 13 39 -38 4 -46 -10 55 -33 -1 -73 29 -2 -38 14 -11 5 -4 -80 -20 14 -57 -24 23
6119B3k7m8O5Nn1J6Rj0JP1p3K9k7LqJ1Rk0J4K8m0j0M2mk6j1Mj5R1j23M3PL0k9
$$ 23 -4 -52 13 18 -33 -17 -8 -18 -17 54 -19 10 -17 -14 -22 -11 -2 -22 -8 20 -20 -30 12 8 -18 -29 -25 -40 51 -72 -29 -22 8 -21
6153b1jJ2J0lN1l9m6J18j07L8k7L1K2Po1J7k6K8oKn2J8P5Oo1mN2m1Mk6KJ3L6m3
$$ -21 -22 -10 0 -3 48 9 -37 81 -26 12 -15 16 38 45 -16 1 -25 3 -3 -1 -53 -35 40 46 -15 -19 33 -8 -4 -30 -28 -15 21 -22
6187b2N4o3M7p1L2j7J4P1j02L6M3k2k5k6O0J2k2J3Ol4Pqj0k9O1OJ8j2m1K3J2K2
$$ -22 32 -31 16 -55 -23 -40 -26 45 -57 -21 22 0 -25 -51 9 21 -1 12 18 -16 -9 -17 -27 -56 5 11 29 17 -24 -1 11 33
6219C3l6J4Kn9M8L0L1n3%l2kM1j1j2O6o9j2L4k3j3kJNK6n3J2l6O8l7JL8m3L4j2
$$ 33 -3 11 13 -46 2 32 63 10 10 -22 -24 17 6 -6 60 -9 -21 13 -10 -23 -25 -24 -19 7 -46 -34 -70 -2 -39 -38 0 -43 -9 -21
6253b1nqpNP0J5o4j7PO1n0k2K8%lN1No0N7Jl9J9rk6L9l1n4O1L3m1k3P4p9j9N7
$$ -21 -26 -34 -41 -36 34 49 -15 -32 -25 36 -14 -36 -8 -8 -11 40 45 -15 42 43 4 23 14 -12 27 -4 -58 3 36 -5 -28 46 -33 -52 5
6288En1M1m0LM7K8%l1N0j0o0k0N9n2L3Jk9K8KL5o2N0Lq4P7k6j2J7k1o2R9n8Q2
$$ 5 -46 -5 -45 -42 5 33 33 2 52 42 -18 -38 21 -31 2 3 -26 2 4 39 -23 27 30 -54 23 -3 -15 2 -19 -81 18 -40 42
6321D2n1M6n2J9%J2l3jJ4J8oqJ6J7o9K3l3O5l5qO2j5p9J11o6j9K2j3Jk4MJ9L5
$$ 42 -9 37 -15 4 4 16 -17 -18 -4 14 8 0 16 33 -36 -13 -46 19 -16 -24 38 23 -56 55 -11 -30 -8 -21 -20 -44 -40 -21 14
6354A4%M4m2Ml5PL0K2p7O3n9M4n1PnN2n1L2J1j9j3P6m9j1M4l5J6l6J2L8o6P8k5
$$ 14 14 58 16 20 -15 -8 22 44 -33 30 -29 15 -36 -29 -34 18 -33 -1 10 -9 -22 54 5 -6 38 3 19 -17 -5 33 -33 45 20
6387B0p0RK9k7O8m3L1j14J17l8m6P4o6L1M4l6O0l5k9J6L4rJ6o3O9l0l0N9l8m9
$$ 20 -50 -41 -12 -39 29 -14 17 -97 20 -18 -64 10 -56 -25 19 -17 43 8 -21 -5 29 20 36 -27 42 12 -18 41 3 -46
6417d6O2J0j4j8J4K0k9RJ1k4k9QK4M3k5p5N7k5kL4J6Ok0n9O6m1N3k9ml9J4J7J2
$$ -46 16 26 12 -6 8 28 -1 8 19 -5 -34 -26 -2 41 16 -59 -2 -27 -29 5 21 27 7 -52 14 -27 26 -3 -7 -46 -32 -15 -3
6450cK4k4J5j4L3q7K1k7L4M9jl7Q2k0Jm4Mk4N7q6M7J4l0J3M1q3K4L1JK3l4k0M0
$$ -3 21 -3 12 -2 31 -56 -35 -62 -28 21 20 -17 65 45 46 2 6 -18 39 -47 0 14 -16 -3 38 -45 -21 10 11 34 0 -20 20
6483B0Lj3k9Q0o8%j5K5P8l3j12N0L0qQJ9n9O0m5k6J8J0J6j9%L0k5o3O8K2k0k6
$$ 20 23 10 -19 61 -7 -7 -22 3 81 48 -64 -14 16 8 16 35 -24 36 -9 -35 -17 -7 9 -10 -10 20 -5 -68 0 22 2 -24
6515b4k4PK0K9k4K0Oj3Kl9LL8K2p7mN8M5q9N4q5N3nL3qk7K3k0K4M7m1lqK1J7o
$$ -24 -48 -41 -21 8 -16 4 10 -3 -1 -40 -37 1 23 -54 -58 0 45 -44 10 -75 -22 -27 6 -2 -29 -6 -26 -2 45 4 1 -7 14 31 25
6550B5l0J6k0N2j6q2M1K0N0l4p8M5N2m5K7j1m3PJ6J1n5N8k6m%J0J4o9J07m6M4
$$ 25 -5 11 -9 43 27 -55 -14 6 56 22 -56 -11 41 -4 23 12 -31 -24 -8 3 -52 6 -20 -24 -24 -14 0 -69 38 -8 36
6581C6n1m1j8P0K3r6O2Rl0P8r7L7N1o2K2m3O3m6P9k6m0M9j3K4J1p2J6J7JJJ2j5
$$ 36 -15 -56 -74 -4 19 -77 -15 -6 -36 42 -55 -18 33 -29 -7 -50 13 -33 46 20 -20 29 16 40 51 -21 -5 12 13 14 26 11
6613A1ol4J7rL7l5N7n5M2QJ3j08P0K9n3j5J4k8K6R3j02mO0m8jK3l7L5k5M3k0L3
$$ 11 5 -29 -12 -21 16 -19 38 -17 25 33 46 -62 8 37 -16 -31 -17 -45 -19 74 -28 -32 28 -20 -21 2 -35 0 -25 18 -2 31
6645C1j4j0l5P7r5O1k0J7o2K9J9J8lQMj8L7o2Nj3k8L6OLN0k4k5k4L2J6m6j0M2
$$ 31 17 7 -28 49 -46 15 -5 12 -50 -21 -2 16 13 21 25 7 44 -18 -13 -26 -54 -18 -12 -9 41 17 -8 -32 0 16 -30 -40 2
6678BNORk4j7N5l4J2n2M1K5l7P6q2Pl9K7L5l9k3M3N%K6Jk4l%noO0%q9PKL1q9R4
$$ 2 7 13 22 -2 -19 36 2 14 -38 3 28 -9 67 -15 -8 -47 -20 15 -24 -47 -4 1 1 27 28 4 1 1 -4 -10 50 50 -39 -32 -30 1 -88 6
6716FQon5RL3j5O3p1k2O8j2K5L7m4p2O8k6k7K9km1P5np6M8M5k8rk1OMJ2Rj5N7
$$ 6 14 8 -47 -38 -5 -20 43 -28 -50 18 6 31 68 24 -48 20 -6 -33 -4 -6 -47 28 23 -53 -5 40 12 3 -18 -12 -8 4 13 -2 55
6751E5m9Rl1K8o4M6Pl0l2R8j7l2j3O5k1J8j28J02K4j1k4J7l1L3pPJ8LOk8qm5R
$$ 55 6 15 -16 12 -52 -6 1 -29 -61 37 20 -12 -25 40 19 37 -91 11 35 24 0 17 -14 19 12 19 37 40 46 18 10 -35 -26
6784b6M6N8r4MK2NJ7l8lJ7oj9okN0l2oM2o6KR8q0K8l8L5L6j2o6L3Jl6N2J2n3J9
$$ -26 20 78 -16 -12 10 15 32 -6 -9 8 2 -17 -23 -25 25 -7 -13 29 -37 -35 63 -17 11 -27 8 44 32 -34 -1 0 -36 16 28 -25 -6
6819fj0l3M5k3L0J8j7k9K8k4N5l8k6O3n7J2J7kj5lN6Om5J5o5J8P%K1J1M1n6k6
$$ -6 -16 -49 -4 -27 3 21 4 -25 3 -21 34 -4 -30 33 -24 -12 5 3 -12 -15 41 47 2 17 -48 -30 -23 -23 -2 9 50 -6 -32
6852c2Q9n9k7R7p4NkM2m4KO8r9qP6o5K9Qm0M6n4j4J06L1p9k4P1j1k9L8l6JrL0
$$ -32 57 -2 -29 68 -6 -1 -3 39 -5 -3 65 -34 -42 34 -31 -2 6 -34 12 -42 -56 50 81 2 -22 49 38 9 47 11 12 3 33
6885C3k8n5M7k3OP0o5J6J9m3L3n6O3K6K2j8p6Nk8Q6k4k5J0j6L0l3Qj8j5K5K9j7
$$ 33 5 -50 -3 -26 -20 50 -15 1 20 -23 10 -46 17 43 65 47 -29 -24 -52 34 10 -15 -5 -21 9 -24 -16 -34 -49 -24 5 -12
6917a2K4m2J8J3lj5oP2l0m3O7J6o3QL2l7k6M4j5qJ07p3q3M7K4k8k4qN1Pk9j8M1
$$ -12 12 -30 -12 1 -2 -17 -23 49 19 -24 43 59 -4 4 36 -1 -27 17 2 -6 101 28 -55 -8 16 -12 -36 -44 7 14 -15 -33 8
6950Hn7M3ll5P9o4R9n6Ppk7j5K7KpK1l5LO4m7J5JKK1k3mk6M2j0k1k4L9M5n9L5
$$ 8 -49 -6 -9 -44 35 -29 70 14 21 14 -13 -28 -1 1 -6 15 -20 -17 47 0 15 16 18 39 16 12 -14 28 18 -3 -27 12 57 -2 33
6985C3m8K1L8o9L3l7NLN9p0L9m8R8j46O0K2n9N9QKj1l1OPj4Q9n7J3K2n5O0l6j
$$ 33 -15 6 44 -25 8 -29 -24 -21 38 -32 7 -41 57 -89 -29 -7 -66 -7 1 3 -8 -39 -33 -26 -40 49 -8 5 27 -28 32 -4 -5
7018eM6m5%k1J2K8K3Lk6K5j5K0l3J8l1oO6j0n6J5Pj8Ll1M9j3%k4K3k7MK9j4M6
$$ -5 41 -4 -4 -25 -13 15 38 41 15 40 25 45 12 30 -1 -7 59 49 -7 8 15 -3 0 -31 18 5 5 -19 4 -23 -19 10 -4 42
7052D2m4QK8Km6k2Pj7O9Onj19L2N8K6k6L7n6nO0l1l6M3rlN6ol4j8N7m3L3o1mL
$$ 42 -2 6 34 36 -10 -32 -25 -42 27 33 28 -91 -59 -1 25 -1 36 -20 -25 35 4 -32 11 2 -1 55 49 15 -3 54 11 44 -17 -21 -18
7087a8k3O2qq0Q8q4Q3K2r7N4rj6L4n0L4K0l1M2K7n2j1J0L8o7N5j5K2K4o7K6lo4
$$ -18 -41 21 13 -67 21 -63 20 42 -55 -1 -10 -26 8 -42 -8 12 -19 23 50 -2 -13 -3 35 -32 23 8 30 54 -13 13 10 -54
7119e4R5m7K4l7L3lRp2N9k0K5k0j7L7j9J5k6j6L9J8o7N2n7N7l7k4qL8K7J4l4O0
$$ -54 41 -6 18 -19 14 11 20 -52 7 -13 12 -8 -25 12 -7 8 -18 -34 5 23 -44 8 -49 8 -29 -53 -61 -23 4 18 -16 44
7151D4m1m5L1L9m5N7K4m7m8N7Nj08L4P8j3k3k1K2J6p0Q1m9N3o6N2q2R7k3j0j8
$$ 44 3 -42 -11 28 -17 40 64 17 -31 26 31 -77 -43 35 22 -1 -22 0 16 -54 27 -22 31 -35 17 -65 32 9 -1 -19
7181a9j9K7Rl0m2Q7k8j1J2k7L5j2K8k0%j9K5%l0P7l1K6m3K0m6J0MK0J9l2j6N0
$$ -19 -38 -11 -2 -32 -74 13 -15 -26 -14 -41 -6 -18 10 -10 -10 -29 -4 -4 -34 43 12 38 -5 15 -31 -21 -17 3 22 -10 -26 24
7213B4Jj7K1r4J20o1k0JMJ3m8O5l7K4qM5o6P8l9Nmj9J0l0NM3k2j9PK0m0l5O4l5
$$ 24 25 8 29 -65 55 -6 -26 -25 -21 -8 -56 9 -28 -4 -12 33 -33 45 6 11 7 -12 -2 -32 -27 16 -6 -25 -18 2 -38 -73 -9 -44
7247d4P1n3K1j3K3L2k5L5m0j7L1K7nr6Q3Qk7K1k7O6l7K3Jo5oO4pj9o1L4l6lJ9
$$ -44 27 -26 -5 -18 5 37 12 47 7 -10 21 48 43 -53 30 38 11 32 5 71 34 57 58 -7 -13 51 44 25 -36 -2 -38 -41 -22
7280b2l4Q7rj8j7n6M5K1J5oj4M0mK3l0j3L5o1K3J2jj0J7k9k0J05j15L9N2Om0M
$$ -22 -56 31 22 4 -13 -69 -24 -3 12 6 -8 32 28 51 21 8 43 -18 5 17 16 6 23 -6 -26 79 -36 3 55 61 21 25
7312B5o5L4k2L0j7M0l0m7L1O0J9o9j0j9K7JlkJ1L2k5M4n8L4M2n6o0Q2j3q7O2K8
$$ 25 -40 -6 -28 2 -15 25 -5 -52 -21 39 58 -11 -21 -40 -13 -12 -15 -17 -6 26 1 45 -13 21 63 7 -53 29 16 -71 -9 19
7344A9m7K4N4o9qL5qjn8R5n4RK5N8n0j9m9L4L0qJrL0l3K9n3K6Rlk7jk5N9j7K3
$$ 19 -28 -4 50 -19 -27 8 0 -1 -59 36 -18 -9 16 74 24 5 -44 -10 20 12 13 4 34 1 30 -23 3 12 9 -18 -19 -44 15 -2 21
7379B1l3L2l5K1k2J7J4K2j02O6M3p6K6j5nLJ7j3M0l0K2on1k5N6J5L4m4j7m3Q7
$$ 21 -12 20 -15 6 -16 1 15 37 -65 1 44 -32 -6 -21 -26 -23 -6 -19 21 -9 13 7 -44 -69 -13 2 36 -8 -25 -68 19
7410A9K2l7L2k1m3J6K6p7JP5o1R0n8K8k8%K0l3N9m0M5n1P6n7ONk9O3j19N5M4n8
$$ 19 41 4 36 15 -28 -12 14 -63 -62 13 -48 42 -16 12 -16 -16 4 -29 30 -10 35 -16 60 3 9 14 -15 48 -71 -16 28 -30
7442c0K0J0o8R1m1N4j5KJ1j0n0Kj3Q4q7K6M3Qj0N3r7P6n2k9MO4o4l4M2K4k6L0
$$ -30 -10 0 -68 23 -18 36 21 23 34 24 -26 -24 -37 47 -40 -14 29 37 27 80 -17 59 7 -22 -18 46 -18 -52 -10 14 -12 18
7474A8k2JrJ7n8M8J9j6L0p5J4L9K8j6j7K5j1k5Qj0K7L8k1q4R2l0n0P8k1j9j8M
$$ 18 -4 -3 -12 5 -53 -5 14 -2 28 -47 -33 6 34 18 1 26 15 -10 -2 -12 15 53 32 -52 40 10 -40 38 17 -2 -20 -16
7506a6k8J5P2L1l1jm7Jk5O2Ql6K1j26J59ko7LoL0n8%k6J7M4K7o0R6o2k4P0l5o9
$$ -16 -44 -29 43 74 43 42 -5 -4 -29 33 41 5 26 -100 59 57 -10 -7 -13 17 -41 -41 -67 -50 -6 21 -39 57 -5 -29 41 6 -63
7539f3O4K7Jj2qj1q7R1L8k9l2jK5JJ6m7NP8o2J0J9K5k3j3o8M4rk5N1K5k5k7J7
$$ -63 1 28 29 17 9 -2 -89 2 40 11 -21 -22 3 4 20 -27 -22 56 -6 4 23 48 25 12 -56 -12 -21 -46 5 30 5 -22 -5
7572eK8m5K4l5P2lj7jo6L6L0p1R0l1M4l9Jqj8M4K5j2k5k9k2Q9o6PL2l2n3O8m4
$$ -5 23 -22 2 -33 39 36 19 18 -48 -12 18 -53 37 6 50 11 12 4 -14 30 55 43 18 -11 -33 56 -10 -3 29 -3 -56 12 -32
7605c2kK9L4n8j1RK1n1N3qL2qJLK1m0k1k8Q1%o3M9o2N0PN3j01K8l1KO4j5L0j5
$$ -32 -34 -5 29 -29 -40 -31 -10 -61 -8 -16 16 8 9 12 33 -7 -28 -56 25 25 -38 11 -51 -1 6 59 -42 -14 -45 -43 21 6 36 21
7639B1k9O0j1k6J2p1N1K5m5M1k3l9L0Rj0k0K6J8j4m0J9L0K1p7J4L1M9jm7m4J4
$$ 21 -8 52 41 15 27 -44 7 32 -13 28 5 -34 -4 5 -5 -25 1 19 5 -35 -16 14 35 -42 -28 3 52 51 4 -40 -26
7670b6PJ6rRL4l0pJ0j5o3P6n5O2K6J8j9J3k8k8L6L9q7L6j6Jmk6P4o1j9L7j9J7
$$ -26 -19 -3 -12 -3 31 1 -6 4 -11 -74 2 -53 9 35 53 34 47 19 -9 27 66 -21 15 -1 0 -4 -30 44 -17 -36 1 -18 -1
7703aNm1PQJ0L6n5M7n1O9lj2j01K7N2J5KPk3jK3o5P8J4on0K5l2k2M1k4K6Ol4M3
$$ -1 4 -37 -30 -22 -12 24 -31 16 -35 34 31 19 -82 -55 -3 12 14 21 -2 -3 20 -45 33 47 41 -9 16 -16 -38 3 -21 5 11 -23 20
7738B0M0n8k1L4J8l7m3Q0q4N7M2j35J46n9kn1LJ1L9o0N3MJ2l0K3k7J1Rk5P%M0
$$ 20 60 2 -19 15 33 -4 -47 33 -51 6 48 -87 59 0 -2 -53 -50 -39 0 -60 -7 -3 9 -21 2 -25 -14 -5 -30 -23 -23 17
7770A7kNj9O9m7j5K3m9j6O4m4m6J03o4N0L6r4L8j7M5l5m5j0L1K2J7j7l0N8o3P
$$ 17 15 20 1 70 23 8 31 -18 -34 30 -14 -60 43 -21 29 65 -29 9 -8 37 2 -43 -53 -22 0 17 0 -30 28 -35 -28
7801b8j1P6o2L1mOL7j08L3K1J1k5K9j1Nj5j9L2L2lk2K2j06J19o3J0K4J5j2oL0
$$ -28 -39 37 -25 6 2 8 45 -63 -30 -9 2 -23 6 -5 0 -15 -34 -2 30 27 5 27 -79 40 -23 -13 11 26 14 8 38
7832C8l1M5n1m6L9Nl1j1L1l7P4k6J0p9L4N2m9O2m1K1p2N2k6L7qKoK1k4L4k9jO4
$$ 38 7 52 1 -45 -6 -1 -32 -43 -12 -49 25 -1 9 -70 -36 16 -33 29 -12 9 -63 -11 -37 0 -8 -6 -12 9 -15 19 -10 -11 53
7865E3q8J0OK7jM5m7P1o9j8R1q9J0L5j0j11N8M0o3J02j8q0K6j0M3m7K3K4rLM8
$$ 53 -35 -25 -19 8 7 52 5 76 7 -11 80 -9 1 36 26 -85 -27 13 -50 52 34 -46 -20 -30 13 -34 -11 13 4 7 55
7896E5q2J3L2j10J10J4k4l1L2PJ0jrk2K8k4J6J8m7L7%K0p0J01o2j4oj6L4J3n6
$$ 55 -27 -14 18 -92 18 32 8 -23 9 16 26 25 16 -6 22 -2 14 32 -15 22 22 42 -28 73 11 -3 -9 -25 9 22 -34
7927c4K9L2q7J23o0l9J5M3m5M0n4J8PO0o0lM5o5M6j2O0q8k9L5KMj6M9kLk6K4K1
$$ -34 -5 27 -60 63 3 -36 -21 22 -23 17 -37 -19 -12 48 -12 -15 30 -35 11 -1 59 -29 -58 -23 -21 -17 -33 16 14 17 -9 15 36
7960C6l6K3qK5m0K6K9l2Jj9K7L2j6k0o0NK3m3pL2N4p3mL4K9nj0m2J7O0nj0o7K8
$$ 36 0 23 15 40 0 26 55 23 24 5 32 64 48 28 -32 -27 -4 -47 -54 -22 32 -41 -45 -11 18 13 3 -39 -22 38 33 23 -44 -16
7994a6M1M9p4l5J3J0qL1q3R0j0L9j4jm0k3N0j6J5m8nM1m5N6J5m7Ql6P3n5l4O8
$$ -16 25 74 0 -35 -22 -12 -20 11 -72 18 8 47 33 32 -8 -31 19 3 18 -30 -35 6 -39 17 32 -15 -7 -43 30 -25 -59 9
8026Io5J26k2m9j5k2K7K3QJ2n8J8K5j6L4n6k1L1j4M6j8p6N0J9j9L5L7Nr2K5J6
$$ 9 -56 70 48 -1 -16 -38 -11 12 20 32 -26 -8 17 1 35 -21 -42 -11 -25 21 3 -73 -23 -4 -23 12 49 54 -38 -13 3
8057CN3o3j5MN9m9J5LRK6p8J9m6Q0l2J1j4R4o9J1J7Qo3j1J1OJ4o0P3p0O7Pq4Q3
$$ 3 56 -7 -22 -18 41 -8 7 10 19 45 -33 -14 -60 20 -12 -1 -15 79 10 21 38 46 -17 -28 -17 -11 3 -57 16 -54 13 20 -64 19
8091A9p7P2K3m8k4K8pN3n6K7J5n1L9Q2j07O9m1k6j1K1oO9oo0k0M8rm1j2LK5J5
$$ 19 -58 14 37 -11 -35 -7 -14 39 -17 10 25 -26 13 95 -12 57 16 -10 -21 0 -6 63 57 -3 -23 25 16 -25 -37 -34 -9 6
8123FJ1N3o7M9o7m0K3%J7k1Lj4j7O7j2k5Q3q6N3k8J1L4k6k3oJ0J8qoK4j5j1j0
$$ 6 17 70 3 52 -15 -55 -32 -32 -15 -36 -33 -47 -64 3 -9 -34 49 -37 16 -12 -1 33 7 -16 -22 -12 6 -2 -8 16 1 -10 -20
8156b0L9K7L0o8k1pK5rO3no4M6N9j00Km6N2K6q2J09n0l3k1R1l3k8j8KJ9rmL7j0
$$ -20 19 46 76 8 -13 -20 5 -4 59 54 -10 36 95 -5 -3 -49 3 29 -53 56 6 -27 -48 43 10 -18 -36 -34 -15 -24 -28 9 -1
8189ak2j7
$$ -1 -23 -40
8191d0
$$ Imaginary data points
##PAGE= N=2
##DATA TABLE= (X++(I..I)), XYDATA
0@%%%%%%%%%%%%%%%%%%%%%%%%%LqJ2j5J6j6J6j6J6j8K2k5K8l1L4l8M0m3M9n4N9
$$ 0 0 0 0 0 0 0 0 0 0 0 0 0 0 0 0 0 0 0 0 0 0 0 0 0 0 3 -5 7 -8 8 -8 8 -8 8 -10 12 -13 15 -16 18 -20 20 -23 26 -28 31
46C1o5P1p8Q6r4J02j13J27j41J58j78K03k33K70l18L81m70N96p84J091j647K837
$$ 31 -34 37 -41 45 -49 53 -60 67 -74 84 -94 109 -124 146 -172 209 -261 335 -449 642 -1005 1832
68A832o247L0749J05585j47036p5214J35932J4024q9535J0776L3760K064K2325
$$ 1832 -4415 26334 131919 -15117 -90331 45601 59625 -29910 -19134 14626 16690 39015
80C9015j9037l9206L5140K6811m3784j6439K7919J8510M035k7635k3538M2279
$$ 39015 19978 -19228 15912 42723 -1061 -17500 10419 28929 32964 5329 -18209 24070
92B4070J5878o1390l01O1575j4472l6194K0468n416j7770K9964j4507m2934N4119
$$ 24070 39948 -21442 -21743 39832 25360 -10834 9634 4218 -13552 16412 1905 -41029 13090
105A3090L9693p5628j7298P0275j6838n4949K9100K5161j9122N793j833k1518
$$ 13090 52783 -22845 -40143 30132 13294 -41655 -12555 12606 -6516 -723 -2556 -24074
117b4074K1085J2588l5065M349L7341r488k1478P266M931k256o155n996K0119
$$ -24074 -2989 9599 -25466 -21117 16224 6736 -14742 -7476 -2545 -4801 -10956 -16952 3167
130C167J1592k7532N114L2504k9947k7630M6262Q873m5639J9462L5912l5511j7198
$$ 3167 14759 -12773 -7659 24845 -5102 -32732 13530 22403 -23236 -3774 32138 -3373 -20571
143b0571L2840n692k0286K1036R302j6441L825M201j1975J684M068n941P918P239
$$ -20571 12269 6577 -13709 7327 16629 188 4013 8214 -3761 -2077 1991 -3950 3968 11207
157A1207j1006m10O401r582k407Q853l304J325P755j1548m864J3708j0826j3147
$$ 11207 201 -209 6192 -3390 -5797 3056 -248 1077 8832 -2716 -7580 6128 -4698 -17845
171a7845K3769O318k3909J0399J7755k4095q844K2854m995j3730J5412N726j2742
$$ -17845 5924 12242 -11667 -1268 16487 -7608 -16452 6402 1407 -12323 3089 8815 -3927
184c927J660K502n465M682J954m554Q148L673j1992q64N794m786J318M927m652
$$ -3927 -2267 235 -5230 -548 1406 -3148 5000 8673 -3319 -4183 1611 -3175 -1857 3070 -1582
199a582N798Q582j5750p763J8521j128j7594R749J3563j0516m880M707n543Q78
$$ -1582 4216 12798 -2952 -10715 7806 6678 -10916 -1167 12396 1880 -3000 1707 -3836 -2958
213b958Q316o971l478J3722l16j4643O0P003j106k157j477K893R061m564j4139
$$ -2958 5358 -1613 -5091 8631 8315 -6328 -6268 735 -371 -2528 -4005 -1112 7949 3385 -10754
228a0754O336J1128j0060m893J1607R42n834J096l958k324R115j304q469R548
$$ -10754 -4418 6710 -3350 -8243 3364 4306 -1528 -432 -4390 -6714 2401 1097 -7372 2176
242B176P986j1775m331P609k591l161N696l60k025N679j331q401J823O532j206
$$ 2176 10162 -1613 -5944 1665 -926 -4087 1609 1249 -776 4903 3572 -4829 -3006 3526 2320
257B320l241J863M230K81p535m068Q212K849q622J962J0610l708q719L241L022
$$ 2320 -921 942 5172 5453 -2082 -6150 2062 4911 -3711 -1749 8861 5153 -3566 -325 2697
272B697m201J44K978k15J234l18n134O09M038l278j506O284J256n864l31K833
$$ 2697 -1504 -1360 1618 1403 2637 2319 -2815 -2206 1832 -1446 -2952 3332 4588 -1276 -1607 1226
288A226l076l182L771L814k179k038K962R74n690j775O504J117n793K111N840
$$ 1226 -1850 -5032 -1261 2553 374 -1664 1298 2272 -3418 -5193 1311 2428 -3365 -1254 4586
303D586m230o024L315L883k642j144L736J828k121k735q81J904Q99k234M44M570
$$ 4586 356 -5668 -2353 1530 -1112 -2256 1480 3308 1187 -1548 -2429 -525 374 -1860 -1416 3154
319C154L40n522r03N022j207n056L991N848m435m546M355J252o037J9O361K41
$$ 3154 3494 -2028 -2931 2091 884 -4172 -181 5667 1232 -3314 1041 2293 -3744 -3725 2636 2877
335B877l825J224K580k283l792Q64L919l56k922K056K799l225l276K097K159r40
$$ 2877 -948 276 2856 573 -3219 -2355 1564 1208 -1714 342 3141 -84 -3360 -1263 896 -44
351d4l30J245J208m08l869j477M602L48m833L199N955m650n106M737K075n369
$$ -44 -374 871 2079 1671 -2198 -3675 927 1275 -3558 -359 5596 946 -4160 577 2652 -2717
367b717K65N416k04l437l5J394m30k088J67L797R36l271J83K604k473l030K297
$$ -2717 -2452 2964 2760 -677 -712 682 252 -1836 -1669 2128 3064 -207 -24 2580 107 -2923 -626
384f26K297r30m09M56P36k65l029m66M590l34m253L123L323n428k562M616J45
$$ -626 1671 741 332 788 1524 1259 -1770 -2236 2354 2020 -2233 890 4213 -1215 -3777 839 984
401I84l321K227K695j536j553o22M59Q89k098n63M741k23n361J845L787m216k187
$$ 984 -2337 -110 2585 1049 -504 -1126 -667 222 -1876 -2439 2302 2079 -3282 -1437 2350 -1866 -4053
418d053M815Q74k573Q03L1j051P28j525j048M296N40m173K382K863m911j282N095
$$ -4053 762 1636 -937 -134 -103 -1154 -426 -1951 -2999 1297 1837 -2336 46 2909 -2002 -3284 1811
435A811j133k985L430J461l075m10P11j13J524j040j120M008O13n965P16M957
$$ 1811 678 -2307 1123 2584 -491 -901 -190 -303 1221 181 -939 3069 3682 -2283 -1567 3390
451C390k911l028M034J529k211J01o25o47J779p99j669K990O10l238J136R69l813
$$ 3390 479 -2549 1485 3014 803 904 279 -368 1411 612 -1057 1933 2543 -695 441 1410 -2403
468b403J243M085l042k244M543N23m469o98J990J197l29k790M58N173j763o988
$$ -2403 -1160 2925 -117 -2361 2182 2705 -1764 -2462 -472 725 396 -2394 -1936 3237 1474 -5514
484e514K933O083m000l540M334J756k353j123q61R53K641j968j962M149Q18m245
$$ -5514 -2581 3502 -498 -4038 296 2052 -301 -1424 -2285 -1332 1309 -659 -2621 1528 2346 -1899
500a899J180J913l209J252L832l341j877M616k61m615Q50K828M18o83j846Q17
$$ -1899 -719 1194 -2015 -763 3069 -272 -2149 2467 2206 -2409 -1559 1269 1687 1004 -842 -25
516b5L656k732n207M246M154m953j238M950j070l463J544P32j602Q88R13n41R5
$$ -25 3631 899 -4308 -62 4092 -861 -2099 2851 1781 -1682 -138 594 -1008 -120 793 252 347
533C47r73o16J751r42k335L010K391l493j194K689m94j611L97K56J155J324k562
$$ 347 -626 -1242 509 -433 -2768 242 2633 -860 -2054 635 141 -1470 -1073 -817 338 1662 -900
550i00j058L559n12l615K133K699j797k12N89j347J023Q74k536R96L252k063j353
$$ -900 -1958 1601 1089 -2526 -393 2306 509 297 886 -461 562 1436 -1100 -104 3148 1085 -268
567b68K602j824j654L947j135m198M096L130n361j430L732n5j778l45j59K616
$$ -268 2334 510 -1144 2803 1668 -2530 1566 4696 -665 -2095 1637 1582 -196 -541 -700 1916
583A916O86n280J48N765l554m711N912J834o199J318M259l651k195L123M10j206
$$ 1916 2602 -2678 -2530 3235 -319 -5030 882 2716 -3483 -2165 2094 -1557 -3752 -629 -219 -1425
599a425J75q61J295J487l951q58N712j037m754L875K798m817k11L863j871j309
$$ -1425 -1250 -2111 -816 671 -3280 -4138 1574 537 -4217 -342 2456 -2361 -2572 1291 -580 -1889
615a889K792k65r75J284q43m93K009j423p92M006j052m050L450K423n097l39M981
$$ -1889 903 638 -337 947 104 -389 1620 197 -595 3411 2359 -1691 1759 4182 -915 -1254 3727
632C727p70k690R76L20P47L21l678kN388j420n031K317L019k678j498P03J22J603
$$ 3727 2957 267 1243 1563 2310 2631 -1047 -1049 4339 2919 -2112 205 3224 546 -952 -249 -127 1476
650A476k75l219J271K490l211j214L041j017j512K796o51l232J756K046k213r60
$$ 1476 1201 -2018 -747 1743 -1468 -2682 359 -658 -2170 626 -25 -3257 -1501 545 -1668 -2628
666b628J542R13l7j757j017L140O09m462J300N273k693l878L786J788l530j02
$$ -2628 -1086 -173 -210 -1967 -2984 156 765 -3697 -2397 2876 183 -3695 91 1879 -1651 -1753
682a753K270J62l3n76n94J870j12k657J972K102l129N07L635l220k641M512N04
$$ -1753 517 679 646 70 -524 1346 1234 -1423 549 2651 -478 29 3664 444 -2197 2315 2819
699B819m021J223K267r84R5j282j551L611O03n338J520N215l600l196L732l3k641
$$ 2819 -1202 21 2288 1304 1399 117 -1434 2177 2780 -2558 -1038 4177 577 -2619 1113 1080 -1561
716a561K132P3j996K105K00l154J737J524l307J268K981l370p76L911j969k881
$$ -1561 571 644 -1352 753 953 -2201 -464 1060 -2247 -979 2002 -1368 -2144 1767 -202 -3083
732c083L564N83l252J791J615k367P20P16k045J904J573l749J005M499l657l160
$$ -3083 481 1064 -2188 -397 1218 -1149 -429 287 -1758 146 1719 -2030 -1025 3474 -183 -3343
748c343M790O50m083J731K041j974O29L56k037J760J285l174J131L049l293j177
$$ -3343 1447 2097 -1986 -255 1786 -188 441 797 -1240 520 1805 -1369 -238 2811 -482 -1659
764a659L831j617k843L188P55k771J309R40j969Q68N86k107J437J623k860K94
$$ -1659 2172 555 -2288 900 1655 -1116 193 1133 -836 32 618 -1489 -52 1571 -1289 -995
780i95K971k779j739L903n05l229K367J548k577K47R25j123R05P58k304J390K280
$$ -995 1976 -803 -2542 1361 856 -2373 -6 1542 -1035 -788 137 -986 -81 677 -1627 -237 2043
797B043l161q33L734j519k568L255N85l066J581J388k343N73J392j618P07J508
$$ 2043 -1118 -1951 1783 264 -2304 951 1536 -1530 51 1439 -904 -331 1061 -557 150 1658
813A658k377J61K683k376j537L579l79k916K146J354k613L83J229j165M60P54
$$ 1658 -719 -558 2125 -251 -1788 1791 1412 -1504 642 1996 -617 -234 995 -170 290 1044
829A044j635P79J614k568n18L006j272k141K524N21k430Q16J135j635K04J048
$$ 1044 -591 188 1802 -766 -1284 1722 450 -1691 833 1354 -1076 -260 875 -760 -556 492
845D92j015K96Q97j585J66J744j820q28K739o05k281J855R68k218J74J300o03
$$ 492 -523 -227 670 -915 -749 995 -825 -1653 1086 481 -1800 55 1023 -1195 -1021 279 -324
862c24O0L08q64J003O45k387N85K653j977j649K988J87k753J012J488j430l2J075
$$ -324 -264 44 -820 183 828 -1559 -974 1679 -298 -1947 1041 1228 -1525 -513 975 -455 -487 588
880E88o79L26N35j439L46J520j598o12K430o16j999J542R45j885J65J323o43k70
$$ 588 -91 235 770 -669 -323 1197 -401 -1013 1417 801 -1198 344 1289 -596 -431 892 249 -21
898b1M26m89K85M94j388K04J949j225j396J919M27k195L61J673r16p67R88O1l77
$$ -21 405 -84 201 695 -693 -489 1460 235 -1161 758 1185 -1010 -649 1024 108 -659 329 390 13
917A3K2n25M96P06j070k99J600l08j721P19J290j171n57J093L47p33l17K47N37
$$ 13 35 -490 6 712 -358 -657 943 635 -1086 -367 923 -248 -805 288 635 -98 -415 -168 369
936C69k77q72O22J075j007q62J258L10j441J92J227l61r03M78O53m07o64J51P54
$$ 369 92 -780 -158 917 -90 -952 306 616 -825 -633 594 233 -670 -192 461 54 -610 -459 295
955B95m0r15K92R94m59j102O39Q98q80l80Q14K87p07j29L89J45l39j95M32M07
$$ 295 255 -660 -368 626 167 -935 -296 602 -278 -658 156 443 -264 -393 -4 141 -198 -393 39 446
975D46n02l59O67K58r59K4J121j56j102M77R58o26q20N68P57l68n82J71P50j20
$$ 446 -56 -415 252 510 -449 -425 696 540 -562 -85 873 247 -573 -5 752 384 -198 -27 723 603
995F03j062K46J149m08j008P17Q42j050n56R57R1p85K20N31k48m03m5L54K23o67
$$ 603 -459 -213 936 528 -480 237 1079 29 -527 430 521 -264 -44 487 239 -164 -209 145 368 -299
1015b99j37R56p8j302M68J082q51r34J029N80r47k01N68J74m62l10L58O50n04
$$ -299 -436 520 442 -860 -392 690 -161 -1095 -66 514 -433 -634 -66 108 -354 -664 -306 344 -160
1034a60o24R20K75j313K24J254o41q05R05M58o80k61K91L36J25o39k05J290L0
$$ -160 -784 136 411 -902 -678 576 -65 -870 35 493 -187 -448 -157 179 304 -335 -540 750 780
1053G80j573L67J414p04q49P99K59k89j0k56K4O80m87n72Q65J61r30M56M75j110
$$ 780 -793 -426 988 284 -565 234 493 204 194 -62 -38 642 155 -417 448 609 -321 135 610 -500
1073e00K85J124j080o03J352j42j123M27M22j93K03m03m43J271R6j898O11J782
$$ -500 -215 909 -171 -774 578 436 -687 -260 162 -31 172 -231 -674 597 693 -1205 -594 1188
1091A188j239j097J465L24r73O4K28J3N20p09l36J332k88j425J070J024j711p0
$$ 1188 -51 -1148 317 641 -332 -268 -40 -27 493 -216 -552 780 492 -933 137 1161 -550 -620
1109f20J804q08j028J158R0q21K79K06k40M77k84o96J015R2j396P32J094j476
$$ -620 1184 376 -652 506 596 -225 54 260 20 497 213 -483 532 624 -772 -40 1054 -422
1127d22k94J586p06j098J101J41j012M68L59m89M64l12q43J283K88k018P74J983
$$ -422 -716 870 164 -934 167 308 -704 -236 123 -366 98 -214 -1057 226 514 -1504 -730 1253
1145A253j794j069J935M7j398O53M61n89O75k07r60J158N57j594L36J509r79m79
$$ 1253 -541 -1610 325 372 -1026 -373 88 -501 174 -33 -993 165 722 -872 -536 973 -6 -485
1163d85J000l95m37Q21k83m32R06k79p04R49N0j273R97P25j424J87J377j058q23
$$ -485 515 120 -317 504 221 -211 695 416 -288 661 711 -562 435 1160 -264 -77 1300 242 -581
1182e81J432r0j148N28M44l59M5m01q4J058o58j233J382Q43j961M6J478p24q29
$$ -581 851 761 -387 141 585 226 271 -130 -214 844 186 -1047 335 1178 -783 -737 741 17 -812
1201h12P92q9k68M75o42o5J236j075j036J952J41k126J009J431j687j85J377o85
$$ -812 -20 -109 -377 98 -544 -609 627 -448 -1484 468 609 -1517 -508 923 -764 -949 428 -257
1219b57n03J187o25o46J292m01q60J080j41j005J289K99j787Q70J425j647l32
$$ -257 -760 427 -198 -844 448 47 -813 267 126 -879 410 709 -1078 -208 1217 -430 -762
1236g62J602n95o51J094n33o94J503o10j325J762L54k110R05J690j978m78J949
$$ -762 840 245 -406 688 155 -539 964 354 -971 791 1145 -965 -60 1630 -348 -826 1123
1253A123o71j050J072j88n54R78o65q22J551j00j682J213Q16j810L81J363j332
$$ 1123 452 -598 474 286 -268 710 45 -777 774 674 -1008 205 1021 -789 -408 955 -377
1270c77m35J599o28q38J041k68p27J061m29j033J489J89j805Q57J279j642l6J572
$$ -377 -812 787 159 -679 362 94 -633 428 -1 -1034 455 644 -1161 -304 975 -667 -703 869
1288H69j006p35J290j16q94O77p0m80R87l30j164J350N37j862M95J455j172l91
$$ 869 -137 -872 418 302 -592 85 15 -465 522 192 -972 378 915 -947 -452 1003 -169 -560
1306e60J169n90n50J092m87o54J108k87r93J244J67j681R57J135j544k06J404
$$ -560 609 19 -531 561 74 -580 528 241 -752 492 659 -1022 -65 1070 -474 -680 724
1323G24o31o25Q23l23l87P15l97l41Q68l23q38J122J04j404P24J041j217l33J186
$$ 724 93 -532 291 -32 -419 296 -101 -442 426 103 -735 387 491 -913 -189 852 -365 -698 488
1342D88l70n63O50k81j86O94m61m69R77j72j000R16N08j247K70J017p98l93Q10
$$ 488 118 -445 205 -76 -262 432 -29 -498 479 307 -693 223 731 -516 -246 771 -27 -420 390
1361C90l08j36M45m72j39Q70m97p97J110oj126Q15O40j222K78Q68p77k49P76m03
$$ 390 82 -54 391 -81 -220 650 153 -644 466 460 -666 149 789 -433 -155 713 -64 -313 463 60
1381F0k80O58n24m71J268m30j205J174M58j361M14Q45q11j90O49m18j79O41n30
$$ 60 -220 438 -86 -557 711 281 -924 250 708 -653 -239 606 -205 -395 254 -164 -343 298 -232
1400b32q8Q42p02o31J260j23j272Q68P02j167O2R11o41l28Q11l88k22N74l49l00
$$ -232 -320 522 -180 -811 449 326 -946 -78 624 -543 -481 430 -211 -539 272 -116 -338 236 -113 -413
1420d13Q44m21o97J032J98j158M98P73q84q8P04l78j53N18m08q7O18n48l22R99
$$ -413 431 10 -687 345 543 -615 -117 656 -228 -316 388 10 -143 375 -33 -120 498 -50 -372 627
1440F27l13q83Q55M35j073K50P07n89j86N77l87r8N36m70j60P04m48o28R31Q0
$$ 627 314 -569 286 721 -352 -102 605 16 -170 407 20 -78 458 -12 -172 532 84 -544 387 467
1460D67r40L95N89o83r9O06l97r1L47l68o1N22m66l21Q85j77q49O75L70r02J54
$$ 467 -473 -78 511 -172 -271 335 -62 -153 194 -174 -235 287 -179 -500 385 208 -641 34 404 -498 -344
1481c44P25m98k79M97q3j93K76k51j17M97l75l49P18K8p79L64M72n39o6M39j49
$$ -344 381 -117 -396 101 18 -175 101 -150 -267 230 -145 -494 224 252 -527 -163 309 -230 -296 143 -6
1502fj59J72j62J05L06m34o1N67k56m99N98J41o31K09M84m07j01L72j69p0J43
$$ -6 -165 7 -155 -50 256 -178 -239 328 72 -427 171 312 -319 -110 374 -33 -134 238 69 -1 142
1523A42j70L1L42l03k65O36p6n97L47M46n99l2M21j17k38K03j03K3J73l32l0M27
$$ 142 -28 3 345 42 -223 413 337 -260 87 533 -66 -98 323 206 -32 171 68 91 264 -68 -98 329
1545C29r8n13L75K23n01k4N78l78l32M00J22l22l8J41P3j7r1j25K32J7l59J07
$$ 329 231 -282 93 316 -185 -209 369 -9 -341 59 181 -141 -179 -38 35 18 -73 -198 34 51 -308 -201
1567b01L11k43j59K14K14l30PJ46k4r5l5J43Q4p5j85J78J28j69j67L43J48m06
$$ -201 110 -133 -292 -78 136 -194 -187 -41 -65 -160 -195 -52 32 -43 -228 -50 78 -91 -258 85 233 -173
1589a73J1L95j09l40K23J63j35j02J34pR2j44q2K44K5k87J31K28l20j06L85k5
$$ -173 -162 233 124 -216 7 170 35 -67 67 60 152 8 -74 170 195 -92 39 267 -53 -159 226 201
1611B01l61J52K57k41j8O1M3L8j91j12L06J34n39Q8N04j95n43M27K43l85M8J79
$$ 201 -160 -8 249 8 -10 51 94 132 -59 -171 135 269 -270 -182 322 127 -416 11 254 -131 -83 96
1633I6j10J01j12j58K36J80m48L3N51l87l53N83m3m70K97K48m51M5L86l76N7L18
$$ 96 -14 87 -25 -183 53 233 -215 -182 369 -18 -371 212 169 -301 -4 244 -207 -162 224 -152 -95 223
1655B23k74j13M74l83k17N85j91m54M96K57p10K12L90m08j05L61j47j14K73k77
$$ 223 -51 -164 310 -73 -290 295 104 -350 146 403 -307 -95 295 -113 -218 143 -4 -118 155 -122
1675a22j19N78l71m74O57J68p05K59M72m82j50M31j82j00L18l03j09N76l34m67
$$ -122 -241 337 -34 -508 149 317 -388 -129 343 -139 -289 142 -40 -140 178 -125 -234 342 8 -459
1695d59O05O4n11K87K42m72J64K71l86R4L09k93p0M96l85r5N15l57k59O29j27
$$ -459 146 210 -301 -14 228 -244 -80 191 -195 -101 208 -85 -155 341 -44 -139 376 19 -240 389 262
1716B62o49N26L50o76j4O02l09j78L22k97M2M31n81q7Q03l51o56P23K03q16K68
$$ 262 -387 139 489 -187 -201 401 92 -86 236 -61 -19 412 -169 -256 547 196 -460 263 466 -350 -82
1737h2M66n03M2L38m25L8M97n44k09P88l98n78P55N4p69N00L62p78K20N51o22
$$ -82 384 -119 -77 261 -164 -126 371 -173 -382 406 8 -570 185 239 -530 -30 332 -446 -226 325 -297
1758b97l8O03m05k70N83k33l69O64k14n95P06J59q06M43M57o69O7N40m87l2N24
$$ -297 -335 268 -137 -407 176 -57 -426 238 24 -571 135 294 -512 -69 388 -281 -214 326 -161 -193 331
1779C31n00j46Q33m70o34R63O3j047O17N24p66L3O03n49Q5M76n14j17O51l97m09
$$ 331 -169 -315 518 48 -586 377 440 -607 10 534 -232 -199 404 -145 -60 416 -98 -215 436 39 -370
1800c70P69k06o12O95J95q72L54O12p82J8P10n88j11O69m71l66P30k77m86P39
$$ -370 399 193 -419 276 471 -401 -47 565 -217 -199 511 -77 -188 481 10 -356 374 97 -389 350
1820C50n2q18O52M02r88K84O91n96k36N94l73k05O12l72l29O95j78o07N76J47
$$ 350 298 -520 132 534 -454 -170 521 -75 -311 283 -90 -295 317 -55 -384 311 133 -474 102 249
1840B49o89M08L55o45J01M99m69n1M71m08j38O30l10n17O84P1p45M84K90n70K04
$$ 249 -440 -32 323 -322 -221 278 -191 -242 229 -179 -317 313 3 -514 170 241 -504 -20 270 -300 -96
1861i6L86m58k0M36l20p1L78l91n4O58l93m69P51jp21N29K11o13K29L95m91kN55
$$ -96 290 -168 -188 248 -72 -143 235 -156 -210 448 55 -414 337 336 -385 144 355 -258 -29 366 -125 -127 428
1884D28m95q0N39m12l22P84k79o20O99K25p48K41M66n19J02L12m53K6M66m37j28
$$ 428 -67 -147 392 -20 -342 442 163 -457 242 467 -281 -40 426 -93 9 321 -132 -106 360 -77 -205
1905b05N85l77l57O73j01o05M81K68o72K25M77n81J04M67n76n4N71l32l69N63
$$ -205 380 3 -354 319 218 -387 94 362 -310 -85 392 -189 -85 382 -194 -248 323 -9 -378 185
1925A85q7m98N21J30n76K89L00n12O6L36l90P8L86n23lO88m47l39O28k17m45N71
$$ 185 98 -400 121 251 -325 -36 264 -248 -182 154 -236 -158 228 -295 -298 390 -57 -396 232 15 -430 141
1947A41N5n67L01L97n61R0M75n14L4M74m81j35O32k33n27N68P0m84L23K25m96
$$ 141 196 -371 -70 327 -234 -144 331 -183 -149 325 -156 -291 341 108 -419 149 219 -265 58 283 -213
1968b13J70L63l68q0M31l72q5N25l75k76O29j52n04L75K51n89K96K97m86J08L65
$$ -213 -43 320 -48 -128 303 -69 -154 371 -4 -280 349 197 -307 68 319 -270 26 323 -163 -55 310
1989C10l44j11M58k63k23L86q9l75M33N6m70K25K27l92J25K32l61J08K32k71m1
$$ 310 -34 -145 313 50 -173 213 124 -251 182 238 -232 -7 220 -172 -47 185 -176 -68 164 -107 -148
2010a48L89l22j59M42j02m26M36%l14J40K20l16P3J81k93P6K72l15KL30k15k33
$$ -148 241 -81 -240 202 100 -326 110 110 -204 -64 156 -160 -87 94 -199 -123 149 -166 -164 166 -49 -282
2032b82M08o3k93K72M6l45J92J45l04J75J74k75M7K61l33j5M09j96k98L97M8l29
$$ -282 126 63 -230 42 88 -257 -65 80 -224 -49 125 -150 -103 158 -175 -190 219 23 -275 122 170 -159
2054a59K59J11k52mK11k43R1K02k63M3K70k35j51L07o0k77K52P6l06K05P3j94
$$ -159 100 211 -41 -45 166 -77 14 216 -47 -4 266 31 -120 187 127 -150 102 178 -128 77 150 -44
2076d4R5J01j82j1K07k49L0J59r4l3J35n7j09R6rj10Q9M8j65J04M6j64N5J53j85
$$ -44 51 152 -30 -41 166 -83 -53 106 12 -21 114 57 -52 44 35 -75 14 62 -103 1 47 -117 -62 91 -94
2101i4nJ82j09j13J74jr6J03k0j40J30K9k13J85N5k75Q5K20j15j02K26o4j97J04
$$ -94 -99 83 -26 -139 35 34 -62 41 21 -119 11 40 -173 12 67 -208 -123 97 -18 -120 106 42 -155 -51
2125e1J8q4J56o9o7J72k3j94J28J99k69m0K53j48m8J01K8r3P0k9m5J06Qr5Q0j7
$$ -51 -33 -117 39 -30 -97 75 52 -142 -14 185 -84 -124 129 -19 -67 34 62 -31 39 10 -35 71 79 -16 64 47
2151D7j47J00Q8j67R9J15j46k3N1K3q2J05j17M3N7l9n5R2L8j06L1J10j32N7Om1
$$ 47 -100 0 88 -79 20 135 -11 -34 17 40 -42 63 -54 -11 46 7 -48 44 82 -24 7 117 -15 42 48 7
2177Gj3O7p1J3J06j49j18K21M2j63K1J64k03L1P0m4j1Q4n5m1J20j00n8J05j5o5
$$ 7 -6 61 -10 3 109 -40 -158 63 105 -58 -37 127 -76 -45 25 -19 -30 54 -1 -42 78 -22 -80 25 10 -55
2203e5Q0pj30J16J05j92l1J47K0j35N8M4j6k0q8P6Q0j22o9R1J06q3o7Q6rkk5J2
$$ -55 25 18 -112 4 109 -83 -114 33 53 -82 -24 20 4 -16 -104 -28 52 -70 -139 -48 58 -25 -92 -6 -15 -17 -42 -30
2231c0N9J8j25J8R3p8K7P4l7l0nK4KJ9J6j9Mk6K6k4O1L2qm0n2kJ54j17n6R0k9
$$ -30 29 47 -78 -60 33 -45 -18 56 19 -11 -16 8 10 29 45 26 30 4 30 6 67 99 91 51 -1 -3 151 34 -22 68 39
2262C9m6P1p6Q3j1m2JO6K5j35N1O8o4k4j7J8K8n2o3J46K5j66O8Q1j37L5L5k6o5
$$ 39 -7 64 -12 71 60 18 19 85 110 -25 26 94 30 6 -11 7 35 -17 -80 66 91 -75 -7 74 -63 -28 7 -19 -84
2291h4J48o7j24J75qj56J00J01j89J11K6j28L1J54j69o7K62j00j71K51n1j34P8
$$ -84 64 -3 -127 48 40 -116 -16 85 -104 7 33 -95 -64 90 -79 -146 116 16 -155 96 45 -89 -11
2314a1Rr9J30jk44J38J79j54j26L15o6k15J77M5j49J09Qj41J37K7j57R8J54j50
$$ -11 -2 -101 29 28 -216 -78 101 -53 -179 136 70 -145 32 77 -72 37 45 -96 41 68 -89 9 163 13
2338A3q1J68p1m5P4K5q9J11k7j67J46N6j63N4J28j68Q2O3j37pK11j61p2J53k5
$$ 13 -68 100 29 -16 58 83 -6 105 78 -89 57 113 -50 4 132 -36 46 109 -28 -35 176 15 -57 96 71
2363G1j47J51o0o0J04Pj73J85N3k60R5J98k88m3K84j42r9K56j84j13K56j11k09
$$ 71 -76 75 15 -45 59 66 -107 78 131 -129 -34 164 -124 -167 117 -25 -124 132 -52 -165 91 -20 -229
2386b29K78K5k48P2K25k37oK34k55J4K15j10k10L58r6k20J85Q6k91J58J83k78
$$ -229 49 74 -174 -102 123 -114 -120 114 -141 -127 88 -22 -232 126 30 -190 -5 81 -210 -52 131 -147
2408a47Q0K56k84k4K61j81p6K74o8k44K07N6k81K57Q7l33K04J80k85rL47k93j11
$$ -147 -67 189 -95 -119 142 -39 -115 159 91 -153 54 110 -171 86 173 -160 44 224 -61 -70 277 -16 -127
2431a27M05k00j79K81n8k66L25k0l04K15J32l47R9L36m12J0K74j55r9L39j97l07
$$ -127 278 78 -101 180 122 -144 181 161 -143 72 204 -143 -44 292 -120 -110 164 9 -90 249 52 -255
2453b55M19n7l07J98J81l86J61J91l10J1L41l01j04M44k36j55K41K1m06M02ql26
$$ -255 164 107 -200 -2 179 -207 -46 145 -165 -154 187 -114 -218 226 -10 -165 76 97 -309 93 85 -241
2475b41J94K56m12L8L95m32M0L71j80k96L91n5l25L52N6l70K59J65l80J38K52
$$ -241 -47 209 -203 -165 230 -202 -162 209 29 -267 124 69 -256 96 152 -218 41 206 -174 -36 216
2496B16l51L7K50j79j48L54j51k51K95J4k84K91Pl53L31J18l22Q5K53l10j6K65
$$ 216 -135 -98 152 -27 -175 179 28 -223 72 86 -198 93 100 -253 78 196 -126 -41 212 -98 -114 151
2518A51j86l0K29q5k58K87j1k31K45P0k92K33J32l94M3K76j91j37L68k14j73L12
$$ 151 -35 -65 164 79 -179 108 97 -134 111 181 -111 122 254 -140 -97 179 -12 -149 219 5 -168 144
2540A44r0k59L06J1k34J14J39l58J95K17l35O4K33k18p9L02j45k02L10l9l07K70
$$ 144 54 -205 101 112 -122 -8 131 -227 -32 185 -150 -86 147 -71 -150 152 7 -195 115 76 -231 39
2562C9Q4k87J35J62k68L2K46k07p2K92j13k08L29j56k08K64Rk55K16J14l53J53
$$ 39 123 -164 -29 133 -135 -103 143 -64 -136 156 43 -165 164 8 -200 64 73 -182 34 148 -205 -52
2584e2J70k34L5K70j49j85K70j47j12K13Ok39J89L4k45J97J18k54j9L16k60mK77
$$ -52 118 -116 -81 189 40 -145 125 -22 -134 79 85 -154 35 69 -176 21 139 -115 -134 182 -78 -82 195
2607A95j54k17L28j52j71K89l7k95K65J10l11K05J58k73n6L76k69j2J93o0k14
$$ 195 41 -176 152 0 -171 118 81 -214 51 161 -150 55 213 -60 -116 260 -9 -21 172 112 -102
2628a02K08O9k97K20J12l79K10J30k10l9K43j64j33K50r1j07J63%j88J12Q9k01
$$ -102 106 175 -122 98 210 -169 41 171 -39 -78 165 1 -132 118 27 -80 83 83 -105 7 96 -105
2650a05J15J32k64N8J55j98j7K57j86j00K09m7j33J43lj88J66J25k41P0J42j22
$$ -105 10 142 -122 -64 91 -107 -124 133 -53 -153 56 9 -124 19 16 -172 -6 119 -122 -52 90 -32
2672c2n8J90j81l3J81q0q3J86p3j14J35R0k55J03J61k43O3J03n4l4J66k19K9J41
$$ -32 -90 100 -81 -114 67 -13 -96 90 17 -97 38 128 -127 -24 137 -106 -43 60 6 -28 138 -81 -52 89
2696H9m4j19J48M9j40O4J00k40R9J20j38K1J63j46j02K24l1j78J33J3j55J11O
$$ 89 45 -74 74 123 -17 47 147 -93 6 126 -12 9 172 26 -76 148 117 -61 72 85 -70 41 47
2719D7j23J22P0j42K1J07n9j17J27Qj21R2J8j41P0J46k07N1J08j52L2N8p8L1Q3
$$ 47 -76 46 116 -26 -5 102 43 -74 53 61 -60 32 50 -91 -21 125 -82 -31 77 -75 -43 15 -63 -32 51
2744E1j19N2M3k6j12O5Q5j10m5J40r7L3M1m3K6M3l8j2J13j06m4L0O0q1P7L3p0
$$ 51 -68 -16 27 1 -111 -46 39 -71 -116 24 -73 -40 1 -42 -16 27 -11 -23 90 -16 -60 -30 30 -51 26 59 -11
2771a1k0R8j09LQ5n6j2M5L7q0l6J00n2J0M6j3m8Q9j28K9O6Mo1P4pn9K9L2m9oJ14
$$ -11 -31 67 -42 -39 46 -10 -22 23 60 -20 -56 44 -8 2 48 35 -13 76 -52 -23 43 47 -14 60 53 -6 23 55 6 0 114
2802A14j24j6R8k4q8O4J19j28O1n4J7m9Q5j07k6J55n8p1J09lj37P9K8j39J08M9
$$ 114 -10 -26 72 48 -40 24 143 15 76 22 39 -10 75 -32 -58 97 39 -32 77 74 -63 16 44 -95 13 62
2828F2j33K9J14j14k3R3m6o1N0j7j03J41N0j57J41K2j27LJ64j45j6R0k6k6L0k2
$$ 62 -71 -42 72 -42 -65 28 -18 -79 -29 -46 -149 -8 42 -115 26 48 -79 -76 88 -57 -73 17 -9 -35 -5 -27
2854b7m7Q8N5k15J64P8j75M6O7n2J5P4k7n9M0%p8J66m9j76Q9R9j00j2R9j36L3
$$ -27 -74 14 69 -146 18 96 -79 -33 34 -18 -3 71 44 -15 25 25 -53 113 64 -112 -23 76 -24 -36 63 -73 -40
2881d0J56j53l5J36l8j16J52M3j97J58Qj27Q7Q6j47J0J67j72m2J73r3l5J02jj42
$$ -40 116 -37 -72 64 26 -90 62 105 -92 66 74 -53 34 120 -27 -17 150 -22 -64 109 16 -19 83 82 -60
2906f0J87o8j62J54Lr3l4K29j69q6K03q7o3J08l9j48K31j4k41J85K9j61R4J4j39
$$ -60 127 59 -103 51 54 -39 -73 156 -13 -99 104 17 -46 62 23 -125 106 92 -149 36 65 -96 -2 12 -127
2931a27P6J22r3n6J10m8j72K45j4j76J38J4j75J76kj24P0J53k00j2J96j64r1K99
$$ -127 -51 71 -22 -78 32 -16 -188 57 43 -133 5 19 -156 20 18 -106 -36 117 -83 -95 101 -63 -154 145
2955A45j94r0K27o8j44J82N6k41J25R1k30Q7K41k02r3K01p5j22K17r1j20K38j0
$$ 145 -49 -139 88 20 -124 58 114 -127 -2 89 -141 -54 187 -15 -108 93 18 -104 113 22 -98 140 130
2978A30j97J45N3k33J29J44k31NK86k35q1K09n1j83K18qj82J80Kk00J03J24j77
$$ 130 -67 78 131 -102 27 171 -60 -55 231 -4 -85 124 73 -110 108 100 -82 98 100 -100 3 127 -50
3001e0%J95j84p3J81j17p2K48j02j76K05l1j71J75K0j78O7J43j79M9J10j60j5
$$ -50 -50 145 -39 -112 69 -48 -120 128 26 -150 55 24 -147 28 48 -130 -63 80 -99 -50 60 -100 -115
3024a15J51r5j15K47pk54J48R3j71J10J47k18O6R6j30l3J68j17q0J91j19j02K35
$$ -115 36 -59 -174 73 66 -188 -40 53 -118 -8 139 -79 -13 83 -47 -80 88 -29 -109 82 -37 -139 96
3047I6q1j63J87N8k39J71J43k11O7J43k60N3K34j82j16K59r8j03J42jj93J85L9
$$ 96 15 -148 39 97 -142 29 172 -39 28 171 -89 -36 198 16 -100 159 61 -42 100 99 -94 91 130
3070A30k11J28Q0j90M2J76j42q3K26j23p8J16p9j22J78N1j87J25M5j54N7J09j61
$$ 130 -81 47 127 -63 -21 155 13 -70 156 33 -45 71 -8 -130 48 99 -88 37 82 -72 -15 94 -67
3093f7K7J66j74r2K24l6j16J43o2j64J88J7j55M1J28j53jJ88k34M3K17j94n3J89
$$ -67 -40 126 -48 -140 84 48 -68 75 13 -151 37 54 -101 -60 68 -85 -86 102 -132 -89 128 -66 -119 70
3117G0r7j12K03m9j80K00R1k52J41P2j92R7J24k00O5J09j02j16K70j11j57K01
$$ 70 -27 -139 64 15 -165 35 126 -126 15 87 -105 -8 116 -84 -19 90 -12 -128 142 31 -126 75
3139G5J05k91J02J86k28LK30j63m0J63j70m7K24n3j81K07Jj49Q9O1k52J49O8j39
$$ 75 180 -111 -9 177 -51 -48 182 19 -21 142 -28 -75 149 96 -85 122 123 -26 63 124 -128 21 89 -50
3163e0L0J10j38k1J18Oj84K27pj92Q4O0j42J27L6j48R5J26j70o4K28j79m1K19
$$ -50 -20 90 -48 -69 49 55 -129 98 91 -101 -17 43 -99 28 64 -84 11 137 -33 -97 131 -48 -89 130
3187A30q9j37J75p2j9O0O7k46J10J36j96N2J12j12m9J53j31n1K04q1j37K05p9
$$ 130 41 -96 79 7 -12 48 115 -131 -21 115 -81 -29 83 -29 -78 75 -56 -107 97 16 -121 84 5
3210Ej21J36J5j47R5K6j15M6R3q6l9J85o4j44J77m5j23J56Oj63P7O1j12N7Q9q5
$$ 5 -116 20 35 -112 -17 9 -106 -60 33 -53 -92 93 29 -115 62 17 -106 50 56 -107 -30 31 -81 -24 65 -20
3236b0jQ3j4q9J43m7j04J47j9j07L3Q6j14O9R9j70L3P1j08l3J70j28m3J75n0r4
$$ -20 -21 62 48 -41 102 55 -49 98 79 -28 5 91 -23 46 145 -25 8 79 -29 -62 108 -20 -63 112 62 -32
3262c2O1L1j01R0kn0k9J50k17R2O0o3k8J10o8o7J88j08j08J29or2nJ25j22N1O1
$$ -32 29 60 -41 49 47 -3 -32 118 -99 -7 53 -10 -38 72 4 -63 125 17 -91 38 32 -60 -65 60 -62 -11 50
3289E0p7j0R3n4l5Q7j37j9J41o8o0M4O8j46J37j5q6M6N4p1nR9m5o8J22m0l2J6
$$ 50 -27 -37 56 2 -33 54 -83 -102 39 -29 -89 -45 23 -123 14 -1 -87 -41 13 -58 -63 36 -9 -77 45 5 -27 -11
3317a1k2l1J23o6mM7O6j19K8N8k2kK3j1l1N6o4oJ2k3o6O4L8j6M9L3j77J09Kl8
$$ -11 -33 -64 59 -7 -11 36 102 -17 11 69 47 45 68 57 26 82 18 12 24 1 -65 -1 37 21 70 103 -74 35 37 -1
3347aj9Q8p4J1J5l2J7L1k8n7Q7m4n2N5N6o6k4O6m8j1O5j7l3Q7j18m7J53m0p3J13
$$ -1 -20 68 -6 5 20 -12 5 36 8 -49 38 -6 -58 -3 53 -13 -37 29 -19 -30 35 18 -15 72 -46 -93 60 20 -53 60
3377F0o1l2LP1k4o7N2n5K0O5n2j9N8j1q5N2K4j6J1k2QJ1Nq8J35k9j0k1k2K4k8
$$ 60 -1 -33 -30 41 17 -50 2 -53 -33 32 -20 -39 19 8 -77 -25 -1 -17 -6 -28 -20 -9 -4 -92 43 14 4 -17 -39 -15 -43
3408d3J04lq2N2k0m1P8j8N3j24M1OO2j2j04P0j3O6o9O7q0M0j8J0j8N4K2o5J5k7
$$ -43 61 58 -24 28 8 -33 45 27 80 -44 -3 3 65 53 -51 19 6 72 3 70 -10 30 12 22 4 58 80 15 30 3
3438Cm0M8l4mL5j0k0L9o4M5J2K2m5m8J11n0K1N0p9L7j1k2QJ6Or1J21K1j08L5N
$$ 3 -37 11 -23 -27 8 -2 -22 17 -47 -2 10 32 -13 -61 50 0 21 71 -8 29 18 -4 4 20 26 -65 56 77 -31 4 9
3469Ir6J11k5o0P9k1j3l7N2jn0L6j4j4J31j27l1J28n7k2l1Q3p8m3J31n1l7L4l2
$$ 9 -87 24 -1 -61 18 -3 -16 -53 -1 -2 -52 -16 -30 -44 87 -40 -71 57 0 -22 -53 30 -48 -91 40 -11 -48 -14 -46
3498d6P6Pm9p2J75o6l8k1J07j13O0P3j07j3Q0o3pO7p5rN8K0n6K9R5j31O5Q5j51
$$ -46 30 37 -12 -84 91 25 -13 -34 73 -40 20 93 -14 -27 53 -10 -17 50 -25 -34 24 44 -12 17 112 -19 46 131 -20
3527b0M5M1k9k4N0r3N3K9k5l4J06j16l7J07jj00PJ44j50L4J06j18k5J00j21m6
$$ -20 25 66 37 13 63 -30 23 52 27 -7 99 -17 -54 53 52 -48 -41 103 -47 -13 93 -25 -50 50 -71 -117
3553a17J13K8j19J59k0j62R5O9j35Q7N7r9k4J54j21n4K11j17r3J06no4N5L9j48
$$ -117 -4 24 -95 64 44 -118 -23 46 -89 -2 55 -44 -68 86 -35 -89 122 5 -88 18 13 -51 4 43 -105
3578a05J8J78j57QJ53j69N4Q9o4p4J21m7k8P6l9n8J11qj31J07P6j29j7J43j56
$$ -105 -87 91 -66 -58 95 -74 -20 69 5 -69 52 5 -23 53 14 -44 67 59 -72 35 111 -18 -35 108 -48
3603d8K5J19n1o0J40o6n1J10j07j24J57P0j65J31O4k22P1J13r2j15K05j70k7J81
$$ -48 -23 96 45 -15 125 59 8 118 11 -113 44 114 -51 80 144 -78 -7 106 14 -101 104 -66 -93 88
3627H8o3j53J48N1j91J60P7k35K6J73j75N9N6J0p6J73j39r4J57o0n8Q4O8k24J28
$$ 88 25 -128 20 71 -120 40 117 -118 -92 81 -94 -35 21 31 -45 128 -11 -105 52 -8 -66 18 86 -138 -10
3652a0Q5j89O0J35j36k6R1j1r1J89o3j62K41j05j11J18M4j48M8J33j22l0J08j08
$$ -10 75 -114 -54 81 -55 -81 10 -1 -92 97 34 -128 113 8 -103 15 59 -89 -41 92 -30 -60 48 -60
3676f0l4K34j48n0J75r3o0M0Q9j66P2J27j74N5Q8j74O8J78j59p7J23j5j20J87
$$ -60 -94 140 -8 -58 117 24 -36 4 93 -73 -1 126 -48 7 95 -79 -11 167 8 -69 54 39 -81 106
3700A06m9j23M7J44j56pJ14r4l2J62j71L9J12j18l3J01M0j65P9M0j07J12P2j50
$$ 106 57 -66 -19 125 -31 -38 76 -18 -50 112 -59 -20 92 -26 -59 42 82 -83 -4 36 -71 41 113 -37
3724c7j1J24j19k5J05p3l6J41m5j03J21j7j16J21J3j30J14M3j61Q9N5j53M4J20
$$ -37 -48 76 -43 -68 37 -36 -72 69 24 -79 42 25 -91 30 43 -87 27 70 -91 -2 53 -100 -56 64
3748F4p4m0P7J1j63J47Jj33J28N5j16J08j0j15O5J01j43LR7q9p4J70j3j62J81
$$ 64 -10 -50 27 38 -125 22 23 -110 18 73 -43 65 55 -60 5 106 -37 -34 63 -26 -100 70 57 -105 76
3773G6Qk21J51N3r7m4J57j41k2J58j20k8J60n4p0Q3on0P2O0j77M5J13j39M3J05
$$ 76 84 -137 14 67 -30 -74 83 -58 -80 78 -42 -70 90 36 -34 49 43 -7 65 125 -52 -7 106 -33 10 115
3799A15j35j4J70j09q9J87j03j18J33L7j34Q2R0j28RJ16j13JO0j01n0K05j01j23
$$ 115 -20 -34 136 27 -62 125 22 -96 37 74 -60 22 112 -16 -7 109 -4 -3 57 -44 -94 111 10 -113
3823a13J35k5q7L9R6j89J29N8j41M6J28j05o8J65r0k4R7n7n6J01n3o3J05J2j40
$$ -113 22 -3 -90 -51 45 -144 -15 43 -98 -52 76 -29 -97 68 -22 -46 51 -6 -62 39 -14 -77 28 40 -100
3848a00O8R4j20K3J06j36j5J62q5k6P2Lj58J90J5j68R7L2q9J4J23j90M9J02l3
$$ -100 -32 62 -58 -35 71 -65 -80 82 -3 -29 43 46 -112 78 93 -75 22 54 -35 -21 102 -88 -39 63 30
3873C0n5J66p8j76J65J1j22J73p8m5j0R2r7LJ15q8L0R6p7q9P0j5n8M5J26k01Q0
$$ 30 -25 141 63 -113 52 63 -59 114 36 -9 -19 73 -24 -21 94 6 36 132 55 -34 36 21 -37 8 134 -67 13
3900A3M1j04K1N5m3k0P5q0k3J16m9j08J37j6j17J08Om5m4J23j27J16j8n1%R6j01
$$ 13 54 -50 -29 26 -17 -37 38 -42 -65 51 2 -106 31 15 -102 6 12 -33 -77 46 -81 35 17 -34 -34 62 -39
3927c9n5J18J3j14P6N5p1Q7o8j1L2K4n5J1O2n9J2OrJ2J8Mm0l8J20j46O5Q1n6j8
$$ -39 -94 24 37 -77 -1 54 -17 70 2 -9 23 47 -8 3 65 6 18 24 15 27 45 49 9 -29 91 -55 10 91 35 17
3957A7k4l2P5K1q2L9pJ2o3K4N7o5Q8m2m1L1K9j9mk9N8p8K5P6m0pmn1R8m6m7O0
$$ 17 -7 -39 36 57 -25 14 7 19 -44 -20 37 -28 60 18 -23 8 37 18 14 -15 43 -35 -10 66 26 19 15 -36 62 16 -31 29
3989B9m5JL2K0l3j7L4L3n4l7P2lo1L5l2L8K1m5j6N6l7k9nL0K4j9qN6k9K7o8mK9
$$ 29 -16 -15 17 37 4 -13 21 54 0 -37 35 32 -29 6 -26 12 33 -12 -28 28 -9 -38 -43 -13 11 -8 -16 40 11 38 -30 -34 -5
4022ej9L0J8l3RL4p5nM3Pjm0J18j01Lm2N3M2n2L0k6KJ9rj3M7p5O9J0n5l3P8l3
$$ -5 -24 6 24 -9 0 34 -41 -46 -3 4 3 -37 81 -20 -17 -59 -6 36 -16 14 -12 -10 9 0 -13 34 -41 28 38 -17 -50 28 -5
4055el9M0K0l0MJ5l0jP5j5J1m5kn1R6ql5l5Q6l7rk1K4J3L1N6q0j4M6q7M2Q3j51
$$ -5 -44 -4 16 -14 -10 5 -25 -26 49 34 45 0 -2 -53 43 35 0 -35 51 14 5 -16 8 21 52 108 28 14 60 -27 15 98 -53
4088e3P5K7m2kj7q4Q3P5j15j0J17p7m1N0Rmk7K4J2k4M9o1M4l9j1K4Q6j37P7J6
$$ -53 22 49 7 5 -12 -96 -13 62 -53 -63 54 -23 -64 -14 -5 -9 -36 -12 0 -24 25 -36 8 -31 -42 -18 68 -69 8 24
4118B4plk9K8o4O0Nm1J11jj30P3O1j07kR3q3qM4j2n9J13M1j30N2O0j01J6N5p0
$$ 24 17 14 -15 13 -51 9 14 -27 84 83 -47 26 87 -20 -22 71 -12 -20 24 12 -47 66 107 -23 29 89 -12 4 59 -11
4148a1JJ22q1o6O9p0j2R4jj12J35m1j04R0M1p2K3O6m2o7M8K8r6Q4Mn7N4j1j13
$$ -11 -10 112 31 -35 34 -36 -48 46 45 -67 68 27 -77 13 54 -18 5 71 29 -38 10 38 -58 26 30 -27 27 16 -97
4177i7P7R3j36M8O3p9K4M7q0k5R1k8j03J27j0j02Q5l3RJ7J9j26O6R4j18P6M5p1
$$ -97 -20 73 -63 -15 48 -31 -7 40 -40 -65 26 -2 -105 22 12 -90 -5 -38 -29 -12 7 -119 -53 41 -77 -1 44 -27
4205b7n8J37p8o9J44N1j34L0R5j10MM5o8J5J39j38L7M6K5j78J62N6j68P1K0r5
$$ -27 -85 52 -26 -95 49 100 -34 -4 91 -19 -15 30 -38 -23 116 -22 15 61 86 -92 70 126 -42 29 49 -46
4231d6M5J59j68J5P2j02j8J16o9o6J66r9n2Q8k1o2Q5J7q4N0Lq2O9P0j27j5J14
$$ -46 -1 158 -10 5 77 -25 -43 73 4 -62 104 5 -47 41 20 -42 43 60 -24 26 29 -53 16 86 -41 -56 58
4258E8r8j8N4K8j02O1M8j34R0J2Lo1Q1m3K2Q2j03r9J73l3r9Q0M0q8J05K3j46L7
$$ 58 -40 -58 -4 24 -78 -17 31 -103 -13 -1 2 -59 22 -21 1 83 -20 -119 54 21 -78 2 42 -46 59 82 -64 -27
4286b7P3p0K6O6j01nQ8l7n4J22m7q9R9L8j67R8P5j17L2N6q2RN8j15LK05j29o7
$$ -27 46 -24 2 68 -33 -38 50 13 -41 81 34 -55 44 82 -85 13 88 -29 3 59 -23 -14 44 -71 -68 137 8 -59
4314e9J49k7q0M6J2q3O5N5j13N8K5j02P4Q6r8p6J11Mq1N1M5q3L1L3p4k7J01p9
$$ -59 90 63 -17 29 41 -42 23 78 -35 23 48 -54 20 106 8 -68 43 47 -34 17 62 -21 10 43 -31 -58 43 -36
4342c6m5K10j27q1J37j6j59J97n4n1P5rj23J02M3r4J0Q9p7o1J00n7m4J04rr1J28
$$ -36 -81 129 2 -79 58 42 -117 80 26 -25 50 41 -82 20 63 -31 -21 68 -9 -70 30 -27 -71 33 24 -67 61
4369F1pj12J06Q0j80N9P1j12oO2r3jJ30p2o6J02Rm3M4k1r9J11K4o9K4Km2K1M0
$$ 61 54 -58 48 128 -52 7 78 -34 -40 22 -71 -72 58 -14 -80 22 31 -12 32 11 -88 23 47 -22 2 4 -38 -17 23
4398B3K2j59J40ll3N8j7j16R7L3o1oL0j5O0k6J6q2J40p6p3O7Nj5rL0l3PN5r1K3
$$ 23 45 -114 26 23 -10 48 31 -85 12 45 -16 -22 8 -7 53 27 43 -39 101 25 -48 19 24 9 0 30 -3 4 59 -32 -9
4429iJ11r1l6J07o2n6P7o6pK1K4l8KL5k9J9k5o6O7O2q1K4N6m8j6M0j1l4J2jl5
$$ -9 102 11 -25 82 20 -36 41 -25 -32 -11 13 -25 -23 12 -17 2 -23 -89 -22 40 -41 -17 39 -9 -25 15 4 -30 -18 -19 -54
4460e4L0N6o4m7M0j4M9N7q3qM3k5k7M4m7L2L6l6m4O8k2Kj3Q4k7k9k3j3M9K4j0
$$ -54 -24 32 -32 -79 -39 -53 -4 53 -30 -38 5 -20 -47 -3 -50 -18 18 -18 -62 6 -16 -14 -27 57 30 1 -22 -35 14 38 28
4491B8k3K6N6j7kn4j3j4M%j7J7J2kN1k2k4L4k9L3Kl7n7R4n3j6M6om5l3M1Ok7M6
$$ 28 5 31 87 70 68 14 1 -13 -9 -9 -26 -9 3 1 52 30 6 40 11 44 46 9 -48 46 -7 -23 23 17 -28 -61 -20 -14 -41 5
4525Ej6j8K8j1rML4r7P0L8K0o9J4J2n9P6K9l4k3k4m3J04J7K4o2j4L7j6o7Q0m7
$$ 5 -11 -29 -1 -12 -21 -17 17 -80 -10 28 48 -21 -7 5 -54 22 51 17 -6 -30 -73 31 48 72 10 -4 33 17 -50 30 -17
4556a7J6j8KK6l6L8LPl1o%M7r8P6k6qJ0J2m6L3j5mM7n7rJ00j9kk4OJO9n7m7J42
$$ -17 -1 -19 -17 9 -27 11 14 21 -10 -16 -16 31 -67 9 -17 -25 -15 -3 -49 -16 -31 -35 12 -45 -54 46 27 25 1 7 8 77 20 -27 115
4591A15q9L7m8M2l2j8K5j3j4JO3n2L8m6M3q1M0J3K8m9mO0q0Q0k2j13Q8m1MJ3J7
$$ 115 26 63 15 57 25 7 32 19 5 6 69 17 55 9 52 -29 11 24 52 3 -1 59 -21 59 37 -76 12 -29 -25 -12 5
4622Ej4MKM4j6l5k1LoK5KN7p6j8R3m0J6m9N0o0M7j1N7n1J8L0j7l8n3RN2j4L6l9
$$ 5 -9 -5 -3 41 25 -10 -31 -28 -34 -9 -7 50 -26 -44 49 9 25 -24 26 -34 13 2 59 8 26 56 39 1 -52 -43 9 -5 31 -8
4656hJ5L1r1O3M7m1KQk9m7N4n2M8Qm4M9O0o2n2J17p9l8L7K4%j2n%P7r9K7L4k1
$$ -8 7 38 -53 10 57 16 18 26 -3 -50 4 -48 0 8 -36 13 73 11 -41 76 -3 -41 -4 20 20 8 3 3 80 -19 8 42 21
4689B1Oo4R9l5l3J8pm2NN0l2%M4nK2l3m2M7Rj3K7n1OL9ol6l7M5J5j2j3J7n2M6
$$ 21 27 -37 62 27 -6 12 5 -37 -32 18 -14 -14 30 25 47 14 -28 19 28 15 42 -9 -3 36 30 -6 -43 2 17 5 -8 9 -43 3
4723CPo7L0rJ5j7LO3p8R0l1jLK0o6L8pJk8J12j21l4J73l9l6jJ6q8Q6j9l4N9j6
$$ 3 10 -57 -27 -36 -21 -38 -35 28 -50 40 9 8 11 31 -35 3 -4 -3 -31 81 -40 -74 99 60 24 23 39 -49 37 18 -16 43 27
4756B7p3K7M1m9L7L1j1n3M9pm7K9K7p8K8J5n3O4j7m3P6N1r5M3M2p2k4R4l7J4j5
$$ 27 -46 -19 22 -27 10 41 30 -23 26 19 -28 1 28 -50 -22 -7 -60 4 -13 -56 20 71 -24 19 61 -11 -35 59 22 36 21
4787B1Mk0M0j06j2M5%M1RM8q4OO9o1k8N0k1Kj0K4n4O5j6l9mP6j6NJ6o6m6O0J2
$$ 21 25 5 45 -61 -73 -28 -28 13 22 70 -14 -8 61 0 -28 22 1 3 -7 17 -37 28 12 -27 -31 45 29 34 50 -16 -62 -2 10
4820A0o5K8M9n5L7N5j18J19n2m8L7Q4j34Q5l7k1l1P9l3j9P4k0j7lJ2p4Q8l7jK5
$$ 10 -55 -27 22 -33 4 59 -59 60 8 -40 -3 81 -53 32 -5 -26 -57 22 -11 -30 44 24 7 4 16 -58 30 -7 -8 17
4850A7N8r9M1j9pM5O3j02m7J04p8j6M1M4r3O3On6MJ13j27J5P7l5l0O6p8L6L2J0
$$ 17 75 -24 17 -2 -9 36 99 -3 -50 54 -24 -40 1 45 -48 15 21 -35 -31 82 -45 -30 47 12 -18 48 -30 6 38 48
4880D8Qk6M5n3j4N8p4PN3j34L5L1l7P0Mo0LM4km5N1L0om6L0m4J7L9j0r5J17o7
$$ 48 56 30 75 22 8 66 -8 -1 52 -82 -47 -16 -53 17 21 -39 -36 8 6 -39 12 42 36 -10 20 -24 -7 32 22 -73 44 -23
4912b3M2J8Nn4J8L7r3P2K0p5j8R4p4N3P9n8q5N4o7P0J9l3m1R0pm2O8k7r8M4O2
$$ -23 19 37 42 -12 6 43 -50 22 42 -33 -51 43 -31 22 101 43 -42 12 -55 15 34 1 -40 50 43 1 69 42 -56 -12 50
4943E0q9J3P7m8n3N9j9j9Q3k2n6M4L2j20M3N5k7rO7l2n8O6k1j4J20j08l7P8l0
$$ 50 -39 -26 51 3 -50 9 -10 -29 54 32 -24 20 52 -68 -25 30 3 -6 61 29 -29 37 16 2 122 14 -23 55 25
4972B5k6Q%n7M1R3r8N6J2o2JM3q6m7O0O7p7O9K1r4L0P5r9oQ5q5j6J44j10M0P7
$$ 25 -1 7 7 -50 -9 84 -14 42 54 -8 -7 36 -50 -97 -37 30 -47 22 43 -51 -21 54 -45 -51 34 -51 -67 77 -33 7 84
5003H4r8j9K5Qj07R6jKl1J41j11J0Q4j05M6M4p4k0Q9j2o0J15p5n8M2O1r3L4rl0
$$ 84 -14 -33 -8 0 -107 -11 -12 -10 -41 100 -11 -1 83 -22 24 68 -6 -26 63 51 -9 106 31 -27 15 76 -17 17 8 -22
5033b2RK9n0L4O0o5m4L2L5m2L8Pl5M2Rl9n8J06k4n7O9k5m8O3J9o5K3P5j11N6j1
$$ -22 -13 16 -34 0 60 -5 -49 -17 18 -24 14 21 -14 28 37 -2 -60 46 22 -35 34 9 -39 24 43 -22 1 76 -35 21 10
5064A0m5rL9Jk7J00p1pL0qm2N5Ko7N3K9n0J0p0K3l2P5K6j14P8N5o1jl2k2R8n5
$$ 10 -35 -44 -5 -4 -31 69 -2 -9 21 13 -29 26 28 -39 14 43 -7 3 -67 -44 -76 -1 25 -89 -11 44 -17 -18 -50 -72 26 -29
5096b9l9R3j4k3J04r6L6n2K0J2o8L9J5j5O1J6j05J03l0oj9K3jl1P1p5j2Q6p6M6
$$ -29 -68 25 11 -12 92 -4 32 -20 0 12 -56 -17 -2 -17 44 60 -45 58 28 22 3 26 25 -6 65 -10 -22 64 -12 34
5126C4K4m6l7O1j1l4J7Jn6M5M2q0k8Q5pk1J8j1oN1k9m5O3ol2jQM1kK4r7QJ5N7
$$ 34 58 12 -25 36 25 -9 8 9 -47 -2 40 -40 -68 17 10 -11 7 -4 -10 41 12 -33 30 24 -8 -9 -1 40 38 62 -35 -27 -12 45
5160D5m8kM5j9m6N9l5oJ5Kkm2P7o4L1k3k2L5m4k3N6J2j4K2j8Jlk5PM3o7K9K3J9
$$ 45 -3 -5 40 21 -25 34 -1 -7 8 10 8 -34 43 -21 10 -13 -35 0 -44 -67 -11 1 -13 9 -9 -8 -11 -36 -29 14 -53 -24 -1 18
5194A8J3l8N9n3J1pK8n6O4j2m8K1l2m2O5M6m0NO1q1Rj4O7O4j1j23M4j2J5rJ5l2
$$ 18 31 -7 52 -1 10 3 31 -25 39 27 -21 0 -32 -74 -9 37 -3 2 63 -18 -9 -23 44 108 97 -26 18 6 21 12 27 -5
5226ej6J0L4j1m7N8j8l7j5LM4k9L7jnj2LM3n3L3L4q2oJ26p8KJ7j6m7K2O9q2QK5
$$ -5 -21 -11 23 12 -35 23 5 -32 -47 -44 0 -29 8 7 2 -10 -7 36 -17 16 50 -32 -38 88 10 12 29 13 -34 -12 57 -25 -17 8
5260HlPLol9L0rJ2J9o9L0L9k4l7L7n0nM6PjJ7Ol2RJj3JN9p9O2J0k8nj0m8J04m
$$ 8 5 12 15 9 -30 0 -9 3 22 -47 -17 22 -2 -39 -2 -52 -57 -11 -4 -5 12 18 -14 -5 -4 -17 -16 43 -36 26 36 8 3 -7 -55 49 45
5297D5m3o4Q0l7K6L9m7M8r3P0lJ5nok6L4p5PR4n8J6k4M7n9j1J04m9l2j4M1n8M6
$$ 45 2 -62 18 -19 7 46 -1 47 -46 24 21 36 31 25 -1 33 -42 -35 59 1 17 -7 40 -19 -30 74 25 -7 -21 20 -38 8
5329Hj5L4L0k7n0L7K5q2L1K8Omk8K8k1K0k8J6m2l4N2j7O0l9J2M5o7M0j7J9M9j6
$$ 8 -7 27 57 30 -20 17 42 -40 -9 19 25 21 -7 21 0 20 -8 8 -34 -68 -16 -33 27 -12 0 45 -22 18 1 20 69 53
5361E3m1J4n2n4J19j9m2Q%%o6L0Q2q3P1K4o0J1N1m5j1P7j29R1%n6MN6l3m5Q5m6
$$ 53 12 26 -26 -80 39 20 -22 -14 -14 -14 -80 -50 32 -51 20 44 -16 -5 46 1 -10 67 -62 29 29 -27 -23 33 0 -45 40 -6
5393fm9P7j4K6o2M2Ll4Q3j00M5K9N7r6JO5o4K3k7k5n1J24l4J3O7j29qR6r5J0J02
$$ -6 -55 22 8 34 -28 14 17 -17 66 -34 11 40 97 1 2 67 3 26 -1 -26 -77 47 13 26 93 -36 -44 52 -43 -33 69
5424F9l3j12M4L1p1O5M8m5n1O2j8LJ7pk7M2k0l4P3k1m5J08p2j4K9k2j1J2K3j1
$$ 69 36 -76 -32 -1 -72 -7 41 -4 -55 7 -11 -8 9 2 -25 17 -3 -37 36 15 -30 78 6 -8 21 -1 -12 0 23 12
5454A2n2Q1m9j3MP6o6KmJ0k9L1j2K6%l0L1mqnL3Qk2nJ2q9N0O3q9O2L5o3kM9o3
$$ 12 -40 41 -8 -21 -17 59 -7 -5 -9 1 -28 3 -9 17 17 -13 18 14 6 1 34 42 20 15 27 -62 -12 51 -38 24 59 -4 -6 43 -20
5489b0P6L5m4r4Q5n1rJ02p0k5L3N0n8k1Q3q5J9L5n6j5M1l0l8O8M8r1N4ok7pM3
$$ -20 56 91 47 -47 38 -13 -22 80 10 -15 18 68 10 -11 72 -13 6 41 -15 -30 11 -19 -57 11 59 -32 22 16 -11 -18 25
5520B5j6kn4Q4q3N2K7l6K9K2n0J7j7n5O4R5j50Q7J4q9M7K8kq0R1n3l0R4j8o4k
$$ 25 9 7 -47 37 -46 6 33 -3 26 48 -2 15 -2 -57 7 102 -48 39 53 -36 11 39 37 -43 48 -5 -35 59 41 -23 -25
5551b5P2j31J29n4JK2qk9mR5j71O2J4R1n2K8n1jqL2n2Q9n2l2M1m3J8J8kjrQ2p0
$$ -25 47 -84 45 -9 -8 14 6 -23 -27 68 -103 -41 -27 64 12 40 -11 -12 -20 12 -40 49 -3 -35 6 -37 -19 -1 -3 -4 -13 69 -1
5584am1J05j5n6KL2n8K7Qk8OJM1n4K4kl0Q8j8l9J8j4J1QPk2ll1M3J2rJ0o3J14
$$ -1 -42 63 48 -8 -6 26 -32 -5 3 -25 -19 -18 23 -31 -7 -9 -39 49 31 -8 10 -4 7 15 22 0 -3 -34 9 21 12 22 -41 73
5618G3p6J1k5P1jq0jM6j3qM1q7Q4k6k8L7Km8N0o8j4J00K6p7k1N3L2p5O8l1j5j1
$$ 73 -3 8 -17 54 53 -27 -28 18 5 -3 38 -49 35 9 -19 18 20 -28 22 -46 -60 40 66 -11 -32 21 53 -22 46 15 0 -11
5650a1K4r1M9K9n8P3Mj7j0J6n2M9j7K1N1o1J7J6k5Nj8Q1p3J2j4K3nnL1n5J2K2
$$ -11 13 -78 -29 0 -58 15 19 2 -8 8 -44 5 -12 9 60 -1 16 32 7 12 -6 75 2 14 0 23 18 13 44 -11 1 23
5682B3m8oN7m5L5J2m8j6O6K5l2qj4l9K4J6qoO0r5k2L8N6m7J4L2p1L6L6k1n3L6
$$ 23 -25 -31 26 -19 16 28 -20 -36 30 55 23 15 1 -38 -14 2 -6 -12 48 -47 -69 -31 25 -22 -8 24 -47 -11 25 4 -49 -13
5714a3j3l2J4P1o8J7L0M3o7M0j2pK7m3K5MrM4n6k2K3mL9J9l0k0k1OOj6j4L2K2
$$ -13 -26 -58 -44 27 -41 -24 6 49 -18 22 10 3 30 -13 12 16 7 51 -5 -27 -4 -8 31 50 20 0 -21 -15 -9 -25 -39 -7 15
5747A5o4M5J9k6j2L1j2jp0M3K6J6k1QqL3j8N5m8Qq6O6L1Kk9J6rk4N4k0j1N2k4
$$ 15 -49 -4 15 -11 -23 8 -4 -5 -75 -32 -6 10 -11 -3 -11 22 4 59 11 19 -67 -1 30 32 3 19 10 -14 40 20 9 61 37
5780C7N1j10Q9m8j8Rm2N9L9m8oM7j4p1J5J5k2N9m7n5k2J00j8j7n0N8p3P6m3J02
$$ 37 88 -22 67 19 1 10 -32 27 66 18 12 59 45 -26 -11 4 -18 41 -6 -61 -83 17 -1 -18 -68 -10 -83 -7 -50 52
5810E2r6j8P8k2Lk7K6j1PO0n1lJ1J7q3Q3j3j5k3MP3p5m7N6JL6l1J7m3jM1LK6J0
$$ 52 -44 -62 16 -6 -3 -30 -4 -15 -8 52 1 -2 9 26 -57 26 13 -2 -25 -21 52 -23 -70 -14 -13 23 -8 9 -34 -35 6 9 35 45
5844D5q0M9M0p8KJ2J1LjJ7J7k5p3Q4O2o0QLl0n5jP7oj5q4P8PPl8K0k1L0j9NN3
$$ 45 -35 14 54 -24 -22 -10 1 4 3 20 37 12 -61 23 85 25 33 36 6 -49 -50 27 21 6 -78 0 7 14 -24 -4 -25 5 -14 -9 44
5879D4m0l2QK2j7p2R0K2k4pk3M1l4K8Mn4%Q3j9p4K9j3O7jm3J9jL4l0l9mM8OQk1
$$ 44 4 -28 -20 2 -15 -87 3 25 1 -6 -29 12 -22 6 10 -44 -44 39 20 -54 -25 -38 29 28 -15 4 3 37 7 -32 -36 12 18 26 5
5914EJpL6l4N0o1K8m0M4n6Q7m2j5J2k3L7n6Q9j00OJ9j0jL7Rk2Ql7P8m8nL4k0K5
$$ 5 6 -1 35 1 51 -10 18 -22 22 -34 53 11 -4 8 -15 22 -34 55 -45 -39 -20 -30 -31 6 15 -7 1 -36 42 -6 -11 23 3 28
5948B8n9N0m8J03m6k2Jj1l9M0MJ0K6Ll5J8l8N0nj9k5N2p3N1L5n7j4L4N2r5L6J
$$ 28 -31 19 -29 74 28 6 7 -4 -43 -3 1 11 37 40 5 23 -15 35 30 11 -14 38 -35 16 51 -6 -20 14 66 -29 7 8
5980HLk0J6l2N9o2k0M3m3L1m4O9j8pN7k8O7n0L9n9J8j19Q0L1n6Q6o8QK3N8q7r
$$ 8 11 -9 7 -25 34 -28 -48 -5 -48 -17 -61 8 -10 -17 40 12 79 29 68 9 27 -92 -12 19 -37 49 -19 -11 12 70 -17 -26
6012b6M3K7r1Q7j6k8j8L1J5r8N6MJ9nl6Q4o7J5Lk1K1o6O9l4L2k0J3O7o4l3L6J1
$$ -26 17 44 -47 40 24 -4 -22 9 24 -74 -18 -14 5 0 -36 48 -19 -4 -1 -22 -1 -67 2 -32 0 -20 -7 60 -4 -37 -1 10
6044A0l8%j4M9r%o7J5J13n9NM2o8K6J8On5Q6r4O1n0N4K0j4o3j0N2j1j5j1J6j5
$$ 10 -28 -28 -42 7 -2 -2 -69 -54 59 0 5 47 -21 5 23 29 -26 60 -34 27 -23 31 51 37 -26 -36 16 5 -10 -21 -5 -20
6076b0j8K6Mj0O5p2K5J6m5m8M3L4mM5l1k9O4j2lm1k9O9ql1L4o2K1K4j8L1%m8L0
$$ -20 -38 -12 -8 -18 47 -25 0 16 -29 -77 -34 0 -4 41 10 -19 45 33 30 -11 -40 29 21 -10 24 -38 -17 7 -11 20 20 -28 2
6109Bj8L8qoo0MQ0l1L9o5j0L9Qql6L6J6n8P8n4J3M1M3o3j7M0n3j0k4K8L7J7m4
$$ 2 -16 22 14 8 -52 -48 32 1 40 -25 -35 4 12 4 -32 4 20 -38 40 -14 -1 40 83 20 3 43 -10 -20 -44 -16 21 38 -6
6142fKK5j5M4p4Q4o4l0K4k9J7M8l3J8J8lk0L1k2n2L2opL0qMl7P7o1PmM1j2l4L6
$$ -6 -4 21 6 50 -24 60 -4 -34 -10 -39 -22 26 -7 11 29 26 6 37 15 -37 -5 -11 -18 12 4 8 -29 48 -13 -6 -10 31 19 -15 21
6177B1qK3m0K2k6Klk5N3n4L9J6OnKJ9p9L9K9p4L9J8k0k3K0Rj8N4m4k5O2q5L6J0
$$ 21 13 36 -4 18 -8 -6 -9 -34 19 -35 4 20 26 21 23 42 -37 2 31 -43 -4 14 -6 -29 -9 0 -18 36 -8 -33 29 -56 -20 -10
6211a0OoJ0l0K4j1J0p5N1LM1k0Pn3M6K1n3M7j0K0m6N0k0j7L9j0J3Nm0JMM4n0m1
$$ -10 -4 -10 0 -30 -6 -17 -7 -82 -31 -28 13 -7 0 -53 -7 14 -39 8 -2 18 -28 22 2 -15 24 14 27 32 -8 -7 -3 41 -9 -50
6245e0N1rm1Q4p0J4M2J3n7L1Km2L3J5k6jO0Pl5rJ8m2QJ5l1J2Q6j40L8M8m9K6m7
$$ -50 1 -8 -49 35 -35 -21 21 34 -23 8 10 -32 1 16 -10 -11 49 56 21 12 30 -12 -4 11 -20 -8 78 -62 -24 24 -25 1 -46
6278d6PL3j6L4K8rm5N8l7Oj2L3m5pN9K0Lo9j9K5L7lpL9o4m5N3MJ3l1n4K7J5J8
$$ -46 -39 -6 -22 12 40 31 -14 44 7 13 1 34 -11 -18 41 61 64 -5 -24 1 38 35 28 67 3 -42 11 15 28 -3 -57 -30 -15 3
6312CK8n2K3%j7k9N4l4K4J4K9m8k8K9j1lM2K8p8M9q2R9k7pLRjj3L0n5nJ3L3n9
$$ 3 31 -21 2 2 -15 -44 10 -24 0 14 43 -5 -33 -4 -15 -18 24 52 -26 23 -59 40 13 6 9 18 17 4 34 -21 -26 -13 20 -39
6346c9J2RM3j4M4m5J6l9j2L3j0N7o1l7L3O4m2Pk0pJ3J5k0k5M2j9Nn2N1L1n1K3
$$ -39 -27 -18 25 11 55 10 26 -13 -25 8 -2 55 -6 -43 -10 54 12 19 -1 -8 5 20 0 -25 17 -2 3 -49 2 33 -18 5
6378E%K5J4rn2L0k5m3Q3L1j01M9M7p6J5n3Q0k5J0L5ql3jJ2m9J6lL0oJ0J6k3m9
$$ 5 5 30 44 35 -17 13 -12 -55 28 59 -42 7 54 -22 -7 -60 20 -5 5 40 32 -1 -2 10 -39 -23 -26 4 -2 8 24 1 -48
6411d8M8n3N2l9N1j3pJ8k5K5j4oJM4k0n5O6M5m9j7LK5k0N1l2qq3R9o5RNJ13j20
$$ -48 0 -53 -1 -40 11 -2 -9 9 -16 9 -5 -11 -10 34 14 -41 25 70 21 4 7 32 12 63 31 23 -60 39 -26 -17 -12 101 -19
6444a9OJ0m2N3rM7LLp6L6m7J9OL4J0k1k9N5m7M0k5K5j2k8Jj6M9%J8p8L7lj2J3
$$ -19 -13 -3 -45 8 -1 46 49 52 -24 12 -35 -16 -10 24 34 13 -16 39 -8 32 7 32 20 -8 -7 -23 26 26 44 -34 3 0 -12 1
6478AM2k9l7K7O0m5J0m2KK9L0rl0Rl3L1j6k8mL4rOmj02R5pk7O8J7l5J1k3j7K4
$$ 1 43 14 -23 4 64 19 29 -13 -11 18 48 39 9 18 -15 16 0 -28 -32 2 -7 -1 -5 -107 -12 -19 -46 22 39 4 15 -8 -25 -1
6512aN3m0j7J3j2l6L6K7k6O4%j4o3k7R5o1l5Q5j2l8LP2p0M3k8K2n8P5o4j2L6j6
$$ -1 52 12 -5 8 -4 -40 -4 23 -3 61 61 47 -16 -43 52 -9 -44 41 29 -9 -6 66 -4 39 11 33 -25 50 -14 -26 10 -6
6544fMl1K3K5Lm0rM1l9J4J8J3l9jqQlM2M6q7L6N4q7L5roJL5L5o5j0nL8k2L0m4
$$ -6 -2 -33 -10 15 18 -22 -31 10 -29 -15 3 16 -23 -24 -32 -24 -27 15 61 -26 10 64 -23 12 3 -3 -2 33 68 3 -7 -12 26 4 34 -10
6580a0L5l9k1M3MPMRk6J2j3qnN9m3pk7L0lRl9O4m0rk4P1n6J4J6J0l7P1k2l6O2
$$ -10 25 -14 -35 8 12 19 23 32 6 18 5 -3 -8 51 8 1 -26 4 1 10 -29 35 -5 -14 -38 33 -23 -9 7 17 -20 51 29 -7 55
6615E5p7P1o8j2N9J1j9Jj2k7L4L2o0l1Q6pj1j7rl9j9M0Pm3J03l0o1j3N5Jl6K1
$$ 55 -22 49 -19 -31 28 39 20 21 9 -18 16 48 -12 -43 43 36 25 8 -1 -40 -59 -19 -12 -55 48 18 -43 -56 -1 0 -36 -15
6647a5M0pn7N8l0JK8k0l7M2k9J1l9M8Q1n1J7o8rP2kn2M6ko3N3K2p6K5K8m3jk7
$$ -15 25 18 -39 19 -11 -10 18 -2 -39 3 -26 -15 -54 -6 75 24 41 -27 -36 36 34 -18 28 26 -37 16 38 -38 -13 15 -28 -29 -56
6680e6N0L6m2pO4Mp5L4n3k1N5M3r7j6P2mL3l2J6j6j6L3j3l9J0J9O1o2J2L5K9k9
$$ -56 -6 30 -12 -19 45 49 -26 8 -45 -66 -11 32 -65 -81 -9 -13 20 -12 4 -12 -28 5 -8 -47 -37 -18 43 -19 -7 28 57 28
6712B8K0n4l2M3K2Ol9rJ0k8j1M6N8n5k2K5l6L3J6l5O1n1m7J4K5L5n4J2P8p0K9
$$ 28 48 -6 -38 5 27 33 -6 -15 -5 -33 -44 2 60 5 -17 8 -28 5 21 -14 47 -4 -51 -37 -12 23 -31 -19 59 -11 18
6743A8k2Pn7P5k8K8l9j6nL2K8j9nO0k1n1R6n9j7KL6k3N1j01J9K3L1l8J7k8K7K6
$$ 18 -4 3 -54 21 -7 21 -18 -34 -39 -7 21 2 -3 57 36 -15 81 22 5 7 43 20 71 -30 -11 12 43 5 22 -6 21 47
6775D7r8N0k4L2JOk3l2nM7j5l1K4J0JO2n1j7k4N6o3Q9l7lL8k9%l0R6o4l0MN2p1
$$ 47 -51 -1 -25 7 8 14 -9 -41 -46 1 -14 -45 -21 -11 -10 52 1 -16 -40 16 -47 42 5 2 40 11 11 -19 77 13 -17 -13 39 -32
6809c2R1j00N4j3l0RK2J1k1K0m1M6mJ3j9m8O7j0L4p7O2o5LQ1%l6m9O0J0k0k5O
$$ -32 59 -41 13 0 -30 -21 1 12 -9 11 -30 16 12 25 6 -42 25 15 49 -28 34 -31 -28 53 53 17 -32 28 38 18 -7 -1
6841alL5n1L2P2k9r8O3kLJ5p2O4K5m3LPp9O6m1L2Rpjj4N3J3p8N0J3l3M3pn6n6
$$ -1 -4 31 -20 12 84 55 -43 20 18 21 36 -36 28 53 10 13 20 -59 7 -34 -2 7 0 -1 -15 38 51 -27 23 36 3 46 39 -17 -73
$$ [...]
8191b1
##END NTUPLES=NMR FID
##END=
