##TITLE=1H_Pr 6-X
 200.13MHz, CDCl3,
 8 sc
 
 6.2.2025
##JCAMPDX= 6.0         $$ Bruker NMR JCAMP-DX V2.0
##DATA TYPE= NMR FID
##DATA CLASS= NTUPLES
##ORIGIN= UXNMR, Bruker Analytische Messtechnik GmbH
##OWNER= pz
$$ XWIN-NMR		Version 3.5
$$ Thu Feb  6 14:09:00 2025 Russian Standard Time (UT+4h)  she@DPX200
##.OBSERVE FREQUENCY= 200.1313
##.OBSERVE NUCLEUS= ^1H
##.DELAY= (6, 6)
##.ACQUISITION MODE= SIMULTANEOUS
##.ACQUISITION SCHEME= undefined
##.AVERAGES= 8
##.DIGITISER RES= 18
##SPECTROMETER/DATA SYSTEM= spect
##.PULSE SEQUENCE= zg30
##.SOLVENT NAME= D2O
##.SHIFT REFERENCE= (INTERNAL, D2O, 0, 14.3821)
##AUDIT TRAIL= $$ (NUMBER, WHEN, WHO, WHERE, WHAT)
$$ ##TITLE= Audit trail, XWIN-NMR		Version 3.5
$$ ##JCAMPDX= 5.01
$$ ##ORIGIN= Bruker BioSpin GmbH
$$ ##OWNER= she
$$ F:/spectra/data/she/nmr/H-C/1/audita.txt
$$ ##AUDIT TRAIL=  $$ (NUMBER, WHEN, WHO, WHERE, WHAT)
(   1,<2025-02-06 14:07:43.85 +0400>,<she>,<DPX200>,
      <created by zg, POWCHK disabled, PULCHK disabled
       configuration hash MD5:
       00 E9 B6 7A A2 85 ED C7 34 08 36 98 17 FE 4E 26
       data hash MD5: 16K
       27 4D 5C 74 A2 74 2F 23 78 5E 11 5D D8 85 0B 79>)
$$ ##END=
$$ 
$$ hash MD5
$$ 62 68 3A 51 6B B6 5B 40 EB B1 ED 6A 98 55 CB 9F
##$RELAX= 
##$RELAX= 
##$RELAX= 
##$RELAX= 
##$RELAX= 
##$RELAX= 
$$ Bruker specific parameters
$$ --------------------------
##$DU= <F:/spectra>
##$EXPNO= 1
##$NAME= <H-C>
##$PROCNO= 1
##$TYPE= <nmr>
##$USER= <she>
##$AMP= (0..31)
100 100 100 100 100 100 100 100 100 100 100 100 100 100 100 100 100 100 
100 100 100 100 100 100 100 100 100 100 100 100 100 100 
##$AQSEQ= 0
##$AQ_mod= 1
##$AUNM= <au_zg>
##$AUTOPOS= <>
##$BF1= 200.13
##$BF2= 200.13
##$BF3= 200.13
##$BF4= 200.13
##$BF5= 200.13
##$BF6= 200.13
##$BF7= 200.13
##$BF8= 200.13
##$BYTORDA= 1
##$CFDGTYP= 0
##$CFRGTYP= 5
##$CHEMSTR= <none>
##$CNST= (0..31)
1 1 145 1 1 1 1 1 1 1 1 1 1 1 1 1 1 1 1 1 1 1 1 1 1 1 1 1 1 1 1 1 
##$CPDPRG= <>
##$CPDPRG1= <>
##$CPDPRG2= <>
##$CPDPRG3= <>
##$CPDPRG4= <mlev>
##$CPDPRG5= <mlev>
##$CPDPRG6= <mlev>
##$CPDPRG7= <mlev>
##$CPDPRG8= <mlev>
##$CPDPRGB= <>
##$CPDPRGT= <>
##$D= (0..31)
0 0.7 0 0 0 0 0 0 0 0 0 0.03 0 0 0 0 0 0 0 0 0 0 0 0 0 0 0 0 0 0 0 0 
##$DATE= 1738836463
##$DBL= (0..7)
120 120 120 120 120 120 120 120 
##$DBP= (0..7)
150 150 150 150 150 150 150 150 
##$DBP07= 0
##$DBPNAM0= <>
##$DBPNAM1= <>
##$DBPNAM2= <>
##$DBPNAM3= <>
##$DBPNAM4= <>
##$DBPNAM5= <>
##$DBPNAM6= <>
##$DBPNAM7= <>
##$DBPOAL= (0..7)
0.5 0.5 0.5 0.5 0.5 0.5 0.5 0.5 
##$DBPOFFS= (0..7)
0 0 0 0 0 0 0 0 
##$DE= 6
##$DECBNUC= <off>
##$DECIM= 32
##$DECNUC= <off>
##$DECSTAT= 4
##$DIGMOD= 1
##$DIGTYP= 9
##$DL= (0..7)
0 120 120 120 120 120 120 120 
##$DP= (0..7)
150 150 150 150 150 150 150 150 
##$DP07= 0
##$DPNAME0= <>
##$DPNAME1= <>
##$DPNAME2= <>
##$DPNAME3= <>
##$DPNAME4= <>
##$DPNAME5= <>
##$DPNAME6= <>
##$DPNAME7= <>
##$DPOAL= (0..7)
0.5 0.5 0.5 0.5 0.5 0.5 0.5 0.5 
##$DPOFFS= (0..7)
0 0 0 0 0 0 0 0 
##$DQDMODE= 0
##$DR= 18
##$DS= 0
##$DSLIST= <SSSSSSSSSSSSSSS>
##$DSPFIRM= 0
$$ [...]
##$SUBNAM0= <"">
##$SUBNAM1= <"">
##$SUBNAM2= <"">
##$SUBNAM3= <"">
##$SUBNAM4= <"">
##$SUBNAM5= <"">
##$SUBNAM6= <"">
##$SUBNAM7= <"">
##$SUBNAM8= <"">
##$SUBNAM9= <"">
##$SW= 18.0517328524113
##$SWIBOX= (0..15)
0 0 2 0 0 0 0 0 0 0 0 0 0 0 0 0 
##$SW_h= 3612.71676300578
##$TD= 16384
##$TD0= 1
##$TE= 0
##$TE2= 300
##$TE3= 300
##$TEG= 300
##$TL= (0..7)
0 120 120 120 120 120 120 120 
##$TP= (0..7)
150 150 150 150 150 150 150 150 
##$TP07= 0
##$TPNAME0= <>
##$TPNAME1= <>
##$TPNAME2= <>
##$TPNAME3= <>
##$TPNAME4= <>
##$TPNAME5= <>
##$TPNAME6= <>
##$TPNAME7= <>
##$TPOAL= (0..7)
0.5 0.5 0.5 0.5 0.5 0.5 0.5 0.5 
##$TPOFFS= (0..7)
0 0 0 0 0 0 0 0 
##$TUNHIN= 0
##$TUNHOUT= 0
##$TUNXOUT= 0
##$USERA1= <user>
##$USERA2= <user>
##$USERA3= <user>
##$USERA4= <user>
##$USERA5= <user>
##$V9= 5
##$VALIST= <valist>
##$VCLIST= <CCCCCCCCCCCCCCC>
##$VD= 0
##$VDLIST= <DDDDDDDDDDDDDDD>
##$VPLIST= <PPPPPPPPPPPPPPP>
##$VTLIST= <TTTTTTTTTTTTTTT>
##$WBST= 1024
##$WBSW= 4
##$XGAIN= (0..3)
0 0 0 0 
##$XL= 0
##$YL= 0
##$YMAX_a= 246264
##$YMIN_a= -249469
##$ZGOPTNS= <>
##$ZL1= 120
##$ZL2= 120
##$ZL3= 120
##$ZL4= 120
##$ABSF1= 10
##$ABSF2= 0
##$ABSG= 5
##$ABSL= 3
##$ALPHA= 0
##$AQORDER= 0
##$ASSFAC= 0
##$ASSFACI= 0
##$ASSFACX= 0
##$ASSWID= 0
##$AUNMP= <proc_1d>
##$AZFE= 0.1
##$AZFW= 0.1
##$BCFW= 1
##$BC_mod= 2
##$BYTORDP= 1
##$COROFFS= 0
##$CY= -3
##$DATMOD= 1
##$DC= 2
##$DFILT= <>
##$DTYPP= 0
##$F1P= 0
##$F2P= 0
##$FCOR= 0.5
##$FTSIZE= 0
##$FT_mod= 4
##$GAMMA= 1
##$GB= 0.15
##$INTBC= 1
##$INTSCL= 1
##$ISEN= 128
##$LB= 0.25
##$LEV0= 0
##$LPBIN= 0
##$MAXI= 10000
##$MC2= 0
##$MEAN= 0
##$ME_mod= 0
##$MI= 1.114404
##$NCOEF= 0
##$NC_proc= 0
##$NLEV= 6
##$NOISF1= 3.799351
##$NOISF2= 2.8
##$NSP= 1
##$NTH_PI= 0
##$NZP= 0
##$OFFSET= 14.38212
##$PC= 1
##$PHC0= -268.6596
##$PHC1= 14.79221
##$PH_mod= 1
##$PKNL= yes
##$PPARMOD= 0
##$PSCAL= 0
##$PSIGN= 0
##$REVERSE= no
##$SF= 200.129724274929
##$SI= 16384
##$SIGF1= 3
##$SIGF2= 2
##$SINO= 400
##$SIOLD= 16384
##$SREGLST= <1H.CDCl3>
##$SSB= 0
##$STSI= 0
##$STSR= 0
##$SW_p= 3205.1282051282
##$SYMM= 0
##$S_DEV= 0
##$TDeff= 0
##$TDoff= 0
##$TI= <>
##$TILT= no
##$TM1= 0
##$TM2= 0
##$TOPLEV= 0
##$USERP1= <user>
##$USERP2= <user>
##$USERP3= <user>
##$USERP4= <user>
##$USERP5= <user>
##$WDW= 1
##$XDIM= 8192
##$YMAX_p= 0
##$YMIN_p= 0
$$ End of Bruker specific parameters
$$ ---------------------------------
##NTUPLES= NMR FID
##VAR_NAME=  TIME,          FID/REAL,        FID/IMAG
##SYMBOL=    X,             R,               I
##VAR_TYPE=  INDEPENDENT,   DEPENDENT,       DEPENDENT
##VAR_FORM=  AFFN,          ASDF,            ASDF
##VAR_DIM=   8192,          8192,            8192
##UNITS=     SECONDS,       ARBITRARY UNITS, ARBITRARY UNITS
##FACTOR=    0.0002768,     1,               1
##FIRST=     0,             0,               0
##LAST=      2.2672688,     0,               0
##MIN=       0,             -249469,         0
##MAX=       2.2672688,     246264,          0
$$ Real data points
##PAGE= N=1
##DATA TABLE= (X++(R..R)), XYDATA
0@%%%%%%%%%%%%%%%%%qJ6j6J6j6K0k8L2l7M5n2O0p0Q1r3J06j19J36j55J74j96
$$ 0 0 0 0 0 0 0 0 0 0 0 0 0 0 0 0 0 0 -8 8 -8 8 -8 12 -16 16 -21 24 -28 32 -38 43 -50 56 -63 73 -82 92 -104
38a04K20k46K75l07L42l76M16m64N14n66O23o88P59q35R19j012J115j232J362
$$ -104 116 -130 145 -162 180 -196 220 -244 270 -296 327 -361 398 -437 482 -530 585 -647 715
57G15j508J674j864K083k342K655l036L509m112M893n877O692k052K44834j04299
$$ 715 -793 881 -983 1100 -1242 1413 -1623 1886 -2226 2667 -3210 3482 1430 246264 141965
72A41965l59424N3126K47541J9866j40620k4614L3872K3035M8877L9434p4560
$$ 141965 -217459 -164333 83208 103074 -37546 -62160 -28288 -5253 43624 83058 8498
83H498q0549O6084J30748k8097j42390j4336J25120K8428q8668l2213L0713o324
$$ 8498 -72051 -5967 124781 96684 -45706 -60042 65078 93506 4838 -27375 3338 -2986
95b986J0613N1667l3912r6827M4332J26020l5994j16423M1218R7528l3327n4740
$$ -2986 7627 59294 25382 -71445 -27113 98907 62913 -53510 -12292 85236 51909 -2831
107b831L7257J2941m0237K5311L9950o7385n4724Q2512O0678r5435q3313Q4153
$$ -2831 34426 47367 7130 32441 72391 5006 -49718 32794 93472 -1963 -85276 -1123
119a123R6353p5448j07803O8086J15142n5804j04716N3268R3354m2486o2045M0162
$$ -1123 95230 19782 -88021 -19935 95207 39403 -65313 -12045 81309 38823 -23222 16940
131A6940K2794m6660P408M6230l6153n8129L3125M8298l2856m1849K0619K0803
$$ 16940 39734 -6926 482 46712 10559 -47570 -14445 33853 997 -40852 -20233 570
143E70j5406L728K0175j7287k3282L0860L9575k7809n0394K1704N8025j1907n9365
$$ 570 -14836 -11108 9067 -8220 -31502 -642 38933 11124 -39270 -17566 40459 28552 -30813
156c0813n405L8150K793k1184J448o306k2873K2719M0247l1915m7497L6650N0087
$$ -30813 -36218 1932 4725 -16459 -15011 -21317 -44190 -21471 18776 -13139 -60636 -23986 26101
169B6101k8620l4902L2435K8376l0616j8506L3422J4861l6462k0224L1701K0648
$$ 26101 -2519 -37421 -4986 23390 -7226 -25732 7690 22551 -13911 -34135 -2434 18214
181A8214l3973k9346K4656K6413j5446j8222O405P428L934J3562J933k1485l45
$$ 18214 -15759 -45105 -20449 5964 -9482 -27704 -21299 -13871 -9937 3625 5558 -15927 -16272
194a6272L4376P558l1766n913K5929J386k0368O04R556j1454r405J3928N812j7469
$$ -16272 18104 25662 -6104 -12017 13912 15298 -5070 -4466 5090 -6364 -15769 -1841 3971 -13498
208a3498o902J7168J2787q786j1206Q470J6309J501n881J70k86M12R560J803k0457
$$ -13498 -20400 -3232 9555 769 -10437 -1967 14342 15843 9962 10132 9846 10258 19818 21621 1164
223A164j0987K1875J1096k7461j5917K2050J2373j8013r964J3720R961m547j831
$$ 1164 -9823 12052 23148 -4313 -20230 1820 14193 -3820 -13784 -64 9897 5350 3519
236C519M810J255J699N603l66o056k41N492j324r977l657N527r75r745k817O287
$$ 3519 8329 9584 11283 16886 16520 10464 10223 15715 14391 4414 757 6284 5309 -4436 -7253 -966
252i66O74o704J889Q715l429o518J0819J0855q732p266J0117P569p769o753K271
$$ -966 -292 -6996 -5107 3608 179 -6339 4480 15335 6603 -663 9454 17023 9254 2501 4772
267D772R4l107k81m023p770O76O538j235q614j037R456N106n336k530P334O497
$$ 4772 4866 1759 1478 -2545 -10315 -9639 -3101 -4336 -12950 -13987 -4531 575 -4761 -7291 43 6540
283F540k930l897M453L320n216k234L281l765o622J276J939n620l490M344R12
$$ 6540 3610 -287 4166 7486 2270 36 3317 -448 -7070 -5794 -3855 -9475 -12965 -8621 -7709
298g709m405K081N505j508j023O155L957k677r62M766L236l795m325P21J913k215
$$ -7709 -12114 -10033 -4528 -6036 -7059 -904 3053 376 -586 4180 7416 3621 -704 17 1930 -285
314b85n099j681K101j370k862J494N48j763L301M973j358j660N459M754k890j109
$$ -285 -5384 -7065 -4964 -6334 -9196 -7702 -7154 -8917 -5616 -643 -2001 -3661 1798 6552 3662 2553
330B553M683O8m152K68J357l168l245k8l54k106j380O54P98N01M87Q81K760K217
$$ 2553 7236 7304 3152 3420 4777 1609 -1636 -1664 -2018 -4124 -5504 -4850 -4052 -3551 -3064 -2183 577 2794
348B794l07J907L184m14k81J762j611l140R56J170m491m478K073J461l705j936
$$ 2794 2487 4394 7578 7164 6883 8645 7034 3894 4850 6020 1529 -2949 -876 585 -3120 -5056
364e056J669Q35N57J411R48Q16K244K493M50o84O45R98r1j110k330j594K14j942
$$ -5056 -3387 -2552 -1995 -584 364 1180 3424 5917 6367 5683 6328 7326 7235 6125 3795 2201 2415 473
382D73l234o29k9j179nJ286J10o33K102L376J47m31K409J623m66J79R8j391j573
$$ 473 -2761 -3390 -3419 -4598 -4603 -3317 -3207 -3840 -1738 1638 1785 1354 3763 5386 4920 5099 5197 3806 2233
401B233m11j230k711j297k16j411r45M22m49J89J600J009J640J916K14L22K540
$$ 2233 1822 592 -2119 -3416 -3632 -5043 -5988 -5566 -6015 -5826 -4226 -3217 -1577 339 553 875 3415
418C415K065j088k181LP18q27j422k691l091K78J612j536l384J58L748J631j336
$$ 3415 5480 4392 2211 2214 2932 2105 683 -2008 -5099 -4821 -3209 -4745 -8129 -7971 -4223 -2592 -3928
435c928L55K116K107K543P45j514L74K083L81j611k315k381o98J364n62m296j971
$$ -3928 -3573 -1457 650 3193 3938 2424 2798 4881 5262 3651 1336 -1045 -1743 -379 -941 -5237 -7208
452g208K519Q35j136P61J168P79K420J992k25P23K571J82j777O64R60k340j463
$$ -7208 -4689 -3854 -4990 -4229 -3061 -2282 138 2130 1905 2628 5199 5381 3604 4268 5228 2888 1425
469A425M85k178k741L38j51j406N64J053j235l83L199K875J34K32J65L94L502
$$ 1425 1910 -268 -3009 -2671 -2822 -4228 -3664 -2611 -3846 -4229 -1030 1845 1979 2211 2376 2770 6272
486F272K059m215k846L089R83l988k385J37j300m98Q10k165j833L513K480j593
$$ 6272 8331 4116 1270 4359 5342 1354 -1031 -894 -2194 -2692 -1882 -4047 -5880 -2367 113 -1480
502a480j48J327J027L767K999l690l942L826M381l154m539l87J34l20l61k883
$$ -1480 -1628 -301 726 4493 7492 3802 -140 3686 8067 4913 374 -13 121 -199 -560 -3443
518c443k449K284J794k143n32K860J328K84J866Rj901L065M115k788l592J312
$$ -3443 -5892 -3608 -1814 -3957 -4489 -1629 -301 -17 1849 1858 -43 3022 7137 4349 757 2069
534B069L77j959k56r38k444k90M15j827J51L029q59k604K936L386j010P67K559
$$ 2069 2446 487 231 -707 -3151 -3441 -3026 -4853 -4702 -1673 -2532 -5136 -2200 1186 176 943 3502
551C502j041j446K130J484j802j670p66j063p2n89k759j5K813j684l752K403M241
$$ 3502 2461 1015 3145 4629 2827 1157 391 -672 -744 -1333 -4092 -4107 -1294 -2978 -6730 -4327 -86
568h6k88j225J275R86Q98K558M74k772l93J803p15j044j91k235j846J055n11k417
$$ -86 -374 -1599 -324 662 1560 4118 4592 1820 1427 3230 2515 1471 1280 -955 -2801 -1746 -2257 -4674
586d674R38K556j001j435J867J261M66K675P03k152J011K276j068o44P92k672
$$ -4674 -3736 -1180 -2181 -3616 -1749 -488 -22 2653 3356 1204 2215 4491 3423 2779 3571 899
602H99k473K424J055m112j727K210o95j878J837J737n37O59R44k6J523J912q49
$$ 899 -1574 850 1905 -2207 -3934 -1724 -2419 -4297 -2460 -723 -1260 -601 343 317 1840 3752 2903
619B903m96J636l17k665O37J592k979k340J045q79j422J825J98k907N51L313R7
$$ 2903 2407 4043 3726 1061 1698 3290 311 -2029 -984 -1863 -3285 -1460 -1262 -4169 -3618 -305 -208
636b08n61K110O36j456J892J991j863n55J443j332k160N12j23j730k90j67j744
$$ -208 -769 1341 1977 521 2413 4404 2541 1986 3429 2097 -63 449 326 -1404 -1694 -1861 -3605
653c605Q0J900k42p53J583M97o22K618J994j976q09K395M27k317K0J056j626j760
$$ -3605 -3525 -1625 -1867 -2620 -1037 -540 -1162 1456 3450 1474 665 3060 3487 1170 1190 2246 620 -1140
671a140K10p44r77P81r0j431M64J542J28K11J058L00J11J602N91q30N67L26j771
$$ -1140 -930 -1674 -2651 -1870 -1960 -3391 -2927 -1385 -1257 -1046 12 312 423 2025 2616 1786 2353 2679 908
690I08n03J101j120j690L59l24j711N9J405m34o74J215Q61p6J002J135k07J47
$$ 908 405 1506 386 -1304 -945 -1269 -2980 -2921 -1516 -1950 -2624 -1409 -548 -624 378 1513 1306 1453
708A453P57J24k02m11l42l64o51r36p52J56L8j077o11J007N73m06P57R82qL27
$$ 1453 2210 2334 2132 1721 1379 1015 364 -572 -1324 -1168 -1130 -2207 -2818 -1811 -1238 -1644 -887 95 87 414
728D14J236N86n43L10N37q67o58M16o53j212l04l34m19k80j12J03K52K00J45P53
$$ 414 1650 2236 1693 2003 2540 1673 1015 1431 778 -434 -738 -1072 -1491 -1771 -1883 -1780 -1528 -1328 -1183 -430
748d30J097K75j42Q04N20l75J34K42o70o48mn10j042n15J20l31p12K57N38O3J86
$$ -430 667 942 800 1604 2124 1749 1883 2125 1455 807 803 293 -749 -1264 -1144 -1475 -2187 -1930 -1392 -1329 -1143
769a143O83M96L83M07P42K53m0l3Ll21k88o29o96q0o13o30n8j01l38J76M80P0
$$ -1143 -460 36 419 826 1568 1821 1781 1748 1751 1430 1142 513 -183 -263 -876 -1506 -1564 -1665 -2003 -1827 -1347 -1277
791a277K99Q88O65N8K10R13P2l16J3p4l31m92m83m46n58l86j65l84j67K62K19
$$ -1277 -978 -90 575 633 843 1756 1828 1512 1525 1451 1120 628 145 -301 -859 -1245 -1410 -1794 -1961 -1699 -1480
812a480K38N11K33N06P24L45J76L10K30k17k76O0m70q83j58j44p96l64k3j54j34
$$ -1480 -1242 -731 -498 8 732 1077 1253 1563 1793 1576 1300 1360 890 7 -151 -295 -1091 -1455 -1478 -1632 -1766
833a766K73L68J69M34P43K49K09O27K36p2J36j40l17o7m98o43l95k50m04l91l
$$ -1766 -1493 -1125 -956 -522 221 470 679 1306 1542 1470 1606 1466 1149 1082 584 -59 -454 -704 -1108 -1499 -1502
854a502J62j05J71N88K21K10O61M32J56K83L00K2k35m4k23n39m07k41o53k60L6
$$ -1502 -1340 -1445 -1274 -686 -465 -255 406 838 994 1277 1577 1599 1364 1320 1097 558 151 -90 -743 -1003 -967
875i67m51q5K50J75J43L96M34L17M00M35K20p2L16K1m91j22j81n58m08k36l66
$$ -967 -1418 -1503 -1253 -1078 -935 -539 -105 212 612 1047 1267 1195 1511 1532 1041 919 738 180 -228 -464 -830
896h30l73j01Q2o5J07L35L63J65M95L67K57K96J54j9l5j16k83l45l80j92m15l79
$$ -830 -1203 -1304 -1222 -1287 -1180 -845 -482 -317 178 545 802 1098 1252 1233 1198 1082 799 454 74 -118 -533 -912
918i12j25j56j43J62J04J41K31M83M47K03K13M59k2K6J28k24k71j99l61l58k61
$$ -912 -1037 -1193 -1336 -1174 -1070 -929 -698 -215 232 435 648 1107 1085 1111 1239 1015 744 545 184 -174 -435
939d35k28k62k14p0P6qL56L87R5K17N65K53J33J98J02j04k01l0j74m51k21k48
$$ -435 -663 -925 -1139 -1209 -1133 -1141 -785 -398 -303 -86 479 732 865 1063 1165 1061 860 830 656 205 -16 -264
961b64o16j10N3j51O7R4PK43M68M28R2K46M20N8p5J58j02l29j70k16m49n5j40
$$ -264 -880 -990 -937 -1088 -1021 -927 -920 -677 -209 219 311 557 977 1035 960 1118 1016 687 517 301 -148 -203 -343
984c43l50l89n4J58L5L18K59l1J85O08K27R9K74k3j16J24j20l17k26j34l79n50
$$ -343 -693 -1082 -1136 -978 -943 -625 -366 -397 -212 396 623 722 996 973 857 981 861 544 318 184 -195 -745
1006g45Q4l0k99M6J77j83K52O70K13J0J96K86pK71K48l32k50L8l21m94J25r9o08
$$ -745 -661 -691 -990 -944 -767 -950 -698 -28 185 195 391 677 670 941 1189 857 607 645 324 -170 -45 -144 -752
1029g52o7L3j56P5L70M1j47M11N09L9K77L10l02j54M16o2m33j30on72m00K34q2
$$ -752 -819 -786 -942 -867 -497 -456 -603 -192 317 356 633 943 641 487 903 841 408 278 272 -300 -700 -466 -548
1052e48l42J35R7k36L07M89m6J15M09J02o7M97J91n74j11K20m34l79L92k09p68
$$ -548 -890 -755 -658 -894 -587 -98 -144 -29 380 482 415 912 1103 529 418 638 204 -175 217 8 -760
1073g60N6J08k46L0M90j38j16M60L86j27K61M20k71j51M10o5m00N6k53n09m3K79
$$ -760 -704 -596 -842 -812 -322 -460 -576 -116 270 143 404 824 553 402 812 747 347 403 150 -359 -402 -123
1095a23k95k73J44q0k94M24N63k09J16M72o6j73N05J19k71j51J02k18l08J87k75
$$ -123 -418 -691 -547 -627 -921 -497 66 -143 -27 445 379 206 711 830 559 408 510 292 -16 171 -104
1116a04n31R8R9k17J59J62k06N5M70J70M4K50J32j39K1K08j59j94M5k05l10l8
$$ -104 -635 -537 -438 -655 -496 -334 -540 -485 -15 155 199 449 581 442 463 671 512 318 363 158 -152 -190
1138a90n5j94q1m3k8P7K07K32o9J04K26N0J59L12j32j24N7j64k11J7o7k46k10
$$ -190 -245 -439 -520 -563 -591 -514 -307 -75 -144 -40 186 236 395 707 575 451 508 344 133 150 83 -163 -373
1161c73Jq4j38K02K6k06K09L70rK16J20J5%J53jj00Rq5l52o8K3j70j92R7j55q5
$$ -373 -372 -456 -594 -392 -366 -572 -363 7 -2 214 334 349 349 502 501 401 410 325 -27 -95 -72 -242 -434 -337 -492 -577
1187e77J25J95k3J35J74J35j1J88K55k52N5R1j54j60L6j70k00j54k3q5l8J15j2
$$ -577 -452 -257 -280 -145 29 164 153 341 596 344 399 490 336 176 212 42 -158 -312 -335 -420 -458 -343 -355
1210c55j53K65K04q2K48J73p1P2K01m6j72L3n8j91j38N3j80j61M2m4j81J39J71
$$ -355 -508 -243 -39 -121 127 300 229 301 502 456 284 317 259 68 -70 -17 -197 -358 -316 -360 -541 -402 -231
1233b31MR9K05LJ39R4O7pk0R5j47p6m2j90j47o0j13q1K4K0Q6j26J85J80L1P9J69
$$ -231 -227 -128 77 80 219 313 380 373 353 448 301 225 183 -7 -154 -214 -327 -408 -384 -364 -278 -404 -219 -39 -8 71 240
1260B40M7N1R7l3o5r2j02p9j33jj31r5J1q9m4N5J07M2Q5J41J41R1L8O3K9l0K6
$$ 240 287 338 435 402 337 245 143 64 -69 -70 -201 -296 -285 -374 -418 -363 -256 -214 -129 12 153 244 282 345 374 344 370
1287C70p7j18n3o6j25j43n0r4NmP6J2Q9R7J14M0J32J01k7J23k5o9k4p3j57r1o8
$$ 370 293 175 122 56 -69 -212 -262 -356 -351 -355 -279 -267 -178 -81 33 73 205 306 279 402 377 308 284 211 54 -37 -105
1314a05mk27j5R0q7qJ34P6O6Q7J73L2P0Q3K1p3K7p1j08o9p3j82o1m4r3p2Q5jN2
$$ -105 -109 -336 -351 -261 -348 -356 -222 -146 -80 7 180 212 282 365 386 313 340 269 161 92 19 -163 -224 -268 -361 -433 -348 -349 -297
1343b97J30J35M8P4J68L4J9R5l0j08J9o5j06j29j41j34kp8K7P%J50P9kJ65M3R9
$$ -297 -167 -32 16 90 258 292 311 406 376 268 287 222 116 -13 -154 -288 -290 -368 -341 -334 -334 -184 -105 -107 58 101 200
1370B00J37Nl3M0p5p9l5o0j01j39o1r7r5K2M1rO3J24N1J37Q9R2J20m6O0L7j05
$$ 200 337 342 309 349 274 195 160 100 -1 -140 -201 -298 -393 -371 -330 -339 -276 -152 -101 36 125 217 337 291 351 388 283
1397B83o4K9j93j03n6j59l7n5j3M9J6J32mN0K07P9L3Q1Q0o8J4J4j15p9m4j24j55
$$ 283 219 248 55 -48 -104 -263 -300 -355 -368 -319 -303 -171 -175 -125 82 161 194 275 355 287 301 315 200 121 77 -47 -202
1424b02J6j11k7n0L2L0L1J68N2J08J11R0L7O1L9o6p2m4j2j35q3j37l5j15m9j4
$$ -202 -186 -297 -324 -374 -342 -312 -281 -113 -61 47 158 248 285 346 385 319 247 203 191 56 -27 -164 -199 -314 -363 -377
1450c77PP8N6J10R2J49Q6K1R3N1k7L1n9n7j11j58j8j67q7j3q4j8O4J6R9O7J24
$$ -377 -370 -292 -236 -126 -34 115 201 222 315 366 339 370 311 254 143 -15 -33 -200 -287 -300 -384 -402 -338 -322 -223 -156 -32
1477c2J40K9Q2R9L7K6j5o8j38Pj02k02r5m7Kp0n6N3O3R4J04R4K1J89QQ7J8J02
$$ -32 108 137 219 318 355 381 366 298 160 167 65 -137 -232 -279 -277 -347 -403 -350 -287 -193 -89 5 26 215 223 310 328 430
1505D30q7j9q1q9q1k16oj28q2k0N4kK4P2M9J69R8M4J24P5Q2m2Nmj69p3o0j31j75
$$ 430 343 324 243 154 73 -143 -149 -277 -359 -379 -325 -327 -303 -231 -182 -13 85 129 253 328 410 368 373 369 200 127 67 -64 -239
1534b39j6n6k5k1R2j6o2K05J37P6J70M7L6j0L2l3lj04l7j27j36j0j26j54L7m0
$$ -239 -255 -311 -336 -357 -265 -281 -343 -138 -1 75 245 292 328 318 350 317 314 210 173 46 -90 -100 -226 -380 -343 -383
1560c83j2Q5R9M8Q1J11N5J29J20Jk4k4L8j25p2p1j33j12m2jj49N5m9N6JK08M5
$$ -383 -395 -310 -211 -163 -82 29 84 213 333 334 310 286 324 199 127 56 -77 -189 -231 -232 -381 -326 -375 -319 -318 -110 -65
1587f5J13J12J21M1NP5j3q8j1j70j04o4j02j18n2Rp9L8P4K0O9J03J47Q7Q0J05
$$ -65 48 160 281 322 327 402 389 301 290 120 16 -48 -150 -268 -320 -311 -390 -352 -278 -258 -189 -86 61 148 228 333
1613C33J02j35L2j6m5p1o8j56o3n3j49n0L6l0l3Q8J60MJ84O9O8P8P3M3j05K9q3
$$ 333 435 300 332 316 271 200 132 -24 -87 -140 -289 -339 -303 -333 -366 -278 -118 -114 70 139 207 285 358 401 296 325 242
1640B42o7j52J5r7k07M9j20q0N2J41o3M4J54R0J04J47J9O4M6k9p1J2m1r7j61q7
$$ 242 175 23 38 -59 -266 -217 -337 -417 -365 -224 -287 -243 -89 1 105 252 271 335 381 352 281 293 252 155 -6 -93
1666i3p7j02j02J02j16PJ37K7R6J09J14M6O3J05Q8r3M9o4j05j6p2j81r7J3j03
$$ -93 -170 -272 -374 -272 -388 -381 -244 -217 -121 -12 102 148 211 316 404 311 360 296 191 175 103 -78 -175 -162 -265
1691b65n5q3R4lL6J45R3Q6J68P6oK0O5r2Jn6r8j22n8o0j19n3r4M0j1J02N3%J47
$$ -265 -320 -403 -309 -312 -276 -131 -38 48 216 292 286 306 371 279 280 224 126 4 -54 -114 -233 -286 -380 -340 -351 -249 -196 -196 -49
1720d9J49J3N5J83m5N2K0j03l9j31m3j07p6r8j02No2L6L6J02N2J15P4J07J34J8
$$ -49 100 113 168 351 306 358 378 275 236 105 62 -45 -121 -219 -321 -316 -378 -342 -306 -204 -152 -37 37 144 278 296
1746B96J0O3o3k2l0r7j29n4p6o5j23j8o6J8P5PJ16O4J31k9K25O5MJ15n0j7n3r3
$$ 296 306 369 306 284 254 157 28 -26 -102 -167 -290 -308 -374 -356 -281 -274 -158 -94 37 8 233 298 302 417 367 350 297 204
1774B04j11j16o8o7j09j06Pj5L0N1J09Q2N9J45Q1P0Q9L9l9O4l3j18k18Rq0j62
$$ 204 93 -23 -91 -158 -267 -373 -366 -381 -351 -300 -191 -109 -50 95 176 246 335 374 335 399 366 248 30 39 -41 -203
1800b03%j22k4Lo6J25O3M1J88P4P5J37K1P0K9q3j6p7j55k3j07j61k5j41R5j20
$$ -203 -203 -325 -349 -346 -412 -287 -224 -183 5 79 154 291 312 382 411 328 312 235 80 57 -50 -211 -236 -377 -282 -402
1826d02M0L8Q3J6J71J17O4P9O2O3L0j3%q3j09q1k07n8p9p0K3m9K7%N2J40R7J09
$$ -402 -362 -324 -241 -225 -54 63 127 206 268 331 361 348 348 265 156 75 -132 -190 -269 -339 -316 -365 -338 -338 -286 -146 -49 60
1854F0Q2J05K3P2J2J2j8j11j13m4j20j12q9q9oo7OL5P1J13R9Q2O3J22J03O0m0
$$ 60 142 247 270 342 354 366 348 237 124 80 -40 -152 -241 -330 -336 -403 -397 -362 -291 -178 -79 3 66 188 291 351 311
1881C11N8l0m6j53l9q4j22p2q8o7m6j9M9J1J84M7P2J05J39N1R6k3J2k5n6p6j35
$$ 311 369 339 293 140 101 17 -105 -177 -265 -332 -378 -397 -348 -337 -153 -106 -34 71 210 261 357 334 346 321 265 189 54
1908E4n7r9q2m0q5j5n7M7L5N3R9J00O2J28J32N8K7L7l6q7q2o4j25j19K5j93l3
$$ 54 -3 -102 -184 -224 -309 -324 -381 -334 -299 -246 -147 -47 15 143 275 333 360 397 361 274 192 128 3 -116 -91 -284 -317
1935c17qq3O6L5M1J43Q7Q3P5J09O1J6P4k6l0m4o5j35j56j50k3j03n0O8m1N5oR6
$$ -317 -325 -408 -342 -307 -266 -123 -36 47 122 231 292 308 382 356 326 282 217 82 -74 -224 -247 -350 -400 -332 -373 -318 -324 -228
1963b28J96J07J30P7rQ9Rp2K8n5q4k26l4n8j07j6n7n9m0J48m5O2J63R3J6K04P7
$$ -228 -32 75 205 282 273 362 371 299 327 272 188 -38 -72 -130 -237 -253 -310 -369 -409 -261 -306 -244 -81 12 28 232 309
1990C09N1k8O0q9o2j6q2j72q0m9j17r1N6r4L3J01Q7N1J15K16J1N0P4N4r4P0q7
$$ 309 360 332 392 303 241 225 143 -29 -109 -158 -275 -366 -310 -404 -371 -270 -183 -132 -17 199 210 260 334 388 294 364 277
2017B77j10j41L8k03o2n5Kj33j2R1OO7J47K4J49P0J56KN2jj30J1j0r2n9j10j24
$$ 277 167 26 64 -139 -201 -256 -254 -387 -399 -308 -302 -235 -88 -64 85 155 311 313 365 364 234 245 235 143 84 -26 -150
2044a50j39k9J6n4K5L9R4K4J93N6Q2O4J17QJj4rr8p1r6j25r5m3j46J0j7K1J8Q1
$$ -150 -289 -318 -302 -356 -331 -292 -198 -174 19 75 157 221 338 346 347 333 324 226 155 59 -66 -161 -204 -350 -340 -357 -336 -318 -237
2073b37Q0K5J11J83L6J04L9Rq8O7o2l9j67m0j41j08l5k8j10R5Q0p8J00R6J55k2
$$ -237 -157 -132 -21 162 198 302 341 350 262 329 267 228 61 21 -120 -228 -263 -291 -401 -306 -226 -304 -204 -108 47 25
2099B5K17J3P2O0n5j3j03m5q6j25K9r6j93p5M2l8N2J66j6kJ27J27L0J41K9k3O
$$ 25 242 255 327 387 332 319 216 171 85 -40 -11 -107 -300 -375 -333 -371 -319 -153 -169 -171 -44 83 113 254 283 260 266
2126B66R8m0k04K7p8j94k3k9p9q6N6j9K1R2J24L2M0J44N5M8J18mp9o2oj01j40
$$ 266 364 324 120 147 69 -125 -148 -177 -256 -342 -286 -305 -284 -192 -68 -36 4 148 203 251 369 365 286 224 218 117 -23
2153b3O4j19j75j5op1L6J08j6j3J42R0M5J60J04q9N0K0K9j21j1o5k25J2r0q2l2
$$ -23 41 -78 -253 -268 -274 -345 -309 -201 -217 -230 -88 2 47 207 311 222 272 292 321 200 189 124 -101 -89 -179 -261 -293
2180b93L0o4mJ40J02m4J26P9J02RJ47Qn6L8m9j30m3m3j90o6n5Np0pK4j8J27J08
$$ -293 -263 -327 -331 -191 -89 -133 -7 72 174 183 330 338 282 320 271 141 98 55 -135 -201 -256 -251 -321 -328 -304 -322 -195 -87
2208h7O3J6J69L6L5P2l2L1l5n7j24n4p7l9j77rQp1j9J47jO9Q2L9R1R4P4N8l3L8
$$ -87 -24 -8 161 197 232 304 272 303 268 211 87 33 -44 -83 -260 -269 -261 -332 -351 -204 -205 -136 -54 -15 76 170 244 302 269 307
2238C07n7o6j3o3j39o1m5p5q9J8RRM1J32K2O4J17R6l7J55m5k4K0m9m6p5m9j09
$$ 307 250 184 171 108 -31 -92 -137 -212 -301 -283 -274 -265 -224 -92 -70 -6 111 207 170 325 280 256 276 227 181 106 57 -52
2266e2n2q1o0l2k5K6J04l8J17M7J04N6J07Q2j9O1p9p3M4p4j36r8j1j49o7K6L1
$$ -52 -104 -185 -245 -277 -302 -276 -172 -210 -93 -46 58 114 221 303 284 345 266 193 237 163 27 -71 -82 -231 -298 -272 -241
2293b41k8J4J19o0J39N2P7J17L0M9o1J26j15l2p4l7j08j13k4l5q2m1R0N0qQ0Q4
$$ -241 -269 -255 -136 -196 -57 -5 72 189 219 268 207 333 218 186 112 75 -33 -146 -170 -205 -287 -328 -238 -188 -196 -116 -32
2320c2oJ29P3P1L1K0K9k8j8j37p9n4n5r2m9j07j5k1O3J11JQ1Q6O4O2R8M6N3o3
$$ -32 -38 91 164 235 266 286 315 287 269 132 53 -1 -56 -148 -197 -304 -319 -340 -277 -166 -165 -84 2 66 128 226 272 325 262
2349B62L4j5j07p6m2j26m1m1j10k2K5j4N0N1l4K24L3O9M3K3J07K0m4j02K5j00
$$ 262 296 281 174 98 56 -70 -111 -152 -262 -284 -259 -273 -223 -172 -206 18 51 120 163 186 293 313 269 167 192 92
2375I2q7o6l3j35j7qm3K0N9JQ4N5Q8R5R9J08j08L2R0r1k4o5o2q7n4j17Pp8n8L6
$$ 92 5 -61 -94 -229 -246 -254 -297 -277 -218 -217 -133 -78 10 105 204 312 204 236 326 235 211 146 84 -3 -57 -174 -167 -245 -303 -267
2405b67K6M0L7R7O1R6O7L7K8L8M0n6k5q7nj13j43p4%o6k3J8oO1L9O1J19N9J23
$$ -267 -241 -201 -164 -67 -6 90 157 194 222 260 300 244 219 132 127 14 -129 -203 -203 -269 -292 -274 -280 -219 -180 -119 0 59 182
2434A82J5N4J6O0j0r6l6p9l0j54n6m3j1q1qL5mJ65k1R1K1J22LR0M8l5m2k3J7p6
$$ 182 197 251 267 327 317 221 185 106 76 -78 -134 -177 -188 -269 -277 -242 -246 -81 -102 -11 10 132 135 225 273 238 196 173 190 114
2464A14o1j25j8n5n8k1p0J3R5LM0J41K7k0J55m1J24nK7J3j39L0j41k1o7l4r7r1
$$ 114 53 -72 -90 -145 -203 -224 -294 -281 -186 -183 -143 -2 25 5 160 119 243 238 265 278 139 169 28 7 -60 -94 -191 -282
2492b82L1%M2O1RO2N6P9J05lM7K2l0K3n5l8j01lj32k3j04N5k4j11J44k3k9J32
$$ -282 -251 -251 -209 -148 -139 -77 -21 58 163 160 207 229 199 222 167 129 28 25 -107 -130 -234 -179 -203 -314 -170 -193 -222 -90
2520i0L8N8P1P6K5KJ06n8n8k5n8r9n4k2n5j32R7p4qL6L7M6N0J14K3R6P2klJ8l
$$ -90 -52 6 77 153 178 180 286 228 170 145 87 -12 -66 -88 -143 -275 -178 -252 -260 -224 -187 -141 -91 23 46 142 214 212 209 227 224
2551B24m5n5j17l0o9p3lm1n3R4j5M0L0J14l5R5L9P5o0J41o7k6O1q7q3l1p1q9q2
$$ 224 179 124 7 -23 -92 -165 -168 -209 -262 -168 -183 -143 -113 1 -34 61 100 175 115 256 189 163 224 137 54 23 -48 -137 -219
2580b19O8l3k0P1m1L9L0N8J09O0PP0k7K4K8q9Jq0l4p6Lq1m4l4J7j1L4P4j7P0P5
$$ -219 -151 -184 -204 -133 -174 -135 -105 -47 62 122 129 199 172 196 224 135 136 56 22 -54 -51 -132 -176 -210 -193 -204 -170 -96 -113 -43 32
2611C2L5k3J48k7m3N5K3j29J7l5l6j23kL3r3o4qL4L6Q5j5J03N4O1N4j15J41j0
$$ 32 67 44 192 165 122 177 200 71 88 53 17 -106 -108 -75 -168 -232 -240 -206 -170 -85 -100 3 57 118 172 57 198 188
2639A88J1m8o5m8l6nr0k5n0m1JR5%j6L4J09K1mP8R7q7O1K3r0Jk0p3p9jn0j09K3
$$ 188 199 151 86 38 2 -3 -93 -118 -168 -209 -208 -113 -113 -129 -95 14 35 31 109 206 119 180 203 113 114 94 21 -58 -59 -109 -218 -195
2671a95M8n1n9J55k4J07M5K8K5N7O3p8qP9q7J7m6j0o1j28K6j08k1O5K3J4lL1J10
$$ -195 -147 -198 -257 -102 -126 -19 26 54 79 136 199 121 113 192 105 122 76 66 5 -123 -97 -205 -226 -161 -138 -124 -127 -96 14
2700A4k0J33m0J4K1K1n2P5j9j07Lr1K2q8m5n7O1NL3K6%Q2N2r8J12R4j9J0K5o4
$$ 14 -6 127 87 101 122 143 91 166 147 40 43 -48 -26 -114 -159 -216 -155 -150 -117 -91 -91 -9 43 -55 57 151 132 142 167 103
2730A03j8kk3j01q1K3m1o4J25o8J3P0n4N0N8Q2R2q1L8L5p0J07o3o9j4Qj17n4M
$$ 103 85 83 60 -41 -122 -99 -140 -204 -79 -147 -134 -64 -118 -68 -10 72 164 83 121 156 86 193 130 61 47 55 -62 -116 -112
2759a12L0r3P2Kq1P9J04n6M6J06J0RQjk6k7N1p9j3pq5n5oN6j12M4nJ9K9J02PN0
$$ -112 -82 -175 -103 -101 -182 -103 1 -55 -9 97 107 116 124 123 97 70 121 42 29 22 -63 -118 -124 -68 -180 -136 -141 -122 -93 9 16 66
2791F6K0O0rJ0k2k3j0m9J2p6n7l6J2m6k8L6PL0O0k2L3M6N5ML0P7o3k8Rn7j4r1
$$ 66 86 146 137 147 125 102 92 43 55 -21 -78 -114 -102 -148 -176 -140 -133 -103 -43 -65 -32 14 69 73 103 180 117 89 98 41 27 -64
2823f4L4o1j6Pk0l3J9K6j0Q2M3M0%O4N4n6J1nk6jl8n1k7p7j3j4J5l0RM8oM3%P2
$$ -64 -30 -91 -107 -100 -120 -153 -134 -108 -118 -36 7 47 47 111 165 109 120 115 89 88 50 -1 -28 -105 -118 -132 -117 -147 -138 -90 -96 -53 -53 19
2857A9N5l2Q3k8K7j8l0k6j8l2l9k6r1O7o9P5m0J9k7P1P6l2R3rk2R0Rm1n3K1k5
$$ 19 74 42 125 97 124 106 76 50 32 0 -39 -65 -156 -89 -158 -83 -123 -104 -131 -60 16 -16 77 68 46 136 145 104 51 72 47
2888D7L8p1j47P0m5J4j1m0N3nQ1k7L5QR7jlL0o5L2l4j7oj1l7m5m6J3n9J07l6L5
$$ 47 85 14 -133 -63 -108 -94 -105 -145 -92 -97 -16 -43 -8 0 97 96 93 123 58 90 56 39 33 22 -15 -60 -106 -93 -152 -45 -81 -46
2920d6k5O4J9L3k0J02n4KJ0l1O5o7o4Njk5p0j1N9l1j9J02Rj5qJ0N6J0M4oM8j2
$$ -46 -71 -7 12 45 25 127 73 75 85 54 119 52 -12 -7 -8 -33 -103 -114 -55 -86 -105 -3 6 -9 -17 -7 49 59 103 97 145 133
2952A33n1%k3q8m1N2p1J9j0rM2n5N2L4K1KN0pl9Q1K0p4O1o1K8n7n3K3o8K5K3n6
$$ 133 82 82 59 -29 -70 -18 -89 -70 -80 -89 -47 -102 -50 -16 5 7 57 50 11 92 112 38 99 38 66 9 -44 -21 -89 -64 -41 -97
2984i7L2j0O8l0L4J4L8O5n0JQQl2N6q0k7k4k6M1Jm0k0rJ3L0m6O7M8l7N9L1m3J9
$$ -97 -65 -75 -7 -37 -3 11 49 114 64 65 73 81 49 105 25 -2 -26 -52 -11 -10 -50 -70 -79 -66 -36 -82 -15 33 -4 55 86 43 62
3017F2Rn0l9Q2o5l0K3k6l8L7l8j4L7Qk6N3J0l8M0M9O8j2J5p8O5o1K5m1L8j00m6
$$ 62 71 21 -18 64 -1 -31 -8 -34 -72 -35 -73 -87 -50 -42 -68 -15 -5 -43 -3 46 114 102 117 39 104 43 68 27 65 -35 -81
3048h1M6m2N6k9l7Q7k0Jl5Q0j1j4O7mm0K4pK0j0j9L7j25L3k2J0K2l2l0J7M5R0
$$ -81 -35 -77 -21 -50 -87 0 -20 -19 -54 26 15 1 68 64 24 48 41 61 51 32 69 -56 -23 -45 -35 -13 -45 -75 -58 -13 77
3079G7o2j7M1l5L4O6p9m0RM5l2l3O8lr5N1j5o2J38n1m1J8oL7l6P1j5j8nR0n5o
$$ 77 15 -2 39 4 38 104 25 -15 -6 39 7 -26 42 39 -56 -5 -20 -82 56 5 -36 -18 -24 13 -23 48 33 15 10 100 45 39
3111C9K0l6k0k8L9r5J3M5k9l2R7l3M7l1Q0j12P9qk3j0O9l2l5k4N8n1n2Q4o9l8
$$ 39 59 23 3 -25 14 -81 -68 -23 -52 -84 13 -20 27 -4 76 -36 43 35 12 2 71 39 4 -20 38 -13 -65 19 -50 -88
3141h8N6L1l3n3Q4m7J5J31p2p8N5M6k5LL3L9p1k4l4J6Ok8J6oK8k4Mn6M0j6O0L2
$$ -88 -32 -1 -34 -87 -3 -50 -35 96 24 -54 1 47 22 25 58 97 26 2 -32 -16 -10 -38 -22 -28 0 -24 -20 -76 -36 -52 8 40
3173D0Ok5M7n0k6O1j3j04O4nm3PO4o8J0KM2n0L7L4m3K4j6N9j05O1J0jp8J3N9p7
$$ 40 46 21 68 18 -8 53 40 -64 0 -5 -48 -41 23 -45 -35 -33 9 -41 -4 30 -13 11 -5 54 -51 10 20 19 -59 -46 13 -64
3205f4P1k0n9L3K9m5KL2M3n7J02m4LO3m1n0N9l2k1o1M2NN7n4J4l8rJ4j9OK4k9
$$ -64 7 -13 -72 -39 -10 -55 -53 -21 22 -35 67 23 26 89 48 -2 57 25 4 -57 -15 -10 47 -7 7 -31 -40 -26 -45 -39 -15 -44
3237d4OK2N3n3N9l0LL9m4Pm3O3q3K5NJ4k2J2k5L5k2RL3M1K7m8L0q4O6l7m3L3o
$$ -44 -38 -16 37 -16 43 13 16 55 11 18 -25 38 -45 -20 -15 -1 -23 -11 -36 -1 -23 -14 19 60 87 39 69 -15 51 14 -29 4 -2
3270bj7K0l9M3J7m6pk1J0N9n0J3N5nl0M3j8M0o5lL7p5N0np5M9k9l5P7n1J7K7m
$$ -2 -19 1 -38 5 22 -24 -31 -52 -42 17 -33 -20 35 30 0 43 25 65 0 -3 34 -41 9 4 -71 -22 -51 -86 -9 -60 -43 -16 -20
3303b0L2lk9M6m6Q3q7N3N0q6Rn5M3m6N2n9O1p9M4L1oN8l8pK3k2M2k6L2o0Q1o4
$$ -20 12 9 -20 26 -20 63 -24 29 79 -7 2 -53 -10 -56 -4 -63 -2 -81 -37 -6 -12 46 8 1 24 2 44 18 50 -10 71 7
3335GK9kj05N2K5Lo1O3L3rj00M0M2p0Q6j1k7j5J9M9j2k9q4M6rL6n1M9j5L5n3N6
$$ 7 36 34 -71 -19 6 9 -52 11 44 35 -65 -25 17 -53 33 22 -5 -20 -1 48 36 7 -77 -31 -40 -4 -55 -6 -21 14 -39 17
3367A7j10M3R1l6pj7K6m6M3K9J6o5j1Q3m6l5Jl9N1k3k0K4J2J5K4l0oPP0o9M3l5
$$ 17 -93 -50 41 5 -2 -19 7 -39 4 33 49 -16 -27 56 10 -25 -24 -63 -12 -35 -55 -31 -19 -4 20 -10 -16 -9 61 -8 35 0
3399@j5M3j5KK5o0ML3r0M9P8q1KL1PK7j7k7l2L1K2K7k7j9j1L6n1M1m3L2n3O4l9
$$ 0 -15 28 13 15 40 -20 -16 17 -73 -24 54 -27 -25 6 13 40 23 -4 -36 -5 17 44 17 -2 -13 23 -28 13 -30 2 -51 13 -26
3432b6L7n3K3M8k3J4RJ2m8J04m7Km5L8J6m5m5lOM1o8L8L3J3q7M8jj1KK0P8q2P3
$$ -26 11 -42 -19 29 6 20 29 41 -7 97 50 52 7 45 61 16 -29 -32 -26 15 -53 -15 18 31 -56 -8 -9 -20 -18 2 80 -2 71
3465G1l3j0K9p3J1j5O6p2O6o3M0l9K6j9k5M5K5o3M0rm8O6j4N9k5n1M2n0L3qkK
$$ 71 38 28 57 -16 -5 -20 46 -26 40 -23 17 -22 4 -15 -40 5 30 -33 7 -2 -50 16 2 61 36 -15 27 -23 10 2 0 2
3497Bp2N5l5R7j2l4M1pk7J6jl4M6j7NLj6qL5mo4l8K6M9p0%O2l0P1q0K9J7J3j1
$$ 2 -70 -15 -50 47 35 1 42 35 8 24 23 -11 35 18 23 26 10 2 37 33 -31 -69 -43 6 -64 -64 -2 -32 39 -41 -12 5 18 7
3531GQo1K8P8m5l8Qk2N0p9R6l1m1K3Qj9L9k3M2K1l7J6J0n1J5jQ6m3l6L3l2m1L2
$$ 7 15 -46 -18 60 15 -23 -15 -37 13 -66 30 -1 -42 -19 -11 -30 9 -14 28 49 12 28 38 -13 2 1 87 44 8 41 9 -32 0
3564@RNn0pO5n3Q0r0N1L4jRk7Qj4N4o0j1L6q3M3j3l6P2Pl8Kj8K9mnR1rr2N1j3
$$ 0 9 14 -36 -43 22 -31 49 -41 10 44 43 52 25 33 19 73 13 2 38 -45 -2 -15 -51 21 28 -10 -8 -26 3 -1 -6 85 76 -16 35 22
3600B2n4J16q8mk1L5j8k6J4n3j3J1P2J4M6K9n2o8N0RJ0j0K8l6L1k1Om8K6j3m2
$$ 22 -32 84 -4 -8 -29 6 -12 -38 -24 -77 -90 -79 -7 7 53 82 30 -38 12 21 31 21 49 13 44 23 29 -19 7 -6 -48
3631d8K3L4k4j4kJ9j2pR5Lj5k9l4K0KJ0o5N4l1j0l4J5J0pLJ0K3kl4j7Q1j5N0L
$$ -48 -25 9 -15 -29 -31 -12 -24 -31 64 67 52 23 -11 9 11 21 -44 10 -21 -31 -65 -50 -40 -47 -44 -34 -11 -13 -47 -64 17 2 52 55
3665E5m5M6j9o3J13p6J7k7J7l4j8m0J3O0q8N0RJ20p1K2p3J07pl0m2O6o0k2M8m4
$$ 55 10 56 37 -26 87 11 28 1 18 -16 -34 -74 -61 -1 -89 -39 -30 90 19 41 -32 75 68 38 -4 62 2 -20 28 -16
3695a6M8m5j9j7M9m1jM2mmpM3P7j35R6q2K8PM5k9j09P3q2J7M1k7J1o3J32j5k7
$$ -16 32 -13 -32 -49 0 -41 -42 0 -4 -8 -15 28 105 -30 66 -16 12 19 64 35 -74 -1 -83 -66 -25 -52 -41 -104 28 13 -14
3726a4O9p6P4k3M0n7K8M6p8L4Pm7QrJ0n2k3J8K1Pk7N3n2P0%K5k8M5j33N5N4l3
$$ -14 55 -21 53 30 70 13 41 87 9 43 50 3 11 2 12 -40 -63 -45 -24 -17 -44 9 -43 27 27 52 24 69 -64 -9 45 12
3758A2m4J0J2p2N6On7J09r1O3m3QO7om5j0L8L5K3Ln7k0M1Km8lk7j3j8K0RM3Qj8
$$ 12 -32 -22 -10 -82 -26 -20 -77 32 -59 4 -39 -31 36 30 -15 -25 13 48 71 74 17 -3 38 40 -8 -11 -38 -51 -69 -49 -40 3 11 -7
3792gJ8j6j4kP3k9jL5o5L9Qp1M4m0K7Pk4k1J6j3o7N1P6o8J02n6p2R8J0ml3N%k0
$$ -7 11 -5 -19 -21 52 23 22 57 -8 31 39 -32 12 -28 -1 6 -18 -39 -23 -36 -103 -52 24 -44 58 2 -70 28 38 34 1 6 6 -14
3826a4njm5K2K2mj2l0K0L7j4K8J5m0O7J5n6pK8lm0L9k2Nl3j7K2m1J8pK6Jj8P4
$$ -14 -19 -20 -65 -43 -21 -25 -37 -67 -47 -10 -24 4 19 -21 46 61 5 -2 26 23 -17 22 0 5 -28 -45 -23 -64 -46 -53 -27 -26 -44 30
3860C0k0j5R1j5k5j9pJ3Pl0J9p5PO8r4k7K9k3P3l7jN8n9R2m4R4m3o8P7p0K3P3
$$ 30 10 -5 86 71 46 27 20 33 40 10 29 -46 -39 29 -65 -92 -63 -86 -13 -50 -51 7 -52 40 -4 90 47 -21 56 -14 9 82
3892H2r1P2n1k0l9O4j7k3j9Pk5Q3RJ0p5R7n7J4Rj1j5NK7j7n1k9K0M8mo6K3j3N0
$$ 82 -9 63 12 -8 -47 17 0 -23 -42 -35 -60 23 32 42 -33 64 7 21 30 19 4 9 36 19 -32 -61 -41 7 3 -63 -40 -53 -3
3925cj5K6M0l1K3Nj9P3j36O4K8m4MM1m7o2K0j2k8Q7l0m9L9N%JM5N0l9n7N6Nn1
$$ -3 -18 8 48 17 40 45 26 99 -37 27 55 11 15 56 9 -53 -33 -45 -73 14 -16 -65 -26 -21 -21 -20 25 75 36 -21 35 40 -11
3958a1L5j5nl9rL5j03Q5j2%j9N1M9j5N7r1K7L4J2n4O1k7l3k6L7q5N7k5k1m6L7
$$ -11 24 9 4 -35 -44 -9 -112 -27 -39 -39 -58 -7 42 27 84 -7 20 54 66 12 73 46 13 -13 24 -61 -4 -29 -50 -96 -59
3989e9j8M7pP6l3RJ9L2j3rk0L0j1J1n3%lLO1j25L8p8N2M8l4j6L1oN7j9N5l0mN9
$$ -59 -77 -30 -37 39 6 15 34 66 53 44 24 54 43 54 1 1 -2 1 62 -63 -25 -103 -51 -3 -37 -53 -22 -28 29 10 65 35 31 90
4023I0m6o2K8M0l3m4K0j4o5K6j5J1R5r3K8M4rM6kMJ7n0J6kk2K1k1k0k3Rj01M5
$$ 90 44 -18 10 50 17 -27 -7 -21 -86 -60 -75 -64 31 -62 -34 10 1 47 45 49 66 16 32 30 8 29 8 -12 -35 -26 -127 -82
4055h2J0J5MN5L0n0L6O5Mq2J00J4l9j5q4K6l8L0J5p7OL1J6p3QJ1M8j0Q9l9j7K
$$ -82 -72 -57 -53 2 32 -18 18 83 87 5 105 119 80 65 -19 7 -31 -1 14 -63 -57 -26 -10 -83 -75 -64 -16 -26 63 24 7 9
4087IM3O0m1mq1L6J8p6nO0m9r9J03Jm3k1L0J9M1L7L5n3K7j0QK7r8P2k8Jm0l4L0
$$ 9 52 112 71 67 -14 22 40 -36 -41 19 -30 -129 -26 -25 -68 -89 -59 -40 1 38 73 20 47 37 45 72 -26 46 18 19 -21 -55 -25
4120b5n0mN7K5l4K5K9J0L8l0K8j7L7j7m0J3qj3j19J04l0K9p9L6m6k6N7J4R2n0
$$ -25 -75 -79 -22 3 -31 -6 23 33 71 41 69 52 89 72 32 45 37 24 -95 9 -21 8 -71 -35 -81 -107 -50 -36 56 6
4150FJ6O8l4orK8j6kp1N1l6j6m6M0l5k6Q4n4LmQ9p6J4Q3L2o3K8L9l5Rpo3l7M4
$$ 6 22 90 56 50 41 69 53 51 -20 31 -5 -21 -67 -27 -62 -88 -4 -58 -55 -59 30 -46 -32 51 83 20 48 87 52 61 54 -9 -46 -2
4184bn4K9r1L7N6p7LO1k4O2K5j9K8J5L7k2J4k5pl6M3m3r2M0p5J5jP7l5MmO1K8
$$ -2 -56 -27 -118 -81 -25 -102 -99 -38 -62 0 25 6 34 49 86 64 78 53 46 10 53 10 -82 -42 -117 -102 -103 -26 -61 -57 -61 0 28
4217B8rM8m5N5l2M1qm4oLo4L6q7M9l7k6k5P8o7OJ50k1Rm3R8o0Q1mqo9M5q6J0m0
$$ 28 19 67 22 77 45 86 78 34 28 31 -33 3 -84 -35 -72 -98 -123 -45 -112 -106 44 23 32 -11 87 27 108 104 96 27 72 -14 -4 -44
4251d4lql5mL0rk4P9m3K3O3Qk8O0k6M1qlq9O6k0q6L8jl2j0K5l2L8jQJ4%N2l6M4
$$ -44 -47 -55 -90 -94 -64 -73 -97 -18 -61 -38 25 33 5 65 39 80 72 69 -20 46 26 -60 -22 -23 -55 -65 -40 -72 -34 -35 -27 -13 -13 39 3 47
4287D7K9k2pL9j3l6n1R6j14M6k3k4k0M3l6l1N3O6j4l0L5k1J4Q0k9l7M2j4l6J5
$$ 47 76 54 47 86 73 37 -14 82 -32 14 -9 -33 -53 -10 -46 -77 -24 42 28 -2 33 12 26 106 77 40 82 68 32 47
4317D7l2o3l1n5M9L9J8l8L3M7K6l3K9N1On7m9M8L5p8O9q2kK4kj7k7lPm4K3J2O4
$$ 47 15 -48 -79 -134 -85 -46 -28 -66 -33 14 40 7 36 87 93 36 -13 35 70 -8 61 -21 -23 1 -1 -18 -45 -48 -41 -85 -62 -50 14
4350A4lj6N4j4L8K7j9j0o4M9l1pl8j6p7O5M0o8K7pP5%k0j0J4nM2PL6n3J0K7n9
$$ 14 11 -5 49 35 73 100 81 71 7 56 25 18 -20 -36 -113 -48 -8 -76 -49 -56 19 19 -1 -11 3 -2 40 47 83 30 40 67 8
4383Hj8j0j8n2N9l9K4j8K9L1k5N3qJ2Nj6K0K7J5Lm7L7q8M1o1l1L2l7K7m2M7k6
$$ 8 -10 -20 -38 -90 -31 -70 -46 -64 -35 -4 -29 24 16 28 33 17 37 64 79 82 35 72 -16 25 -36 -67 -35 -72 -45 -87 -40 -66
4415f6L7J6J2N6j5K0o0R7k9k3L5n6j8LPj06K5P0p9j3oJ2L7j1L4%P7l3L6J9l6N4
$$ -66 -29 -13 -1 55 40 60 0 97 68 45 80 24 6 9 16 -90 -65 5 -74 -87 -93 -81 -44 -55 -21 -21 56 23 59 78 42 96
4447I6lj02P9l8q3M1J7o2j7nj4M1M5p2K7Q1J9J4j5M0o0L9J5K5p5l0L1q3K9qq1
$$ 96 93 -9 70 32 -51 -10 7 -55 -72 -77 -91 -50 -5 -77 -50 31 50 64 49 89 29 68 83 108 33 3 34 -49 -20 -28 -109
4478a09P3Rj03P3P0o8Q6mJP2n8lj2RL2n7M1l8K2q6j5Qj6p9M7K4M0PM4n1R0KMK3
$$ -109 -36 -27 -130 -57 13 -55 31 27 28 100 42 39 27 36 68 11 52 14 36 -50 -65 -57 -73 -152 -105 -81 -41 -34 10 -41 49 51 55 78
4512G8k0k2J9k3K5k7m5k2K5p6n9J04n1L5K5M8n5LK9J0N5J2mK1On9L1m7ql4m0J4
$$ 78 58 36 55 32 57 30 -15 -37 -12 -88 -147 -43 -94 -59 -34 14 -41 -38 -9 1 56 68 64 85 91 32 63 16 8 -26 -66 -52
4544e2j3Jl9J7O9n0J4M1M4N3o5N0Kj0l0P8p1j5j0k8k9J6pk1%l6M8K7m6J02p3R6
$$ -52 -65 -64 -103 -86 -17 -67 -53 -12 32 85 20 70 72 62 32 110 39 24 14 -14 -43 -27 -34 -55 -55 -91 -43 -16 -62 40 -33 63
4576F3j2k3P4k7j6j5K1%m5k8P9j51L5l7Q6j4q2j0R5pQK4j03J48R5j06K8Nj0j05
$$ 63 51 28 102 75 59 44 65 65 20 -8 71 -80 -45 -82 4 -10 -92 -102 -7 -14 -6 18 -85 63 158 52 80 85 75 -30
4606c0P4o1m0O4q6jMmMJN4L6j0N8n%K5p2O5n9K7J0q4nPjK2j9o7J6j3K7N0J1L8
$$ -30 44 -17 -57 7 -79 -80 -76 -80 -76 -75 -21 15 5 63 58 58 83 11 76 17 44 54 -30 -35 -28 -29 -7 -26 -93 -77 -90 -63 -13 -2 36
4641C6jRpLL5k0O8p0k6j7J4l6n6k5M8m3M1pjLN3K5J0L8Mk4k0M0PQl7o9j4R8j28
$$ 36 35 44 37 40 75 55 123 53 27 10 24 -12 -68 -93 -45 -88 -47 -54 -55 -52 1 26 36 74 78 54 34 74 81 89 52 -17 -31 67 -61
4676f1mk9J4k4P8l3M4j7M2M7m6K2j1J8K0j8L1L4j3j20Q2l2o2J7p5P2n3M1l6OM2
$$ -61 -65 -94 -80 -104 -26 -59 -15 -32 10 57 11 33 22 40 60 42 73 107 94 -26 56 24 -38 -21 -96 -24 -77 -36 -72 -66 -24
4707b4O3Mn5P1oQ0n8j3k9J6l2m5%Rn9LlM0k0K0K1Qj3O1K6n4L6N3m0n1N7m2Pm0
$$ -24 39 43 -12 59 53 133 75 62 33 49 17 -28 -28 -19 -78 -75 -78 -38 -58 -38 -17 -9 -22 39 65 11 47 100 60 9 66 24 31 -9
4741iO0q4m4P6o3k3Q1k6j2Q2k7l5P1k7K4l1J23r4j2%j7nk0k5J7m2OL9m1j3O1J
$$ -9 51 -33 -77 -1 -64 -87 -6 -32 -44 38 11 -24 47 20 44 13 136 42 30 30 13 8 -12 -37 -20 -62 -56 -17 -58 -71 -10 -9
4773iL3M3p7k1J61o0n7K0L6m9K7l2k2k4J2Lmp9N9n3K8M6l2K7PN9o9J3M0N8l8j2
$$ -9 24 67 -10 -31 130 70 13 33 69 20 47 15 -7 -31 -19 -16 -20 -99 -40 -93 -65 -19 -51 -24 -17 42 -27 -14 26 84 46 34
4805C4J9n7Mj4k9rJ2l9J3L9j3l2N9k9oJ17k8NL5k9k5N5j06K5N5n9P4r5J7l1m7
$$ 34 53 -4 0 -14 -43 -52 -40 -79 -66 -27 -40 -72 -13 -42 -48 69 41 46 81 52 27 82 -24 1 56 -3 71 -24 -7 -38 -85
4836h5O5k3rN5lml6N2%N6Nk7M8j13J5L1o6K9l6N8p9k9N8nNRL8n1N9K0m7R0j6L9
$$ -85 -20 -43 -52 3 0 -4 -40 12 12 68 73 46 94 -19 -4 27 -39 -10 -46 12 -67 -96 -38 -43 -38 -29 9 -42 17 37 -10 80 64 103
4870A03l1m9K2n2mk4O0p6j2L8K7o3l4P3k2J7L1n7K6O0pqPNK2j1Rj6m1j0k3q4N2
$$ 103 72 23 45 -7 -11 -35 25 -51 -63 -25 2 -61 -95 -22 -44 -27 4 -53 -27 33 26 18 25 30 52 41 50 34 -7 -17 -40 -124 -72
4903g2PM6l4k4P0o8N9QM9j5oK3J3K0o3n7L4O3j35N9k3Ql8M5j6PL5L4j5K3Qk3L1
$$ -72 -65 -19 -53 -77 -7 -75 -16 -8 41 26 20 43 56 76 13 -44 -10 53 -82 -23 -46 -38 -76 -31 -47 -40 -5 29 14 37 45 22 53
4936E3l5N5l4n9O8k8j1j5q7K0L4m8N1JJ0J4j7N1l5K8L8L2j9l4J4K2n5m3K7k9m0
$$ 53 18 73 39 -20 48 20 9 -6 -93 -73 -39 -87 -36 -35 -25 -11 -28 23 -12 16 54 86 67 33 47 69 14 -29 -2 -31 -71
4967g1K2Prk1M4J1j8K5N2nJ1J9j3K8n8Jj9J5l7N7m5M3q9m7L5K2m0k6O7N5k2N0
$$ -71 -49 -42 -51 -72 -28 -17 -35 -10 42 37 48 67 54 82 24 25 6 21 -16 41 -4 39 -50 -97 -62 -40 -80 -106 -39 16 -6 44
4999D4NK9J5m8qk1k4MK1L9j7o6ok5l4P1m5O7n3k8Q6K2N3m0M5m1pk5rj1L8Ol9k1
$$ 44 49 78 93 45 37 16 -8 -4 17 56 39 -27 -33 -58 -92 -21 -66 1 -52 -80 6 28 81 41 86 45 38 13 4 -7 31 37 -2 -23
5033b3j1j1j9J9jj7J3M8N0k3%J0k5k5Q1l7K9m9n0M9jo2M0n0N4K6m2KJ1o8Q5L7
$$ -23 -34 -45 -64 -45 -46 -63 -50 -2 48 25 25 35 10 -15 66 29 58 9 -41 8 7 -55 -15 -65 -11 15 -27 -25 -14 -82 3 40
5065D0k2j5jM6n2MO7m4j5l8R7p4l9N8r2N1K7j4m3K7j4N1l2L2L3j6K6M8q3N9k0
$$ 40 18 3 2 48 -4 0 67 23 8 -30 67 -7 -46 12 -80 -29 -2 -16 -59 -32 -46 5 -27 5 38 22 48 96 13 72 52
5096E2k7O9o0o0l0P5j03j6M4M8m4K0%N3k7O8j2p4Q7K5m2ql3Qjo6M4j6j5n2N5k
$$ 52 25 94 34 -26 -56 19 -84 -100 -56 -8 -52 -32 -32 21 -6 62 50 -24 63 88 46 38 5 13 12 -54 -10 -26 -41 -93 -38 -40
5128d0J4J4OL5l9j8P1O6o8mJ3k8J6J4p8N9m1o0k7J01l4K5l0K7NmM5lNJ7l3pJ1
$$ -40 -26 -12 -6 29 -10 -28 43 109 41 37 50 22 38 52 -26 33 -8 -68 -95 6 -28 -3 -33 -6 -1 -5 40 37 42 59 26 19 30
5161C0N7p1O0j05kJ7j0K1l9mO4k3oL0m5K6k7R0m0L0L1k6o7jP6l9j1p3N0L2n8L
$$ 30 87 16 76 -29 -31 -14 -24 -3 -42 -46 18 -5 -11 19 -26 0 -27 63 23 53 84 58 -9 -10 66 27 16 -57 -7 25 -33 -30
5193c0J3k9L7o1Q9o1N0j8l2L6J8nK6k2QJ9m3N0n5m3k3O4J4j14R9k5R8m2l4jJ1
$$ -30 -17 -46 -9 -70 19 -42 8 -10 -42 -6 12 7 33 11 19 38 -5 45 -10 -53 -76 -12 2 -112 -13 -38 60 18 -16 -17 -6
5224fM5ol6K3P7o8LK5nn9J3k1k1j7J8M%L6m5oK0K5JlN9n7M3J7pq0RL1J5k4J5n
$$ -6 39 33 -3 20 97 29 32 57 52 -7 6 -15 -36 -53 -35 -31 -31 5 -40 -46 -26 -1 0 -3 56 -1 42 59 52 -28 -19 12 27 3 18 13
5260A3l5m8L1l2J6P6l6M3Qo8M2L5qNj0Jk8Rrj9K5p6L3k6K2M4m8R9l2l0l5O9J6
$$ 13 -22 -70 -39 -71 -55 21 -15 28 36 -32 10 45 37 42 32 33 5 14 5 -14 11 -65 -32 -58 -36 8 -40 59 27 -3 -38 31 47
5293D7k8LNqK7k2Mm1Pj7j0K5m7K7J6l1O1o4rN2rRJK4J4j5k3j%k7j1ok0O6n5N9
$$ 47 19 22 27 19 46 24 28 -13 -6 -23 -33 -8 -55 -28 -12 -43 18 -46 -55 -3 -12 -3 -2 22 36 21 -2 -3 -3 -30 -41 -47 -67 -1 -56 3
5329Cp2L4K9NRl6P2n7O5l1K2l5M4m4K9p0K7N5q5NL5l2k2L9K2l6LJ0J4j6P0J4j7
$$ 3 -69 -35 -6 -1 8 -28 44 -13 52 21 43 8 52 8 37 -33 -6 49 -36 -31 4 -28 -50 -11 11 -25 -22 -12 2 -14 56 70 53
5362E3p0L1K6o9O3l2k8M0j6k7l7M3pK1K6RK8n6mQ8j05K8J3M3k1K9n9k2rJ0j3K0
$$ 53 -17 14 40 -29 34 2 -26 14 -2 -29 -66 -23 -30 -9 17 26 54 -2 -6 82 -23 5 18 61 40 69 10 -12 -21 -11 -24 -4
5394dRkk9J3M4n3L2l1m%O3N9j5n7n5O6K0o2k5k7J6L3l2L0j08J05L7k5lJ1n1J1
$$ -4 5 3 -26 -13 31 -22 10 -21 -25 -25 38 97 82 25 -30 36 56 -6 -31 -58 -42 -9 -41 -11 -119 -14 23 -2 -5 6 -45 -34
5426c4O9L0l2L2r4K0j1M6Lm3mRml2M8n7LM3Ll3P0o5J04r8Q9l4m0j8P1p5M8%m0
$$ -34 35 65 33 65 -29 -9 -20 26 29 -14 -18 -9 -13 -45 3 -54 -51 -8 -5 -38 32 -33 71 -27 62 28 -12 -30 41 -34 14 14 -26
5459b6l4j5L1N4Rm8N9n3K2RmM9K0p9J8j8M3p4O8r0K9JK9J7q8J7L7kJ5Oj7QJ4L4
$$ -26 -60 -75 -44 10 19 -29 30 -23 -1 8 4 53 73 -6 12 -6 37 -37 31 -59 -30 -29 0 17 -71 -54 -17 -19 -4 2 -15 -7 7 41
5493D1n3M6M1l1j4L6j02M2mK7p5mL2k6L2n4J8PJ4j5Q0k5j6L8M7m5k8K6k5l6j8
$$ 41 -12 34 75 44 30 66 -36 6 2 29 -46 -50 -18 -44 -12 -66 -48 -41 -27 -42 38 13 -3 35 82 37 9 35 10 -26 -44
5524d4O3l6kLL2o3K0K5k5N2r3N8j2J2M5m5m7J26q5K8l1J3l4N1m2j9J0K8m3M3j9
$$ -44 19 -17 -19 -16 16 -47 -27 -2 -27 25 -68 -10 -22 -10 35 -10 -57 69 -16 12 -19 -6 -40 11 -31 -50 -40 -12 -55 -12 -31
5555c1L0mmL9J7j7ol7M2Kpo5M9k9R7r9J9k6K9k3nJ7j5K6l1L3M8l5m8O4j4N2j8
$$ -31 -1 -5 -9 30 47 30 24 -13 29 31 24 -41 8 -21 76 -23 -4 -30 -1 -24 -29 -12 -27 -1 -32 1 49 14 -34 30 16 68 50
5588E0J2o5Rn1O6m6jL8m4N8J1p0M7n8N7N9k6n4K3M0p9Rj0M4l3j8J15j35L2k8J9
$$ 50 62 -3 6 -45 21 -25 -26 12 -32 26 37 -33 14 -44 13 72 46 -8 15 55 -24 -15 -25 19 -14 -32 83 -52 -20 -48 -29
5619b9j2n6P1j2J8LN5m7M8K6r5P4k3J2n7N1j8l6M8r2Q2Ql7j1J6M5n3M2LK0r2P7
$$ -29 -41 -97 -26 -38 -20 -17 38 -9 39 65 -30 44 21 33 -24 27 9 -27 21 -71 11 19 -18 -29 -13 32 -21 21 24 44 -48 29
5651B9j3n0K4j0L7J3n9K5J2n5L5oOJ8l1k2J1J2Rj7M0M3q6L6J5PLj9L9r6O0k8O
$$ 29 16 -34 -10 -20 17 30 -29 -4 8 -47 -12 -18 -12 6 -25 -47 -36 -24 -15 -32 8 51 -35 1 16 23 26 7 46 -50 10 -18 -12
5684a2qL9j1p7K6K6NN2l0pmJM8k1k7kk3N6k7J1q3P1k1kjn7P6n5K6K9l9K1O4q4
$$ -12 -20 19 8 -69 -43 -17 -12 40 10 3 -1 0 48 27 0 -2 -25 31 4 15 -68 3 -18 -20 -21 -78 -2 -57 -31 -2 -41 -20 44 -40
5718d0J10l9m9M2k6k7N6l3k9L5M4o1J0nl1K3JK0QM0k3j2K7o3M8K0m9k3j1J4Ok6
$$ -40 70 31 -18 24 -2 -29 27 -6 -35 0 44 -17 -7 -12 -43 -20 -19 1 9 49 26 14 41 -22 26 46 -3 -26 -37 -23 -17 -43
5750d3J2O1l4mm5K4J3j3J1N4J1l9K3K7k3KrOo7k7M9j6POLj3jL8k5M1m1K8RJl9
$$ -43 -31 30 -4 -8 -53 -29 -16 -29 -18 36 47 8 31 58 35 37 28 34 -33 -60 -11 -27 -20 -14 -11 -24 -25 13 -12 29 -12 16 25 26 -13
5785a3K8K2pk6L6m9j1LrK5K8rok7L4q3rQ6k1L9l4O4J4r8J6L5p4M8LnoK6m1K7m6
$$ -13 15 37 30 4 40 -9 -20 -17 -26 -1 27 18 12 -15 19 -64 -73 13 -8 31 -3 61 75 -23 -7 28 -46 2 5 0 -6 20 -21 6 -40
5820d0J1qL0jl5O1J3j6k1j1N0j9rL1J4l1k1l5n6R0l3J4K0k6MJ6J0n5L7O3m1K6
$$ -40 -29 -37 -7 -8 -43 18 31 15 -6 -17 33 14 5 36 50 19 -2 -37 -93 -3 -36 -22 -2 -28 -24 -8 2 -53 -16 47 6 32
5852C2oJ0Nm7J1Ol0J8N2o7l2L7j8J3MJMJ3rJ8oJ3k5J6Km3M1k8K4m7K4On5M9k0
$$ 32 26 36 41 -6 5 11 -19 -1 51 -16 -48 -11 -29 -16 -12 -11 -7 6 -3 15 9 22 -3 13 15 -28 13 -15 9 -38 -14 -8 -63 -14 -34
5887c4K6j6J0ON2Oq3N9l8N2j33J12J4j25J16n4mM7k4lk3N8n3L2m2k2J9M6K0J0
$$ -34 -8 -24 -14 -8 44 50 -33 26 -12 40 -93 19 33 -92 24 -30 -34 13 -11 -14 -37 21 -32 0 -42 -64 -45 1 21 31
5917C1m4K3knLL7k4K2l7J7n5R1r1Pol1N1k1O8j8m7N1pj7kmL9Qj7Rj0j6m2l0O1
$$ 31 -13 10 8 3 6 43 19 41 4 21 -34 57 -34 -27 -33 -64 -13 -34 34 16 -31 20 13 -4 -6 -10 29 37 20 29 19 3 -39 -69 -8
5952hOK8n2k2P6l1nKK7j0l0O1p8J00j36O2qqK4l3k6L9p%K5j7m7O7Jl6M3K2K0J5
$$ -8 -2 26 -26 -48 28 -3 -8 -6 21 11 -19 42 -36 64 -72 -10 -18 -26 -2 -35 -61 -22 -29 -29 -4 -21 -68 -1 0 -36 7 29 49 64
5986F4l5m2qNN8n4QMr3P1j2j1L6nl8Rj9P4JL6Mj03M2J5O4J0n1k4K1n7jk7N0j6
$$ 64 29 -13 -21 -16 42 -12 -4 0 -93 -22 -34 -45 -9 -14 -52 -43 -62 12 13 49 53 -50 -8 7 71 81 30 6 27 -30 -31 -58 -8 -24
6020b4N5l6KKm0R1o8M5l0N0o7M0K8j1j8l9L1j4kn9M4m6K8K4j0J3kKJ3J8M8n0N4
$$ -24 31 -5 -3 -1 -41 50 -18 27 -3 47 -20 20 48 37 19 -20 11 -3 -5 -64 -20 -66 -38 -14 -24 -11 -13 -11 2 20 68 18 72
6053G2q9K7m6J18j14J03n8k2K1k7Kj5j3J7O4j3k2J0K9n4L1m1O0m6n8M8O6K2p4
$$ 72 -17 10 -36 82 -32 71 13 -9 12 -15 -13 -28 -41 -24 40 27 5 15 44 -10 21 -20 40 -6 -64 -16 50 72 -2
6082bJ7J6m4%r0M1Q6J5o8j9J7j5L8N1k5m1J3J3QLMl6jJ7J3N9j24N9m9J4P1qk9
$$ -2 15 31 -13 -13 -103 -62 24 39 -29 -48 -31 -46 -8 43 18 -23 -10 3 11 14 18 -18 -19 -2 11 70 -54 5 -44 -30 41 33 4
6115DN9j01M4L8J6p5QP7k4n6O2q0rL6m8M8k6P2p1J2N8Oj23N3N6m6pK3l2L2j3j8
$$ 4 63 -38 6 44 60 -15 -7 70 46 -10 52 -28 -37 -1 -49 -1 -27 45 -26 -14 44 50 -73 -20 36 -10 -17 6 -26 6 -7 -25
6147b5L7l6N4j3n2K4k9j2J5J0j3K1L1l9O6p8M4k5N2ok6P2l4l3J2J9r6J8L3pK1
$$ -25 12 -24 30 17 -35 -11 -40 -52 -37 -27 -40 -19 12 -27 39 -39 5 -20 32 26 0 72 38 5 17 36 -60 -42 -9 -16 5
6178El6N7m8K0J0Ll1L1M7l8k2L7j3%nJ5n9N8p9L1MJ8l6j0N0j5K7l0L9k8K4k9Q
$$ 5 -31 26 -22 -2 8 11 -20 11 58 20 -2 35 22 22 17 32 -27 31 -48 -17 -13 5 -31 -41 9 -6 21 -9 30 2 26 -3 5
6211En8M8J8qN3m7lj02O8K0J4j1k9J5J0M5q7N9k0P1n8M6j8J1o9J6K8n5K5R1n9
$$ 5 -53 -5 13 5 58 11 8 -94 -26 -6 8 -3 -32 -17 -7 38 -49 10 -10 61 3 49 31 42 -27 -11 17 -38 -13 78 19
6242A9m5oJ1M5k6K8j2nl9L4P7o8l4j3L4K9k3jjk0M7m7J0j5M2n4M3J2lKpjj7L4
$$ 19 -26 -32 -21 24 -2 26 14 9 -30 4 81 13 -21 -34 0 29 6 5 4 -16 31 -16 -6 -21 21 -33 10 22 19 21 14 13 -4 30
6276C0k8l2k3P5j0k7J2K5p6K7O5n1l2l4J29q4O1l8N4l2L4n1m0M3J4l6N2J2jk5
$$ 30 2 -30 -53 22 12 -15 -3 22 -54 -27 38 -13 -45 -79 50 -34 27 -11 43 11 45 -6 -46 -3 11 -25 27 39 38 13
6306A3j8Nm3O0m1j8k3O3K0l2K2L2j3J7k3K1o3M0j1j1qk9N5l3L8n7L2J2o1R4k6
$$ 13 -5 0 -43 17 -24 -42 -65 -2 18 -14 8 40 27 44 21 42 -21 19 8 -3 -11 -40 15 -18 20 -37 -5 7 -54 40 14
6337A4k9N9n8J5L5nm1M7k3m2N4p1K4L4l0n1M1K2ROJ7n1J4j8QMM3L7j03O1m3M8
$$ 14 -15 44 -14 1 36 31 -10 37 14 -28 26 -45 -21 13 -17 -68 -27 -5 4 10 27 -24 -10 -28 -20 -16 27 64 -39 22 -21 27
6369B7k7p8P7lK2K6J4l4o6J6N0q5J08l0r2M4J0Kj0M6ol3L2Nk2J1k6Rl4N5j9Ll4
$$ 27 0 -78 -1 -4 18 44 58 24 -42 -26 24 -61 47 17 -75 -31 -21 -19 -29 17 11 -22 10 15 -7 4 -22 -13 -47 8 -11 -8 -42
6402d2L1kj1L3n6J2L1ML1o0NN5p8J25q2k4P2j07jQ9p0K6k4J2KL9JQj01P4pQ2j8
$$ -42 -11 -13 -24 9 -47 -35 -4 0 31 -29 -24 31 -47 78 -4 -28 44 -63 -64 25 -45 -19 -43 -31 -29 10 11 19 -82 -8 -15 67 49
6435D9m9k1Q4j09O2l9LJ8NJ3j6n9Q2lj8j8K3KL9m8L5jk7%L8m1j3L6m4k1N2l7j8
$$ 49 0 -21 63 -46 16 -23 -20 -2 3 16 0 -59 23 20 2 -16 7 9 48 0 35 34 7 7 45 4 -9 27 -17 -38 14 -23 -41
6468d1O1MJ6l0J2j1J2k9J7O6p0lL5l7j1M0o3M4J3n2L0J8m1O9m1K2k5m6LL0K5m7
$$ -41 20 24 40 10 22 11 23 -6 11 77 7 4 39 2 -9 31 -32 12 25 -27 3 21 -20 49 8 30 5 -41 -38 -8 17 -30
6500c0rL6J14j12N1m3k7L3J5q2R3Nj7k8p2J43o2m2K2L4lj4K6p2M9k1m5J03J9q4
$$ -30 -39 -3 111 -1 50 7 -20 13 28 -54 39 44 27 -1 -73 70 8 -34 -12 22 19 5 31 -41 8 -13 -58 45 64 -20
6530b0O1k5ll3J9J5k7J3%K7k8l6P9p5M3o6N0Rj2kkL7Ln5j6NN3pk5M0l5L3nm1K3
$$ -20 41 16 13 -20 -1 14 -13 0 0 27 -1 -37 42 -33 10 -56 -6 3 -9 -11 -13 24 27 -28 -44 -39 14 7 -18 22 -13 20 15 -26 -3
6565cK9o2M5O4n2n7O5n7L7Nj1m0L3j9K6K0l6j7P6k4J7p8Q1kr6O2j8N4q0N1o0R6
$$ -3 26 -36 9 73 21 -36 29 -28 9 14 3 -37 -4 -23 3 23 -13 -30 46 22 39 -39 42 40 -56 6 -12 42 -38 13 -47 49
6597D9n8L4j0m5L2N3q5K0m2J68j48JM0M8p2o6M3N8l7m2MM1J8J3jnj0rRk2L7lK0
$$ 49 -9 25 15 -30 2 55 -30 -10 -52 116 -32 -31 9 57 -15 -81 -38 20 -17 -59 -55 -14 4 17 16 11 1 -8 1 -21 16 13 33
6630C3l1j4L1pLm4nJ9J1rMl3Oj5N3Kl5N6o2Q2Ln6pK4m1R2j08Q2k9m4J4lmK2M0
$$ 33 2 -12 19 12 15 -29 -34 -15 -4 -13 -9 -42 -36 -51 2 4 -31 25 -37 45 48 -8 -15 9 -32 60 -48 34 5 -39 -25 -28 -32 -10 30
6665C0qn5K8KK2n9L8K3k4N3l4L2l9k6n2L8M0m5j0N2J6n9K6R%JnML7k9k8M7m7N2
$$ 30 22 -33 -5 -3 19 -40 -2 21 -3 50 16 48 9 -17 -69 -31 9 -36 -46 6 22 -37 -11 -2 -2 -1 -6 -2 35 6 -22 25 -22 30
6699C0oo6L0j2L3m4L4j9J0l6j9N2OJ6n0jJ14k9k9j7L8j0n5O0k9m8P0m6M4J5m7
$$ 30 24 -42 -12 -24 9 -35 -1 -20 -10 -46 -65 -13 -7 9 -41 -42 72 43 14 -3 35 25 -30 30 1 -47 23 -23 21 36 -11
6730a1O2k2m2L5k6k9J5N1K7p2R1p9J8l6j6J5k8M7n5M5N%qKOO4j9o3LL7Qj7J4j8
$$ -11 51 29 -13 22 -4 -33 -18 33 60 -12 79 0 18 -18 -34 -19 -47 0 -55 -10 -5 -5 -13 -11 -5 59 40 -23 -20 17 25 8 22 4
6764DL4j7l6K6j4k2K5j4k2J9O1m8m3O2k8M8lNo1L2l3L5mj6J9o2K1OOoO1m3KK3
$$ 4 38 21 -15 11 -3 -25 0 -14 -36 -17 44 -4 -47 15 -13 35 32 37 -24 8 -25 10 6 -10 9 -53 -32 -26 -20 -26 35 -8 -6 17
6798A7j7jK1M8o7%J1L5n9j9O2o5J1nJ0jk9M9K2J5m4jJ3kRl5L0qrN3p1j1J8P5q4
$$ 17 0 -1 20 68 1 1 12 47 -12 -31 31 -34 -23 -28 -18 -19 -48 1 23 38 -6 -7 6 4 13 -22 8 0 -9 44 -27 -38 -20 55 -29
6833b9N4k3k2j1M7o2K2j2qNOJ35p9L9m0J1J3l6o5K9L5l6pK6o7N4L2%o3M3lJ9r
$$ -29 25 2 -20 -31 16 -46 -24 -36 -44 -39 -33 102 23 62 22 33 46 10 -55 -26 9 -27 -34 -8 -75 -21 11 11 -52 -9 -12 7 -2
6866bJM8m2M4m5J5o6K6M3Qo4l1P0l0o4M2M6m9R5j2n1M1r%K7j6j8j1k5LOJ0j3l5
$$ -2 -1 47 5 49 4 19 -47 -21 22 30 -34 -65 5 -25 -89 -47 -1 -50 45 33 -18 23 14 14 41 25 7 -4 -29 -26 -20 -10 -23 -58
6900e8Q5m5k7PL4l2J4M0jL2o3J2J6M1m6K0n2M1l6J1j0oO5m9o1N7J7p3J09m9mO5
$$ -58 27 -18 -45 -38 -4 -36 -22 18 17 49 -14 -2 14 55 9 29 -23 18 -18 -7 -17 -23 42 -7 -68 -11 6 -67 42 -7 -11 54
6932E4m6N7j9l4N2q7PL2J2Mn0N4l8j3k1K0m9N5j5oQK7l1%O5l1L4n9J9nOMK2o6
$$ 54 8 65 46 12 64 -23 -16 16 28 32 -18 36 -2 -15 -36 -16 -65 -10 -25 -31 -23 4 -27 -27 38 7 41 -18 1 -4 2 6 28 -38
6966c8k4O4n4O0K6oo5K4N2m6nm5N6M8j01Q0L2o3k0j4NP0j6m1m0K7m1N9j6qN3l4
$$ -38 -62 2 -52 8 34 28 -37 -13 39 -7 -12 -57 -1 47 -54 26 58 -5 -25 -39 -34 36 20 -21 -61 -34 -75 -16 -32 -40 13 -21
6998b1M6J5o4M6L0p0L9k9J2l7J1L3j4k2J5NJ2k5l0L2J5L1k9k6O0q0N6L1j7J1o8
$$ -21 25 40 -24 22 52 -18 21 -8 4 -33 -22 11 -3 -25 -10 -5 7 -18 -48 -16 -1 30 1 -25 35 -45 11 42 25 36 -32
7029c2N9%K6q2M8q8N5QK8p4K5k1O7j1K6k3kJ3n0J5M9rl0O1o0Mn2N6o2M8n3M4l
$$ -32 27 27 53 -29 19 -69 -14 -6 22 -52 -27 -48 19 8 34 11 9 22 -28 -13 36 27 -3 58 -2 2 -50 6 -56 -8 -61 -17 -20
7062b0L7m2%M8l3QN5m5K9l0L3l7K0p6J1pM0j4k5M7j8Oj1L5l3o1R3Oj7k1K6kk3
$$ -20 17 -25 -25 23 -10 -2 53 8 37 7 40 3 23 -53 -42 -49 -9 -23 -48 -1 -19 -13 -24 11 -22 -83 10 16 -1 -22 4 2 -21
7095b1J4j1j2ORj5J7KJ3l5LM1l7PQ2q2Q5k2n9L8Qm5K1KOj7m2L1J7K7j02P7j7j2
$$ -21 -7 -18 -30 -24 -15 -30 -13 -11 2 -33 -30 11 -26 -19 63 -19 66 44 -15 23 31 -14 7 9 15 -2 -44 -13 4 31 -71 6 -11 -23
7129b3l7J7N1rl5K4O9j06N8oK5r1N7J8n9qON5L1j10N9%j9MN4k8pM4q4R4LLl6n7
$$ -23 -60 -43 8 -1 -36 -12 57 -49 9 3 28 -63 -6 12 -47 -55 -49 6 37 -73 -14 -14 -33 -29 25 -3 -10 34 -50 44 47 50 14 -43
7163d3L6qrM3kn6KPK5j7N2m7Rj5K7j1J4k0k8P4m0M9m2j5j3K8o7J00p2l7L9j7N1
$$ -43 -7 -15 -24 19 17 -39 -37 -30 -5 -22 30 -17 -8 -23 4 -7 7 -13 -41 33 -7 42 0 -15 -28 0 -67 33 -39 -76 -37 -54 -3
7196cM1k9Ll3O3K0l9NK5r6N9J1m6J9k8J6l5N4k0jk2j1K0N2oj5rMK4j9N6l5mKn
$$ -3 38 9 12 -21 42 62 23 28 53 -43 16 27 -19 0 -28 -12 -47 7 -13 -14 -36 -47 -27 25 19 4 -5 -1 23 4 60 25 21 23 18
7231A8L3o7qk7R5q1j5j7K1M3l0N5l4mN9J7p6J7OJ6j3p1L8O7p3k4j2K1j3K9m1J6
$$ 18 51 -16 -24 -51 44 -37 -52 -69 -48 -5 -35 20 -14 -18 41 58 -18 -1 5 21 8 -63 -25 42 -31 -55 -67 -46 -59 -30 -71 -55
7263e5L5k8K3Mj2N7%K8j6l0P6j11J6L3k2lQn2J6M5r6O5QQ0j9K1o1L5mn4L7Op8
$$ -55 -20 -48 -25 -21 -33 24 24 52 36 6 82 -29 -13 20 -2 -5 3 -49 -33 12 -84 -19 -11 69 50 71 10 45 41 -13 24 30 -48
7296d8J2M3n4jK4pj0pJ8P0j20P7K4k4J8KRK4kl9Nl9%J9j2Jl2j7M0Qp9O1J1K3j
$$ -48 -36 7 -47 -48 -24 -31 -41 -48 -30 40 -80 -3 21 -3 15 17 26 50 48 9 14 -25 -25 -6 -18 -17 -49 -66 -26 -18 -97 -36 -25 -2 -3
7331cm9L2kM2L4mp9M6k3Pj9PJ0k2lPL6m1M0nrj8jj0M5L6l1N5q3llK9NJ4n0K0n6
$$ -3 -52 -20 -22 20 54 50 -29 17 -6 1 -18 -11 -1 -23 -26 -19 17 -24 16 11 2 -16 -17 -27 18 54 23 78 -5 -8 -11 18 23 37 -13 7 -49
7368d9K3k8M8N9n7j9JN7n2k2PR5q2k0N6K8l5nL5p7K8M4q1N3L3m8J3k4LN9k4PJ7
$$ -49 -26 -54 -6 53 -4 -23 -22 35 -17 -39 -32 63 -19 -39 17 45 10 5 40 -37 -9 35 -46 7 40 -8 5 -19 -16 43 19 26 43
7401D3n1J0O8p7N1K1p4J9k1K4k3M1m9L6J1n6k8P2J1O4q2j1j0O8o1K2o2N5j7M3
$$ 43 -8 2 70 -7 44 65 -9 10 -11 13 -10 31 -18 18 29 -27 -55 17 28 92 10 -1 -11 57 -4 18 -44 11 -6 37
7431C7j9m5L4m6L7rk1m6R2L2q8M4M5m2%RKj1PK4j0qj09L7P2o0K4k0P8n6k0NM6
$$ 37 18 -27 7 -39 -2 -11 -32 -78 14 46 -42 2 47 5 5 14 16 5 12 36 26 18 -91 -54 18 -42 -18 -38 40 -16 -36 -31 15
7464A5L9l7l4J7m7O5K8l0j9Rjm5L8l0m8J02k6K4l3l5L4l3J14j7k1k5L6M%k7j3
$$ 15 54 17 -17 0 -47 18 46 16 -3 6 5 -40 -2 -32 -80 22 -4 20 -13 -48 -14 -47 67 50 29 4 40 44 44 17 4
7495DRN1q7J0q2N6Q6j18N4k7O6q3R7l5J9M4n6J6n7R1l7l3L5km5J4MK4m7j9jR1
$$ 4 13 64 -23 -13 -95 -39 47 -71 -17 -44 22 -61 36 1 20 64 8 24 -33 58 21 -12 23 21 -24 -10 -6 18 -29 -48 -49 42
7527D2Qn9k9ORN5M3l9l1Q0n6nJ5l2j5j4j6N2lK2q4j7R3n7rj7N4L8k3Rlj7j2K5
$$ 42 50 -9 -38 -32 -23 32 75 36 5 85 29 24 39 7 -8 -22 -38 14 11 33 -51 -68 25 -32 -41 -58 -4 34 11 20 17 0 -12 13
7561A3pPk0lL5J4o7K8jn8NN0mpN5o2L3oJ7k2k3K2j5L1L1j2j6J2o9l6P6K9q4P9
$$ 13 6 13 -7 -10 25 39 -28 0 -1 -59 -54 -4 -8 -15 40 -22 11 5 22 0 -23 -1 -16 15 46 34 18 30 -39 -75 1 30 -54 25
7595B5k6mj1N1n7L1L8k2L6k9J2n2oK2K6l4l6J0j8LK0J2j4k6M4K7RnK9J1r3R3n4
$$ 25 -1 -5 -16 35 -22 9 47 25 61 32 44 -8 -14 8 34 0 -36 -26 -44 -41 -21 -9 -23 -49 -5 22 31 26 55 66 -27 66 12
7628A2PKPk4o5N4j4oNm3L3RL7n9M1Jk7P7m4K8j8k2QoO0q2PmK0j0m3MM9l8L5M5
$$ 12 19 21 28 4 -61 -7 -21 -27 -22 -65 -32 -23 14 -45 -4 -3 -30 47 3 31 13 -9 -1 -7 53 -29 -22 -26 -6 -16 -59 -55 -6 -44 -9 36
7664C6l4N4o5L0kl4n2Q0J4ko9L7KJ8j4M0Rr7L2M3J7j07J2M2K1n0N7o1N7L6p8Q
$$ 36 2 56 -9 21 19 -15 -67 13 27 25 -44 -7 -5 13 -1 39 48 -49 -17 26 43 -64 -52 -10 11 -39 18 -43 14 50 -28 -20
7696b0Q1o9J0K9k4j2J9m5l9O8j6M7kpL4m2knL7JL4o4n3J5J8nJ6L0k9lOJ7q5P3
$$ -20 61 -8 2 31 7 -5 14 -31 -70 -2 -18 29 27 20 54 12 10 5 42 43 77 13 -40 -25 -7 -12 4 34 5 2 8 25 -60 13
7730A3n0P1Qj6n1N0K3j07L1O0J7l4J2l1k5nN2j1Mk2k4k1N4m2K3M9o0P9m0Kj1k7
$$ 13 -37 34 42 26 -25 25 48 -59 -28 32 49 15 27 -4 -29 -34 18 7 11 -11 -35 -56 -2 -44 -21 28 -32 47 7 9 -2 -29
7762b9J3L1l7ML0m3RNn2M7L4qN5p8L8K9n8L3KK4l7J9j18J09j0k7L6k5Ml3Jl9P9
$$ -29 -16 15 -22 -18 12 -31 -22 -17 -69 -22 12 4 59 -19 19 48 -10 23 25 49 12 31 -87 22 12 -15 21 -4 0 -33 -32 -71 8
7795Hj3l6O4k8J09j05j3PKL0p3N0J7J1l4K5n6PN0n7m2R6Mk4k8M9m3J0J7L6on6
$$ 8 -5 -41 23 -5 104 -1 -14 -7 -5 25 -48 2 19 30 -4 21 -35 -28 22 -35 -77 19 23 -1 -29 20 -23 -13 4 40 34 -22
7827b2M8k3j2N1o2M4m2m2M4j9K2Pj2pN2K3k9qk8kO1Pk4n8L7l8K5n5N8k7J9l5J2
$$ -22 26 3 -9 42 -20 24 -18 -60 -16 -35 -13 -6 -18 -25 27 50 21 13 -15 -17 44 51 27 -31 6 -32 -7 -62 -4 -31 -12 -47 -35
7860c5j9M8J4j3kP4n4j3K9m0MJ8JMj0j1J9l4j5N3J2p3lK9j3N5l5L8j6k3N2o4M4
$$ -35 -54 -6 8 -5 -7 67 13 0 29 -11 -7 11 12 16 6 -5 14 -20 -35 18 30 -43 -46 -17 -30 25 -10 28 12 -11 41 -23 21
7893B1m8M7Jn2L6k3nM4j04N2PL8j4k3kL5L2Jj3J8q5J5N2r6Q6J4k4nk3M5j7rLK9
$$ 21 -27 20 21 -31 5 -18 -23 21 -83 -31 -24 14 0 -23 -25 10 42 43 30 48 -37 -22 30 -66 20 34 10 5 -18 27 10 1 4 33
7927C3m0J6k5K0k5K7L0J3o2K9N3r9J1M1J0o3M8l6K1m0J7J6j1K7KNk9mK1m2N9r
$$ 33 -7 9 -16 4 -21 6 36 49 -13 16 69 -30 -19 22 32 -31 17 -19 2 -38 -21 -5 -16 11 13 18 -11 -15 6 -36 23 14
7959A4K6n9L2Jj7P4j05J6J4l2K2jo0O3Oj6K6k7N5l1O3j03N3P0n4l2n2J2M1pN3
$$ 14 40 -19 13 14 -3 71 -34 -18 -4 -36 -14 -15 -75 -12 -6 -22 4 -23 32 1 64 -39 14 84 30 -2 -54 -42 -1 -8 45
7990D5o4RPl8L3NM8m8K8m1L7l3k6J31q6l1O9m4l5Kl5j6R6l5N8l5MJ9p7K6J5K4
$$ 45 -19 -10 -3 -41 -8 -3 45 -3 25 -16 21 -12 -38 93 7 -24 45 1 -34 -32 -67 -83 13 -22 36 1 5 24 -53 -27 -12 12
8022A2M9o5O4m3k1L2m1K9k9L3j8j6L4r4L1P4p5M7J8J1o3N3lN6j7k9n9j1P5k2J2
$$ 12 61 -4 60 17 -4 28 -13 16 -13 20 2 -14 20 -74 -43 31 -44 3 21 32 -31 22 19 75 58 29 -30 -41 34 12 24
8053B4l6oJ5qn4L5N8m7P9p0qL0k7K4Pj7J1PL8m1K9r6P8l9J5r9R8rl7j4K7M6K4
$$ 24 -12 -18 -3 -11 -65 -30 28 -19 60 -10 -18 12 -15 9 16 -1 10 17 55 14 43 -53 25 -14 1 -98 0 -9 -46 -60 -33 13 37
8086C7po6M3J4Nrm1R2r1rK6m4NP0o8JqK6K9jK0l0J3K8ok1j0nl6N0Kn2J8K4k2J7
$$ 37 30 -36 7 21 26 17 -24 68 -23 -32 -6 -50 -45 25 -43 -42 -50 -24 5 4 24 -6 7 35 29 8 -2 -7 -43 7 9 -43 -25 -1 -23 -6
8122fm6M9j8Qj4P0k7l7K1K6m9J30j39M6l6k0L5N9m5k3L2k7K7j9j8l2P1k1L8n9
$$ -6 -52 -3 -21 -13 -27 43 16 -21 0 26 -23 107 -32 14 -22 -42 -7 52 7 -16 16 -11 16 -3 -21 -53 18 -3 35 -24
8152b4M5k0k3OJ7J1N5n7J7k4jk1mK7j4M7o8R3j32L8PJ3K6o3N9noJ6l6N2l2j7M
$$ -24 21 1 -22 -16 1 12 67 10 27 3 2 -19 -23 4 -10 37 -31 62 -70 -32 -25 -12 14 -49 10 5 -1 15 -21 31 -1 -18 -14
8185a4k7Q%L1k0J6
$$ -14 -41 -33 -33 -2 -22 -6
8191f
$$ Imaginary data points
##PAGE= N=2
##DATA TABLE= (X++(I..I)), XYDATA
0@%%%%%%%%%%qJ6j6J6k4L2l2M0n6O4p2Q8j04J28j52J76k08K40k75L15l60M12m70
$$ 0 0 0 0 0 0 0 0 0 0 0 -8 8 -8 8 -16 16 -16 24 -32 32 -40 48 -56 72 -80 96 -112 128 -147 168 -192 220 -250
33b50N33o03O80p64Q58r61J071j192J327j473J633j806J997k206K431k680K954
$$ -250 283 -320 360 -404 454 -507 564 -628 699 -774 859 -947 1050 -1156 1275 -1405 1549
50A549l254L583l949M357m813N324n905O571p340Q241r317J0628j2262J4370j7207
$$ 1549 -1705 1878 -2071 2286 -2527 2797 -3108 3463 -3877 4364 -4953 5675 -6587 7783 -9424
65i424K1251k7511L8582o3895K25024J9179m52675J58733K80947l6094k15898
$$ -9424 11827 -15684 22898 -40997 184027 203206 -249469 -90736 190211 154117 -61781
76f1781J7061N6986P065J6266L5098r1080o4010R1567J24981o8097j34240K2213
$$ -61781 -44720 12266 19331 35597 70695 -20385 -84395 7172 132153 64056 -70184 -47971
88d7971J43176R648j01173k7541N2512K209k586K6607l6423q5925M3143J08232
$$ -47971 95205 104853 3680 -23861 28651 30860 28274 54881 18458 -67467 -24324 83908
100H3908n0014j26474M4045J06773l9195p3027M0733L3789l5383J3645M4107m8727
$$ 83908 33894 -92580 -48535 58238 19043 -53984 -13251 20538 -14845 -1200 42907 -5820
112e820m5910P8334N5081r5341p3648Q7908Q3593q6571j06943O7719J08458o3753
$$ -5820 -51730 26604 81685 -13656 -87304 604 84197 -2374 -109317 -41598 66860 3107
124C107j10647N4381J00400m5326p5239M4413M7095l7991k988M8093k2647n1362
$$ 3107 -107540 -53159 47241 1915 -73324 -28911 18184 -19807 -22795 25298 2651 -48711
136d8711L6649N2567l6199m9770K1998K7496k0709j0906J4876j2967k1475K5759
$$ -48711 -12062 40505 4306 -45464 -23466 4030 -16679 -27585 -12709 -25676 -47151 -21392
148b1392L2510k7095m0844L0067N9409j3494n7139N248N2332P357k9673l186M992
$$ -21392 11118 -15977 -56821 -26754 32655 19161 -37978 -32730 19602 26959 -2714 -5900 -908
161i08j4427J2159K9254l0931m7345L3291M8779l3185m2357L2324L4494k7716
$$ -908 -15335 -3176 26078 -4853 -52198 -18907 29872 -3313 -45670 -13346 21148 -6568
173f568j9130L5675J9453l1887j3816L6578K1751l3067k6414K7846K6455k2989
$$ -6568 -25698 9977 29430 -2457 -16273 20305 42056 8989 -17425 10421 36876 13887
185A3887k5817P780J0430k833J345k370j7396O07L1030O753l1130l992L2709P276
$$ 13887 -11930 -4150 6280 3447 4792 2422 -14974 -14367 16663 23416 -7714 -11706 21003 28279
199B8279k0368J345J5631o343j0397J1092N005j9090r356J4032O191j5983j4253
$$ 28279 7911 9256 24887 18544 8147 19239 24244 5154 -4202 9830 16021 38 -14215
212a4215P893J4652k540j0259Q55N360L435Q013L244j3018n132K2062J1161k6177
$$ -14215 -6322 8330 5790 -4469 -3614 1746 5181 13194 16438 3420 -1712 20350 31511 5334
226E334j5418K2857J1368k3667j4795J2614P447j0969p413L792J474n56M024J127
$$ 5334 -10084 12773 24141 474 -14321 -1707 5740 -5229 -12642 -8850 -7376 -7932 -3908 -2781
240b781l134L091Q403J526o221k83Q260J119q849k914N292j155r548k603N188
$$ -2781 -5915 -2824 5579 7105 884 601 8861 9980 1131 -1783 3509 2354 -7194 -9797 -4609
255d609m558r271O448Q720r226p526J1981J0148o445m771P458N734j011Q79m40
$$ -4609 -9167 -18438 -11990 -3270 -12496 -20022 -8041 2107 -4338 -9109 -1651 4083 3072 3951 3511
270C511m596R89N251l596j0260k360O800J096r154m735O318N368l363l259N958
$$ 3511 -1085 -96 5155 1559 -8701 -11061 -4261 -3165 -12319 -17054 -10736 -5368 -8731 -11990 -6032
285f032O352k188k42O684R97l909L012L965m460m117L200J43o712j742K936l406
$$ -6032 320 -1868 -2110 4574 5571 1662 4674 8639 4179 62 3262 3405 -3307 -5049 -2113 -5519
301e519m120L931K891l386p98N677M384j808j271M550N011j82k984PL011q60m288
$$ -5519 -9639 -5708 -2817 -6203 -7001 -1324 3060 1252 -19 4531 9542 9360 6376 6383 9394 8534 4246
318D246o21m77m040n38J985l507l787L462L916l060j410N864K900k330K157M256
$$ 4246 3625 3148 -892 -1430 555 -2952 -6739 -3277 639 -2421 -3831 2033 4933 2603 4760 9016
334I016q39j562J725R45k131k175n87j116k373k128j561j28q4j880J81K850K41
$$ 9016 8177 6615 8340 9285 7154 4979 4392 3276 903 -1225 -2786 -2914 -2998 -4878 -4697 -1847 -1606
351a606n6L106J274p19K731L308k031k729K859K040m629l640Q29o58k517j302
$$ -1606 -1662 1444 2718 1999 4730 8038 6007 3278 6137 8177 3548 -92 737 79 -2438 -3740
367c740j333j249M14J090j41m01J695K702J446P87N56R41K104R9k057k76L18j882
$$ -3740 -5073 -6322 -5908 -4818 -4959 -5360 -3665 -963 483 1270 1826 2767 4871 4970 2913 2637 2955 1073
385A073j798p20j833k687m67J204j314j746K048K192J2J059K054J005Q75J938
$$ 1073 -725 -1445 -3278 -5965 -6432 -5228 -6542 -8288 -6240 -4048 -4036 -2977 -923 82 957 2895
401B895J108p07j12Q01j088j816o34j757j893n94r30r80k7n55k25K214K303j56
$$ 2895 4003 3296 3184 3985 2897 1081 447 -1310 -3203 -3797 -4727 -5707 -5734 -6289 -6514 -4300 -1997 -2153
419b153l16K586L381R70ql60q02J173J684k149m212q91J805q64m024j692J185
$$ -2153 -2469 117 3498 4468 4460 4100 3298 4471 6155 4006 -206 -1097 708 -156 -4180 -5872 -4687
436d687Q18N65K08q91J490L789J888k30jP64J696K242j43l652k049J872l2l677
$$ -4687 -3869 -3304 -3096 -3987 -2497 1292 3180 2950 2949 3713 5409 7651 7508 3856 1807 3679 3647 -30
454c0j780k75j203r7L75j215L5K593J114o60J896L177k65r1K240n9j780Q01L57
$$ -30 -1810 -2085 -3288 -3385 -3010 -4225 -4190 -1597 -483 -1143 753 3930 3665 3574 5814 5755 3975 4776 5133
473E133k232j212m69k620k199J158P42k149j515O31Q74L005K290k538j030N302
$$ 5133 2901 1689 1220 -1400 -3599 -2441 -1699 -3848 -5363 -4732 -3858 -853 1437 -1101 -2131 3171
489C171L195k746j285K037J44j208n5k201k963J390P68m038k323J075O65J529
$$ 3171 6366 3620 2335 4372 4516 3308 3253 1052 -1911 -521 247 -3791 -6114 -5039 -4374 -2845
505b845J645l018k252N472N837k161l457K264K965J36l60k063k244J406R38l854
$$ -2845 -1200 -4218 -6470 -998 4839 2678 -779 1485 4450 4586 4226 2163 -81 1325 2263 -1591
521a591k640J344K15j998N2K06j210K614M463j880k705L579L136p94L33O39j346
$$ -1591 -4231 -2887 -2672 -4670 -4618 -4412 -5622 -3008 1455 -425 -3130 449 3585 2791 3124 3763 2417
538B417k28P14j860j428J156j863l993J065K621k146j312K296j29q90L042K849
$$ 2417 2189 2903 1043 -385 771 -1092 -5085 -4020 -1399 -3545 -4857 -2561 -2690 -3580 -538 2311
554B311q18n33J392J041N84K75j811n19J809j990m703R66L118k328l431N23J096
$$ 2311 1493 960 2352 3393 3977 4252 2441 1922 3731 1741 -2962 -1996 1122 -1206 -4637 -4114 -3018
571c018L31J618P59j727P13L714R50n59R96l81r91J384J15k652l28J370k364l205
$$ -3018 -2687 -1069 -310 -2037 -1324 2390 3340 2781 3777 3396 2405 3789 3904 1252 924 2294 -70 -3275
589c275N57Q00j065P41M33j902R83L510K4m68K007j74r36K956J803l557k074K398
$$ -3275 -2718 -1918 -2983 -2242 -1809 -3711 -2728 782 806 338 2345 2171 1235 4191 5994 2437 363 2761
607B761m40l134L32P97k337j371L49m46M74J520m83m14K333J238j150J479K793
$$ 2761 2321 -813 -481 316 -2021 -3392 -3043 -3489 -3015 -1495 -1978 -2392 -59 1179 29 1508 4301
624D301j472j835K015L97k025N58k86l647q37K389q93k526P76N88j496J375K629
$$ 4301 2829 994 3009 3406 1381 1939 1653 -1994 -2831 -442 -1335 -3861 -3085 -2497 -3993 -2618 11
641A1r47l39K652N02j097J574J259j158m46K58j521q32R68j053k412J57J00j326
$$ 11 -936 -1275 1377 1879 782 2356 3615 2457 2011 2269 748 -84 884 -169 -2581 -2424 -2324 -3650
659c650J110J571j868p83L217J493j435O86K475l61j167J045M38j185K62l25k063
$$ -3650 -2540 -969 -2837 -3620 -403 1090 -345 341 2816 2455 1288 2333 2771 1586 1848 1523 -540
676e40n89O44q25j242J12k0l07R62R09m78O28J583l81L15K156J01j362P36K80
$$ -540 -1129 -485 -1310 -2552 -2440 -2460 -2767 -1805 -896 -1374 -746 837 456 771 2927 3028 1666 2402 2682
695B682j658l85Q05j052j907Q7K66j033n9O52m06PJ165P21L10N09O69N23K89j04
$$ 2682 1024 639 1444 392 -1515 -1428 -1162 -2195 -2254 -1602 -2008 -2001 -836 -115 195 704 1373 1896 2185 2081
715B081k6K48L0j193j198L50j15j458m11J92o47l26R05N03l44N41J224K14P8J191
$$ 2081 2055 2303 2333 1140 -58 292 177 -1281 -1692 -1500 -2147 -2473 -1568 -1065 -1409 -868 356 570 648 1839
735A839M30n72J23K45m58m85m65n56m63o33o13j70K62k49n30N37Q47M3L93J062
$$ 1839 2269 1697 1820 2065 1607 1122 657 101 -362 -995 -1608 -1778 -1516 -1765 -2295 -1758 -911 -868 -475 587
755E87K51J58P78K93m32j56L17m05j072l13j0p52q05q5k18j34L2L90M19K49M16
$$ 587 838 996 1774 2067 1635 1479 1796 1391 319 6 -4 -756 -1561 -1646 -1864 -1998 -1966 -1576 -1157 -908 -492
776d92O78M99M49K05J42M87j05n11q9k66q25m67k20o20n90N0J61m77rQ55M98j5
$$ -492 186 685 1134 1339 1481 1968 1863 1352 1263 997 172 -295 -515 -1135 -1725 -1675 -1514 -1991 -2000 -1145 -647 -662
798f62N54P45L79L02K48J60n8j06j60m24n98k96m65n40l18l56j91J39P2J88M16
$$ -662 -108 637 1016 1318 1566 1726 1668 1562 1402 978 380 84 -381 -921 -1239 -1595 -1786 -1647 -1575 -1387 -971
819i71N27L24L64P11L65q6M00M44m87l40j0m36o84l88l32n17k22pj44j96L84M02
$$ -971 -444 -120 244 955 1320 1234 1634 2078 1591 1251 1241 805 121 -267 -599 -1116 -1338 -1345 -1489 -1685 -1301 -899
841h99J43N59N12L36M63L34l2J13J12k64m25k26k20n77o28n5l78n05J49J38p9
$$ -899 -756 -197 315 651 1114 1448 1416 1529 1641 1377 952 726 506 -71 -699 -754 -1132 -1637 -1488 -1350 -1429
862a429K57M87L58L17M68N60O9J62L24j22k35L0n37n01j88m56m42k80j43j45j
$$ -1429 -1172 -685 -327 -10 458 1018 1087 1249 1573 1451 1216 1246 709 208 20 -436 -878 -1158 -1301 -1446 -1447
883a447K16K09R0N61N00J30L95M46Q9Q7J17j11l74k76k38l23n43k63k11l76j5
$$ -1447 -1231 -1022 -932 -371 129 259 654 1100 1189 1276 1393 1282 908 632 394 71 -472 -735 -946 -1322 -1337
904a337M8%K56L05K99M27L57L21K02J96K11m3k10k3k53m36k30m45m10k19o2j21
$$ -1337 -1289 -1289 -1033 -728 -429 -2 355 676 878 1074 1285 1242 1032 1009 756 320 90 -355 -765 -984 -1046 -1167
926a167p3j5L58K31J24N60K85K18L73K18kR8n0k22k74l26k39m17j87k03l80j53
$$ -1167 -1240 -1255 -897 -666 -542 18 303 521 894 1112 1110 1208 1158 936 662 336 97 -320 -507 -710 -1090 -1243
948a243J98J04J3K15K88L49K85M06L32pJ23Q5j81j12K5l68l53l40l90l23O6j13
$$ -1243 -1045 -941 -928 -713 -425 -76 209 615 947 940 1063 1148 967 855 880 512 159 -181 -571 -894 -828 -941
970i41j89K1L06K65N4M17L06O9M05K15O9R6R7l75l38j42r9l33k03k19m11l05L18
$$ -941 -1130 -1109 -803 -538 -484 -67 239 308 713 928 997 1093 1190 815 477 335 236 -97 -300 -519 -930 -1235 -917
993i17Q3j03K58K02K69L66L10J01K26K35k7k87J57N3n48k63j33n03k14J93j21
$$ -917 -834 -937 -679 -477 -208 158 468 569 795 1030 1003 716 873 926 378 115 -18 -521 -735 -542 -663
1014f63m60N2K69J14K62M11J56q6M74K73j29L12J38m85j31Q6l65l29q1k93m49
$$ -663 -1123 -1071 -802 -688 -426 -15 141 55 529 802 673 985 1123 638 507 593 228 -101 -182 -475 -924
1035i24L7K35j67j5M18j18k5P02L99k17J96L53k13j38L25l2n13j33j07m42r9J82
$$ -924 -887 -652 -819 -834 -416 -534 -559 143 542 325 521 874 661 523 848 816 303 170 63 -379 -478 -296
1057b96m15l12K95O2j03M82M34l05R2N42J22p1M64Ro39l4K63l91k67R0m13m43
$$ -296 -711 -1023 -728 -666 -769 -287 147 -158 -66 476 598 527 991 1000 361 327 590 199 -68 22 -391 -834
1079h34J54K76l40l1L70Rm2O00K86k34K65K01k09J26L95l55m29o0n1m23l5K48
$$ -834 -680 -404 -744 -775 -405 -396 -438 162 448 214 479 680 471 597 992 637 208 148 97 -326 -361 -113
1101a13m61l22L77pk43N03L31k26J36M63J17j01K40k6l83R0K20l94k16k0l41k11
$$ -113 -574 -896 -519 -526 -769 -266 65 -161 -25 438 555 454 694 668 285 375 595 201 -15 -35 -376 -587
1123e87J25M0k17J33J46p5P1M89J05m7K97J05j77J64P8j99k19j21l4k09r0p3k32
$$ -587 -462 -422 -639 -506 -360 -435 -364 125 230 183 480 585 408 572 650 451 232 111 77 -132 -222 -295 -527
1146e27j29J38k6M8K82Q2J5K13J52Q9K33M6j03j85R0n8k24n4j17l25r0J21j48
$$ -527 -656 -518 -544 -496 -214 -132 -117 96 248 337 570 616 513 328 418 360 136 82 -35 -360 -450 -329 -477
1169d77q7J80r8J70J64K28j0J27J34KN1J46L1k50po5l33l6P1k99j54J40k8j31
$$ -477 -564 -384 -482 -312 -148 80 70 197 331 333 384 530 561 311 304 239 -94 -130 -59 -358 -512 -372 -400 -531
1193e31J28K60j36J10L37R4NK44qj13J9no7j79p8o3l05kN8k45L3J69j13N0L10
$$ -531 -403 -143 -279 -169 168 262 267 511 503 390 409 404 337 158 80 17 -288 -290 -232 -477 -444 -275 -388 -338 -28
1218b8rK6J60K36p2J02Q5k1k04J5o0k02r5j5k04n1j0q7L7M4J38J5P0K07J15Q7
$$ -28 -37 -11 149 385 313 415 500 479 275 290 230 28 -67 -82 -286 -337 -347 -434 -397 -353 -215 -200 -130 77 192 279
1244B79J11kq6N8jo1j81l7j51j49l8np3q3J16K6JJ63J42k0J03J27R6OM4j9m7j06
$$ 279 390 388 302 360 359 298 117 80 -71 -220 -258 -263 -336 -419 -303 -277 -276 -113 29 9 112 239 335 341 385 366 319 213
1272B13Mk10q5j2j65j16P4r8%J22N0O4J08J19J25L9J27K0k9k1J1j11j35k9j49
$$ 213 217 7 -78 -90 -255 -371 -297 -395 -395 -273 -223 -159 -51 68 193 232 359 379 350 329 340 229 94 65 -84
1297h4j02p3j1p5o3N0L4K8J67J37L4J05J32N3QL8mq9n0o8j82m7q9j21q0mK1k2
$$ -84 -186 -259 -270 -345 -408 -358 -324 -296 -129 8 42 147 279 332 340 378 374 285 235 167 -15 -62 -151 -272 -352 -356 -335 -357
1325c57K2J17Q7Q2J34R5L2J05J21p4n9Ro7r9q5j17r0j59K6j8r2J42P3r2J24J40
$$ -357 -335 -218 -131 -49 85 180 212 317 438 364 305 314 247 148 63 -54 -144 -303 -277 -295 -387 -245 -172 -264 -140 0
1351@L0J98O8j5N9J02j04m5q9o6q6j89q5q4n2k1P5l8O6R4L1J44Q3J66j3J04nL5
$$ 0 30 228 296 281 340 442 338 293 204 138 52 -137 -222 -306 -358 -379 -304 -342 -276 -182 -151 -7 76 242 229 333 328 363
1379C63n8rp2r9j25r7n7j35n4Qj8K5L6K6K01Q8M4Q7J50%L5J8m9r0jp8j37m9j95
$$ 363 305 296 224 125 0 -97 -154 -289 -343 -335 -353 -328 -292 -266 -65 23 67 154 304 304 339 357 308 218 217 139 2 -47 -242
1408b42q5o8R5l3q9J60O0J14R2J51K7Q5MN8om2n7n8l0j74j12j31L2r4ML8j4O6
$$ -242 -327 -395 -300 -333 -422 -262 -202 -88 4 155 182 267 271 329 323 281 224 166 136 -38 -150 -281 -249 -343 -339 -301 -315 -249
1436b49L3R6J26J01P8R9QL4M3r9n5K9p8k57j5q0p3q9nj1K2P4J07R3J20Q1J5J24
$$ -249 -216 -120 6 107 185 284 292 326 369 270 215 244 166 -91 -106 -186 -259 -348 -353 -364 -342 -268 -161 -68 52 133 148 272
1464B72N3KRl1l0m0j47r9j45p1q7j2n5L1R3J6P8P7P1J45J19M7O6K9n9jr1p9m1
$$ 272 325 327 336 305 275 235 88 -11 -156 -227 -314 -326 -381 -350 -257 -241 -163 -86 -15 130 249 296 362 391 332 331 240 161 120
1493A20j82l4j05m3m1j41J33n5O6J42K6J30J58N4KR3ML0mn3j35q4j09j8j66q3
$$ 120 -62 -96 -201 -244 -285 -426 -293 -348 -282 -140 -114 16 174 228 230 323 327 357 353 300 165 81 -28 -46 -212 -295
1519b95n4j0j1M5Q0N5L9J36J52O3R6R3m5kJn2j04q6j13j14j57L1j8j02l4O6L6
$$ -295 -349 -359 -370 -325 -245 -190 -151 -15 137 200 296 389 344 342 343 291 187 101 -12 -126 -283 -252 -270 -372 -406 -340 -304
1546c04J09J52M2Q2Q6J56n1J36Np8j19l1o0j36l6j17j43o2j2K1l6J58J04J2P0
$$ -304 -195 -43 -1 81 167 323 272 408 413 335 216 185 125 -11 -47 -164 -307 -369 -381 -360 -396 -238 -134 -122 -52
1571e2K12K9Q9JJ25r7qN5j49j24n0j56j44L3n6r8N1K3k0J49J29Q9L5R5J21OJ6
$$ -52 160 189 278 279 404 307 299 354 205 81 31 -125 -269 -236 -292 -390 -339 -316 -336 -187 -58 31 66 161 282 288 304
1598C04J36j11j09J7j32p7p0j19j55o5P7n3J2J44nkJ90J15N8J26N7K0MJ5p6j20
$$ 304 440 329 220 237 105 28 -42 -161 -316 -381 -304 -357 -345 -201 -206 -208 -18 97 155 281 338 358 362 377 301 181
1624A81l1j00j42p0q1m2o6m8K9N1P9J50M2J51J09L8MJ60j1m7l1j32j09l4l9j39
$$ 181 150 50 -92 -162 -243 -285 -351 -399 -370 -319 -240 -90 -48 103 212 250 254 414 403 356 325 193 84 50 11 -128
1650a28j93L7l2j10P7Q4l6J60Q8R7J18Q7N4qN1O3p7r8n7j36j69M6r1j99L3nn7
$$ -128 -321 -284 -316 -426 -349 -265 -301 -141 -53 44 162 249 303 295 346 409 332 234 177 41 -128 -82 -173 -372 -339 -344 -401
1677d01L3J04J13J0J56R9J05O8R6m2n9K1l0j04o5q6j41j24k6q4l5P0M2lO5J64
$$ -401 -368 -264 -151 -141 15 114 219 287 383 341 282 303 273 169 104 18 -123 -247 -273 -357 -392 -322 -280 -283 -218 -54
1703e4L6J03K04j2j1J29k5l6o2p9q1j37o7j06j26j5qp9O9J24O4N8J15P5M8J64
$$ -54 -18 85 289 277 266 395 370 334 272 193 112 -25 -92 -198 -324 -339 -347 -426 -357 -233 -169 -111 4 79 127 291
1729B91J6P0NPj15j12j5j82m5j35j29J9q3O9j0K0M2J39N3J36Q0J48N1M6K2o9J4
$$ 291 307 377 382 389 274 162 147 -35 -80 -215 -344 -325 -408 -339 -349 -329 -287 -148 -95 41 121 269 320 366 388 319 333
1756C33j39j8j70j00l4j98L3Mj34R5M0J6J10J24O5J52O2L8Q1ln4Mj4j73k6j31
$$ 333 194 176 6 -94 -128 -326 -293 -289 -423 -328 -288 -272 -162 -38 27 179 241 279 360 357 303 307 293 120 94 -37
1782c7m8j83k0m6n0M5O6L1O2J01J04J62Q2P0N1K1n4k7k7j12n9j35j21p1j51jl1
$$ -37 -85 -268 -288 -334 -384 -339 -273 -242 -180 -79 25 187 269 339 390 411 357 330 303 191 132 -3 -124 -195 -346 -347 -378
1809c78J8P5n7J86P1O4J61J20O3RK1m5K9p5o8m3j05j51j03o0j05J1L6q0J11R7
$$ -378 -360 -285 -342 -156 -85 -21 140 260 323 332 353 308 337 262 194 151 46 -105 -208 -268 -373 -362 -326 -406 -295 -198
1835a98J09Q1J14J49PJ09l2k9N8q8l1r2j11j32j04n6m1q3k3K8R2j3J29J25J72
$$ -198 -89 -8 106 255 262 371 339 310 368 280 249 157 46 -86 -190 -246 -287 -370 -393 -365 -273 -286 -157 -32 140
1860A40Q3J31qJ0lQp0m9n7r4j62r9r6n5j5q7K2N5Q8R6J00J40P7J24J4N2L5m7L4
$$ 140 223 354 346 356 353 361 291 242 185 91 -71 -170 -266 -321 -336 -423 -401 -346 -258 -162 -62 78 155 279 293 345 380 333 367
1889C67j15q3j22j1j94j04o2l5mK2M4N7R2J08L0J24J22M6J34m7j3J8j36r0n9j30
$$ 367 252 169 47 36 -158 -262 -324 -359 -363 -341 -297 -240 -148 -40 -10 114 236 282 416 369 356 374 238 148 89 -41
1915d1j25j4j25l4l7l3OJ08J28O4J49J7K01P0j9O3mo1qq2j19j40Mj63p3n9Jk1
$$ -41 -166 -180 -305 -339 -376 -409 -403 -295 -167 -103 46 63 264 334 315 378 374 313 305 223 104 -36 -32 -195 -268 -327 -326 -347
1943c47PP8O8N5J62P1J33Q5J2L9Lm9p9q1m0j47l7j39l5r9l3m5P4K7Q0K08L0N3
$$ -347 -340 -262 -194 -139 23 94 227 312 324 363 366 317 238 157 117 -30 -67 -206 -241 -340 -373 -418 -344 -317 -237 -29 1 54
1971E4J45L1O5Q3k0j9n9L8k24m3o4j94p1o5Nj8KR2M8Q9J15O3R0J20M5K4N0J6r6
$$ 54 199 230 295 378 358 339 280 318 94 51 -13 -207 -278 -343 -338 -356 -354 -262 -214 -125 -10 53 143 263 308 332 382 398 302
2000C02l3n6j18j70r2r5r8k2KN0n1J45J02L8J53Q1N4K5J28MJ7l9o7j26p1l6j44
$$ 302 269 213 95 -75 -167 -262 -360 -382 -380 -330 -381 -236 -134 -96 57 138 192 217 345 349 366 327 260 134 63 27 -117
2027a17j19k0l8j10Q2N5j8N5K22j7J63R6P4k3N6L7m7j15Kj65j28n0p4j25mM6j07
$$ -117 -236 -256 -294 -404 -322 -267 -285 -230 -8 -25 138 234 308 285 341 378 331 216 218 53 -75 -125 -199 -324 -328 -282 -389
2054c89JJ41J3Q7J95L8N2J12N4O8Om0m6j28o0p8j22l3r3q8n2P7Jm5J74J2O1J32
$$ -389 -388 -247 -234 -147 48 86 138 250 304 372 378 338 292 164 104 26 -96 -129 -222 -310 -362 -285 -284 -329 -155 -143 -82 50
2082E0J72M1P2jNr2J9M4j73j28q6r5p1J6l1j80J04J19J0R0P6O5Q5R5J20KM5N9
$$ 50 222 263 335 334 339 247 266 310 137 9 -77 -172 -243 -227 -258 -438 -334 -215 -205 -115 -39 26 111 206 326 328 373 432
2110D32j77o3rj15j39rq0j89k4R5j15J26O9N3J8J61J38QO0N0m2O2Q0j38j06n0
$$ 432 255 192 183 68 -71 -80 -160 -349 -373 -278 -393 -267 -198 -145 -127 34 172 180 240 290 248 310 390 252 146 96
2136I6p7j32o9k3j01o8M2J02m5Q5J75LL2J34Q8L5J13l6j09j8J0j18j17m8p5j55
$$ 96 19 -113 -182 -205 -306 -374 -332 -230 -275 -190 -15 -12 20 154 242 277 390 354 245 227 237 119 2 -46 -121 -276
2162b76O4q2m8M8O9K6qK25J01mN5J47n7K1K5j0j29p2Nk08L0p6j53nj3J2K5J14
$$ -276 -212 -294 -342 -294 -225 -199 -207 18 119 115 170 317 260 281 306 296 167 95 100 -108 -78 -154 -307 -312 -325 -313 -288 -174
2190a74K1Q1P9J12R2R3j8Jm3J05j17m2q2r2j41j16N6q7o0R0K8nR4K2J18J5J43
$$ -174 -153 -72 7 119 211 304 286 287 244 349 232 190 108 16 -125 -241 -185 -272 -332 -242 -214 -219 -125 -103 15 30 173
2217A73M7P5%M0l8m2j00j4j68L7j11j17j13M8k0P2N7m4R4O6J52J9J43L8L9m8M0
$$ 173 220 295 295 335 297 255 155 141 -27 10 -101 -218 -331 -283 -303 -231 -174 -218 -124 -58 94 113 256 294 333 285 325
2244C25j01j8m9j30q7q2o4j07k5Om4J36L4R7L3N1J86k3J06Q9qm8k0o3q6p9m1k
$$ 325 224 206 157 27 -60 -142 -206 -313 -338 -332 -376 -240 -206 -109 -76 -25 161 138 244 333 325 277 257 194 108 29 -12 -14
2272a4j83n0L6o9j5P5k4RJ81O6M6J22J06no3M8j7p8Pn6j13p3j13l2p3L2m1O9k
$$ -14 -197 -247 -211 -280 -295 -220 -244 -235 -54 12 58 180 286 281 218 266 249 171 178 122 9 -64 -177 -209 -282 -250 -291 -222 -224
2301b24%J45O4P1L8J08J00K0m3L0p3j10m2l7n7j71k3n9n0L4NJ3O0P3R4L9J12R6
$$ -224 -224 -79 -15 56 94 202 302 322 279 309 236 126 84 47 -10 -181 -204 -263 -313 -279 -274 -261 -201 -128 -34 5 117 213
2329B13L3P4l8K3m6l7o5j22j10k7j05Oo5l9KO1L6L8N6J55M3P1R0N4m5O1l8p5j20
$$ 213 246 320 282 305 259 222 157 35 -75 -102 -207 -201 -266 -305 -303 -242 -206 -168 -112 43 86 157 247 301 256 317 279 204 84
2358H4k7n1o1j26o0%p6MJ06J9M9P0Q7N5Q6K4O8N0pr1Pk2j38o9pp9j74j5mN6m4
$$ 84 57 6 -55 -181 -241 -241 -317 -313 -207 -188 -139 -69 18 73 159 183 251 301 294 203 210 188 50 -19 -26 -105 -279 -294 -298 -242 -286
2389b86O7NJ83M8O9J08l0Q5J4N1k7Jj11m4n5q2q3m1j15l1L0m1O8J2M6R8Q9Q7R5
$$ -286 -219 -214 -31 17 86 194 164 249 263 314 287 288 177 133 78 -4 -87 -128 -243 -274 -244 -285 -217 -205 -159 -61 28 115 210
2418B10M1m4L4P2q2j16J9r7qj47n9Mq9m3L9K9J0O9J28K0P0J40m7J26j0mo5L6m9
$$ 210 251 207 241 313 231 115 134 37 29 -118 -177 -173 -262 -305 -266 -237 -227 -158 -30 -10 60 200 153 279 269 265 200 236 187
2447A87j28n0j39l5m3J7j03QO1mR2M5P4R2P0O6Q0%r2R5p5r1m3o8m9j01lr8J5L1
$$ 187 59 9 -130 -165 -208 -191 -294 -286 -225 -229 -137 -92 -18 74 144 210 290 290 198 293 218 127 84 16 -33 -134 -137 -235 -220 -189
2477a89r0jJ25Q0J2J60O5q5J51J5ok9m5k9l1J3j62j08M3r1j5m0K0J8O1O4J8Q4
$$ -189 -279 -280 -155 -75 -63 97 162 77 228 243 237 208 163 134 103 116 -46 -154 -111 -202 -217 -257 -237 -219 -158 -94 -76 8
2505HJ12K8MO6j3J7l7m2k4r3j4j09r2k0k2m7P0Qj4M8J44J8N8L6J27L7J3o2L5n4
$$ 8 120 148 152 218 205 222 185 143 119 26 12 -97 -189 -209 -231 -278 -208 -200 -214 -166 -22 -4 54 90 217 254 267 205 240 186
2535A86l9k7j32j0p7m8q8N2Om0L4L9M0R6J22NJ7L0O2o2J2jk2j16Ln1p7np2p8k
$$ 186 147 120 -12 -22 -99 -147 -235 -183 -177 -217 -183 -144 -104 -8 114 119 136 166 228 166 178 177 155 39 42 -9 -86 -91 -163 -241 -243
2566b43J17m7M8Q2j4Q4N1J12o6RP1j0j5Jj08q2k2o0m6Rm1m1K1l3N3J7M9J48J1
$$ -243 -126 -173 -125 -43 -57 27 78 190 124 133 204 194 179 180 72 -10 -32 -92 -138 -129 -170 -211 -190 -223 -170 -153 -104 44 55
2595E5Q3L1k4J5O9o6m2mk6r4n8Qr6j34R0O6r7J00JN2j7J89l3J07K6Lm4j4K7n6
$$ 55 138 169 145 160 229 163 121 117 91 -3 -61 -53 -149 -283 -193 -127 -224 -124 -123 -71 -88 101 68 175 201 204 160 146 173 117
2625A17K0q3j02r8M1J2j65L4R2p2N3R7jQ3LJ11l1N0Q3q6Rln9o0j1r8n0pN9p1l
$$ 117 137 54 -48 -146 -105 -93 -258 -224 -132 -204 -151 -54 -55 28 31 142 111 161 244 158 167 164 105 45 34 -64 -114 -121 -62 -133 -136
2656a36j2k4K8R6M9L9M1N9J8L3pL2o8o8n4Qr9J1p2m9m5O2j6nR3j6O0N2N9j8O8
$$ -136 -148 -172 -144 -48 1 40 81 140 158 191 184 216 148 80 26 34 -65 -54 -126 -175 -220 -158 -174 -179 -86 -102 -42 10 69 51 119
2687A19M8j2l4L3p0n3j2Qp6r6j2m5J2R2k8J8j4R2N3j5J15k4K7kJ12q6l6p4k7Q
$$ 119 167 155 121 154 84 31 19 27 -49 -145 -157 -202 -190 -98 -126 -108 -122 -30 23 8 123 99 126 124 236 150 114 40 13 21
2717B1n0j33O2Rm5Kj4Q6k0L8K1P1kN7O9l2nJ7l8m0J2n1j00rk4n1kJ6L2r7R6K9
$$ 21 -29 -162 -100 -91 -136 -134 -148 -62 -82 -44 -23 48 46 103 172 140 135 152 114 74 86 35 -65 -74 -98 -149 -151 -135 -103 -200 -104 -75
2749g5R0LJ13K4J2K2k1qRl6m5n7l6m9k4m7l9p6R0M7J4QkJ05%N0K9J9nj6K1q2R6
$$ -75 15 18 131 155 167 189 168 160 169 133 88 31 -5 -54 -78 -125 -164 -240 -150 -103 -89 -81 -83 22 22 72 101 120 115 99 120 38 134
2782A34m7j66M9j5o5J2pk8K6N2l6L1P4J3P1j1Q6%p0K1l3m3m8J1r5J1j9j26P7n
$$ 134 87 -79 -30 -45 -110 -98 -105 -133 -107 -55 -91 -60 14 27 98 87 173 173 103 124 91 48 0 11 -84 -73 -92 -218 -141 -146
2812a46M2j4L2K9N0L8O2Rk4P0k4LK2o9J7j04L4j4j31Q8p1j2lO2m0RO2O2J8L8N9
$$ -146 -104 -118 -86 -57 -7 31 93 102 78 148 124 127 149 80 97 -7 27 13 -118 -30 -101 -113 -116 -54 -94 -85 -23 39 57 95 154
2843A54o5M2J0o9N1or4m0l4m9k8K0%q2J01k3M2J8O5L3M0j2J3N2m7R0q8nn1k7n0
$$ 154 89 131 141 72 123 117 23 -17 -51 -100 -128 -108 -108 -190 -89 -112 -70 -52 13 46 86 74 87 139 92 182 94 89 38 11 -39
2874c9j8l5L2n5K0k3M5P6lO6o6P7O1Mj8l4J0l2J9m0l8n9K3p7Lqm0N8K5n3M4R4
$$ -39 -57 -92 -60 -115 -95 -118 -73 3 0 66 0 77 138 142 124 90 100 68 87 47 9 -50 -27 -104 -101 -109 -149 -91 -66 -119 -75 19
2906A9m0O4K6M2K5l8j6k4L9q2j5l7Jk8o1N7KNK1l7O3oN0L7K1Kj1L1m6k0kM8j23
$$ 19 -21 43 69 111 136 98 82 58 97 15 0 -37 -36 -64 -125 -68 -66 -61 -40 -77 -14 -20 30 67 88 90 79 110 64 44 42 90 -33
2939c3L6n8K4l0o5K2j7M6j7P0JpO6j7O7k3K7m8J0Q1o2l6l9k2PK1j25Pl1J09m0
$$ -33 3 -55 -31 -61 -126 -104 -121 -75 -92 -22 -21 -28 38 21 88 65 92 44 54 135 73 37 -2 -24 -17 4 -121 -114 -145 -36 -76
2970g6M9J7J6K6K2K3M1l2Qkp8K4l2K0o0Jj6n0MK9mk7K6P5Ok0Q4k5j7O1jm0j6L4
$$ -76 -27 -10 6 32 54 77 118 86 94 92 14 38 6 26 -34 -33 -49 -99 -95 -66 -70 -97 -71 4 10 -10 74 49 32 93 92 52 36 70
3004G0j4q5M1Mn6k3P1k7r8J03LJN5Mj2l9JL0M4K7n7mN5q1p3OL1n7QO3k5j8J8o
$$ 70 56 -29 12 16 -40 -63 8 -19 -117 -14 -11 -10 45 49 37 -2 -1 29 73 100 43 39 94 13 -60 -54 -23 -80 -72 -9 -34 -52 -34 -40
3038d0l4O6N2l3KL3L5n1Q3j7m7p3QL8p4N6l2L3j0m1jJ4M8k7K4K3J2j5k5L9n0J4
$$ -40 -74 -8 44 11 13 46 81 30 113 96 49 -24 -16 22 -52 4 -28 5 -5 -46 -47 -33 15 -12 12 35 47 32 7 46 -4 10
3070A0Q3l9m9j8N1q2j4M3j0k0LJ5j6J05q1N3O1j9nlk9L9m3J0k6j5O2k1o0qk5J5
$$ 10 93 54 5 -13 38 -44 -58 -15 -25 -45 -42 -27 -43 62 -19 34 95 76 71 68 39 78 35 45 19 4 66 45 -15 -23 -48 -33
3102c3m8N6O4m7J1l2L7L4Lo8mJ06k9k6q1O4j4m4J03l6m9l3J8j0k1R8n9OlJ05K
$$ -33 -81 -25 39 -8 3 -29 8 42 45 -23 -27 79 50 24 -57 7 -7 -51 52 16 -33 -66 -48 -58 -79 19 -40 -34 -37 68 70
3133G0m3J39r9p4J15q0J4K1l6q4j7L7J4l3N1n3j0R3J2k3j9J4J7mO5J7q2j0%M5
$$ 70 27 166 67 -7 108 28 42 63 27 -57 -74 -37 -23 -56 -5 -58 -68 25 37 14 -5 9 26 22 87 104 22 12 12 57
3163E7o9P4n4l7j4J1q0P6J8Ml7Q9j3m2L2N6p1jR4n3%L9m8k6j3l5jlj7O4l8J5O5
$$ 57 -12 62 8 -29 -43 -32 -112 -36 -18 -14 -51 38 25 -17 15 71 0 -1 93 40 40 79 31 5 -8 -43 -44 -47 -64 0 -38 -23 42
3196D2j08Q8J6m7M1J1J6m1J3j4nnM2k6k6M2q2j9O2q2Q7j4o2J15n9J8L9j4K8L4
$$ 42 -66 22 38 -9 32 43 59 18 31 17 12 7 49 23 -3 39 -43 -62 0 -82 5 -9 -71 44 -15 3 42 28 56 90
3226I0j11Q5o4L0m5N7p6k1N6K8j12J7N6m4J7R0o3m5Q6M4o5m3M2Qn8lM5J4p1N1
$$ 90 -21 64 0 30 -15 42 -34 -55 1 29 -83 -66 -10 -54 -37 53 -10 -55 31 75 10 -33 9 17 -41 -44 1 15 -56 -5
3256enr4M6N0L9o9J3RK2j5R2q8N2K0l5K6o2k2j8N3j8%nko0J7L7j8k2P9L6j7jn
$$ -5 -10 -104 -58 -8 31 -38 -25 -16 6 -9 83 -5 47 67 32 58 -4 -26 -44 9 -9 -9 -14 -16 -76 -59 -22 -40 -62 17 53 36 35 30
3290C0M7j2Qp2j9K6l5K2O4l9r8M6P5r9M2L1Qk2J2L2m5j0M6J4mo%m3J1l0J3j12
$$ 30 77 65 73 1 -18 8 -27 -5 59 20 -78 -32 43 -56 -14 17 25 3 15 47 2 -8 38 52 48 42 42 -1 10 -20 -7 -119
3322a19P2R4o8l0J9k5J8M0k3L3K0l0ML2kJ6p4K5rOO1k5m6k7M6j8J4J6k5K7K3j9
$$ -119 -47 47 -21 -51 -32 -57 -39 1 -22 11 31 1 5 37 35 51 -23 2 -7 -1 60 35 -11 -38 8 -10 4 20 -5 22 45 26
3354B6j8J3l0L6mj3L5k7j4m7NJ0O2n1m0MN8m4OM8m2N2J4kJk3m9j3O3jm8N0q2J4
$$ 26 8 21 -9 27 23 10 45 18 4 -43 -38 -28 34 -17 -57 -53 5 -39 -33 15 -27 25 39 37 38 15 -34 -47 16 15 -33 17 -65 -51
3388e1M6L5n4J2J6l1K2j9o3P5NKK6n2N9Mj1kO6j03J1j1K4m6OK7Mj5k1M4p5O0Q
$$ -51 -5 30 -24 -12 4 -27 -5 -24 -87 -12 -7 -5 21 -31 28 32 21 19 85 -18 -7 -18 6 -40 -34 -7 -3 -18 -39 5 -70 -10 -2
3421bl6J6P6n7K4Lkk6QJ4j2m1L4Jj1m1K2rPK8j2K7J3m1m8J02J7m6K0J%p4jLK5
$$ -2 -38 -22 54 -3 21 24 22 -4 4 18 6 -35 -1 0 -11 -52 -30 -39 -32 -4 -16 11 24 -17 -65 37 54 8 28 29 29 -45 -46 -43 -18
3456a8J3J6o8O4k0pN5n1j5O7o8J9K5OLkj7L2k0p4Q8l3L5J8Nk9ll2L3j0l1pNM4
$$ -18 -5 11 -57 7 -13 -20 35 -16 -31 36 -32 -13 12 18 21 19 2 34 14 -60 28 -5 30 48 53 24 21 -11 22 12 -19 -26 -21 23
3490B3J3j8K4k2k2k1P0l8m5P9q7J9pm7L8J8m4L8MR1p1K6Po1M1L1nj4kl2P8l8l3
$$ 23 36 18 42 20 -2 -23 47 9 -36 43 -44 -25 -32 -79 -41 -23 -67 -29 -25 66 -5 21 28 -33 8 39 34 20 18 -14 64 26 -7
3523gJ5no9Q2k2mj9K1M0K0p1J6n1N8N2k4qk7L8n9K3l9k5R0m5L1jRmnj5rk3N7j
$$ -7 8 3 -66 16 -6 -10 -29 -8 32 52 -19 -3 -54 4 56 32 24 -3 35 -24 -1 -40 -65 25 -20 11 10 19 15 10 -5 -14 -37 20 19
3558A9N6q7N5J4o7L1NJ2p9j0L8LJ1K0l2QJ5j7jJ4P3j29Q7on4M2N1j8j05O5J8n3
$$ 19 75 -12 43 57 -10 21 26 38 -41 -51 -13 -10 1 21 -11 -3 12 -5 -6 8 81 -48 39 33 -21 21 72 54 -51 14 32 -21
3590b1N4j5n4k9L0Ol6L8N8Ml8J2mK6L6ro5O4l8m2jO7mm3K3n2l6L1j8K7k1P6K3
$$ -21 33 18 -36 -65 -35 -29 -65 -27 31 35 -3 9 5 31 67 58 -7 57 19 -23 -24 43 39 -4 19 -33 -69 -38 -56 -29 -50 26 49
3623D9q3L1K9%M4k3n3k6R5r3J3l9K0L7k3J9j6k5j0L4l0O7J9k8N1n9jj5O3j7o6
$$ 49 -34 -3 26 26 70 47 -6 -32 63 -30 -17 -56 -36 1 -22 -3 -19 -44 -54 -20 -50 17 36 8 59 0 -1 -16 47 30 -36
3654c6RJK1kJl9k2O3k8j8J5N3k2K0L5j7n6nM0j2J5Rom7nk9L0J1l6KO9qK8j7M1
$$ -36 -27 -26 -5 -7 -6 -45 -67 -4 -32 -50 -35 18 -4 16 51 34 -22 -27 13 1 16 25 19 -28 -33 -62 -32 -21 -57 -55 14 6 34 17 58
3689E8k0j4lNJ9O6r3qJ3j9k1j7K3l3l9Q1K6p2lO6J4j2K2j8M5m6KMj6K1n9N2j0
$$ 58 38 24 21 26 45 111 18 10 23 4 -17 -34 -11 -44 -83 -2 24 -48 -51 15 29 17 39 21 66 20 22 26 10 31 -28 24 14
3722A4l0m1L2K7j6j8j8k6K5Q8j2K4j5j3K0J0m4PK0m0j8Ql2L0K0r1M4K8m5PL4l1
$$ 14 -16 -57 -25 2 -14 -32 -50 -76 -51 37 25 49 34 21 41 51 7 14 34 -6 -24 -16 -48 -18 2 -89 -45 -17 -62 -55 -21 -52
3754e2M4R0o2N1q7R1q3lN5p0M7o1J6N7q9N6k5k2L3l8RN5L1l9J8L2MjJ7n7OKL0
$$ -52 -8 82 20 71 -16 75 -8 -11 44 -26 21 -40 -24 33 -56 0 -25 -47 -14 -52 -43 12 43 4 22 54 58 57 74 17 23 25 55
3787E5m7K4n1n2L5L7o6J5k7J09l5JJ5J8Joll5K0J3j3M2n9knk4L2l7N8j1nN1j0
$$ 55 8 32 -19 -71 -36 1 -65 -50 -77 32 -3 -2 13 31 32 26 23 -12 8 21 8 50 -9 -11 -16 -40 -8 -45 13 2 -3 48 38
3820C8%l6J5K0m4Q0L4l5n5N1q1K3p4P1j3m3J2N4r3P8mK9k2j2J6j2j0N6k1M3Ol8
$$ 38 38 2 17 37 -7 73 107 72 17 68 -13 10 -64 7 -6 -49 -37 17 -76 2 -2 27 5 -7 9 -3 -13 43 22 65 71 33
3852C3Lj8q2N9k4J6K1m7OJ1m7rR4L9k7j9Q7p1rK0k2K8k4rj7p7N7lJ0%j0M0l4L
$$ 33 36 18 -64 -5 -29 -13 8 -39 -33 -22 -69 -78 16 55 28 9 96 25 16 36 14 42 18 9 -8 -85 -28 -31 -21 -21 -31 9 -25 -22
3886b2k0M3m4R0pjm4Q8l2l6N5Or0j0om7L2L3lk1ML2l0L1L4J5J6l1L2k5n0L3L7
$$ -22 -42 1 -43 47 40 39 -5 83 51 15 70 76 -14 -24 -30 -77 -45 -12 -15 -36 -32 0 -30 1 35 50 66 35 67 42 -8 25 62
3919F2m1M2j8j11KmM5j7PNk8O5o0LL2J10m7K6Mo2K1PK0j01M2M3o2m2L4Rq8J07
$$ 62 21 63 45 -66 -64 -68 -23 -40 -33 -28 -56 9 -51 -48 -16 94 47 73 77 15 36 43 63 -38 4 47 -15 -57 -23 -14 -102 5
3951EL3l1k8K9OlNRN7n0k2O0J3p6m7L2J1j5J5n9Ll3L0MNO8K8k5On5P8j4k5K9r
$$ 5 38 7 -21 8 14 11 16 25 82 32 10 70 83 7 -40 -8 3 -12 3 -56 -53 -86 -56 -52 -47 21 49 24 30 -25 53 39 14 43 34
3986C4qm9k7Q0m8J9o9K9K6j6K5j6j2P5m5K7NJ3J5L5l7j5n8P2%o7np0K3RL8pJ0
$$ 34 26 -23 -50 30 -18 1 -68 -39 -13 -29 -4 -20 -32 43 -2 25 30 43 58 93 56 41 -17 55 55 -12 -17 -87 -64 -55 -17 -24 -14
4019a4OJ4k3N6MK7k8K1l5J4k7m0N2k0j6l7J1m2M8NM5m2M6m1LJ7M8L5k1O7r3k7
$$ -14 -8 6 -17 39 43 70 42 63 28 42 15 -25 27 7 -9 -46 -35 -77 -29 -24 21 -21 25 -16 -13 4 52 87 66 133 40 13
4051A3kK2m5j6N6n8oK1l2L1m6j7M1M0L4k4k6P1j8L8olk7klL6l2k4j04MM3pj4K2
$$ 13 11 33 -12 -28 28 -30 -36 -15 -47 -16 -62 -79 -38 2 36 12 -14 57 39 77 71 68 41 39 36 72 40 16 -88 -84 -41 -48 -62 -40
4085d0kkM3J3k1N7j3qL1k5N5n9ml0L4p5l8P2k9L7l5o3J14jM8p5K6P8k7j8M8l6
$$ -40 -42 -44 -1 12 -9 48 35 27 58 33 88 29 25 -5 29 -46 -84 -12 -41 -4 -39 -102 12 11 59 -16 10 88 61 43 91 55
4117E5jrm5%O6p5q1J8mM6p1J28q5l6O7K7%L0K2Mj6l3J09o7k4M6p5K1o1J9n2n4
$$ 55 54 45 0 0 66 -9 -90 -72 -76 -30 -101 27 -58 -94 -27 0 0 30 52 56 40 7 116 49 25 71 -4 17 -44 -25 -77 -131
4149a31J03p0N9J9K0K8j7N3n2RL6j2m6M8K5Mq0M3p3J0m5K2QJ2j5Ok8O2m9P4M5
$$ -131 -28 -98 -39 -20 0 28 11 64 12 21 57 45 -1 47 72 76 -4 39 -34 -24 -69 -47 -39 -27 -42 -36 -64 -2 -51 23 68
4180F8m8L4N%J4j7l5%j3Mp1M5j0k0p3L1P7m4P6JOJ5j5J9j9J3O1lp3K2%j04kJ6
$$ 68 20 54 59 59 73 56 21 21 8 12 -59 -14 -24 -44 -117 -86 -9 -53 23 24 30 45 30 49 30 43 104 101 28 50 50 -54 -56 -40
4214d0l0M1l4l0L4N5m2k4J20l3j1K0N8n2K7Jm6o2P1K4o2p4O0j5mN2m8m9OR7k9
$$ -40 -70 -29 -63 -93 -59 -4 -46 -70 50 17 6 26 84 32 59 60 14 -48 23 47 -15 -89 -29 -44 -48 4 -44 -93 -87 10 -19
4245a9K0j3R5%Pj9J1n1k8K5p2L4n8j7O8n9k1L3k3J06l6N5l3n1J41m5Lj0J5Pm9
$$ -19 1 -12 83 83 90 71 82 31 3 28 -44 -10 -68 -85 -17 -76 -97 -64 -87 19 -17 38 5 -46 95 50 53 43 58 65 16
4276A6lqk9J3n6o4N6J9l6j5P8R5j03N8k8P8q2N9M5k7k3jJ2mQo0k7n5N1o8M2k4
$$ 16 13 5 -24 -11 -67 -131 -75 -56 -92 -107 -29 66 -37 21 -7 71 -11 48 93 66 43 42 54 50 58 -2 -29 -84 -33 -101 -59 -83
4308h3R1n4K4L1pJ14p7J0O2k5j2j4k2l2n3M0k0N4r5J9J4pn9J26r0M1K6KN0L6o2
$$ -83 8 -46 -22 9 2 116 39 49 111 86 74 60 38 6 -47 -7 -27 27 -68 -49 -35 -42 -101 25 -65 -24 2 4 54 90 28
4339B8J8lL8m7k3K5k6r5N6nK7k0n6QL6L1J3J1l2R3l7KJ5k3j1L9j9l1K5l8k6n4
$$ 28 46 43 81 34 11 36 10 -85 -29 -34 -7 -27 -83 -75 -39 -8 5 16 -16 77 40 42 57 34 23 62 43 12 37 -1 -27 -81
4371h1M7k6nn2O4N8l4M0NK8N7j1k2J8m8LM2j08O4j5j3j1o8J6m6M1J3J2J9PL0j3
$$ -81 -34 -60 -65 -117 -53 5 -29 11 16 44 101 90 68 86 38 41 83 -25 39 24 11 0 -68 -52 -98 -57 -44 -32 -13 -6 24 11
4403A1J2K8j3M4k9m0L2ONk2r8P5r3L0J4n9M6N8j8l6N1L2OKLj3O0n9M8j05K0p5
$$ 11 23 51 38 82 53 13 45 51 56 34 -64 11 -82 -52 -38 -97 -51 7 -11 -47 4 36 42 44 47 34 94 35 83 -22 -2 -77
4435g7lO7k9m4j5mN0J1j4K5k1N2Q0l2J0L1m5L5o5O9m7o8OL5kn3K8j9J2pppO7K7
$$ -77 -80 -13 -42 -86 -101 -105 -55 -44 -58 -33 -54 -2 78 46 56 87 42 77 12 81 34 -34 -28 7 5 -48 -20 -39 -27 -34 -41 -48 19 46
4469D6ooJ5p0N3L4kqk4j0n4Pj0qr2R1nK6l5L5k1Q3nL1k9OO6m5k0K1j5m5N2m6k6
$$ 46 40 34 49 -21 32 66 64 56 32 22 -32 -25 -35 -43 -135 -44 -49 -23 -58 -23 -44 39 34 65 36 42 108 63 43 64 49 4 56 10 -16
4504a6l8O2k5o5M5Kk5O1k2P0j0M5l6P2k5n7lK9or4QN1n5p7K9J6kj4R9o1K1K1J1
$$ -16 -54 8 -17 -82 -37 -35 -60 1 -21 49 39 84 48 120 95 38 35 64 58 -36 -28 23 -32 -109 -80 -64 -66 -80 19 -42 -21 0 11
4537A1k1R9n3L0l6K5QMp3j6J3j9l3K7r2O4j0K1K9MJ9L5K5mJ2Nkl6L5l2Pn0rr6
$$ 11 -10 89 36 66 30 55 63 67 -6 -22 -9 -28 -61 -34 -126 -62 -72 -51 -22 -18 1 36 61 57 69 74 72 36 71 39 46 -4 -13 -109
4571a09J2M4k7lJ9OL0L7KO0m6O7n2j6K4%kkL6j8m8n7j6j6ON5Nk9Q2q8%Q6%LJ9
$$ -109 -97 -53 -80 -83 -64 -58 -28 9 11 71 25 92 40 24 48 48 46 44 80 62 14 -43 -59 -75 -69 -14 -9 -38 44 -44 -44 42 42 45 64
4606F4J7o4O9o3L4k0o8K7lo0j3K3q4J29k3l5LO5k7Q4l6lP7rj8k6P4l6j9m2j1L
$$ 64 81 17 86 23 57 37 -31 -4 -7 -67 -80 -57 -141 -12 -35 -70 -67 -2 -29 55 19 16 93 84 66 40 114 78 59 17 6 9
4638ILJ3q6%Kl2J07m6J00l0k9J4M7k3m0K8j8M5k2q4K6o7M0mk2Pk9M6N8m4N5O2
$$ 9 12 25 -61 -61 -59 -91 16 -30 70 40 11 25 72 49 9 37 19 64 42 -42 -16 -83 -43 -47 -69 -62 -91 -45 13 -31 24 86
4670H6rk3LK4m6M0K8p0k7K3J0p6k0qj9nK5L8l9O0K3q4J19Rk1OL2J0k0j3J9p3J2
$$ 86 77 54 57 81 35 75 103 33 6 29 39 -37 -57 -65 -84 -89 -64 -26 -65 -5 18 -66 53 62 41 47 79 89 69 56 75 2 14
4703A4p5L0m5K4MrMk8O8J2K2n6N3K0L6mk3L0op8N1n2n4O5p3J9O9o0Kn6J02r9M0
$$ 14 -61 -31 -76 -52 -48 -57 -53 -81 -13 -1 21 -35 18 38 74 70 47 77 71 -7 44 -8 -62 3 -70 -51 18 -42 -40 -96 6 -93 -53
4736e3Q0MK8L5o8P6m8j1J4n3mj3l3k3J2J6m3J4N2Qk3K7jR8o9Q2j0Ok6k5m4M7j10
$$ -53 27 31 59 94 26 102 54 43 57 4 0 -13 -46 -69 -57 -41 -84 -70 -18 -10 -33 -6 -7 91 22 104 94 100 74 49 5 52 -58
4769e8P6l6Rq5J6N6l6m1Q3j3L9l5O3K5p3L6PKO0k9o4J5l7Kk0K6q8M5Mk3P0m2M3
$$ -58 18 -18 -9 -94 -78 -22 -58 -99 -16 -29 10 -25 38 63 -10 26 33 35 95 66 2 17 -20 -18 -38 -12 -100 -55 -51 -74 -4 -46 -3
4802cPR3o5JM3p5P2j1k2j3j1L5Oo9n3jLj9qRM4O7j5OJ4J5p1O1N9m8L7p8M2m1L1
$$ -3 4 97 32 33 76 1 73 62 40 27 16 51 57 -12 -65 -66 -63 -82 -90 -81 -37 30 15 21 35 50 -21 40 99 51 88 10 52 11 42
4837D2j6n8M7m0k6K3nOJ1J3J2l9O8jK8k3MK4l9j2lm6oJ0J6l0J3Jq5N3N7o5M0j5
$$ 42 26 -32 15 -25 -51 -28 -33 -27 -16 -3 9 -30 38 37 65 42 46 70 31 19 16 -30 -36 -26 -10 -40 -27 -26 -111 -58 -1 -66 -26 -41
4871d1O1N5o7P0j9Mm0Kjm4L9l6o0M4%m4N0K5k4l0O1MO2Lm9P7l5K1Rq0J2J8n6j0
$$ -41 20 75 8 78 59 63 23 25 24 -20 19 -17 -77 -33 -33 -77 -27 -2 -26 -56 5 9 71 74 25 102 67 88 97 17 29 47 -9 -19
4905a9j6j2J1j7n7R5L4q9%J20n5O5j0p0L1l0N7l4L1lk1LKo9L2Pm1j0N0k0M6m9
$$ -19 -35 -47 -36 -53 -110 -15 19 -70 -70 50 -5 60 50 -20 11 -19 38 4 35 32 11 14 16 -53 -21 -14 -55 -65 -15 -35 11 -38
4937c8O3M1J0k9k6M9l6M8ll6p8O9j0m4l3rjj5R8o1NK3M4l0J0RjN8pjk6Ml9pJ5
$$ -38 25 66 76 47 21 70 34 82 79 43 -35 34 24 -20 -53 -62 -63 -78 20 -41 -36 -13 31 1 11 20 19 77 70 69 43 47 8 1 16
4972A6j8p9RK6J0k2KK3RKJ5Q3l0j7P5p0M8o9N7j8m4J8k0k2q2O0l9M0j1P2q6J02
$$ 16 -2 -81 -72 -46 -36 -58 -56 -33 -24 -22 -7 76 46 29 104 34 82 13 70 52 8 26 6 -16 -98 -38 -77 -37 -48 24 -62 40
5004D0Nn7O1MjL4Nj9l7o8P0o9j0N9q2L1k7m4N5P4J1k5J7l2K2J2L5o9RN0J1o1m9
$$ 40 45 -12 49 53 52 86 91 72 35 -33 37 -32 -42 17 -65 -34 -61 -105 -50 24 35 10 27 -5 17 29 64 -5 4 54 65 4 -45
5037d5N8q4K3j8m0N3PL6m9J9nP3qnm1N8lk6J2j2N3m2km0K2J9l6Pl8M5K4n4O4j3
$$ -45 13 -71 -48 -66 -106 -53 -46 -10 -59 -40 -45 28 20 15 -26 32 29 3 15 3 56 14 12 -28 -6 13 -23 -16 -54 -9 15 -39 25 12
5071A2Qj2QJ4K2j4pk0k3pM8k0o5N0k0Nl0L1k5L0nK5L9p8K9J8K5K0Rl7O7q0l5P1
$$ 12 20 8 16 30 52 38 31 11 -12 -19 29 9 -56 -6 -26 -21 -51 -20 -45 -15 -20 5 44 -34 -5 13 38 58 67 30 97 17 -18 53
5105E3o3m8L2n1L8j8kL8k3Ok0R6j3L%Kl1L3q9P1n1M5Rj1p2oK3K6l1O0k0QK3QJ1
$$ 53 -10 -58 -26 -77 -39 -57 -59 -21 -44 -38 -58 38 25 28 28 30 -1 32 -57 14 -37 8 17 6 -66 -72 -49 -23 -54 6 -14 -6 17 25 36
5140C6Ro3P2Mm1J0J1p2Q7p7J5k6oqJ5M4Ko3%N3LK1k6J4K3K5n5K8n4P2n9J1o5K3
$$ 36 45 -18 54 58 17 27 38 -34 53 -24 -9 -35 -41 -49 -34 10 12 -51 -51 2 5 26 0 14 37 62 7 35 -19 53 -6 5 -60 -37
5174c7Q7o9%ll2l3Q9%N3n2J8j6L4L1k0l3L2m1J2k3K2k6kJ5q5J3O6m1J9K3n4P2
$$ -37 50 -19 -19 -22 -54 -87 2 2 55 3 21 5 39 70 50 17 49 8 20 -3 19 -7 -9 6 -79 -66 0 -41 -22 1 -53 19
5206A9Jj0k5J4k7J2L3q7J03l5k9J8Nl9j0N9M1n5k5r%P2Kk9J8J6KN1m6l0j5L5r1
$$ 19 20 10 -15 -1 -28 -16 17 -70 33 -2 -31 -13 -8 -47 -57 2 43 -12 -37 -46 -46 26 28 -1 17 33 35 86 40 10 -5 30 -61
5239f1MP9kj9j3Qk9pJ2L3p9M9L8j1mN5o4k0P8m0L7o8O1r1L2L2m2L8J1j8j%m2P2
$$ -61 -57 22 20 1 -12 -4 -33 -40 -28 5 -74 -25 13 2 -2 53 -11 -31 47 7 44 -24 37 -54 -22 10 -32 6 17 -1 -2 -2 -44 28
5273B8M2m3J6M0l9J7j1n8M4o8Q6j0o4n7N8j8o0L2Q2Ql8KL5k7N0qJ2J7J1Jk0k6
$$ 28 70 27 43 83 44 61 50 -8 36 -32 54 44 -20 -77 -19 -37 -97 -65 17 25 -13 -11 24 -3 47 39 51 68 79 80 60 34
5305C4k8n2J0L1p0P8%m8J7J3nRL5K0J2K9k0k9NJ7j8m0mJ7K2q3L4n4N8j4l4P3k5
$$ 34 6 -46 -36 -5 -75 3 3 -45 -28 -15 -20 -11 24 44 56 85 65 36 41 58 40 0 -4 13 35 -48 -14 -68 -10 -24 -58 15 -10
5338a0m3J1J8J03o5n4O1K7J3j8L4p7j4K6j6m2M4ln6M5j5L9l9k0R4m8qM2K6l2J5
$$ -10 -53 -42 -24 79 14 -40 21 48 61 43 77 0 -14 12 -4 -46 -2 -5 -61 -16 -31 8 -31 -51 43 -5 -13 29 55 23 38
5369C8RNJ3m6m0K7j09Q8%J1k7l3J04m5M2Lj3l1O2Pn0j3o7O5P1m4o3L3m6RK1L3
$$ 38 47 52 65 19 -21 6 -103 -15 -15 -4 -31 -64 40 -5 37 40 27 -4 58 65 15 2 -65 0 71 27 -36 -3 -49 -40 -19 14
5401A4Lj6j3L0l7L3M7m2M6j6K1p8k2L7J8k0m6nO2j03Q2m9o2J29l5Jk1K6M6m3M
$$ 14 17 1 -12 18 -19 14 61 19 65 49 70 -8 -30 7 25 5 -41 -46 16 -87 -5 -54 -116 13 -22 -21 -42 -16 30 -13 -9
5432iP0m3O2m0K2o6j7L8k7q5P2Jj4L5%k8LP1o5R0j5j4K5l2j8Ork2J7J5o1qM7l0
$$ -9 61 18 80 40 62 -4 -21 17 -10 -95 -23 -22 -36 -1 -1 -29 -26 45 -20 70 55 41 66 34 16 22 13 -9 8 23 -38 -46 1 -29
5466b9%M9p6N1Jl4K3JM6j9K2olqm1J0N0Nn9OMl3J0N5o2L0K8k0l3J2O2o6N3L7l8
$$ -29 -29 20 -56 -5 -4 -38 -15 -14 32 13 35 29 26 18 -23 -13 37 42 -17 -11 -7 -40 -30 25 -37 -7 21 1 -32 -20 42 -24 29 66 28
5501B8K6p7N4K8n2j5j2OQL2m2l7L4k4RRM1k1L7Qm7L7L5k5Rl3L0j4j0jk4k6L1l6
$$ 28 54 -23 31 59 7 -8 -20 -14 -6 26 -16 -53 -19 -43 -34 -25 16 -5 32 40 -7 30 65 40 49 16 46 32 22 21 -3 -29 2 -34
5535c4K2j0K6J3p0P7K5m4Q0m5k0M3q4k5K7L0j6JJ9j9k0l8O0j9Njj2O0%J8k2j4
$$ -34 -12 -22 4 17 -53 24 49 5 85 40 20 63 -21 -46 -19 11 -5 -4 15 -4 -24 -62 -2 -21 -16 -17 -29 31 31 49 27 13
5567A3Q3m1mo0L3qJ4n2j6L4k9O7m3rj9O4k8J5j07Q0N5k9l5POJ3K1L1k5j8l5J1
$$ 13 96 55 51 -9 24 16 30 -22 -38 -4 -33 34 -9 -18 -37 27 -1 14 -93 -13 42 13 -22 -15 -9 4 25 56 31 13 -22 -11
5599a1l9K4k2LN6l2K5%Qk7M4k0m1N3M7K5l9j2k8o6Q2K1o9l5NJ8j3oL4k2N6j3n
$$ -11 -50 -26 -48 -45 11 -21 4 4 12 -15 29 9 -32 21 68 93 54 42 14 -52 30 51 -18 -53 -48 -30 -43 -49 -15 -37 19 6 1
5632AJ2L1rM8k8k3j6JL0n1l0J3O9p1K3NJ6J8m0J3l8N5L1n7K5m6J02Kn2Jl5M4k8
$$ 1 13 44 35 83 55 32 16 17 47 -4 -34 -21 48 -23 0 5 21 39 -1 12 -26 29 60 3 28 -18 84 86 34 35 0 44 16
5665A6m3L9K0n1K1o2M0o7R2jk7P2Mm1M6k1K4k7l2j5rj3K0j6mM4k0kJ4k0K9J3m7
$$ 16 -27 12 32 -19 2 -60 -20 -87 5 4 -23 49 53 12 58 37 61 34 2 -13 -22 -35 -15 -31 -35 9 -11 -13 1 -19 10 23 -24
5698b4J24m5ll3M8r6K6j0%LL4q8Q0rNj9m3PJ9k0L1mj4J02q0J4j8N4m4O1j2n2l
$$ -24 100 55 52 19 67 -29 -3 -13 -13 -10 24 -64 16 7 12 -7 -50 -43 -24 -44 -13 -17 -31 71 -9 5 -13 41 -3 58 46 -6 -9
5731iPk5nK4n2L7J5l7O2Oj6j5%J0L0n4J9L8k0K1J4n7K1k5J0m9L2j6p5M8O6n4K6
$$ -9 -2 -27 -32 -8 -60 -23 -8 -45 17 23 7 -8 -8 2 32 -22 -3 35 15 36 50 -7 14 -11 -1 -50 -18 -34 -109 -61 5 -49 -23
5764b3NL8j6k0j2M1m0j0O7k5J9Nk6j7K0kr6J19n3k8M4M4M6l5m8N8l6K5Jl4JJ7
$$ -23 -18 20 4 -16 -28 13 -27 -37 30 5 24 29 3 -14 6 4 -92 27 -26 -54 -10 34 80 45 -3 55 19 44 45 11 12 29
5796B9m9l3P7Lq1Q1n9M1j1Qk7jK9k6J6j2J3N0%k3LPn0O6m3l4OLk0K3Qk5%L7J6
$$ 29 -20 -53 24 27 -54 27 -32 9 -2 6 -21 -22 7 -19 -3 -15 -2 48 48 25 28 35 -15 51 8 -26 -20 -17 -37 -14 -6 -31 -31 6 22
5831B2LK4k9j8L7%l4N1m1j1j1qkNK5j2jo8P0j5lJ2j1L9J1k5K3M1o0j4j4J9j5m4
$$ 22 25 49 20 2 39 39 5 56 15 4 -7 -15 -17 -12 13 1 0 -68 2 -13 -16 -4 -15 24 35 10 33 74 14 0 -14 5 -10 -54
5865e4M1N8p8P5k6m4oJ01l7l6J4Rj6MK4Oj1L3j25Q1Ol4K1l6J6J9Ll2QK7pk8M2
$$ -54 -13 45 -33 42 16 -28 -34 67 30 -6 8 17 1 5 29 35 24 57 -68 13 19 -15 6 -30 -14 5 8 -24 -16 11 4 -24 18
5898A8j8jk9N0L9m1j9O2m6J4n5O3m4k8J1PjP9j15K0K3N2m1L1kN4p1L9l8k5M2L5
$$ 18 0 -1 -30 20 59 18 -1 61 15 29 -26 37 -7 -35 -24 -17 -18 61 -54 -34 -11 41 0 31 29 83 12 51 13 -12 30 65
5930F5o3k2j3L9m7K4m9M0J3K2rk4J8K9j8Kj1K1k0rk3N3MJ6j9o4pQ0q1k3J07J9
$$ 65 2 -20 -33 6 -41 -17 -66 -26 -13 9 0 -24 -6 23 5 7 -4 17 -3 -12 -35 18 22 38 19 -45 -52 28 -53 -76 31 50
5962E0r7M1O8l4m3M8Mn6O5n1J4qM4m1p0R7o7M4K5n4j0K8N3j12R9L1j08K4K4O4
$$ 50 -47 -6 62 28 -15 33 37 -19 46 -5 9 1 45 4 -66 31 -36 8 33 -21 -31 -3 50 -62 37 68 -40 -16 8 72
5992G2l9n7M0o5Q2l5K5l9k2M4k3M1n4L5J1L5n4N7m6m3O8%J2l7k8J00l8Qp4k1Q
$$ 72 33 -24 16 -49 33 -2 23 -16 -38 6 -17 24 -30 5 16 51 -3 54 8 -35 33 33 45 8 -20 80 42 50 -24 -45 -37
$$ [...]
8191E2
##END NTUPLES=NMR FID
##END=
