##TITLE=1H_Pr 6-OH
 200.13MHz, CDCl3,
 8 sc
 
 6.2.2025
##JCAMPDX= 6.0         $$ Bruker NMR JCAMP-DX V2.0
##DATA TYPE= NMR FID
##DATA CLASS= NTUPLES
##ORIGIN= UXNMR, Bruker Analytische Messtechnik GmbH
##OWNER= pz
$$ XWIN-NMR		Version 3.5
$$ Thu Feb  6 14:03:32 2025 Russian Standard Time (UT+4h)  she@DPX200
##.OBSERVE FREQUENCY= 200.1313
##.OBSERVE NUCLEUS= ^1H
##.DELAY= (6, 6)
##.ACQUISITION MODE= SIMULTANEOUS
##.ACQUISITION SCHEME= undefined
##.AVERAGES= 8
##.DIGITISER RES= 18
##SPECTROMETER/DATA SYSTEM= spect
##.PULSE SEQUENCE= zg30
##.SOLVENT NAME= D2O
##.SHIFT REFERENCE= (INTERNAL, D2O, 0, 14.3821)
##AUDIT TRAIL= $$ (NUMBER, WHEN, WHO, WHERE, WHAT)
$$ ##TITLE= Audit trail, XWIN-NMR		Version 3.5
$$ ##JCAMPDX= 5.01
$$ ##ORIGIN= Bruker BioSpin GmbH
$$ ##OWNER= she
$$ F:/spectra/data/she/nmr/H-C/1/audita.txt
$$ ##AUDIT TRAIL=  $$ (NUMBER, WHEN, WHO, WHERE, WHAT)
(   1,<2025-02-06 14:02:31.28 +0400>,<she>,<DPX200>,
      <created by zg, POWCHK disabled, PULCHK disabled
       configuration hash MD5:
       00 E9 B6 7A A2 85 ED C7 34 08 36 98 17 FE 4E 26
       data hash MD5: 16K
       2D D9 B8 4D 78 0D 81 F8 5A 1A C5 A8 E6 19 3A 35>)
$$ ##END=
$$ 
$$ hash MD5
$$ 17 B5 E4 E7 37 7A BD 8E 82 45 3D 3B 31 CA F3 26
##$RELAX= 
##$RELAX= 
##$RELAX= 
##$RELAX= 
##$RELAX= 
##$RELAX= 
$$ Bruker specific parameters
$$ --------------------------
##$DU= <F:/spectra>
##$EXPNO= 1
##$NAME= <H-C>
##$PROCNO= 1
##$TYPE= <nmr>
##$USER= <she>
##$AMP= (0..31)
100 100 100 100 100 100 100 100 100 100 100 100 100 100 100 100 100 100 
100 100 100 100 100 100 100 100 100 100 100 100 100 100 
##$AQSEQ= 0
##$AQ_mod= 1
##$AUNM= <au_zg>
##$AUTOPOS= <>
##$BF1= 200.13
##$BF2= 200.13
##$BF3= 200.13
##$BF4= 200.13
##$BF5= 200.13
##$BF6= 200.13
##$BF7= 200.13
##$BF8= 200.13
##$BYTORDA= 1
##$CFDGTYP= 0
##$CFRGTYP= 5
##$CHEMSTR= <none>
##$CNST= (0..31)
1 1 145 1 1 1 1 1 1 1 1 1 1 1 1 1 1 1 1 1 1 1 1 1 1 1 1 1 1 1 1 1 
##$CPDPRG= <>
##$CPDPRG1= <>
##$CPDPRG2= <>
##$CPDPRG3= <>
##$CPDPRG4= <mlev>
##$CPDPRG5= <mlev>
##$CPDPRG6= <mlev>
##$CPDPRG7= <mlev>
##$CPDPRG8= <mlev>
##$CPDPRGB= <>
##$CPDPRGT= <>
##$D= (0..31)
0 0.7 0 0 0 0 0 0 0 0 0 0.03 0 0 0 0 0 0 0 0 0 0 0 0 0 0 0 0 0 0 0 0 
##$DATE= 1738836150
##$DBL= (0..7)
120 120 120 120 120 120 120 120 
##$DBP= (0..7)
150 150 150 150 150 150 150 150 
##$DBP07= 0
##$DBPNAM0= <>
##$DBPNAM1= <>
##$DBPNAM2= <>
##$DBPNAM3= <>
##$DBPNAM4= <>
##$DBPNAM5= <>
##$DBPNAM6= <>
##$DBPNAM7= <>
##$DBPOAL= (0..7)
0.5 0.5 0.5 0.5 0.5 0.5 0.5 0.5 
##$DBPOFFS= (0..7)
0 0 0 0 0 0 0 0 
##$DE= 6
##$DECBNUC= <off>
##$DECIM= 32
##$DECNUC= <off>
##$DECSTAT= 4
##$DIGMOD= 1
##$DIGTYP= 9
##$DL= (0..7)
0 120 120 120 120 120 120 120 
##$DP= (0..7)
150 150 150 150 150 150 150 150 
##$DP07= 0
##$DPNAME0= <>
##$DPNAME1= <>
##$DPNAME2= <>
##$DPNAME3= <>
##$DPNAME4= <>
##$DPNAME5= <>
##$DPNAME6= <>
##$DPNAME7= <>
##$DPOAL= (0..7)
0.5 0.5 0.5 0.5 0.5 0.5 0.5 0.5 
##$DPOFFS= (0..7)
0 0 0 0 0 0 0 0 
##$DQDMODE= 0
##$DR= 18
##$DS= 0
##$DSLIST= <SSSSSSSSSSSSSSS>
##$DSPFIRM= 0
$$ [...]
##$SUBNAM0= <"">
##$SUBNAM1= <"">
##$SUBNAM2= <"">
##$SUBNAM3= <"">
##$SUBNAM4= <"">
##$SUBNAM5= <"">
##$SUBNAM6= <"">
##$SUBNAM7= <"">
##$SUBNAM8= <"">
##$SUBNAM9= <"">
##$SW= 18.0517328524113
##$SWIBOX= (0..15)
0 0 2 0 0 0 0 0 0 0 0 0 0 0 0 0 
##$SW_h= 3612.71676300578
##$TD= 16384
##$TD0= 1
##$TE= 0
##$TE2= 300
##$TE3= 300
##$TEG= 300
##$TL= (0..7)
0 120 120 120 120 120 120 120 
##$TP= (0..7)
150 150 150 150 150 150 150 150 
##$TP07= 0
##$TPNAME0= <>
##$TPNAME1= <>
##$TPNAME2= <>
##$TPNAME3= <>
##$TPNAME4= <>
##$TPNAME5= <>
##$TPNAME6= <>
##$TPNAME7= <>
##$TPOAL= (0..7)
0.5 0.5 0.5 0.5 0.5 0.5 0.5 0.5 
##$TPOFFS= (0..7)
0 0 0 0 0 0 0 0 
##$TUNHIN= 0
##$TUNHOUT= 0
##$TUNXOUT= 0
##$USERA1= <user>
##$USERA2= <user>
##$USERA3= <user>
##$USERA4= <user>
##$USERA5= <user>
##$V9= 5
##$VALIST= <valist>
##$VCLIST= <CCCCCCCCCCCCCCC>
##$VD= 0
##$VDLIST= <DDDDDDDDDDDDDDD>
##$VPLIST= <PPPPPPPPPPPPPPP>
##$VTLIST= <TTTTTTTTTTTTTTT>
##$WBST= 1024
##$WBSW= 4
##$XGAIN= (0..3)
0 0 0 0 
##$XL= 0
##$YL= 0
##$YMAX_a= 135479
##$YMIN_a= -163082
##$ZGOPTNS= <>
##$ZL1= 120
##$ZL2= 120
##$ZL3= 120
##$ZL4= 120
##$ABSF1= 10
##$ABSF2= 0
##$ABSG= 5
##$ABSL= 3
##$ALPHA= 0
##$AQORDER= 0
##$ASSFAC= 0
##$ASSFACI= 0
##$ASSFACX= 0
##$ASSWID= 0
##$AUNMP= <proc_1d>
##$AZFE= 0.1
##$AZFW= 0.1
##$BCFW= 1
##$BC_mod= 2
##$BYTORDP= 1
##$COROFFS= 0
##$CY= -3
##$DATMOD= 1
##$DC= 2
##$DFILT= <>
##$DTYPP= 0
##$F1P= 0
##$F2P= 0
##$FCOR= 0.5
##$FTSIZE= 0
##$FT_mod= 4
##$GAMMA= 1
##$GB= 0.15
##$INTBC= 1
##$INTSCL= 1
##$ISEN= 128
##$LB= 0.25
##$LEV0= 0
##$LPBIN= 0
##$MAXI= 10000
##$MC2= 0
##$MEAN= 0
##$ME_mod= 0
##$MI= 1.114404
##$NCOEF= 0
##$NC_proc= 0
##$NLEV= 6
##$NOISF1= 3.799351
##$NOISF2= 2.8
##$NSP= 1
##$NTH_PI= 0
##$NZP= 0
##$OFFSET= 14.38212
##$PC= 1
##$PHC0= -110.6896
##$PHC1= 14.79221
##$PH_mod= 1
##$PKNL= yes
##$PPARMOD= 0
##$PSCAL= 0
##$PSIGN= 0
##$REVERSE= no
##$SF= 200.129724274929
##$SI= 16384
##$SIGF1= 3
##$SIGF2= 2
##$SINO= 400
##$SIOLD= 16384
##$SREGLST= <1H.CDCl3>
##$SSB= 0
##$STSI= 0
##$STSR= 0
##$SW_p= 3205.1282051282
##$SYMM= 0
##$S_DEV= 0
##$TDeff= 0
##$TDoff= 0
##$TI= <>
##$TILT= no
##$TM1= 0
##$TM2= 0
##$TOPLEV= 0
##$USERP1= <user>
##$USERP2= <user>
##$USERP3= <user>
##$USERP4= <user>
##$USERP5= <user>
##$WDW= 1
##$XDIM= 8192
##$YMAX_p= 0
##$YMIN_p= 0
$$ End of Bruker specific parameters
$$ ---------------------------------
##NTUPLES= NMR FID
##VAR_NAME=  TIME,          FID/REAL,        FID/IMAG
##SYMBOL=    X,             R,               I
##VAR_TYPE=  INDEPENDENT,   DEPENDENT,       DEPENDENT
##VAR_FORM=  AFFN,          ASDF,            ASDF
##VAR_DIM=   8192,          8192,            8192
##UNITS=     SECONDS,       ARBITRARY UNITS, ARBITRARY UNITS
##FACTOR=    0.0002768,     1,               1
##FIRST=     0,             0,               0
##LAST=      2.2672688,     0,               0
##MIN=       0,             -163082,         0
##MAX=       2.2672688,     135479,          0
$$ Real data points
##PAGE= N=1
##DATA TABLE= (X++(R..R)), XYDATA
$$ [...]
$$ plain form
1966 -421 489 -163 -417 316 86 -769 -318 450 -40 -309 146 61 -216 411 470 -319 -264 450 280 -378 -46
1987 -46 289 -484 -145 214 -101 -645 -108 105 -358 -188 387 67 -218 244 307 -43 22 533 9 -412 278
2008 278 311 -452 -48 307 -408 -471 358 26 -547 1 311 -165 -491 530 -101 -163 137 431 25 -124 238
2029 238 -99 -222 -237 55 -260 -279 305 -151 -288 -179 6 -175 -188 324 150 -23 94 439 -22 -90 337
2050 337 -147 208 504 -231 -250 -3 147 -308 -284 31 -52 -333 7 11 35 -195 186 17 275 267 152 231 163
2073 163 161 247 -375 -45 -22 -191 -65 -89 -128 -256 107 65 -283 -47 160 36 207 55 130 -376 184 443 -128
2096 -128 355 165 -66 -10 119 37 -2 -407 100 -64 -135 78 -89 76 -146 156 84 -57 118 -35 53 -121
2118 -121 389 -236 60 4 -39 33 -33 -169 -157 -61 44 -139 -5 -85 276 127 -205 32 119 248 157 130 84 -20
$$ packed form
1966d21R10o52k54P33k30q55M51P68m90k69M55q5k77O27N9p89N5P14j70o58L32
1987d6L35p73L39L59l15n44N37K13m63J70N75l20k85M62O3l50O5N11n24m21O90
2008B78L3p63M04L55p15o3Q29l32n73N48L10m76l26J021o31o2L00K94m06j49L62
2029B38l37j23j5K92l15j9N84m56j37J09J85j81j3N12j74j73J17L45m61o8M27
2050C37m84L55K96p35j9K47J50m55K4L15q3k81L40MK4k30L81j69K58qj15P9o8
2073A63kQ6o22L30K3j69J26k4l9j28L63m2l48K36K07j24J71j52P5n06N60K59n71
2096a28M83j90k31N6J29q2l9m05N07j64p1K13j67J65k22L02p2j41J75j53Q8j74
2118a21N10o25K96n6m3P2o6j36J2R6J05j83J34q0L61j49l32K37Q7J29r1k7m6j04
$$ plain form
2142 -20 -242 99 65 -98 -29 34 -24 -370 -143 126 -304 335 101 80 82 143 263 -193 271 143 11 -287 134
2165 134 47 -176 -14 109 37 -138 -281 15 -583 39 202 -208 -303 219 -104 -279 286 438 -36 149 354
2186 354 -148 -291 69 369 -103 -434 -38 -283 -169 -90 -97 -251 -14 252 -47 -296 191 150 2 207 338
2207 338 11 -310 328 -96 -303 -315 2 -102 -125 77 89 -239 10 225 -210 -90 408 -16 -110 296 260 -178
2229 -178 197 128 -143 -210 42 -33 -283 251 289 -312 -318 307 -107 -363 97 -85 -215 238 249 41 -50 386 164
2252 164 -148 -61 36 -488 124 99 -91 -268 63 -76 -487 243 386 -38 -289 228 254 -95 100 354 30
2273 30 -252 476 302 -138 -158 340 -227 -313 564 68 -422 28 334 -315 -167 486 -4 -243 220 419 -101
2294 -101 -176 661 135 -537 247 373 -345 -264 477 -142 -567 40 147 -763 -323 381 -333 -640 204 475 -188
$$ packed form
2142b0k22L41l4j63O9O3n8l46K27K69m30O39k34k1KO1J20m56M64j28j32k98M21
2165A34q7k23J62J23p2j75j43K96n98O22J63m10r5N22l23j75N65J52m74J85K05
2186C54n02j43L60L00m72l31L96k45J14P9pj54K37K66k99k49M87m1j48K05J31
2207C38l27l21O38m24k07j2L17j04k3K02J2l28K49K15m35J20M98m24r4M06l6m38
2229a78L75o9k71o7K52p5k50N34L8o01oO25m14k56M60j82j30M53J1k08r1M36k22
2252A64l12Q7R7n24O12k5j90j77L31j39m11P30J43m24k51N17K6l49J95K54l24
2273C0k82P28j74m40k0M98n67q6Q77m96m90M50L06o49J48O53m90k39M63J99n20
2294a01p5Q37n26o72P84J26p18Q1P41o19m25O07J07r10M40P04p14l07Q44K71o63
$$ plain form
2315 -188 -131 486 265 12 298 246 -426 -72 424 -64 -181 154 223 -443 -358 483 -291 -373 352 239 -461 93
2337 93 632 -225 -41 399 148 -445 388 193 -258 -253 406 -174 -223 353 50 -203 35 417 -96 28 178
2358 178 327 -357 104 514 -226 83 223 -50 -380 -38 361 -400 -252 145 18 -575 54 178 -143 23
2378 23 782 -250 -216 606 344 -272 40 435 -36 -53 567 -102 -225 31 374 -369 -537 101 -321 -313 -113
2399 -113 317 -324 -227 616 25 -249 357 632 -420 -198 6 -208 -386 337 101 -542 309 138 -288 -622
2419 -622 520 -2 -494 126 410 -343 -92 372 280 -421 295 529 -176 -108 269 365 -368 0 300 -345 -93
2440 -93 189 -160 -415 108 234 -615 -274 199 -225 -132 472 662 -341 51 391 -47 -54 251 43 -447 -35
2461 -35 192 -379 -113 275 79 -176 -192 440 -88 -157 237 21 -169 399 263 -123 -84 387 28 -460 8
$$ packed form
2315a88N7O17k21k53K86n2o72L54M96m88j17L35O9o66Q5Q41p74q2P25j13p00N54
2337I3N39q57J84M40k51n93Q33j95m51NO59n80m9N76l03k53K38L82n13J24J50
2358A78J49o84M61M10p40L09J40k73l30L42L99p61J48L97j27n93O29J24l21J66
2378B3P59j032L4Q22k62o16L12L95m71j7O20o69j23K56L43p43j68O38m22QK00
2399a13M30o41R7Q43n91k74O06K75j052K22K04k14j78P23k36o43Q51j71m26l34
2419f22J142n22m92O20K84p53K51M64r2p01P16K34p05O8L77R6p33L68L00o45K52
2440i3K82l49k55N23J26q49L41M73m24R3O04J90j003L92L40m38pL05k08m90M12
2461c5K27n71K66L88j96k55j6O32n28o9L94k16j90N68j36l86L9M71l59m88M68
$$ plain form
2482 8 128 -550 -157 174 -270 -137 340 111 -479 158 376 -241 -94 308 228 -468 229 379 -352 -115 565
2503 565 -71 -312 0 346 -279 -401 208 -183 -803 33 178 -628 202 573 -10 145 694 356 -333 -59
2523 -59 365 -183 -195 176 -130 -567 -157 144 -388 85 233 139 -286 156 61 -264 140 462 150 -331 215
2544 215 353 -289 -176 315 -53 -731 249 237 -239 206 321 -8 -376 382 51 -162 -28 154 42 -68
2564 -68 466 6 -260 127 -147 41 -298 422 -137 -429 105 310 -268 67 202 -237 -333 133 104 -242 293
2585 293 203 57 132 190 60 -292 -16 187 -44 -31 152 -134 -75 -72 266 -314 -79 389 -86 16 79 -100 20
2608 20 200 266 -198 -128 -14 -75 -183 -256 -16 9 -149 77 -192 -444 -310 -21 -298 134 113 -88 -94 86 315
2631 315 -58 37 197 436 -223 -255 24 -495 -363 214 -568 -95 -136 295 -8 -361 420 103 -89 42 -114
$$ packed form
2482HJ20o78L93L31m44J33M77k29n90O37K18o17J47M02q0o96O97J50p31K37O80
2503E65o36k41L12L46o25j22O09l91o20Q36J45q06Q30L71n83J55N49l38o89K74
2523e9M24n48j2L71l06m37M10L01n32M73J48r4m25M42r5l25M04L22l12m81N46
2544B15J38o42J13M91l68o78R80j2m76M45J15l29l68P58l31k13J34J82j12j10
2564f8N34m60k66L87k74J88l39P20n59k92N34K05n78L35J35m39r6M66k9l46N35
2585B93r0j46P5N8j30l52K76K03k31J3J83k86N9LL38n80K35M68m75J02O3j79J20
2608B0J80O6m64P0J14o1j08p3K40K5j58K26k69k52J34K89k77M32k1k01oJ80K29
2631C15l73R5J60K39o59l2K79n19J32N77p82M73m1M31l03l53P81l17j92J31j56
$$ plain form
2652 -114 -48 249 247 -72 -49 -101 144 -121 -230 22 91 -417 53 -75 -234 -109 -250 -47 119 97 57 -111 243
2675 243 -147 18 -237 -253 144 -230 191 -212 -232 50 190 -379 -240 291 -131 -270 -224 302 241 102 207
2696 207 -44 44 320 32 -104 112 94 -10 -14 -14 -354 -61 -39 -130 -12 182 -105 179 -88 -197 -17 135 -26
2719 -26 202 268 102 172 -6 3 -337 216 38 -210 -213 -84 -8 -116 149 -101 -112 257 22 4 183 20 -125
2742 -125 -80 12 125 -59 -229 -133 15 73 42 52 4 -221 -301 83 120 123 110 -99 69 81 235 461 202 374
2766 374 -109 56 -19 304 67 45 65 239 -387 -61 102 -19 -234 -18 221 -184 -228 107 137 -124 -19 -24
2788 -24 -201 200 381 2 44 181 132 -291 -105 -172 0 -326 -84 -53 -375 216 382 -106 -140 120 145 -142
2810 -142 231 334 -50 -32 184 177 -339 70 65 -228 -117 -242 20 -231 69 283 -29 49 448 331 -98 169
$$ packed form
2652a14O6K97kl19K3n2K45k65j09K52O9n08M70j28j59J25j41K03J66k2m0j68L54
2675B43l90J65k55j6L97l74M21m03k0K82J40n69J39N31m22j39M6N26o1j39J05
2696B07k51Q8K76k88j36K16j8j04m%l40K93K2r1J18J94k87K84k67j09J80J52j61
2719b6K28O6j66P0j78Rl40N53j78k48lJ29P6j08K65k50j1L69k35j8J79j63j45
2742a25M5R2J13j84j70R6J48N8l1J0m8k25q0L84L7Lj3k09J68J2J54K26k59J72
2766C74m83J65p5L23k37k2K0J74o26L26J63j21k15K16K39m05m4L35L0k61J05n
2788b4j77M01J81l79M2J37m9m23J86o7J72l26K42L1l22N91J66m88l4K60K5k87
2810a42L73J03l84J8K16pn16M09nk93J11j25K62k51L00K14l12P8L99j17m29K67
$$ plain form
2832 169 276 -400 95 346 45 55 37 43 -197 -27 -26 -291 -80 -110 -34 -102 143 55 -26 -102 199 -121 -128 217 101
2857 101 -67 8 100 -16 -228 44 -77 -259 -158 130 -24 -260 38 217 -212 -95 147 -250 234 337 285
2878 285 -396 359 259 -332 -177 396 21 -307 56 126 -167 -133 161 -199 -80 -2 14 -166 53 343 215
2899 215 92 218 3 9 -23 260 -294 -278 191 20 -388 202 255 -65 51 264 -158 -435 58 317 -97 92
2921 92 293 110 -406 -37 197 -264 5 188 -113 -349 192 100 -106 95 283 -281 -269 610 191 -35 182
2942 182 419 -159 -194 269 319 -340 126 450 37 -184 62 -3 -239 85 209 -183 -318 131 131 41 282 -3
2964 -3 -212 73 416 -32 -100 271 178 -316 72 272 -372 -282 133 99 -319 378 184 -37 -165 335 -9 7
2986 7 540 432 -356 102 442 -13 -351 269 292 -366 -113 112 -346 -262 313 175 -307 103 260 -226 -165 453
$$ packed form
2832A69J07o76M95K51l01J0j8Ok40J70Jk65K11l0P6o8K45q8q1p6L01l20pL45j16
2857A01j68P5R2j16k12K72j21j82J01K88j54k36K98J79m29J17K42l97M84J03n2
2878B85o81P55j00n91J55N73l75l28L63P0k93L4K94l60J19P8J6j80K19K90j28
2899B15j23J26k15Ol2K83n54J6M69j71m08N90N3l20J16K13m22k77M93K59m14J89
2921I2K01j83n16L69K34m61K69J83l01k36N41r2k06K01J88n64J2Q79m19k26K17
2942A82K37n78l5M63N0o59M66L24m13k21K46o5k36L24J24l92j35M49%r0K41k85
2964ck09K85L43m48o8L71r3m94L88K00o44R0M15l4m18O97j94k21j28N00l44J6
2986GN33j08p88M58L40m55l38O20K3o58K53K25m58Q4N75j38m82M10J57m86O1O18
$$ plain form
3008 453 321 -39 40 283 -230 196 206 -225 -312 384 160 -602 -161 212 -143 -351 111 437 -358 -197 420
3029 420 -163 -210 16 65 -278 33 297 -137 -100 406 -97 -375 -275 212 -227 -392 272 248 -385 14 30 -202
3051 -202 -47 162 -29 -194 248 168 -362 79 317 74 -292 549 269 -188 -53 327 -277 -236 197 -39 -281
3072 -281 22 7 -299 5 166 383 -77 173 215 -196 41 131 235 -295 277 -13 -201 -243 132 -201 -21
3093 -21 353 123 -12 38 136 -82 273 204 53 -20 110 -54 -186 -154 -64 -25 -109 48 140 -271 93 -80 -33 -20
3117 -20 154 378 33 130 423 355 95 380 46 -72 -83 -58 -181 -243 109 65 -346 -83 228 -243 -129 378
3139 378 46 -350 159 130 108 -44 3 -20 -204 210 82 -214 -134 272 53 -572 -30 -85 -495 -210 -6 -359
3161 -359 -16 289 91 -31 76 352 -165 -143 -37 106 -33 145 174 60 155 227 -10 -83 49 53 19 -309 360
$$ packed form
3008D53j32l60P9K43n13M26J0m31q7O96k24p62M41L73l55k08M62L26p95J61O17
3029D20n83m7K26M9l43L11K64m34L7N06n03k78J00M87m39j65O64k4o33L99J6k32
3051b02J55K09j91j65M42q0n30M41K38k43l66Q41k80m57J35L80o04M1M33k36k42
3072b81L03j5l06L04J61K17m60K50M2m11K37R0J04n30N72k90j88m2L75l33J80
3093b1L74k30j35N0R8k18L55o9j51p3J30j64j32L2R0L9q4J57R2m11L64j73M7J3
3117b0J74K24l45R7K93o8k60K85l34j18j1K5j23o2L52m4m11K63L11m71J14N07
3139C78l32l96N09k9k2j52M7k3j84M14j28k96Q0M06k19o25N42n5m10K85K04l53
3161c59L43L05j98j22J07K76n17K2J06J43j39J78K9j14R5P2k37p3J32Ml4l28O69
$$ plain form
3184 360 -25 -139 193 340 -38 86 143 69 -186 101 353 104 331 184 -188 17 129 -376 -55 -42 124
3205 124 -300 -290 139 167 82 -234 -112 -113 -273 470 -105 -361 60 -200 -150 -64 -66 61 -171 374 170 -236 -81
3228 -81 58 106 89 253 31 14 179 -86 12 -11 -118 -111 -242 197 -172 152 -97 -300 201 -56 -127 89 -128
3251 -128 26 84 161 -9 112 -56 -139 153 214 -48 177 163 108 -168 -215 -135 -51 -21 28 248 -87 -16 40 -217
3275 -217 -158 103 292 -48 146 415 -23 90 -103 107 -74 -167 54 255 -133 169 -47 273 -12 -68 -155
3296 -155 -62 148 -110 117 46 185 -220 1 -135 36 1 -42 -182 -218 -333 -132 -171 -203 -211 108 120 -29 -59 167
3320 167 28 234 93 26 225 48 44 220 27 92 -62 -279 16 6 -27 -82 -175 77 -363 -37 109 -98 102
3343 102 -6 451 94 -11 119 -128 45 126 494 326 65 161 -36 -325 -365 -229 32 63 144 4 -53 -254
$$ packed form
3184C60l85j14L32J47l78J24N7p4k55K87K52k49K27j47l72K05J12n05L21J3J66
3205A24m24J0M29K8q5l16J22jj60P43n75k56M21k60N0Q6kJ27k32N45k04m06J55
3228h1J39M8j7J64k22j7J65k65R8k3j07Pj31M39l69L24k49k03N01k57p1K16k17
3251a28J54N8P7j70J21j68q3K92O1k62K25j4n5k76m7Q0Q4L0M9K20l35P1N6k57
3275b17N9K61J89l40J94K69m38J13j93K10j81r3K21K01l88L02k16L20k85n6q7
3296a55R3K10k58K27p1J39m05K21j36J71l5m3j40l6j15K01l9l2qL19J2j49l0K26
3320A67j39K06j41o7J99j77mJ76j93O5j54k17K95j0l3n5r3K52m40L26J46k07K00
3343A02j08M57l57j05J30k47J73Q1L68j68k61R6j97k89m0J36K61L1Q1j40n7k01
$$ plain form
3365 -254 -24 -17 22 -113 129 194 -98 189 120 31 139 217 -111 211 -189 104 233 -210 -57 -22 -150 -150 74
3388 74 155 -134 -94 164 -158 -75 -182 -147 -214 338 85 -141 -277 69 -31 -133 -132 229 -2 -601 23 69 82
3411 82 -99 -94 249 51 75 175 151 3 354 43 -43 37 -66 -16 -272 237 -46 -143 152 268 -44 -323 179
3434 179 -148 -87 253 -37 181 -63 385 -44 -93 -49 30 130 20 359 -87 -139 164 85 -103 33 228 -372
3456 -372 -64 281 241 41 109 -13 -134 -191 49 137 203 40 -176 -89 -162 93 -443 -185 -44 55 -145 30 283
3479 283 -25 71 219 34 -333 92 184 -49 -90 38 69 -112 34 -194 -107 13 2 132 21 46 109 -277 -189
3502 -189 407 -179 73 326 126 -210 -117 -73 37 -147 193 317 -74 -9 -147 -118 -144 262 -159 -280 423 129
3524 129 -441 -187 58 -120 -142 227 251 27 126 364 -213 -249 201 -241 -176 -97 262 -135 -112 64 112 -242 188
$$ packed form
3365b54K30PL9j35K42O5k92K87o9q9J08P8l28L22m00K93J29m43J53L5j28%K24
3388G4Q1k89M0K58l22Q3j07L5o7N52k53k26j36L46j00j02JL61k31n99O24M6J3
3411H2j81NL43j98K4J00k4j48L51l11q6Q0j03N0k56N09k83r7K95J16l12k79N02
3434A79l27O1L40k90K18k44M48m29m9M4P9J00j10L39m46n2L03p9j88J36J95o00
3456c72L08L45m0k00O8j22j21n7K40Q8O6j63k16Q7p3K55n36K58J41R9k00J75K53
3479B83l08R6J48j85l67M25R2k33m1J28L1j81J46k28Q7J20j1J30j11K5O3l86Q8
3502a89N96n86K52K53k00l36R3M4J10j84L40J24l91O5j38K9k6M06m21j21P03k94
3524A29n70K54K45j78k2L69K4k24R9K38n77l6M50m42O5P9L59l97K3J76M8l54M30
$$ plain form
3547 188 190 -383 -95 296 -65 -294 -29 344 -40 -220 -315 -57 -162 387 51 -162 -139 253 -66 -417 72
3568 72 236 -309 -42 426 -11 -1 114 -50 -326 -115 -53 79 -380 153 -195 -268 -211 -174 44 -313 166 264
3590 264 65 235 99 -16 183 79 -130 119 239 40 -142 -209 382 -488 -76 39 111 15 -14 231 -211
3611 -211 32 205 219 -95 423 328 12 177 30 174 227 2 -192 -140 -97 250 -317 -169 -48 12 -73 -45 348
3634 348 -164 245 16 321 -27 -13 256 -116 -237 153 -113 -307 203 36 -131 -208 318 -81 -140 235 58
3655 58 -199 9 356 26 -107 -38 204 -241 114 67 -51 316 51 -38 -175 -46 167 -235 -60 194 155 -49
3677 -49 18 119 -304 109 400 -13 -148 317 195 -87 -38 189 -54 -41 257 -92 -93 25 236 -85 -55 329
3699 329 56 -163 -13 -61 -192 -160 104 136 -23 -157 37 -255 -31 -292 264 158 -6 -122 -164 -47 162
$$ packed form
3547A88Kn73K88L91l61k29K65L73l84j80r5K58j05N49l36k13K3L92l19l51M89
3568G2J64n45K67M68m37J0J15j64k76K11O2J32m59N33l48p3N7L7K18l57M79R8
3590B64j99J70j36j15J99j04k09K49J20j99j82o7N91q70M12J15P2r6k9K45m42
3611b11K43J73J4l14N18r5l16J65j47J44N3k25j94N2M3L47n67J48J21O0q5K8L93
3634C48n12M09k29L05l48J4K69l72j21L90k66j94N10j67j67p7N26l99n9L75j77
3655E8k57K08L47l30j33O9K42m45L55m7j18L67k65q9j37J29K13m02J75K54l9k04
3677d9O7J01m23M13K91m13j35M65j22k82M9K27k43J3K98l49jJ18K11l21L0L84
3699C29k73k19J50m8j31L2K64L2j59j34J94k92K24k61N56j06j64j16m2J17K09
$$ plain form
3720 162 -132 87 -137 -175 -246 -362 384 -135 169 397 54 -308 20 -6 -65 127 82 -22 -402 -123 35 16
3742 16 -106 42 276 -122 99 -59 152 -82 277 -180 -90 -111 67 35 -215 -23 -78 8 73 -57 -266 -26
3764 -26 139 30 -159 -104 -57 69 10 117 61 -72 41 56 -54 -55 -48 223 -107 140 54 16 -325 41 -280 68
3788 68 155 228 -131 37 -215 103 -100 -130 322 -68 246 -40 107 127 -2 -190 123 22 29 -9 60 -51 18
3811 18 -71 -156 177 -163 -14 -57 -141 218 -206 85 -32 57 31 -139 -93 -58 189 39 175 -88 28 -256 -147
3834 -147 334 -29 45 34 111 -122 277 -161 16 180 104 91 -339 345 -138 212 -287 153 -156 -22 -27 -156
3856 -156 -144 271 -81 144 193 -109 160 69 125 117 -188 59 121 -29 67 77 93 -29 72 -94 -105 -40 193 94
3880 94 68 -95 153 62 -71 111 8 189 32 8 215 -23 104 61 -28 142 -231 343 60 182 -36 -88
$$ packed form
3720A62k94K19k24l8p1j16P46n19L04K28l43l62L28k6n9J92m5j04l80K79J58j9
3742A6j22J48K34l98K21j58K11k34L59m57R0k1J78l2k50J92n5Q6O5j30k09K40
3764b6J65j09j89N5M7J26n9J07n6j33J13J5j10jPK71l30K47q6l8l41L66l21L48
3788F8Q7P3l59J68k52L18k03l0M52l90L14k86J47K0j29j88L13j01Pl8O9j11O9
3811A8q9q5L33l40J49m3q4L59m24K91j17Q9k6j70M6L5K47j50J36k63J16k84J09
3834a47M81l63P4j1P7k33L99m38J77J64p6j3m30O84m83L50m99M40l09J34nj29
3856a56J2M15l52K25M9l02K69r1N6ql05K47O2j50R6J0J6j22J01j66j1O5K33r9
3880I4k6j63K48r1j33J82j03J81j57k4K07k38J27m3q9J70l73N74k83J22k18n2
$$ plain form
3902 -88 19 180 -6 -71 75 98 -172 -96 -4 -182 -186 -205 302 -20 -99 209 255 55 18 86 -465 -58 117 -343
3926 -343 -90 151 133 72 -145 186 -39 113 -74 84 51 -68 -88 -74 153 141 -321 -74 136 -54 220 -77
3948 -77 111 77 25 -57 107 53 -192 17 72 -89 436 -115 -349 43 60 308 -44 -385 45 -3 -72 -56 21 7
3972 7 -84 -12 16 -162 -124 -252 -51 233 17 55 278 173 117 -113 27 -316 -148 165 -190 99 184 -45 -78
3995 -78 244 13 -43 -135 -102 -129 157 -385 -45 -23 -46 118 -26 -68 -65 334 115 -67 265 156 5 -168 213
4018 213 -127 -9 450 185 -63 -97 175 -2 98 -179 -71 -44 -219 20 -149 -112 -239 23 -69 14 273 -43
4040 -43 -64 218 148 113 125 29 -240 -269 41 269 -43 -42 119 -64 -37 467 -69 -245 -50 176 -124 -54 152 106
4064 106 -117 17 -39 -164 39 -11 28 170 30 -110 -74 18 71 -242 -432 47 171 -184 172 250 -105 143
$$ packed form
3902h8J07J61j86o5J46K3k70P6R2j78mj9N07l22p9L08M6k00l7O8n51M07J75m60
3926c43K53K41j8o1k17L31k25J52j87J58l3j19k0J4K27j2m62K47K10j90K74k97
3948g7J88l4n2q2J64n4k45K09N5j61N25n51k34L92J7K48l52l41M30m8o9J6P7j4
3972Gr1P2K8j78L8j28K01K84k16L8K23j05n6k30J40l43J68L13l55K89Q5k29l3
3995g8L22k31n6r2L3k7K86n42L40K2k3J64j44m2LL99k19j82L32j09j51j73L81
4018B13l40J18M59k65k48l4K72j77J00k77J08K7j75K39j69L7j27K62r2Q3K59l16
4040d3k1K82p0l5J2r6k69k9L10K28l12JJ61j83K7N04n36j76J95K26l00P0K06m6
4064A06k23J34n6j25K03n0L9J42j40j40L6R2N3l13j90M79J24l55L56P8l55K48
$$ plain form
4086 143 380 61 -284 318 241 -183 -346 403 -237 -125 134 -104 14 -70 234 -62 -38 74 -137 -46 148
4107 148 190 -113 174 179 24 -32 -41 -20 -80 -269 -128 94 -139 125 44 85 170 16 -169 183 186 157 -215 -81 294
4132 294 111 -173 51 233 50 67 135 -128 -184 125 -22 213 -35 131 -185 -272 -6 384 -86 166 27
4153 27 192 76 175 -106 -265 183 -199 -346 -306 -64 -44 43 -126 134 -183 139 190 -74 -438 176 256 190 -33
4176 -33 76 -306 -86 74 182 -242 156 62 193 122 -200 -62 8 163 125 -167 48 232 67 -222 -14 58
4198 58 -186 44 192 44 -319 182 6 -156 87 -106 -142 -148 312 23 12 89 32 -219 -9 179 -81 -317
4220 -317 5 460 30 -245 350 -5 -136 0 84 -23 42 302 -265 -42 37 -57 -162 157 -29 59 41 492
4242 492 83 -94 205 55 -150 -270 -105 -43 -200 32 257 -78 212 -91 -93 -13 231 -75 -53 33 72 240
$$ packed form
4086A43K37l19l45O02p7m24j63P49o40J12K59k38J18q4L04k96K4J12k11R1J94
4107A48M2l03K87Nj55n6rK1o0j89J41K22k33K64q1M1Q5j54j85L52Lk9l72J34L75
4132B94j83k84K24J82j83J7O8k63n6L09j47K35k48J66l16q7K66L90m70K52j39
4153B7J65j16R9k81j59M48l82j47M0K42K0Q7j69K60l17L22N1k64l64O14Q0o6k23
4176c3J09l82K20J60J08m24L98r4J31p1l22J38P0J55l8k92K15J84j65k89K08P2
4198E8k44K30J48j48l63N01j76j62K43j93l6oM60k89j1P7n7k51K10J88k60k36
4220c17L22M55m30k75N95l55j31J36Q4j07O5K60n67K23P9r4j05L19j86Q8j8M51
4242D92m09j77K99j50k05j20J65O2j57K32K25l35K90l03kQ0K44l06K2Q6L9J68
$$ plain form
4264 240 -252 136 -65 -28 47 9 -149 -231 -216 -35 -81 352 29 -276 100 -78 269 -152 -35 -110 -83 -77 -30 99
4288 99 -34 165 208 -8 -105 130 130 48 -44 74 -185 -148 40 -53 6 -8 -209 -74 149 364 -202 59 242 85
4312 85 -155 -194 -7 -115 -19 -252 151 -48 334 48 -24 -200 -113 104 271 -128 21 -305 -292 3 94 5 -59
4335 -59 -107 -369 -66 39 -234 -176 60 124 -158 -116 -31 -44 23 144 158 -127 -78 49 94 -110 97 8 47 6 190
4360 190 61 109 -1 -146 164 -266 42 -366 83 236 47 6 -223 197 5 -187 252 140 -154 227 -121
4381 -121 -121 -118 39 -251 99 78 -173 -231 -154 -22 -32 -119 219 -55 10 186 78 -308 -180 402 -126 -116 97 -261
4405 -261 229 -119 -62 -162 32 -80 116 -159 -31 -209 -33 -175 -19 -156 -117 87 -88 -439 -209 28 65
4426 65 119 42 -2 -23 13 389 378 -87 193 -15 109 38 14 -119 -146 27 -60 -156 158 -89 89 170 -37 -130 -5
$$ packed form
4264B40m92L88k01L7P5l8j58q2J5J81m6M33l23l05L76j78L47m21J17p5K7OM7J29
4288I9j33J99M3k16r7K35%q2r2J18k59L7J88r3N9j4k01J35K23K15n66K61J83j57
4312H5k40l9J87j08R6k33M03j99L82k86p2j76Q7K17J67l99J49l26J3K95R1q9o4
4335e9m8k62L03J05k73N8K36O4k82M2Q5j3O7J21J4k85M9J27M5k04K07q9L9m1J84
4360A90j29M8j10j45L10m30L08m08M49J53j89m1k29M20j92j92M39j12k94L81l48
4381a21%LJ57k90L50k1k51n8P7J32j0q7L38k74O5J76j08l86J28N82n28J0K13l58
4405b61M90l48N7j00J94j12J96k75J28j78J76j42J56j37L9K04j75l51K30K37L7
4426F5N4p7m4k1L6L76j1m65K80k08J24p1k4j33k7J73q7r6L14k47J78Q1k07r3J25
$$ plain form
4451 -5 18 19 -142 -162 148 88 -134 -71 -117 194 78 -106 157 -137 -103 43 100 -153 62 -197 41 -60 -101 61
4475 61 -186 36 163 -81 20 -24 -147 127 128 -20 89 -130 347 228 -101 -192 232 -21 177 326 -2 -135
4497 -135 201 85 240 138 3 -118 140 130 -9 38 81 105 237 134 323 -49 -10 -209 127 -66 206 46
4519 46 127 -237 76 66 -140 -327 229 227 17 93 -164 -32 -94 -6 77 58 127 136 141 -14 -54 64 -62 100 -79
4544 -79 -48 -12 35 199 -79 303 44 -50 -96 7 74 -141 -52 40 350 -136 -155 -87 -148 -89 -224 186 -130 -40 113
4569 113 -105 -333 283 -105 -241 12 -127 71 -157 24 -38 -121 113 5 -163 -221 50 -215 -308 24 -68 -18
4591 -18 -182 -20 -182 -42 379 -8 6 0 155 -58 37 -66 -180 27 -83 82 -88 241 -305 -231 -17 -49
4613 -49 50 176 288 -55 76 162 -91 -160 73 18 -47 205 151 179 50 -125 90 -104 163 -196 -171 186 14
$$ packed form
4451eK3Jj61k0L10o0k22O3m6L11j16j84K63k94L4J46N7k53K15k59K38j01m1J62
4475F1k47K22J27k44J01m4j23K74Jj48J09k19M77j19l29r1M24k53J98J49l28j33
4497a35L36j16J55j02j35j21K58j0j39M7M3K4J32j03J89l72L9j99L36j93K72j60
4519D6Q1l64L13j0k06j87N56kk10P6k57J32o2Q8Q3j9O9RNj55m0J18j26J62j79
4544g9L1L6M7J64k78L82k59r4m6J03O7k15Q9R2L10m86j9O8o1N9j35M10l16R0J53
4569A13k18k28O16l88j36K53j39J98k28J81o2q3K34j08j68n8K71k65r3L32r2N0
4591a8j64J62j62J40M21l87J4oJ55k13R5j03j14K07j10J65j70L29n46P4K14l2
4613d9R9J26J12l43J31Q6k53o9K33n5o5K52n4K8j29j75K15j94K67l59K5L57j72
$$ plain form
4636 14 208 281 -74 193 79 59 -181 -54 -32 -187 -12 147 -35 -185 -147 -34 -119 187 -99 -97 -326 175 -275
4659 -275 -162 -75 129 -105 -49 151 -157 -3 64 110 -98 -56 118 -81 -81 -173 131 -46 -348 244 -429 65 106
4682 106 145 78 158 145 41 -154 132 -128 176 223 42 11 127 17 352 80 89 205 -151 -7 84 54 -35 -143
4706 -143 103 -167 -96 197 -31 -75 -54 -55 -248 117 -49 208 -94 26 108 -96 28 78 52 83 -152 66 10
4729 10 26 -220 -172 268 69 -325 133 -25 -18 -145 148 -113 -266 21 -153 65 -108 37 42 -377 4 -55 -199
4752 -199 -186 227 167 118 67 -27 10 -148 -177 -23 -153 85 97 -276 99 45 87 -232 -12 207 -136 -130 249 96
4776 96 -17 -17 -14 -105 -85 175 -7 24 -314 130 -373 117 0 -198 -92 -62 168 18 67 497 -105 -175 36 336
4800 336 4 33 -94 -92 241 59 -203 284 223 149 43 241 120 20 42 -296 263 200 244 226 72 94 349
$$ packed form
4636A4J94P3l55K67j14k0k40J27K2j55J75J59j82j50L8J13q5L06k86Kk29N01m50
4659b75J13Q7K04k34N6K00l08J54O7M6k08M2J74j99%r2L04j77l02N92o73M94M1
4682A06L9o7Q0j3j04j95K86k60L04M7j81l1J16j10L35k72RJ16l56J44R1l0q9j08
4706a43K46k70P1K93k28m4K1jj93L65j66K57l02J20Q2k04J24N0k6L1k35K18n6
4729A0J6k46M8M40j99l94M58j58Pj27K93k61j53K87j74K18j73J45Nm19L81n9j44
4752a99J3M13o0m9n1r4L7j58k9J54j30K38J2l73L75n4M2l19K20K19l43OL79j53
4776I6j13%Lr1K0K60j82L1l38M44n03M90j17j98J06L0K30j50M9M30o02p0K11L00
4800C36l32K9j27KL33j82k62M87o1p4j06J98j21j00K2l38N59o3M4j8j54K2K55
$$ plain form
4823 349 56 145 -119 278 4 -50 4 31 -75 -47 -40 283 89 -276 -167 95 -71 102 69 -70 -209 53 78
4846 78 48 106 -267 -117 22 -45 94 25 -9 -34 -7 -75 -10 -285 85 -129 136 214 -297 36 96 155 58 160 66
4871 66 131 164 101 -73 122 -117 -20 -63 24 38 -173 51 -2 33 333 285 -116 178 41 253 96 -72 -226 -266
4895 -266 60 25 -167 221 -21 -122 32 224 -16 -1 319 -228 97 167 -129 -370 -180 -160 -68 -40 67 169
4917 169 -136 18 -27 90 172 169 -166 -210 187 66 275 24 72 251 -13 -102 298 -193 87 14 55 -73 136
4940 136 9 -309 -245 87 -11 -118 -111 189 230 153 247 39 51 -27 102 -34 97 -103 -166 -21 136 50 193 244
4964 244 131 -61 -340 156 -13 101 -159 37 -60 -31 -97 48 86 94 -62 190 15 -13 -32 -124 -51 247 298 83
4988 83 -46 91 -56 -41 100 102 107 84 -178 61 74 -85 70 141 -44 -200 60 -15 -81 160 119 -195 123 -114
$$ packed form
4823C49k93Q9k64L97k74n4N4K7j06K8PL23j94l65J09K62j66J73l3j39j39K62K5
4846G8l0N8l73J50J39o7J39o9l4k5K7o8O5k75L70k14K65P8n11L33O0N9r7J02r4
4871F6O5L3o3j74J95k39R7m3Q7J4k11K24n3L5L00m8m01K94j37K12j57j68j54m0
4895b66L26l5j92L88k42j01J54J92k40J5L20n47L25P0k96k41J90K0R2K8J07J02
4917A69l05J54m5J17Q2ll35m4L97j21K09k51M8J79k64q9M00m91K80p3M1j28K09
4940A36j27l18O4L32r8j07PL00M1p7R4k08J2p8J29j36J31k00o3J45J57q6J43N1
4964B44j13j92k79M96j69J14k60J96r7K9o6J45L8Qj56K52j75k8j9r2P3K98N1k15
4988H3j29J37j47J5J41KNk3k62K39J3j59J55P1j85j56K60p5o6K41m1l14L18k37
$$ plain form
5012 -114 311 41 -51 -185 -136 -153 -301 2 371 153 150 -240 175 14 115 -39 82 281 -145 -63 -11 -158
5034 -158 -111 -121 -144 -46 -65 -279 28 -2 123 -262 13 -238 -235 17 30 -148 139 13 -17 251 97 174 -49 -83
5058 -83 -26 141 -6 166 -174 -129 32 -129 77 145 119 -89 -250 -126 205 -161 75 -93 146 380 42 9
5080 9 -83 47 166 -71 -425 35 52 -6 -110 118 122 -156 -29 199 199 5 -135 154 -91 -150 -131 -186 -226 -221 214
5105 214 -314 156 14 302 1 36 66 238 201 127 206 -228 -58 -8 -145 89 -21 -21 -59 90 162 109 -31 -392
5129 -392 83 23 -21 86 115 94 19 -133 -162 249 -34 -107 164 -33 -205 -23 -32 263 39 190 30 -124 -172
5152 -172 -324 7 -133 -179 -41 102 126 166 36 -118 -376 96 -377 -88 -120 -71 -269 -130 -258 45 193 158
5174 158 40 -296 -236 -63 14 228 7 -78 54 -145 39 17 148 106 18 -229 -18 -197 106 -163 16 52
$$ packed form
5012a14M25k70r2j34M9j7j48L03L69k18ll90M15j61J01j54J21J99m26Q2N2j47
5034a58M7j0k3R8j9k14L07l0J25l85K75k51LK52J3j78K87j26l0K68j54P7k23l4
5058h3N7J67j47J72l40M5J61j61K06O8k6k08j61J24L31l66K36j68K39K34l38l3
5080Ir2J30J19k37l54M60J7n8j04K28Mk78J27K28%j94j40K89k45n9J9n5m0NM35
5105B14n28M70j42K88l01L5L0J72l7p4P9m34J70N0j37K34j10%l8J49P2n3j40l61
5129c92M75o0m4J07K9k1p5j52k9M11k83p3K71j97j72J82rK95k24J51j60j54m8
5152a72j52L31j40m6J38J43K4M0j30j54k58M72m73K89l2M9j98J39j28L03J48l5
5174A58j18l36O0J73P7K14k21q5J32j99J84k2J31m2q8k47K11j79L03k69J79L6
$$ plain form
5196 52 91 -239 125 132 -35 196 300 165 30 -98 50 131 174 81 11 72 -343 83 -172 85 29 -20 -12 -123
5220 -123 192 -71 33 205 -22 -104 270 -73 25 -74 -2 166 -308 -92 29 -134 -41 180 230 -75 66 46
5242 46 75 -140 93 -91 -234 -218 253 -112 63 46 160 97 431 -153 298 147 40 172 57 -52 -120 229
5264 229 -100 -104 12 -20 -155 -266 30 27 157 37 -297 -91 61 79 -251 -111 -176 22 -48 136 -70 248 -95
5287 -95 69 166 -102 277 130 83 -226 287 82 -71 -105 -48 -307 -196 -221 -106 -264 -29 -47 18 -245 -166 47
5310 47 -46 -160 -97 9 141 39 64 -114 150 -130 -32 384 237 78 303 108 66 1 96 -90 -416 243 94
5333 94 -200 130 -88 176 -33 -6 -1 -49 -98 -68 -116 76 35 84 -36 291 -169 -79 28 -114 -88 217 36 -93
5357 -93 -108 179 -87 164 153 -78 139 150 -85 89 -152 -83 11 261 201 -180 183 74 -22 59 -226 -189 134
$$ packed form
5196E2L9l30L64Pj67K31J04j35j35j28J48Q1M3r3p0O1m15M26k55K57n6m9Qj11
5220a23L15k63J04J72k27q2L74l43R8r9P2J68m74K16J21j63R3K21N0l05J41k0
5242D6K9k15K33j84j43J6M71l65J75j7J14o3L34n84M51j51j07J32j15j09o8L49
5264B29l29mJ16l2j35j11K96lJ30j20l34K06J52J8l30J40o5J98p0J84k06L18l43
5287i5J64R7k68L79j47m7l09N13k05j53l4N7k59J11k5J15j58K35j8O5k63P9K13
5310D7r3j14O3J06J32j02K5j78K64k80R8M16j47j59K25j95m2o5R5j86l26O59j49
5333I4k94L30k18K64k09K7Nm8m9L0m8J92m1M9j20L27m60R0J07j42K6L05j81j29
5357i3j5K87k66K51j1k31K17J1k35J74k41O9R4K50o0l81L63j09r6Q1k85L7L23
$$ plain form
5380 134 -2 251 -33 114 167 -72 331 -15 160 220 -95 -307 183 -26 -82 17 -37 -124 73 -89 241 71
5402 71 54 -29 -173 -98 -130 -116 26 96 163 -26 -87 93 68 396 -204 -11 -95 56 -6 132 -140 -26 111 19
5426 19 104 -217 -68 62 -73 180 136 48 -68 -20 -102 -83 -43 330 246 -122 -21 54 -63 197 -250 -51 11 208
5450 208 96 63 -46 -369 -79 -301 85 -13 240 371 -117 -273 -139 164 -125 233 -88 38 -166 -19 239
5471 239 -143 170 36 196 132 83 -45 -7 -2 146 37 71 110 -133 8 414 -31 -114 79 -13 57 -87 -142 89
5495 89 38 -242 250 212 -227 147 226 268 85 -140 -104 -83 -49 -94 18 -246 -1 29 -220 -22 -31 -145 72 -47
5519 -47 126 56 19 264 -38 184 -2 -9 -3 -67 31 236 -109 -249 153 -138 1 -294 -103 77 -90 -44 -44 258
5543 258 -57 -38 142 -328 27 0 -33 -99 9 164 -70 -82 34 196 127 136 81 -26 59 61 113 92 -30 -118 39
$$ packed form
5380A34j36K53k84J47N3k39M03l46J75O0l15k12M90k09n6R9n4q7J97j62L30j70
5402G1j7q3j44P5l2J4J42P0O7j89o1J80k5L28o00J93q4J51o2J38k72J14J37r2
5426A9Q5l21J49J30j35K53m4q8j16M8q2J9M0L73q4l68J01P5j17K60m47J99O2J97
5450B08j12l3j09l23K90k22L86r8K53J31m88j56J34L03k89L58l21J26k04J47K58
5471B39l82L13j34J60o4m9j28L8NJ48j09L4L9k43J41M06m45q3J93r2P0j44n5K31
5495H9n1k80M92l8m39L74P9M2j83k25L6K1L4m5J12k64K45L0k49J98rj14K17j19
5519d7J73p0l7K45l02K22j86pOo4R8K05l45j40M02k91J39k95J91J80j67M6%L02
5543B58l15J9J80m70L55k7l3o6J08J55k34j2J16J62o9Rn5j07Q5KN2k1j22q8J57
$$ plain form
5568 39 118 -5 187 164 105 -3 -57 40 163 2 22 -237 -25 -67 182 -118 -122 21 80 106 57 -80 39 57 24
5593 24 205 14 6 -298 92 84 -54 51 78 -372 -123 -81 102 -12 29 -75 -234 196 -200 -284 -22 -114 -322
5616 -322 145 -233 57 -248 23 29 74 -4 168 -38 48 245 -253 -27 197 67 140 -88 138 79 -125 -99 89
5639 89 127 -117 -210 -151 91 3 -21 93 -11 -226 -15 0 38 96 -154 -79 24 116 259 -67 51 66 57 -125 89
5664 89 44 -99 -55 62 94 -153 188 113 -150 166 292 -8 133 95 81 -53 -347 12 -308 87 2 -121 -86
5687 -86 -256 77 -125 301 40 -28 238 -6 -144 -5 36 85 180 108 167 -293 -53 -34 198 111 -76 199 59
5710 59 121 -23 -116 -33 127 -185 137 -189 20 -25 -27 -19 -262 -61 -132 -30 122 -132 1 165 294 -64 145
5733 145 -33 -53 47 355 167 -99 -84 -65 -92 3 6 196 213 247 -54 -70 -219 309 107 -261 118 -28 -75 -67
$$ packed form
5568C9P9j23J92k3n9j08n4R7J23j61K0k59K12m2K49l00mJ43N9K6m9j37J19J8l3
5593B4J81j91ql04L90qj38J05K7m50K49M2J83j14M1j04j59M30l96q4K62r2k08
5616c22M67l78K90l05K71OM5p8J72k06Q6J97m98K26K24j30P3k28K26n9k04K6J88
5639H9L8k44r3N9K42q8k4J14j04k15K11J5L8N8k50P5J03R2J43l26J18J5rj82K14
5664H9m5j43M4J17L2k47L41p5k63L16J26l00J41l8j4j34k94L59l20L95q5j23L5
5687h6j70L33k02M26k61o8K66k44j38J39M1M9R5p2N9m60K40J9K32q7j87K75j40
5710E9O2j44r3Q3J60l12L22l26K09m5kQk43K01p1J02J52k54J33J64J29l58K09
5733A45j78k0J00L08j88k66J5J9k7R5LJ90J7L4l01j6j49N28k02l68L79j46m7Q
$$ plain form
5757 -67 -233 143 107 -65 27 -218 231 -133 73 78 63 -25 -332 65 225 -187 -15 40 -38 -177 -249 0 -314
5780 -314 73 161 30 -91 238 -22 -43 171 -75 -356 -79 149 413 69 97 49 37 2 -257 206 -55 -75
5802 -75 152 -22 139 13 131 60 66 127 -171 -56 -199 117 -11 -83 -110 -379 39 252 27 76 298 144 -236
5825 -236 87 -172 -79 124 -178 -110 3 366 73 -16 -124 -102 -40 -24 98 179 -3 -135 -83 -63 1 300 48
5848 48 282 -52 224 -140 -59 -59 -78 -94 7 -142 -224 -88 -4 -208 -65 268 288 -140 -229 -69 61 -5 -64 33
5872 33 181 81 132 110 199 -103 39 -87 81 211 -104 -134 -135 329 -142 -274 -4 35 67 -136 133 92 -227
5895 -227 -81 101 -108 -266 1 32 -60 33 186 -35 -61 56 58 65 289 163 -120 5 -146 -199 -15 7 116
5918 116 435 60 36 300 215 120 -14 3 -21 131 140 -126 -313 214 172 216 -85 -117 6 103 -197 -33 175 -141
$$ packed form
5757f7j66L76l6j72R2k45M49l64K06Nj5q8l07L97J60m12J72N5p8j39p2K49l14
5780c14L87Q8j31j21L29k60k1K14k46k81K77K28K64l44K8m8j2l5k59M63k61k0
5802g5K27j74J61j26J18p1OO1k98J15j43L16j28p2k7k69M18K13k25M9K22j54l80
5825b36L23k59R3K03l02O8J13L63k93q9j08K2O2J6J22Q1j82j32N2K0O4K99k52
5848D8K34l34K76l64Q1%j9j6J01j49q2J36Q4k04J43L33K0m28q9J60J30o6n9R7
5872C3J48j00N1k2Q9l02J42j26J68J30l15l0jM64m71j32K70L9L2k03K69m1l19
5895b27J46J82k09j58K67L1r2R3J53k21k6J17KPK24j26k83J25j51n3J84K2J09
5918A16L19l75k4K64q5r5j34J7k4J52Rk66j87N27m2M4l01l2J23R7l00J64K08l16
$$ plain form
5942 -141 103 -124 110 103 56 -52 -136 44 -89 202 42 143 37 -181 -164 -6 170 -166 -77 -73 -219 64 -125
5965 -125 70 -17 96 -63 25 -279 21 -72 228 55 153 65 230 -45 323 39 -51 -46 -43 -28 0 170 -60 -110
5989 -110 -2 -99 -403 88 -174 -77 -104 -130 29 -72 -99 -328 189 24 -156 259 208 302 -95 -41 -145 7 190
6012 190 -61 -215 -20 -173 -51 121 167 156 -34 -278 41 148 39 48 -268 -38 140 -133 -217 51 46 143 -253
6035 -253 -397 -178 -4 59 -3 185 136 -85 20 -149 -126 5 -61 121 -166 145 146 -300 -134 196 -355 89
6057 89 -85 1 -363 -130 -142 -308 -4 167 10 -189 7 -245 187 -16 240 -63 -175 101 -75 -76 234 -126
6079 -126 -206 41 -131 -32 -174 -22 -233 -126 108 -208 -57 -120 121 -217 185 81 -102 86 100 -1 -13 5
6101 5 -63 -243 -111 176 -163 112 67 239 -73 28 76 231 128 -48 36 -145 -51 -150 38 67 -84 -165 107
$$ packed form
5942a41K44k27K34pm7j08q4J80j33K91j60J01j06k18J7J58J76l36Q9Mj46K83j89
5965a25J95q7J13j59Q8l04L00r3L00j73R8q8J65k75L68k84r0NLJ5K8J70k30n0
5989a10J08r7l04M91k62R7k7k6J59j01k7k29N17j65j80M15n1R4l97N4j04J52J83
6012A90k51j54J95j53J22J72M6j1j90k44L19J07j09Rl16K30J78k73q4K68nR7l96
6035b53j44K19J74O3o2J88m9k21J05j69K3J31o6J82k87L11Jm46J66L30n51M44
6057H9j74Q6l64K33j2j66L04J71j57j99J96k52M32k03K56l03j12K76j76jL10l60
6079a26q0K47j72R9j42J52k11J07K34l16J51o3K41l38M02j04j83J88J4j01j2J8
6101Eo8j80J32K87l39K75m5J72l12J01M8J55j03j76Q4j81R4r9J88K9j51q1K72
$$ plain form
6124 107 -151 34 256 -223 -91 37 -120 51 6 75 102 379 174 190 -37 -276 -74 -205 158 156 -61 165
6146 165 79 -90 -91 68 -56 -74 215 88 -45 123 -340 153 -280 -169 111 -17 -54 -77 -69 80 56 -178 -198
6169 -198 40 62 -63 -54 -44 -34 33 -104 51 220 -230 -117 133 -215 28 147 -5 -215 -103 -10 -37 -251 -176
6192 -176 -115 -103 5 -173 -191 -35 32 149 63 -107 37 -183 63 -29 4 141 37 66 -24 34 90 80 -318 265
6216 265 -95 93 -27 116 119 -73 5 203 -43 -98 -48 -182 151 134 98 235 -118 31 -171 101 231 -63
6238 -63 -11 133 -39 -36 -3 77 163 -178 225 -239 22 189 -33 -12 151 278 44 13 58 -151 252 280 328 -130
6262 -130 0 153 86 -110 209 -42 102 -238 88 -205 -41 107 156 43 87 -199 24 -160 -462 -109 6
6283 6 5 200 -22 76 -12 244 335 -18 86 -41 -263 -156 176 -98 -102 -190 -61 -94 233 77 -21 8 208 258 -106
$$ packed form
6124A07k58J85K22m79J32J28j57J71m5O9K7K77k05J6k27k39K02j31L63kk17K26
6146A65q6j69jJ59j24j8K89j27j33J68m63M93m33J11K80j28l7k3QJ49k4k34k0
6169a98K38K2j25RJ0J0O7j37J55J69m50J13K50l48K43J19j52k10J12R3k7k14P5
6192a76O1J2J08j78j8J56O7J17q6j70J44k20K46r2L3J37j04K9r0N8N6j0l98N83
6216B65l60J88j20J43Lj92P8J98k46n5N0j34L33j7l6J37l53J49k02K72J30k94
6238f3N2J44j72LL3Q0Q6l41M03m64K61J67k22K1J63J27k34l1M5k09M03K8M8m58
6262a30J30J53o7j96L19k51J44l40L26k93J64J48M9j13M4k86K23j84l02L53J15
6283FjJ95k22R8q8K56R1l53J04j27k22J07L32k74mq8J29l3L27j56r8K9K00N0l64
$$ plain form
6308 -106 0 79 -8 24 -15 77 -295 -115 -64 -131 14 -53 61 313 85 6 197 -130 -107 -153 34 -200 62 -63
6332 -63 330 -7 -167 24 -4 153 201 -21 203 -25 -116 186 79 202 219 22 25 -17 126 1 9 -205 114
6355 114 -44 208 55 -46 24 145 122 152 25 -79 353 77 200 153 -12 45 97 32 237 287 -54 214 170
6378 170 -20 265 -165 206 -36 169 -46 -186 -114 -10 15 -22 -125 91 -46 -50 -188 62 91 -237 73 18
6400 18 40 121 -65 90 -132 26 -29 40 276 -223 15 -122 -219 -44 -12 160 22 -141 -17 87 167 -166 -25
6423 -25 -201 91 292 -221 -125 32 130 -296 87 -261 101 60 88 145 -109 204 -13 -37 -21 -163 145 50 -28
6446 -28 93 134 260 -139 83 -18 -13 55 -51 63 34 210 -73 -176 -220 -85 -94 -79 -1 93 -59 -180 -232 135
6470 135 67 45 57 -129 190 -181 -73 182 113 44 14 111 44 -311 -76 7 96 212 108 -189 210 -25 -204
$$ packed form
6308a06J06P9q7L2l9R2l72J80N1o7J45o7J14K52k28p9J91l27K3m6J87k34K62j25
6332f3L93l37j60J91k8J57M8k22K24k28r1L02j07J23J7j97Lm2J43j25Qk14L19
6355A14j58K52j53j01P0J21k3L0j27j04M32k76J23m7j65N7N2o5K05N0l41K68m4
6378A70j90K85m30L71k42K05k15j40P2J04K5l7j03K16j37mj38K50K9l28L10n5
6400A8K2Q1j86J55k22J58n5O9K36m99K38j37r7J75L2J72j38j63J24J04Q0l33J41
6423b5j76K92K01n13R6J57R8m26L83l48L62m1K8N7k54L13k17k4J6j42L08r5p8
6446b8J21M1J26l99K22j01NO8j06J14k9J76k83j03m4J35rJ5P8R4j52j21n2L67
6470A35o8k2J2j86L19l71J08K55o9o9l0R7o7l55K35Q3Q9J16j04k97L99k35j79
$$ plain form
6493 -204 118 102 -284 -161 -117 -9 -98 53 -58 -365 32 170 -35 32 -120 45 14 -98 -276 -67 -176 -238
6515 -238 85 52 89 47 196 -272 157 2 -148 -108 67 -16 -113 32 85 162 58 124 125 -110 -81 107 -86 82
6539 82 -46 173 233 101 59 -87 -87 -138 13 -103 -54 -27 -35 -83 -23 216 -163 -65 -81 -11 -329 -164 -3 184 -310
6564 -310 -8 143 -106 -210 103 38 273 -245 -8 -248 -2 -195 -28 82 6 5 53 88 164 -76 14 15 135
6587 135 53 221 123 -87 -10 74 22 27 53 88 62 12 158 26 -119 -98 -95 -315 193 5 248 -210 -304 37 162
6612 162 -64 -201 216 -63 -209 132 -237 -137 -117 181 304 112 82 249 -270 -276 -219 -112 -151 90 89 122 94
6635 94 222 190 -259 140 187 -88 -99 -119 -112 54 -21 -120 131 209 199 8 -123 75 -290 71 -32 46 -166 19
6659 19 -81 147 15 -92 134 144 139 -82 -209 113 10 -69 204 25 29 193 -150 -138 -121 50 -7 -215 -98
$$ packed form
6493b04L22j6l86J23M4J08q9J51j11l07L97J38k05O7j52J65l1j12j78K09j09o2
6515b38L23l3L7m2J49m68M29j55j50M0J75q3r7J45N3P7j04O6Jk35K9J88j93J68
6539H2j28K19O0j32m2j46%n1J51j16M9K7qm8O0K39l79R8j6P0l18J65J61J87m94
6564c10L02J51k49j04L13o5K35n18K37k40K46j93J67J10p6jM8L5P6k40R0JJ20
6587A35q2J68r8k10P7Q4n2NK6L5k6n0J46j32j45K1Lk20N08j88K43m58r4L41J25
6612A62k26j37M17k79j46L41l69J00K0K98J23j92l0J67n19oN7J07l9K41jL3k8
6635I4J28l2m49L99M7k75j1k0PJ66p5r9K51P8j0j91j31J98l65L61j03P8k12J85
6659A9j00K28j32j07K26J0nk21j27L22j03p9K73j79MJ64l43J2J7J71n7k08J17
$$ plain form
6682 -98 -24 5 14 -186 35 -31 -95 63 139 59 -151 -46 -146 163 217 57 53 -111 -90 -25 60 1 22 -165 44 -132
6708 -132 58 -152 -142 -83 191 -13 23 -5 -30 68 -86 92 -44 14 172 -5 -204 -4 -9 296 97 230 -44
6731 -44 -69 75 -227 -6 -292 -69 -179 -186 -45 151 252 210 116 107 75 155 195 9 -107 -3 -91 -106 -170 -67 121
6756 121 -21 -56 3 58 -114 -96 -126 -65 109 -112 -190 -271 -189 47 59 34 231 18 101 -183 59 292 -19 -141
6780 -141 108 155 -116 348 199 -35 -67 206 71 179 83 -56 -103 -91 116 221 -19 -3 -115 -93 -162 71 40
6803 40 183 -169 25 153 -131 -27 66 -136 164 -54 243 -397 17 -230 159 13 -193 -138 -89 -34 -97 288
6825 288 -84 -10 -161 17 -33 106 -126 144 -52 121 -89 -115 -141 171 -64 -40 -250 78 265 379 -39 -168
6847 -168 -36 0 -11 5 -121 352 107 -24 190 -31 -23 -134 -60 -56 -165 -21 -127 -113 -110 73 80 28 208 50 143
$$ packed form
6682i8P4K9Rk00K21o6o4J58P6q0k10J05j00L09N4j60mj64K1O5Q5n9K1j87K09j76
6708a32J90k10J0N9K74k04L6k8k5R8j54J78j36N8J58j77j99K00nL05j99J33k74
6731d4k5J44l02K21k86K23j10pJ41J96J01m2r4rl2Q0M0j86j16J04q8j5o4J03J88
6756A21j42l5N9N5j72J8l0O1J74k21p8q1Q2K36J2k5J97k13Q3k84K42K33l11j22
6780a41K49M7k71M64j49k34l2K73j35J08r6j39m7J2K07J05k40J6j12K2o9K33l1
6803D0J43l52J94J28k84J04R3k02L00k18K97o40M14k47L89j46k06N5M9N5o3L85
6825B88l72P4j51J78n0J39k32K70j96J73k10k6k6L12k35K4k10L28J87J14m18j29
6847a68J32L6j1J6j26M73k45j31K14k21Qj11P4Mj09J44j06J4LJ83Pn2J80j58R3
$$ plain form
6872 143 -76 -38 -155 27 -64 -36 -12 141 -21 1 -61 -259 -91 250 -4 177 5 48 -127 216 50 234
6894 234 -84 109 -67 -148 -245 -43 223 188 -94 -270 131 38 -127 -21 75 165 -194 163 42 41 -11 -391 -89
6917 -89 264 -92 47 365 -173 -9 180 -174 -127 -110 76 -282 -240 109 -36 -95 327 98 -124 -2 -200 158
6939 158 -259 180 -74 -33 9 -148 -52 -184 -216 26 17 -418 186 150 83 77 -79 280 37 261 161 -47 -135 -45
6963 -45 -185 65 -276 -45 170 -131 269 -117 -175 -31 250 126 3 78 200 39 103 -109 17 -71 -17 270
6985 270 109 27 140 -80 92 5 -96 -66 -47 -92 123 -48 -56 414 40 -165 -50 -51 158 -365 59 100 -205
7008 -205 -29 28 61 -1 -165 -157 70 92 -60 146 197 -27 -130 153 -96 -49 225 -69 109 36 48 110 -48 104
7032 104 309 149 16 -140 -146 242 -18 -185 -85 -32 -99 75 1 71 -117 -148 -169 24 -104 136 184 88 80 201
$$ packed form
6872A43k19L8j17J82r1K8K4J53j62K2o2j98J68L41k54J81j72M3j75L43j66J84
6894B34l18J93j76q1r7K02K66l5k82j76M01r3j65J06R6R0l59L57j21jn2l80L02
6917h9L53l56J39L18n38J64J89l54M7J7J86l58M2L49j45n9M22k29k22J22j98L58
6939A58m17M39k54M1M2j57R6j32l2K42rm35O04l6o7oj56L59k43K24j00k08q8R0
6963d5j40K50l41K31K15l01M00l86n8J44K81j24j23P5J22j61O4k12J26q8N4K87
6985B70j61q2J13k20J72q7j01L0J9m5K15j71qM70l74k05J15jK09n23M24M1l05
7008b05J76N7L3o2j64QK27K2j52K06N1k24j03K83k49M7K74k94J78p3J2O2j58J52
7032A04K05j60j33j56oL88k60j67J00N3o7J74p4P0j88l1k1J93j28K40M8r6qJ21
$$ plain form
7056 201 -134 -57 147 159 -2 26 31 -128 84 30 -230 -253 -20 -154 -67 98 241 -154 -280 -256 102 333 304
7079 304 -55 -99 202 73 -77 155 0 173 -34 101 -1 -41 20 199 8 44 15 -2 23 -21 290 115 86
7102 86 6 144 -62 -74 -103 -80 96 76 6 26 -53 -155 206 -39 -245 -150 -53 -41 29 259 -105 -14 38 -113 -128
7127 -128 -90 -177 115 -107 -158 68 -140 151 175 -138 -10 53 -78 81 -218 28 291 49 59 -47 -259 -260 141
7150 141 -317 -113 -198 -109 58 75 111 -83 190 -251 39 -363 -38 421 35 -46 259 124 -107 251 128 108
7172 108 13 148 279 -23 -10 116 -129 163 4 195 11 175 232 -6 -77 -39 148 131 -202 114 74 -160
7194 -160 -241 -11 4 73 63 146 271 -90 -82 135 15 5 108 -115 117 -24 -3 61 -90 -102 87 -17 -138 -15
7218 -15 45 6 48 121 71 -49 80 20 -127 116 -162 159 -400 106 41 -55 -101 276 44 -326 164 -180 29
$$ packed form
7056B01l35P7K04J2j61K8Nj59K12n4k60k3K33j34Q7J65J43l95j26K4L58K31k9
7079C04l59m4L01j29j50K32j55J73k07J35j02m0O1J79j91L6k9j7K5m4L11j75k9
7102H6q0J38k06j2k9K3J76k0p0K0p9j02L61k45k06R5R7J2P0K30l64R1N2j51j5
7127a28L8q7K92k22n1K26k08K91K4l13J28O3j31J59k99K46K63k42J0j06k12jM01
7150A41m58K04q5Q9J67J7L6j94K73m41K90m02L25M59l86q1L05j35k31L58j23k0
7172A08r5J35J31l02J3J26k45K92j59J91j84J64N7k38p1L8J87j7l33L16m0k34
7194a60q1K30J5O9j0Q3J25l61QK17j20j0J03k23K32j41K1O4j51j2J89j04j21J23
7218a5O0l9M2P3n0j20J29o0j47K43k78L21n59N06o5r6m6L77k32l70M90l44K09
$$ plain form
7241 29 -32 -144 -92 85 -149 247 137 -80 -40 241 114 113 129 -28 -169 22 -8 -291 142 -107 200 30 -144
7264 -144 35 -49 -189 60 17 14 -131 -60 102 -28 86 -153 -25 82 113 126 -243 -93 -319 -138 259 76
7286 76 -112 -329 -18 130 55 86 -17 220 203 -74 -183 -2 83 -62 25 207 131 -73 244 -86 115 -55
7308 -55 -45 185 87 -161 -129 -136 119 205 79 -76 -166 -93 -109 4 -234 -149 40 -169 -89 35 47 -42 57 169 51
7333 51 33 286 65 143 78 296 -14 -135 61 131 -100 167 138 -23 -91 199 -131 225 -149 20 -5 -224 -10
7356 -10 20 65 -246 14 -237 -113 -307 -76 18 112 -10 10 -335 37 109 35 -21 -15 -182 -24 149 -140 33 -114
7380 -114 -39 9 -44 56 180 62 3 -104 101 -64 92 -71 149 51 -52 17 113 -40 56 16 45 -228 153
7403 153 85 -10 43 87 127 104 -162 -146 -11 19 -51 -173 -145 -64 -86 -60 -89 -56 256 -87 41 -8 397 18 -148
$$ packed form
7241B9o1j12N2J77k34L96j10k17M0K81j27jJ6j57j41J91l0k83M33k49L07j70j74
7264a44J79q4j40K49m3lj45P1J62j30J14k39J28J07L1J3l69J50k26J81L97j83
7286G6j88k17L11J48p5L1j03K37j7k77j09J81Q5j45Q7J82p6k04L17l30K01j70
7308e5J0K30r8k48L2pK55Q6j26j55r0P3j6J13k38Q5J89k09Q0J24J2q9R9J12j18
7333E1j8K53k21P8o5K18l10j21J96P0k31K67k9j61o8K90l30L56l74J69k5k19K14
7356a0L0M5l11K60k51J24j94K31R4R4j22K0l45L72P2p4n6Oj67J58J73k89J73j47
7380a14P5M8n3J00J24j18n9j07K05j65J56j63K20r8j03O9R6j53R6m0K9k73L81
7403A53o8r5N3M4M0k3k66J6J35L0p0j22K8Q1k2K6k9L3L12l43J28m9M05l79j66
$$ plain form
7428 -148 29 -92 -40 282 -71 31 88 -9 49 65 -179 -93 -40 92 80 154 142 126 98 72 110 -285 73 -71 -117
7453 -117 86 169 -150 -53 -216 -82 162 53 240 -59 -72 242 -104 -108 95 -138 -184 -221 55 136 -115 -149 -293
7476 -293 -55 94 -317 -14 65 -32 -187 -85 -57 302 -97 250 159 -4 -9 -144 -164 -82 -111 -149 -105 61 35 -203
7500 -203 186 -118 90 -11 22 -86 333 -155 18 -9 -28 -84 4 -137 -42 102 -31 57 19 -11 -65 253 -97
7523 -97 -2 95 184 90 -88 -16 239 -325 -102 2 154 -190 -85 288 157 92 -49 216 83 -295 -139 -156 -88
7546 -88 330 -16 47 -158 -68 262 -58 23 230 219 28 11 -100 -26 158 -45 48 5 -49 -148 -24 -192 -69 135
7570 135 -95 71 -152 -138 145 253 28 22 166 -316 136 126 58 335 68 -25 -362 52 -46 30 87 -39 -81
7593 -81 -73 -154 60 101 -147 8 152 22 437 -64 -71 -85 95 -3 -79 -240 -35 -316 -65 120 -83 15 208 143
$$ packed form
7428a48J77j21N2L22l53J02N7r7N8J6k44Q6N3J32j2P4j2j6k8k6L8l95L58j44m6
7453a17K03Q3l19R7j63J34K44j09J87k99j3L14l46mK03k33m6l7K76Q1k51l4j44
7476b93K38J49m11L03P9r7j55J02K8L59l99L47r1j63nj35k0Q2k9l8M4J66k6k38
7500b03L89l04K08j01L3j08M19m88J73k7j9n6Q8j41R5J44j33Q8l8l0n4L18l50
7523i7R5R7Q9r4j78P2K55n64K23J04J52l44J05L73j31o5j41K65j33l78J56j7O8
7546h8M18l46O3k05R0L30l20Q1K07j1j91j7j11P4J84k03R3m3n4r9J24j68J23K04
7570A35k30J66k23J4K83J08k25oJ44m82M52j0o8K77k67r3l37M14r8P6N7j26m2
7593h1Qq1K14M1k48J55J44j30M15n01pj4J80r8p6j61K05k81K51J85k03R8J93o5
$$ plain form
7617 143 -62 -210 -157 18 -77 -191 -99 49 -44 -229 37 288 -304 -112 202 -155 72 60 384 91 -42 344
7639 344 13 -246 -188 61 32 -28 203 -204 -157 143 -39 261 5 85 89 -14 -201 -113 -184 76 -67 101 -294
7662 -294 193 204 60 -71 52 392 -18 -44 174 205 81 90 133 -115 -221 14 -168 23 56 105 -161 -235 10
7685 10 -81 129 -167 14 -202 227 -52 54 -275 -130 101 113 -89 -337 -46 -15 321 122 89 -92 6 -23
7707 -23 167 -87 -113 57 125 -172 -29 91 -49 -75 87 -101 8 -80 -293 -24 362 63 -142 217 175 -79
7729 -79 85 48 94 111 -229 -71 -140 155 -7 145 201 54 -259 -88 -143 62 -105 94 -88 -67 97 -82 40
7752 40 18 48 -29 -150 238 -89 -56 103 -99 170 130 -12 -29 103 -137 -81 -78 78 -97 -176 44 262 10 60
7776 60 -52 32 -175 262 34 -5 -155 -82 13 -71 173 -23 -8 6 15 -55 32 -220 -68 -86 -172 -93 -34 11 206 -66
$$ packed form
7617A43k05j48N3J75r5j14R2J48r3j85K66K51n92J92L14l57K27j2L24k93j33L86
7639C44l31k59N8K49k9o0K31m07M7L00j82L00k56Q0Mj03j87Q8p1K60j43J68l95
7662b94M87J1j44j31J23L40m10k6K18L1j24RM3k48j06K35j82J91L3M9k66p4K45
7685A0r1K10k96J81k16M29k79J06l29J45K31J2k02k48K91L1L36j99l3j81R8k9
7707b3J90k54k6J70O8k97J43J20j40k6J62j88J09q8k13K69L86k99k05L59m2k54
7729g9J64l7M6J7l40J58o9K95j62J52N6j47l13J71n5K05j67J99j82K1J64j79J22
7752D0k2L0p7j21L88l27L3J59k02K69m0j42j7J32k40N6LJ56j75p9K20K18k52N0
7776F0j12Q4k07M37k28l9j50P3R5q4K44j96J5J4Rp0Q7k52J52j8q6P9N9M5J95k72
$$ plain form
7802 -66 82 56 349 33 64 -17 238 214 37 -377 282 -256 93 -27 -161 -106 -112 65 21 171 -202 97 187
7825 187 52 -59 -245 -67 -29 157 20 -39 -2 -129 -38 -186 -352 38 28 -44 -83 -22 -78 65 -24 330 70
7848 70 219 -57 4 -208 150 -16 -25 107 -28 -176 -138 170 99 311 -7 -98 -40 -94 -203 -17 110 5 226
7871 226 -132 -56 162 -44 123 -165 65 102 18 -142 102 -84 -13 -34 -139 -287 -52 122 -215 -135 -144 -94 44
7894 44 75 -170 128 -37 -34 135 -41 -38 -281 285 -3 23 13 75 -38 -38 327 -25 275 10 82 -68 -136 -54 -43
7919 -43 44 76 -102 -157 73 99 -109 -130 -243 203 -67 -33 -99 -111 62 -182 -62 83 -81 61 104 180 185 -3
7943 -3 -25 -71 -309 46 207 -29 -7 -75 -69 19 -84 99 -12 29 138 -91 -44 230 -218 -319 -8 33 -13 14 71
7968 71 -160 52 162 -84 -199 -112 -34 -114 -149 232 192 141 -58 0 -211 93 -93 21 107 284 92 271 -245
$$ packed form
7802f6J48k6K93l16L1q1K55k4j77m14O59n38L49j20j34N5oJ77m4J50l73K99R0
7825A87j35j11j86J78L8J86j37n9L7j27R1j48j66L90j0p2l9O1n6J43q9L54k60
7848G0J49k76O1k12L58j66rJ32j35j48L8L08p1K12l18r1N8n4j09J86J27j05K21
7871B26l58P6K18k06J67k88K30L7q4j60K44j86P1k1j05j48K35J74l37Q0rN0J38
7894D4L1k45K98j65LJ69j76Lk43N66k88K6j0O2j13%L65l52L00k65P2j50o8Q2J1
7919d3Q7L2j78n5K30K6k08k1j13M46k70L4o6j2J73k44J20J45j64J42M3P6Nj88
7943ck2m6k38L55J61k36K2o8OQ8j03J83j11M1J09k29M7K74m48j01L11M1m6K7N7
7968G1k31K12J10k46j15Q7P8q0l5L81m0n1j99N8k11L04j86J14Q6J77j92J79n16
$$ plain form
7991 -245 -115 143 -106 165 126 -64 84 -107 -144 19 89 158 -96 -196 -89 112 76 87 63 207 -161 39
8013 39 -78 201 -9 73 70 -132 -174 -305 18 268 101 36 73 -40 -15 -326 20 50 -64 13 -196 -77 53
8036 53 -315 -154 -52 18 215 -76 46 -169 41 13 -6 -84 179 -220 218 -132 -64 -112 14 -9 -47 79 -56
8059 -56 16 -189 122 -275 -139 -193 -169 -98 102 199 96 156 72 102 -235 260 -23 54 -154 -196 8 -112 -168 -31
8083 -31 116 -283 -9 190 -205 100 91 107 178 -292 51 136 88 81 109 -151 280 -91 -182 -6 -339 11 -145 187
8107 187 246 375 90 -1 164 -222 -340 -121 143 -258 -111 -175 275 -122 140 -72 -49 189 -11 119 118 -75
8129 -75 -55 -68 45 29 79 -49 -184 30 -164 -75 7 154 -10 -108 197 255 54 -119 93 -240 40 -25 73 62
8153 62 -104 348 -152 122 -150 1 -197 101 -221 40 -156 -152 17 -400 -196 -185 -55 -75 -83 -192 -196 172 -54
$$ packed form
7991b45J30K58k49K71l9j90J48j91l7J63P0O9k54j00J07K01l6J1k4J44l68K00
8013C9j17K79k10Q2lk02m2j31L23K50j67o5L7j13K5l11L46L0j14P7k09J19J30
8036E3l68J61J02P0J97k91J22k15K10k8j9p8K63l99M38l50O8m8J26k3l8J26j35
8059e6P2k05L11l97J36n4K4P1K00R7j03O0q4L0l37M95k83P7k08m2K04j20n6J37
8083c1J47l99K74J99l95L05rJ6P1m70L43Q5m8pK8k60M31l71r1J76l33L50j56L32
8107A87N9J29k85r1J65l86j18K19K64m01J47o4M50l97K62k12K3K38k00J30jj93
8129g5K0j3J13j6N0j28j35K14j94Q9Q2J47j64r8L05N8k01j73K12l33K80o5R8j1
8153F2j66M52n00K74k72J51j98K98l22K61j96MJ69m17K04J1J30k0qj09mL68k26
$$ plain form
8176 -54 121 -5 -202 -314 -66 -57 291 138 -42 -51 -30 -29 -120 -51 -140
$$ packed form
8176e4J75j26j97j12K48RL48j53j80rK1Jr1O9q9
8191a40
$$ Imaginary data points
##PAGE= N=2
##DATA TABLE= (X++(I..I)), XYDATA
$$ plain form
0 0 0 0 0 0 0 0 0 0 0 0 0 0 8 -8 8 -8 8 -16 16 -24 24 -32 32 -40 48 -56 64 -75 88 -99 113 -129 148 -168
34 -168 190 -214 240 -267 299 -335 372 -415 459 -507 562 -620 684 -754 834 -915 1010 -1112
52 -1112 1226 -1351 1494 -1654 1834 -2043 2286 -2570 2914 -3333 3860 -4548 5482 -6839 8984
67 8984 -12919 22540 -101619 -52237 135479 13427 -79286 -42714 61939 32717 28269 26392
79 26392 -1512 -17563 15173 38676 4886 -35782 -41630 -10441 24987 137 -23543 -25203 11037
92 11037 3023 -134 25014 533 -20220 4903 45082 6726 -46468 7548 35692 -6577 -33354
105 -33354 6482 18297 -24161 -14798 13583 4231 -13630 9256 18515 -11381 -11078 9768 25891
118 25891 327 -26025 -13127 16676 25771 -28361 -36702 19345 34007 -9652 -31295 15809
$$ packed form
0@%%%%%%%%%%%%Qj6J6j6J6k4L2m0M8n6O4p2Q8j04J20j39J63j87K12k42K77l16
34a68L58m04M54n07N66o34P07p87Q74r66J069j182J304j438J588j749J925k122
52a112K338k577K845l148L488l877M329m856N484o247P193q408J0030j2321J5823
67H984k1903L5459j24159M9382J87716j22052r2713L6572J04653k9222m448j877
79B6392k7904j6051L2736K3503l3790m0668n848L1189L5428k4850k3680j660L6240
92A1037q014l157K5148k4481k0753K5123M0179l8356n3194N4016K8144m2269k6777
105c3354L9836J1815m2458R363K8381r352j7861K2886R259k9896L03K0846J6123
118B5891k5564k6352J2898K9803R095n4132q341N6047J4662m3659k1643M7104
$$ plain form
130 15809 23707 -8672 -7205 10420 8683 -5659 -945 -5492 -9478 1979 4995 -5695 -14503 2113
144 2113 6873 4436 1308 -8642 1629 12400 11789 -5053 -4084 9946 -6564 -7399 13624 11252
158 11252 -25283 -26607 18632 21444 -14370 -23214 1039 11464 8524 8921 -7203 -12849 5037
171 5037 23968 11690 -13747 -15449 -4444 18284 15543 -16931 -26440 3682 23426 -5279 -17447
184 -17447 2001 3569 -5115 5613 14717 -8160 -14202 10026 14739 -2546 -5775 4141 -3418 -3224
198 -3224 9084 2450 -10940 -7862 8925 5589 -5430 -6013 -4218 4182 6526 -3063 -10252 2825
212 2825 12641 -3520 -8452 6017 8819 -5150 -3133 7972 -872 -6016 3787 5217 -8043 -5092
226 -5092 7787 -428 -8828 -1324 5379 -1011 -4918 1352 1914 1834 1604 -1566 552 6448 3898 -6346
$$ packed form
130A5809P898l2379J467J7625j737j4342M714m547l986J1457L016j0690q808J6616
144B113M760k437l128r950J0271J0771o11j6842R69J4030j6510q35K1023k372
158A1252l6535j324M5239K812l5814q844K4253J0425k940L97j6124n646J7886
171E037J8931j2278k5437j702J1005K2728k741l2474r509L0122J9744k8705j2168
184a7447J9448J568q684J0728R104k2877o042K4228M713j7285l229R916p559J94
198c224J2308o634j3390L078J6787l336j1019n83J795Q400K344r589p189J3077
212B825R816j6161m932J4469K802j3969K017J1105q844n144R803J430j3260K951
226e092J2879q215q400P504O703o390l907O270N62q0k30l170K118N896k550j0244
$$ plain form
242 -6346 -1641 6524 435 -4982 -818 1187 -4914 -1048 4348 -3541 -6942 1810 5818 -2946 -2769
257 -2769 4254 1967 -1152 2014 4553 169 -1920 749 1153 2009 -564 -4693 -3901 2850 2667 -5522
273 -5522 -3882 1745 1089 -694 1675 504 -3756 1754 7015 610 -4808 1485 6018 -588 -2385
288 -2385 663 356 -1723 -1252 77 -1573 -873 -632 -1630 -50 1604 -743 -2761 2225 3214 -821 10
305 10 3037 976 -655 2643 1820 -3113 -1253 2923 80 -4811 -1948 1814 -1009 -2345 -1034 -14
321 -14 -560 290 1184 -41 473 1119 1223 1383 1482 198 -618 1275 1507 -1264 -1520 -415 -971 -2084 -331
340 -331 -208 -2371 -1805 1505 2170 -1387 -827 2097 2133 857 53 893 1045 892 1266 -125 -1043 -1318 -100
359 -100 -687 -1468 -1897 -1466 -151 -99 -517 -386 381 738 361 1215 1720 1357 -190 758 1755 988 -944 -954
$$ packed form
242f346M705Q165o089n417M164K005o101L866N396p889l401Q752M008q764J77
257b769P023k287l119L166K539m384k089K669M04Q56k573m129P92O751j83q189
273e522J640N627o56j783K369j171m260N510N261o405n418O293M533o606j797
288b385L048l07k079M71J329j650P00K41r98J580J654k347k018M986R89m035Q31
305A0L027k061j631L298q23m933J860M176k843m891K863L762k823j336J311J020
321a4n46Q50Q94j225N14O46J04J60R9j284q16J893K32k771k56J105n56j113J753
340c31J23k163N66L310O65l557N60K924L6j276q04Q40J52j53L74j391r18k75J218
359a00n87p81m29M31J315N2m18J31P67L57l77Q54N05l63j547R48R97p67j932j0
$$ plain form
379 -954 -111 -465 -1068 -768 -1505 -2103 -800 1157 -611 -2000 -215 1289 1118 1448 1411 288 44 2194
397 2194 1728 -304 -693 -77 -137 -145 644 -1696 -3285 -644 673 -1275 -1239 253 -206 -640 1996 2004 -1038
416 -1038 -104 2945 1053 -1115 1354 2052 -1124 -1178 669 -133 -939 -487 -2138 -2840 870 2469 -1917
433 -1917 -3710 949 2550 737 973 1000 -1855 304 4184 2509 -2534 -1724 1059 -61 240 777 -3009
450 -3009 -4458 1819 3978 -1844 -4378 -16 1562 135 1721 1178 -1850 -149 3576 1280 -910
465 -910 1009 55 -2299 753 2792 -1824 -3528 463 435 -2568 -114 2267 -1773 -3323 1497 3215
481 3215 693 -147 -740 -608 3136 5222 -1088 -4987 492 4166 218 -1982 -967 -1958 -1992 2273 2006
498 2006 -3470 -3800 402 1901 2146 1566 -2631 -3197 4174 6549 -1683 -4792 1547 3536 -197 -692
$$ packed form
379i54Q43l54o03L00p37n98J303J957j768j389J785J504j71L30l7j123k44K150
397B194m66k032l89O16o0qP89k340j589K641J317j948L6J492m59m34K636Ql042
416a038R34L049j892k168K469O98l176n4J847q02q06M52j651p02L710J599m386
433a917j793M659J601j813K36K7k855K159L880j675n043Q10K783j120L01N37l786
450c009j449O277K159n822k534M362J578j427J586n43l028J701L725k296k190
465i10J919r54k354L052K039m616j704L991k8l003K454K381m040j550M820J718
481C215k522q40n93J32L744K086o310l899N479L674l948k200J015r91l4M265k67
498B006n476l30M202J499K45n80m197n66P371K375q232l109O339J989l733m95
$$ plain form
514 -692 -545 -2740 -1218 1797 -1268 -2508 974 403 -3307 -80 4123 -618 -2371 2598 2430 -1783
530 -1783 1096 3964 -1176 -3337 1450 2225 -933 -618 -1170 -3939 277 5075 -1673 -7087 355 4210
546 4210 -776 -1062 2845 -540 -3264 3423 5503 -2155 -3959 1986 1870 -100 1365 -2015 -5733 935
562 935 5866 -2249 -6554 1250 3296 -3056 -1435 3723 -112 -1975 2711 2292 -1788 1306 2636 -3198
578 -3198 -1504 5383 1602 -5646 -1190 3253 -2358 -2567 3288 55 -5299 -348 4289 -349 -2243
593 -2243 1225 831 299 3983 1569 -4356 -1226 5166 1871 -3149 -352 -583 -3336 555 3835 -2232
609 -2232 -5107 1366 3162 -1614 -1935 534 -455 883 4096 409 -4090 630 4376 -251 -1819 1265
625 1265 407 -2149 -484 -348 -2370 -538 1763 -1317 -1618 2336 -213 -3388 925 3695 -923 -1369
$$ packed form
514f92J47k195J522L015l065j240L482n71l710L227M203m741j753M969j68m213
530a783K879K868n140k161M787P75l158L15n52k769M216M798o748n414P442L855
546D210m986k86L907l385k724O687K080p658j804N945j16j970J465l380l718O668
562I35M931q115m305P804K046o352J621N158l835j863M686m19m080L094J330n834
578c198J694O887l781p248M456M443n611k09N855l233n354M951M637m638j894
593b243L468l94n32L684k414n925L130O392l295n020K797k31k753L891L280o067
609b232k875O473J796m776l21K469r89J338L213l687m499M720L746m627j568L084
625A265q58k556J665J36k022J832K301l080l01L954k549l175M313K770m618m46
$$ plain form
641 -1369 3163 1299 -2836 28 3117 -102 -1050 1371 -1459 -2863 1164 1338 -3209 -1601 2137 8
657 8 -1985 725 218 -2001 2471 4335 -1404 -2812 2708 1655 -2937 889 3124 -1920 -2316 2453
673 2453 -53 -4172 181 2884 -2284 -2280 2844 328 -3643 1079 3666 -416 -249 2617 -397 -2210
689 -2210 2637 2403 -3215 -672 3364 -1420 -4162 1398 1102 -3942 -493 3578 -1160 -3436 1945 1551
705 1551 -2100 873 3694 -1311 -2229 3173 2312 -2743 -570 2397 -750 -1913 891 -1071 -3167 835
721 835 2094 -2382 -1802 2378 0 -2336 1654 2543 -1343 162 3050 -246 -2347 1755 2020 -2059
737 -2059 -735 2146 -1123 -2821 775 844 -1987 -497 1068 -1040 -559 1481 13 -1266 1912 2255
753 2255 -1343 -574 1923 -44 -1366 1389 895 -2173 -631 1703 -1162 -2665 591 502 -1985 -266
$$ packed form
641a369M532j864m135K864L089l219r48K421k830j404M027J74m547J608L738k129
657Hj993K710n07k219M472J864n739j408N520j053m592L826K235n044l96M769
673B453k506m119M353K703n168MN124k516l971M722K587m082J67K866l014j813
689b210M847k34n618K543M036m784k742N560k96n044L449M071m738k276N381l94
705A551l651K973K821n005r18N402q61n055K173K967l147j163K804j962k096M002
721H35J259m476N80M180k378k336L990Q89l886J505K888l296k101M102K65m079
737b059J324K881l269j698L596O9k831J490J565k108M81K040j468j279L178L43
753B255l598P69K497j967j322K755m94l068J542K334k865j503L256q9k487J719
$$ plain form
769 -266 1861 -332 -1217 1483 1134 -654 1044 1385 -806 59 2142 -184 -2288 743 1173 -1597 -1064
786 -1064 701 -915 -1783 1068 911 -2143 -227 2293 -580 -1608 1619 1868 -971 397 1793 -496
802 -496 -1033 1245 312 -1883 121 997 -1722 -1370 1077 -116 -1821 336 1600 -1221 -821 1888 373
819 373 -977 1493 1939 -1000 -202 1652 -34 -1384 465 651 -1391 -782 1036 -668 -1356 215 423
836 423 -1175 156 1686 -291 -874 1418 760 -624 824 1444 -272 -487 973 -159 -1583 51
852 51 516 -1524 -1191 833 -233 -994 -112 544 -425 141 1059 -72 -363 1076 911 -322 17 908 -448
871 -448 -459 430 -501 -1093 -400 195 -659 -760 278 -91 -582 1013 888 -449 -92 1096 826 137 838
890 838 385 -457 105 715 -191 -1001 -82 -394 -670 -540 -72 -886 -391 182 218 -376 214 431 19 242 877
$$ packed form
769b66K127k193q85K700l49j788J698L41k191Q65K083k326k104L031M30k770N33
786a064J765j616q68K851j57l054J916K520k873j028L227K49k839J368J396k289
802d96n37K278r33k195K004Q76k719L52K447j193j705K157J264k821M00K709j515
819C73j350K470M46k939P98J854j686j350J849J86k042O09J818j704o88J571K08
836D23j598J331J530j977n83K292o58j384J448O20j716k15J460j132j424J634
852E1M65k040L33K024j066p61Q82O56r69N66R18j131k91J439j65j233L39Q91j356
871d48j1Q89r31n92O93N95q54j01J038l69m91J595j25j337L57J188k70o89P01
890H38m53q42N62O10r06q10R19l12k76J30M68q14M95N73L6n94N90K17m12K23O35
$$ plain form
911 877 483 -196 50 756 218 -5 -217 -892 -583 276 124 -719 -748 -348 -82 69 223 -254 -198 507 941
932 941 737 168 416 106 319 219 -102 -595 -696 -221 -28 -488 -648 -376 -266 -8 75 99 7 147 226 471
954 471 391 469 178 -32 -76 620 91 -212 -417 99 93 -331 -338 -338 -495 -413 307 405 -70 -73 334 639 348 194 -293
979 -293 153 759 491 67 -533 -19 -113 -51 147 -214 -604 -453 17 15 -255 -95 -71 -107 699 652 -164 -4 958
1002 958 779 -324 -2 582 -224 -728 -219 19 -584 -519 -428 -788 -111 371 -374 -705 510 764 -68 48
1022 48 803 -42 -314 965 720 -606 -651 376 -296 -386 -140 -388 -1292 -24 814 -589 -978 678 516
1041 516 -615 182 1047 -363 -251 1245 769 -591 302 344 -740 -146 272 -595 -1470 115 620 -1027
1059 -1027 -392 1059 225 -1170 702 1256 -197 -41 1127 124 -352 890 884 -939 -358 1121 -770
$$ packed form
911H77l94o79K46P06n38k23k12o75L09Q59j52q43k9M00K66J51J54m77N6P05M34
932I41k04n69K48l10K13j00l21m93j01M75J93m60j60K72J10K58Q3K4r2J40P9K45
954D71q0P8k91k10m4O96n29l03k05N16om24p%j57Q2P20R8m75lM07L05k91j54m87
979b93M46O06k68m24o00N14r4O2J98l61l90J51M70kk70J60K4l6Q06m7q16J60R62
1002I58j79j103L22N84q06n04N09K38o03O5R1l60O77M82p45l31J215K54q32J16
1022D8P55q45k72J279k45j326m5J027o72r0K46k48r04J268Q38j403l89J656j62
1041E16j131P97Q65j410J12J496m76j360Q93M2j084N94M18q67q75J585N05j647
1059a027O35J451q34j395J872N54j453J56J168j003m76J242oj823N81J479j891
$$ plain form
1076 -770 -1056 332 -204 -1477 218 1063 -750 -1281 1048 878 -575 354 1128 -208 -250 1566 362
1093 362 -953 612 904 -577 -524 831 -476 -1114 9 568 -891 -671 800 -282 -615 341 638
1110 638 -560 270 1301 -402 -489 1006 249 -990 -237 842 -524 -814 656 -284 -1440 -84 622
1127 622 -909 -604 1173 255 -667 910 703 -373 356 1466 116 -1135 730 468 -1069 -4 852
1144 852 -985 -830 558 -480 -1657 237 1048 -1076 -272 1565 184 -1075 986 1325 -552 -246
1160 -246 1407 -275 -1165 549 392 -1290 -220 1138 -874 -1453 856 287 -1571 134 1510 -351
1176 -351 -646 1503 604 -1154 585 1898 -334 -635 1443 220 -1606 -227 1231 -1000 -663 1136
1192 1136 30 -1854 490 1069 -809 -519 1491 42 -1221 901 1331 -1044 50 1825 -442 -1487
$$ packed form
1076g70k86J388n36j273J695Q45j813n31K329j70j453R29P74j336m2J816j204
1093C62j315J565K92j481N3J355j307o38J123N59j459K20J471j082l33R56K97
1110F38j198Q30J031j703q7J495p57j239P53J079j366k90J470r40j156J356P06
1127F22j531L05J777r18r22J577k07j076P29J110j350j251J865k62j537J065Q56
1144H52j837J55J388j038j177J894Q11k124Q04J837j381j259K061L39j877L06
1160b46J653j682q90J714j57j682J070J358k012n79K309n69j858J705J376j861
1176c51k95K149q99j758J739J313k232l01K078j223j826J379J458k231L37J799
1192A136j106j884K344N79j878K90K010j449j263K122M30k375J094J775k267j045
$$ plain form
1208 -1487 677 717 -1688 -170 1061 -707 -1692 834 620 -1522 257 1656 36 -458 1154 426
1224 426 -1058 770 1278 -595 -636 936 -341 -1441 -65 633 -1295 -558 1072 -603 -1293 553 688
1241 688 -1100 29 1732 -71 -740 1056 681 -827 478 1125 -271 -735 565 -68 -1161 178
1257 178 643 -747 -356 674 -519 -1172 796 917 -852 242 1055 -343 -592 1172 953 -1052 298
1274 298 1179 -912 -1346 775 469 -1118 113 993 -931 -915 853 -188 -835 842 1257 -632 -343
1291 -343 1289 274 -800 876 1145 -909 259 1170 -700 -1665 873 832 -1458 -656 1240 -634 -1227
1308 -1227 1115 853 -962 49 1627 -475 -551 1013 617 -950 460 1019 -871 -870 832 -284 -1350
1325 -1350 309 881 -1054 -708 1133 -272 -1281 888 1240 -815 -123 1245 -41 -565 906 1070
$$ packed form
1208a487K164M0k405J518J231j768r85K526k14k142J779J399j620m94J612p28
1224D26j484J828N08j873m1J572j277j100J376O98j928P37J630j675o90J846J35
1241F88j788J129J703j803o69J796l75j508J305O47j396m64J300o33j093J339
1257A78M65j390L91J030j193o53J968J21j769J094Q13j398k49J764k19k005J350
1274B98Q81k091m34K121l06j587J231Q80j924J6J768j041o47J677M15j889K89
1291c43J632j015j074J676K69k054J168R11j870r65K538m1k290Q02J896j874n93
1308a227K342k62j815J011J578k102p6J564l96j567J410N59j890JJ702j116j066
1325a350J659N72j935L46J841j405j009K169L52k055O92J368j286n24J471J64
$$ plain form
1341 1070 -706 -347 795 -615 -946 344 -3 -1214 51 751 -721 -799 810 89 -455 559 1228
1358 1228 -328 -139 752 113 -732 528 680 -885 -456 545 -434 -854 178 405 -1149 -357 763
1375 763 -478 -412 667 459 -403 392 748 -616 -314 1101 83 -615 239 717 -891 -540 453 -320
1393 -320 -960 336 492 -698 -46 832 123 -520 702 727 -564 269 940 -118 -601 538 40 -665
1411 -665 5 637 -741 -710 611 116 -855 44 827 -715 -285 818 410 -747 724 883 -102 -17 856
1430 856 -130 -502 203 220 -860 -169 338 -388 -872 260 275 -900 -242 855 -285 -191 449 323 -297
1449 -297 482 896 -267 -133 371 105 -652 -9 -29 -517 -535 315 -175 -646 233 181 -162 49 632 167 -335
1470 -335 370 499 -71 64 485 -184 -502 153 -59 -426 -222 180 -474 -688 224 -215 -322 -34 28 -17 155
$$ packed form
1341A070j776L59J142j410l31J290l47j211J265P00j472p8J609p21n44J014O69
1358A228j556J89Q91o39q45J260J52j565M29J001r79m20J032K27j554P92J120
1375G63j241O6J079k08q62P95L56j364L02J415j018o98Q54M78j608L51R93p73
1393c20o40J296J56j190O52Q78p09o43J222K5j291Q33O71j058m83J139m98p05
1411f65O70O32j378L1J321m95r71Q99P83j542M30J103m08j157J471J59r85Q5Q73
1430H56r86l72P05J7j080O91N07p26m84J132J5j175O58J097j140R4O40j26o20
1449b97P79M14j163J34N04k66p57O43k0m88j8Q50m90m71Q79n2l43K11N83m65n02
1470c35P05J29n70J35M21o69l18O55k12l67K04M02o54k14R12m39j07K88O2m5J72
$$ plain form
1491 155 456 88 65 474 664 17 -134 339 -226 -362 -58 43 -550 -88 26 -235 -419 -52 -258 78
1511 78 -57 382 132 163 434 196 123 34 275 68 25 -44 -94 -102 -240 -134 -200 -569 -108 -212 -244 -45 -50 -23 94
1536 94 -101 515 254 155 215 89 -250 -95 -127 -353 -229 -100 115 -238 -144 -29 -177 -162 -143 159 9 72 286
1559 286 141 71 259 355 141 27 364 -120 -111 180 64 -474 -250 77 -185 -148 -160 603 -23 -36 405 340 -107
1582 -107 65 135 12 134 385 393 -334 24 -96 -404 -312 255 -250 -333 -102 74 -387 -105 282 34 56 557
1604 557 263 31 419 489 -17 -97 284 -312 -527 -23 -170 -613 106 -76 -597 -486 48 -44 -246 329 555
1625 555 24 -97 601 379 -346 411 330 -194 -390 387 -376 -679 304 118 -680 -364 569 -281 -601 174
1645 174 528 -247 343 799 153 -225 871 283 -308 298 590 -627 -400 282 -117 -901 218 321 -800
$$ packed form
1491A55L01l68k3M09J90o47j51M73n65j36L04J01n93M62J14k61j84L67k06L36
1511G8j35M39k50L1K71k38p3q9K41k07m3o9n0qj38J06o6l69M61j04l2J99nK7J17
1536I4j95O16k61r9O0j26l39J55l2k26J24J29K15l53R4J15j48J5J9L02j50O3K14
1559B86j45p0J88R6k14j14L37m84RK91j16n38K24L27k62L7j2P63o26j3M41o5m47
1582a07J72P0j23J22K51Qp27L58j20l08R2N67n05q3K31J76m61K82L87k48K2N01
1604E57k94k32L88P0n06q0L81n96k15N04j47m43P19j82n21J11N34r2k02N75K26
1625E55n31j21O98k22p25P57q1n24j96P77p63l03R83j86p98L16R33q50l20P75
1645A74L54p75N90M56o46l78J096n88n91O06K92j217K27O82l99p84J119J03j121
$$ plain form
1664 -800 -422 791 59 -936 374 516 -225 4 860 85 -509 741 525 -670 -409 607 -356 -935
1682 -935 323 108 -844 -143 820 -661 -368 548 367 -593 155 942 -147 -389 680 366 -646 53
1700 53 515 -549 -706 339 -197 -761 163 320 -724 -239 427 -96 -470 435 532 -208 104 983 47 -576
1720 -576 379 119 -659 -108 581 -262 -726 153 196 -777 -76 165 -567 -360 524 10 -457 381 941 -395
1740 -395 -28 749 120 -434 563 111 -1094 -175 502 -197 -664 384 -46 -522 254 598 -331 -221 608
1759 608 -53 -247 471 792 -417 -36 759 99 -582 402 461 -721 -308 589 -409 -899 361 211 -667
1778 -667 -36 931 -373 -386 808 515 -694 316 793 -314 -510 983 121 -645 262 622 -980 -971 598
1797 598 -230 -1172 -59 933 -634 -35 1074 64 -467 644 848 -519 -258 1075 -461 -1019 437
$$ packed form
1664h00L78J213p32r95J310J42p41K29Q56p75n94J250k16j195K61J016r63n79
1682i35J258k15r52P01R63j481K93R16j81r60P48P87j089k42J069l14j012O99
1700E3M62j064j57J045n36n64R24J57j044M85O66n23l74R05R7p40L12Q79r36o23
1720e76R55k60p78N51O89q43m64Q79M3r73P01K41p32K07Q84n14m67Q38N60j336
1740c95L67P77o29n54R97m52j205R19O77o99m67J048m30m76P76L44r29J10Q29
1759F08o61j94P18L21j209L81P95o60o81R84N9j182M13Q97r98m90J260j50q78
1778f67O31R67j304j3J194k93j209J010M77j107j96J493q62p66R07L60j602RJ569
1797E98q28r42J113R92j567N99J109j010n31J111K04j367K61J333j536n58J456
$$ plain form
1814 437 602 -858 -295 841 -334 -815 208 583 -918 -261 871 23 -263 618 324 -645 10 1063
1832 1063 -350 -588 424 -182 -1049 38 627 -869 -357 603 -600 -742 401 695 -494 60 810
1849 810 -273 -465 496 716 -281 115 684 -7 -735 260 -29 -810 -36 487 -794 -665 649 105 -649
1868 -649 304 444 -434 -382 669 225 -596 754 483 -547 -200 464 -352 -624 382 68 -738 -130 384
1887 384 -523 -664 354 216 -541 137 581 -260 -461 833 421 -674 408 567 -660 -586 221 -355 -413
1906 -413 161 410 -657 -402 491 -295 -406 550 263 -392 -203 805 -251 -320 695 129 -359 15 658
1925 658 -493 -325 528 4 -718 -91 409 -569 -181 433 106 -555 307 530 -511 -76 767 37 -379
1944 -379 534 427 -415 -336 682 -224 -674 396 29 -584 40 347 -324 -527 114 243 -334 310 725 -27
$$ packed form
1814D37J65j460N63J136j175m81J023L75j501O57J132q48k86Q81k94r69O55J053
1832A063j413k38J012o06q67J087N89j496N12R60j203j42J143K94j189N54P50
1849H10j083j92R61K20r97L96N69o91p28R95k89p81P74N23j281J29J314n44p54
1868f49R53J40q78N2J051m44q21J350k71j030L47O64q16k72J006l14q06O08N14
1887C84r07j41J018j38p57O78M44q41k01J294m12j095J082J59j227P4Q07n76n8
1906d13N74K49j067K55Q93p86j11R56k87o55J89J008j056o9J015n66m88L74O43
1925F58j151J68Q53n24p22O27N00r78L88O14l27o61Q62K23j041M35Q43p30m16
1944c79R13j07q42P9J018r06m50J070l67o13O24L07o71k03O41J29n77O44M15p52
$$ plain form
1964 -27 161 520 448 -436 158 380 -343 -315 85 21 -553 -2 448 -606 -147 291 -186 -100 328 350 -201 162
1986 162 523 -190 -246 469 344 -381 -139 90 -519 -390 255 -214 -206 344 355 -308 -81 606 100 -423 397
2007 397 137 -161 167 699 -53 -158 212 259 -302 -3 10 -347 128 225 -97 -535 -133 468 -380 -194 258
2028 258 -5 -150 203 473 -238 13 246 -96 -340 -142 53 -392 -227 413 -17 -547 6 264 -306 -229
2048 -229 302 -52 -229 412 208 -23 -17 181 120 93 544 -58 -326 188 28 -399 -168 -49 250 -131 -128 193
2070 193 -243 -26 303 145 -52 210 161 -43 64 240 -67 -211 146 -94 -106 38 -215 -386 -202 97 -233
2091 -233 -93 102 64 -327 193 193 -111 -67 148 370 113 57 218 15 -210 -295 -65 -126 -104 -22 -216 81 169
2114 169 250 -51 99 210 11 -268 -84 48 42 189 29 98 73 205 -54 -108 -426 -21 -30 -63 -3 98 -227
$$ packed form
1964b7J88L59p2q84N94K22p23K8M00o4n74N51M50j054M59M38m77Q6M28K2n51L63
1986A62L61p13n6P15j25p25K42K29o09J29O45m69QN50J1o63K27O87n06n23Q20
2007C97k60k98L28N32p52j05L70M7n61K99J3l57M75R7l22m38M02O01q48J86M52
2028B58k63j45L53K70p11K51K33l42k44J98J95m45J65O40m30n30N53K58n70P7
2048b29N31l54j77O41k04k31OJ98o1k7M51o02k68N14j60m27K31J19K99l81LL21
2070A93m36K17L29j58j97K62m9k04J07J76l07j44L57k40j2J44k53j71J84K99l30
2091b33J40J95l8l91N20%l04M4K15K22k57n6J61k03k25q5K30o1K2Q2j94K97Q8
2114A69Q1l01J50J11j99k79J84J32oJ47j60O9k5J32k59n4l18M05rl3O0J01l25
$$ plain form
2137 -227 41 217 416 165 165 252 112 70 252 102 -31 114 -6 -146 -313 -273 -100 -85 -160 242 167 -55 -10
2160 -10 390 -168 140 290 395 -52 -255 355 116 -26 -46 -231 -190 -210 -301 -208 -261 174 90 -183 146 464 -161
2183 -161 135 169 -59 -106 -43 481 28 -94 423 -192 -94 47 189 -250 -131 268 -507 -274 79 63 -424 -32
2205 -32 301 -56 107 325 -69 -153 15 518 -72 -106 329 -57 -253 -37 -6 -239 -316 22 -26 -414 50 23
2227 23 -189 36 261 -25 -203 58 69 -92 336 325 41 -601 174 -306 -254 -187 66 -216 -379 197 -38 -308
2249 -308 53 -76 -275 527 170 69 -202 322 155 30 -263 160 -201 -275 71 65 -387 163 258 -172 -263 286
2271 286 -72 11 -107 338 -370 -37 374 42 -176 484 476 -259 -236 274 -344 -548 84 252 -524 -223 358
2292 358 -218 -323 136 259 -370 -67 422 -118 57 448 194 -215 200 182 -564 -282 286 -159 -520 45
$$ packed form
2137b27K68J76J99k51%Q7j40m2J82j50j33J45j20j40j67M0J73J5p5M02p5k22M5
2160a0M00n58L08J50J05m47k03O10k39j42k0j85M1k0r1R3n3M35q4k73L29L18o25
2183a61K96L4k28m7O3N24m53j22N17o15R8J41J42m39J19L99p75K33L53j6m87L92
2205c2L33l57J63K18l94q4J68N03n90l4M35l86j96K16L1k33p7L38m8l88M64k7
2227B3k12K25K25k86j78K61J1j61M28j1k84o42P75m80N2O7K53k82j63N76k35k70
2249c08L61j29j99Q02l57j01k71N24j67j25k93M23l61p4L46om52N50R5m30r1N49
2271B86l58Q3j18M45p08L33M11l32k18O60qp35K3N10o18k04O32J68p76L01N81
2292C58n76j05M59J23o29L03M89n40J75L91k54m09M15j8p46K82N68m45l61N65
$$ plain form
2312 45 460 -499 -167 516 -106 -480 604 539 -465 -61 864 117 -447 311 333 -310 -210 596 -70 -277
2332 -277 172 -7 -269 -193 380 -239 -392 434 293 -127 75 327 -235 -79 365 308 -234 194 270 -381 -187
2353 -187 297 -291 -524 160 347 -346 -233 488 45 -117 137 -57 -123 358 418 -80 -137 191 186 -581 157 314
2375 314 -216 -268 -40 -443 -568 246 191 -210 -418 409 -320 -319 468 162 -348 72 489 -169 -367 472 517 -464
2397 -464 233 312 -608 -357 240 -92 -563 294 330 -335 -361 445 -53 -440 444 664 -209 -212 464 67 -258 176
2419 176 315 -261 -454 248 -416 -374 238 607 -514 -64 471 -107 -414 278 232 -388 186 624 -236 -336
2439 -336 623 356 -218 93 348 -300 -503 104 -110 -116 81 300 -440 14 405 145 -108 492 630 -261 -397
2460 -397 227 -179 -341 470 140 -328 -118 174 -286 -269 447 273 -372 331 383 15 -266 369 -158 -54 350
$$ packed form
2312D5M15r59L32O83o22l74J084o5j004M04R25p47n64P58K2o43J00Q06o66k07
2332b77M49j79k62P6N73o19j53Q26j41m20K02K52n62J56M44n7n42M28P6o51J94
2353a87M84n88k33O84J87o93J13P21m43j62K54j94o6M81O0m98n7L28np67P38J57
2375C14n30n2K28m03j25Q14n5m01k08Q27p29JP87l06n10M20M17o58j98Q39M5r81
2397d64O97P9r20K51N97l32m71Q57L6o65k6Q06m98l87Q84K20q73lO76l97l25M34
2419A76J39n76j93P02o64M2O12L69j121M50N35n78l07O92m6o20N74M38q60j00
2439c36R59k67n74L11K55o48k03O07k14oJ97K19p40M54L91k60k53O00J38q91j36
2460c97O24m06j62Q11l30m68K10K92m60J7P16j74o45P03N2l68k81O35n27J04M04
$$ plain form
2481 350 459 -69 59 591 -275 -205 122 161 -320 -357 288 129 -338 184 260 -118 -178 350 -253 -264 438 -46
2503 -46 -279 356 293 -505 -553 321 -226 -531 73 -128 -393 -474 677 -186 -277 337 149 -300 -13 361 -81
2524 -81 -18 403 559 -362 91 160 -175 -316 371 344 -466 -146 181 -104 -374 359 -278 -550 102 266 -213
2545 -213 -32 413 108 -143 65 43 -319 56 326 -134 -483 -37 256 -377 -139 290 -175 -149 319 133 -329
2566 -329 -49 494 -67 -500 334 324 -367 118 244 -147 -126 104 125 -548 -3 -85 21 43 343 -21 -137 202
2588 202 -166 -33 14 354 -1 201 247 70 -120 209 53 3 -178 189 16 -413 -148 -105 -405 -28 255
2609 255 56 150 271 239 3 -81 355 279 -23 43 -184 -119 -157 59 59 -286 125 -34 -468 199 92 -45 -47 144
2633 144 257 -32 97 12 128 -94 212 -45 -367 26 -3 -171 -37 107 -85 -360 18 29 -271 -108 32
$$ packed form
2481C50J09n28J28N32q66P0L27L9m81l7O45j59m67N22P6l78o0N28o03j1P02m84
2503d6k33O35o3p98m8Q74n47l05O04k01k65q1J151q63r1O14j88m49K87L74m42
2524h1O3M21J56r21M53O9l35j41O87k7q10L20L27k85k70P33o37k72O52J64m79
2545b13J81M45l05k51K08k2l62L75K70m60l49M46K93o33K38M29m65K6M68j86m62
2566c29K80N43n61m33Q34j0o91M85J26l91K1K30K1o73N45q2J06K2L00l64j16L39
2588B02l68J33M7L40l55K02M6j77j90L29j56n0j81L67j73m29K65M3l00L77K83
2609B55j99R4J21l2k36q4M36p6l02O6k27O5l8K16%l45M11j59m34O67j07j37kJ91
2633A44J13k89J29q5J16k22L06k57l22L93k9j68J34J44j92k75L78J1l00J63J40
$$ plain form
2654 32 347 -249 -10 -1 -85 26 218 137 -70 259 122 80 -72 23 -119 -207 37 72 -63 -83 1 -8 139 -78
2678 -78 151 212 23 51 91 66 66 -102 -77 17 65 -64 -61 -42 26 -108 -212 -26 -191 51 22 -134 -295 53 68
2703 68 218 -12 -229 -1 118 14 -103 -293 -168 183 -124 -108 -143 -88 -71 -68 -24 -332 111 257 119 84 71
2726 71 -48 -272 19 -197 47 -27 65 177 -71 134 -127 -69 -7 -180 -140 -81 3 9 179 81 43 57 336 -11
2750 -11 -103 129 99 -236 -61 29 -207 -54 50 -12 59 -113 -187 -91 100 34 -21 -175 345 -19 -54 188 75 112
2774 112 -165 80 39 -452 -100 -195 168 -37 104 194 -101 156 105 -65 36 265 39 -158 279 192 129 16
2796 16 -14 68 -112 102 52 -264 40 197 -149 -124 -74 118 -103 -103 326 -49 -138 117 156 -268 84 8 24 -298
2820 -298 169 -31 -376 -50 -102 -391 -23 82 4 -201 12 247 -11 1 156 -73 -145 297 3 128 167 538
$$ packed form
2654C2L15n96K39Rq4J11J92q1k07L29j37m2j52R5j42q8K44L5j35k0Q4rJ47k17
2678g8K29O1j89K8M0k5%j68K5R4M8j29LJ9O8j34j04J86j65K42k9j56j61L48J5
2703F8J50k30k17K28J19j04j17j90J25L51l07J6l5N5J7LM4l08M43J46j38l5j3
2726G1j19k24K91k16K44p4R2J12k48K05k61N8O2j73M0N9Q4OJ70r8l8J4K79l47
2750a1r2K32l0l35J75R0k36J53J04o2P1j72p4R6J91o6n5j54N20l64l5K42j13L7
2774A12k77K45m1m91L52r5L63k05J41R0k95K57n1j70J01K29k26j97M37q7o3j13
2796A6l0Q2j80K14n0l16L04J57l46K5N0J92k21%M29l75q9K55L9m24L52p6J6l22
2820b98M67k00l45L26n2k89L68J05p8k05K13K35k58J2J55k29p2M42k94J25L9L71
$$ plain form
2842 538 37 -350 234 104 -479 -175 -29 -393 -278 330 -35 -107 153 120 156 227 440 215 -9 311 385 -209
2864 -209 212 202 117 -467 -111 -259 -392 -54 264 -60 -341 214 -160 -158 91 303 35 -1 236 38 -109 541
2886 541 -45 -217 -109 132 -378 -414 160 225 -11 77 230 119 -190 191 274 -306 213 173 -168 -130 261 204
2908 204 -302 107 342 -395 -486 360 161 -372 31 207 -312 -170 320 -121 -107 165 140 -309 56 174 -162
2929 -162 -113 159 329 320 -8 269 -6 -484 105 302 -502 155 337 -306 -161 301 13 -369 154 342 32
2950 32 -348 113 257 -413 -143 278 -300 -181 301 28 -358 180 71 -487 -38 208 81 -210 245 217 -194
2971 -194 221 420 -10 -321 472 174 -28 91 165 -334 -105 227 -179 -534 38 338 -202 71 81 -48 -167
2992 -167 222 244 -285 146 371 39 -410 301 205 -236 -71 -131 -168 -95 245 12 -433 -57 407 -425 -228 286
$$ packed form
2842E38n01l87N84j30n83L04J46l64J15O08l65p2K60l3L6P1K13k25k24L20P4n94
2864b09M21j0q5n84L56j48j33L38L18l24k81N55l74KK49K12k68l6K37j98j47O50
2886E41n86j72J08K41n10l6N74O5k36Q8J53j11l09L81Q3n80N19m0l41L8L91n7
2908B04n06M09K35p37r1Q46j99n33M03J76n19J42M90m41J4K72k5m49L65J18l36
2929a62M9K72J70rl28K77k75m78N89J97q04O57J82o43J45M62k88l82N23J88l10
2950C2l80M61J44o70K70M21n78J19M82k73l86N38j09n58M49K46j27k91M55k8m11
2971a94M15J99m30l11P93k98k02J19P4m99K29L32m06l55N72L00n40K73J0j29j19
2992a67L89K2n29M31K25l32m49P11r6m41J65o0l7P3L40k33m45L76M64q32J97N14
$$ plain form
3014 286 238 -242 320 368 -211 134 268 188 -256 -39 -159 -248 -187 196 -148 -601 -5 131 -485 -121 575 52
3036 52 -289 430 65 -394 123 219 -173 10 376 -68 -312 -102 136 -165 -158 96 78 -325 112 337 -13 -18
3058 -18 416 150 32 313 287 -261 -103 35 77 -138 64 138 -254 149 141 12 -479 79 -170 -568 -111 111
3080 111 -227 -224 327 188 -129 191 168 -142 75 209 -274 -123 80 114 -52 -180 161 -180 -127 163 -167 -97
3102 -97 -141 375 -83 180 387 206 -18 -100 192 -171 -285 85 51 -374 2 -30 -52 30 70 68 -93 48 110 -169
3126 -169 -176 366 73 -79 115 221 -282 165 -26 -124 -220 -61 240 -176 -176 234 -102 -281 19 -22 -232 292
3148 292 229 -296 -27 407 52 -401 213 214 -89 -169 264 -306 -143 44 4 -412 66 153 25 -350 -41 -51
3170 -51 -334 107 188 280 27 51 97 -128 -110 -17 -213 -375 140 -71 101 98 84 -154 -264 204 9 -194 403
$$ packed form
3014B86m8m80N62M8n79L45J34q0m44K17j20q9O1L83l44m53N96J36o16L64O96n23
3036E2l41P19l65m59N17R6l92J83L66m44k44K10K38l01PK54j8m03M37K25l50n
3058a8M34k66j18K81k6n48J58J38M2k15K02P4l92M03qj29m91N58k49l98M57K22
3080A11l38LN51j39l17L20k3l10K17J34m83J51K03L4j66j28L41l41N3K90l30P0
3102i7m4N16m58K63K07j81k24q2K92l63j14L70l4m25L76l2k2Q2M0kj61J41O2k79
3126a69pN42k93j52J94J06n03M47j91r8r6J59L01m16%M10l36j79L00m1k10N24
3148B92o3n25K69M34l55m53O14Jl03q0M33n70J63J87m0m16M78Q7j28l75L09j0
3170e1k83M41Q1R2k53K4M6k25J8R3j96j62N15k11J72lj4k38j10M68j95k03N97
$$ plain form
3193 403 212 -177 -111 138 -8 194 190 -47 -196 -48 257 86 -102 -160 -20 -78 -156 116 -107 145 296 19
3215 19 -145 21 294 -26 -33 309 125 -101 -51 -186 -207 -208 77 -135 -66 -8 -33 98 129 199 -118 -108 297 77
3239 77 -111 146 233 -18 74 337 -201 -83 78 -50 -469 -118 -52 -44 -149 219 -113 144 -49 135 195 36
3261 36 112 122 -17 194 247 -110 77 -126 -163 -53 -120 -61 -181 -228 -271 -77 -61 252 101 -108 308 53 -17 214
3285 214 92 -113 55 17 285 -226 49 -55 -129 -33 -162 41 -163 -40 -191 -233 21 -129 -193 -58 -126 -142
3307 -142 109 167 -69 246 6 42 -255 -90 -115 -24 244 47 -120 -136 -108 -34 -13 -61 208 -33 -28 -39 326 -31
3331 -31 -242 -37 -20 -177 123 -60 -188 115 -97 57 -159 -184 -144 -328 34 -39 -4 111 21 76 185 -168 -8
3354 -8 200 190 -1 26 236 163 -80 3 -72 52 -37 -9 -1 -189 -102 -77 -165 -94 -108 -73 -280 -180 19 94 139 89 -12
$$ packed form
3193D03j91l89O6K49j46K02mk37j49J48L05j71j88n8J40n8p8K72k23K52J51k77
3215A9j64J66K73l20pL42j84k26N0j35k1jK85k12O9N8k5J31L1P0l17J0M05k20
3239G7j88K57Q7k51R2K63n38J18J61j28m19L51O6Qj05L68l32K57j93J84O0j59
3261C6P6J0j39K11N3l57J87k03l7J10o7N9j20m7m3J94J6L13j51k09M16k55p0K31
3285B14j22k05J68l8K68n11K75j04p4R6j29K03k04J23j51m2K54j50o4J35o8j6
3307a42K51N8k36L15k40L6k97J65k5R1K68j97j67j6K8P4K1m8K69k41Nj1L65l57
3331c1k11K05J7j57L00j83j28L03k12J54k16k5M0j84L62p3L5J15r0N5J09l53J60
3354hK08j0j91K7K10p3k43Q3p5J24q9K8Qj88Q7K5q8P1j4L5k07J00J99P5M5n0j01
$$ plain form
3381 -12 144 87 119 44 -135 -137 -193 93 11 259 139 -15 -196 41 79 32 265 43 -157 -140 237 -165 -273 12
3405 12 -21 -125 -436 2 -144 264 247 -155 -194 49 164 80 -64 398 -208 -69 -108 17 -186 -139 234 -90
3427 -90 35 68 88 -129 -186 93 -156 -146 131 -54 157 1 37 -12 145 92 163 -29 -252 121 40 -205 -72
3450 -72 -252 -119 -124 152 -192 -58 -7 7 -254 -75 146 -157 -100 46 99 -161 10 -44 85 -74 85 289 -91
3473 -91 33 61 -178 45 36 -69 -134 -51 -347 -292 48 255 67 -14 350 160 -69 258 94 -197 -4 132 -234
3496 -234 -251 -3 52 -86 -180 35 -175 118 48 47 95 180 423 78 -234 -24 160 -424 9 411 -11 -90 246
3519 246 118 100 17 172 -30 -141 518 -362 -228 408 158 -267 106 168 -117 29 252 254 -345 -83 232 308
3541 308 -221 -86 20 -320 -146 -55 -242 -281 253 -86 -98 73 360 -146 -245 148 12 147 -95 215 -70
$$ packed form
3381a2J56n7L2p5j79kn6K86q2K48j20j54j81K37L8m7K33k22k00J7L77m02j08K85
3405A2l3j04l11M38j46M08j7m02l9K43J15q4j44M62o06J39l9J25k03M7L73l24
3427i0J25L3K0k17n7K79k49J0K77j85K11j56L6m9J57n3P1j92k23L73q1k45J33
3450g2j80J33nK76l44J34N1J4k61J79K21l03N7J46N3k60J71n4J29j59J59K04l80
3473i1J24K8k39K23rj05o5Q3k96N5L40K07j88q1L64j90k29L27j64k91J93J36l66
3496b34j7K48N5j38r4K15k10K93p0jM8Q5K43l45l12K10J84n84M33M02m22p9L36
3519B46j28j8q3J55k02j11O59q80J34O36k50m25L73O2k85J46K23Kn99K62L15P6
3541C08n29J35J06l40J74R1j87l9N34l39j2J71K87n06r9L93j36J35k42L10k85
$$ plain form
3562 -70 -171 388 50 -314 241 -70 -70 -207 194 -17 -96 200 249 -30 -121 448 67 -129 82 29 -126 -316
3584 -316 -275 -259 -91 74 131 -293 -84 578 -56 -178 -46 63 -146 127 153 27 -22 225 266 -65 -13 234
3606 234 -71 -219 204 -84 -356 439 89 -104 57 144 -62 210 308 74 -33 351 264 -401 -236 15 -28
3627 -28 -207 95 182 -122 -35 156 -219 -153 11 304 -193 235 149 -130 -19 -30 -143 119 29 260 -228 -271 235
3650 235 105 -397 5 341 -83 189 219 -147 -229 -113 141 -229 -58 243 9 -43 177 357 -154 60 477
3671 477 -19 -232 61 28 -218 -97 134 -79 -338 398 -78 -492 -49 175 186 45 -131 -235 99 -50 182
3692 182 -150 103 343 -91 -34 -7 124 -233 -254 165 -144 49 336 -378 -285 -48 330 -39 -67 42 23 -81
3714 -81 -39 160 -47 -108 -151 -144 -281 224 -83 -96 -25 47 65 -310 213 151 -186 160 263 -314 23 260 113 -352
$$ packed form
3562g0j01N59l38l64N55l11%j37M01k11p9K96M9k79r1N69l81j96K11n3j55j90
3584c16M1J6J68J65N7m24K09O62o34j22J32J09k09K73K6j26m9K47M1l31N2K47
3606B34l05j48M23k88k72P95l50j93J61Q7k06K72R8k34j07L84q7o65J65K51m3
3627b8j79L02Q7l04Q7J91l75O6J64K93m97M28q6k79J11j1j13K62r0K31m88m3N06
3650B35j30n02M02L36m24K72L0l66q2J16K54l70J71L01k34n2K20J80n11K14M17
3671D77m96k13K93l3k46J21K31k13k59P36m76m14M43K24J1j41j76j04L34j49K32
3692A82l32K53K40m34N7K7J31l57k1M19l09J93K87p14R3K37L78l69k8J09j9j04
3714h1M2J99k07o1m3Pj37N05l07j3P1P2J8l75N23o2l37L46J03n77L37K37j47m65
$$ plain form
3738 -352 104 128 -104 -285 65 101 -142 -54 -33 254 156 -214 187 120 59 338 -28 -45 240 177 -98 48 228
3761 228 -147 -81 165 -6 -9 143 113 -76 117 -38 38 -140 -44 113 222 -90 316 -78 252 190 68 -9 -16
3784 -16 -160 106 -133 126 72 -214 75 133 -164 -109 109 88 78 167 90 -172 151 -6 -424 197 37 -25 93
3807 93 14 431 -41 -66 -233 -27 -270 156 -151 -103 95 362 82 22 120 47 70 212 -71 83 -14 -195 -138
3830 -138 -198 174 27 73 -207 -371 -34 -79 124 207 -303 -184 -95 97 71 360 75 87 -113 334 164 -198
3852 -198 199 72 -129 -136 88 -29 -149 30 -144 -89 102 55 167 -100 -58 301 -51 99 203 -172 31 -14
3874 -14 121 130 -115 -45 19 -253 -35 -80 -96 -30 98 -2 -90 2 -115 -185 146 310 81 99 134 -1 -23 -161 127
3899 127 203 23 -83 8 -198 -73 23 -132 -172 79 -202 -247 154 154 331 -102 -32 7 10 -229 -68 171 1 -124
$$ packed form
3738c52M56K4k32j81L50L6k43Q8K1K87r8l70M01o7o1K79l66j7K85o3k75J46J80
3761B28l75O6K46j71lJ52l0j89J93j55P6j78R6J57J09l12M06l94L30o2j22p7p
3784a6j44K66k39K59n4k86K89N8k97N5K18k1j0Q9p7k62L23j57m18O21j60o2J18
3807I3p9M17m72k5j67K06k43M26l07M8J98K67k80o0R8p3K3J42k83J54r7j81N7
3830a38o0L72j47M6k80j64L37m5K03Q3n10J19Q9J92k6K89k85J2k00M47j70l62
3852a98L97j27k01pK24j17j20J79j74N5J91m7J12k67M2L59l52J50J04l75K03m5
3874a4J35Rk45P0O4k72K18m5j6O6J28j00q8R2j17p0L31J64k29J8L5j35k2j38K88
3899A27P6j80j06R1k06J25R6j55m0K51k81m5M01%J77m33P0L9Lk39J61K39j70j25
$$ plain form
3923 -124 109 89 68 -236 99 -162 41 119 -131 -104 -309 64 -29 -174 28 19 -76 176 147 116 104 -279 158 -132
3947 -132 -25 -143 -194 263 -15 98 -175 -6 -49 102 240 132 -158 96 -91 12 -139 -217 -37 304 -112
3968 -112 -99 186 -180 128 14 -276 239 167 -121 104 178 28 18 143 45 105 -173 -10 60 -40 21 -39 70
3991 70 -23 111 -173 46 346 -24 -140 -71 -58 151 -518 -58 -52 -49 -99 -19 -13 -287 -17 -197 -424 9 171 -226
4015 -226 -24 132 -163 325 53 110 347 99 199 -3 11 339 -143 -94 -56 -18 -145 50 25 43 -181 -62
4037 -62 342 -15 -70 191 50 -116 69 -51 66 -168 -145 147 -199 -220 -36 -305 177 -21 -93 -69 -121 147
4059 147 15 -215 -40 143 -22 -48 25 20 -311 -100 189 130 101 104 69 -20 177 -32 -31 107 -130 -81 -177 135 -291
4084 -291 75 252 220 -251 157 198 -338 -5 41 115 162 92 184 154 5 97 92 -63 37 157 -245 -112 -165 90
$$ packed form
3923a24K33k0k1l04L35k61K03P8k50K7k05L73r3j45K02rr5K52k9l1j2l83M37k90
3947a32J07j18n1M57k78J13k73J69m3J51J38j08k90K54j87J03j51p8J80L41m16
3968a12J3K85l66L08j14k90N15p2k88K25P4j50j0J25r8O0k78J63P0j00O1o0J09
3991G0r3J34k84K19L00l70j16O9J3K09o69M60OLn0Q0Ok74K70j80k27M33J62l97
4015b26K02J56k95M88k72N7K37k48J00k02J4L28m82M9L8L8j27J95k5J8k24J19
4037f2M04l57n5K61j41j66J85j20J17k34K3K92l46k1J84k69M82j98p2K4n2K68
4059A47j32k30J75J83j65k6P3nl31K11K89n9k9Ll5q9J97k09JJ38k37M9r6L12m26
4084b91L66J77l2m71M08M1n36L33M6P4M7p0R2l0j49R2nj55J00J20m02J33n3K55
$$ plain form
4108 90 -86 9 369 -102 194 206 128 -117 158 27 -322 -34 223 -152 63 162 222 -403 259 -87 -66 -40 29
4131 29 -36 371 260 41 134 138 146 -5 243 87 -9 123 -29 252 79 -155 278 -109 -255 72 198 -138 -107
4154 -107 144 131 -116 -62 353 -131 71 -66 -205 -129 24 -18 -104 -177 -22 41 5 337 -76 -41 -103 40 29 -202
4178 -202 74 181 -325 -68 206 48 -166 125 -54 -255 8 -168 -89 -512 -56 199 -83 21 -46 90 10
4199 10 211 311 -44 217 204 -24 210 350 272 -25 251 52 -145 -12 126 -44 -110 198 -112 119 204 56
4221 56 -160 -87 -216 39 -55 100 76 -163 42 159 51 169 12 -144 -325 -26 146 -352 -245 40 -265
4242 -265 -263 164 75 -163 -202 -140 119 -248 -185 34 -148 -123 37 -10 -123 -149 187 -27 214 212 102 -59 50 87
4266 87 -70 -88 -196 24 -157 107 70 131 7 84 -225 -262 53 -164 -322 -145 98 -232 -257 73 405 19
$$ packed form
4108I0j76R5L60m71K96J2p8k45K75j31l49K88K57l75K15R9O0o25O62l46K1K6O9
4131B9o5M07j11k19R3MQj51K48j56r6J32j52K81j73k34M33l87j46L27J26l36L1
4154a07K51j3k47N4M15m84K02j37j39P6J53m2q6p3J55O3l6L32m13L5o2J43j1k31
4178b02K76J07n06K57K74j58k14K91j79k01K63j76P9m23M56K55k82J04o7J36q0
4199A0K01J00l55K61j3k28K34J40p8k97K76j99j97J33J38j70o6L08l10K31Q5j48
4221E6k16P3j29K55r4J55k4k39K05J17j08J18j57j56j81K99J72m98J07K85l05
4242b65KM27q9k38l9O2K59l67O3K19j82K5J60m7j13k6L36k14K41kj10j61J09L7
4266H7j57j8j08K20j81K64l7O1j24P7l09l7L15k17j58J77K43l30k5L30L32l86
$$ plain form
4288 19 -122 330 -319 -214 -39 55 -87 -26 -8 99 72 127 -5 -132 -121 452 33 -92 -10 -48 -291 -88 -364
4311 -364 -239 28 140 -128 -80 11 -13 -350 -229 -162 21 29 202 49 36 -189 185 -204 41 -63 -92 -276 130
4334 130 113 179 -36 9 -138 300 -48 139 -44 -126 293 -129 -35 273 -14 -195 93 -272 223 -167 5 -335
4356 -335 -225 -132 -60 -111 221 -130 -93 168 93 369 12 -124 -71 158 -267 -16 8 -149 -205 161 137 17 63
4379 63 -99 -97 32 -62 -193 45 -92 9 -65 64 -84 -85 -66 139 113 12 -173 15 241 38 199 -21 78
4402 78 -129 -81 -38 299 113 45 -285 -26 69 92 283 -29 188 -15 -42 -38 -355 97 105 -4 -62 0 245 -73
4426 -73 -91 -82 90 427 33 25 166 -420 -12 221 -303 13 -59 0 -114 105 190 -61 -190 -80 -327 112 44
4449 44 -106 52 -97 -178 -73 133 -117 -189 186 95 -105 140 120 27 333 -206 61 152 -221 191 -312 278
$$ packed form
4288A9j41M52o49J05J75R4j42O1J8J07k7N5j32j27J1N73m19j25Q2l8k43K03k76
4311c64J25K67J12k68M8R1k4l37J21O7J83QJ73j53j3k25L74l89K45j04k9j84M06
4334A30j7O6k15M5j47M38l48J87j83q2M19m22R4L08k87j81K88l65M95l90J72l40
4356c35J10R3P2n1L32l51L7K61p5K76l57j36N3K29m25K51K4j57n6L66k4j20M6
4379F3j62KJ29r4j31K38j37J01p4J29j48jJ9K05k6j01j85J88K26k03J61k20R9
4402G8k07M8M3L37j86o8l30K59R5K3J91l12K17k03k7Ml17M52Qj09n8O2K45l18
4426g3j8RJ72L37l94qJ41n86M08K33n24L16p2N9j14K19Q5k51j29J10k47M39o8
4449D4j50J58j49q1J05K06k50p2L75r1k00K45k0r3L06n39K67R1l73M12n03N90
$$ plain form
4471 278 -250 122 153 266 15 3 -117 79 -256 113 -190 -37 -156 62 65 -85 131 -56 -164 -153 39 -239
4493 -239 -119 -50 -219 185 374 -184 130 -240 -96 -90 -195 -161 -179 278 -205 37 52 -250 189 123 -106 181
4515 181 -123 47 274 153 -181 -101 88 134 92 -24 251 -238 -343 41 -212 -12 -67 -153 103 -58 121 -21
4537 -21 -167 265 -81 28 138 -242 38 -69 54 -88 -120 -87 -259 51 -106 -33 -92 27 -104 -97 -101 -156 -148 -213
4561 -213 149 56 54 -133 188 -33 -102 -298 28 -63 218 -158 -51 -2 -123 37 32 210 101 -316 -114 9 164
4584 164 84 -50 -224 -68 -104 120 -65 -107 196 -161 243 -199 -318 -58 -33 -37 -17 248 -154 -290 146 -11
4606 -11 -136 160 220 44 226 42 -194 -234 -133 -105 -118 -34 142 -33 -303 -83 -191 45 -178 -138 20 -165
4628 -165 94 32 -22 76 158 -65 -82 320 -5 -142 36 -1 -12 -145 -76 -92 -138 -95 224 75 -98 74 -17 -90
$$ packed form
4471B78n28L72L1J13k51j2j20J96l35L69l03J53j19K18Lj50K16j87j08J1J92k78
4493b39J20O9j69M04J89n58L14l70J44Oj05L4j8M57m83K42J5l02M39o6k29K87
4515A81l04J70K27j21l34Q0J89M6m2j16K75m89j05L84k53K00n5q6K56j61J79j42
4537b1j46M32l46J09J10l80K80j07J23j42l2L3j72L10j57P3n9J19j31Pmn5Qo5
4561b13L62r3kj87L21k21o9j96L26r1K81l76J07M9j21J60nJ78j09m17K02J23J55
4584A64q0j34j74J56l6K24j85m2L03l57M04m42j19K60K5mK0K65m02j36M36j57
4606a1j25K96O0j76J82j84k36m0J01K8j3Q4J76j75k70K20j08K36k23M0J58j85
4628a65K59o2n4R8Q2k23j7M02l25j37J78l7j1j33O9j6m6M3L19j49j73J72r1p3
$$ plain form
4652 -90 -80 182 -113 -153 21 19 135 -58 170 -55 -99 295 -146 -63 -155 210 -67 21 -26 79 -112 355 90
4675 90 111 102 83 -40 -31 -16 -20 280 -122 -58 -34 62 -6 -101 111 -67 -50 -103 72 222 -78 18 45 59 -17 -171 209
4702 209 -97 -11 -76 -300 77 180 56 41 78 273 172 -195 17 -77 279 17 -43 -20 105 -216 110 -38
4724 -38 110 -29 232 -57 261 -240 -294 -178 208 82 -132 122 -180 -355 -101 -117 -158 74 157 -144 -83 -67
4746 -67 -157 -132 103 -155 -22 -126 -84 265 -470 149 328 -97 -53 292 160 -114 -70 163 -69 35 -61 -21 257
4769 257 -201 -60 -233 -225 268 180 -264 145 -6 106 78 51 -210 -259 -21 158 293 227 35 -215 80 -23
4791 -23 152 -117 113 206 -54 153 110 266 -47 -126 -40 65 106 -93 -168 93 -187 -11 -12 15 217 209 36 -58
4815 -58 -221 80 -52 -112 -105 -38 -84 67 34 160 249 4 -47 -20 87 -209 25 194 -14 -192 66 -94 141
$$ packed form
4652i0J0K62k95m0J74kJ16j93K28k25m4L94m41Q3r2L65k77Q8m7J05j91M67k65
4675I0K1rj9j23RJ5mL00m02O4K4R6o8r5K12j78J7n3J75J50l00R6K7J4p6j54L80
4702B09l06Q6o5k24L77J03j24j5L7J95j01l67K12r4L56k62o0K3J25l21L26j48
4724c8J48j39K61k89L18n01n4J16L86j26k14K54l02j75K54j6m1K32Q3l01O1J6
4746f7r0K5K35k58J33j04M2L49p35O19J79m25M4L45j32k74M4K33k32J04r6M0K78
4769B57m58J41j73QM93q8m44M09j51J12k8k7k61m9K38J79J35o6j92k50K95j03
4791b3J75k69K30R3k60K07m3J56l13p9Q6J05M1j99p5K61k80J76jK7K02qj73r4
4815e8j63L01j32o0PO7m6J51l3J26Q9k45n1K7J07k96K34J69k08j78K58j60K35
$$ plain form
4838 141 -124 -61 -273 -68 39 -372 -238 -144 138 -401 -76 -51 330 -209 107 -121 115 -4 37 15 -161 97
4860 97 -71 -202 -100 -8 -69 -109 -252 -55 55 5 192 195 53 -32 -12 -141 141 43 -36 192 -48 -36 -162 95
4884 95 105 18 -110 32 -256 -115 263 -99 51 106 -45 -55 68 13 56 -300 6 124 375 -100 -27 -23 -86 -63
4908 -63 -217 -392 12 36 60 -148 -38 99 -229 -380 195 32 -191 87 225 -214 -27 -152 14 -39 -40 -63
4930 -63 -200 -298 153 139 147 -300 391 -40 210 -15 -203 208 48 -114 -97 122 -33 -204 -82 -29 -44 99 30
4953 30 134 -115 -117 61 187 101 -72 64 -79 -317 -143 -58 145 -47 114 93 48 100 85 -93 -197 -14 49
4976 49 -101 -85 -252 -243 33 352 -125 89 -100 87 130 301 -122 -41 -158 -297 98 100 -116 -27 45 184 96 72
5000 72 259 158 7 -125 257 23 80 268 -72 124 58 -6 -113 -34 241 98 -16 -95 388 16 91 57 -304
$$ packed form
4838A41k65O3k12K05J07m11J34R4K82n39L25K5L81n39L16k28K36j19M1k2j76K58
4860I7j68j31J02R2o1m0j43J97J10n0J87Lj42q5K0j29K82r8p9K28k40J2j26K57
4884I5J0q7j28J42k88J41L78l62J50N5j51j0J23n5M3l56L06J18K51m75P3Mo3K3
4908f3j54j75M04K4K4k08J10J37l28j51N75j63k23K78J38m39J87j25J66n3jk3
4930f3j37r8M51j4Qm47O91m31K50k25j88M11j60j62J7K19j55j71J22N3j5J43o9
4953C0J04k49kJ78J26q6j73J36j43k38J74Q5K03j92J61k1m5N2j5j78j04J83O3
4976D9j50J6j67RK76L19m77K14j89J87M3J71m23Q1j17j39L95Kk16Q9P2J39q8k4
5000G2J87j01j51j32L82k34N7J88l40J96o6o4j07P9K75j43j14p9M83l72P5l4l61
$$ plain form
5023 -304 99 146 -125 -109 31 -60 254 -66 -264 -203 45 -5 195 -243 -114 116 -3 102 -4 134 55 -161
5045 -161 -118 -38 6 -265 36 47 197 -29 110 -67 255 -116 -15 -133 24 23 -120 -320 30 -83 -120 167
5067 167 -165 33 -1 2 159 50 113 -97 -172 -156 153 129 -48 184 -23 143 -24 15 -108 61 115 171 -78
5090 -78 -131 -32 54 96 195 39 111 -92 -164 -214 111 56 278 -93 -206 -195 -14 364 56 83 248 -85 -250 -60
5114 -60 -58 164 -47 -32 -168 -262 102 -253 243 -56 169 39 -187 30 69 -75 109 179 -90 115 -170 -31
5136 -31 -8 70 -155 56 -67 -49 -35 -56 -350 94 112 -44 -59 39 -54 -122 55 140 -273 55 -216 -15 140 -36
5160 -36 254 110 37 206 -61 84 133 -122 -75 -96 -207 147 274 177 -32 -78 -217 -135 81 -149 -189 -176 -51
5183 -51 127 106 146 60 11 -80 46 -67 -22 204 25 79 -155 5 185 -92 158 112 169 115 -52 -57 -152 -78 -37
$$ packed form
5023c04M03M7k71J6J40r1L14l20j98O1K48n0K00m38J29K30j19J05j06J38p9k16
5045a61M3Q0M4k71L01J1J50k26J39j77L22l71J01j18J57jj43k00L50j13l7K87
5067A67l32J98l4LJ57j09O3k10p5J6L09k4j77K32k07J66j67L9j23J69N4N6k49
5090g8n3R9Q6M2R9j56P2k03p2n0L25n5K22l71j13J1J81L78l08K7J65l33j65J90
5114f0KK22k11J5j36r4L64l55M96k99K25j30k26K17L9j44J84P0k69K05k85J39
5136c1K3P8k25K11j23J8J4k1k94M44J8j56j5R8r3o8J77Q5m13L28k71K01J55j76
5160c6K90j44p3J69k67J45M9k55M7k1j11L54J27r7k09m6j39Q2K16k30m0J3J25
5183e1J78k1M0q6m9r1J26j13M5K26j79N4k34J60J80k77K50m6N7n4j67nr5P4M1
$$ plain form
5208 -37 -222 -3 64 44 65 240 -3 83 32 17 -97 -16 -51 229 88 -27 125 5 -143 2 135 -30 28
5231 28 52 19 9 167 -101 -85 -222 353 -127 -298 -84 70 -139 131 -80 -137 -90 -47 -251 -199 109 187 75
5254 75 184 9 -280 318 49 -121 -121 128 -163 53 157 194 -147 -27 -245 -118 104 106 22 107 -60 19 -219
5277 -219 -19 117 308 -112 35 -147 -86 39 -233 -164 -91 -26 62 -195 125 -91 69 31 168 -254 218 126
5299 126 55 87 -265 -341 -13 -59 -151 -181 -99 213 135 8 47 -65 -76 -196 69 -164 120 160 -105 -224 50 -38
5323 -38 -157 144 -30 35 -200 108 126 51 87 80 -136 244 74 17 185 -49 203 287 -70 16 130 -82 1 171
5347 171 -104 157 120 -51 227 -13 190 4 90 -291 -125 101 -292 203 -114 -182 -209 154 -128 82 98 61
5369 61 85 -107 -108 -45 -258 -61 24 -107 3 22 -238 -26 67 -176 128 3 -246 121 -249 -66 230 -397 -65
$$ packed form
5208c7j85K19O7k0K1J75k43Q6n1j5j14Q1l5K80j41j15J52j20j48J45J33j65N8
5231B8K4l3j0J58k68J6j37N75m80j71K14J54k09K70k11n7M7M3k04N2L08P8j12
5254G5J09j75k89N98k69j70%K49k91K16J04L7l41J20k18J27K22Kq4Q5j67P9k38
5277b19K00J36J91m20J47j82O1J25k72O9P3O5Q8k57L20k16J60l8J37m22M72r2
5299A26p1L2l52p6L28m6r2l0Q2L12p8j27L9j12j1j20K65k33K84M0k65j19K74q8
5323c8j19L01j74O5k35L08J8p5L6pk16L80j70n7J68k34K52Q4l57Q6J14k12Q3J70
5347A71k75K61l7j71K78k40K03j86Q6l81J66K26l93M95l17o8k7L63k82K10J6l7
5369F1K4j92jO3k13J97Q5j31J10J9k60K12R3k43L04j25k49L67l70J83K96o27L32
$$ plain form
5392 -65 7 162 -67 27 304 -55 38 289 -26 -84 -229 -98 98 152 127 -63 189 149 85 5 36 49 -211 -295
5416 -295 7 159 64 37 -153 17 288 -64 97 -97 298 -38 90 -73 -95 -6 -29 -35 138 -212 -231 -6 113
5439 113 157 -124 -76 -27 -337 -168 206 48 135 -180 -103 -97 193 19 -149 -10 88 264 -36 -101 -6 7 266 120
5463 120 182 83 52 -416 -100 157 -40 -223 -105 -179 -25 -85 104 -120 -110 -32 142 80 93 47 128 428 -50 -114
5487 -114 -7 6 -285 -92 4 -51 102 186 74 148 -130 88 -39 -208 -151 -105 -28 -220 -17 32 -73 -248 -361
5510 -361 89 -78 -45 0 101 147 23 24 -132 -104 63 -38 14 51 39 -197 35 -149 -231 22 -91 -8 -125 39
5534 39 57 180 -47 246 171 -143 -231 -26 -31 104 151 151 17 37 6 -163 4 95 183 -34 90 -131 170 -217
5558 -217 -15 9 -105 30 195 65 52 -111 -79 215 -111 37 -23 -256 -105 -97 -172 -151 -114 -155 -40 168 -42
$$ packed form
5392f5P2J55k29R4K77l59R3K51l15n8j45J31J96N4k5j90K52m0o4q0L1J3k60q4
5416b95L02J52r5k7j90J70K71l52J61j94L95l36J28j63k2Q9k3oJ73l50j9K25J19
5439A13M4k81M8M9l10J69L74j58Q7l15P7OK90j74j68J39R8J76l00o5R5J3K59j46
5463A20O2r9l1m68L16K57j97j83J18p4J54o0J89k24J0P8J74o2J3m6Q1L00m78o4
5487a14J07J3k91J93R6n5J53Q4j12P4k78K18j27j69N7M6P7j92K03M9j05j75j13
5510c61M50j67L3M5J01M6j24Jj56K8J67j01N2L7j2k36K32j84q2K53j13Q3j17J64
5534C9J8J23k27K93p5l14q8K05nJ35M7%j34K0l1j69J67R1Q8k17J24k21L01l87
5558b17K02K4j14J35J65j30j3j63L2K94l26J48o0k33J51Qp5K1L7m1J15K08k10
$$ plain form
5581 -42 228 -252 60 -114 15 269 -132 -201 -8 118 78 -167 96 -96 -189 191 44 173 46 38 13 221
5603 221 -189 67 -64 282 -220 -195 40 -236 -140 -191 -9 -41 203 -261 -190 102 131 79 124 -16 158 -12 -28
5626 -28 -157 -167 -160 165 -55 86 161 -187 -105 103 -136 -116 58 -133 -51 -11 -64 -14 -23 38 56 -237 318 202 -70
5651 -70 7 -196 -80 -121 282 68 181 98 -86 -88 -88 154 -117 69 58 -174 -80 -45 122 242 91 317 -313 -56
5675 -56 75 -19 -226 -59 168 54 119 224 -19 -234 191 39 63 -153 134 58 -267 -26 -295 64 -63 104
5697 104 -147 -187 -82 115 141 89 -103 -131 23 -150 -63 69 -66 26 189 -153 44 197 260 199 -212 71 -100
5720 -100 1 -95 -42 134 -126 19 -177 -24 49 96 66 -78 -20 33 3 22 269 -44 -137 -37 9 63 63 -49 289
5745 289 137 -125 -337 -17 -6 206 129 -29 62 -108 28 31 -1 -19 -80 47 -59 -51 277 -78 50 84 99 210
$$ packed form
5581d2K70m80L12j74J29K54m01o9J93J26m0k45K63j92r3L80j47J29j27qk5K08
5603B21m10K56j31L46n02K5K35k76R6n1J82l2K44m64P1K92K9n2M5j40J74j70j6
5626b8j29j0PL25k20J41P5l48Q2K08k39K0J74j91Q2M0n3N0rO1J8k93N55j16k72
5651g0P7k03J16m1M03k14J13q3j84k%K42k71J86j1k32R4L5J67J20j51K26o30K57
5675e6J31r4k07J67K27j14O5J05k43k15M25j52K4k16K87p6l25K41k69L59j27J67
5697A04k51m0J05J97K6n2j92k8J54j73Q7J32j35R2J63l42J97J53O3o1m11K83j71
5720a00J01r6N3J76k60J45j96J53P3M7l0j44N8N3l0J9K47l13r3J00M6N4%j12L38
5745B89j52k62k12L20J1K12p7j58R1j70J36Ll2j8o1J27j06QL28l55J28L4J5J11
$$ plain form
5769 210 200 -231 -123 -89 336 112 106 -45 -202 -115 -86 42 -92 -151 -131 -148 -27 22 -86 159 143 64 -86 43
5793 43 386 -101 -88 333 -70 94 207 42 -154 -244 -26 112 -54 101 61 16 -207 -57 49 -153 -110 106
5815 106 36 -218 3 -49 -95 -49 -104 82 96 -325 251 -159 -188 57 10 -42 146 90 93 10 -268 -89 -178 31 77
5840 77 -321 -290 -100 126 -250 -18 -188 -32 -53 13 -1 9 59 -249 55 34 -43 -93 -179 -132 91 -132 121 -81
5864 -81 -82 -43 38 -25 -132 49 123 -163 -126 49 -66 6 177 164 -11 116 17 -168 123 -31 27 -342 162 -127
5888 -127 34 144 72 22 82 -31 18 -48 -64 -111 -120 -226 117 -83 -5 184 -2 -2 -36 61 -55 150 139 16 -63
5913 -63 322 -90 205 -73 206 89 178 106 -90 -41 105 -84 13 -35 -252 93 -300 -185 -87 255 62 -40
5935 -40 47 -101 211 -257 -15 11 -141 112 202 -63 -146 -3 -19 114 -93 -78 261 79 -234 -119 -92 18 182
$$ packed form
5769B10j0m31J08L4M25k24oj51j57Q7K9J28j34n9K0j7J21M9j08K45j6p9j50J29
5793D3L43m87J3M21m03J64J13j65j96r0K18J38j66J55m0m5k23J50J06k02M3K16
5815A06p0k54K21n2m6M6n5J86J4m21N76m10k9K45m7n2J88n6Lq3k78J79q9K09M6
5840G7l98L1J90K26l76K32j70J56k1O6j4J0N0l08L04k1p7n0q6M7K23k23K53k02
5864h1jL9Q1o3j07J81P4k86L7J75j15P2J71j3j75J27r9j85K91j54N8l69N04k89
5888a27J61J10p2n0O0j13M9o6j6m7rj06L43k00P8J89j86%l4R7j16K05j1j23p9
5913f3L85m12K95k78K79j17Q9p2j96M9J46j89R7m8k17L45l93J15R8L42j93j02
5935d0Q7j48L12m68K42K6j52K53R0k65q3J43j6J33k07J5L39j82l13J15K7J10J64
$$ plain form
5958 182 72 -66 43 20 -107 -250 -128 9 -89 -161 67 -81 203 75 181 -36 -203 -119 54 57 186 39
5980 39 9 42 -71 131 -110 34 105 14 62 -272 -45 78 65 -204 -32 -62 -75 -212 -57 -117 154 146 69 -125
$$ packed form
5958A82j10j38J09k3j27j43J22J37r8p2K28j48K84j28J06k17j67Q4J73LJ29j47
5980C9l0L3j13K02k41J44P1r1M8l34K27J23j3k69J72l0j3j37J55o0K71qp7j94
$$ [...]
8191g7
##END NTUPLES=NMR FID
##END=
