##TITLE=1H_Pr 6-MeOBzt
 CDCl3+DMSO,8 sc, 
 11.03.2021
##JCAMPDX= 6.0         $$ Bruker NMR JCAMP-DX V2.0
##DATA TYPE= NMR FID
##DATA CLASS= NTUPLES
##ORIGIN= UXNMR, Bruker Analytische Messtechnik GmbH
##OWNER= root
$$ XWIN-NMR		Version 3.5
$$ Thu Mar 11 13:36:06 2021 Russian Standard Time (UT+4h)  she@DPX200
##.OBSERVE FREQUENCY= 200.131506
##.OBSERVE NUCLEUS= ^1H
##.DELAY= (6, 6)
##.ACQUISITION MODE= SIMULTANEOUS
##.ACQUISITION SCHEME= undefined
##.AVERAGES= 8
##.DIGITISER RES= 18
##SPECTROMETER/DATA SYSTEM= spect
##.PULSE SEQUENCE= zg30
##.SOLVENT NAME= CDCl3
##.SHIFT REFERENCE= (INTERNAL, CDCl3, 0, 15.7039)
##AUDIT TRAIL= $$ (NUMBER, WHEN, WHO, WHERE, WHAT)
$$ ##TITLE= Audit trail, XWIN-NMR		Version 3.5
$$ ##JCAMPDX= 5.01
$$ ##ORIGIN= Bruker BioSpin GmbH
$$ ##OWNER= she
$$ F:/spectra/data/she/nmr/H-F/1/audita.txt
$$ ##AUDIT TRAIL=  $$ (NUMBER, WHEN, WHO, WHERE, WHAT)
(   1,<2021-03-11 13:35:05.29 +0400>,<she>,<DPX200>,
      <created by zg, POWCHK disabled, PULCHK disabled
       configuration hash MD5:
       00 E9 B6 7A A2 85 ED C7 34 08 36 98 17 FE 4E 26
       data hash MD5: 16K
       C2 98 14 62 FB FD C5 08 57 62 D1 22 41 33 7D BA>)
$$ ##END=
$$ 
$$ hash MD5
$$ 5D C2 39 26 E5 B8 25 43 99 4D 1A 6D 9A 91 AC 21
##$RELAX= 
##$RELAX= 
##$RELAX= 
##$RELAX= 
##$RELAX= 
##$RELAX= 
$$ Bruker specific parameters
$$ --------------------------
##$DU= <F:/spectra>
##$EXPNO= 1
##$NAME= <H-F>
##$PROCNO= 1
##$TYPE= <nmr>
##$USER= <she>
##$AMP= (0..31)
100 100 100 100 100 100 100 100 100 100 100 100 100 100 100 100 100 100 
100 100 100 100 100 100 100 100 100 100 100 100 100 100 
##$AQSEQ= 0
##$AQ_mod= 1
##$AUNM= <au_zg>
##$AUTOPOS= <>
##$BF1= 200.13
##$BF2= 200.13
##$BF3= 200.13
##$BF4= 200.13
##$BF5= 200.13
##$BF6= 200.13
##$BF7= 200.13
##$BF8= 200.13
##$BYTORDA= 1
##$CFDGTYP= 0
##$CFRGTYP= 5
##$CHEMSTR= <none>
##$CNST= (0..31)
1 1 145 1 1 1 1 1 1 1 1 1 1 1 1 1 1 1 1 1 1 1 1 1 1 1 1 1 1 1 1 1 
##$CPDPRG= <>
##$CPDPRG1= <>
##$CPDPRG2= <>
##$CPDPRG3= <>
##$CPDPRG4= <mlev>
##$CPDPRG5= <mlev>
##$CPDPRG6= <mlev>
##$CPDPRG7= <mlev>
##$CPDPRG8= <mlev>
##$CPDPRGB= <>
##$CPDPRGT= <>
##$D= (0..31)
0 1.2 0 0 0 0 0 0 0 0.06 0 0.03 0 0 0 0 0.0002 0 0 0 0 0 0 0 0 0 0 0 0 
0 0 0 
##$DATE= 1615455304
##$DBL= (0..7)
120 120 120 120 120 120 120 120 
##$DBP= (0..7)
150 150 150 150 150 150 150 150 
##$DBP07= 0
##$DBPNAM0= <>
##$DBPNAM1= <>
##$DBPNAM2= <>
##$DBPNAM3= <>
##$DBPNAM4= <>
##$DBPNAM5= <>
##$DBPNAM6= <>
##$DBPNAM7= <>
##$DBPOAL= (0..7)
0.5 0.5 0.5 0.5 0.5 0.5 0.5 0.5 
##$DBPOFFS= (0..7)
0 0 0 0 0 0 0 0 
##$DE= 6
##$DECBNUC= <off>
##$DECIM= 32
##$DECNUC= <off>
##$DECSTAT= 4
##$DIGMOD= 1
##$DIGTYP= 9
##$DL= (0..7)
0 120 120 120 120 120 120 120 
##$DP= (0..7)
150 150 150 150 150 150 150 150 
##$DP07= 0
##$DPNAME0= <>
##$DPNAME1= <>
##$DPNAME2= <>
##$DPNAME3= <>
##$DPNAME4= <>
##$DPNAME5= <>
##$DPNAME6= <>
##$DPNAME7= <>
##$DPOAL= (0..7)
0.5 0.5 0.5 0.5 0.5 0.5 0.5 0.5 
##$DPOFFS= (0..7)
0 0 0 0 0 0 0 0 
##$DQDMODE= 0
##$DR= 18
##$DS= 0
##$DSLIST= <SSSSSSSSSSSSSSS>
$$ [...]
##$SUBNAM2= <"">
##$SUBNAM3= <"">
##$SUBNAM4= <"">
##$SUBNAM5= <"">
##$SUBNAM6= <"">
##$SUBNAM7= <"">
##$SUBNAM8= <"">
##$SUBNAM9= <"">
##$SW= 16.9725357007746
##$SWIBOX= (0..15)
0 0 2 0 0 0 0 0 0 0 0 0 0 0 0 0 
##$SW_h= 3396.73913043478
##$TD= 16384
##$TD0= 1
##$TE= 0
##$TE2= 300
##$TE3= 300
##$TEG= 300
##$TL= (0..7)
0 120 120 120 120 120 120 120 
##$TP= (0..7)
150 150 150 150 150 150 150 150 
##$TP07= 0
##$TPNAME0= <>
##$TPNAME1= <>
##$TPNAME2= <>
##$TPNAME3= <>
##$TPNAME4= <>
##$TPNAME5= <>
##$TPNAME6= <>
##$TPNAME7= <>
##$TPOAL= (0..7)
0.5 0.5 0.5 0.5 0.5 0.5 0.5 0.5 
##$TPOFFS= (0..7)
0 0 0 0 0 0 0 0 
##$TUNHIN= 0
##$TUNHOUT= 0
##$TUNXOUT= 0
##$USERA1= <user>
##$USERA2= <user>
##$USERA3= <user>
##$USERA4= <user>
##$USERA5= <user>
##$V9= 5
##$VALIST= <valist>
##$VCLIST= <CCCCCCCCCCCCCCC>
##$VD= 0
##$VDLIST= <DDDDDDDDDDDDDDD>
##$VPLIST= <PPPPPPPPPPPPPPP>
##$VTLIST= <TTTTTTTTTTTTTTT>
##$WBST= 1024
##$WBSW= 4
##$XGAIN= (0..3)
0 0 0 0 
##$XL= 0
##$YL= 0
##$YMAX_a= 187661
##$YMIN_a= -126072
##$ZGOPTNS= <>
##$ZL1= 120
##$ZL2= 120
##$ZL3= 120
##$ZL4= 120
##$ABSF1= 10
##$ABSF2= 0
##$ABSG= 5
##$ABSL= 3
##$ALPHA= 0
##$AQORDER= 0
##$ASSFAC= 0
##$ASSFACI= 0
##$ASSFACX= 0
##$ASSWID= 0
##$AUNMP= <proc_1d>
##$AZFE= 0.1
##$AZFW= 0.1
##$BCFW= 1
##$BC_mod= 2
##$BYTORDP= 1
##$COROFFS= 0
##$CY= 11.3945322036743
##$DATMOD= 1
##$DC= 2
##$DFILT= <>
##$DTYPP= 0
##$F1P= 15.9154993809931
##$F2P= -4.1035820241983
##$FCOR= 0.5
##$FTSIZE= 0
##$FT_mod= 4
##$GAMMA= 1
##$GB= 0.15
##$INTBC= 1
##$INTSCL= 1
##$ISEN= 128
##$LB= 0.24
##$LEV0= 0
##$LPBIN= 0
##$MAXI= 10000
##$MC2= 0
##$MEAN= 0
##$ME_mod= 0
##$MI= 1.114404
##$NCOEF= 0
##$NC_proc= 0
##$NLEV= 6
##$NOISF1= 3.799351
##$NOISF2= 2.8
##$NSP= 1
##$NTH_PI= 0
##$NZP= 0
##$OFFSET= 15.70392
##$PC= 1
##$PHC0= -11122.22
##$PHC1= 15.00094
##$PH_mod= 1
##$PKNL= yes
##$PPARMOD= 0
##$PSCAL= 0
##$PSIGN= 0
##$REVERSE= no
##$SF= 200.130013532006
##$SI= 16384
##$SIGF1= 3
##$SIGF2= 2
##$SINO= 400
##$SIOLD= 16384
##$SREGLST= <1H.CDCl3>
##$SSB= 0
##$STSI= 0
##$STSR= 0
##$SW_p= 3612.71676300578
##$SYMM= 0
##$S_DEV= 0
##$TDeff= 0
##$TDoff= 0
##$TI= <>
##$TILT= no
##$TM1= 0
##$TM2= 0
##$TOPLEV= 0
##$USERP1= <user>
##$USERP2= <user>
##$USERP3= <user>
##$USERP4= <user>
##$USERP5= <user>
##$WDW= 1
##$XDIM= 8192
##$YMAX_p= 0
##$YMIN_p= 0
$$ End of Bruker specific parameters
$$ ---------------------------------
##NTUPLES= NMR FID
##VAR_NAME=  TIME,          FID/REAL,        FID/IMAG
##SYMBOL=    X,             R,               I
##VAR_TYPE=  INDEPENDENT,   DEPENDENT,       DEPENDENT
##VAR_FORM=  AFFN,          ASDF,            ASDF
##VAR_DIM=   8192,          8192,            8192
##UNITS=     SECONDS,       ARBITRARY UNITS, ARBITRARY UNITS
##FACTOR=    0.0002944,     1,               1
##FIRST=     0,             0,               0
##LAST=      2.4114304,     0,               0
##MIN=       0,             -126072,         0
##MAX=       2.4114304,     187661,          0
$$ Real data points
##PAGE= N=1
##DATA TABLE= (X++(R..R)), XYDATA
0 0 0 0 0 0 0 0 0 0 0 0 0 0 0 0 -8 8 -8 8 -8 14 -16 16 -24 24 -32 32 -40 48 -54 61 -70 80 -90 102 -115 130
36 130 -146 163 -182 201 -225 249 -276 306 -339 373 -413 454 -500 553 -607 669 -738 814 -901
55 -901 996 -1106 1234 -1383 1558 -1771 2031 -2363 2802 -3405 4296 -5750 8536 -15843 77516
70 77516 187661 77107 37367 76343 135640 53382 -46634 -41326 63226 80710 14100 -26742
82 -26742 47575 109358 32650 -66084 -68872 7799 11482 -67043 -83413 10321 91153 52198 -13984
95 -13984 -893 79151 55403 -41438 -81759 -15912 42465 -6350 -60828 -23088 63471 54311
107 54311 -27572 -67670 -4572 35329 -29382 -83203 -44997 47569 46275 -21676 -36504 29115
119 29115 54759 -15319 -88360 -67408 2432 -18845 -81961 -88157 -8862 31993 -24329 -71447
131 -71447 -35120 28319 9446 -50540 -53121 30886 70149 26358 -6306 36696 101901 69728
143 69728 -967 -12636 43727 56708 -1845 -44749 -2063 58215 28663 -30933 -34959 28183
155 28183 38079 -24375 -59570 -12841 43018 19221 -30066 -19682 51387 59930 1878 -34433
167 -34433 6973 51633 11779 -41504 -29503 35239 42407 -9577 -36319 11969 51270 11482
179 11482 -40711 -30622 30369 28790 -24188 -42974 6503 41649 2367 -47931 -36391 15572
191 15572 4961 -49692 -70479 -18755 16958 -20263 -57655 -32177 25361 19198 -29387 -41774
203 -41774 12951 43481 7222 -28650 -173 57424 44914 -5220 -15676 33146 51543 5688
215 5688 -35288 -10469 36432 19162 -28869 -36562 15747 33214 -10758 -44800 -15599 28534
227 28534 10340 -33577 -34343 19381 35597 -2721 -31326 1427 44570 22351 -21864 -21029 29432
240 29432 39403 -828 -27230 8104 46496 22403 -21047 -19721 28921 32531 -12695 -38215 -2579
253 -2579 31802 4726 -36897 -29751 18265 19293 -23537 -46060 -7975 25073 -2574 -40024 -26239
266 -26239 23219 23907 -15534 -31584 8871 37690 9849 -25522 -11617 35493 32164 -7640 -21835
279 -21835 18184 41915 10966 -24317 -9340 31346 22229 -18161 -32340 6788 27225 -5850
291 -5850 -38844 -20678 18815 7978 -31810 -40535 1572 19544 -9878 -37843 -14093 27672
303 27672 17483 -19077 -22626 20439 35839 3827 -23368 2120 37451 22613 -14917 -19521
315 -19521 19911 29287 -6145 -32968 -8901 22791 5678 -30401 -29527 11130 18866 -11816 -33437
328 -33437 -4943 27112 10142 -22101 -17786 22438 28331 -3215 -22465 7507 34522 14972
340 14972 -17450 -11858 26789 28769 -4105 -20845 10043 35462 14330 -17081 -7888 28641 26568
353 26568 -6318 -22906 7430 27516 2814 -28757 -19281 14525 9299 -24762 -37592 -5410
365 -5410 12580 -9961 -36448 -21731 14306 10834 -18247 -25376 9208 27428 4573 -20481 -4123
378 -4123 27400 19099 -12310 -21015 10179 22033 -4806 -30451 -14355 14256 4198 -27325 -31272
391 -31272 3154 14312 -9366 -30770 -8675 22289 12293 -15961 -15829 18410 28392 2391 -17801
404 -17801 4872 30831 17310 -11470 -11054 21691 27176 630 -16934 6099 30870 16990 -11194
417 -11194 -6642 25241 28206 2186 -15074 8300 28629 10839 -17137 -13741 14912 14746 -13987
430 -13987 -29281 -4825 13449 -3420 -29483 -21097 10415 10632 -14723 -24568 3066 22127 5356
443 5356 -18962 -8235 20544 17513 -9604 -21457 4587 18354 -2792 -27506 -17957 8867 3988
456 3988 -23734 -31275 -3954 9670 -8133 -29472 -14422 14123 9560 -14060 -18708 9384 22643
469 22643 2806 -17203 -1329 23304 16438 -9148 -13305 14732 23554 3291 -15616 802 25266
482 25266 17089 -8357 -8979 18689 26477 5640 -13077 5542 26798 15279 -10088 -11438 14921
495 14921 19594 -4638 -21500 -2886 16272 4922 -20404 -17525 10303 13695 -7199 -21075 -40
508 -40 20065 7739 -15315 -9752 15557 17806 -5356 -18976 2310 16708 2243 -20830 -16227
521 -16227 8408 6991 -16457 -26706 -5267 9422 -4422 -26010 -16055 8920 7650 -13176 -21391
534 -21391 2886 16655 1463 -17777 -6858 16336 14103 -8793 -14811 8713 19293 3400
546 3400 -15581 -3568 18932 13977 -7611 -11385 11040 21234 4317 -13377 313 19735 13773
559 13773 -7698 -11933 11089 17866 -170 -16069 -2796 15598 8960 -12983 -13638 8609 14989
572 14989 -2070 -16808 -1178 16952 8600 -11314 -10810 11469 16583 -2512 -16070 177 15617
585 15617 6114 -15188 -13319 8830 10701 -8271 -20587 -3465 11714 1111 -18971 -13775 7647
598 7647 9518 -8802 -19100 143 13649 2973 -15406 -9253 11727 12780 -6552 -14519 4355
611 4355 16379 4451 -13696 -5786 14055 12644 -6055 -13279 5820 16513 3043 -14104 -4710
624 -4710 14127 11161 -8120 -13898 6191 14714 709 -15366 -5208 13113 8922 -10165 -13375
637 -13375 6144 13997 -656 -15865 -3402 13598 8479 -10136 -12326 7310 13574 -1742 -15110
650 -15110 -2634 12997 6776 -11462 -11840 6913 12086 -3269 -15758 -2534 12249 5264 -12250
663 -12250 -11306 7594 11215 -3920 -14970 -185 13271 5836 -11673 -8370 10323 12696 -3065
676 -3065 -12449 3037 15284 6543 -10418 -5815 11795 12852 -3704 -11937 3689 14440 4572
689 4572 -11979 -6179 10728 10393 -6330 -13260 2574 12318 1722 -13572 -6920 9397 8062 -8050
703 -8050 -13476 2629 11007 -17 -14643 -6343 9274 6638 -9627 -13641 2546 9585 -1931
716 -1931 -15182 -5973 8616 5320 -10669 -13036 3668 9876 -2277 -14542 -3737 9914 6184
729 6184 -9669 -10340 6593 11771 -846 -12028 -411 12901 7661 -7567 -7039 9228 13101 -59
743 -59 -10048 2006 13817 7970 -7309 -5682 9732 12801 -413 -9411 2512 13509 7107 -7878
757 -7878 -5002 9670 11735 -1805 -10217 2503 12062 4597 -9821 -6284 8188 8890 -5549 -12192
771 -12192 917 9548 1254 -12930 -7626 6510 6111 -7937 -13549 14 7750 -1271 -14347 -8007
785 -8007 5371 4378 -9863 -14039 -255 6690 -2588 -14559 -7077 5977 4534 -9073 -11116 2933
799 2933 9342 208 -10684 -2136 10368 7938 -5405 -7063 6729 11967 1445 -8876 -375 11206
813 11206 7628 -6234 -6793 6673 11079 552 -9046 1039 12057 7966 -5251 -4184 9189
826 9189 12955 1593 -6939 3261 12882 7940 -5840 -4084 8429 10325 -1709 -9349 610 9325
840 9325 3220 -9919 -7114 5382 6832 -4874 -11387 -1005 7435 833 -11479 -7717 3811 5005
854 5005 -7386 -13212 -2019 5335 -1691 -13341 -8625 3313 3654 -8107 -12121 -27 7165 256
868 256 -10477 -4269 7746 7236 -4654 -7617 3944 9773 1676 -8905 -2286 7570 6062 -6391
882 -6391 -8412 3150 8072 43 -9485 -1844 8486 6861 -4801 -5157 6520 11777 3219 -5441
896 -5441 2498 11879 9134 -2717 -3231 7675 11195 1284 -6952 382 8939 5279 -6881 -6000 4938
911 4938 7835 -1949 -9327 -700 7559 2660 -8255 -6279 4274 6174 -4447 -10751 -1711 5749
925 5749 535 -10754 -7754 3198 4509 -6061 -10685 -882 6649 1318 -8956 -4808 5935 6667
939 6667 -3422 -7522 2189 8363 1924 -8166 -4238 5282 5147 -5945 -9327 191 5937 -889 -10040
954 -10040 -4629 5548 4870 -5376 -6926 3533 9300 1871 -6197 399 9243 7880 -2585 -3876
968 -3876 6302 9863 1834 -6081 114 8300 5574 -5281 -5385 4144 7253 -804 -8276 -1226 6531
983 6531 3698 -6407 -6279 3472 6109 -2193 -8351 -1301 5637 2896 -7189 -5825 3728 5801 -2385
998 -2385 -7826 136 7360 3336 -6047 -3742 5450 7532 -1690 -6434 1270 7465 2704 -6831 -4193
1013 -4193 4805 5213 -4167 -8165 -559 5352 396 -9058 -5156 3488 4289 -4798 -8157 670 6532
1028 6532 991 -6810 -2479 5957 6362 -3095 -4956 3045 8243 2181 -5962 -962 6543 5609 -3985
1043 -3985 -5700 2414 6708 -467 -8236 -2839 4359 3007 -6870 -7421 995 4673 -2238 -8631 -2686
1058 -2686 5181 3399 -5647 -5041 3634 7171 124 -5676 1180 7937 5516 -3387 -2694 5386 8190
1073 8190 49 -5230 1018 7238 3982 -5199 -3853 4368 6257 -1892 -6405 480 6274 2686 -5937
1088 -5937 -3780 3710 5571 -2733 -6858 150 5462 1472 -6644 -3966 4060 5057 -3136 -5803 1360
1103 1360 6528 2317 -5220 -1894 5369 5766 -2510 -5465 1629 5848 -130 -7596 -4236 2101 1684
1118 1684 -7090 -9022 -2004 2183 -3240 -9676 -4945 2512 2363 -5456 -5662 1940 6382 1216 -4732
1133 -4732 742 7194 6094 -2104 -2488 4715 7365 958 -4600 18 6020 4094 -4192 -3505 3389
1148 3389 6423 -194 -4924 561 6824 4323 -3479 -2481 4449 7027 -371 -5194 624 5822 2554
1163 2554 -5224 -3746 3400 5037 -1957 -5244 798 5879 2974 -3927 -1663 5139 6403 -873 -3942
1178 -3942 1317 5867 1083 -6242 -4474 1413 1292 -6552 -9296 -3611 620 -3764 -10286 -6930 417
1193 417 721 -5691 -6614 250 5197 1133 -4658 -586 6244 5716 -1841 -2851 3251 6236 961 -5082
1209 -5082 -1219 4443 3109 -4187 -4540 1880 5151 -170 -4903 13 5879 4650 -2393 -1798 4370
1224 4370 7095 1086 -3376 677 5903 3740 -3391 -3024 2899 5476 -729 -4442 620 5888 3819
1239 3819 -2886 -991 4969 7009 748 -2691 1945 6120 2653 -4578 -3391 2118 2467 -4734 -8166
1254 -8166 -3516 822 -3095 -9244 -6742 -505 708 -5578 -6823 -916 3741 729 -4510 -1454 4466
1269 4466 4978 -1422 -3157 1859 5359 820 -4629 -2514 2951 2666 -4189 -5098 266 3814 -450 -5193
1285 -5193 -1745 3918 3580 -2409 -2661 2755 6042 1075 -3582 372 4943 3963 -2678 -2563 2654 5334
1301 5334 237 -3658 423 5139 4014 -1858 -1047 4268 6897 1649 -1846 1773 5992 3802 -2867
1316 -2867 -2413 2189 3644 -2389 -6081 -2354 1623 -901 -6953 -5752 -496 1366 -3646 -6192 -1359
1331 -1359 3415 851 -4192 -2023 3378 4512 -1026 -2961 1251 4823 1662 -3937 -2134 2690 2773
1346 2773 -2939 -4866 -201 3103 -417 -5171 -2924 2276 2516 -3256 -3934 839 3839 432 -3930
1361 -3930 -1238 3653 3173 -2272 -2994 1662 4733 840 -3073 -375 4339 4036 -1269 -1559 2902 5726
1377 5726 1652 -2202 446 4831 3584 -2260 -2285 1792 3763 -1199 -4616 -1874 2640 768 -4634
1392 -4634 -4308 303 2286 -2267 -4712 -1299 2730 1378 -3314 -2279 2489 4081 -656 -2982 782
1407 782 4440 2213 -2520 -1488 2849 3608 -1188 -3340 212 3278 592 -4159 -3010 1298 2083 -2795
1423 -2795 -4390 -683 2631 -149 -4237 -2162 1894 2423 -2162 -3211 767 3952 1080 -2485 -572
1438 -572 3655 3560 -933 -1904 1745 4391 808 -3084 -816 3057 2265 -2577 -3122 771 2873 -771
1454 -771 -4063 -1689 2198 1515 -3094 -3543 403 2729 -974 -4104 -1415 2718 1482 -2993 -2434 1607
1470 1607 3639 -339 -2752 -102 3846 2714 -1519 -1052 2853 4152 241 -2132 881 3994 1925
1485 1925 -2636 -1862 1726 2267 -1935 -4001 -975 2019 -123 -4012 -2719 1205 2516 -1954 -3063
1500 -3063 731 3719 1697 -1909 -414 3487 3741 -291 -1950 1091 3566 584 -3155 -1789 1620
1515 1620 1857 -2830 -3764 -665 1924 -919 -3803 -2226 1441 1557 -2631 -2751 202 2540 -236 -3495
1531 -3495 -1446 1939 1317 -2468 -2843 648 2446 -739 -3089 -802 2867 2120 -1141 -1155 2149 4122
1547 4122 1000 -1308 740 3996 2807 -1129 -1313 1847 2800 -575 -2894 -936 1806 416 -2959
1562 -2959 -2670 978 2221 -1006 -2506 415 3474 2138 -1332 -304 3169 4188 357 -1445 1006
1577 1006 3521 1305 -2051 -1933 1251 1668 -2237 -3640 -1196 1592 -768 -3625 -2427 893 1250 -1902
1593 -1902 -2868 -344 2262 -161 -2963 -1651 1408 1267 -2051 -3001 -307 1830 -499 -2968 -1746 1808
1609 1808 1626 -1586 -1844 1245 3405 982 -1333 284 3324 2752 -798 -1327 1370 2861 -354 -2431
1625 -2431 -832 1795 891 -2415 -2302 658 2143 -600 -2321 -11 3190 1935 -1047 -464 2651 3747
1641 3747 795 -840 920 3322 1966 -1336 -1299 1557 1932 -1655 -2659 -869 1349 -192 -2948 -2200
1657 -2200 512 1532 -1475 -2457 -327 2086 292 -2382 -1535 1088 1229 -1607 -2467 -613 1623 -595
1673 -595 -2676 -1584 1204 1122 -1411 -1896 540 2402 577 -1681 -473 2473 2061 -964 -1319 574
1689 574 2542 -127 -2227 -939 1369 1144 -1930 -2084 532 1977 -14 -1942 -631 2332 1694 -1168
1705 -1168 -765 1854 3067 947 -985 543 2717 1682 -1082 -927 1081 2134 -540 -2080 -421
1720 -421 1498 639 -2141 -1674 676 1366 -1121 -2366 -440 1723 451 -1872 -1465 920 1655 -1080
1736 -1080 -2135 -442 1606 149 -1955 -1477 1042 1511 -1055 -1952 -3 1923 762 -1523 -1081 1385
1752 1385 1656 -712 -1781 234 2232 -275 -2045 -946 1432 923 -1377 -1926 -17 1723 -164 -1815
1768 -1815 -905 1653 1399 -959 -1103 946 2512 410 -1398 -196 2198 1474 -754 -1109 936 2012
1784 2012 -120 -1663 -478 1372 799 -1464 -1642 412 1414 -643 -1922 -854 1338 506 -1643 -1447
1800 -1447 839 1674 -677 -1671 -238 1768 516 -1293 -915 1115 1829 -380 -1418 75 1949 608
1816 608 -1142 -1088 1468 1544 -893 -1373 17 1504 352 -1686 -785 964 1520 -858 -1414 292 1521
1833 1521 426 -1497 -600 1580 1316 -881 -1381 268 1731 102 -1209 -991 1102 982 -926 -1187
1849 -1187 517 1685 -260 -1628 -722 1279 621 -1182 -1590 117 1157 -570 -1674 -1001 1056 489
1865 489 -1611 -1422 459 1142 -443 -1259 -361 1351 663 -810 -962 1004 1789 -190 -979 -73 1664
1882 1664 863 -819 -621 977 1567 -446 -1242 36 1889 586 -1134 -727 985 1500 -180 -1069 206
1899 206 1716 463 -847 -625 1133 1308 -548 -1183 11 1474 450 -1094 -699 1022 705 -637
1915 -637 -1249 126 1411 52 -1462 -1079 886 743 -1243 -1285 -245 1111 -298 -1600 -1131 585 115
1932 115 -1464 -1809 -46 843 -667 -1521 -677 1065 563 -1034 -1019 523 1153 -194 -1096 -223 1391 851
1950 851 -637 -727 857 1342 64 -990 241 1277 562 -807 -662 981 1400 19 -842 146 1907
1967 1907 1009 -538 -302 1177 1379 -186 -884 -56 1429 549 -889 -503 867 1057 -373 -1297 111
1984 111 1028 145 -1074 -914 608 956 -911 -1411 -103 866 -88 -1450 -882 476 377 -960 -1385 -164
2002 -164 815 -267 -1384 -951 291 502 -956 -1228 -65 845 -154 -1040 -419 871 637 -657 -1093 323
2020 323 1031 -49 -956 -304 1113 470 -664 -759 531 1056 -198 -725 -212 1350 876 -483 -340 806
2038 806 1544 -75 -716 212 1226 531 -459 -527 805 1197 -269 -614 182 1314 356 -884 -803 514
2056 514 767 -290 -1067 -46 1281 -8 -825 -675 555 691 -222 -976 88 693 -363 -801 -760 543
2074 543 628 -1001 -1158 21 825 -203 -1135 -601 637 431 -773 -1171 93 1024 -158 -867 -308 905
2092 905 753 -582 -721 395 919 77 -839 -230 1056 492 -378 -638 563 1014 141 -606 87 843 750
2111 750 -366 -425 622 1087 -185 -605 75 1116 179 -736 -695 487 661 -356 -848 75 1071 295 -701
2130 -701 -522 636 884 -468 -927 138 868 400 -609 -579 670 544 -570 -882 -10 770 -174 -1014
2148 -1014 -334 489 445 -608 -593 177 831 -199 -835 -272 739 719 -379 -573 78 826 -33 -640 -46
2167 -46 734 371 -413 -501 76 735 -102 -680 -232 1025 356 -404 -659 526 917 -100 -738 -250 631 236
2187 236 -806 -764 375 683 -318 -679 -259 847 214 -531 -422 522 797 -243 -521 182 784 164 -696
2206 -696 -569 677 686 -287 -714 28 692 117 -638 -537 619 289 -270 -674 114 793 -67 -579 -594 508
2226 508 508 -180 -689 452 1027 178 -543 -167 988 615 -220 -611 182 894 184 -778 -483 707 191 -515
2246 -515 -699 144 329 -312 -888 -527 403 80 -749 -762 335 793 -339 -755 -2 731 319 -463 -437 394
2266 394 716 -131 -625 -392 596 341 -260 -390 493 413 -362 -649 -170 757 358 -414 -295 574 834 -196
2286 -196 -746 53 619 210 -730 -441 642 549 -452 -414 239 830 153 -449 38 1008 683 15 -157 512
2306 512 822 -1 -522 -388 470 403 -640 -849 -157 356 -279 -943 -397 372 54 -616 -604 168 617 -220
2326 -220 -482 -232 459 326 -370 -641 169 581 -447 -753 -456 304 69 -967 -652 453 619 -284 -867
2345 -867 -165 633 299 -471 -375 537 607 -108 -572 -131 478 -41 -485 -190 551 406 -114 -604 391 693 373
2366 373 -37 46 908 847 106 -63 554 1016 192 -497 -210 405 357 -408 -565 -95 447 -393 -1045 -588 293
2387 293 76 -508 -648 100 717 -55 -472 -240 651 31 -470 -249 297 651 -234 -835 -685 287 -160 -501
2407 -501 -706 159 114 -249 -651 -132 714 163 -272 -516 479 593 -54 -478 -68 698 214 -696 -744 99 454
2428 454 -252 -541 -168 747 177 -265 -228 887 862 209 -187 388 929 406 -371 -88 712 485 -414 -370 -75
2449 -75 183 -209 -684 -693 216 371 -373 -672 51 764 -129 -486 -230 527 594 -154 -288 89 602 -64 -751
2470 -751 -160 296 -126 -660 -621 338 109 -489 -736 -229 587 267 -426 -466 228 480 -111 -667 -19 483 14
2491 14 -397 -381 -57 325 -369 -599 -297 629 247 -220 -222 662 796 245 -295 450 1067 397 -229 -327 497 532
2513 532 -167 -502 -106 487 -31 -639 -512 214 341 -527 -647 164 636 89 -298 -307 568 230 -349 -451 160
2534 160 665 187 -405 -215 356 52 -449 -514 167 377 -237 -779 -516 379 21 -440 -540 74 310 -91
2554 -91 -529 -190 487 165 -471 -561 308 302 -139 -426 -63 217 220 -354 -161 384 600 42 -262 383 767 330
2576 330 -56 -310 309 355 16 -655 89 442 -71 -544 -455 34 165 -320 -666 18 494 254 -520 -200 433
2597 433 191 -205 -440 25 616 182 -259 -118 776 405 -73 -274 183 746 -84 -513 -247 323 162 -694
2617 -694 -514 -272 310 -250 -533 -302 -27 247 -213 -324 239 529 -201 -548 -251 516 451 -38 -478 311
2637 311 667 -133 -535 86 585 249 -343 -625 156 288 -67 -492 5 342 150 -299 -343 244 335 32 -413
2658 -413 -213 315 -175 -637 -571 16 185 -344 -359 -64 453 119 -491 -32 505 539 -32 -521 262 535 77
2679 77 -468 -227 327 25 -247 -351 -66 264 -117 -399 -516 581 296 -324 -300 27 628 321 -360 157
2699 157 565 574 63 -110 547 557 267 -362 -123 262 356 -347 -545 -2 481 -255 -534 -154 249 306 -265 -323
2721 -323 363 560 97 -528 -340 423 98 -392 -480 177 197 -373 -620 -272 275 101 -298 -381 523 514 -205 -423
2743 -423 113 793 509 -334 -243 309 406 -454 -646 -140 342 -453 -495 -520 205 335 -65 -417 370 764 246
2764 246 -40 -99 507 619 77 -142 442 512 140 -346 -166 301 145 -297 -517 -131 472 -47 -354 -271 419
2785 419 281 -211 -470 536 515 43 -308 144 355 81 -235 -569 66 115 -449 -581 -69 356 190 -317
2805 -317 -607 396 664 126 -386 -23 561 434 -401 -402 360 367 -105 -634 -153 220 109 -620 -259 410 183
2826 183 -134 -554 97 530 181 -581 -188 666 542 209 -351 328 483 319 -312 -288 495 413 -209 -580 -147
2847 -147 789 72 -554 1 274 303 133 -255 286 626 116 -448 -159 453 196 -201 -294 92 488 -49 -600
2868 -600 -338 244 272 -343 -362 373 241 24 -564 -22 495 258 -175 -307 354 207 67 -511 -174 270 -53
2889 -53 -559 -578 268 109 -12 -581 -21 599 270 -256 -126 402 619 31 -436 132 482 174 -516 -387 567
2910 567 573 -107 -455 -103 383 11 -490 -126 311 129 -392 -284 365 331 83 -543 -316 430 187 -255 -468
2931 -468 130 598 -34 -626 -114 486 194 -186 -449 168 473 -45 -332 17 561 116 -304 -354 253 399
2951 399 -132 -403 -148 298 113 -284 -571 109 574 16 -403 -129 330 222 -317 -437 269 406 -148 -414
2971 -414 -78 496 78 -266 -235 129 357 214 -643 1 469 207 -131 -453 359 283 -349 -494 -35 258 4
2992 4 -427 -495 119 156 -176 -459 58 361 -30 -312 -277 123 447 -194 -457 300 568 209 -505 -438 191 260
3014 260 -42 -251 161 296 104 -235 -278 463 486 -168 -365 179 428 -135 -349 -37 412 446 -298 -277 234
3035 234 609 -34 -435 148 622 251 -74 -242 130 272 -63 -128 80 558 365 -427 -506 179 518 -107 -608
3056 -608 -197 416 -54 -678 -199 -73 282 -379 -537 19 309 148 -262 -261 234 433 50 -232 101 591 163
3077 163 -220 -77 -19 296 -243 -593 -14 331 91 -380 -118 234 175 26 -317 141 517 229 -514 -509 374
3098 374 49 29 -377 55 456 -6 -488 -148 559 345 -48 -445 626 582 84 -328 118 264 218 -237 -445
3119 -445 233 382 42 -581 -62 371 179 -147 -403 70 161 -143 -402 -100 199 70 -227 -160 357 356 -55
3140 -55 -567 -80 152 -42 -379 -469 121 175 -254 -233 -56 337 58 -564 -363 113 397 -242 -310 72 332 291
3162 291 -160 -134 242 455 -125 -219 37 304 167 -378 -441 248 117 -215 -218 213 589 253 -338 135 366 556
3184 556 34 -271 142 406 16 -561 -149 277 291 -307 -283 15 498 25 -437 -100 347 91 -81 -158 110
3205 110 593 46 -311 116 610 267 -248 -192 176 390 -62 -536 -231 209 306 -329 -198 83 265 138 -654
3226 -654 29 293 -3 -285 -148 243 424 -92 -419 44 310 66 -456 -426 157 354 -171 -169 6 327 150
3247 150 -303 135 336 368 -149 -261 146 164 123 -457 -32 295 378 -230 -34 379 166 78 -463 -119 62 140
3269 140 -290 -153 267 392 24 -430 -2 572 219 -189 -226 185 335 -36 -354 -228 124 -43 -308 -533
3289 -533 -1 290 96 -550 129 308 180 -268 -177 152 171 -79 -312 -77 349 133 -295 43 228 447 50
3310 50 -387 -404 472 44 -34 48 267 322 -103 -379 117 144 66 -566 -303 388 331 -194 -299 172 486 -172 -370
3333 -370 -219 146 322 23 -323 -72 278 -23 -434 -157 126 349 -129 -256 -18 222 119 -546 -19 345
3353 345 203 -290 -403 27 508 -124 -295 -191 38 294 -409 -247 78 249 84 -321 -35 162 28 -248
3373 -248 -297 325 167 95 -473 -45 95 29 -255 -306 211 121 -64 -398 -76 125 347 -341 -354 256 288 -193
3395 -193 -343 23 185 31 -314 -326 200 165 -71 -431 -2 138 289 -347 -361 403 305 -361 -163 83 291
3416 291 96 -416 55 239 322 -223 -197 7 179 -80 74 277 297 128 -60 -392 31 195 -16 -392 8
3437 8 297 213 -286 -230 154 290 -14 -678 -217 224 85 -8 -309 242 194 -10 -292 9 128 146 -40 -315
3459 -315 221 116 -330 -343 -145 239 114 -662 -130 182 341 -98 -263 -242 305 285 -268 -153 195 280 -82
3480 -82 -445 -52 304 -82 -422 -46 143 183 -283 -737 0 133 -22 -265 -359 309 221 172 -230 198 139 70
3502 70 -336 -16 225 319 -74 -246 -12 424 243 -284 -148 253 471 -332 -119 141 282 115 -281 -244 309
3523 309 298 -295 -134 115 345 -202 -129 15 215 145 -215 -105 -46 77 -57 -650 -180 187 -272 -53 -257
3544 -257 193 367 -64 -240 -220 155 240 -223 -215 -6 301 -165 -354 -224 91 187 -77 41 147 150 -153 4
3566 4 274 345 169 -290 -238 233 165 -224 -320 94 37 30 -253 -287 245 133 -211 -222 -95 488 265 -240 -419 377
3590 377 212 -81 -20 166 130 44 -314 -43 182 424 -271 -214 -13 155 104 -144 -70 -3 148 -529 -209 106
3612 106 256 0 -77 -181 63 -185 -211 -175 -15 -54 -16 -467 -278 49 135 -199 -133 375 372 -90 -35 80 323
3635 323 217 -366 -135 -108 401 146 -170 -122 135 243 -197 -104 84 108 -141 -126 -203 232 141 36 -167 181
3657 181 294 -12 -133 19 293 373 -32 -252 75 303 -183 -482 33 79 202 -173 -173 -59 289 -11 -247
3678 -247 -242 125 136 -425 -122 92 319 -230 -219 -91 355 62 -197 -55 40 408 -79 -225 168 112 34 -154
3700 -154 -103 435 363 -417 -344 162 228 -101 -227 -111 180 -23 -247 -235 79 -11 15 -73 -148 32 192 -116 -153
3723 -153 -88 313 -32 -253 44 196 -25 -311 -351 146 460 -358 -212 -77 530 128 -376 -51 61 102 -147
3744 -147 -71 -71 231 164 -392 -94 128 123 -176 -210 36 174 229 -183 -19 -42 90 -109 -102 -67 127 134 -214 -159 149
3769 149 360 -218 -156 147 470 102 -349 -158 124 226 -335 -15 76 349 -129 -168 -115 279 291 -166 -130 -63
3791 -63 332 -146 -333 -64 393 154 -379 -60 2 246 10 30 184 143 321 -292 -50 269 236 -233 -93 -218
3813 -218 75 162 -258 -156 299 271 14 -234 -26 48 232 -132 -10 403 199 -40 -226 -52 366 183 -416
3834 -416 -258 29 94 -88 -563 -100 57 270 -242 -157 77 183 75 -297 -77 360 18 111 -100 285 226
3855 226 94 -339 -58 327 -134 -251 -323 100 164 -52 -113 210 426 238 -191 -76 95 312 -58 -85 251
3876 251 -83 71 -24 -410 99 -94 -316 -264 -216 32 -278 -288 81 47 38 -133 -95 -44 552 170 -186 -105 141
3899 141 207 -178 -128 50 189 -27 -217 -158 19 189 -77 -96 121 43 -104 -164 19 282 277 -67 13 198 354
3922 354 -65 -220 -146 15 -51 -279 -240 -86 -24 -68 29 -7 187 214 -10 -150 70 267 -76 -93 244 493 -42
3945 -42 -353 -199 -70 275 -211 -24 -28 243 205 -81 -31 286 27 113 105 57 82 128 -278 -6 378 128 -90 -370
3969 -370 -106 -116 -138 -236 -212 164 -25 -360 -177 -169 371 156 -236 -63 371 40 -24 -272 184 203 -63 -173 -148
3992 -148 -34 3 -186 -52 63 49 -164 -258 -10 165 -110 243 -96 204 121 -131 -9 209 266 11 -38 -79
4014 -79 119 109 -175 13 5 64 -23 -200 16 136 220 -25 2 116 42 325 -70 -259 493 360 -260 -144 -69
4037 -69 115 2 -42 -157 3 -88 -91 -102 149 185 -78 79 -118 257 121 -91 -100 96 206 2 -145 -265 113
4060 113 -7 -161 -182 119 137 -247 -230 46 193 105 -57 8 1 84 -2 -141 -168 348 0 -236 -222 -26 352 -66
4084 -66 -338 -171 -16 -12 -348 -175 99 -2 -225 -107 -36 239 90 -133 107 33 225 58 -95 129 22 105
4106 105 -139 -173 -139 160 -100 -127 24 83 106 -264 19 140 34 -120 -141 47 -32 4 -165 166 -54 1 -145
4129 -145 -174 131 286 -24 -117 -63 29 -7 -2 -51 -257 -1 66 -215 -27 121 123 -176 -43 -78 116 -102 -290 50
4153 50 -8 180 -146 -42 60 147 -6 -144 10 166 117 -215 -170 26 178 10 -73 2 216 -28 23 20 205
4176 205 486 104 -241 11 282 137 -145 135 323 -2 -132 -166 -52 101 63 -313 -137 85 -100 -8 -228
4197 -228 -108 263 259 -58 -13 62 -70 -36 365 186 224 83 -231 -169 49 140 -75 -192 -29 156 -59 -377 62
4220 62 164 177 177 -67 88 155 63 62 -61 246 116 -125 -71 -38 94 -53 -77 -240 129 67 -182 48 -51 76
4244 76 60 -38 -30 294 -98 -22 -365 195 265 -115 -172 183 51 78 77 -360 96 129 14 -26 -48 472 71 -26 111
4269 111 59 62 150 -18 -25 130 181 -116 -185 -34 61 -59 181 27 -58 90 46 71 362 -110 -104 117 -109 -11 8
4294 8 -260 -29 -159 -10 40 -25 -73 1 -40 -146 288 19 -6 -155 35 35 225 24 -202 65 68 13 -184 -85 -188
4319 -188 -132 -68 -339 192 79 -253 -14 -114 -153 193 85 -104 416 171 146 142 -185 234 191 43 -246 19
4341 19 -64 -78 -57 -192 -19 99 197 -211 -173 86 123 -9 -130 157 215 157 -175 -205 181 -195 23 92 65 330
4365 330 -202 -267 -85 99 50 -34 36 55 -161 71 141 -19 380 6 -42 144 -1 -34 7 -106 -97 -23 -123 -252
4389 -252 -13 -91 -113 90 -82 46 59 14 -57 -15 63 79 19 36 35 240 -60 12 79 65 130 111 -341 -159 139 -27
4415 -27 -72 304 -6 107 101 -153 25 112 105 -192 -57 179 5 46 -110 193 159 127 -184 -63 147 10 20 -157
4439 -157 144 171 -73 10 -70 20 -5 -72 -88 156 61 53 -20 -89 -28 -26 -55 35 -18 242 -34 28 -206 88 -111 -358
4465 -358 153 313 -88 5 -149 -19 287 -45 -378 199 85 -207 123 17 46 10 35 -16 214 -7 96 110
4487 110 -11 99 161 106 97 -15 -134 32 -191 -14 -67 154 -246 55 -145 49 -16 19 -101 -152 34 16 -271
4510 -271 -264 94 200 -329 -328 -56 71 -90 -89 29 -103 -19 42 -65 134 96 1 -44 -1 195 -64 -15 37 187 164
4535 164 96 -34 98 207 -80 173 228 -5 12 112 199 135 179 -170 -142 15 256 154 16 -99 -114 101 15
4558 15 -166 -63 -15 354 51 -30 -133 327 -109 363 17 228 -11 103 1 46 107 64 24 -132 -13 150
4580 150 -118 -38 -94 71 -137 114 150 -94 -14 -148 -93 -92 227 -124 77 -120 4 90 -154 -200 -90 -90 -16 -265
4604 -265 -1 75 -36 61 71 -231 -77 -14 -108 -24 37 98 23 -80 157 -59 276 -260 -72 201 14 27 -149
4627 -149 -141 -63 -5 -242 127 163 60 297 -119 151 36 -23 81 -46 -100 -28 -48 -105 2 89 -51 -265 95 -51
4651 -51 -63 26 -106 -38 234 -194 -7 124 125 113 182 32 266 -176 -94 110 274 133 -93 35 -15 -17 -86 114
4675 114 -85 93 141 -79 -91 17 191 32 222 -61 136 37 -161 45 -82 333 -30 190 112 124 266 226
4697 226 -314 -236 231 -19 161 -41 175 187 61 -146 238 110 -85 23 -60 6 231 -155 -93 -96 80 -24
4719 -24 89 193 -108 -116 36 240 80 -73 -156 -111 -385 -157 271 -52 -143 -114 155 227 50 -37 227 -31 -90
4742 -90 -19 105 123 47 -229 9 -137 29 106 63 119 37 37 -56 221 0 -73 -33 -94 82 -2 22 16 206 -83 -13
4768 -13 -31 -174 -110 121 160 -256 57 79 99 83 62 -7 -21 -47 -68 40 195 123 -31 174 -18 -16 12 -126 121
4793 121 -27 -20 215 129 98 -6 -102 -150 -158 71 141 -111 17 111 134 -78 163 -75 -14 109 -156 27 67 58 38
4818 38 -112 11 151 -13 80 16 -31 31 -350 -60 33 -31 144 1 -8 124 -193 39 26 -30 106 20 -88 -56
4842 -56 -66 -132 -292 -192 190 116 -28 -26 0 -62 -145 -213 -43 58 85 -25 -20 -46 85 -63 -178 4 229 171 86
4867 86 61 -92 -102 71 -105 67 -53 14 -56 53 230 144 -12 133 -22 -175 -11 252 -11 -96 167 -134
4889 -134 30 34 2 -171 -222 44 1 197 -29 -51 -45 228 -20 -152 -74 -170 -96 -132 -46 251 420 -166 -16 27 100
4914 100 189 166 -54 -14 42 98 -167 3 127 -123 -120 -264 -42 -97 85 98 65 -36 46 -183 237 306 164 -299
4938 -299 -225 -76 -43 -151 48 13 143 -78 -61 94 1 133 212 36 -56 -163 -41 136 73 -230 -71 147 118
4961 118 -131 -142 -97 172 -152 -98 -141 -141 209 48 -3 -230 195 50 -165 9 54 320 -6 150 150 32 -91
4984 -91 -10 -329 26 202 -153 -65 217 -89 64 -45 -195 283 314 -100 -115 84 65 73 -158 -54 -194 -16 88
5007 88 -86 98 -143 3 -29 -58 -106 -129 -225 -7 129 89 4 -45 47 55 -8 -55 9 174 63 -70 145 33 189
5032 189 -26 -118 -130 -43 -124 144 -60 140 75 241 -96 45 40 -70 19 116 -48 -97 98 -100 70 5 156 36
5056 36 -216 -1 111 4 79 -331 20 -145 67 -80 225 -54 -262 -159 -52 210 11 54 103 59 0 -19
5078 -19 115 142 82 -11 -206 14 153 7 46 -266 28 220 -34 171 -248 -2 150 18 60 -9 -30 141 -15
5101 -15 3 -62 103 -7 -37 -84 34 -3 34 -11 39 85 39 -10 240 375 9 -60 -36 -163 -135 -192 196 79 -52
5126 -52 41 -154 -138 -199 165 -203 -53 -252 -181 -63 -31 -118 63 174 83 -187 -66 37 27 -290 -133 -4 51
5149 51 66 124 256 -142 125 -94 -132 138 136 198 -102 60 -196 40 4 -70 190 -127 -27 9 59 -111 -38 209
5173 209 213 108 -19 -10 -37 -90 371 11 -98 5 -215 108 33 171 75 175 -21 -60 -75 140 160 -148 68 -38
5197 -38 39 -45 13 109 162 134 18 -3 -85 -8 75 -198 -237 54 152 -203 122 18 -50 -57 2 55 62 231 18 143 -67
5224 -67 58 148 -290 -174 193 -74 101 -114 31 -115 228 79 -104 150 105 -92 -82 -121 16 -189 -18 -329
5246 -329 -138 94 -183 129 5 75 32 31 -88 258 231 98 -8 123 -191 -34 -150 28 -135 -160 43 -101
5268 -101 10 127 -104 166 84 -59 78 -78 -52 57 58 -23 2 -126 92 187 24 76 38 -16 -202 -194 184 240
5292 240 119 66 -198 -38 -86 -2 -166 -7 92 -75 18 -173 -189 124 21 13 -48 132 -121 -160 3 182 36
5315 36 11 92 107 93 -43 60 10 -64 -180 44 54 233 156 46 -217 61 83 83 -20 234 182 -231 -114 -90 -114
5340 -114 51 -3 -185 -28 -132 -16 -118 -22 -216 187 88 -111 -14 -13 54 30 -78 -31 80 347 85 51 -244
5363 -244 290 -8 -110 -215 -242 113 77 -22 -58 38 -200 -133 58 12 -62 -54 -199 112 -36 63 -34 -76 45 50 -53
5388 -53 43 69 64 199 52 15 115 -26 -26 -193 -77 15 98 16 118 44 42 41 -146 -176 -62 7 59 -183 -107 -14 167
5415 167 167 56 -89 -75 -139 -129 45 298 -155 -157 149 93 -108 -90 -228 58 212 114 45 15 199 37 37 113 169
5440 169 157 -137 57 -13 -109 -41 -8 -325 296 141 -29 131 4 87 502 -95 -123 202 88 104 11 208 163
5463 163 -123 -231 -166 -159 -117 65 206 68 14 86 134 -20 46 4 33 -19 67 151 47 -4 38 49 1 38 -97 57
5489 57 -50 166 -67 18 -40 -120 -14 64 -155 -48 -55 33 -35 -261 -89 -1 11 -37 -189 -273 -36 17 170 54 92
5514 92 -124 -94 -48 184 11 27 -81 35 15 22 -15 177 67 79 -30 -51 -84 177 -164 -40 28 -125 17 119
5538 119 219 169 -183 43 -136 -333 -126 -218 62 -151 176 163 96 -123 -88 -8 91 259 44 202 -37 64
5560 64 -147 28 -203 -81 -34 -157 65 -152 -297 -2 270 -117 14 267 -10 44 -159 365 43 140 -200
5581 -200 -4 20 -42 -2 8 -13 -220 -137 68 3 -142 -55 -85 -141 44 -344 11 33 -174 263 81 -81 -19 229
5605 229 249 137 -39 -37 66 -59 -150 28 119 -103 -229 -61 123 173 4 124 -126 -48 -194 -125 -140 -74 93
5628 93 55 62 6 -146 17 -20 4 -113 124 -148 -113 -78 30 46 -39 133 30 -124 -12 -228 -91 261 -158 -43
5652 -43 -46 37 -113 96 -89 -230 23 -30 -40 -47 334 129 2 -80 -32 -16 -125 -114 5 -110 275 -117 250 -44
5676 -44 285 -96 -167 12 -90 84 81 -219 -266 -164 -146 34 -120 -46 -15 56 66 20 207 23 27 -170 139 117 49
5701 49 53 -189 240 53 95 -46 318 48 166 -30 118 31 -3 227 262 12 -69 5 -174 90 -77 29 -158
5724 -158 -183 -172 -58 41 47 -17 -109 -284 -112 211 -29 61 75 50 -116 15 -234 68 -192 101 8 74 5 -284
5748 -284 61 -144 77 91 25 63 136 -137 130 159 220 -106 -80 191 27 -164 143 -83 89 56 -81 -118 47
5771 47 -85 -20 2 222 -91 -86 24 267 344 68 31 230 -65 -133 27 -85 240 70 10 109 -166 -44 86
5794 86 -207 120 -145 -142 -78 156 -76 33 162 -238 -32 -11 291 -18 34 -29 -188 120 -76 -15 -276 117 140
5817 140 6 -185 -156 31 -8 -41 33 164 -55 137 13 -24 -120 -104 109 -6 -60 -128 -112 -94 -117 35 -263 -99
5841 -99 114 105 -2 33 -99 -8 198 -195 -184 13 141 66 -27 44 179 -208 7 33 -100 64 198 -110 219
5864 219 -133 -97 119 210 61 31 -11 192 16 -63 196 -156 151 158 -90 25 -127 -29 -43 87 -24 54 49 125
5888 125 138 -18 37 -8 154 -55 -45 -108 -12 203 187 -234 -1 -177 -145 129 -52 137 42 141 41 14 27 -87
5912 -87 -92 24 9 92 -18 -137 -59 74 -96 -23 -66 66 221 -197 143 170 44 110 -106 -55 322 -169 18 141
5936 141 108 -218 -78 95 32 134 1 -2 52 -200 133 -233 -51 56 -94 -57 -164 -20 -49 128 -200 -30
5958 -30 -150 -102 126 1 -122 249 38 -45 -108 63 -109 -57 -23 192 -16 -50 66 -64 15 -4 -117 -37 -130 -50
5982 -50 -175 94 320 -41 226 -5 92 72 85 9 -57 92 201 211 -26 -232 -61 -110 -101 -17 -7 -195 -5 6
6006 6 -78 6 -13 -34 -8 -145 58 -146 -28 -81 119 -131 -15 6 201 125 -30 -134 170 34 26 -26 103 142 -185
6031 -185 -65 -95 -89 42 57 -158 -151 -79 107 -119 199 90 87 -14 77 -110 -76 29 121 61 128 -28 -9 135 66
6056 66 221 -24 40 -77 194 -45 -44 -160 -88 4 33 52 -10 -79 -151 39 77 -77 112 -45 117 -210 2 33
6080 33 -22 148 -43 227 -16 225 122 122 167 107 4 74 -88 103 -12 -16 65 -87 -96 -61 99 85 -57 153 34
6105 34 6 115 -28 64 49 -90 235 -84 10 37 -273 30 135 8 -47 25 -292 25 101 68 -293 70 125 -64
6129 -64 136 72 -120 -38 171 87 51 217 246 -15 -113 12 -30 104 -123 107 59 6 93 -164 -54 0 -35 118
6153 118 -147 113 -241 73 24 -107 88 -64 -15 -41 -62 35 36 82 -128 -80 -135 -12 171 -172 272 -148 -61 -40
6177 -40 -16 115 218 -65 -15 -13 -10 66 8 -100 -74 -9 13 108 -123 29 -52 -56 -11 99 -80 61 -79 -60 27 101 -206
6204 -206 223 5 105 -244 -98 150 116 -118 -56 -31 27 91 115 -12 -125 -107 2 218 -6 174 -27 47 -61
6227 -61 26 112 144 20 133 -85 -195 -174 -184 159 153 9 -25 27 44 -191 -121 -4 -147 -286 115 45 77 22 196
6252 196 -111 9 -8 10 99 11 202 8 -84 10 104 87 155 22 -89 -81 -23 133 103 72 42 -345 -178 -85 -100 107
6278 107 -69 -228 53 -15 59 161 170 104 -15 -134 -106 -101 -7 30 -140 28 192 -60 -152 15 -232 -153 -36 -83
6302 -83 -91 84 -68 -206 142 39 6 -45 -209 91 79 -107 -37 -122 -62 40 -17 -48 -109 199 324 -167 204 13
6326 13 62 7 -9 -202 23 39 -62 158 168 51 74 34 -186 -103 -443 130 85 181 87 260 -172 0 -174 -281
6350 -281 -196 -36 8 74 52 4 106 -22 -189 153 238 97 -31 -2 121 43 -165 -187 178 199 164 -10 117 29
6374 29 -9 -49 -228 11 122 70 -150 -39 0 107 -67 -43 18 128 6 -105 -77 -132 88 -70 17 -60 26 56
6398 56 -5 -1 -38 -114 -164 56 104 -52 294 159 -81 163 -120 44 5 113 -181 -138 -96 130 212 288 -25 -225
6422 -225 61 82 -57 -179 58 -76 -151 -118 -155 141 18 -90 156 -143 158 -39 -96 54 38 32 146 -82 60
6445 60 102 -84 -54 -27 141 -38 152 31 -142 193 -38 58 -78 -114 -10 -152 -220 166 -168 134 -80 78
6467 78 38 84 226 -178 23 -72 -97 170 -222 185 -213 135 -66 5 -39 -4 143 -206 88 48 -131 -77 112
6490 112 245 143 410 9 -284 -72 147 -58 -208 -113 -106 89 -206 -216 -57 -161 -60 39 250 -84 31 11
6512 11 138 52 93 -86 50 77 -26 10 -189 -20 61 -273 90 -105 -19 205 90 185 -102 120 -154 -68 123
6535 123 -141 -243 -119 36 187 -132 26 124 -122 109 262 -41 19 195 125 -41 -80 -146 85 -138 17 61
6557 61 -246 139 -179 56 -20 -70 183 180 116 78 107 -18 -224 -33 180 180 -183 -31 20 159 58 -180 -289 -169
6581 -169 -80 -19 144 156 -172 -89 -132 18 -14 75 -68 101 -46 -19 -270 13 -19 -3 25 -103 210 -280 183 32
6605 32 30 -42 -255 162 85 -3 42 -55 71 -221 53 13 -219 1 -21 194 73 34 192 -238 110 -56 182 -196
6629 -196 -225 229 -3 -83 187 -82 82 -81 15 20 78 27 -68 -199 -135 -1 -45 166 56 79 -138 -27 -53 -46 148
6654 148 -68 30 20 19 -131 -150 -82 -94 -71 196 -38 -82 -126 78 -98 32 -55 -65 -51 -89 -44 53 112 65 56 -6 -27
6681 -27 -109 -247 54 -87 250 29 33 24 58 -62 -218 186 -41 12 -97 160 -235 76 102 73 164 -3 -157 41
6705 41 222 174 99 52 3 107 31 72 -52 -211 55 -16 -159 -110 100 92 102 -100 27 113 25 20 127 113 114 101 -93
6732 -93 -72 -89 -60 -46 -91 35 0 51 -292 183 -6 46 -29 27 33 -92 -135 -341 -6 -155 -176 -75 209 14 60
6757 60 -52 118 74 56 297 29 -63 -86 -111 -15 -152 -73 -6 11 96 -39 226 54 -54 -46 74 137 -147 -214 -19
6782 -19 92 197 281 148 182 -28 267 50 -154 -14 -134 -132 78 -44 -92 11 105 -143 -103 -110 -97 -106 27 102 86
6807 86 39 -357 3 61 96 128 290 -317 -221 -2 26 185 -74 -19 90 -175 -176 168 -47 -80 49 397 -4 68
6831 68 123 -67 54 135 268 -36 -137 -56 -154 -71 246 -9 256 248 -54 -9 217 -11 155 -8 -182 -18 14
6854 14 187 80 -14 -76 -66 52 105 -89 108 -44 -38 -381 -119 4 71 -207 45 -21 182 -7 -6 15 5 -296
6878 -296 -33 161 -4 -208 -157 -64 0 10 35 -48 -6 149 -27 -41 -141 100 73 -212 -181 101 -105 -57 -1 104
6902 104 86 -107 -65 -156 7 83 107 -142 -163 37 -140 -32 -204 -107 107 -271 11 -177 174 -155 77 55 -51
6925 -51 7 -27 -106 62 -166 83 176 -245 191 89 -191 -129 49 133 145 -26 175 64 -16 2 28 197 289 89
6949 89 -5 -52 62 155 -102 144 -115 -191 -61 -27 22 91 4 81 -118 97 77 126 47 72 -108 11 129 -155 161
6974 161 178 71 243 112 -77 -18 48 -55 115 239 -81 -84 -73 155 -129 -152 -39 -8 -22 94 -52 -204 -65
6997 -65 -6 16 281 84 -232 103 42 -210 -157 -174 -177 -71 137 -18 75 126 43 33 -255 122 53 83 -141 -48 -175
7022 -175 -32 164 -71 25 109 -125 273 143 -117 -221 -148 -32 -68 49 -73 110 71 42 -241 69 17 97 124
7045 124 82 -7 -97 -29 14 -312 81 -8 76 -126 118 -78 146 74 -22 200 93 -61 132 49 129 -13 -25 -50
7069 -50 35 30 87 -52 -82 -325 -125 112 52 -122 15 -115 89 121 33 187 -191 199 -121 39 -176 -40 63
7092 63 125 55 27 28 -145 2 -5 10 -7 44 -44 8 -22 -40 -42 -10 -60 -105 -184 -243 54 42 -34 -82 56 105 -16 -17 -11 -4 -218
7123 -218 216 -167 150 -100 130 -125 25 -119 76 28 -104 -203 110 112 7 144 44 -29 -74 14 36 -14 82
7146 82 -2 -19 -78 120 160 -156 162 -186 45 179 81 181 217 45 91 -248 36 250 -70 -45 120 140 8
7169 8 -127 -17 -80 160 77 70 -111 276 307 56 -141 15 32 29 182 -132 -113 -20 -82 55 300 -8 19 -108 12
7194 12 12 32 14 51 -74 128 -97 135 -45 11 108 110 90 28 -13 -86 -167 -137 -124 45 66 0 33 118 69 -216 177
7221 177 140 -85 -172 41 -11 -137 -113 36 3 -10 6 86 248 160 -31 4 130 60 50 -180 226 -8 244 85
7245 85 -100 -73 37 64 100 161 57 44 -20 191 31 18 13 414 -17 55 112 -188 -90 228 71 -56 102 180 120
7270 120 59 -97 -178 180 -227 30 -30 322 -50 129 -198 -27 -62 1 164 166 -107 197 47 -175 110 -43
7292 -43 190 15 130 84 39 88 4 9 80 -17 -72 -123 -78 -11 -189 -60 50 54 232 -66 -101 -110 -41 96 -47 203
7318 203 -57 -8 -89 250 -35 -114 63 34 63 44 90 -31 -17 -13 27 67 100 -4 5 -91 15 -2 180 -172 53 -40
7344 -40 -188 190 -20 94 174 -323 65 -175 -35 -48 -81 -2 88 63 88 62 -55 -120 -374 -99 33 -121 -117 66
7368 66 38 157 -229 -2 168 7 -119 -2 -116 6 133 -149 -45 280 -78 -38 -77 -139 -97 203 216 327
7390 327 148 252 -64 26 -13 92 -109 -86 -100 -7 169 114 -171 160 166 -102 -177 -58 -132 50 85 72 99 97 22
7415 22 -67 113 161 148 111 -71 34 -38 -152 32 252 -94 -16 -70 242 0 176 -13 -112 272 8 -10 -129
7438 -129 -92 81 335 129 3 332 -3 -20 -45 288 -23 2 -46 -122 185 67 -33 107 -13 91 -198 -11
7460 -11 17 -59 26 70 -137 -135 60 -61 116 -101 -65 -139 -16 -28 42 40 -48 -5 -40 86 -46 -107 -225 0 81 66
7486 66 105 -23 -206 -28 103 73 0 -181 -100 338 -9 -87 -11 1 37 217 -21 -40 -159 162 78 237 -41 -159
7510 -159 123 162 -29 -142 -281 -48 -23 -15 339 -114 -91 205 130 0 -9 119 -85 176 6 92 64 -26 29 237
7534 237 -143 -55 35 28 -56 -145 -181 14 155 53 -31 179 30 -195 -39 120 -73 30 140 -81 -53 -177 -118
7557 -118 -106 59 210 170 148 189 23 13 -144 72 133 -9 74 393 15 93 -253 -251 258 -74 91 61 160 -50
7581 -50 -26 -193 91 -18 -137 24 191 -192 103 6 20 -169 50 -43 17 -27 -156 93 121 -21 171 -47 172
7604 172 -64 -186 -92 31 -212 -115 -138 61 -269 219 107 26 -99 70 71 254 -43 142 -26 40 -133 142
7626 142 25 12 219 -72 102 -64 136 -190 104 -130 -83 98 82 -14 153 -83 85 -114 -47 -147 80 -72
7648 -72 -109 -51 57 147 -44 173 183 -114 30 -154 -21 234 10 67 -114 -102 62 19 484 2 -288 -59 -22
7671 -22 186 -128 -90 -127 -65 200 -25 236 46 -115 235 -123 -35 68 98 71 -12 35 16 -37 -96 -170 187 205 3
7696 3 -135 12 -77 36 -61 72 190 58 14 183 151 20 201 -233 -172 67 96 -173 -12 -102 53 6 170
7719 170 7 -38 36 56 -67 43 -42 -223 -97 -157 90 -6 116 -134 57 24 99 -42 186 53 66 121 65 -412
7743 -412 -153 3 -13 -16 -216 95 -252 251 40 -109 -203 87 31 102 -254 111 -47 291 183 87 57 43 43 -111
7767 -111 -141 -55 212 -28 79 -185 122 167 212 1 56 59 83 -63 50 4 151 38 -4 101 89 12 141 -110
7791 -110 -106 -4 52 48 -118 101 111 -169 -263 -25 -107 0 -162 51 -116 -188 -50 70 34 3 -164 289 -99 140
7815 140 162 -37 -133 -44 16 -6 10 -42 164 261 170 89 57 -34 -65 -47 -100 87 -186 -23 111 -155 164 111 -95
7840 -95 -10 183 354 -129 -4 234 -101 63 25 38 101 -69 53 173 142 -103 -135 -233 47 -167 -20 -100 0
7863 0 108 92 174 -53 -56 247 208 4 -126 -104 -198 -12 -30 -76 117 -33 73 -119 -84 213 -130 79 -59 68
7887 68 101 190 -82 225 119 170 17 -35 299 145 229 -77 28 -90 50 -113 -252 208 259 -112 -121 33 129
7910 129 224 -417 108 -73 -192 -84 -255 -149 117 214 -114 5 23 58 201 -22 78 1 -128 129 128 -240
7932 -240 129 147 -100 -60 171 -85 66 -101 69 290 178 -126 -82 -156 -92 5 140 -151 -23 -61 -104 -187 -167
7955 -167 -80 247 156 -83 32 -14 -181 24 -83 16 -169 58 192 -59 295 36 -158 117 89 -119 -11 -61
7977 -61 192 -20 60 -90 88 -139 26 9 233 85 43 -91 108 85 -102 126 124 279 -86 -11 -94 221 -28
8000 -28 111 -1 137 21 -89 -59 -42 139 3 66 85 98 -61 47 92 -20 34 -48 23 53 163 142 -187 -13
8024 -13 -229 43 -18 -130 190 18 -78 -89 50 58 -36 246 124 105 69 -62 -163 -130 -217 273 -13 -3 57 -193
8048 -193 -80 -168 40 -133 -35 147 130 124 -31 262 14 -106 45 57 -2 -42 13 41 25 -172 66 322 -127 71
8072 71 19 -75 -123 55 -44 331 24 194 68 188 -185 56 8 -88 -71 47 131 132 84 -68 -190 14 349 124
8096 124 -171 118 177 -153 -29 184 -3 103 27 -72 64 125 204 -67 -46 -100 -328 -238 -37 -41 65 -17 45 36 -52
8121 -52 -131 92 157 -33 106 -75 -4 134 220 -64 -277 -122 -109 -115 27 48 158 250 239 -25 88 133 49 154
8145 154 -27 -74 0 107 -55 215 -84 27 -129 140 9 -52 227 -162 176 -326 -50 -77 113 176 280 -184
8167 -184 -22 246 -24 -25 -66 29 102 44 -18 -34 -226 -51 50 -29 219 80 -241 147 -185 -59 190 -64 -122
8190 -122 238
8191B38
$$ Imaginary data points
##PAGE= N=2
##DATA TABLE= (X++(I..I)), XYDATA
0 0 0 0 0 0 0 0 0 0 0 0 0 0 0 0 -8 8 -8 8 -9 16 -16 22 -24 29 -32 40 -47 53 -61 71 -80 91 -104 117 -133 150
36 150 -168 190 -213 237 -263 293 -325 359 -399 441 -485 535 -590 650 -718 789 -870 960
54 960 -1060 1174 -1301 1450 -1618 1819 -2057 2346 -2711 3183 -3821 4740 -6189 8827 -15277
69 -15277 70831 40949 -52022 10345 36324 -27835 -118717 -66310 36795 52585 -38182 -63374
81 -63374 -5916 45778 -44587 -126072 -90257 4964 19760 -48182 -45276 48609 102754 30611
93 30611 -49330 -34651 29556 5355 -91588 -95071 -12570 48396 -6638 -57371 -13366 57128
105 57128 28836 -61101 -78900 -9707 36899 -27427 -65538 -9746 68731 50569 -35197 -45515
117 -45515 13243 29557 -46173 -94549 -48958 31760 17114 -42161 -24400 50975 82709 12880
129 12880 -27628 18740 77802 52053 -6391 5930 80859 105562 36075 -1656 32072 75063
141 75063 26250 -50754 -46749 12085 24422 -36104 -60628 -10418 45249 6495 -53139 -41287
153 -41287 19835 29756 -34847 -52391 4478 56382 21916 -28799 -13301 46224 42877 -28018
165 -28018 -51866 -6861 35875 -7853 -54684 -27544 33093 32086 -28402 -45146 1855 36420
177 36420 -12387 -57159 -33589 24782 20019 -38143 -44867 4524 33088 -15554 -57765 -34699
189 -34699 18732 9104 -42335 -42585 14074 49557 6061 -25452 7258 58405 42434 -10225 -12293
202 -12293 38782 62745 13958 -17818 11091 57538 33132 -24862 -27399 17990 30846 -20848
214 -20848 -49908 -16965 29775 7883 -38803 -33124 17701 32878 -17244 -40559 -4471 38755
226 38755 14754 -27592 -17272 33296 43722 -4766 -25960 6935 44816 14097 -30209 -19809
238 -19809 27641 32106 -15530 -32893 2058 36089 2261 -39276 -28770 16676 17561 -31122 -44411
251 -44411 -4742 27810 -4764 -41088 -24653 22644 20066 -25385 -34775 5772 38161 4610
263 4610 -27960 -6926 39200 32856 -11858 -20186 19130 42935 5937 -25515 -6956 35437 25266
276 25266 -19914 -26127 11979 30965 -8336 -37912 -17770 21496 7701 -33132 -35709 4043
288 4043 23159 -14544 -39292 -14193 25244 10663 -27273 -24591 17995 34173 -1602 -21749
300 -21749 4571 42433 24241 -14507 -12015 27374 37121 -3664 -24933 747 32615 9293
312 9293 -27539 -24450 13424 19910 -19091 -36063 -7184 24730 3613 -28213 -18513 21898 27142
325 27142 -8023 -21296 7882 37277 13422 -17985 -8134 28941 29387 -8086 -20792 9003 33126
338 33126 5621 -23554 -13248 23575 20741 -16089 -25194 5474 27425 -1148 -29541 -16330
350 -16330 18417 10643 -25541 -33674 -3008 16138 -13743 -38556 -22323 12583 5332 -27395 -29995
363 -29995 4719 23220 -3867 -23230 -4210 30672 21374 -10156 -11985 20058 32958 2115
375 2115 -19801 -2270 26249 11177 -21013 -22642 8018 18149 -12249 -29905 -8740 21052
387 21052 7813 -20597 -16456 18782 28288 -463 -14477 8415 36697 19602 -9253 -5202 26521
400 26521 30616 -894 -16505 6353 30129 9674 -17620 -12545 19048 21164 -9205 -20898 3264
413 3264 25329 4896 -21322 -14106 16324 14139 -16076 -27210 -4098 14892 -8059 -31996 -22876
426 -22876 6723 4419 -23922 -31314 -3344 15588 -5137 -24388 -11794 19825 16188 -11410 -15709
439 -15709 10395 25892 2539 -19625 -7054 19956 10701 -18047 -23879 2432 15595 -9602
451 -9602 -27641 -12681 15041 8164 -17577 -18278 11827 24095 2328 -13077 3002 30684 20440
464 20440 -5065 -5651 20917 29624 4788 -12259 4159 27129 14040 -10693 -11266 16246 22514
477 22514 -2492 -15984 1140 24125 10266 -14298 -11598 15052 18207 -7201 -21384 -2913
489 -2913 17629 301 -22956 -19582 6889 8909 -16403 -27162 -5360 14235 -1467 -22086 -15112
502 -15112 13431 13538 -10373 -18122 2803 20633 2736 -18063 -10666 13841 11037 -13489 -22683
515 -22683 -1075 13581 -5757 -23671 -14989 10475 7293 -15490 -19455 4079 18119 1026 -15524
528 -15524 -3448 21999 15997 -5627 -9204 13822 25170 4404 -11537 847 22814 14991 -7973
541 -7973 -10555 13102 21214 488 -13881 -789 20858 11144 -10711 -11064 11494 17991 -2393
554 -2393 -16426 -2146 17021 5579 -14641 -14700 7846 12700 -7775 -19326 -3871 14388 3525
567 3525 -15758 -13393 10196 12916 -6220 -16691 -339 17138 3550 -14845 -11365 10544 11991
580 11991 -9353 -19007 -1357 13351 -786 -18344 -13638 9422 8791 -11297 -17994 598 15306
593 15306 1151 -15665 -7775 14606 12548 -6490 -12953 6588 19325 3473 -11810 -3985 17022
606 17022 13284 -6953 -11849 7820 17428 1951 -13263 -4315 15765 9981 -9195 -12873 6410
619 6410 15249 -1649 -15355 -4718 14229 7222 -11371 -13954 6858 13648 -3470 -15639 -4131
632 -4131 14410 6285 -11833 -11978 8215 13552 -3365 -15071 -1775 14889 5601 -11812 -11052 8947
646 8947 12686 -4890 -15009 -1344 14280 4104 -12607 -10200 9584 11542 -5324 -13806 450
659 450 14832 3672 -11628 -7879 11349 12255 -4715 -12140 2914 15848 4049 -10933 -6302
672 -6302 12756 11430 -5479 -11790 3857 15132 2214 -12495 -6803 11423 8636 -8100 -13633
685 -13633 2389 12174 -1305 -14667 -7525 10151 6494 -9874 -13981 2899 11190 -2192 -14652
698 -14652 -6170 10541 5815 -10012 -12649 4575 11181 -1935 -13829 -4506 11365 5333 -9643
711 -9643 -11224 5986 11615 -2064 -12592 -1969 12963 6254 -8492 -8474 8807 13023 -1458 -10432
725 -10432 1189 15234 7378 -7350 -6112 11058 13551 -973 -9541 2726 15068 6036 -7901
738 -7901 -6079 10674 11742 -2878 -10796 1685 12808 3396 -9931 -7121 9151 8799 -5541 -12096
752 -12096 993 10856 874 -11885 -7843 7820 6406 -7806 -13513 -135 8853 -1688 -13764
765 -13764 -8675 6617 4310 -9535 -13870 530 8181 -2413 -13763 -6789 7761 4312 -8869
778 -8869 -11824 2335 9162 -1919 -12325 -4371 9567 5714 -7518 -9077 5732 11175 126
791 126 -8723 -439 12988 8341 -4365 -5001 9759 13780 2397 -6540 2462 13910 8040 -4847
805 -4847 -5182 9044 11512 -544 -8879 699 11662 5196 -7093 -6435 8119 9700 -2088 -9050
819 -9050 1680 11671 4426 -7669 -5854 8136 8216 -3860 -10854 -148 8594 197 -11560 -9002
833 -9002 4703 3848 -7940 -13872 -2172 6157 -2188 -12549 -8873 4964 3987 -7800 -12069 -243
847 -243 7185 -1340 -11594 -6539 6016 4163 -7011 -10765 1906 8382 -122 -9157 -2999 9407
861 9407 7265 -3799 -6094 6725 12190 3092 -5800 644 12182 7965 -3289 -5488 6629 10431
875 10431 563 -8141 -971 9633 5428 -5822 -6636 6285 9564 407 -6858 1376 11550 6866
889 6866 -4063 -3754 7952 10178 143 -7587 715 9168 3295 -7505 -7480 4315 5186 -5015 -11658
904 -11658 -2812 5583 -49 -10676 -8673 3865 4318 -5609 -11161 -1337 6483 -205 -10067 -7191 4336
919 4336 4142 -6064 -10694 60 6669 -72 -9026 -4917 7080 6036 -3782 -6925 3621 9823
933 9823 2555 -6562 -1579 9045 6682 -3465 -6861 3553 8300 -3 -8593 -3102 6841 4344
947 4344 -5568 -7448 3749 7737 572 -7129 -170 9879 6729 -2732 -3702 7090 10381 1767 -5544
962 -5544 1430 9609 5296 -5015 -5846 4893 6501 -2447 -8817 -1865 6228 1469 -8400 -6960 3688
977 3688 4901 -3445 -9444 -939 6375 1233 -7523 -5900 4384 5257 -3425 -8175 313 6768 2083
992 2083 -6693 -4505 6307 6030 -2286 -6598 1877 8198 2133 -6376 -3145 6191 5367 -3595 -7844
1007 -7844 1339 6275 -286 -8131 -4619 4661 3115 -5326 -8028 1290 6213 -52 -7399 -2668 6673
1022 6673 5220 -3228 -5504 4072 8281 1440 -5625 -607 7703 5385 -3444 -5262 4061 6978 -318
1037 -318 -7251 -2062 5996 2729 -5974 -7039 2245 4871 -2222 -8636 -2212 5391 2487 -5834 -5960
1052 -5960 4170 6348 -815 -5957 1073 8260 4529 -3868 -2408 6803 7587 206 -5205 1963 8305
1067 8305 3385 -5038 -3911 4945 5094 -3005 -7483 -92 5398 692 -7125 -5145 3782 3818 -3892 -7417
1083 -7417 294 5462 459 -7003 -3943 4034 3446 -3786 -7087 1282 5571 413 -6550 -2673 5466
1098 5466 4372 -3500 -5550 2394 6323 725 -6507 -2529 5036 3080 -5132 -7395 761 3588 -2590
1113 -2590 -8806 -4318 3105 1633 -5830 -6398 2659 5589 189 -5026 887 8156 6369 -835 -1036
1128 -1036 7035 9171 2409 -2865 2285 8027 4643 -3369 -3462 4462 5439 -1398 -6619 -520 5446 2090
1144 2090 -5275 -4005 3742 5282 -1500 -5833 711 6124 2015 -5153 -3523 3980 3795 -2925 -7227
1159 -7227 -393 4046 107 -6739 -4136 3491 3515 -3034 -5969 1322 5427 923 -5762 -2939 3843
1174 3843 2874 -4524 -7373 -685 2369 -2950 -9076 -5953 919 -29 -6598 -7657 66 3694 -140
1189 -140 -5219 -193 6892 6047 -131 -933 6630 9026 3814 -2274 2268 7809 4947 -2038 -3046 3598
1205 3598 4941 -750 -5838 -825 4822 2697 -3693 -3226 4027 5850 454 -3926 1496 6548 3623
1220 3623 -3236 -2476 4056 4699 -1674 -5669 -485 4008 1070 -5498 -4087 2993 3517 -2446 -5524 703
1236 703 4929 1670 -4579 -2881 3490 2909 -3476 -6806 -1175 1979 -2245 -8777 -6313 -142 -889 -6365
1252 -6365 -8541 -1683 2212 -1309 -5978 -2120 4757 4674 -657 -2050 4523 7553 3086 -2134 1034
1267 1034 6347 4688 -2069 -3217 2318 4683 -280 -5260 -1401 3695 2569 -3168 -3625 2809 5166
1282 5166 870 -3352 1060 6086 4274 -1603 -1852 4135 5419 316 -4053 151 4964 2245 -3663
1297 -3663 -3246 2986 4052 -728 -4416 656 5051 2648 -3282 -2518 3212 3473 -2010 -5593 -1036 2166
1313 2166 -905 -7077 -5753 -353 198 -5154 -7572 -2111 1641 -767 -5735 -3100 2788 3550 -982
1328 -982 -2953 2474 6080 2833 -2450 -69 4827 4182 -1526 -3657 1483 3824 168 -4996 -2098
1343 -2098 2597 2078 -3173 -4467 1208 3783 336 -3748 -561 4352 3704 -1869 -2632 2934 4945 742
1359 742 -3271 363 4348 3464 -1943 -2437 3000 4413 391 -3509 255 4493 2959 -2709 -2590 2223
1375 2223 3472 -907 -4522 -993 2452 496 -4988 -4197 831 1555 -2962 -5706 -1421 2034 208
1390 208 -4072 -2930 2345 3367 -1168 -3483 1036 4558 2201 -2638 -1012 4027 3872 -764 -3200
1405 -3200 1199 3789 753 -4195 -2244 2247 2155 -2782 -4487 105 2785 -301 -4383 -2173 2307
1420 2307 2095 -2337 -3486 902 3497 611 -3080 -460 3767 3318 -1335 -2183 2518 4425 1208 -2903
1436 -2903 -215 3643 2573 -2322 -2928 1337 2819 -644 -4295 -1396 2250 1106 -3592 -3752 793
1451 793 2470 -1085 -4052 -664 2654 1673 -2528 -2352 2003 3223 -486 -3270 40 3613 2118 -1969
1467 -1969 -1153 3108 3777 379 -2292 1016 3988 1969 -2030 -1493 2523 2858 -1325 -3752 -265 2230
1483 2230 172 -4208 -3090 1023 1342 -2615 -4064 -156 2660 379 -3151 -1091 3266 3314 -888 -1971
1499 -1971 2039 4112 1396 -2545 -693 2794 2337 -2333 -3361 206 1725 -849 -4681 -2265 1100
1514 1100 751 -2934 -3507 540 2584 -377 -3182 -520 2818 1844 -1748 -1836 2058 3132 264 -2737
1530 -2737 51 3151 2108 -1501 -1775 2190 3443 398 -2184 1098 3838 2844 -1226 -690 3059 3383
1546 3383 144 -2471 188 2512 982 -3222 -2526 514 1426 -2300 -3777 -633 1800 555 -2747
1561 -2747 -1277 2259 3006 -530 -1731 1392 3409 1480 -2204 -788 1995 1967 -1886 -3253 -460 1308
1577 1308 -1036 -4445 -2908 234 315 -2964 -3629 -436 1666 -99 -3240 -1255 2013 1982 -1257 -1900
1593 -1900 1248 2705 275 -2514 -478 2172 1768 -1730 -1855 1408 3197 644 -1771 341 3505
1608 3505 2779 -833 -687 2520 3172 781 -1681 252 2714 1413 -2052 -1984 851 1701 -1383 -3396
1624 -3396 -751 1874 1058 -2332 -1254 1834 2741 181 -1651 981 3458 1746 -1407 -823 1988 2141
1640 2141 -1079 -2888 -510 1195 -314 -3726 -2749 192 344 -2526 -3496 -740 1234 43 -2663 -1147
1656 -1147 1458 1946 -1175 -2097 684 2132 365 -2319 -897 1491 1418 -1608 -2062 804 2248 297
1672 297 -1924 -151 2617 2183 -942 -1224 1785 2797 592 -1301 158 2138 1580 -1634 -2061 800
1688 800 1853 -601 -2392 -577 1546 923 -1741 -1428 1267 2275 197 -1491 754 2680 1851 -1249
1704 -1249 -670 1601 2217 -536 -1861 -307 1506 113 -2432 -1968 450 1036 -1778 -3019 -661 1065
1720 1065 149 -2590 -1399 906 1466 -850 -2008 321 1779 454 -2186 -995 1495 1623 -934 -1704
1736 -1704 455 1900 545 -2013 -627 1853 1825 -681 -1562 814 2257 551 -1932 -408 1709 1300
1752 1300 -1300 -1812 444 1770 -215 -2105 -770 1408 1142 -1365 -1391 726 1832 19 -1689 179
1768 179 2117 1387 -1188 -806 1193 1950 9 -1738 -174 1412 561 -1772 -1353 689 1096 -755 -2224
1785 -2224 -297 1286 536 -1980 -1426 794 1407 -610 -2094 38 1491 736 -1673 -920 1687 1553
1801 1553 -499 -1437 486 2119 696 -1436 -536 1629 1597 -619 -1329 516 1725 659 -1771 -622
1817 -622 1264 1365 -1025 -1571 272 1489 130 -1680 -606 1260 1276 -1219 -1483 589 1474 -89 -1734
1834 -1734 -427 1077 1049 -884 -1246 439 1200 -239 -1493 -483 1396 900 -1392 -1421 679 1190 -344
1851 -344 -1596 -468 1044 590 -1833 -1352 420 1407 -381 -1763 235 1520 665 -1141 -763 957
1867 957 1606 -188 -983 583 1856 1168 -995 -313 1229 1769 -350 -1228 329 1535 548 -1202 -611
1884 -611 836 1357 -430 -1337 153 1442 174 -1382 -569 1016 1011 -663 -1163 185 1328 241 -1446
1901 -1446 -536 914 797 -1280 -1600 36 1161 -116 -1716 -916 876 676 -1147 -1381 131 1004 -388
1918 -388 -1816 -672 648 625 -1346 -1360 329 998 -280 -1517 -342 978 673 -923 -725 662 1490
1935 1490 -108 -717 389 1578 1032 -526 -385 1274 1427 -22 -810 133 1631 840 -1019 -433 724
1952 724 1308 -366 -1015 119 1455 539 -959 -582 1118 1168 -512 -974 322 1158 416 -1293 -809 779
1970 779 805 -933 -1427 -44 828 10 -1264 -917 319 430 -1085 -1399 -157 1047 -200 -1405 -524
1987 -524 369 683 -1199 -1097 -100 761 -246 -1435 -638 712 313 -944 -995 532 1207 -3 -1036 -134
2005 -134 1152 951 -538 -458 770 1349 76 -731 198 1229 1013 -730 -434 687 1386 59 -704 70
2023 70 1308 648 -1015 -329 631 1364 -59 -720 349 1210 466 -821 -532 394 1046 -130 -978 -80
2041 -80 893 340 -1073 -711 404 908 -681 -1010 -337 898 -127 -1216 -599 370 527 -1044 -889 -1
2059 -1 746 -78 -1033 -619 587 538 -929 -1001 49 956 -105 -951 -444 630 830 -694 -710 426 1001
2078 1001 173 -677 -43 952 854 -629 -455 598 1128 195 -733 61 1137 733 -563 -580 690 920 -188
2097 -188 -656 39 1176 392 -452 -489 598 1051 -409 -714 -44 933 121 -966 -409 473 738 -420 -887
2116 -887 -171 586 232 -922 -771 361 717 -316 -835 -62 969 -96 -985 -492 410 654 -625 -1072
2134 -1072 -97 637 -220 -1040 -509 363 399 -584 -803 37 900 -233 -999 -218 504 624 -613 -568 154 1106
2154 1106 -95 -577 -180 861 706 -622 -612 231 855 -194 -848 46 681 515 -596 -688 437 703
2172 703 -267 -835 58 717 480 -634 -539 503 720 -342 -759 -167 693 282 -724 -333 436 929 -145
2191 -145 -560 -61 677 458 -639 -193 455 710 -309 -650 118 840 94 -754 -401 486 714 -408 -714
2210 -714 361 772 17 -823 -397 503 619 -592 -738 89 948 -28 -668 68 783 504 -225 -577 229
2229 229 546 -174 -779 -246 587 271 -769 -421 181 656 -184 -871 -197 564 182 -734 -601 165 774 -341
2249 -341 -577 -68 790 565 -581 -153 375 735 -126 -561 182 817 476 -616 -353 479 751 -265 -607
2268 -607 260 875 310 -568 -249 592 733 -23 -555 31 897 -37 -817 -122 526 507 -273 -508 291 363 -20
2289 -20 -645 -72 560 431 -394 -311 201 765 166 -700 -276 466 475 -733 -712 7 362 -333 -1201 -554 191
2310 191 -156 -729 -998 141 583 -189 -776 -140 423 551 -521 -388 489 816 -67 -382 40 640 388
2329 388 -505 -278 527 491 -606 -412 -6 676 290 -367 -137 685 761 -239 -470 388 949 224 -445 -85
2349 -85 640 695 -293 -584 189 492 82 -763 -183 465 804 -216 -183 514 832 411 -258 -23 642 661 -614
2370 -614 -711 -173 705 -16 -851 -686 -75 121 -908 -976 68 233 -549 -837 -146 527 374 -568 -286 355
2390 355 778 -23 -658 2 623 37 -688 -317 248 458 -306 -985 -197 347 386 -619 -406 403 795 90
2410 90 -87 238 913 273 -350 14 690 710 -228 -491 39 615 104 -651 -157 657 615 -261 -78 279 974
2431 974 512 -202 29 529 653 -420 -522 20 477 -317 -964 -466 194 -132 -566 -701 -9 370 -276 -835
2451 -835 -327 306 538 -231 -422 229 606 -115 -396 -289 527 462 -684 -364 87 273 -236 -866 -452 244
2471 244 188 -533 -518 464 572 -153 -545 41 647 449 -519 -243 244 556 -39 -522 62 484 -91 -462 -209
2492 -209 569 788 -226 -457 256 618 316 -102 -31 570 569 -123 -64 296 504 -58 -701 -422 205 292 -480
2513 -480 -633 -116 403 -258 -739 -454 312 146 -77 -280 182 677 -115 -422 -100 172 187 -464 -366 64 487
2534 487 -166 -690 -261 312 266 -502 -529 -58 298 -255 -415 -131 598 30 -469 -206 159 673 88 -356 -117
2555 -117 449 437 -530 -209 419 589 -15 -231 184 735 211 -291 -76 308 559 -28 -419 -46 702 56
2575 56 -564 -148 179 271 -472 -438 -98 331 97 -451 -244 450 172 -239 -579 19 606 2 -540 -86 489
2596 489 273 -413 -350 229 553 -13 -777 -5 641 284 -534 -275 5 345 -344 -770 -120 451 136 -394
2616 -394 -565 282 589 -188 -591 176 842 185 -29 98 595 614 -7 -648 46 397 512 -427 -507 293 210
2637 210 -534 -518 -6 328 60 -420 -400 -16 677 -251 -552 -192 643 58 -486 -473 190 311 -398 -603 -334
2658 -334 343 87 -561 -446 448 344 -55 -289 302 562 176 -93 -220 704 637 -266 -392 19 487 -153
2678 -153 -368 -438 365 146 -637 -366 127 527 -155 -366 -195 499 498 68 -128 437 718 174 -441 -181 624
2699 624 309 -336 -419 51 407 -319 -591 -284 423 55 -515 -349 203 537 -131 -442 -87 438 -59 -307
2719 -307 -511 105 173 -360 -585 -115 245 108 -525 -432 483 290 -141 -154 134 869 278 -271 -158 571 534
2740 534 -212 -261 81 386 -52 -636 -364 183 265 -432 -418 142 412 -174 -340 38 825 713 -86 -9 362
2761 362 813 357 -280 166 535 275 -365 -375 97 250 -417 -822 -517 97 -176 -597 -534 -35 235 -116 -489
2782 -489 -204 460 368 -212 -341 411 258 -230 -566 -177 137 18 -505 -426 -17 555 -146 -380 -82 374 152
2803 152 -94 -161 486 501 93 -252 -89 641 -19 -550 -426 281 267 -520 -678 -113 100 262 -371 -227 799
2824 799 600 -152 -337 340 798 -12 -629 -119 553 548 -227 -420 54 201 -159 -677 -320 16 262 -572 -214
2845 -214 210 477 -72 -467 -1 661 179 -325 -359 68 409 -152 -542 -117 183 65 -392 -447 144 237 -211
2866 -211 -483 -55 530 453 -424 -360 387 475 -3 -323 -32 340 225 -319 -675 413 390 -475 -613 -37 387
2887 387 -126 -339 -151 233 524 -251 -298 29 760 269 -88 -24 438 356 -110 -298 -10 564 -19 -213 -374
2908 -374 362 291 -499 -492 31 339 100 -557 -158 316 378 -266 -344 -11 560 -60 -426 -119 320 177 -290 -264
2930 -264 228 449 -296 -350 -112 605 205 -271 -527 322 224 -138 -569 119 274 168 -409 -456 117 336 -312
2951 -312 -364 -25 425 172 -54 1 255 633 -164 -421 -98 641 218 -206 -231 166 394 22 -402 -262 298
2972 298 36 -419 -479 337 338 -281 -557 111 561 -187 -724 -15 437 203 -67 -517 -66 440 -90 -433 -155
2993 -155 302 363 -122 -255 315 620 170 -211 1 384 128 -242 -286 217 459 -84 -447 -226 257 290 -75
3014 -75 -351 290 477 53 -451 -53 526 379 -93 -314 416 252 -220 -180 -305 685 181 -272 -277 201 196 -260
3036 -260 -679 -13 610 252 -234 -312 371 155 -205 -180 197 299 -123 -631 -571 108 -53 -350 -708 -169 507
3057 507 -64 -442 -247 459 433 -43 -377 163 534 164 -285 -259 189 427 -128 -244 48 494 175 -388 -251
3078 -251 221 305 -159 -564 218 498 65 -285 -86 638 170 -61 -223 427 573 -20 -283 103 555 267
3098 267 -137 -389 -22 427 -154 -411 -179 545 354 -352 -401 308 388 -104 -529 -221 431 -211 -477 -240 237
3119 237 337 -335 -562 -2 241 45 -436 -352 115 437 -131 -347 106 483 35 -323 -388 272 410 -58 -477
3140 -477 74 210 32 -431 -361 220 314 -202 -497 115 588 103 -340 -292 469 273 -134 -250 114 416 173
3161 173 -372 -322 458 382 -124 -316 110 293 80 -256 52 476 375 -213 -144 354 521 140 -478 -53 198
3182 198 169 -318 -593 57 31 33 -408 -79 241 158 -262 -473 353 254 4 -316 -205 491 291 -307 -498 155
3204 155 376 -182 -457 -13 442 -100 -189 -160 50 206 -256 -447 -135 532 121 -279 -350 319 278 -103 -254
3225 -254 196 394 116 -201 -128 630 345 -77 -178 79 343 276 -14 -12 445 275 33 -184 198 234 92 -378
3247 -378 -87 357 210 -196 -258 145 131 86 -482 -32 220 125 -226 -216 44 270 12 -204 -267 342 236 -398
3269 -398 -592 156 165 46 -374 137 407 -39 -437 -434 315 405 -399 -485 -109 404 56 -511 -255 179 272 -113
3291 -113 -152 -168 135 44 -425 -76 13 362 -175 -358 147 308 -56 -226 -45 67 292 -11 -351 -41 252
3312 252 151 -167 -32 392 236 -50 -412 127 301 228 -147 -173 212 137 -106 -76 133 400 -32 -385 -201
3333 -201 419 409 -124 -453 168 515 53 -391 -198 330 195 -146 -191 265 26 -145 -276 -111 93 -10 -444
3354 -444 -628 261 395 -60 -410 -97 376 27 -181 -391 199 291 -218 -288 -104 212 92 -323 -169 225 285
3375 285 23 -305 320 411 100 -178 -156 187 106 25 -362 132 306 73 -151 -31 271 22 -89 -171 250 429
3397 429 0 -350 -82 297 120 -17 -332 59 269 232 -329 -209 188 127 -248 -215 -67 163 98 -434 -95
3418 -95 191 191 80 -260 435 337 -15 -130 -51 240 359 -79 -377 283 168 36 -74 -276 151 13 -314 -253
3440 -253 -110 149 74 -302 -184 434 368 110 -314 236 143 -135 -398 -221 154 132 -192 -264 180 361 -181 -311
3462 -311 -46 183 66 -264 -159 12 362 -90 -317 -210 221 28 -345 -230 306 186 -154 -413 35 222
3482 222 279 -167 -55 332 309 -101 -254 -25 630 129 -317 26 361 164 -44 -142 -35 283 -149 -310 -429
3503 -429 198 23 -236 -562 -16 152 -60 -252 -214 39 44 -61 -36 -34 147 76 -248 217 320 48 -323 -361 243
3526 243 148 137 -419 -402 211 42 -222 -167 17 343 21 -361 7 176 16 -107 95 147 18 60 -342 -99
3548 -99 244 -76 -137 -276 211 256 222 -101 98 216 33 -174 -237 274 344 65 77 256 170 180 -114 -212 123
3571 123 23 -98 -444 15 12 -22 0 -292 264 214 -168 -256 -17 297 217 -410 -25 343 98 -229 -288 -14 -51
3594 -51 15 -415 -121 101 102 -296 -211 150 110 -188 -398 79 85 316 -228 -327 210 260 -24 -197 137 180 128 -255
3618 -255 -177 14 319 99 -118 -101 494 61 -124 -127 287 332 -80 -193 149 162 328 -359 -266 152 -25 103
3640 103 -324 83 182 -23 -248 -221 -68 115 -24 -131 124 215 142 -133 -331 138 71 -2 -328 24 159 15
3662 15 -467 -269 96 164 -14 -491 111 13 -4 -174 -84 -51 240 -272 -29 -35 358 10 -193 -105 233 -146 -66
3685 -66 -294 255 133 63 -31 81 377 189 -240 -324 -90 252 112 -214 68 292 62 -194 -208 3 145 -50
3707 -50 -201 -119 89 102 -108 -291 220 223 23 -168 -107 270 32 -182 -182 189 250 47 -485 -126 454 170 -97
3730 -97 -97 -125 91 -1 -282 -98 397 -353 -258 -338 217 181 -202 -256 154 207 -61 -100 -149 131 266 -28 -152 193
3754 193 435 141 -127 -153 217 323 -47 -138 -151 143 18 -234 172 382 126 -194 -136 40 258 -141 -409
3775 -409 105 241 198 -131 -349 164 169 135 -223 -67 154 -100 -99 -244 217 -20 -16 -361 50 -15 3 7 -58 343
3799 343 220 -129 -320 -78 199 170 -193 -53 211 55 31 -315 -64 41 29 -120 -226 189 289 -277 -243
3820 -243 325 179 85 -190 -120 352 -8 -77 -358 -220 182 160 -157 -137 -94 -75 162 -90 293 -65 194 -196
3842 -196 -101 567 289 -21 -201 205 -9 3 -130 50 111 -61 5 -154 23 69 -58 -244 96 64 84 -26
3864 -26 -78 -108 350 92 -174 43 28 280 -363 -77 -146 264 -185 -299 151 42 55 -250 -326 300 123 -61
3886 -61 -267 134 338 -19 -335 -318 260 255 6 -232 -287 84 204 -355 20 0 197 -189 -348 110 176 266 -87
3909 -87 144 212 129 9 38 160 164 4 -330 -38 39 2 107 -258 78 265 -144 -88 45 -138 131 -190 -283
3932 -283 -147 169 118 17 188 241 174 -7 98 128 148 -106 -262 -71 106 -20 -191 22 77 334 80 -169
3954 -169 183 464 268 -60 -109 168 58 -111 -378 -197 26 -19 66 -116 -64 192 -165 -317 -60 242 196 -267
3976 -267 -218 379 51 -138 -367 79 335 -111 -186 -331 63 11 -262 -107 94 18 79 -125 229 83 265 8
3998 8 -462 31 471 245 36 -82 106 160 -267 -322 -96 255 -90 -201 -14 135 -109 7 -67 -41 -43 -158 -138
4021 -138 70 302 316 -193 -114 98 304 150 -267 -213 96 158 -263 -168 -37 266 -192 -131 -123 34 107 -146 -202
4044 -202 255 128 220 -396 260 261 -243 -118 -393 126 151 265 -211 106 276 -63 108 -313 -117 220 -6
4065 -6 -276 -57 54 80 132 -54 277 54 -252 -149 109 -2 -12 35 32 2 -99 -276 -88 72 -55 181 -416
4088 -416 -65 -17 260 -117 -58 20 27 1 -66 -88 -275 178 -111 -168 -91 200 -42 -302 -94 213 -56 -113 -39 -1
4112 -1 109 -29 45 103 -116 207 44 -262 251 284 24 -198 -57 91 332 -395 -87 23 44 99 -102 93
4134 93 88 90 -145 -155 -106 210 -68 -248 217 229 133 -217 -251 283 367 -7 -59 61 145 165 -31 -194 -41 100 -102
4159 -102 -237 -119 175 -78 -86 -119 82 419 -169 -128 75 130 -25 -68 109 249 48 -330 -245 -65 85 -200
4181 -200 -199 -130 30 133 6 -63 106 149 132 -161 -50 58 -10 45 -156 125 125 20 -160 -177 99 88 -189 -95
4205 -95 -127 -115 -175 -153 -23 96 167 1 7 -77 54 0 9 1 525 44 -104 -222 22 82 -188 44 -197 152 196
4230 196 -193 34 167 1 -37 68 -61 67 144 -251 210 232 192 95 40 38 36 -17 -140 -122 -1 211 -118 1
4254 1 35 27 -49 133 -151 -66 233 37 -52 -186 106 87 25 -253 -24 20 -143 181 -97 200 75 -181 158 31
4278 31 148 -17 -44 -3 -94 139 60 -149 36 75 -69 20 -26 113 -167 -275 -278 272 -5 19 -259 -72 74 -128
4302 -128 -254 257 176 116 -44 -136 15 -53 -45 -217 -11 -39 -147 -201 45 48 27 -164 -1 -16 241 47 -1 62 187
4327 187 153 -84 57 -3 181 27 -291 -139 -14 -61 -323 -89 -163 204 130 -111 167 -265 60 -290 93 -31
4349 -31 158 52 -42 149 162 173 35 84 121 -85 -149 -102 -206 39 204 44 -31 207 76 39 -259 -36 35 117
4373 117 -261 -20 323 22 110 -212 -92 273 -113 -296 67 143 -204 -219 -44 -181 -34 417 -142 -123 176
4394 176 126 111 -285 27 42 -102 -70 -7 46 105 -107 33 244 87 77 64 -169 183 123 41 -145 -121 67 -24
4418 -24 38 -158 55 248 -69 6 -57 3 61 2 41 -149 -213 78 -206 -126 -38 -108 90 -11 77 193 21 37 216
4443 216 163 35 -256 111 -1 -226 129 -166 -54 -62 102 -210 37 35 348 132 -227 153 331 65 -101 -57
4465 -57 -104 238 -12 -63 37 340 -280 -145 108 96 206 -154 -43 242 155 -4 -143 -39 272 -80 -309 102
4487 102 297 -130 47 -239 -179 32 184 -115 121 88 34 -66 -102 -5 171 -89 -142 -29 130 279 -238 -110
4509 -110 61 20 44 -169 -263 -59 -11 -18 -143 -149 140 231 205 96 112 -37 -79 -66 -53 173 11 -273 -21 110 190
4534 190 -10 50 233 210 -179 -34 -40 -57 -41 2 -178 -29 414 112 -9 49 24 142 -57 -156 57 -14 -7 -202
4558 -202 71 150 69 -300 -220 88 154 0 72 -269 44 69 100 13 -91 146 -24 -131 -16 72 -302 -57 87
4581 87 142 89 -115 -59 16 16 -28 65 -173 69 -85 -186 120 -11 210 -33 -92 -97 -10 198 168 284 -161 -41 -110
4606 -110 -59 -112 -94 21 90 -106 -43 212 -308 -20 251 114 29 32 40 51 267 -92 -47 73 54 245 67 -217
4630 -217 -62 274 50 -117 -75 -153 34 -286 -359 -119 114 -241 163 -158 193 177 32 -219 268 210 23 230
4652 230 -97 41 -36 81 -162 145 0 -70 -174 91 156 -37 123 67 -25 -17 -207 -3 111 157 59 -33 -273
4675 -273 56 18 198 19 47 249 2 15 -160 26 -265 -116 -144 -8 164 114 194 -110 80 148 58 -85 133
4698 133 246 58 45 -12 96 22 -212 11 -75 150 50 324 17 -55 -41 -14 -2 33 81 181 40 58 -71 -72
4722 -72 6 15 -86 70 -60 249 -3 98 -82 1 -63 -1 154 -151 116 -64 77 -98 6 -31 56 23 5 -62
4746 -62 -344 152 106 39 -114 46 65 57 -39 -36 -96 -1 -95 44 -67 289 -29 -146 -32 154 -65 162 -36 -17
4770 -17 -351 13 -52 124 -118 141 127 128 46 321 -11 -24 142 -25 -35 -66 48 -54 -16 -170 -129 -222 -111 -155
4794 -155 -134 -59 -58 -33 220 -124 97 22 349 -141 -99 -37 151 0 -112 -34 42 -287 -312 -227 129 -139 -29 122
4818 122 34 110 -214 -176 16 -149 144 20 -61 81 -217 -117 14 -72 -222 247 6 141 154 -38 -113 151
4840 151 -87 152 67 -34 116 -153 -23 -129 90 -80 -164 375 -46 119 23 -101 -136 -53 -183 135 109 154
4862 154 -243 -33 -69 14 -19 3 -43 -1 114 -15 45 -115 -20 179 111 -84 -62 -57 36 102 20 27 -265 -90 -137 62
4888 62 -154 183 -24 -116 -22 -60 -40 147 -84 98 -211 54 56 98 -269 -200 180 -105 -65 -201 -34 5 -213 134
4912 134 17 17 -77 72 10 -46 316 12 -81 -47 207 17 -100 -83 89 115 212 -158 -11 -59 -86 -88 77 -69 -71
4937 -71 59 -98 -145 202 -229 -222 -7 29 -73 -24 -179 -7 -109 10 -73 -186 -3 -1 78 -36 -132 173 230 124
4961 124 132 -105 169 238 90 -211 79 151 -55 109 139 128 20 -183 -50 32 -116 -201 29 2 -12 -43 92 92
4985 92 140 106 -86 179 156 -15 106 -39 -166 -278 -86 53 483 -16 -69 -53 -83 149 -242 104 -21 -231
5007 -231 -315 -88 -76 -185 -23 -20 124 29 25 -196 212 73 170 10 -54 14 57 204 48 -64 44 -15 75 -59
5031 -59 -107 249 168 142 209 26 64 6 -7 -86 52 -28 -11 187 -240 -57 -32 83 -65 182 65 -6 -211 -95
5055 -95 156 142 -142 139 251 -49 -53 48 22 28 175 -25 -37 -229 266 155 9 62 -106 -25 45 95 -9 -42
5079 -42 168 41 -74 -95 -168 202 -97 -76 146 155 60 -111 191 -90 127 -237 -42 -32 55 -33 66 78 -227 114
5103 114 -18 -77 -50 -46 56 157 123 -37 -160 15 -194 42 -97 -45 45 -12 20 144 -242 36 -225 -56 97
5126 97 -230 -147 93 -4 -196 87 -88 -149 113 -58 123 -140 -140 -39 59 -94 -65 -43 174 111 -114 -33 -158 -187
5150 -187 23 63 -152 -4 276 -70 -130 99 54 -24 -110 -93 -108 130 -34 85 -149 -77 49 -139 -101 92 -33
5173 -33 -203 -34 -66 -88 42 -17 125 18 -66 32 206 96 73 -24 -71 -78 -105 142 123 129 74 261 -223 62 14 4
5199 4 -16 56 -119 -101 0 154 -109 -81 19 182 -78 -219 17 52 24 193 -279 -74 78 117 66 -90 -67 5
5223 5 123 -148 40 39 -32 -10 -138 24 255 -80 110 -30 -41 -40 144 -228 -131 68 128 -74 -13 -12 -47 -99 -17 23
5249 23 -132 207 34 -28 -14 23 -31 -408 58 324 -92 169 136 214 34 37 -95 -94 -51 -33 5 -68 -94 -80 106 -10
5275 -10 106 210 90 44 74 126 85 -19 162 -116 79 -103 186 227 -67 34 -108 125 28 83 60 -105 -45
5298 -45 -35 172 67 -189 15 -117 -64 -19 89 -8 32 -17 -105 -185 72 66 88 -75 194 183 5 44 19 171 19
5323 19 -149 246 0 98 184 -57 70 -99 -161 -93 -7 -80 214 126 -68 -165 -239 42 73 -38 -116 -146 -205 0 82
5348 82 70 -22 -229 149 160 -92 85 70 46 -31 -91 108 -19 11 53 -44 -164 -5 -73 -14 90 81 -167 -156 124
5373 124 -30 -191 60 83 33 -35 -109 -18 -46 -1 14 11 40 -146 57 17 -303 -53 82 60 128 65 120 22 -8 257
5399 257 207 11 -161 -76 -82 -172 106 52 -98 -124 -257 76 -135 64 -1 -125 -56 -195 -47 -196 224 214 -25
5422 -25 -45 -9 86 -151 -19 -31 26 -12 19 -24 30 65 61 -44 -19 -65 35 150 91 -58 420 -13 -271 75 129 -24
5448 -24 130 -5 57 -126 42 -117 -84 139 -123 105 363 46 -22 203 101 -38 74 -48 -67 140 -33 73
5470 73 -145 31 28 -98 -112 -119 -128 123 37 260 43 74 203 108 -30 -124 98 50 -227 28 100 133 32 -109 -157
5495 -157 211 71 6 -37 10 -146 173 33 -14 -99 -83 106 212 -33 -81 121 -32 45 72 -6 45 -277 73 37
5519 37 119 149 -94 60 -213 127 -34 -16 18 182 0 -46 318 72 59 -274 -138 -48 179 164 -140 225 48
5542 48 -116 -159 78 202 -82 -63 -51 -300 56 41 -96 17 349 54 -61 55 91 243 68 45 -78 -169 -35
5565 -35 150 194 183 -26 -56 -5 2 -26 -198 -44 125 102 105 -84 -92 -5 91 -35 -63 166 -67 -76 -244 50 -189 90
5591 90 -61 -28 106 -109 98 -182 -89 -20 151 32 78 -189 4 16 64 23 -160 -40 177 54 -82 74 -167
5614 -167 183 -97 176 160 -57 -47 -12 20 12 -161 46 -3 -118 -50 -104 -2 -150 31 80 116 6 -17 -37 -60 44
5639 44 128 -96 23 -48 -30 296 47 208 81 256 -83 48 168 71 13 -122 51 -3 31 -191 -126 -63 19 77
5663 77 -72 -81 124 17 10 -69 94 -158 191 50 -120 -44 -43 104 83 -35 35 0 -92 -18 43 27 -87 -134 180 25
5689 25 79 9 56 27 -169 -4 179 127 269 -4 -47 -17 36 69 -256 83 -234 -63 129 -22 -1 143 -64 101
5713 101 63 157 -111 42 -56 76 171 65 -139 121 1 -103 8 -52 -46 -132 -81 66 40 184 255 170 -5 -253
5737 -253 82 -69 50 -120 -15 -63 -38 -74 -45 61 42 108 -359 -25 -169 154 -198 140 69 -18 77 -154 -56
5760 -56 -155 -78 20 -8 114 -11 -15 245 -7 26 64 52 -33 -103 -139 89 119 -173 -81 35 28 -63 174 -101 -75 18 3
5787 3 123 -151 -43 57 15 -57 -27 -84 -202 -50 -162 20 200 -22 -269 -97 54 -29 109 -66 -20 -17 -122
5810 -122 87 27 81 -80 -106 -71 -173 -282 28 20 -270 -77 -284 15 -77 31 53 -10 -27 13 52 -63 25 22 141
5835 141 71 -168 -90 -153 -61 199 187 -123 -193 119 -224 93 107 91 86 0 -228 -120 -20 55 159 -128 -221 109
5859 109 -215 -64 -98 -10 -68 -147 -228 -21 224 21 -192 -49 53 180 135 106 219 99 22 -15 -221 168 126
5882 126 -3 -273 -61 126 55 126 13 -151 120 52 -94 20 -202 240 97 -9 -140 -10 25 153 -77
5903 -77 -38 50 -88 18 122 -1 -74 -57 -36 -24 -108 -29 -196 -108 30 77 -47 -72 -195 131 293 -101 34 29 130
5928 130 -75 48 91 63 107 78 -80 105 187 -3 -25 -24 98 -56 4 40 -155 168 107 126 4 -38 -2 86 186
5953 186 147 90 -85 26 -60 -5 159 35 -90 1 -195 -77 79 145 -127 -134 44 138 -47 -116 8 -187 18
5976 18 236 141 91 19 3 -244 -79 -78 -22 -13 -7 -40 -45 -159 -8 56 159 140 32 32 40 24 52 154 11 -49 121 71
6004 71 191 104 -64 -63 168 -15 -244 172 -46 -201 160 42 118 -47 -65 -24 -85 -81 7 115 -2 -6 42 19 -72
6029 -72 -45 82 -190 125 140 -88 -142 0 19 23 -54 79 340 60 99 133 157 45 -92 -182 39 -44 87 -131
6053 -131 8 -22 59 -69 -103 -216 -103 29 -171 -201 -108 0 -5 89 -21 187 47 109 -220 -59 209 39 102
6076 102 56 -100 -63 -8 50 -147 -13 -92 68 5 -60 8 -176 71 22 43 -16 -18 -124 290 117 104 3 -142 252
6101 252 -121 -19 -97 116 134 -75 77 50 -118 -101 19 139 329 126 -51 70 215 -172 -127 43 -55 -99
6123 -99 109 -8 11 -105 -8 256 -259 -260 -63 49 18 82 -105 46 29 -83 13 10 100 132 -38 214 -170 44
6147 44 212 41 5 -110 40 98 -25 -74 -126 105 -84 -100 -59 -266 55 -113 -66 -37 -74 139 -32 121 -106
6170 -106 64 47 -57 205 148 139 -76 195 114 -222 149 -14 -10 -116 203 21 110 139 54 10 58 39 60 177 16
6195 16 163 22 33 116 179 117 -197 -118 44 -2 100 -87 184 -57 -226 167 -30 68 -115 -66 -3 -258 -7
6218 -7 25 20 -41 85 20 52 -60 -15 175 -56 -107 161 -118 10 -52 67 148 -86 34 42 -115 22 34 5 19 206
6244 206 14 29 46 54 100 -161 109 -29 20 -23 137 -297 -108 -52 215 -19 281 9 24 -70 -168 136 -96 176
6268 176 -15 300 100 -8 62 120 134 35 -28 15 -64 129 204 -248 82 -184 123 -31 -81 -29 113 35 -108 17
6292 17 35 -46 -55 -101 115 90 22 -33 141 -64 67 37 -7 174 -41 138 -51 -243 127 19 206 -240 24 -54
6316 -54 -62 79 14 81 -69 -207 -98 -18 -234 -117 -18 60 63 170 -63 -65 -206 -61 59 24 -15 -18 -36 39 -71 49
6342 49 218 43 10 110 -116 -101 71 23 65 175 18 21 156 -165 41 -20 -129 -24 -31 140 -41 -221 -53
6365 -53 -21 74 -176 -136 59 -318 -273 69 134 38 -85 113 95 -93 -8 -274 53 170 -62 -76 -209 153 71 142
6389 142 -212 120 -92 19 -130 -10 97 32 -57 -25 34 -196 -25 149 -33 56 26 130 -80 14 -323 -138
6411 -138 -5 -54 210 24 15 39 214 -174 -252 -136 -104 67 101 276 79 203 -119 147 -160 111 113 240 18
6434 18 -20 -6 47 26 230 -37 -227 152 -10 102 -8 -71 138 -123 105 -186 80 -17 0 62 -161 249 -88
6457 -88 57 31 30 53 12 154 67 -20 -103 -209 -95 -149 -19 180 -90 83 279 -161 -81 76 210 40 -131 -316
6481 -316 -116 -52 89 299 32 -75 108 -123 227 24 64 -203 32 118 -30 -22 17 35 -175 71 196 97 -50
6504 -50 -67 -236 -21 -5 18 73 7 66 -15 -95 25 86 100 -56 -182 96 -139 188 -31 -153 104 -170 -68 92
6528 92 9 17 190 149 -29 300 -194 143 -31 -82 26 -71 139 136 62 210 -169 -28 102 150 -42 15 -12 46 13
6553 13 100 45 115 -60 344 158 -123 -23 155 215 93 -2 108 -107 76 143 34 -55 -76 -6 -71 27 128 -262
6577 -262 -233 -100 -204 -128 -408 7 100 181 -174 146 118 99 -88 -113 -49 11 -135 123 -47 -46 -90 149 174 -9
6601 -9 9 -49 82 103 246 -108 -270 40 -126 7 34 225 118 -26 -172 90 26 -87 56 95 19 -14 -66 19
6625 19 -28 70 -161 12 -40 119 -3 -28 -178 -98 -64 8 169 113 -114 -47 -133 247 49 38 -195 -111 287 -117
6649 -117 -186 -137 140 -125 -108 139 223 -162 -78 -402 114 -12 21 76 -26 285 -19 -29 36 -37 186 -113 -201 34
6673 34 -17 53 -84 -40 -103 130 170 -18 65 -81 -193 -83 -227 -28 -96 83 -164 -147 126 -47 115 122 4 130
6697 130 150 -240 -138 227 -49 -12 54 -319 -54 -192 -42 95 -257 28 0 68 -111 50 101 -78 -75 115 -92
6720 -92 -316 19 9 -52 7 -54 -132 134 -5 120 207 135 69 85 148 86 -240 111 -57 64 201 -80 25 -80
6744 -80 84 -64 55 -97 -9 -75 -158 -21 -13 -199 -169 171 59 -46 109 -162 -68 -253 26 -116 108 -59 -112
6767 -112 61 -266 162 -57 360 78 -65 36 274 -40 25 41 -43 97 -82 -118 -68 -91 -54 -129 145 -111 6
6790 6 19 81 0 87 -338 -57 -1 -69 -36 -268 87 39 -223 -176 -16 39 -337 107 -83 7 95 177 -90 -20 160
6815 160 -96 97 -65 135 120 370 8 -78 -162 36 -74 7 4 89 -12 -4 137 48 55 -53 -45 -142 -139 -117 -30 -109 39
6842 39 -147 -43 51 -8 31 168 242 -171 24 30 43 -106 -127 -3 -174 102 -28 -179 64 144 242 77 99 23
6866 23 27 76 193 -147 14 234 -81 12 149 109 79 -11 -456 330 210 -40 -8 7 -156 -251 107 -52 12 49
6890 49 -70 -32 -109 -154 164 138 27 -65 -98 -199 180 -98 -32 61 42 208 -6 5 -13 -216 22 131 25 -105
6914 -105 20 199 61 13 -119 61 -166 -153 31 -54 224 22 50 -239 71 161 24 -92 -23 106 19 -50 36
6937 36 330 -126 -179 84 150 -8 -46 -46 -43 213 164 157 -47 36 -28 84 -164 -70 -59 -110 -63 104 -175 35 -279 37
6963 37 185 124 -75 -226 17 128 -94 36 55 -130 7 120 -194 44 118 64 40 120 2 110 25 -25 250
6986 250 -56 92 105 100 -8 -43 48 -65 156 -94 -205 -250 -346 99 153 -216 217 -194 116 55 -141 -234 -58
7009 -58 129 -130 274 7 164 44 12 -112 -89 147 28 -169 -99 141 -15 -35 -226 72 263 -11 -95 23
7031 23 -100 -141 221 37 31 -3 56 -90 -90 -279 59 -58 -262 88 -329 29 -7 -120 -242 215 67 39 -77
7054 -77 146 80 -182 16 -21 48 -160 82 -15 -118 -33 -74 35 214 210 -17 110 250 61 -50 -142 133 -134
7077 -134 40 -38 -13 14 -74 7 -48 160 -7 88 5 -242 -24 -55 55 -301 8 -225 -158 -195 27 -326 -97 -251
7101 -251 76 -108 -210 -2 73 -111 20 -2 -69 44 -60 50 -115 -19 76 -30 220 50 -44 -50 -9 25 286
7124 286 -72 -55 -71 -89 -257 62 -33 -113 61 245 20 -21 251 47 173 -11 203 -133 418 94 104 -169
7146 -169 64 194 84 83 -23 22 121 226 75 61 -100 166 100 -237 -124 31 -62 23 -149 -156 -62 -162 -6 46
7170 46 -75 -150 -22 -147 -74 109 -323 39 -90 -71 39 -31 -60 203 104 -15 98 80 -102 -210 59 81 103
7193 103 140 45 -203 -221 125 58 16 8 133 3 17 53 65 -246 -129 48 65 19 208 -65 -206 -146 85 136 202
7218 202 -60 188 58 -184 104 212 -100 -157 15 61 -156 60 130 4 191 -4 -90 62 -69 0 -152 92
7240 92 -156 -199 -22 -138 39 289 224 78 -92 172 -205 120 184 -154 -12 32 -106 -6 170 -54 46 -81
7262 -81 65 70 -1 -127 -13 -116 -39 150 8 -47 101 -103 155 -124 89 126 61 186 -108 215 -68 22 179
7285 179 -136 65 -29 -24 0 -171 120 -29 -251 -276 229 -88 -128 121 -78 108 88 82 -33 -160 88 -28 66
7308 66 -85 1 -2 209 -120 62 236 -199 5 -78 -80 -160 -64 -8 -21 8 153 -49 6 -56 -203 121 -268 -1 -374
7333 -374 -113 -31 -29 263 -37 -162 -122 195 6 -164 -181 85 124 -93 -55 -66 -135 -21 -101 -75 -254 131 56 88
7357 88 80 109 69 -24 83 -75 -137 25 115 -8 56 74 -114 -25 -155 23 -67 73 181 -167 -120 -201 265 377 133
7382 133 -13 85 269 66 -32 144 -76 -24 -1 -105 -23 0 -44 321 2 74 51 -25 147 -100 28 238 133
7405 133 -92 -82 -84 31 -20 40 338 -140 -29 -106 -89 -10 -229 66 34 -177 -65 -33 126 218 -184 210 80 -211
7429 -211 180 -119 -234 -77 -125 -96 -48 -158 -81 -95 71 141 -58 134 336 -104 55 123 -177 -128 -65 -83 -64 32
7453 32 34 -70 -70 -58 -37 -104 -75 -22 32 -131 31 -49 94 79 12 -92 -113 211 42 13 -68 -206 -83 -32 -33 -153 126
7480 126 4 -56 -109 16 -17 17 -118 107 -21 -24 -175 96 -32 -25 -113 15 -189 52 -30 -192 127 -39 57 -5
7504 -5 -132 124 102 -42 -46 150 -9 -119 178 -146 32 -78 -163 132 -52 -171 -4 4 133 51 -115 -22 -35 70
7528 70 -170 185 -311 -49 14 38 32 -107 -168 -17 -266 36 -68 -79 -23 -134 -63 187 105 14 -308 147 -92 -167
7552 -167 -49 -175 87 85 -52 -66 57 -47 59 50 129 -193 -64 -150 -125 65 -81 133 32 30 -19 -64 -21 0 -17
7577 -17 -26 67 48 48 2 334 -2 -93 261 158 52 130 98 -1 2 104 301 136 174 159 -156 -23 -47 -113 -45 30 179
7604 179 -7 -64 -84 -123 -261 -67 -41 39 -4 -60 110 -49 197 83 114 -12 -124 107 -66 27 -156 -63 -112 202
7628 202 -15 151 -31 -135 -208 -62 36 25 -165 212 -114 28 -40 -119 156 194 159 -83 -230 -328 -68 -56 -140
7651 -140 64 -87 -80 -212 -173 21 -147 -183 -147 227 190 75 -12 4 61 -35 -170 -64 -14 -137 72 129 275 -50
7675 -50 136 -46 -32 122 -16 -52 62 57 -33 -56 102 63 -107 -79 -26 -75 -58 194 8 84 51 -42 56 82 81 130 113
7702 113 -33 -131 -193 180 72 -41 -20 -51 -166 42 25 97 46 -16 180 -58 -181 301 123 153 14 -1 99
7725 99 -59 69 -70 -41 -56 -87 14 191 -50 92 87 19 68 -10 -25 67 -244 273 -29 -3 210 213 158 -133 164
7750 164 62 -159 297 53 124 157 -54 84 -62 14 22 81 69 -67 23 171 -81 -68 129 -2 -85 305 -90
7773 -90 106 -51 116 -24 -24 56 233 -38 -110 23 38 -38 -190 -102 -157 192 -81 63 58 -48 -58 165 217 29
7797 29 12 -31 67 99 106 40 -70 -40 36 113 -73 4 61 91 -163 215 -82 -41 -201 25 -146 -94 -285 -182 154
7822 154 171 -137 56 23 171 17 69 43 -198 165 -162 95 -152 247 -64 -25 -178 98 -205 -131 77 -94
7844 -94 -101 -219 -178 -158 45 115 34 -138 -328 -97 -94 -191 -119 254 73 1 -20 -103 19 -53 -1 42 103 -81 -27 126
7870 126 -82 -184 86 -57 -142 9 -219 -144 -12 145 -18 373 -175 -115 -3 14 148 10 -105 329 -19
7891 -19 -87 -175 57 -236 -65 108 109 226 -131 -45 -62 265 -35 89 222 -8 185 -404 -91 243 22 -148
7913 -148 -88 -93 11 -192 -186 95 -27 -141 51 -62 -61 -59 43 128 20 26 208 14 -28 31 197 339 -44 -124 274
7938 274 -15 -112 138 -17 -278 -164 -153 9 52 -115 -92 61 -92 172 33 29 -4 -5 -211 -5 -118 138 172
7961 172 54 57 -65 -114 -57 73 15 -46 22 70 57 -55 -302 155 -112 -44 -179 158 16 -92 222 -31 -143
7984 -143 -74 -8 257 -65 -148 -85 35 24 117 -12 216 -4 186 -8 79 228 -99 -35 122 108 47 -115 -68 -82
8008 -82 34 -5 66 6 93 -144 166 -73 103 174 123 136 -26 217 -78 4 -89 -151 -194 39 -18 13 -94 -76 8
8033 8 186 109 146 -177 -165 154 150 115 -84 9 130 -132 49 -125 -126 103 -53 128 -95 -2 90 -54 37 18 -141
8058 -141 -122 75 -53 -41 -7 -178 16 103 -76 185 -22 -150 270 245 12 -22 -59 -37 87 -157 -292 127 1
8081 1 -70 265 85 -187 -5 -85 -140 17 114 109 56 40 -57 -44 51 247 -171 22 125 -65 277 126 122 -149 -94
8106 -94 -273 129 -27 253 15 -136 11 -245 38 271 -102 -118 50 -219 -87 28 154 50 191 55 41
8127 41 47 -123 -5 -208 -144 -153 34 -201 -41 39 169 74 170 -184 134 25 20 -37 -40 -68 -122 -82 189 -39 -109 -1
8153 -1 -58 123 142 -97 26 116 45 -26 -109 148 -157 40 271 -56 -15 179 197 -63 108 406 158 72 32 0
8177 0 -163 29 -92 -17 38 -111 -204 -53 -249 96 -64 38 65 23
8191B3
##END NTUPLES=NMR FID
##END=
