##TITLE=1H_Pr 6-D
 200.13MHz, CDCl3,
 8 sc
 
 6.2.2025
##JCAMPDX= 6.0         $$ Bruker NMR JCAMP-DX V2.0
##DATA TYPE= NMR FID
##DATA CLASS= NTUPLES
##ORIGIN= UXNMR, Bruker Analytische Messtechnik GmbH
##OWNER= pz
$$ XWIN-NMR		Version 3.5
$$ Thu Feb  6 14:16:46 2025 Russian Standard Time (UT+4h)  she@DPX200
##.OBSERVE FREQUENCY= 200.1313
##.OBSERVE NUCLEUS= ^1H
##.DELAY= (6, 6)
##.ACQUISITION MODE= SIMULTANEOUS
##.ACQUISITION SCHEME= undefined
##.AVERAGES= 8
##.DIGITISER RES= 18
##SPECTROMETER/DATA SYSTEM= spect
##.PULSE SEQUENCE= zg30
##.SOLVENT NAME= DMSO
##.SHIFT REFERENCE= (INTERNAL, DMSO, 0, 14.3821)
##AUDIT TRAIL= $$ (NUMBER, WHEN, WHO, WHERE, WHAT)
$$ ##TITLE= Audit trail, XWIN-NMR		Version 3.5
$$ ##JCAMPDX= 5.01
$$ ##ORIGIN= Bruker BioSpin GmbH
$$ ##OWNER= she
$$ F:/spectra/data/she/nmr/H-C/1/audita.txt
$$ ##AUDIT TRAIL=  $$ (NUMBER, WHEN, WHO, WHERE, WHAT)
(   1,<2025-02-06 14:15:29.07 +0400>,<she>,<DPX200>,
      <created by zg, POWCHK disabled, PULCHK disabled
       configuration hash MD5:
       00 E9 B6 7A A2 85 ED C7 34 08 36 98 17 FE 4E 26
       data hash MD5: 16K
       55 BE 05 3A A4 7F D5 39 8F 63 33 F0 99 49 B8 71>)
$$ ##END=
$$ 
$$ hash MD5
$$ 53 0F 36 3C 70 44 ED 90 58 6B C9 FB D0 59 B3 E5
##$RELAX= 
##$RELAX= 
##$RELAX= 
##$RELAX= 
##$RELAX= 
##$RELAX= 
$$ Bruker specific parameters
$$ --------------------------
##$DU= <F:/spectra>
##$EXPNO= 1
##$NAME= <H-C>
##$PROCNO= 1
##$TYPE= <nmr>
##$USER= <she>
##$AMP= (0..31)
100 100 100 100 100 100 100 100 100 100 100 100 100 100 100 100 100 100 
100 100 100 100 100 100 100 100 100 100 100 100 100 100 
##$AQSEQ= 0
##$AQ_mod= 1
##$AUNM= <au_zg>
##$AUTOPOS= <>
##$BF1= 200.13
##$BF2= 200.13
##$BF3= 200.13
##$BF4= 200.13
##$BF5= 200.13
##$BF6= 200.13
##$BF7= 200.13
##$BF8= 200.13
##$BYTORDA= 1
##$CFDGTYP= 0
##$CFRGTYP= 5
##$CHEMSTR= <none>
##$CNST= (0..31)
1 1 145 1 1 1 1 1 1 1 1 1 1 1 1 1 1 1 1 1 1 1 1 1 1 1 1 1 1 1 1 1 
##$CPDPRG= <>
##$CPDPRG1= <>
##$CPDPRG2= <>
##$CPDPRG3= <>
##$CPDPRG4= <mlev>
##$CPDPRG5= <mlev>
##$CPDPRG6= <mlev>
##$CPDPRG7= <mlev>
##$CPDPRG8= <mlev>
##$CPDPRGB= <>
##$CPDPRGT= <>
##$D= (0..31)
0 0.7 0 0 0 0 0 0 0 0 0 0.03 0 0 0 0 0 0 0 0 0 0 0 0 0 0 0 0 0 0 0 0 
##$DATE= 1738836928
##$DBL= (0..7)
120 120 120 120 120 120 120 120 
##$DBP= (0..7)
150 150 150 150 150 150 150 150 
##$DBP07= 0
##$DBPNAM0= <>
##$DBPNAM1= <>
##$DBPNAM2= <>
##$DBPNAM3= <>
##$DBPNAM4= <>
##$DBPNAM5= <>
##$DBPNAM6= <>
##$DBPNAM7= <>
##$DBPOAL= (0..7)
0.5 0.5 0.5 0.5 0.5 0.5 0.5 0.5 
##$DBPOFFS= (0..7)
0 0 0 0 0 0 0 0 
##$DE= 6
##$DECBNUC= <off>
##$DECIM= 32
##$DECNUC= <off>
##$DECSTAT= 4
##$DIGMOD= 1
##$DIGTYP= 9
##$DL= (0..7)
0 120 120 120 120 120 120 120 
##$DP= (0..7)
150 150 150 150 150 150 150 150 
##$DP07= 0
##$DPNAME0= <>
##$DPNAME1= <>
##$DPNAME2= <>
##$DPNAME3= <>
##$DPNAME4= <>
##$DPNAME5= <>
##$DPNAME6= <>
##$DPNAME7= <>
##$DPOAL= (0..7)
0.5 0.5 0.5 0.5 0.5 0.5 0.5 0.5 
##$DPOFFS= (0..7)
0 0 0 0 0 0 0 0 
##$DQDMODE= 0
##$DR= 18
##$DS= 0
##$DSLIST= <SSSSSSSSSSSSSSS>
##$DSPFIRM= 0
$$ [...]
##$SUBNAM0= <"">
##$SUBNAM1= <"">
##$SUBNAM2= <"">
##$SUBNAM3= <"">
##$SUBNAM4= <"">
##$SUBNAM5= <"">
##$SUBNAM6= <"">
##$SUBNAM7= <"">
##$SUBNAM8= <"">
##$SUBNAM9= <"">
##$SW= 18.0517328524113
##$SWIBOX= (0..15)
0 0 2 0 0 0 0 0 0 0 0 0 0 0 0 0 
##$SW_h= 3612.71676300578
##$TD= 16384
##$TD0= 1
##$TE= 0
##$TE2= 300
##$TE3= 300
##$TEG= 300
##$TL= (0..7)
0 120 120 120 120 120 120 120 
##$TP= (0..7)
150 150 150 150 150 150 150 150 
##$TP07= 0
##$TPNAME0= <>
##$TPNAME1= <>
##$TPNAME2= <>
##$TPNAME3= <>
##$TPNAME4= <>
##$TPNAME5= <>
##$TPNAME6= <>
##$TPNAME7= <>
##$TPOAL= (0..7)
0.5 0.5 0.5 0.5 0.5 0.5 0.5 0.5 
##$TPOFFS= (0..7)
0 0 0 0 0 0 0 0 
##$TUNHIN= 0
##$TUNHOUT= 0
##$TUNXOUT= 0
##$USERA1= <user>
##$USERA2= <user>
##$USERA3= <user>
##$USERA4= <user>
##$USERA5= <user>
##$V9= 5
##$VALIST= <valist>
##$VCLIST= <CCCCCCCCCCCCCCC>
##$VD= 0
##$VDLIST= <DDDDDDDDDDDDDDD>
##$VPLIST= <PPPPPPPPPPPPPPP>
##$VTLIST= <TTTTTTTTTTTTTTT>
##$WBST= 1024
##$WBSW= 4
##$XGAIN= (0..3)
0 0 0 0 
##$XL= 0
##$YL= 0
##$YMAX_a= 11359
##$YMIN_a= -10335
##$ZGOPTNS= <>
##$ZL1= 120
##$ZL2= 120
##$ZL3= 120
##$ZL4= 120
##$ABSF1= 10
##$ABSF2= 0
##$ABSG= 5
##$ABSL= 3
##$ALPHA= 0
##$AQORDER= 0
##$ASSFAC= 0
##$ASSFACI= 0
##$ASSFACX= 0
##$ASSWID= 0
##$AUNMP= <proc_1d>
##$AZFE= 0.1
##$AZFW= 0.1
##$BCFW= 1
##$BC_mod= 2
##$BYTORDP= 1
##$COROFFS= 0
##$CY= -3
##$DATMOD= 1
##$DC= 2
##$DFILT= <>
##$DTYPP= 0
##$F1P= 0
##$F2P= 0
##$FCOR= 0.5
##$FTSIZE= 0
##$FT_mod= 4
##$GAMMA= 1
##$GB= 0.15
##$INTBC= 1
##$INTSCL= 1
##$ISEN= 128
##$LB= 0.25
##$LEV0= 0
##$LPBIN= 0
##$MAXI= 10000
##$MC2= 0
##$MEAN= 0
##$ME_mod= 0
##$MI= 1.114404
##$NCOEF= 0
##$NC_proc= 0
##$NLEV= 6
##$NOISF1= 3.799351
##$NOISF2= 2.8
##$NSP= 1
##$NTH_PI= 0
##$NZP= 0
##$OFFSET= 14.38212
##$PC= 1
##$PHC0= -267.0213
##$PHC1= 14.79221
##$PH_mod= 1
##$PKNL= yes
##$PPARMOD= 0
##$PSCAL= 0
##$PSIGN= 0
##$REVERSE= no
##$SF= 200.129724274929
##$SI= 16384
##$SIGF1= 3
##$SIGF2= 2
##$SINO= 400
##$SIOLD= 16384
##$SREGLST= <1H.CDCl3>
##$SSB= 0
##$STSI= 0
##$STSR= 0
##$SW_p= 3205.1282051282
##$SYMM= 0
##$S_DEV= 0
##$TDeff= 0
##$TDoff= 0
##$TI= <>
##$TILT= no
##$TM1= 0
##$TM2= 0
##$TOPLEV= 0
##$USERP1= <user>
##$USERP2= <user>
##$USERP3= <user>
##$USERP4= <user>
##$USERP5= <user>
##$WDW= 1
##$XDIM= 8192
##$YMAX_p= 0
##$YMIN_p= 0
$$ End of Bruker specific parameters
$$ ---------------------------------
##NTUPLES= NMR FID
##VAR_NAME=  TIME,          FID/REAL,        FID/IMAG
##SYMBOL=    X,             R,               I
##VAR_TYPE=  INDEPENDENT,   DEPENDENT,       DEPENDENT
##VAR_FORM=  AFFN,          ASDF,            ASDF
##VAR_DIM=   8192,          8192,            8192
##UNITS=     SECONDS,       ARBITRARY UNITS, ARBITRARY UNITS
##FACTOR=    0.0002768,     1,               1
##FIRST=     0,             0,               0
##LAST=      2.2672688,     0,               0
##MIN=       0,             -10335,          0
##MAX=       2.2672688,     11359,           0
$$ Real data points
##PAGE= N=1
##DATA TABLE= (X++(R..R)), XYDATA
0 0 0 0 0 0 0 0 0 0 0 0 0 0 0 0 0 0 0 0 0 0 0 0 0 0 0 0 0 0 0 0 0 0 0 0 2 -7 8 -8 8 -8 8 -8 8 -9 10 -15 15 -16 16 -18
50 -18 22 -23 26 -28 31 -34 38 -41 49 -52 57 -66 76 -87 101 -121 150 -182 225 -726 11330 6966 -7579
73 -7579 -5948 422 2510 1700 -659 -3095 -899 2583 1692 -1056 -1 -427 -1090 1878 2151 -876 -644
90 -644 -130 -1562 66 3351 -68 -4434 -976 3440 1223 -1775 -1359 -486 873 2614 370 -2470
106 -2470 -439 1191 296 730 362 -1293 -776 1078 194 -1119 445 -58 -2173 887 3610 -938 -4098
123 -4098 -214 3127 2081 -221 -2360 -1870 1849 2905 -772 -2247 334 1045 -342 258 -216 -1636
139 -1636 364 1518 -821 -671 1389 -333 -2109 587 2438 -2 -1680 -561 433 1340 1217 -1688
155 -1688 -2288 1492 2513 -659 -1599 -538 -100 1134 1422 -1018 -1802 859 1496 -974 -706 1087 -191
172 -191 -994 775 742 -538 -599 -741 -180 1796 1107 -2115 -2049 1267 1966 -149 -894 -744 -313 1521 1231
191 1231 -1771 -1377 1495 1022 -721 -343 213 -300 -269 210 118 288 235 -1180 -859 1666 1193 -1589 -1199
210 -1199 823 1059 435 -663 -1496 -58 1973 892 -1687 -1098 998 729 -398 -218 -279 30 744 -176
228 -176 -637 545 327 -1007 -266 1206 538 -1001 -742 179 559 858 -193 -1629 -241 1699 451
245 451 -1199 -615 403 687 460 -445 -794 215 839 -170 -605 474 408 -814 -235 626 202 -56 -442
264 -442 -582 411 1077 -302 -1419 -203 1310 601 -771 -804 -108 730 818 -567 -990 499 815 -372
282 -372 -437 189 89 -193 -50 146 75 133 -243 -628 394 968 -226 -974 -49 603 536 -120 -800 -288 714
303 714 687 -502 -862 174 669 -39 -238 -34 -130 195 172 -311 58 403 -211 -376 138 544 38 -546 -343
324 -343 336 604 98 -779 -568 751 741 -417 -605 -31 478 384 -368 -435 101 319 105 -379 -107 356 -10
345 -10 -372 55 332 123 -255 -505 140 690 151 -558 -399 370 616 -199 -629 -167 386 378 -151 -429 -48
366 -48 328 95 -169 -157 77 166 -120 -158 250 149 -109 -300 40 430 181 -309 -327 149 546 192 -561 -363
388 -363 381 291 -77 -285 -293 278 384 -108 -364 61 261 -3 -293 35 299 -127 -123 32 59 386 -92 -489
410 -489 -3 515 113 -489 -271 275 232 52 -165 -307 100 510 -156 -456 157 257 -134 3 62 -60 36
431 36 45 -97 -53 287 -69 -457 -50 515 -19 -285 -17 -39 74 349 -158 -464 178 397 -82 -312 26 101
453 101 -40 205 -44 -323 176 244 -373 -111 374 -102 -323 84 200 -69 -14 -45 -238 87 501 -209 -503
474 -503 315 379 -236 -48 29 -193 180 217 -280 -238 332 93 -436 -4 299 -242 -287 309 11 -117 300 -174
496 -174 -356 327 294 -370 -261 326 123 -119 144 -41 -356 234 303 -399 -120 395 -161 -213 321 37 -233
517 -233 131 143 -202 16 329 -160 -394 347 202 -349 44 137 -187 52 331 -309 -194 433 119 -385 20
538 20 321 -194 -84 267 -222 -240 409 -44 -367 270 196 -386 -7 301 -3 -218 160 -22 -200 306 211 -445
560 -445 -56 389 -151 -244 272 -80 -203 154 172 -297 47 319 -197 -131 366 1 -426 175 199 -275 74 252
582 252 -330 -77 366 -54 -292 152 134 -224 -4 257 -222 -81 427 -153 -393 300 162 -300 76 177 -328
603 -328 -96 295 -74 -207 262 135 -374 70 377 -236 -201 284 -78 -200 319 -2 -316 151 204 -219 -95
624 -95 279 -61 -224 239 38 -370 161 179 -213 -44 300 -202 -200 286 88 -240 154 181 -272 -45 329 -127
646 -127 -235 309 23 -394 224 213 -320 60 297 -255 -254 213 63 -292 97 136 -277 18 306 -169 -99 334
668 334 -102 -283 278 198 -247 -20 194 -186 -111 244 -5 -323 198 165 -316 29 336 -222 -134 280 -124 -247
690 -247 175 86 -231 36 231 -234 -178 378 -51 -339 226 189 -332 100 226 -241 -74 247 -74 -272 206
711 206 114 -251 63 336 -278 -212 349 -41 -284 219 10 -297 168 221 -202 -79 279 -71 -238 218 129 -333
733 -333 58 257 -248 -70 280 -151 -225 262 -4 -297 135 214 -219 -79 308 -71 -295 244 86 -321 107
754 107 182 -210 -2 299 -62 -205 220 88 -301 95 194 -181 19 317 -98 -210 278 20 -250 144 188
775 188 -294 -108 230 -90 -149 167 58 -239 64 173 -243 -76 273 -203 -176 248 48 -209 53 128 -157
796 -157 -32 231 -56 -164 178 37 -204 130 135 -175 -36 200 -139 -130 142 26 -170 59 94 -119 -17 220
818 220 -84 -68 260 32 -235 151 74 -152 22 133 -68 -58 81 28 -156 68 133 -194 -19 199 -125 -82
840 -82 156 8 -71 92 29 -119 27 145 -89 -72 90 -26 -108 133 109 -145 38 29 -89 -2 150 -48 -71 109
864 109 18 -227 -14 104 -99 -123 86 21 -106 103 94 -75 38 85 -82 -48 88 40 -72 44 106 -36 -65 79
888 79 -88 -131 91 -16 -68 82 -2 -127 15 43 -31 -36 28 107 2 5 46 -111 -25 58 -90 -7 66 -72 35 34 22
915 22 -30 -20 77 -37 -34 56 -37 -97 75 -18 -40 -11 28 -93 -30 25 -81 -27 -2 -43 4 -41 50 -82 -32 41 -7 -74 16
944 16 14 -71 35 -14 -13 -20 -9 35 -10 35 11 -50 -27 50 -24 -43 27 25 -8 -1 -32 0 42 1 -8 -32 -17 48 -40 54 56 -51 14
977 14 -22 32 23 -61 14 51 -45 -19 70 -30 -7 20 -86 -18 0 4 -13 -31 48 -53 -35 47 2 8 27 14 29 41 30 -87
1007 -87 27 42 3 -16 69 26 -26 -9 13 -26 -37 48 -18 1 135 -3 -42 103 27 -43 -29 100 -25 -27 36 -10 -85 101
1035 101 -5 -100 79 153 -143 -63 82 -40 -36 37 46 -61 40 52 -59 -110 116 17 -60 70 84 -133 -48 79 -102
1060 -102 -56 36 -11 -84 65 67 -84 -6 109 -52 -53 175 20 -104 91 65 -83 24 83 -56 -41 119 6 -145
1084 -145 99 107 -180 73 143 -83 -92 102 -12 -100 123 18 -151 57 127 -92 -72 215 -36 -157 163 99 -195
1107 -195 70 129 -178 -49 154 -40 -145 100 8 -129 -41 137 -67 -53 113 -52 -180 131 46 -182 104 138
1129 138 -91 -19 153 -92 -155 92 85 -200 10 176 -106 -127 245 -75 -195 161 36 -139 97 150 -161 -84
1151 -84 180 -45 -208 149 53 -232 23 130 -164 -7 197 -98 -142 93 30 -168 0 82 -186 -73 123 -122
1173 -122 -181 165 26 -234 47 204 -133 -52 167 -45 -125 131 78 -137 64 108 -155 -80 234 -60 -191 158
1195 158 71 -139 44 158 -121 -59 147 -24 -89 127 71 -185 52 135 -195 -55 203 -65 -145 163 78 -118
1217 -118 61 83 -141 -63 184 -20 -184 168 55 -196 62 148 -89 -25 153 -5 -62 119 66 -175 73 177
1239 177 -161 -75 184 -2 -82 143 -1 -128 144 91 -126 -75 138 -129 -121 130 86 -183 72 140 -211 -46 184
1262 184 -109 -131 150 60 -144 65 115 -146 -38 166 -67 -147 126 17 -97 115 115 -166 -23 145 -79 -53
1284 -53 150 60 -134 38 90 -93 12 105 -112 -76 157 -35 -100 130 91 -171 1 115 -148 -32 95 -26
1306 -26 -158 98 65 -113 3 131 -120 -81 156 34 -144 91 -10 -66 13 98 -76 -52 86 -9 -135 102 73
1329 73 -160 -12 70 -96 -55 150 9 -76 88 16 -111 -30 180 -118 -65 85 4 -160 23 76 -150 65 76
1352 76 -88 -83 136 -62 -101 69 27 -107 43 175 -61 -73 56 -76 -66 130 50 -44 57 92 -29 -42 106 -23
1376 -23 -86 42 12 -73 64 91 -61 48 108 -33 -22 85 -9 -102 -3 125 -31 -61 65 6 -80 83 30 -118 47
1401 47 71 -92 -11 113 -18 -104 83 31 -14 66 72 -44 -30 129 -63 -95 44 0 -81 -27 74 -55 -9 89 -37
1426 -37 -45 41 13 -103 94 35 -30 4 41 -74 -89 132 -9 -104 52 3 -71 -10 -50 -41 -56 21 10 -57 62 72 -115
1453 -115 -11 80 4 -72 41 28 -25 44 49 -54 -7 82 -6 -78 23 13 -62 90 37 9 17 -21 -9 -49 44 38 -5 0 44
1482 44 -58 -12 39 -38 -25 2 33 -18 39 -11 -37 32 -9 -42 0 32 52 -5 7 63 2 -16 37 -38 4 5 -66 -11 -7 52 -38
1513 -38 44 -12 51 -14 18 59 15 29 -58 -1 -28 7 -25 12 -13 22 -54 12 -34 -23 10 10 -55 -22 -7 -66 56 -16 6 30
1543 30 -15 -37 17 -10 -28 42 -3 -59 7 -11 4 -19 -42 61 -14 -5 -51 -20 -12 43 19 -51 9 37 -8 28 -5 28 -23 9 -75
1574 -75 -16 12 -39 -46 -58 52 -12 -26 23 30 5 -2 -51 -73 22 78 16 -9 104 -4 -53 38 19 -60 -20 -35 -62 -9 91 -49
1604 -49 -19 26 3 6 -8 61 -4 -57 70 25 -59 51 23 -47 26 51 -5 -8 55 2 8 80 59 -100 1 44 -44 -22 35 -24
1634 -24 50 -26 19 -31 45 1 -80 -7 57 3 -98 20 29 -46 72 33 -79 -9 83 -47 -55 41 1 -59 16 45 3 54 49
1663 49 -3 -86 29 14 -101 62 18 -78 -1 49 -64 -20 60 35 -12 7 58 -61 9 71 -51 5 71 -10 -38 78 44
1690 44 -59 23 36 -28 -14 31 39 -16 66 31 -114 -19 43 -66 -21 102 -31 6 26 29 -30 -5 100 -83 -12 92 -27
1717 -27 -115 10 52 -107 20 30 -48 14 19 28 -24 98 -3 -72 -34 14 -6 10 97 -47 -26 97 6 -70 -20 87 -22
1744 -22 12 109 -38 -29 73 3 -84 58 51 -46 0 63 -56 -4 77 21 -57 63 56 -68 -13 43 -5 -50 -5 42 -68 -26
1772 -26 28 -33 59 120 -69 -80 43 65 -46 48 -21 -49 47 123 -84 -21 78 37 -55 -17 8 3 47 55 -3 1 59 -35 -81 -4
1802 -4 99 -122 -7 110 -35 -73 105 -35 -22 34 29 -31 -9 104 0 -69 -11 15 -97 72 10 -91 -11 42 -58
1827 -58 -43 42 26 -24 79 -22 -95 9 59 -143 -95 77 17 -60 44 17 -55 -3 22 -45 -36 107 3 -79 62 35
1853 35 -52 -17 -3 -12 2 73 -65 -51 104 13 -106 23 35 -36 -53 -20 -42 -14 68 -21 -69 31 88 -67 -1 10 -11 -17
1881 -17 32 13 -21 55 25 -63 -17 126 -15 -74 14 17 5 4 -8 -111 -83 80 -50 -33 -6 60 -8 -3 0 -30 51 -1 -34 28
1911 28 149 16 -55 36 17 -16 -16 -43 -25 11 53 -79 -71 48 54 -74 3 76 -8 -25 27 -32 -25 53 -38 -92 -20 17 -1 39
1941 39 99 -11 -7 40 60 -73 20 88 -16 -27 7 36 38 29 4 -46 15 37 -57 41 82 -4 -106 59 21 -6 16 7 -34 65
1971 65 63 -19 -52 91 16 -32 -16 -3 -24 -23 6 -28 -16 80 -45 -64 5 51 -60 -56 34 24 -32 6 7 -52 91 53 -47 -18
2001 -18 15 37 3 -2 18 3 31 -8 -71 -21 28 -25 -42 18 44 -30 -21 8 -67 33 -28 -47 -85 41 8 -34 -67 1 -9 25
2031 25 34 -32 -42 17 9 -25 -5 55 23 -49 36 32 1 -50 9 -67 -15 1 -55 -28 32 20 -11 14 -58 47 -6 -32 -73 50 29
2062 29 -51 -65 53 59 22 61 -4 -35 19 13 -14 -76 10 -24 -17 11 23 -73 6 47 -13 -18 20 -31 -7 -10 13 3 3 -43 -21 -4 0
2095 0 -14 -89 38 27 -33 -66 3 20 -29 -19 -27 41 -44 26 -28 -33 31 47 -13 -18 -25 1 1 -50 3 64 46 -21 18 48 -22 -25 -31 22
2129 22 -12 -32 -24 -4 -11 26 33 -21 -28 -10 50 -12 -15 -29 -41 -5 -29 20 78 5 -79 -85 -78 12 -20 -38 -18 40 62 -56 17 -16 -17 75
2163 75 15 27 -17 -10 -14 22 -74 19 37 31 9 -68 -38 -12 -6 -4 -23 -23 3 -45 84 75 27 -53 35 16 -32 5 -11 21 33 -19 19
2196 19 38 -21 17 21 -18 -76 16 39 -50 -8 16 -52 16 36 -56 23 -37 -17 9 29 -10 -48 -19 24 -35 -1 93 5 -12 31 10
2227 10 -58 30 76 22 -9 13 26 -9 83 -51 38 26 2 -24 -53 -18 -12 1 15 4 -60 2 -20 8 -50 63 56 -72 31
2256 31 39 37 16 7 -67 -6 -17 -23 -64 71 -10 -16 -26 0 38 -13 54 -16 -9 18 64 -9 -19 33 -20 23 -10 -4 -71 7 -39 -15 5
2289 5 -9 -17 -24 82 30 -22 60 18 -11 45 52 -9 -3 100 -69 -31 -31 34 8 45 -21 -36 -13 78 -5 -4 -2 36 -60 33 -34 -16 21
2322 21 6 -21 -39 -25 26 -18 -37 57 -3 -4 60 -32 13 60 64 -41 8 8 -35 29 29 2 -41 -11 49 11 1 29 -77 -21 38
2353 38 34 23 -14 31 -26 34 -22 -50 -54 28 -30 -50 -4 5 -23 -2 17 -13 -25 21 -38 -38 51 28 4 -16 0 -39 -29 51 7 1 20
2386 20 -22 -77 -12 27 -40 9 62 -4 -56 22 -17 3 5 69 21 -3 58 13 -6 -18 -5 -23 -23 28 -31 32 7 18 -36 30 106
2417 106 -47 30 57 -26 -11 50 -60 11 6 -7 -10 18 -14 2 -1 -14 26 -2 32 53 -32 13 8 -10 5 20 -57 -10 40 42 47 30
2449 30 28 -38 -10 10 -33 -34 -53 -26 2 1 33 -34 38 72 -61 -97 19 22 -58 56 6 1 -23 3 -21 8 45 -17 1 27 12
2480 12 -10 -9 7 -66 -49 10 -33 12 18 32 -19 -6 10 -28 -29 3 41 -46 -1 55 -79 -25 4 -10 41 9 13 -58 15 -22 -49 -23
2512 -23 16 -35 -32 -21 5 1 -4 16 -72 42 49 27 -20 44 -20 -13 -3 53 1 42 7 -80 39 55 -7 -40 -35 15 -30 -18 28 -37
2544 -37 22 29 41 -16 53 -54 -11 72 -33 -6 -1 9 11 -4 -3 -32 -7 -6 22 -7 -19 88 37 27 50 -4 -33 -34 -23 -55 -19 23
2576 23 -41 1 34 7 -16 -17 62 -19 -43 49 30 14 -6 -56 -31 61 15 2 1 8 -28 -14 33 20 29 23 48 -26 31 -7 -17 -45 -34
2609 -34 -25 -26 37 7 -14 45 43 -19 -25 10 32 -30 -36 -20 -34 28 -12 -9 18 -44 70 -34 -33 -35 -12 -26 -62 16 3 6 -42 -20 -26 42
2643 42 -6 26 14 18 39 10 -27 -12 32 -9 5 -39 -1 13 -69 -14 -18 -71 -41 -67 10 -19 3 -11 45 -4 -4 23 -12 30 25 29 12
2676 12 -27 -33 6 -78 19 21 -43 27 35 -64 -13 -2 38 -32 -36 1 -11 -64 5 22 -1 -4 -8 -4 26 2 36 -24 26 -47 -58 -34 -26 -2
2710 -2 -59 -29 25 23 -22 -31 20 -28 -15 -12 13 -25 -47 24 -17 47 18 1 26 4 -14 6 -5 15 22 23 44 -11 8 31 -7 -7 29 -17
2744 -17 11 -17 16 11 3 -62 25 1 32 31 17 0 0 21 17 -12 2 0 -7 20 -1 11 -13 -3 -27 38 4 28 24 -44 13 -36 -11 -13 -10
2779 -10 -10 -15 -12 -17 61 43 41 29 -13 -50 8 43 -25 -5 -34 -3 37 77 -4 -20 12 -38 54 -42 41 -9 -44 29 38 -18 -22 -42 6 14
2813 14 23 -18 -46 -18 38 -2 -20 57 23 -2 -38 -18 -30 -2 -14 16 -7 1 -4 -18 -18 -21 -18 42 36 -17 -30 -19 -11 -51 -5 27 -15 1
2847 1 9 -8 19 11 1 52 -22 42 -62 2 54 51 3 58 44 -15 -17 -28 10 26 -10 15 5 -10 15 61 52 -32 4 27 -28 -72 31
2880 31 -14 -58 -14 22 -65 34 32 -40 -41 -11 -9 -42 1 7 13 -33 39 20 -102 -7 -11 -19 10 -31 -68 -79 27 1 -8 59 47 -55 -11
2913 -11 7 2 4 14 -28 -45 20 0 -5 10 -16 -17 30 49 -38 11 -36 73 0 26 -31 15 18 39 0 -54 3 34 -62 3 3 -14 33
2946 33 9 0 -16 71 52 -27 -37 -8 -3 45 -2 -10 35 16 -30 10 -11 14 -34 28 10 26 -86 -17 29 -13 -31 6 12 -21 7 -35
2978 -35 3 -34 -7 -32 63 4 -6 21 7 -43 -17 -25 -3 25 -21 30 -20 23 43 -21 -4 32 42 -30 50 -27 -76 0 -44 4 3
3009 3 -13 39 -5 -21 13 -17 13 11 14 -43 53 -20 -18 36 11 -34 -36 -13 21 7 51 -1 -33 8 5 -24 9 -13 -3 -55 38 1 -10
3042 -10 35 32 -32 6 69 -66 24 -19 19 36 -23 -45 -58 -33 30 -8 5 -59 -15 8 30 -19 3 -25 46 -8 -36 -3 -30 -38 26
3073 26 40 -7 7 -40 -4 19 45 -12 -7 17 7 -34 9 19 16 -2 -5 9 -43 40 50 -18 -5 -12 8 -34 13 -68 -27 43 -31 21
3105 21 -78 -14 22 -31 52 47 21 -6 8 -28 10 -7 -32 87 -5 -60 -68 -17 36 -16 -34 -3 -2 49 -9 10 -17 39 47 -40 -45 10
3137 10 -69 27 -23 4 26 -9 -20 -25 -15 33 -50 -32 15 -2 49 -13 70 -44 15 17 -75 -8 15 39 -5 35 9 -20 0 -5 -15
3168 -15 23 43 -57 -16 -39 18 21 -6 15 -45 16 3 6 -7 1 35 -2 -5 -10 -15 2 34 24 1 8 1 75 1 55 32 -3 8 32 -22
3202 -22 36 10 -21 -17 7 -28 101 9 -50 -2 60 14 11 -31 -12 4 -40 7 -34 57 10 -39 -53 7 -35 28 -22 -24 34 31 -8 5
3234 5 -23 24 32 0 -41 -81 12 -8 -59 -20 -22 13 -19 -34 17 36 19 -8 71 50 7 53 6 -17 -23 44 35 -41 16 8 17 19 11 10 16 -12
3270 -12 52 -4 -53 56 -20 -44 27 -58 27 16 -4 -30 -31 -37 4 -12 -23 7 8 -32 16 45 64 40 10 15 78 39 34 5 0 -3 11
3303 11 -74 -3 -37 21 29 -54 -4 27 29 13 21 -8 27 18 17 59 56 1 7 13 57 24 10 -10 -16 10 -32 43 16 56 55 -13 2 -10 -34
3338 -34 -17 3 8 25 30 21 -26 7 43 -29 -7 11 -60 -19 -54 -56 29 30 0 -20 -22 -67 28 19 22 19 -60 -2 10 32 -1 47 -22 14 -20
3373 -20 -32 8 21 -25 -9 24 53 34 10 -25 -36 2 12 -20 -20 22 -16 -31 14 20 -47 -9 66 -10 65 21 -16 -53 -60 -25 -16 -17 36
3406 36 -28 11 -55 0 13 -8 62 -14 42 15 -5 -11 -1 15 56 -32 19 23 34 4 -6 9 -9 19 -10 -30 -25 18 -41 -3 47 -70
3438 -70 73 -34 -7 -22 -11 4 7 -11 56 13 -18 -17 -14 17 -17 -2 -34 69 -22 4 -39 -18 20 -30 -1 -11 -69 30 -5 -14 -17
3469 -17 -3 19 22 -29 -39 56 -42 -77 2 -42 -3 26 21 27 -22 40 -18 -62 -8 -5 8 -9 51 -51 -18 10 -58 -42 26 -18 -43 -20
3501 -20 29 -19 0 64 -5 20 -5 -30 -37 20 -28 16 -7 24 64 -23 -10 -24 -42 50 -4 -4 -9 24 -30 4 36 -60 -19 55 17 -20
3533 -20 -7 6 54 -27 44 -38 19 9 49 -7 42 -28 -43 -14 -11 30 -8 16 -2 12 11 2 -2 2 30 24 26 33 9 -55 49 -15 -64 -16
3567 -16 -24 -10 -61 -8 -32 -24 -34 33 -16 52 -16 46 -15 49 56 -4 -5 -60 17 21 28 -13 -66 38 -54 17 -22 10 -26 -15 63 13 -33
3600 -33 -41 68 29 40 -18 -26 4 -44 -34 -12 29 29 -28 -42 -28 -9 -19 -65 -35 25 -41 -4 -51 27 -5 27 36 0 -27 -30 24 20 -28
3633 -28 6 40 -3 -14 33 -49 0 23 -7 -69 -63 -47 -32 -51 -24 27 20 -44 45 -37 -59 71 26 -32 21 -55 -17 -16 -9 48 -20 8
3665 8 -34 54 -45 -47 34 25 -55 25 -39 11 -10 -14 50 -14 -1 11 67 26 6 42 -8 -15 -16 -71 -38 -9 15 -38 -24 -14 46 -17 -46
3698 -46 12 -5 2 -16 -83 41 16 -26 -15 52 12 23 -23 -44 10 8 -18 -59 -26 27 11 42 34 -16 50 38 -4 -38 29 -14 9
3729 9 -34 0 -4 10 -29 -42 -28 -32 2 -8 -14 -38 27 36 -41 -32 -26 -36 -84 -34 -5 -39 -39 14 -4 5 -16 -44 -26 -70 -1 8 -15 -23 30 13
3765 13 -43 23 -9 -25 8 -4 17 30 -32 5 -4 -52 -18 -62 -22 -5 -22 24 2 3 -32 -37 32 12 -29 10 16 -23 20 -3 16 -16
3797 -16 -91 35 -55 45 17 -50 7 -14 4 16 -17 18 49 0 -76 -46 19 -28 19 7 28 -5 13 17 34 5 59 -5 -43 -29
3827 -29 11 -33 61 7 -12 -24 29 -51 -38 22 2 2 -26 16 33 23 15 42 57 -30 6 -43 15 17 -55 33 -47 67 9 32 39 -44
3859 -44 15 -11 -6 -9 -9 -23 11 -40 -21 13 -11 24 -26 -28 11 3 29 -29 6 -17 -1 12 -34 -2 -16 -37 17 5 -31 66 16 16 -10
3892 -10 -6 -13 21 -55 -3 12 14 -19 48 25 11 -31 -22 -63 -17 -67 -42 17 11 -15 -42 -1 -18 -13 -1 10 12 -53 -39 -9 6 -17 -22 43
3926 43 26 76 54 -29 -6 20 -5 -1 -3 50 -33 1 -7 -6 -19 -47 11 -34 -52 29 -43 6 -13 -34 -30 4 17 2 -48 26 32 -36 -21
3959 -21 -21 16 -6 13 -2 69 -29 6 52 -57 -25 -13 -54 39 -47 16 -39 43 -8 18 -60 -51 13 23 -42 0 9 -6 -21 -24 -5 34
3991 34 -22 13 6 1 13 2 -35 43 -3 -6 6 -35 -41 -7 -77 -19 -25 -6 -21 -38 -20 7 -24 44 63 -51 37 12 -15 -40 -9 -18 45
4024 45 60 35 -40 -24 -18 -60 -7 64 10 -33 24 10 -40 3 -16 -53 1 32 20 48 99 16 23 22 -7 -41 14 37 95 25 0 -3
4056 -3 12 53 -12 -6 -33 12 -33 -5 5 -5 -25 -24 42 19 -40 -5 -55 -37 -19 10 -66 8 22 3 19 18 61 -30 26 -4 -9 36 -24
4089 -24 52 14 73 -14 -45 -5 -5 -19 4 -23 16 -12 -36 50 -21 6 13 -60 29 45 2 13 -22 -24 42 53 -1 4 -52 26 1 -11
4121 -11 10 12 -50 -35 -5 39 -11 3 57 -11 22 -14 -69 6 5 -35 -50 17 -33 67 49 -25 32 -22 -15 7 -5 31 10 -14 9
4152 9 -16 -37 31 -30 -13 -5 73 -10 57 64 -32 -10 26 -12 32 8 -42 15 -40 -4 -51 -76 -4 9 -40 44 -25 -4 -25 -5 0 -31
4184 -31 1 -20 19 33 -25 -11 -16 32 10 17 42 -18 -37 0 -17 19 -47 20 44 34 1 27 7 1 3 -28 -42 -9 8 -32 -13 -46
4216 -46 24 15 11 -1 63 -19 -1 21 -24 26 8 3 41 4 -13 20 -59 -19 0 4 2 33 32 18 -7 -14 22 -37 5 9 5 16 1 -5 35
4251 35 -47 -10 -17 -28 1 -24 7 -36 21 -37 49 -19 7 6 -77 -46 47 52 7 -3 -14 26 -6 -57 -23 -6 -38 18 -5 -22 25 -44
4283 -44 9 9 24 -5 -75 62 44 24 12 -50 -22 45 -35 -18 -6 -32 -8 23 36 -6 -51 -64 -41 -6 12 32 -4 23 -17 9
4313 9 -17 -18 26 -3 5 28 -33 -48 48 -4 -26 -24 17 -34 -20 -16 36 9 -17 5 -20 33 -55 15 24 -13 -4 -23 32 11 -2 -11 10 -8
4347 -8 0 15 -33 52 -19 -30 15 2 16 -19 -69 9 -25 5 -3 -50 -9 -11 -35 20 -5 -33 18 -8 36 -19 7 0 20 61 38 5 -2
4380 -2 30 -37 -24 23 14 -9 -46 -1 -19 25 -33 14 5 -15 37 31 -16 60 -1 -44 -11 29 -7 8 15 23 6 32 40 -12 1 64 4 11
4414 11 -4 3 59 27 -15 15 19 26 36 -24 0 -28 -46 21 -11 -34 65 7 12 -3 60 -12 24 -19 37 20 39 49 5 -6 -20 -16 -8
4447 -8 -27 42 -16 -33 6 25 12 2 -23 -1 15 -34 23 54 -2 48 21 29 23 -69 -39 26 53 -27 43 8 6 -9 -29 12 21 -3 7
4480 7 -14 -7 0 -10 7 -40 -4 -3 -30 14 -19 6 18 -11 4 -10 -11 20 -25 -21 -5 -21 -6 17 26 11 26 37 -5 21 -28 -47 37 -7
4514 -7 -2 -96 -19 10 -27 -38 -51 -30 -31 32 -13 -36 14 -48 47 -37 39 -44 14 -39 -1 40 -49 -23 -5 -17 -22 3 21 32 -9 11
4546 11 39 9 41 40 -2 -60 18 15 35 30 11 3 19 15 9 -1 -40 39 2 13 -9 20 41 -11 21 43 53 -35 54 32 -16 6 51
4579 51 13 30 24 -25 -51 -78 28 -21 -63 -19 19 -8 41 10 32 -32 46 42 -53 17 -37 -46 8 14 34 -61 -22 3 -31 66 8 45
4611 45 25 12 24 27 27 5 -45 10 -19 -18 7 -22 11 30 17 14 -16 -8 27 22 -49 -1 62 -28 83 16 -54 46 -78 8 -14 -3
4643 -3 -39 -41 27 -18 -22 -26 8 -30 -35 -58 16 -2 26 -54 20 -29 10 46 1 2 -47 25 25 -50 -62 -9 -13 10 30 15 30 4 89 -30
4677 -30 17 25 27 -42 67 41 21 17 -33 -10 -35 42 39 25 -49 29 43 -19 -20 0 4 74 -21 -21 11 -17 -18 29 49 16 36 3 36 -7
4711 -7 8 56 43 -46 12 -6 36 24 -8 1 -33 19 -2 -10 -4 61 -80 -24 -23 12 76 23 -35 29 -10 -11 -18 31 13 -30 27 56 -14
4744 -14 15 -24 -60 -22 -19 26 31 13 20 -34 -2 31 -12 22 12 58 -52 4 60 27 -43 59 28 6 30 -12 8 -6 -4 -35 77
4775 77 -15 32 -6 -37 -17 -21 -12 5 15 19 69 -4 2 22 19 -13 -20 34 -16 -30 21 43 24 30 32 -20 -12 -7 -33 -12 -5 -22 52 39 -6 13
4811 13 -16 -16 49 36 4 44 -26 -29 -14 84 -5 -6 70 -1 -6 24 -55 112 -21 -34 -4 -5 11 2 56 4 15 -7 -10 -73 32 4
4843 4 48 9 -18 -12 -30 31 38 -10 26 -38 -26 -11 46 -58 -14 32 -17 -13 28 -12 32 8 8 -56 -21 -3 35 -16 -56 5 -38 -5
4875 -5 -10 -50 12 20 -23 35 1 67 -4 62 7 5 -82 43 35 29 40 12 -32 -29 40 33 -16 4 -46 -79 2 -24 27 -31 -8 5 -1 75
4909 75 26 3 -54 16 -23 12 36 20 16 -39 56 -38 27 -16 -42 45 16 -58 42 -11 8 2 8 5 9 -17 -9 4 32 33 -1 33 -8
4942 -8 -50 11 -11 -19 -5 -51 20 31 3 45 27 -12 47 50 7 44 79 -22 -6 -11 -6 23 16 62 5 29 44 32 2 -43 -1 41 7
4975 7 -25 -23 -59 7 25 9 43 -12 -19 -34 13 -30 11 43 -21 -6 -48 55 13 -38 32 -27 21 -6 0 -8 6 78 69 -45 -23 21
5007 21 -9 0 -21 8 48 17 16 22 3 8 20 -15 28 3 28 21 25 12 -1 -7 31 58 -17 -35 12 -53 -23 26 -27 -1 19 50 -5 28
5041 28 12 -21 64 49 -37 -5 2 -53 56 -7 4 -7 -48 -4 -5 -17 36 20 10 10 6 53 27 -73 12 72 8 3 -7 -3 2 49 -3
5074 -3 47 -9 56 -27 22 11 -1 16 -28 8 -51 -47 13 19 -48 -4 48 25 61 -64 -9 0 49 47 20 19 -64 -8 -25 31 -1 39 30
5107 30 -1 -41 -2 36 6 -16 -23 -34 -20 32 9 -22 5 10 -40 10 -2 11 25 9 8 22 -8 22 27 6 -45 77 10 -27 8 -43
5139 -43 -23 12 15 3 5 4 14 12 19 -37 -7 -26 -19 -50 -24 -12 75 -5 -22 16 -4 28 -7 23 -9 -25 18 2 41 1 14 11 23 34
5173 34 -15 31 1 35 -60 66 62 19 57 -9 26 5 10 30 36 -35 19 -46 28 -19 36 -47 -32 1 25 83 27 -14 -9 -3 2 -3 27
5206 27 54 -3 -10 3 47 -8 29 -39 -3 13 21 -29 5 27 30 46 8 19 -16 7 -52 10 14 55 -23 18 68 -8 6 104 -10 -3
5238 -3 -10 9 -47 -19 6 -52 -19 -76 19 -1 -49 -8 54 -23 17 30 -27 24 39 32 45 -56 25 5 67 -15 -51 10 52 -40 33
5269 33 34 11 -15 -34 44 5 8 20 -23 7 -25 -27 -23 -25 29 -1 -10 -19 8 6 9 -38 25 -20 21 11 9 31 32 -13 23 -21 -2 45 -5 34
5305 34 15 23 -12 -18 -35 13 -16 9 35 36 -27 -64 -23 -40 -42 28 53 -6 11 6 -4 -17 -8 15 5 64 28 -15 -33 -13 -19 29 -28 8
5339 8 10 -18 53 58 24 -15 45 -19 17 27 19 -15 40 9 -23 26 32 50 -48 -29 -44 -44 -78 -16 19 -53 -9 26 -24 -28 -55 -35 28 11
5373 11 -30 8 4 -28 2 18 27 -8 -16 9 11 -50 35 -8 4 7 12 23 -7 -1 35 21 22 23 -13 -9 30 -27 -61 -21 -20 -22 51 100 24 -25
5409 -25 3 -17 8 18 -28 -27 7 27 13 28 13 -28 27 -13 -25 -12 35 0 6 24 17 -37 55 61 -16 -34 14 62 4 29 15 2
5441 2 -8 -49 9 53 8 9 2 14 -14 38 -10 19 7 -4 13 -7 21 10 -17 15 -11 -44 -6 -30 21 -10 -12 19 47 -16 -5 34
5473 34 42 -4 37 -42 -20 -33 1 -42 3 31 -27 -6 -56 -27 -9 -34 -4 5 -14 74 2 32 -22 33 -14 19 -22 45 -4 -28 8
5504 8 -44 41 -47 -28 -24 -10 -33 3 -29 -13 -17 23 36 0 10 -7 25 -35 -33 -41 26 -1 -32 -9 -22 -10 -63 -19 -15 -37 74 24 -23
5537 -23 -29 20 28 -8 2 -34 -2 9 -21 -24 6 23 -7 -48 -20 -13 -24 -36 -24 42 -21 -4 -4 -51 -17 -69 -5 7 -10 6 -54 -3 0
5570 0 -11 -29 -20 67 -11 -23 8 -58 38 -50 -10 -60 -1 -41 -4 -2 -14 18 1 19 -24 11 -4 -18 -18 25 11 16 -14 10 -3 12 -3
5603 -3 16 17 23 7 24 19 61 -51 7 -3 17 44 -26 6 -3 21 25 12 -24 6 -22 -20 -31 -29 -17 -13 -58 -39 5 25 1 -5 -6 -19 -24 40
5639 40 31 -25 -17 74 -25 27 -70 -15 -11 -76 -2 -25 13 -2 14 -17 -41 -5 -46 15 -5 -18 -44 -60 -5 38 1 13 16 5 27 1
5671 1 -15 35 -65 -28 -5 -2 10 -27 37 36 54 41 20 -15 1 -29 -32 23 5 -28 13 -1 -54 7 10 34 43 14 -16 -25 38 -20 0
5704 0 6 11 4 34 96 22 14 24 24 20 -22 13 17 15 -4 -11 11 -34 -41 -7 15 -11 -24 -8 35 -33 68 -12 12 39 -14 13 7 -27 -39 10
5740 10 14 -32 -37 5 62 -5 6 -46 17 62 41 12 -19 10 -44 -6 17 -36 -2 -37 -13 22 -55 51 50 -5 -30 -4 3 65 36 24
5772 24 -6 5 41 42 51 -11 -14 9 21 -19 21 21 0 -32 75 18 32 -22 89 -29 41 -11 21 -26 5 -10 -2 36 3 -4 -56 -2
5804 -2 -44 -4 23 -9 -32 -28 -71 8 56 0 6 -13 -21 -23 -43 -9 12 -9 -66 3 -67 -20 37 18 -49 26 -8 19 -18 -9 14 -8 -19
5837 -19 -33 7 -25 26 51 37 -18 -3 -44 13 10 9 2 58 25 33 49 3 -15 2 0 39 -16 -33 -50 17 36 17 -9 20 -32 -7 66
5870 66 -50 -53 11 32 -10 25 18 19 -21 15 -14 -30 3 10 -53 37 -9 -23 -24 -34 -54 15 -30 20 -1 66 -3 -29 15 13 8 -26 6
5903 6 10 14 -16 -36 25 -37 65 8 25 3 26 -12 -25 -22 -36 -12 -51 -8 33 6 -12 37 12 -32 -4 13 26 -26 -6 14 -10 47
5935 47 13 9 -23 8 37 -27 -20 41 -7 0 48 6 52 -18 18 -34 29 20 20 16 0 19 -20 -7 -17 12 1 39 -8 2 0 -35 -5 -20
5969 -20 -54 -22 -23 22 -11 8 3 -26 -20 -14 40 27 -2 18 19 54 19 12 37 -39 -13 68 -42 -44 -40 13 -46 36 -49 -21 -24 3 33 -23
6003 -23 -18 -32 -10 -36 18 4 -33 -48 1 -34 36 -66 -25 -76 -49 -28 -32 25 -2 -39 11 -15 4 -25 14 18 -8 -28 -11 38 36 17
6035 17 -26 -27 -14 19 -68 22 1 -11 17 6 20 -13 1 25 -2 23 -36 -7 6 -27 -5 -31 9 -41 -49 -16 -32 -23 -2 16 1 0
6067 0 48 1 0 1 3 -36 -29 -36 -24 54 -50 26 -1 -60 -50 55 -34 -19 -10 41 19 8 -7 9 -8 -3 -17 14 78 -54 -22 -2 -9
6100 -9 10 84 2 -35 -26 -23 64 62 9 10 2 -48 -26 22 13 -23 -29 -29 1 18 24 -22 -86 -6 -8 60 44 12 17 23 -30 -27 25 -37 -26 -15 23
6137 23 22 -6 25 -17 11 11 -20 22 7 -28 -69 -60 52 -31 6 -13 -6 1 -65 52 -49 50 -71 38 55 35 -10 -25 66 28
6167 28 5 -10 3 -21 -36 20 4 -29 -1 -26 21 -27 13 58 33 -22 -38 -42 -37 -13 -7 7 -24 -6 16 10 -30 16 13 -9 -21 57 23
6200 23 36 65 -36 -18 -15 -3 16 30 -31 -10 36 -21 26 36 -19 -24 12 5 -10 -9 4 -2 6 -46 -3 29 -24 16 -39 -32 -48 20 8
6233 8 -42 15 -9 -16 -32 -4 -16 47 35 44 24 19 -21 -46 46 -18 -2 -2 -26 -9 42 10 48 -43 19 24 -64 28 61 29 -24 -23 -18 -8
6267 -8 10 24 -17 -13 -59 44 -55 0 25 32 30 2 6 0 -11 -57 -42 14 -31 -39 -2 -56 76 -60 67 -21 -52 29 -49 26 -69 37
6299 37 -16 -64 10 1 3 41 2 -17 25 -11 -7 -9 12 20 5 -9 18 -29 -16 38 13 -3 62 -58 19 56 13 -9 -40 -16 82 5
6331 5 10 32 19 -3 29 58 7 -10 17 35 2 15 12 -9 -23 -21 -38 -22 -18 1 43 -4 -2 -35 -30 -60 -26 42 41 -34 37 18 -49 31
6365 31 2 -23 -35 -15 -24 10 1 9 -6 35 48 18 -20 18 38 -35 1 14 -26 -31 -20 22 -10 -31 14 -82 23 -4 -7 -29 -58 9
6397 9 -11 -4 -21 -48 -10 3 -4 -26 30 8 -32 11 -11 35 20 -19 66 -15 4 4 12 -5 -13 35 -7 3 40 10 36 -27 23 37 3
6430 3 9 -49 -33 20 19 -31 10 -9 -37 3 16 -5 0 -31 22 35 -6 27 -41 -8 40 5 -25 7 44 54 35 -17 -10 -30 -39 49 63
6463 63 -47 11 -9 69 -16 15 -49 -8 1 -4 17 1 15 -27 -25 19 -6 5 -5 -20 -3 -21 -21 9 -35 -59 -23 -12 -2 20 -14 14
6495 14 -12 -18 63 -21 33 -3 30 -14 20 -6 4 -27 -13 8 -15 -25 40 4 -58 66 50 13 -25 -6 -23 42 4 -45 9 34
6525 34 -18 -1 -77 5 -23 -46 -31 -8 15 -7 6 -56 -5 -11 -47 -16 11 -4 47 -11 34 10 5 34 7 -61 -54 -8 28 13 0 16
6557 16 39 25 14 -12 -17 -4 -36 -7 0 -45 15 -2 -2 -28 49 6 35 4 -32 39 -23 -18 47 32 -5 -41 -15 -4 0 65 21 58 83
6590 83 -20 92 22 -55 -28 1 24 -1 1 19 -11 -20 -17 15 -73 50 -4 -31 16 -17 -30 -3 1 31 5 -11 16 -25 -3 28 -16
6621 -16 20 13 -15 6 -7 -41 -12 -1 -36 1 20 42 -2 19 -11 -19 -3 -1 43 70 45 0 -6 -37 15 1 7 -74 -4 -21 12 -57 -50
6654 -50 42 25 17 -26 17 55 -11 9 -41 -62 14 34 26 -27 -22 6 -19 3 -14 -14 82 -15 23 -41 58 41 -30 21 -28 10 -51 -32
6686 -32 -32 -46 37 55 -20 13 -61 16 -29 -32 -29 52 -27 21 0 -22 23 26 -6 -32 5 5 8 6 -36 -13 -18 -15 36 -13 -47 -33 -39 5 -5
6721 -5 -13 8 30 40 -11 -9 -38 41 -24 -1 35 -27 -29 22 5 -49 16 12 6 -38 7 -34 -12 -7 21 55 -17 27 76 -26 19 -10 0
6754 0 0 28 4 12 19 25 67 20 -49 -43 19 13 2 0 5 -28 26 40 -1 0 -31 -13 -19 12 -45 -20 -38 -6 -22 27 -12 -7 -4 -37 23 -45 -41
6791 -41 43 -9 -18 -3 17 -16 35 -3 49 -38 3 -8 -4 38 34 -16 15 33 -38 -19 5 16 -12 45 13 -28 19 -7 0 -24 -64 -22
6823 -22 31 11 -3 43 19 41 -39 -7 24 11 28 0 41 -11 -17 8 -22 41 4 -36 -45 -15 -12 15 -27 5 40 -12 43 15 -31 28
6855 28 -5 -7 1 0 6 23 -68 39 -43 11 8 -16 -33 18 16 -22 6 -67 19 -18 36 32 13 -51 -17 -35 -54 32 -38 2 9 9 43 6
6889 6 -5 -34 4 39 14 -30 40 -38 -12 0 23 -49 -8 -2 -38 -32 40 43 -12 -13 0 -4 30 -57 1 -24 -10 44 -14 -9 -8 15 -32 -4
6923 -4 -16 -37 34 -52 2 15 -18 19 -18 2 37 16 -2 -6 53 -5 -15 -11 -25 35 -28 8 -15 37 -25 39 29 -25 10 20 -12 8
6955 8 -15 1 42 -38 -1 -10 33 11 27 6 -14 -1 -21 31 28 11 8 -40 -17 12 65 57 14 48 -29 -2 20 11 0 -23 32 51 -77
6988 -77 44 30 57 7 -27 45 54 8 -23 3 40 6 1 -26 8 9 12 25 -33 40 -2 -30 17 -28 -1 51 -22 46 -16 -4 12 -36
7020 -36 23 19 -28 3 -40 22 -8 -39 11 -20 32 -52 -29 45 21 6 17 26 -3 -23 71 47 75 -17 23 -8 -11 3 -24 16 31 1
7052 1 -7 21 33 23 13 3 18 7 21 35 35 -2 -19 39 -48 24 23 -35 13 19 -16 39 56 -23 33 -70 -5 5 -9 -64 -67 3 -47
7085 -47 19 14 6 -35 24 -6 8 28 7 58 35 -5 -47 12 35 10 -12 32 -13 -4 -12 37 -17 -36 -55 -32 -3 0 33 25 -14 -33 -32 24
7119 24 14 55 -59 15 3 16 33 6 38 -12 -6 -42 76 23 107 20 20 39 33 33 -15 12 29 46 12 -36 -47 45 -41 65 -29
7150 -29 17 34 2 -4 16 -37 -42 -18 -2 -39 -57 18 12 15 20 -27 -31 -24 7 -30 42 -18 -17 -16 -35 20 -6 -40 7 33 13 19 -22 20 35
7185 35 11 -13 53 -43 -19 -10 -49 -45 8 23 2 -12 -25 -14 25 -43 -16 -20 -21 -18 33 -26 -13 -24 37 19 24 21 26 26 -21 -46 35 -2 -51
7220 -51 -40 7 7 -8 38 53 2 -13 -10 1 -25 -12 41 -71 -32 -25 37 -10 5 1 -46 0 -48 20 62 52 -8 -27 -34 -10 20 14 45
7253 45 17 -7 -19 33 34 -17 -8 -12 -43 19 63 -57 -16 35 -12 7 -19 -6 17 31 2 42 20 -15 50 -22 -29 -35 57 -56 -41 3
7285 3 -2 -35 7 -35 -19 27 -33 3 -43 -72 15 2 39 33 46 9 22 -27 -10 -29 -15 -51 14 18 -33 38 26 15 37 40 20 -20 61
7318 61 -30 -19 43 -12 20 47 -46 -9 -15 -32 11 17 0 -17 -17 -14 -12 52 24 -34 -41 -26 4 67 19 -6 -21 23 49 60 28 5 54
7351 54 25 24 4 7 -6 -16 19 40 46 -11 -1 1 45 15 16 -10 -42 1 -27 49 -4 8 -61 -11 -3 -19 -22 4 -67 -22 -45 -19 16 4
7385 4 -20 -53 54 -24 -2 15 12 4 -1 -49 -12 16 -13 -52 47 -3 25 12 1 1 -5 1 -20 27 48 6 43 9 -24 -18 1 -47 -22 -1
7419 -1 25 -44 -11 4 1 -30 16 -32 -34 58 -32 22 -57 14 -17 2 1 -70 -37 4 -20 -23 35 20 -63 -12 51 44 6 13 32 -7 -14 0
7453 0 -32 -64 -14 -6 42 -25 12 20 -44 -40 20 -5 6 -14 13 -53 -29 -18 -13 -16 75 -14 7 38 10 28 -2 -21 -19 -10 6 -15 -37 54
7487 54 -30 -8 -4 -26 41 0 12 29 35 -10 -20 -9 -14 -45 -20 23 -38 56 -16 -48 28 -12 8 43 -36 -26 37 -17 3 -3 33 -19
7519 -19 46 -35 64 0 17 -23 -26 15 71 33 50 -4 18 47 5 32 -4 11 -5 22 8 2 34 -37 -23 2 -25 41 32 -38 8 -17
7551 -17 24 13 -25 26 17 74 6 -29 -12 43 2 20 8 13 -4 -24 41 11 -6 34 8 11 -11 6 -48 12 35 8 57 63 23 31 -57
7584 -57 11 53 28 -8 6 14 7 48 5 -18 -34 -29 46 -34 -23 -15 64 -21 23 -26 -15 -6 -11 -39 50 -3 60 -44 -7 -30 9 22 13
7617 13 54 28 22 -42 -42 -29 37 -50 -8 -27 -9 19 21 36 3 -48 -44 -15 -28 3 32 -32 -9 2 -19 -21 -18 32 -13 2 -16 39 -10
7650 -10 -7 11 69 -42 22 17 -3 29 -4 -24 -13 12 -11 -6 -30 2 -9 25 -5 -7 -22 23 -22 38 -37 -10 10 -36 -1 -38 37 32
7682 32 -50 38 17 11 38 7 19 -59 -6 8 -11 54 -63 16 19 -45 6 -10 -34 16 25 20 -17 -1 -18 -45 -27 -24 -36 -4 -19 22
7714 22 25 -23 -5 7 -5 -34 13 -10 -29 -6 14 14 60 60 10 24 0 25 6 -49 -7 -8 -15 -7 6 44 -38 15 14 -3 23 -27 1 14
7748 14 -18 -4 15 -6 31 -1 16 -17 20 -49 -14 25 -7 18 -11 12 44 -33 -37 25 -16 -25 41 17 30 8 -48 -16 51 -18 -10 -9
7780 -9 -19 10 40 29 70 26 19 63 5 2 -16 53 -24 -21 -61 -18 -17 8 -45 -2 -31 -12 -28 29 -4 -39 -39 -34 -25 -36 -122 3 7 6 74
7815 74 33 -10 8 -57 29 21 6 32 16 1 70 34 2 20 -3 27 -3 28 -5 -2 50 -21 -15 -4 -23 9 8 -1 57 5 9 -44 -59
7848 -59 -24 -52 -16 36 -3 -24 -31 -13 20 -4 2 -23 45 1 18 49 18 36 -36 44 22 9 32 -29 -22 -17 41 -4 0 -48 -31 9 25
7881 25 -11 -15 -30 36 47 -4 46 -17 -2 -24 5 38 -30 41 16 -22 18 -10 2 6 -68 24 -4 36 29 -38 -16 7 2 61 36 0
7913 0 -34 -35 -27 -9 12 23 -26 -20 -26 12 6 -39 -10 -14 12 -18 29 -1 -77 -43 -38 -1 37 -13 -14 16 -15 -7 42 19 22 38 33 13 15 41 4
7950 4 -13 -15 -31 -13 18 12 -20 -1 38 3 -7 -40 -21 27 -10 -22 13 12 10 9 -27 -39 -15 12 -27 -34 -36 0 -9 7 56 -38 25 1 5
7985 5 -21 -67 -35 -10 0 21 -90 18 -17 56 -28 24 26 2 26 -5 15 5 -43 -10 -16 -4 11 -77 2 -17 -29 36 37 51 -21
8016 -21 -2 77 -28 -11 -20 28 -31 15 -4 22 -26 -7 34 -1 3 14 -28 -21 23 8 -29 -16 -20 -10 16 -69 -29 -17 -14 16 4 -24
8048 -24 -30 23 27 20 4 7 -33 -42 -41 -55 6 -51 -16 49 -17 -27 -24 24 -10 -26 51 -5 -60 44 -19 -31 11 35 4 14 -28 16 42
8081 42 -20 9 -2 17 -17 25 39 33 16 -14 -18 -34 -36 -4 -9 -10 -39 -4 -5 32 -24 21 9 -25 -76 13 51 3 -25 29 2 -35 8
8114 8 31 50 -2 39 -10 -38 38 -6 -18 -5 32 -15 1 -5 -32 67 14 -56 36 29 -49 -5 -24 18 3 6 53 82 22 -30 -1 -6 -19
8147 -19 -24 -36 42 -24 -43 14 15 -5 -17 44 53 -13 -62 0 3 -9 41 -10 -2 72 40 -42 -25 32 48 22 -21 -18 30 -60 12 8 3 6 -60
8182 -60 36 -22 9 -44 -36 -23 9 -60 -46
8191d6
$$ Imaginary data points
##PAGE= N=2
##DATA TABLE= (X++(I..I)), XYDATA
0 0 0 0 0 0 0 0 0 0 0 0 0 0 0 0 0 0 0 0 0 0 0 0 0 0 -8 8 -8 8 -8 8 -8 10 -16 16 -16 18 -24 24 -26 32 -32 38 -40 46 -50
45 -50 56 -62 67 -75 83 -91 99 -110 122 -134 148 -164 182 -204 232 -262 301 -350 410 -498 625
66 625 -826 1205 -2158 11359 9358 -10335 -5527 2767 4776 -50 -1518 -3337 -696 2535 1143
81 1143 -2362 -954 -265 -275 1186 2078 -1253 -1389 750 -66 422 3000 -189 -3899 -564 3940 1021
98 1021 -2999 -1473 572 960 1704 -493 -2782 -446 1983 669 -108 314 -835 -533 1479 660 -1084
115 -1084 40 405 -1285 317 2765 -1271 -4292 417 3635 1084 -1703 -2383 -862 2331 2693 -1118
131 -1118 -2535 750 1865 -196 -276 122 -1021 256 1677 -657 -1251 1060 24 -1837 537 2305
147 2305 -355 -2209 -342 1162 1000 497 -1456 -1772 1808 2597 -1190 -2136 7 726 914 781 -1144
164 -1144 -1761 855 1750 -925 -1063 1064 206 -1044 632 915 -724 -648 -49 264 1348 512 -2209 -1691
182 -1691 1732 2097 -832 -1572 -382 236 1163 864 -1761 -1349 1723 1367 -1049 -617 493 50 -107 309
200 309 203 -3 27 -716 -621 1407 990 -1729 -1194 1297 1163 -233 -911 -997 323 1889 586 -1841 -1037
219 -1037 1388 930 -785 -421 69 62 528 -61 -668 433 489 -758 -217 1077 415 -1114 -655 725 716
238 716 342 -379 -1318 -118 1720 317 -1593 -575 803 621 -8 -599 -708 265 878 -115 -736 345
256 345 513 -702 -323 852 238 -377 -226 -246 456 872 -342 -1319 31 1412 398 -1153 -719 373
274 373 725 485 -652 -911 600 950 -482 -588 307 345 -216 -122 152 74 -75 -204 -400 344 880 -335
294 -335 -1096 99 881 311 -338 -702 -76 808 534 -666 -820 366 802 -97 -496 -38 8 155 175 -249
314 -249 -31 366 -266 -374 216 450 -16 -575 -165 524 478 -97 -695 -386 726 716 -564 -740 139 649
334 649 199 -369 -406 192 410 14 -409 -163 395 50 -367 45 374 8 -292 -347 229 600 -70 -601 -203
355 -203 444 562 -225 -678 45 540 281 -258 -465 72 471 85 -197 -160 36 157 -142 -213 166 161 -272 -111
377 -111 59 289 120 -434 -266 277 469 69 -572 -229 538 383 -203 -301 -166 216 375 -215 -385 79 350
398 350 -25 -271 56 225 -133 -197 48 130 219 -49 -464 -9 598 24 -536 -163 323 232 -118 -233 -188 133
420 133 437 -44 -531 136 332 -192 -131 117 -11 -15 65 -89 -39 176 28 -367 -20 553 -51 -431 70 144
442 144 109 239 -193 -431 249 435 -151 -406 74 154 -50 119 37 -242 118 342 -275 -174 414 -21 -451
463 -451 138 291 -157 -91 -43 -155 69 423 -133 -571 232 503 -306 -216 186 -121 53 217 -235 -250 368 185
485 185 -394 -54 429 -124 -278 312 127 -156 189 11 -312 271 301 -419 -266 299 218 -218 -27 -10 -268
506 -268 118 404 -259 -270 343 -35 -262 267 165 -266 37 258 -220 -123 326 -78 -377 264 299 -417 -116
527 -116 299 -166 -8 311 -226 -255 340 166 -430 -34 406 -75 -203 218 -99 -268 297 107 -418 178 306
548 306 -358 -82 404 -10 -342 65 148 -190 178 224 -396 -93 495 -63 -305 252 137 -225 178 242 -266
569 -266 -42 238 -73 -244 269 168 -366 170 289 -279 -102 264 -256 -233 426 40 -376 99 229 -231 -10
590 -10 265 -105 -226 329 24 -378 172 292 -326 -39 254 -193 -125 274 12 -255 157 203 -304 16 450
611 450 -181 -267 276 62 -263 266 116 -257 95 282 -100 -148 273 43 -256 155 197 -320 10 334 -230
632 -230 -86 310 -84 -256 281 139 -261 54 223 -133 -134 329 11 -315 213 208 -321 126 245 -300 -45 299
654 299 -141 -260 280 164 -218 5 212 -197 -55 351 -103 -252 236 10 -346 191 269 -273 -114 255 -34
675 -34 -231 237 69 -334 123 266 -310 -118 315 -156 -195 350 88 -285 188 262 -200 -94 217 -93 -185 324
697 324 59 -402 175 275 -245 9 318 -157 -184 232 -24 -247 169 196 -253 -34 280 -151 -278 317 70
718 70 -294 199 201 -246 -1 289 -155 -123 200 27 -247 112 298 -257 -22 328 -189 -196 241 25 -171 233
740 233 107 -257 35 255 -79 -182 212 32 -296 197 201 -210 -17 211 -214 -91 304 -110 -232 169 106
761 106 -229 -2 245 -129 -213 253 -17 -261 185 117 -278 117 202 -275 -63 203 38 -231 120 102 -272 24
783 24 200 -182 -103 286 -93 -209 169 63 -218 89 144 -72 -133 175 -31 -135 189 56 -255 24 238 -167
805 -167 -117 211 -84 -147 156 46 -153 36 129 -88 -17 122 -37 -199 180 138 -230 88 156 -115 -48 142 -45
828 -45 -139 110 90 -60 34 157 -129 -63 207 -53 -128 149 30 -204 66 66 -183 -21 88 -27 -162 152 43
851 43 -167 -6 143 -161 -84 136 -16 -117 66 -32 -112 88 38 -89 20 166 -25 -139 149 49 -172 40
873 40 108 -96 92 104 -103 -54 73 -31 -100 -19 89 -23 -75 104 -25 -55 93 -3 -100 91 62 -82 8 153
897 153 -35 -52 16 41 -109 23 33 -81 -13 53 -43 -94 112 -70 -38 29 3 -32 -25 60 -37 14 55 30 -62 52 36
924 36 -105 15 61 -15 -12 95 7 -86 14 66 -10 -40 4 -56 -36 -9 19 -74 57 9 -32 38 3 -1 10 -16 10 17 26 -36
954 -36 -9 4 65 -86 -57 72 -23 4 71 -55 -27 13 -42 5 -35 23 35 -51 -23 32 -68 -69 -12 -44 -38 -19 -4 13 -29 42
984 42 27 -27 -23 62 -39 10 23 -8 11 47 -25 12 -39 -47 -5 -45 101 -37 6 11 -13 -37 14 -11 -4 -20 18 29 -67 -53 90
1015 90 7 -101 45 -33 -37 72 -34 -99 91 28 -86 -26 93 -43 -64 -23 15 -69 36 45 -120 -2 113 1 -59
1040 -59 135 51 -72 35 48 -15 15 102 -56 -41 70 67 -97 -19 55 -119 -16 74 -10 -32 115 -26 -115 -31 103
1065 103 -52 -4 99 -18 -85 40 45 -141 16 104 -126 -18 85 -119 -30 92 -10 -73 93 129 -119 -22 185
1088 185 11 -148 89 31 -168 63 25 -93 -37 164 4 -104 79 82 -184 -18 153 -112 8 127 -71 -68
1110 -68 176 -10 -126 62 131 -108 -45 170 -69 -146 144 -4 -217 94 138 -232 17 140 -108 -27 169 14
1132 14 -127 100 108 -150 6 194 -60 -102 127 15 -195 110 92 -243 -1 161 -101 -74 143 46 -204 111
1154 111 124 -102 -45 202 -162 -95 159 -49 -214 79 69 -128 24 105 -84 -118 127 40 -173 124 157 -204 20
1177 20 195 -120 -121 169 8 -159 65 111 -132 -33 173 -94 -122 165 -7 -214 88 109 -110 -6 186 -112
1199 -112 -172 95 3 -217 80 128 -173 45 209 -114 -101 201 17 -200 143 111 -94 45 186 -137 -123 150
1221 150 73 -144 138 156 -218 -3 197 -134 -110 95 -105 -124 163 84 -123 3 162 -95 -116 140 10 -170
1243 -170 65 79 -140 61 144 -111 -103 206 -33 -157 107 100 -147 89 150 -118 -31 162 -29 -159 127 56 -169
1266 -169 8 104 -98 -24 163 -34 -132 94 66 -117 40 156 -167 -45 153 -70 -124 155 37 -145 51 84
1288 84 -73 -52 146 -58 -148 116 23 -147 42 175 -55 -9 135 -61 -132 153 62 -172 -66 62 -133 -15
1310 -15 156 -30 -99 171 37 -149 58 49 -76 -31 147 -57 -85 106 57 -179 101 153 -127 -28 123 -70 -82
1333 -82 135 61 -75 44 129 -100 -3 99 -49 -45 82 23 -149 25 60 -88 -38 111 -46 -21 104 37 -64 116
1357 116 53 -113 13 83 -77 -73 110 56 -124 58 76 -127 -20 125 -64 -54 35 -6 -124 104 117 -31 -22 42
1381 42 -45 -21 111 -13 -43 56 26 -102 27 79 -39 -53 60 5 -102 80 68 -77 -27 39 -103 -46 94 -29
1405 -29 -102 84 102 -62 -9 107 -23 -86 94 -40 -108 45 58 -131 58 64 -31 -33 96 34 -83 63 94 -132 -48
1430 -48 78 -30 -50 48 -57 -96 16 -9 -94 46 36 -25 -3 73 3 -120 32 2 -48 17 35 -76 -13 56 -30 -21 4
1457 4 64 -46 36 85 -25 -45 78 -44 -45 82 27 -84 26 63 -30 -21 53 27 -45 14 -10 -56 18 -29 -59 -13 -4 7 -51
1486 -51 24 19 -4 0 3 5 -10 16 -19 -15 43 -3 -40 0 34 -49 13 -24 3 6 22 -53 -3 26 -7 2 24 6 15 2 -15 -20 16 18 1
1521 1 10 -12 -67 30 52 -18 6 17 -65 48 1 -15 -16 -8 19 -50 -22 9 6 -27 -33 54 -43 -4 15 9 -12 8 -75 23 15 24 -73 -15
1555 -15 -2 15 -8 27 18 43 53 -5 -32 22 16 -10 -51 23 24 -9 5 11 8 -46 14 -31 4 -10 34 -41 33 -43 40 19 -34 13 38
1588 38 -18 -21 -24 51 22 -65 -5 -41 -41 21 11 -41 16 93 -5 -49 22 44 -11 -43 -23 -30 -31 10 27 -77 21 29 -46 8 43 37 -25
1621 -25 10 -3 -93 38 60 2 -9 64 13 -16 52 -7 -26 56 32 -78 19 99 -61 -43 84 18 -47 6 -10 -26 10 40
1649 40 -31 -37 99 -26 -55 26 11 8 16 -2 -77 -49 71 -3 -60 13 25 -53 -1 27 -9 43 20 -48 -69 7 53 -69 -9 74
1679 74 -63 -5 56 -29 19 57 26 -75 103 76 -24 -71 79 -4 -28 47 -10 -3 22 14 -70 56 75 -5 -33 37 70 -45
1707 -45 11 -13 -47 79 19 30 -60 72 46 -110 80 44 -92 48 49 -32 -35 8 -9 -70 57 -8 -43 -21 90 24 -18
1734 -18 22 -56 -148 61 26 -35 -83 44 -65 -8 8 -36 -60 75 -6 -69 50 33 -72 -30 24 6 -20 56 61 -37 104
1761 104 69 -82 11 102 -8 -48 6 68 -18 33 35 -30 -23 108 -9 10 3 24 -12 28 41 -39 -18 25 -45 -14 92 -22
1789 -22 -77 -4 53 -66 19 61 -77 13 55 -18 -61 46 39 -73 -63 49 -43 -47 35 -4 -74 64 44 -102 -44 131 -59
1816 -59 -78 12 30 -61 68 -22 -124 -6 84 -48 -45 64 52 -43 10 36 -18 16 39 -50 -69 102 -14 -124 -37 99
1842 99 -67 9 27 -32 -37 50 12 -41 58 43 -39 -38 56 -38 -6 75 -52 -40 77 96 -101 45 -1 -7 -53 10 -42 -58 -8
1871 -8 47 -119 -33 149 -91 -69 161 26 -45 19 -11 -64 52 64 -84 -14 141 56 -98 15 -20 16 58 70 -115
1896 -115 -7 77 -48 -144 43 69 -43 10 31 -15 -12 45 -9 -19 94 41 -126 -6 68 22 -32 -7 -3 -62 31 -58 -128
1923 -128 87 17 -59 -54 103 9 -23 39 9 -66 72 32 -105 -72 119 -13 -54 23 -8 -39 31 -6 -68 32 48 -29 -56
1950 -56 13 0 -34 -10 28 -31 51 46 -58 -78 72 37 -92 28 -2 -47 -38 32 19 36 26 -51 8 46 69 -103 -63 36 33
1979 33 -44 40 7 -11 68 40 -51 -33 74 -120 -7 24 -14 -8 29 15 -75 0 69 -43 -11 70 12 -67 -28 49 -22 25 18
2008 18 -12 -94 43 47 -69 -4 45 -71 -13 13 -32 49 53 -38 -51 73 38 -19 -45 -8 23 -29 24 -25 -72 48 29 -93
2036 -93 -53 -7 -69 -29 5 10 12 13 40 -14 23 39 -36 -38 8 40 -52 20 27 -10 -4 -30 -27 -36 12 -8 -54 8 34 -52 9 -23 -15 14 29
2071 29 -39 -43 118 49 7 -23 62 21 18 24 24 -3 43 3 -80 -16 54 -8 -29 -1 31 15 90 58 -49 59 43 -20 -52 91
2101 91 -1 -19 -26 -25 47 78 -18 -52 -37 51 -20 -21 47 57 -38 -63 3 -75 17 -6 41 13 -11 -34 -41 -60 -12 -1 -45 81 75 20
2133 20 53 53 4 20 -21 25 -9 11 20 23 36 -14 34 -11 58 -11 49 -1 -13 -20 -31 36 18 -16 29 28 21 7 -54 -11 -3 -8 37 -33
2167 -33 -8 16 -11 -13 -18 -11 3 50 4 -8 14 22 11 -35 -55 -10 36 16 -4 -16 -17 -3 -21 20 20 4 -33 -19 -27 2 21 -12 13 49
2201 49 -7 -1 -2 53 -25 15 -14 -29 -45 -29 -19 -77 -48 80 -22 -31 -14 5 10 -18 -11 22 -2 32 35 19 44 95 -30 -15 -12 -44
2233 -44 -7 29 -12 -7 -7 45 -17 -1 -18 23 -4 45 1 -27 7 21 -3 21 24 13 -69 42 -6 -40 -14 17 -69 -7 -49 -20 -58
2264 -58 36 -21 -52 32 20 -8 0 27 12 -46 -3 39 4 -22 4 8 -22 45 -41 -71 -9 58 -23 59 2 -9 -24 35 5 0 3 -13
2296 -13 -2 -28 40 34 -57 2 0 -36 4 71 -87 -12 -44 -30 -26 63 34 -102 58 6 -89 7 47 -69 46 10 46 32 46
2325 46 -40 -42 26 12 -99 -73 3 -17 -46 -27 -26 -30 22 19 -4 31 5 36 -25 43 -27 -63 4 57 -15 11 14 49 -8 60 27 -28
2357 -28 38 34 51 35 41 4 -20 42 23 -33 25 27 -26 -22 31 -37 -47 40 -47 -22 -6 16 -7 -44 27 21 -79 -17 2 6 70 21 -101
2390 -101 4 77 -11 -83 33 -23 -60 -34 84 -73 -44 67 -8 6 63 79 17 63 36 -55 63 20 30 -65 -1 -38 -50
2417 -50 -2 28 -15 20 33 66 38 31 -15 -13 -21 24 9 -28 68 -2 -28 -7 -13 -31 14 32 -28 -55 48 -1 7 60 9 11 -17 41 4
2450 4 -21 47 8 24 133 56 -72 46 22 -92 73 5 32 -68 43 2 31 11 40 4 -29 36 17 -8 4 -38 12
2477 12 52 33 -24 -3 12 2 -8 4 47 -26 42 53 -1 29 38 36 13 40 -17 4 46 16 -27 -8 3 -10 -44 -12 -63 -12 -25
2508 -25 8 -34 -24 40 -18 -38 13 20 -64 1 29 -67 15 53 -52 9 68 -15 -11 15 -25 7 55 26 -32 -8 37 20 -21 63 6
2539 6 3 19 39 -72 20 9 -13 -47 -23 -15 12 -30 -6 11 31 21 -35 7 38 -24 -25 -43 2 0 -54 62 -3 -22 11 6 -67 25
2571 25 39 -17 38 68 3 6 -21 3 46 -16 35 -13 48 1 -62 24 58 39 -8 -10 41 -65 -22 8 -69 -4 9 33 -11 -50 25
2602 25 26 -10 46 -11 -12 -13 -11 -41 -3 16 38 33 33 -61 -33 6 17 54 -19 21 16 6 22 -1 25 21 -30 -4 37 -21 24 -7 22 24 -16
2637 -16 -16 42 27 26 43 9 -28 -35 -40 -28 47 33 -24 -28 10 -23 40 -10 9 -27 29 14 -2 13 71 44 -40 15 20 11 -4 25 -25 -42
2671 -42 21 -3 -23 36 10 -21 23 35 -23 36 -11 5 -33 -4 2 -12 -16 39 -9 -2 5 -22 31 41 -50 -12 44 -7 7 35 -4 22
2703 22 52 3 8 -29 58 20 78 7 2 -36 -9 13 26 19 8 -8 -52 -33 24 1 23 44 20 11 56 8 -2 20 -30 43 37 38 -7
2736 -7 -35 46 67 43 37 21 -45 -11 72 27 7 -1 45 -8 44 41 -9 47 -74 21 31 -37 -9 89 -23 49 -31 21 -22 14 -6
2767 -6 -6 -43 4 70 -23 -42 -13 16 4 -4 34 2 53 -4 -10 17 39 -14 -3 46 -28 45 21 58 58 31 -17 37 10 -55 -24 61 -40
2800 -40 11 -23 3 6 -12 44 -2 25 2 17 24 -38 62 69 27 -14 -16 -11 33 35 39 -2 53 40 3 -2 49 42 31 21 32 -28 47 5
2834 5 -4 82 45 23 27 21 -52 19 59 32 38 -39 24 -42 51 8 -1 5 -11 -10 -35 -19 -23 -13 34 -31 -3 -11 -2 -32 -8 38 14 11 -46 18
2870 18 1 8 44 9 16 32 30 -44 -3 44 -45 34 -36 -58 -9 1 62 7 -8 23 -65 -6 -34 -5 -20 -26 -1 -29 16 54 -15 7
2902 7 1 28 -33 28 21 -58 -35 1 16 -30 38 -6 9 22 10 48 21 40 24 -11 23 -106 39 63 -2 -6 -27 -60 27 -36 28
2933 28 13 6 -18 6 -16 -25 -25 -19 7 11 -17 26 -2 26 -8 62 16 -64 34 -35 30 -12 -9 22 36 18 63 -24 30 -4 -13 21 39 56
2967 56 38 38 -56 -15 6 -13 -49 -11 -23 25 -6 43 -2 -49 3 28 -33 47 -32 26 15 28 53 3 -6 47 -11 -30 29 23 52 29
2999 29 -13 -21 -12 23 -37 -28 7 -13 6 28 37 22 -8 -2 16 15 51 4 -11 15 -4 3 24 79 -23 25 32 -25 -58 -9 56 -14 -11 -5 29
3034 29 41 16 -43 3 46 6 1 -23 -22 2 -2 28 19 11 10 37 -11 40 -37 17 -12 52 -18 -3 -77 26 0 -21 -11 4 -51 46 -48
3067 -48 -62 -2 10 23 34 3 -61 40 48 17 -34 78 -8 5 45 -51 -12 2 120 -13 -95 25 -51 -20 43 30 29 34 23
3096 23 14 -12 48 -22 -32 -70 -12 14 -26 29 -42 0 -2 9 23 1 -14 -11 8 -3 8 17 7 5 -17 -7 19 -30 7 8 -44 11 -36
3129 -36 34 -27 7 -10 -51 101 18 7 20 -12 5 27 9 -5 2 -31 13 -16 -20 36 13 -40 41 -12 -45 2 -18 18 -47 5 38
3160 38 -6 8 -9 44 -24 -33 -8 -30 -85 -8 5 10 7 11 28 10 16 28 25 16 45 33 -15 -17 3 31 -17 -4 87 17 -8 21 -9 -31
3194 -31 1 -18 24 18 -36 -29 -30 -26 19 23 62 -44 -26 1 42 -6 -34 65 -12 -14 -24 -3 -22 31 24 -42 15 13 -20 -19 6 40 -3 22
3228 22 37 15 31 -8 43 -43 -33 30 28 -11 10 27 -36 -64 39 35 -21 -18 43 71 4 26 51 46 18 -45 46 46 32 -11 -49 53
3260 53 -12 -27 3 -7 52 28 21 0 13 -8 -6 17 -4 -20 2 -4 20 35 7 -30 -8 -13 0 -7 -6 19 -9 -41 95 -37 52 -11
3292 -11 6 26 -11 10 6 32 40 -10 10 -38 9 53 30 -17 -4 11 -12 -7 -62 26 -15 24 -34 26 20 0 -33 25 -53 55 -1 6
3324 6 58 -35 -37 23 66 -14 -1 -5 -6 -28 0 -12 -23 -9 6 -44 17 -3 -20 -65 8 75 -6 -3 26 13 13 -53 -4 -74 0 11 70
3357 70 11 -28 3 37 -36 -32 22 -4 -37 -5 6 15 -3 -9 -12 92 -21 15 48 -20 80 -9 16 19 17 -11 82 -2 17 15 4 -43
3389 -43 -3 3 6 54 0 53 3 36 6 -9 -7 45 4 23 13 13 -17 11 22 32 -38 -29 9 19 -8 -49 2 -28 23 -41 20 15 -23
3422 -23 33 6 -64 -42 -6 -6 47 20 -28 14 16 5 -84 6 15 -34 -17 12 -17 56 5 9 -27 68 -5 -17 -3 -15 5 -20 40 -39
3454 -39 37 -26 -19 -16 2 -42 25 -25 31 64 30 -12 -2 -32 -51 41 24 10 59 10 51 -5 -34 74 15 -21 14 41 -25 11 -82
3485 -82 -12 -5 -11 -21 -56 26 16 13 -9 4 44 14 69 -34 -7 -4 -31 10 20 -28 -29 37 -26 3 -52 -25 -18 17 45 45 3 13 -40
3518 -40 -5 38 -44 18 23 11 -6 -33 -18 22 -52 9 -25 2 -83 61 -30 20 -35 42 -7 -11 -14 -9 36 21 -34 77 33 23 14 -20
3550 -20 19 57 53 -14 -10 -14 14 10 -41 19 34 24 0 9 26 14 -54 22 11 20 22 -61 16 -4 -35 -55 28 4 -84 28 -45 10 26
3583 26 31 -18 -50 21 -13 -4 46 -8 21 25 -24 45 2 -9 -20 -31 39 -3 -9 -45 -31 24 13 36 -39 -20 56 -10 21 -29 -16 -8 -3
3616 -3 -7 31 10 15 8 -48 -9 16 -31 11 19 -8 49 32 -19 -8 25 29 36 -43 -27 53 2 25 -35 -21 -58 -11 -4 6 12 -31 -19 -28 46
3651 46 30 20 34 -20 32 35 43 -10 -5 18 -28 25 -19 4 65 49 -56 13 -10 5 -23 -14 15 -45 12 60 27 -31 66 -65 12
3682 12 42 -41 18 -49 16 -8 -41 59 -16 6 -35 -39 30 4 35 5 11 25 1 -22 -18 -45 -26 13 -60 3 -12 31 10 14 -26 13
3714 13 -14 40 10 0 -56 17 18 13 -11 29 20 -43 2 14 47 43 -34 23 -16 -12 20 0 34 -5 53 -11 -34 23 -10 -12 50 -13 -14 -28
3748 -28 12 -4 -69 -37 52 58 -9 0 32 -6 37 41 35 -52 -9 22 -19 66 31 16 10 34 18 55 -35 -22 -5 -51 -54 36 -20 22 23 -26
3782 -26 1 -28 -25 27 20 -22 15 -2 -49 -20 -8 -50 -8 14 42 -14 31 57 74 -52 -19 -22 -4 -58 -6 2 30 58 26 21 21 17 16 -1
3816 -1 11 -49 -9 -45 4 -16 69 -9 9 13 15 29 39 18 16 33 27 58 0 -4 -25 -44 42 -15 -6 66 55 31 -22 -19 -37 -6 -30 3
3850 3 -36 21 2 -25 -31 -12 50 -17 58 -2 -43 -43 -7 -19 29 14 -11 2 13 8 1 -30 -44 3 22 -42 42 -54 18 25 -35 -38 -20 49
3884 49 10 0 50 -26 20 3 36 -6 -3 -17 -10 13 -18 25 -31 58 -40 -9 22 35 6 32 13 4 57 -23 45 4 26 9 50 72
3916 72 -5 10 11 3 -50 66 57 -34 51 -45 -39 -35 17 26 -37 9 66 11 16 -67 55 -7 18 -5 -18 -23 12 4 -9 33 75 -11 38 -50
3950 -50 28 14 -1 32 -34 9 -47 -8 -17 -23 52 -5 3 -8 4 -28 -23 16 -7 -5 23 8 -34 48 -23 2 56 -18 19 -17 26 80 17
3983 17 38 -2 37 49 64 38 11 -8 -10 -44 12 33 -58 14 -2 55 11 -16 -31 -25 -21 6 17 14 -13 -11 27 -51 -17 -26 -15 -12 -91 -51
4017 -51 47 -31 7 -74 19 10 4 -19 -3 15 5 -12 31 17 -4 -56 -41 -38 -42 21 -17 -55 -1 17 -11 -37 -9 10 -45 -26 -57 -30
4049 -30 -22 3 10 18 34 16 -11 4 5 -53 38 -19 -12 18 -3 -23 -27 11 19 -3 -10 38 -43 25 -14 29 -27 -20 -11 -16 -17 27 66 -83 -12 -4
4085 -4 14 20 23 -16 -65 45 -13 -5 10 29 -73 -68 6 14 -42 48 11 38 9 15 41 11 86 16 10 -31 18 26 24 25 17 39 -1 -17 29
4120 29 4 21 14 19 46 0 -37 1 -33 23 19 9 54 65 -10 -37 33 31 13 -14 4 27 -9 4 0 -30 14 27 -13 25 -50 11 51
4153 51 40 27 -26 -8 50 7 14 -29 13 -6 17 18 -25 8 -36 53 2 -13 -1 -22 -8 -15 -15 25 37 6 -2 -29 12 18 4 17 -43
4186 -43 -26 -3 3 -35 -13 8 -3 -8 -23 16 -63 27 3 -38 5 2 -38 9 24 8 -63 8 -15 14 2 -80 46 -60 12 -15 -9
4217 -9 23 -7 -6 28 15 -55 35 -23 -48 4 7 -24 27 2 -55 66 3 20 8 9 26 60 -15 78 -38 37 22 2 -6 -44 29 5
4249 5 7 30 -21 5 -1 -17 -20 12 -17 -17 0 4 21 36 5 17 18 -23 38 -38 -80 -3 -10 -33 -5 -26 18 -33 -27 57 7 -30 32 -24 68
4284 68 -2 -3 -30 0 10 -9 -3 -40 13 36 4 9 19 49 -30 -24 -4 27 -73 29 -8 -73 84 16 15 -13 16 51 47 30 -20 48
4316 48 8 -38 -8 -10 -21 42 32 10 -27 -10 -10 11 -17 -33 46 -7 5 61 -21 -14 -42 5 3 28 28 -22 -3 -17 -23 9 3 -19 19 28
4350 28 7 -7 39 7 -22 11 7 -46 -5 -6 37 0 9 -2 -82 -4 27 8 -32 8 39 -30 3 2 22 -16 72 53 -13 36 -44 -37 -25
4383 -25 -11 46 14 -52 35 -33 36 -19 17 -71 -2 11 -33 48 -1 -17 6 72 -19 -23 54 70 39 -16 36 60 58 44 30 -22 10
4414 10 9 6 32 -26 32 2 66 11 52 13 -39 6 8 10 12 84 35 -17 11 -23 53 5 -6 31 -26 57 17 -15 -70 -15 49 -10 -43
4447 -43 14 39 -62 -16 0 14 56 -13 -4 -58 17 8 -60 53 -37 37 31 15 8 11 46 9 -25 -28 28 -8 -50 5 -22 -23 -28 -65 27
4480 27 -33 -51 38 24 9 12 1 -18 -51 -33 25 8 -38 7 43 30 19 3 -1 17 -18 11 53 17 -15 8 35 24 -14 0 5 20
4512 20 20 -61 -32 -26 1 16 -19 -43 -24 7 -36 -45 9 -32 -49 -11 -41 43 -22 -22 18 4 43 18 -48 33 30 32 47 -27 9 41 25
4545 25 60 20 -24 19 -48 18 -26 17 -6 38 10 4 -11 -32 -20 15 -31 -43 -34 -37 -7 -52 -12 -33 32 -30 17 5 -33 21 -2 -32
4577 -32 -1 -3 7 -34 -63 22 -44 13 -15 -66 19 3 -26 -7 -11 24 35 12 -15 -65 -2 -73 -33 28 3 -36 0 -8 3 -30 -40 56
4609 56 -41 9 34 12 -48 -28 3 -16 -18 -83 11 -12 -9 -51 -29 -5 3 -41 -19 18 0 -19 -13 44 -3 14 -8 21 19 28 8 80 35
4642 35 -20 89 17 -11 16 15 2 -15 23 -11 13 -26 -43 -22 27 -14 42 -9 42 41 22 10 8 -39 -46 85 5 -52 2 -28 29
4673 29 18 30 1 72 19 31 -7 -16 -2 -12 40 -19 -11 -25 -17 -2 48 -44 -19 47 25 35 1 42 37 54 28 -12 -75 -5 58 -20
4705 -20 7 34 -10 17 -8 35 16 -13 -18 24 -30 35 16 -5 12 39 -3 23 11 -45 11 -58 -37 -16 13 27 21 -57 -18 52 -21
4736 -21 -31 -5 32 -24 11 -18 -41 -33 -27 -24 15 -57 -40 -2 -22 -16 34 -18 0 -16 28 0 -45 3 -21 -16 -34 53 78 5 45 31 4
4769 4 -31 -7 6 -27 60 16 60 -89 31 -68 -19 65 -9 -9 -38 15 -19 13 40 -38 -21 13 7 -33 -41 14 13 -21 91 35 50
4800 50 33 -21 20 25 21 -8 1 0 2 -6 -36 15 6 -85 -15 21 10 -23 1 28 3 -15 26 8 43 34 -49 2 -27 32 16 11 -44 -27 42
4835 42 30 24 19 1 -8 36 13 10 -63 5 15 4 3 -6 -18 23 90 -5 -25 17 -24 16 9 -84 -19 -9 22 21 -17 13 22 -16 -5 14 4
4870 4 7 17 -66 40 -23 -42 40 -46 6 -55 21 -5 29 -6 -10 -5 61 42 28 -27 16 53 25 26 -11 48 0 -2 9 15 14 59 25 -57
4904 -57 20 -27 16 1 -47 8 -61 -13 -6 -2 -3 16 -22 -6 -32 26 -15 30 -20 17 -3 -1 -10 7 -1 34 38 35 -52 13 -20 -63 16 -6
4938 -6 41 37 -57 47 29 -7 57 -7 19 -27 -5 -20 -87 24 -8 31 -8 30 10 -9 -10 -4 34 -53 50 49 -13 21 41 17 19 21
4970 21 9 6 -4 7 24 -54 -30 -13 4 35 33 -12 -13 27 3 4 -16 -10 27 -65 -23 -56 6 25 27 31 2 -24 -20 -39 -36 40 42 -66 -48
5005 -48 3 -30 5 -32 -5 -46 109 28 31 15 9 -19 -24 11 11 72 42 -68 38 11 -41 40 -2 2 -36 -49 -44 -2 21 -27 37 -19
5037 -19 17 -14 -32 45 -10 -21 41 -21 -27 -16 -19 -33 -44 -10 -8 10 -34 -14 -31 -25 6 3 -9 -14 40 34 -13 17 1 -14 25 50 -2 -33
5071 -33 27 51 -102 -29 -25 9 -8 18 -30 43 8 -11 57 -14 -8 17 18 -27 6 12 35 -4 28 -53 -4 6 10 -55 -9 34 18 33
5103 33 0 -50 -19 17 -23 49 -4 58 -3 6 -11 -54 6 -26 44 23 50 -59 51 40 -16 13 -15 31 12 -5 2 37 77 26
5133 26 23 -33 15 75 40 42 43 -22 10 -28 0 -18 -30 -42 -31 24 5 10 -3 -22 -17 54 -4 46 29 1 5 -83 -16 -1 -31 -5 -14 21
5167 21 -15 1 19 31 11 42 15 2 -3 -3 7 29 24 21 -6 -18 -29 -23 7 -14 -5 70 29 -5 11 42 37 -5 -50 43 -37 -18 67 -7
5201 -7 -15 -12 -7 -26 69 24 -49 11 14 -10 7 -7 -3 -17 -30 -36 2 1 -20 -11 -34 16 5 -13 -8 -75 -57 3 17 46 -6 -15 -29 13 11 12 -41
5238 -41 -25 -42 17 32 43 -47 94 20 7 40 -46 -8 -42 -2 -36 -45 -23 -47 -41 17 -16 25 -20 3 3 3 17 -15 -43 0 -27 -40
5270 -40 17 -2 40 49 35 49 -66 2 -49 27 38 -24 7 13 23 -43 14 2 19 1 -12 50 58 -22 12 13 -44 6 17 -7 -11 -4 12
5303 12 -2 -32 -5 31 31 13 27 6 -21 51 -33 11 60 5 85 38 0 2 39 43 6 27 -10 22 -33 44 -32 -51 26 12 -14 15
5335 15 -2 6 -58 -36 -38 -7 -82 -21 -10 21 -7 -53 -2 35 -4 -15 26 -58 -5 -56 0 -32 34 13 -25 22 26 -7 -28 -26 15 42
5367 42 13 -14 -33 -15 -5 -12 -22 -13 0 3 46 10 -45 4 21 -19 6 0 52 -7 -54 4 10 25 1 -2 -7 21 -26 16 -1 52 -64
5400 -64 3 -34 41 -28 21 -39 -45 4 24 -18 -2 -8 11 -83 -4 39 18 42 -8 45 -40 24 3 27 -7 18 4 -45 34 46 -33
5431 -33 3 46 -53 19 39 17 4 3 -39 16 6 -9 34 33 -59 -6 -17 -33 -2 -21 -11 -15 6 -52 6 -57 -2 38 -47 -10 6 -9
5463 -9 -20 7 -15 -32 2 -10 -52 19 -16 -40 -1 45 3 -40 17 14 31 -56 1 -68 -29 49 -10 6 -14 25 -8 18 -25 -23 -15 -30
5495 -30 -37 -16 -21 7 11 -32 54 -44 -31 32 -56 -32 -23 -18 45 -25 26 -56 -55 5 16 -33 -14 79 17 45 13 -16 -24 -7 52 -43 15 17
5529 17 6 -13 1 39 -19 7 -46 -46 52 -34 12 37 30 -62 21 -38 2 -12 -29 -5 14 -6 42 -52 -41 20 -20 -68 -43 -37 -54 -28
5561 -28 -65 -16 -42 60 -32 -5 -35 -8 -24 53 15 13 16 2 -1 -15 -14 -45 -12 -32 49 4 16 33 -28 -6 -4 -65 -20 -57 19 -30
5593 -30 -16 -21 24 -68 6 -17 65 28 -17 4 -29 -8 -35 14 -6 15 -36 20 -76 25 8 29 -9 -24 8 -17 30 35 -18 13 -28
5624 -28 -32 -56 -47 24 19 -13 29 -71 -6 -45 8 -3 24 29 -75 -38 27 -24 14 34 -17 32 48 47 31 59 -3 -10 45 -20 -30 1
5656 1 4 43 5 -26 -19 -35 -32 24 -12 1 -37 4 5 -16 -11 -6 -42 29 -39 -26 -2 31 53 28 -9 31 32 -20 5 -17 9 14 13 3 -29
5691 -29 -7 -19 28 -43 44 -26 3 7 -17 0 -6 -19 14 28 35 53 40 9 29 -27 5 -33 -47 -54 -35 -19 6 25 -6 26 13 43
5723 43 -29 13 -28 -9 -22 -37 12 11 12 -4 25 -11 -50 32 -5 -1 -60 -23 -49 9 12 0 58 -43 -64 -5 40 11 -26 -30 -48 36
5755 36 14 6 -33 -24 -15 -26 16 -13 33 -23 54 -31 30 -8 -27 2 -15 61 31 64 4 -41 -15 3 -4 26 10 -30 -18 22 15 33 -25
5788 -25 -13 33 -26 -27 4 -27 -10 9 -7 -14 -92 1 -19 -8 14 -13 -3 10 -44 51 -2 -40 -21 38 -21 42 -37 26 -25 12 35
5819 35 4 -11 -29 49 -14 -1 51 -16 -40 0 1 56 8 37 -14 37 -57 -21 7 -26 11 23 -14 -15 -7 -17 26 -11 33 28 -32 -35 -5
5852 -5 33 9 27 -25 34 19 36 -2 -10 55 13 7 28 25 -13 -18 11 57 -11 -57 -28 37 53 11 38 -40 25 4 -3 7 -1 -29 -53 -61
5886 -61 -23 3 2 61 -8 7 33 22 -19 -38 10 0 0 -12 9 -10 11 9 29 54 -2 -11 28 10 -17 65 10 -1 6 59 -2 -14 8
5919 8 -13 -2 46 9 7 -9 -34 -30 -9 -46 48 28 0 13 -6 13 55 -21 -17 2 -43 -2 15 54 -18 -33 -10 -34 8 -8 18 78
5951 78 -18 -36 20 16 57 25 40 -11 1 19 53 -62 -5 19 9 -60 -39 61 -4 -2 -18 -28 -8 14 13 -1 -17 16 5 -55 42
5982 42 -21 -17 -3 19 39 -6 -34 6 -29 -7 -7 -23 -24 43 -24 -39 14 -21 19 18 -43 -25 46 37 -47 -4 -1 7 -22 4 -12 -1 14 11
6016 11 6 -10 28 22 -22 -28 33 -31 25 103 45 11 -51 -4 84 26 -15 24 -10 63 2 -7 34 28 -8 -3 47 -33 2 -57 27 -26 -22 -34
6050 -34 27 7 -18 7 11 -41 27 -27 51 27 13 -22 12 -13 -10 -6 -27 -13 -13 -43 -15 -20 6 21 44 -38 43 -5 58 72 5 44 -25
6083 -25 17 -63 1 22 44 -5 22 -63 22 -57 18 1 32 19 -1 12 -19 -27 12 36 19 -3 -2 14 -16 63 -59 -29 30 38 52
6114 52 20 18 -18 36 -35 -23 16 -38 -25 -26 -57 53 4 -21 4 41 -23 -12 17 -5 -4 10 -28 17 59 49 16 0 12 43 40 -20
6146 -20 53 -33 -28 6 5 -17 40 11 64 31 6 10 -27 -33 11 2 7 -43 -27 6 44 -20 -16 3 55 -46 42 -17 4 1 -46 17 47 10
6180 10 41 42 11 16 3 24 16 28 11 16 6 35 -51 -8 20 -5 -7 -18 -24 -5 -5 -26 20 31 -43 -4 7 17 28 0 16 -33 18 -8
6214 -8 12 8 -26 -12 17 15 26 42 -14 40 -16 -29 29 31 -38 -9 -4 30 -3 -2 39 -61 -40 -20 -34 95 -30 52 27 -14 22 -35
6246 -35 20 15 8 18 -73 -42 -35 27 -12 -7 31 -5 14 21 1 11 -37 15 57 64 -40 48 -46 -54 -13 -20 18 11 -87 -9 60 65 61 -2 6 23
6282 23 54 10 0 -16 27 23 36 -34 8 -11 -80 -11 -33 -16 42 -19 32 -27 -42 20 -4 41 -4 37 -35 4 9 18 -14 12 36 8
6314 8 -56 -35 -23 24 28 4 -10 -34 8 -18 14 -56 -24 -6 12 35 20 1 0 -37 -3 46 -38 -12 -29 49 -24 -15 -27 57 16 34
6346 34 26 13 -8 -13 -26 -39 3 6 -49 -16 15 -17 -42 20 3 13 -46 -14 52 12 -47 26 -9 39 27 5 11 9 20 61 -31 38 -46
6379 -46 10 -8 32 -25 -37 64 -9 -31 11 -45 -13 21 24 20 -8 3 2 -11 -53 -18 8 16 -94 -36 -9 25 38 -60 4 78 -9
6410 -9 -27 -9 -19 -32 -11 7 8 39 -23 10 -24 -7 66 2 -25 1 -51 -81 -1 -76 -16 17 -52 3 -16 -28 -31 34 -29 25 9 -6
6442 -6 37 -3 37 -35 -18 14 9 -2 0 -18 12 6 24 69 -33 24 35 31 -5 -14 50 -65 9 -2 -36 -42 -27 -9 -12 -8 -35 20 -3 35
6476 35 14 -6 -9 -28 -28 15 -3 2 82 -27 -31 10 47 83 8 -40 -22 -4 -2 -6 -46 -8 -40 -7 23 -6 -21 -15 -5 14 3 5 50 4
6510 4 -12 -10 20 45 -28 -16 9 -35 -48 12 0 10 20 -45 -51 9 12 6 -16 3 -7 -69 49 15 -18 37 21 18 34 6 30 18 -30
6543 -30 17 40 -13 11 -44 -15 16 2 -7 63 26 51 30 17 46 34 -21 11 18 -32 38 23 -33 17 -30 33 -29 -19 23 3 0 -51
6575 -51 -12 -49 -3 -3 -12 27 23 36 45 3 -80 -2 19 -21 31 -31 -19 -4 -9 31 5 50 57 -3 -42 -5 12 -4 -46 -11 -61 -32 18
6608 18 6 -10 -23 -51 22 -38 -15 -5 23 -5 -41 -13 -6 -22 -5 -47 42 -53 5 44 8 56 32 63 -38 15 -36 -1 34 44
6638 44 19 -34 3 -21 -5 -12 18 -33 -24 13 -10 11 10 11 17 -7 -18 -16 3 70 -3 55 -29 -16 10 -54 -26 -11 -18 3 -32 -8 9 14
6672 14 -31 -58 46 -18 16 -62 5 26 -41 -32 23 -20 0 46 16 -27 -19 -7 -31 90 34 18 -54 26 -30 3 -15 31 -32 -19
6702 -19 48 -21 -20 27 -13 14 10 30 31 34 56 11 23 -36 -2 19 36 21 7 -14 18 12 -5 9 62 -26 41 -11 -33 8 -18 18 54
6735 54 34 -26 15 17 -34 -15 -29 -47 -29 6 -35 -11 -10 7 -45 -2 -5 61 0 59 -58 13 -14 -24 2 -14 -40 23 -74 15 -45
6766 -45 6 59 -32 24 45 35 27 26 -17 3 1 -16 -36 63 8 -16 -60 -22 13 -43 -32 11 43 23 55 18 -11 -3 19 -45 9 -13
6798 -13 12 31 13 24 32 41 16 -41 -2 18 -11 41 25 0 0 -31 -23 -28 30 -7 -70 35 -11 32 -37 7 44 3 -39 -18 37 -19
6830 -19 12 57 -42 24 32 -47 -8 41 29 13 51 -14 5 38 -15 33 -58 44 -63 13 5 3 24 10 -23 48 -21 -16 44 47 -2 -20
6862 -20 5 8 -30 27 -14 -3 -18 -4 81 -12 -29 -42 -40 -17 -13 -34 10 4 15 -28 -58 -22 -64 6 -33 32 13 -36 -2 -35 -15 -7 49
6895 49 -3 13 -31 3 -29 14 11 -59 8 1 -35 -8 -20 -9 31 -27 -23 -25 41 -20 39 11 26 -28 19 40 56 4 30 -34 9 39
6927 39 -27 -3 -12 -36 19 -11 -3 9 -5 24 39 -33 10 26 -7 27 -21 -32 -18 -24 -17 2 -3 -26 -62 -24 26 27 -39 33 27 11 -18 50
6961 50 -2 -15 -11 -14 12 31 -18 -20 19 -35 -13 43 -27 68 -9 -63 50 2 -7 46 14 -39 3 15 11 43 -21 44 33 -23 9 -21
6993 -21 7 -56 -30 -12 -27 5 3 -10 -36 -45 5 63 -47 -35 19 -79 -26 54 25 3 -35 -5 10 -15 8 4 -22 19 44 28 -10
7024 -10 -45 -5 28 -17 0 -21 3 13 34 -7 -15 26 -15 27 -20 -3 21 -30 10 -22 42 -4 2 -11 38 -3 -36 -43 33 3 -58 36
7056 36 -25 -16 -38 14 -32 -30 -28 30 25 39 15 -4 32 28 -5 -64 -17 -46 23 62 39 57 9 -23 -27 -13 -25 -50 -51 -20 -23 44 5 -30
7090 -30 10 -43 -18 37 2 58 0 6 -13 -22 -3 5 32 0 -19 -20 -16 0 21 24 -19 53 -9 -31 -37 -54 -15 -12 49 0 -1 12 -20 54 -28
7125 -28 5 -2 -32 -1 20 55 5 -38 13 31 -12 30 -29 23 42 3 51 -30 -5 56 3 -29 -31 1 -43 37 14 -26 33 -14 34
7156 34 -8 27 -17 8 -11 -24 57 -24 31 -27 -27 28 -29 11 35 11 4 -24 -37 -18 55 0 19 7 13 -7 -37 -4 -5 14 -11 -3 -16
7189 -16 14 -3 13 -19 -1 -15 -16 28 61 9 0 43 -25 2 46 27 -15 -25 -6 15 -23 11 0 15 32 -44 4 5 55 30 13 33
7221 33 23 7 27 38 -12 17 -5 -30 -37 -7 -58 -22 -14 -4 24 -26 26 2 -15 15 -27 42 10 2 18 -15 -6 2 70 89 17 12 -55
7254 -55 23 -3 -44 -8 3 -44 11 -32 -29 6 43 27 15 -17 27 26 -5 46 11 -22 34 52 11 -3 -4 -64 -28 6 -17 40 28 18
7286 18 -34 -38 22 34 -25 16 33 -14 -25 22 -36 70 -7 -63 36 -51 -20 2 -4 6 -5 -56 -33 24 -27 -11 -12 55 6 15 10 -9
7318 -9 22 -5 -52 30 56 -34 -22 -2 -34 -8 -15 -63 46 -13 4 -20 43 -6 -11 41 6 16 32 -42 27 -57 4 8 14 -15 27 -6
7350 -6 -31 -11 32 -57 -21 -22 -22 53 29 -15 -100 -22 -20 -62 26 34 29 -39 62 10 -19 -6 6 3 -30 37 9 40 -33 -49 -52 -22 -16 -40
7384 -40 16 -6 30 -35 3 48 46 -52 22 -25 -32 81 -9 30 36 2 -5 13 -38 -21 21 24 13 45 -16 -29 -1 -44 -44 -12 1 37 -44
7417 -44 11 -4 -16 -40 -41 -11 15 -54 -33 -3 20 -1 -24 -58 42 -12 -17 5 -6 -6 -40 1 -1 79 -28 55 10 27 7 12 -18 13
7449 13 -36 13 10 13 18 12 17 -40 30 44 7 22 -1 -13 16 -11 27 14 7 -27 24 -28 -62 17 8 -7 -18 53 35 10 25 19 32 -37
7483 -37 -5 -11 -5 9 -43 -31 -29 -25 54 -12 -59 27 11 25 -26 -2 39 6 -21 9 -59 -29 25 33 19 18 -53 26 -6 -18 80 9 -3
7516 -3 37 25 35 -8 -44 -5 13 15 8 14 12 -14 -30 15 12 84 1 34 -24 27 2 -27 -6 -33 13 -32 27 -14 24 37 44 -29 41 13
7550 13 26 -7 7 -43 -18 5 -22 -25 -6 -40 -1 99 -64 -7 -33 20 38 -51 -19 5 22 24 -18 21 14 -8 23 -15 9 9 34
7581 34 61 -12 6 24 67 -18 29 13 30 0 31 -43 -48 -18 -3 19 28 18 21 6 7 37 -81 -41 4 -52 31 12 48 -10 10 58
7613 58 15 25 -31 40 25 -27 9 -6 -47 1 -15 1 21 -10 -41 -8 -56 -39 4 3 65 -40 -33 -23 12 -66 9 -7 -36 -5 6
7644 6 72 27 18 -5 -37 4 10 -8 -34 37 3 25 -3 10 47 5 69 -30 -29 42 -29 15 -23 -45 -51 20 24 -23 -22 -16 -51 -7 -1 7 2 5
7680 5 65 -2 44 32 8 2 -1 29 53 -6 -3 -20 -6 40 -18 10 -3 1 -38 72 -6 -25 -44 8 -16 -10 40 4 -20 -38 2 14 14
7713 14 -39 11 -42 -15 22 -11 23 35 6 2 51 -15 -7 -21 27 -10 -2 4 65 -33 62 -15 23 26 14 24 13 21 -20 67 -38 29 -32
7746 -32 33 -7 3 -35 -35 31 5 -12 17 20 -2 -28 -29 -39 10 7 -8 13 -20 -2 34 -5 30 1 -25 -7 2 -9 -59 42 -31 -7
7778 -7 -52 -15 -42 -38 -55 12 74 -19 3 12 22 -5 5 9 41 30 -2 49 -53 20 -8 -2 -2 28 -26 -10 -34 67 -48 -20 -12 -26
7810 -26 18 29 9 -37 2 -42 -26 -32 2 -7 19 -14 -55 15 6 48 51 17 -6 -38 33 -47 -25 13 17 21 -31 -19 22 15 -45 -58 -11 63
7844 63 -12 20 -28 -14 -2 -42 2 -63 -9 4 -3 -35 -14 9 33 10 5 -16 30 -39 -45 -40 -69 6 38 -22 -13 3 15 -25 -36 -22 30
7877 30 12 -61 -13 20 -86 14 33 -85 15 16 -35 17 -21 -50 3 -5 -5 -54 -3 -1 25 41 -18 5 -7 -44 -68 -4 34 8
7907 8 9 14 -9 -33 -21 -19 6 -21 25 9 0 1 18 -21 10 -8 -25 -15 12 -21 15 -24 29 6 -36 29 22 -43 -53 2 -45 6 -6 21
7941 21 -12 4 20 -33 -26 -16 -6 -33 -47 3 -10 43 4 58 26 -70 21 -26 21 13 -25 -4 -49 23 2 -4 -11 26 -17 36 12 -25
7973 -25 8 35 72 25 -22 13 -37 22 -10 -27 -50 27 47 25 -52 45 -2 -39 47 -4 -35 34 17 -41 -3 15 -25 -21 66 -1 12
8004 12 67 1 2 26 -24 54 23 -27 -38 -53 -19 -15 -2 13 15 -79 -25 49 33 -2 -41 -63 8 -11 -54 -42 -43 -5 7 45 3 19
8036 19 -45 8 -85 6 -9 21 -43 -5 -35 -18 29 -5 43 -14 -13 -60 -41 1 -1 -60 -66 -19 -6 -33 7 -16 -18 -62 0 1 30 41 6
8069 6 5 -7 32 -7 5 13 11 31 -12 9 -10 46 -32 17 -52 -1 11 51 -31 14 -13 25 -45 49 -21 -1 -51 34 1 37 -19 27
8101 27 27 16 42 -31 -22 -53 -13 -15 22 10 -31 48 -31 14 -9 23 -16 -6 1 -6 -11 12 -28 -21 16 -49 17 -13 -23 70 11 -5 -48 -11
8135 -11 33 -88 40 -10 -29 -11 21 -29 -15 -53 2 7 -21 -20 51 1 27 30 59 -7 -38 79 21 9 22 40 32 17 -25 12 7
8166 7 -29 47 -1 45 -42 -84 -5 1 -10 -2 33 -10 0 -48 -39 16 -17 24 16 10 19 -29 26 -17 3
8191C
##END NTUPLES=NMR FID
##END=
