##TITLE=1H_Pr 6-3
 DMSO
 8 sc, 
 14.3.2024
##JCAMPDX= 6.0         $$ Bruker NMR JCAMP-DX V2.0
##DATA TYPE= NMR FID
##DATA CLASS= NTUPLES
##ORIGIN= UXNMR, Bruker Analytische Messtechnik GmbH
##OWNER= root
$$ XWIN-NMR		Version 3.5
$$ Thu Mar 14 13:50:10 2024 Russian Standard Time (UT+4h)  she@DPX200
##.OBSERVE FREQUENCY= 200.1313
##.OBSERVE NUCLEUS= ^1H
##.DELAY= (6, 6)
##.ACQUISITION MODE= SIMULTANEOUS
##.ACQUISITION SCHEME= undefined
##.AVERAGES= 8
##.DIGITISER RES= 18
##SPECTROMETER/DATA SYSTEM= spect
##.PULSE SEQUENCE= zg30
##.SOLVENT NAME= CDCl3
##.SHIFT REFERENCE= (INTERNAL, CDCl3, 0, 15.7039)
##AUDIT TRAIL= $$ (NUMBER, WHEN, WHO, WHERE, WHAT)
$$ ##TITLE= Audit trail, XWIN-NMR		Version 3.5
$$ ##JCAMPDX= 5.01
$$ ##ORIGIN= Bruker BioSpin GmbH
$$ ##OWNER= she
$$ F:/spectra/data/she/nmr/H-F/1/audita.txt
$$ ##AUDIT TRAIL=  $$ (NUMBER, WHEN, WHO, WHERE, WHAT)
(   1,<2024-03-14 13:48:58.87 +0400>,<she>,<DPX200>,
      <created by zg, POWCHK disabled, PULCHK disabled
       configuration hash MD5:
       00 E9 B6 7A A2 85 ED C7 34 08 36 98 17 FE 4E 26
       data hash MD5: 16K
       71 A3 CD AF 1C E6 84 BD 19 23 AC 9F 85 B2 40 92>)
$$ ##END=
$$ 
$$ hash MD5
$$ A3 02 DD 4F FE 4F CC C0 B2 55 F3 A6 55 2E 9F CA
##$RELAX= 
##$RELAX= 
##$RELAX= 
##$RELAX= 
##$RELAX= 
##$RELAX= 
$$ Bruker specific parameters
$$ --------------------------
##$DU= <F:/spectra>
##$EXPNO= 1
##$NAME= <H-F>
##$PROCNO= 1
##$TYPE= <nmr>
##$USER= <she>
##$AMP= (0..31)
100 100 100 100 100 100 100 100 100 100 100 100 100 100 100 100 100 100 
100 100 100 100 100 100 100 100 100 100 100 100 100 100 
##$AQSEQ= 0
##$AQ_mod= 1
##$AUNM= <au_zg>
##$AUTOPOS= <>
##$BF1= 200.13
##$BF2= 200.13
##$BF3= 200.13
##$BF4= 200.13
##$BF5= 200.13
##$BF6= 200.13
##$BF7= 200.13
##$BF8= 200.13
##$BYTORDA= 1
##$CFDGTYP= 0
##$CFRGTYP= 5
##$CHEMSTR= <none>
##$CNST= (0..31)
1 1 145 1 1 1 1 1 1 1 1 1 1 1 1 1 1 1 1 1 1 1 1 1 1 1 1 1 1 1 1 1 
##$CPDPRG= <>
##$CPDPRG1= <>
##$CPDPRG2= <>
##$CPDPRG3= <>
##$CPDPRG4= <mlev>
##$CPDPRG5= <mlev>
##$CPDPRG6= <mlev>
##$CPDPRG7= <mlev>
##$CPDPRG8= <mlev>
##$CPDPRGB= <>
##$CPDPRGT= <>
##$D= (0..31)
0 1.2 0 0 0 0 0 0 0 0.06 0 0.03 0 0 0 0 0.0002 0 0 0 0 0 0 0 0 0 0 0 0 
0 0 0 
##$DATE= 1710409738
##$DBL= (0..7)
120 120 120 120 120 120 120 120 
##$DBP= (0..7)
150 150 150 150 150 150 150 150 
##$DBP07= 0
##$DBPNAM0= <>
##$DBPNAM1= <>
##$DBPNAM2= <>
##$DBPNAM3= <>
##$DBPNAM4= <>
##$DBPNAM5= <>
##$DBPNAM6= <>
##$DBPNAM7= <>
##$DBPOAL= (0..7)
0.5 0.5 0.5 0.5 0.5 0.5 0.5 0.5 
##$DBPOFFS= (0..7)
0 0 0 0 0 0 0 0 
##$DE= 6
##$DECBNUC= <off>
##$DECIM= 32
##$DECNUC= <off>
##$DECSTAT= 4
##$DIGMOD= 1
##$DIGTYP= 9
##$DL= (0..7)
0 120 120 120 120 120 120 120 
##$DP= (0..7)
150 150 150 150 150 150 150 150 
##$DP07= 0
##$DPNAME0= <>
##$DPNAME1= <>
##$DPNAME2= <>
##$DPNAME3= <>
##$DPNAME4= <>
##$DPNAME5= <>
##$DPNAME6= <>
##$DPNAME7= <>
##$DPOAL= (0..7)
0.5 0.5 0.5 0.5 0.5 0.5 0.5 0.5 
##$DPOFFS= (0..7)
0 0 0 0 0 0 0 0 
##$DQDMODE= 0
##$DR= 18
##$DS= 0
##$DSLIST= <SSSSSSSSSSSSSSS>
$$ [...]
##$SUBNAM2= <"">
##$SUBNAM3= <"">
##$SUBNAM4= <"">
##$SUBNAM5= <"">
##$SUBNAM6= <"">
##$SUBNAM7= <"">
##$SUBNAM8= <"">
##$SUBNAM9= <"">
##$SW= 18.0517328524113
##$SWIBOX= (0..15)
0 0 2 0 0 0 0 0 0 0 0 0 0 0 0 0 
##$SW_h= 3612.71676300578
##$TD= 16384
##$TD0= 1
##$TE= 0
##$TE2= 300
##$TE3= 300
##$TEG= 300
##$TL= (0..7)
0 120 120 120 120 120 120 120 
##$TP= (0..7)
150 150 150 150 150 150 150 150 
##$TP07= 0
##$TPNAME0= <>
##$TPNAME1= <>
##$TPNAME2= <>
##$TPNAME3= <>
##$TPNAME4= <>
##$TPNAME5= <>
##$TPNAME6= <>
##$TPNAME7= <>
##$TPOAL= (0..7)
0.5 0.5 0.5 0.5 0.5 0.5 0.5 0.5 
##$TPOFFS= (0..7)
0 0 0 0 0 0 0 0 
##$TUNHIN= 0
##$TUNHOUT= 0
##$TUNXOUT= 0
##$USERA1= <user>
##$USERA2= <user>
##$USERA3= <user>
##$USERA4= <user>
##$USERA5= <user>
##$V9= 5
##$VALIST= <valist>
##$VCLIST= <CCCCCCCCCCCCCCC>
##$VD= 0
##$VDLIST= <DDDDDDDDDDDDDDD>
##$VPLIST= <PPPPPPPPPPPPPPP>
##$VTLIST= <TTTTTTTTTTTTTTT>
##$WBST= 1024
##$WBSW= 4
##$XGAIN= (0..3)
0 0 0 0 
##$XL= 0
##$YL= 0
##$YMAX_a= 861225
##$YMIN_a= -483850
##$ZGOPTNS= <>
##$ZL1= 120
##$ZL2= 120
##$ZL3= 120
##$ZL4= 120
##$ABSF1= 10
##$ABSF2= 0
##$ABSG= 5
##$ABSL= 3
##$ALPHA= 0
##$AQORDER= 0
##$ASSFAC= 0
##$ASSFACI= 0
##$ASSFACX= 0
##$ASSWID= 0
##$AUNMP= <proc_1d>
##$AZFE= 0.1
##$AZFW= 0.1
##$BCFW= 1
##$BC_mod= 2
##$BYTORDP= 1
##$COROFFS= 0
##$CY= 11.3945322036743
##$DATMOD= 1
##$DC= 2
##$DFILT= <>
##$DTYPP= 0
##$F1P= 15.7292609196834
##$F2P= 12.9074282941183
##$FCOR= 0.5
##$FTSIZE= 0
##$FT_mod= 4
##$GAMMA= 1
##$GB= 0.15
##$INTBC= 1
##$INTSCL= 1
##$ISEN= 128
##$LB= 0.24
##$LEV0= 0
##$LPBIN= 0
##$MAXI= 10000
##$MC2= 0
##$MEAN= 0
##$ME_mod= 0
##$MI= 1.114404
##$NCOEF= 0
##$NC_proc= 0
##$NLEV= 6
##$NOISF1= 3.799351
##$NOISF2= 2.8
##$NSP= 1
##$NTH_PI= 0
##$NZP= 0
##$OFFSET= 15.70392
##$PC= 1
##$PHC0= -25459.39
##$PHC1= 8.18731
##$PH_mod= 1
##$PKNL= yes
##$PPARMOD= 0
##$PSCAL= 0
##$PSIGN= 0
##$REVERSE= no
##$SF= 200.130013532006
##$SI= 16384
##$SIGF1= 3
##$SIGF2= 2
##$SINO= 400
##$SIOLD= 16384
##$SREGLST= <1H.CDCl3>
##$SSB= 0
##$STSI= 0
##$STSR= 0
##$SW_p= 3612.71676300578
##$SYMM= 0
##$S_DEV= 0
##$TDeff= 0
##$TDoff= 0
##$TI= <>
##$TILT= no
##$TM1= 0
##$TM2= 0
##$TOPLEV= 0
##$USERP1= <user>
##$USERP2= <user>
##$USERP3= <user>
##$USERP4= <user>
##$USERP5= <user>
##$WDW= 1
##$XDIM= 8192
##$YMAX_p= 0
##$YMIN_p= 0
$$ End of Bruker specific parameters
$$ ---------------------------------
##NTUPLES= NMR FID
##VAR_NAME=  TIME,          FID/REAL,        FID/IMAG
##SYMBOL=    X,             R,               I
##VAR_TYPE=  INDEPENDENT,   DEPENDENT,       DEPENDENT
##VAR_FORM=  AFFN,          ASDF,            ASDF
##VAR_DIM=   8192,          8192,            8192
##UNITS=     SECONDS,       ARBITRARY UNITS, ARBITRARY UNITS
##FACTOR=    0.0002768,     1,               1
##FIRST=     0,             0,               0
##LAST=      2.2672688,     0,               0
##MIN=       0,             -483850,         0
##MAX=       2.2672688,     861225,          0
$$ Real data points
##PAGE= N=1
##DATA TABLE= (X++(R..R)), XYDATA
0@%%%%%%%%%%%%Qj6J6j6J6k4L2l8M6n4O7p8R0j09J27j45J70j95K23k56K91l30
$$ 0 0 0 0 0 0 0 0 0 0 0 0 0 8 -8 8 -8 8 -16 16 -22 24 -30 37 -41 49 -60 67 -78 92 -103 120 -136 155 -175
34a75L72m22M77n35O00o69P45q31R25j027J133j253J387j526J685j859K046k255
$$ -175 197 -225 252 -283 317 -352 393 -438 487 -540 593 -660 727 -799 886 -973 1073 -1182
52a182K484k738L022l337L697m108M575n121N767o545P501q710J0298j2485J5712
$$ -1182 1302 -1436 1586 -1751 1946 -2162 2413 -2708 3059 -3486 4015 -4695 5603 -6882 8830
67H830k0998L1510q7105L41624L07064k87275m12829k74285l5964K2425J00037
$$ 8830 -12168 19342 -67763 273861 580925 293650 -119179 -393464 -429428 -407003 -306966
78c06966K06206K83680J51922k5776r6751n2001j07035k11845j52429J73139M39371
$$ -306966 -100760 182920 334842 309066 212315 160314 53279 -158566 -310995 -137856 301515
89C01515L20581j31322m61734l98014r2369J09762J41000J38116J62454R8166
$$ 301515 622096 490774 29040 -368974 -461343 -351581 -210581 -72465 89989 188155
99A88155o9554j85662j21374J6172O0736K6079P9747K27029K48009N83l10475
$$ 188155 118601 -67061 -188435 -172263 -111527 -85448 -5701 221328 469337 469920 159445
110A59445l61288j15161J45224J93308R2244K2567L537o9697j88889j96321l1882
$$ 159445 -201843 -317004 -171780 21528 113772 136339 139876 70179 -118710 -315031 -346913
121c46913J44198J65841Q5631N7618Q3905K7073j36069k24256q8996J53130K43110
$$ -346913 -202715 -36874 48757 106375 190280 217353 81284 -142972 -231968 -78838 164272
132A64272J09465o1101r8593n7626p3950j31757r9165M5578J58954J27625J6240
$$ 164272 273737 212636 114043 56417 -17533 -149290 -248455 -202877 -43923 83702 99942
143I9942m6005m9880p4763j11098m9690J22549K41484J59751m8655j70239j14558
$$ 99942 53937 4057 -70706 -181804 -231494 -108945 132539 292290 243635 73396 -41162
154d1162k474K3203j7530j0033N8980Q4741J5377p0844q9595o3813n0781k8026
$$ -41162 -43636 -20433 -37963 -47996 10984 95725 111102 40258 -49337 -113150 -163931 -191957
166a91957O0386J69932J65788M444j66769j70088j8622J09071J00139K2353r021
$$ -191957 -131571 38361 204149 208593 41824 -128264 -146886 -37815 62324 84677 75656
177G5656J0399M070m6863p6862m7413o829q67Q176O4847J11258N0302r4903j72687
$$ 75656 86055 90125 43262 -33600 -81013 -87842 -88709 -80533 -15686 95572 145874 50971 -121716
190a21716q4952Q2978J61469R6723r096n0288l7496l2804l9954j8530K5476L8988
$$ -121716 -206668 -123690 37779 134502 125406 75118 37622 4818 -35136 -53666 -28190 10798
202A0798R120j1306J2005L0414j7044r4059r3987J1910J20034J19454K5138n7149
$$ 10798 19918 8612 20617 51031 33987 -60072 -154059 -142149 -22115 97339 122477 65328
214F5328o6789l5961j3074N026L6774N9113L4033k2150m7373k3085o0j8547m3287
$$ 65328 -1461 -37422 -50496 -45470 -8696 50417 84450 62300 14927 -8158 -8218 -26765 -70052
227g0052j5666N1899Q2021L3767m1003o6253l4726J789J6001K8708M9753M8743
$$ -70052 -85718 -33819 48202 81969 40966 -25287 -60013 -58224 -42223 -13515 36238 84981
239H4981M391m9320n9349k2748J2403J4540N582J5696K9153R868l4606n5078k6817
$$ 84981 89372 40052 -19297 -42045 -29642 -15102 -9520 6176 35329 45197 10591 -44487 -71304
252g1304J6710L1589J9494J3485K3282K0305j1268m2709l7133j50L0331L3187
$$ -71304 -54594 -23005 -3511 9974 33256 53561 42293 -416 -37549 -37699 -7368 25819
264B5819K0820P123j1681l7780n0271k6371K0406M6002K8325n963j7968m769M807
$$ 25819 46639 53762 42081 4301 -45970 -72341 -51935 -5933 22392 16429 -1539 -6308 -1501
277a501m012j4819o674J5874L0673K6778J0719r750l1048m2578k7654J2158M4942
$$ -1501 -5513 -20332 -27006 -11132 19541 46319 57038 47288 16240 -26338 -53992 -41834 3108
290C108L9563r0l6236l8488j3085J0393J5224R762P225R096R863P496J798q384
$$ 3108 42671 42581 6345 -32143 -45228 -34835 -19611 -9849 -2624 6472 16335 23831 25629 17245
304A7245j9286j9722j284K6236L7366J6382k2079m5288l5578m612K1547K7040
$$ 17245 -2041 -21763 -23047 3189 40555 56937 34858 -10430 -46008 -50620 -29073 -2033
316b033J5267j051j1489j2249m982M406P738L574L80N832J5725J6074M28k1165
$$ -2033 13234 12183 694 -11555 -16537 -12131 -4393 -819 -439 5393 21118 37192 37620 16455
330A6455k9893j7602O832K4112K2619N254j5503k6540k1423l790J4331K1265J4107
$$ 16455 -13438 -31040 -24208 -96 22523 27777 12274 -14266 -35689 -39479 -25148 -3883 10224
343A0224J317n697k718K714K318l306o442j804P887J3979J0364k987j7989k4443
$$ 10224 11541 5844 3126 5840 8158 4852 -1590 -3394 4493 18472 28836 25849 7860 -16583
357a6583j6883J590J8853K1920Q890r794j9123j2826J957J2907J3569P203J090
$$ -16583 -33466 -31876 -13023 8897 17787 7993 -11130 -23956 -21999 -9092 4477 11680 12770
370A2770j170J13J418l69o000j0904q113K774J3744J3329m22j6725k1955j1572
$$ 12770 11600 11713 13131 12762 6762 -4142 -12255 -9481 4263 17592 17170 445 -21510 -33082
384c3082O133J8158J7807P581n245j2015q683J460R674Q717N26n109k308M458
$$ -33082 -26949 -8791 9016 16597 11352 -663 -9346 -7886 1788 10505 11031 5922 3614 8072
398H072N252k581j1879j3468n834N637J3307J2627L017j0179j7296j0961N444
$$ 8072 13324 10743 -1136 -14604 -20438 -14801 -1494 11133 14150 3971 -13325 -24286 -18842
411a8842J8162J6268K689q934r434k098L760L444l54l377l978j154M132P168K580
$$ -18842 -680 15588 18277 9343 -91 -2189 1571 5015 4661 1284 -2694 -3848 284 7452 10032
426A0032q798j6308r495Q225K0044J4701k331j4383j2851k303P343J0544P817
$$ 10032 1234 -15074 -24569 -16344 3700 18401 16070 1687 -11164 -13467 -6124 4420 12237
439A2237N90p327r182j918P287O787m410j3337p553P931J6380Q456p061j4521
$$ 12237 12827 5500 -3682 -5600 1687 8474 4064 -9273 -16826 -8895 7485 15941 8880 -5641
453e641r280J045Q872J1641Q873l92j1386j3307k754J0400J0952j377j1270o249
$$ -5641 -14921 -13876 -5004 6637 15510 15118 3732 -9575 -12329 -1929 9023 7646 -3624 -9873
467i873O185J0007J585p704p873j365L549N336O724O246q82j1106j2424o92J2245
$$ -9873 -3688 6319 7904 200 -7673 -9038 -5489 -153 6571 12817 11935 829 -11595 -12287 -42
482d2J0739k105j0186m949L633L309l341m347K173O211J636l080M34N879K889
$$ -42 10697 8592 -1594 -6543 -2910 399 -2942 -7289 -5116 1095 2731 -349 85 5964 8853
497H853o574q686R93J0244P001l963p793k343J029l891p037Q82J1188Q717n106
$$ 8853 2279 -6407 -5414 4830 11831 7868 75 -2268 -1239 -5130 -12167 -11285 -97 8620 3514
512C514j2380l549R610R965n01n797l02N425K461k579r31K388k315j0957q838
$$ 3514 -8866 -12415 -2805 7160 6659 862 560 5985 8446 5867 4936 7324 5009 -5948 -14786
527a4786O535J6826N950j5084k0282l172J5401J5112J484o846l814J010J710K910
$$ -14786 -8251 8575 14525 -559 -20841 -24013 -8612 6500 7984 1138 -2676 -1666 44 2954
541B954P455O687n642j6056p200J3386J9262o91k3997k2394J848J9961J3755m049
$$ 2954 10409 17096 11454 -4602 -11802 1584 20846 20155 -3842 -26236 -24388 -4427 9328 5279
555E279j1533o281k88K416P711J3170P442q861j6379j692J9488J9002o433k6385
$$ 5279 -6254 -12535 -12823 -10407 -2696 10474 17916 9055 -7324 -9016 10472 29474 23041 -3344
569c344j6521R427J9585N451j1984j3869n429L62K283P276J1386L716j1157j2980
$$ -3344 -19865 -10438 9147 14598 2614 -11255 -16684 -16322 -14039 -6763 4623 8339 -2818 -15798
583a5798N248K2099J4218j0006j9933m105J5431J3709m775j5145q143R73J96k643
$$ -15798 -10550 11549 25767 15761 -4172 -8277 7154 20863 16088 943 -7200 -6227 -6031 -8674
597h674K011O708k53j1332r083P990J8036O476j1099r801Q070J6564L606j2073
$$ -8674 -6663 45 -208 -11540 -20623 -12633 5403 11879 780 -9021 -951 15613 19219 7146
611G146r472M466Q577j653r287l596M115Kq864o259N904Q813k464r756n8J4045
$$ 7146 -2326 2140 10717 9064 -223 -3819 296 298 -8566 -14825 -8921 -108 -2572 -12328 -12386 1659
627A659J1026o492j4104m32J6328J2832n284j3977m935N637L717l676l964P75
$$ 1659 12685 6193 -7911 -8343 7985 20817 15533 1556 -3379 2258 5975 2299 -1665 -890
641h90o82p582o131O793J3734J825j4947j2429Q568K1647J0428j0062j4990j953
$$ -890 -1572 -9154 -15285 -8492 5242 7067 -7880 -20309 -11741 9906 20334 10272 -4718 -6671
655f671R747P379l81k422j891o245r125j032J1561J0375p022j9760r110J4107
$$ -6671 3076 10455 10074 7652 5761 -484 -9609 -10641 920 11295 4273 -15487 -24597 -10490
669a0490K1277M168j4771j3146K963J2482Q061N33j854l052o921o477L680J3191
$$ -10490 10787 14955 184 -12962 -9999 2483 10544 11077 9223 6171 -750 -7227 -3547 9644
683I644O078j2722j9772l809J6505J6005l136j6516r278O864J2485N337j297j670
$$ 9644 15722 3000 -16772 -20581 -4076 11929 8793 -7723 -17001 -10137 2348 7685 6388 4718
697D718j896m772k392O663J1319J218j3551j4314J855J4889P961r111j4201k623
$$ 4718 2822 -1950 -4342 2321 13640 14858 1307 -13007 -11152 3737 11698 2587 -11614 -14237
711a4237R010P584m75l054R1O89j926k62O265P850j532j0648o102O590J0013r41
$$ -14237 -5227 2357 1882 -1172 -1081 -392 -2318 -2580 3685 11535 10003 -645 -6747 -157 9856 8915
727H915j1550p581M574Q399J39p363l754L734M030q70j516L040L991j163m375
$$ 8915 -2635 -10216 -5642 2757 2896 -4467 -8221 -4487 -457 -1327 -2843 197 4188 3025 -1350
742a350N98O836L846o015q576N91R132M465p245j0461j627P110N538k218n165
$$ -1350 -752 6084 9930 3915 -4661 -4070 5062 9527 2282 -8179 -9806 -2696 2842 624 -4541
757d541j097K205J226P85L399L885j714o587k222P321R414n80j1119r102K913
$$ -4541 -5638 -3433 -2207 -1422 1977 5862 4148 -2439 -4661 2660 12074 11494 375 -8727 -5814
772e814R512L930n209p319k935J368K664K893L035k2m860n007K642J0176P132
$$ -5814 3698 7628 2419 -4900 -7835 -6467 -3803 -910 2125 2103 -2757 -7764 -5122 5054 12186
787A2186m420j0739m220O718R210J326o760o981j681J912K167K094J074k303n706
$$ 12186 7766 -2973 -7193 -475 8735 10061 3301 -3680 -5361 -3449 -1282 812 1886 -417 -6123
802f123l182M277Q672L741n457p816k98P900P044q57n811m011K84K170J605R27
$$ -6123 -9305 -5028 3644 7385 1928 -5888 -6186 1714 8758 7901 2090 -1921 -1637 533 2138 3065
818C065j95k788m807k217L520N807R11n135m690J486N699L565j391l150o87J639
$$ 3065 2870 82 -4725 -6942 -3422 2385 3296 -1839 -6529 -5043 656 4221 2830 -320 -1007 632
834F32J216L83Q56N20j820l384j373K230K985m70l722k390J263K707M35j609l21
$$ 632 1848 2231 3087 3607 1787 -1597 -2970 -740 2245 1775 -1947 -4337 -3074 -367 68 -1541 -1862
851a862J680J172n74o85J079J881J17j989j293J080J400m58j723p12M12j8j330
$$ -1862 -182 990 416 -269 810 2691 2808 819 -474 606 2006 1548 -175 -887 -475 -493 -1823
868a823q42J316K269ok527j631J490L141J359j080j592l30P88P51M50L08m99k016
$$ -1823 -2665 -1349 920 914 -1613 -3244 -1754 1387 2746 1666 74 -256 532 1283 1733 2041 1542 -474
886d74k037L57K674J830j478l451j884J689L518J778j061k064j028N59J657J935
$$ -474 -2511 -2154 520 2350 872 -2579 -4463 -2774 744 2522 1461 -603 -1631 -1072 585 2520
902B520R01j398k707j716J175L126J447k164l879j507J858L007J238j165k223
$$ 2520 3421 2023 -684 -2400 -1225 1901 3348 1184 -2695 -4202 -2344 663 1901 736 -1487
917a487j236N81K130K264Q16j355k703j080J831L048J053k098l242j305J338K277
$$ -1487 -2723 -2142 -12 2252 3068 1713 -990 -2070 -239 2809 3862 1764 -1478 -2783 -1445 832
933H32O68j285j904j150M0J704K017P82j117j793o99J666K679J013j408k036q44
$$ 832 1500 215 -1689 -2839 -2799 -1095 922 1704 587 -1206 -1905 -239 2440 3453 2045 9 -835
950h35Q57J150M90p28j307j358n76N10J277R08n69j577p10J117J886J093k77p11
$$ -835 22 1172 1662 934 -373 -1731 -2307 -1797 -520 388 -181 -1758 -2468 -1351 535 1628 1351 640
968F40l62L27O06N12J99k17j139j333l46P81Q19l93j408j187J10R42Q89L53K47
$$ 640 278 605 1211 1723 1922 1705 566 -767 -1113 -332 487 94 -1314 -2501 -2391 -1449 -560 -207 40
987D0j10k92j23P81J628Q38p24j541q15P49J117R7j073j444p88j45M12P47N45
$$ 40 -70 -362 -485 296 1924 2762 2038 497 -318 431 1548 1645 572 -872 -1660 -1805 -1393 -646 -101
1006a01m08j333q82Q75K362J669n42j572p94R43J574Q64l87j146j222p83J98J195
$$ -101 -509 -1842 -2724 -1849 513 2182 1640 68 -726 217 1791 2655 2268 1122 -100 -883 -685 510
1024E10P99r57k308j587Q69K472J600r29j919q46J063J963J248K87p98j238r11
$$ 510 1309 352 -1956 -3543 -2674 -202 1398 469 -1450 -2296 -1233 730 1978 2265 1467 229 -682
1041f82O13J867J213j132k813j818J001K376Q93j468k166p41R18J518J189L82
$$ -682 -69 1798 3011 1879 -934 -2752 -1751 625 1518 50 -2116 -2857 -1939 -421 768 1150
1057A150o04j244p84J019K321J418j130k623j224J376K031L16j769j709k67O62
$$ 1150 546 -698 -1482 -463 1858 3276 2146 -477 -1701 -325 1706 2022 253 -1456 -1723 -1061
1073a061O27N06J84m51j024p83J019K139J044j308j876k24J755J320l67j404n40
$$ -1061 -434 72 256 -195 -1219 -2002 -983 1156 2200 892 -984 -1208 547 1867 1500 96 -444
1090d44M83K90m98k58M26J52p26p76M15J343M29j096q35O74J327Q0j126l80J020
$$ -444 39 329 -169 -427 -1 151 -575 -1351 -936 407 836 -260 -1095 -421 906 986 -140 -520 500
1109E00R95o15j541m48J113J010m32j115l62N49J57l52K19R30J85j237j215R24
$$ 500 1495 880 -661 -1109 4 1014 582 -533 -895 -346 -189 -541 -322 608 793 -444 -1659 -735
1127g35K253Q68j831k311N3K117J494o62j514p59P8L09M10R73O18r75k257o63
$$ -735 1518 2386 555 -1756 -1703 414 1908 1246 -268 -1027 -949 -640 -230 743 1361 386 -1871 -2534
1145b534K222K846J32k886k345Q14K755J417r35j745p85jL86Q61J244K02k014
$$ -2534 -312 2534 2666 -220 -2565 -1751 1004 2421 1486 -259 -1044 -1045 -659 202 1446 1648 -366
1162c66k420J46K967K526p96l292j806J500K886Q91j047j400o15O2M41J085J183
$$ -366 -2786 -2640 327 2853 2057 -1235 -3041 -1541 1345 2236 1189 -211 -826 -764 -323 762 1945
1179A945k87k320k076P54L050J699j794l067q53K030K153K54j224q86j8J99K41
$$ 1945 1658 -662 -2738 -1984 1066 2765 971 -2096 -2949 -919 1234 1488 264 -622 -640 -441 -200
1196b00J063J068m50k075j268J251K506M37k184k267L27J966R17r58j171O4N58
$$ -200 863 1931 1481 -594 -1862 -611 1895 2332 148 -2119 -1792 174 1091 133 -1038 -974 -416
1213d16O2q9N21Q13j74j223l19J348J435n43j816o93J377J324p64j910n91J199
$$ -416 -354 -443 78 891 717 -506 -825 523 1958 1415 -401 -1094 283 1607 843 -1067 -1658 -459
1231d59J069n11j202o0P34L18k94K48P84J65r05p00J086J873K34k141j916O72
$$ -459 610 99 -1103 -1163 -429 -111 -405 -157 627 792 -113 -813 273 2146 2380 239 -1677 -1005
1249a005K247Q64j534k102m59R67R39J86j72j57p11q59O88K153J512j096k500
$$ -1005 1242 2106 572 -1530 -1989 -1022 -83 103 -69 -226 -937 -1796 -1108 1045 2557 1461 -1039
1266a039r23K060K740K19k433k149L5J425R18m8o55j003j091l08J266K108N99
$$ -1039 -1962 98 2838 3057 624 -1525 -1490 -65 853 805 150 -853 -1944 -2252 -986 1122 1721
1283A721j849k175K77K816K153p33k269j264R98J506N84n85q04q59q28j53J160
$$ 1721 -128 -2303 -2026 790 2943 2210 -59 -1323 -325 1181 1765 1180 376 -483 -1311 -1464 -304
1300c04J296k34k088j398R73K316J163j217j525%J369J043m5m51k61k90m92p2
$$ -304 992 758 -1330 -2728 -1755 561 1724 507 -1018 -1018 351 1394 1349 898 637 347 -145 -217
1318b17O46O67o12j563p39Q93J355J7j219o72O53J042K86n31p2M86L10k37k37
$$ -217 429 1096 484 -1079 -1818 -925 430 447 -772 -1444 -791 251 537 6 -66 420 730 493 256
1337B56M53L48m67r10j93P58L23o35j087jR40M31n63p43L11R71L67l40l12L91
$$ 256 709 1057 590 -320 -513 245 568 -67 -1154 -1155 -215 216 -347 -1090 -779 192 559 219 -93 298
1357B98L63j91k23K23M67k64r25n38N34Q86r8j124p87M32J047L37n68l92R0K52
$$ 298 661 470 247 470 937 673 -252 -790 -256 630 532 -592 -1379 -947 100 437 -131 -523 -433 -181
1377a81K75K39M57N4o56p09J25J047O67o19j296o00O61R14J80p08o78l8L59M69
$$ -181 94 333 790 844 188 -521 -396 651 1318 699 -597 -1197 -536 378 558 -150 -828 -866 -507 -38
1397c8L91K80k83p40m64P82J177K44q73j238j59R65Q51k15q77n96L1L45M65K70
$$ -38 353 633 350 -390 -854 -72 1105 1349 476 -762 -921 44 895 680 -197 -793 -762 -417 48 318
1417C18l2m89n62l1R04R19o1r76p35L29R45M99m70p47l18J87K49J41K8j7m57l18
$$ 318 286 -203 -765 -796 108 1027 966 -10 -745 -416 529 1028 558 -189 -507 -320 -71 70 98 81 -376 -694
1439f94J36O73M40k34n98k90N22O71jm17l49J25K20l3p6r2Pj98j45m9L50J14k02
$$ -694 -558 115 555 321 -277 -567 -45 626 625 208 -141 -16 204 171 95 3 10 -188 -333 -382 -32 82 -120
1462a20k75J08L42J47j77j64J78K65K11l99k76J64K64j4k04j71p7O1j0n7J13Q5
$$ -120 -395 -287 55 202 25 -139 39 304 515 116 -160 4 268 254 50 -121 -198 -137 -147 -204 -91 -6
1484fj61k57N3M46L92j47n07r0K68M61J35l20l15j03O0J20J01N6j95l70j70K23
$$ -6 -167 -424 -371 75 467 320 -187 -277 -9 452 587 267 -48 -151 -91 29 130 186 -9 -379 -549 -326
1506c26N48J34k97n55r1N19M97nk38l01j06J00K51K68J5k66m12k11L69M29R6m38
$$ -326 222 356 59 -496 -587 -68 429 424 186 -115 -221 -121 130 398 413 147 -265 -476 -107 322 418 -20
1528b0n07oM18L93Qk47l09J7P9L65K06K6k81l97n4L36L96j1m14l73K2L31K29j2
$$ -20 -527 -533 -115 278 286 39 -270 -253 -174 191 397 423 142 -255 -309 27 423 412 -2 -375 -353 -22 207 195
1552A95k59j60l1J37K15J30M6k66k94N2K94K71l5l52k20J09J78J06j5j11J3n8
$$ 195 -64 -224 -255 -118 97 227 273 7 -287 -235 59 330 295 -57 -277 -168 10 116 101 -10 3 -55
1574e5J4O2J54K5k14j73N1J89J27j02k38j1J19N0j6q6J06R7k7j42l7J57R3l4q6
$$ -55 -41 21 175 200 -14 -187 -136 53 180 78 -160 -171 -52 -2 -18 -104 2 99 72 -70 -107 50 143 109 23
1599B3j7N9k6j37M4R6O9j64j95j1K31K30j24k81n0J80K44J29p9j43j17m9kK40
$$ 23 6 65 39 -98 -54 42 111 -53 -248 -259 -28 202 78 -203 -253 -73 171 300 221 78 -39 -88 -90 150
1623A50J59q3l65k71J51L64J55k58l03j43K75K81O7J5j77j65o9K43L43J09k55
$$ 150 309 226 -139 -410 -259 105 260 2 -301 -444 -169 112 179 194 17 -148 -217 26 369 478 223
1644B23n11o4K71M76L7m41l72PK25K19N6l7j65k09O0J95M29O6l88l55J4M14L43
$$ 223 -288 -352 -81 395 432 -9 -381 -374 -149 70 126 89 -76 -285 -225 -30 399 465 77 -278 -264 150 493
1667D93j25m27l14J03K15J23K0j72n8j31lK72K84j6k96j71R5M01J07j68k94r9
$$ 493 368 -59 -373 -270 -55 68 88 -84 -142 -273 -276 -4 280 264 -32 -203 -108 293 400 232 -62 -161
1689a61R5O5k7Lm2p0j41M6J94J78m1j92j16K09L15k8k33p4P8J38k3k05m4K8k6
$$ -161 -66 -1 -28 -25 -67 -137 -278 -232 -38 140 99 -93 -209 0 315 287 54 -20 58 196 173 -32 -76 -48 -74
1714g4j36r8J23J38l6j17K8K11J49j31j44J81K55R9j46l05o5J96J28j58k42j16
$$ -74 -210 -308 -185 -47 -83 -200 -172 39 188 57 -87 94 349 448 302 -3 -68 128 256 98 -144 -260
1736b60LoJ5R6J74j25k39j2L58M40M1m31k02J66M06J20j53l31j98m0J2Q2O3l6
$$ -260 -257 -263 -248 -152 22 -103 -342 -354 4 444 485 54 -148 18 424 544 391 60 -138 -178 -166 -84 -21 -57
1760e7l44k78J15M69M88k08m63p9M03M15J51k18k33q7j4J45J24M9k86n02k49K90
$$ -57 -401 -679 -564 -95 393 185 -278 -357 46 461 612 394 161 74 60 205 329 378 92 -410 -659 -369
1782c69M18J39l70m76Q2N05L09nj66j08J30J22J13J40L1k41l73j23K46K59j29
$$ -369 49 188 -182 -658 -576 -71 238 233 67 -41 89 211 324 464 495 254 -119 -242 4 263 134
1803A34m76l03K26K64R8j00j42J03K03R5Q3J15M2oj60lJ26R8k88l14q9J74J36
$$ 134 -342 -645 -419 -155 -57 -157 -299 -196 7 102 185 300 342 336 176 173 299 397 109 -205 -294 -120 16
1826A6j68k80qJ99J01j2l9Q1K18NO2K9J69o1j43j60J51P6o3l28k04J09K35l7k36
$$ 16 -152 -432 -440 -241 -140 -152 -191 -110 108 113 175 204 373 312 169 9 160 236 173 -155 -359 -250 -15 -52 -288
1851b88j37R2J95J02M6J17K2J1r5R1K12J00j45l62j05J17J89p5k86j66j9J60L6
$$ -288 -425 -333 -138 -36 10 127 149 160 65 156 368 468 323 -39 -144 -27 162 87 -199 -365 -384 -224 -188
1874a88R4K8kr6K7K28K87J12k24k75j9K44J73r6l08k63OJ15Qmm0n1j25O5K45K61
$$ -188 -94 -66 -68 -164 -137 91 378 490 266 -9 -28 216 389 293 -15 -278 -272 -157 -149 -153 -193 -244 -369 -304 -59 202
1900B02Q8j99k27J91M12J12k01l40r7Q9R4l1j21j36j68p7P2J75J81j08k07LK37
$$ 202 290 91 -136 55 467 579 378 38 -59 30 124 93 -28 -164 -332 -409 -337 -162 19 -89 -296 -293 -56
1923e6M02N0k59j60Q8K82N2j60j99m6k6j18JO4L1k17j14P2K83J03j03j43O7K82
$$ -56 346 396 137 -23 65 347 399 239 40 -6 -32 -150 -149 -85 -54 -271 -385 -313 -30 73 -30 -173 -106 176
1947A76J78m2j34l5L9L0K9j39q4q3o9p4P6Q0j34j90K1K41J95Lq0o2O9K05N7o1
$$ 176 354 312 178 143 182 212 241 102 18 -65 -134 -208 -132 -52 -186 -376 -355 -114 81 84 4 -58 11 216 273 212
1973B12m8n4k2lpQ6j31k00j94Q9J91O3q1j43N9J41J96O2j01j4%K8M5O6o1p6k18
$$ 212 164 110 88 85 78 164 33 -167 -361 -272 -81 -18 -99 -242 -183 -42 154 216 115 101 101 129 174 240 179 103 -115
2000a15J2R4M4j0k39p5M9J73J06l2j16QP6J44L9J5l6J6j28OJ22N1j70j09j23J26
$$ -115 -103 -9 35 25 -214 -289 -240 -67 39 7 -109 -101 -25 119 158 173 137 153 25 31 153 204 34 -75 -198 -72
2026g2N1J8m3r4m9Q8J12O8n9NJ1l7O8P8J7n0j17p1O9N5m1j58jK2NO1j1L3J6l8
$$ -72 -21 -3 -46 -140 -189 -101 11 79 20 25 36 -1 67 145 162 112 -5 -76 -7 48 7 -151 -152 -130 -125 -64 -75 -42 -26 -64
2056f4Q8M2L2L3m9r1N5N4k2oj24n0L1Q0o2k4k1K5K0N5m3L9J8q0J14N0N0k8p0p2
$$ -64 24 66 98 131 82 -9 46 100 78 72 -52 -102 -71 9 -53 -77 -98 -73 -53 2 -41 -2 16 -64 50 100 150 122 52 -20
2086b0O4J3m9r2k5QM2N0o6J1J1J7j9N1P3M6r0lM8M7K4oj30p9j7Q6k7j01J6NQ0
$$ -20 44 57 8 -84 -109 -101 -59 -9 -75 -64 -53 -36 -55 -4 69 115 25 22 70 117 141 135 5 -74 -91 -5 -32 -133 -117 -112 -32
2117c2MQ0m5m6J0M3O7O1N7q8j32k6J18O2j01j09kK4l5K3L6n2no0J12R9R5l5j92
$$ -32 -28 52 7 -39 -29 14 81 142 199 111 -21 -47 71 133 32 -77 -79 -55 -90 -67 -31 -83 -88 -148 -36 63 158 123 -69
2146f9L4J08N9Lm2p8%j9k4L9pl4r1J5P9J6K7p6p0O5J18L7po5lL3p2R2K1p9j7J0
$$ -69 -35 73 132 135 93 15 15 -4 -28 11 4 -30 -121 -106 -27 -11 16 -60 -130 -65 53 90 83 18 15 48 -24 68 89 10 -7 3
2178Cr1J24j8j06J1j9k4J27N5j37M1P7j8L9op4P5pql9MKm4J4k8K7L2n6Jl8Q6J5
$$ 3 -88 36 18 -88 -77 -96 -120 7 62 -75 -34 43 25 64 58 -16 59 52 44 5 9 11 -33 -19 -47 -20 12 -44 -43 -81 5 20
2210B0J2m4L0k1Q7l7k6Kl4m6J2O0j4j2p1L2kJ05l5Nn5L1N3M5l1m7m5P4r9Q1K6
$$ 20 32 -12 18 -3 84 47 21 23 -11 -57 -45 15 1 -11 -82 -50 -52 53 18 23 -32 -1 52 97 66 19 -26 48 -51 30 56
2241E6m0J5j20K9n2J66j2m1o1J6M3K3J4j5J5%n0N7O0o7l8j24J10LN7n5n2q7P0
$$ 56 16 31 -89 -60 -112 54 42 1 -60 -44 -1 22 36 21 36 36 -14 43 103 36 -2 -126 -16 -13 44 -11 -63 -150 -80
2270h0Q9L1n3O0m0J1l6R9L5p4k3n5NO0J00j39r9J3L9L5J5J5o9J5L1L1OM4l3p0
$$ -80 9 40 -13 47 7 18 -18 81 116 42 19 -36 -31 29 129 -10 -109 -96 -57 -22 -7 8 -61 -46 -15 16 22 66 33 -37
2300c7J5P1O5r1n3j0OK8%m6j1N8n7RpJ11l9lo5J26q2N8J8o4K0N2K7q5j3l9N3j5
$$ -37 -22 49 114 23 -30 -40 -34 -6 -6 -52 -63 -5 -62 -53 -60 51 12 9 -56 70 -12 46 64 0 20 72 99 14 1 -38 15 0
2332@rk0N7o1L3n4P0K0l6p0M7Q4O3p8m7p2J00K5K3m8o6j6JN5M9n1J6k5n7N2R2
$$ 0 -9 -29 28 -33 0 -54 16 36 0 -70 -23 61 124 46 -1 -73 27 52 75 27 -39 -55 -54 1 50 -1 15 -10 -67 -15 77
2363G7K8j17k5L2L9N3k2n2l2l6k1%J20o3Jk5l3L1J03j0l4k8p3J39K5m5K6n3p2
$$ 77 105 -12 -37 -5 34 87 65 13 -19 -55 -76 -76 44 -19 -18 -43 -76 -45 58 48 14 -14 -87 52 77 32 58 5 -67
2392f7M6kM6k0l6o8L0P0K8Jn5j0k8K7J51k8n6m5RK6N3j7k0jk3r7N2P3o4l8k1J04
$$ -67 -21 -23 23 3 -33 -101 -71 -1 27 28 -27 -37 -65 -38 113 85 29 -16 -7 19 72 55 35 34 11 -86 -34 39 -25 -63 -84 20
2424B0n2L8m1N2nK1j5lK9L3n0n2Q8n5p4L1o0M9N7n5Km9K9K0M2POJ5J5K2qORn7
$$ 20 -32 6 -35 17 12 33 18 15 44 77 27 -25 63 8 -66 -35 -95 -46 11 -44 -42 -91 -62 -42 0 7 13 28 43 65 57 63 72 15
2458A5J9j4L1m8k5m5j2N5L5m4jo3MR2J8K5m7M1o0N7L6M8p0j03K1M3K0Qj6q7l6
$$ 15 34 20 51 3 -22 -67 -79 -24 11 -33 -34 -97 -93 -1 17 42 -5 36 -24 33 69 117 47 -56 -35 8 28 36 20 -67 -103
2489a03K3O9k4J0m4j1N9N9k1P9K0j49P8oJ3K9n0n6j9M3l5J7r2L0N2l5K0N2lL6
$$ -103 -80 -11 -35 -25 -69 -80 -21 38 17 96 116 -33 45 39 52 81 31 -25 -44 -1 -36 -19 -111 -81 -29 -64 -44 8 5 41
2519D1l4KK6N6j0n7Q0r6K5J5m9j3j5O5p5Nj2N1n3L2k2Q2j2l1jjP3p5J1j2N5j0
$$ 41 7 9 35 91 81 24 104 8 33 48 -1 -14 -29 36 -39 -34 -46 5 -48 -16 -38 44 32 1 0 -1 72 -3 8 -4 51 41
2551D1m4K1M8j06k4K9k8O7M3k8p7J6N4LmK2l0K3p1O8L6oK2r4oN5j6j4m3p1M1J5
$$ 41 -3 18 66 -40 -64 -35 -63 4 47 19 -58 -42 12 15 11 33 3 26 -45 23 59 53 75 -19 -25 30 14 0 -43 -114 -73 -58
2583e8J03n6k2k9J3M0M7Jk8J0k1J1Rjj0o8N8qRM9p2j4K4J0M9n6J9L5p6J7K0N0
$$ -58 45 -11 -33 -62 -49 -9 38 39 11 21 0 11 20 19 9 -59 -1 -9 0 49 -23 -37 -13 -3 46 -10 9 44 -32 -15 5 55
2615E5l7LJoJ2ONn9LK8K3O3r3p6KN0N0l9J5k1j2L3N0o6P4n6l0qM9j2lk3l9J2R0
$$ 55 18 21 22 16 28 34 39 -20 -17 11 34 97 4 -72 -70 -20 30 -9 6 -15 -27 6 56 -10 64 8 -22 -30 19 7 4 -19 -58 -46 44
2650D4J3J2rn8%J9L3J2l3m2j2%O4k2m1K3J3KoK4l1L9n6O3l3M7o0l6J0RM5l1oJ
$$ 44 57 69 60 2 2 21 54 66 33 -9 -21 -21 43 21 -20 3 16 18 12 36 5 44 -12 51 18 65 5 -31 -21 -12 33 2 -4 -3
2684cn4M4L9o2K3J3J9J1o9mP9pJ6m2oK5j8j3pP4mJ1j09L5p5J31rn5nl1J8M0k5
$$ -3 -57 -13 26 -36 -13 0 19 30 -39 -43 36 29 45 3 -3 22 4 -9 -16 58 54 65 -44 -9 -84 47 38 -17 -22 -53 -35 5 -20
2717b0N0qj1j1j5qJ9kn0O8Q5r4L7m0%n7Q1rn6K4K9jJ9j9lOL2n3j7M1kpj0j8N4
$$ -20 30 22 11 0 -15 -23 -4 -6 -56 12 97 3 40 0 0 -57 24 15 -41 -17 12 11 30 11 8 14 46 -7 -24 17 15 8 -2 -20 34
2752C4j5n0P9r3L3k0pNj1Oj0QK2N0j8J9k8K9l5J2m1L0K3J4m4L2n7m%M5m6N3j3
$$ 34 19 -31 48 -45 -12 -32 -39 -34 -45 -39 -49 -41 -19 31 13 32 4 33 -2 10 -31 -1 22 36 -8 24 -33 -37 -37 8 -38 15 2
2785BO6r8kK1lK5l9N4l2l8K2L6n2M7J1r7j8J28k7r3L9l1O1J8L4pK3m6l1RJ6J17
$$ 2 68 -30 -32 -11 -14 11 -28 26 -6 -44 -22 14 -38 9 20 -77 -95 33 6 -87 -48 -79 -18 0 34 27 50 4 -27 -18 -2 115
2817A15r7o4J5KP8on4o4R8m5k6O3k9j5jO0o5N5%J4L8o6J4l7P0q2j0J9M9J3n7%
$$ 115 18 -46 -31 -29 49 43 -11 -75 23 -22 -48 15 -14 -29 -30 30 -35 20 20 34 72 6 20 -17 53 -29 -39 -20 29 42 -15 -15
2849a5n9L5J3L7Pk7J8n3R2rk1j8L9J0qM9q2j1l7l9Q1k4L9k4J9o3J8K8j2K4j3l1
$$ -15 -74 -39 -26 11 18 -9 9 -44 48 39 18 0 39 49 41 90 8 -3 -40 -79 2 -22 17 -7 12 -51 -33 -5 -17 7 -6 -37
2881c7R4j1l3Op3k6J09Mn3N4o1OL0j5l5K8J2l1J9L8LL6k0o8M7K9l1j2j8J2K1j7
$$ -37 57 46 13 19 -54 -80 29 33 -20 34 -27 -21 9 -6 -41 -13 -1 -32 -13 25 28 64 44 -24 23 52 21 9 -9 3 24 7
2913GQj9o8K6J5j8Mj3R2l5p6R6J0o8L6J9K4o5M3l8L6J3n7K5N6j0l3J2m1j8M9n
$$ 7 15 -4 -72 -46 -31 -49 -45 -58 34 -1 -77 19 29 -39 -3 16 40 -25 18 -20 16 29 -28 -3 53 43 10 22 -19 -37 12 7
2945Gl9M7lK9km6jK4j5M7q6L0N1n8NKO2o0k8J9J7k7M8l1k5Q1n7L2n8O0jM4n7j2
$$ 7 -32 15 12 41 39 -7 -8 16 1 48 -38 -8 43 -15 -10 -8 54 -6 -34 -15 2 -25 23 -8 -33 48 -9 23 -35 25 24 68 11 -1
2979al3K7k0K4Np2L6L2L6l5ol3J3R3r3M7k3j6J3K9M9q5Ll3N3K4N0j40J8Q3l0l6
$$ -1 -34 -7 -27 -3 2 -70 -34 -2 34 -1 -7 -40 -27 66 -27 20 -3 -19 -6 23 72 -13 -10 -43 10 34 84 -56 -38 45 15 -21
3011b1J0K3m2RKJ8Ol6M8j05R4j2k2j8L1L4nK3mm2J8M4k0Pj7q6Q4K2r1N4j4J2o3
$$ -21 -11 12 -30 -21 -19 -1 5 -31 17 -88 6 -6 -28 -46 -15 19 14 37 33 -9 9 53 33 40 23 -63 21 43 -48 6 -8 4 -59
3044e9O9l3M0J5l7oj3m2M4J8J9l0J5J4KLk2k2L1N9m9M4m6j0o3R2p0O0NJ5K1o6
$$ -59 10 -23 17 32 -5 -11 -24 -66 -22 -4 15 -15 0 14 16 19 -3 -25 6 65 16 60 14 4 -59 33 -37 23 28 43 64 -2
3076bk0R0n3k4J9lj9O0m5k3L5l2J2k1O2rJ3q6K0M8J3rqRl8K5M3o5K0j8K6mm8p
$$ -2 -22 68 15 -9 10 7 -12 48 3 -20 15 -17 -5 -26 36 27 40 -46 -26 22 35 26 18 27 -11 14 57 -8 12 -6 20 16 -32 -39
3110c9N7k0L7mp0L9n8Q0j6J3o2N4Oj6J6Qopk8O5p0K0L7pKo0m4N5K3l8M6J4l4j9
$$ -39 18 -2 35 31 -39 0 -58 22 6 19 -43 11 17 1 17 25 19 12 -16 49 -21 -1 36 29 31 -29 -73 -18 5 -33 13 27 -7 -26
3144b6M2m2L1nrj7N4K5k9l9J4j8NK5J9m9K1N4q2M6k1m6J4P4ool1Pm7M7J6l8M4
$$ -26 16 -26 5 0 -9 -26 28 53 24 -15 -1 -19 -14 11 30 -19 2 56 -26 20 -1 -47 -33 41 35 29 -2 5 -42 5 21 -17 27
3177B7p3J8jj5O1k0L3l7K1l1K8no3O3K4Qm1M9lq2O0n6J00r9J7NnKK3QLj6oJ2J7
$$ 27 -46 -28 -29 -44 17 -3 30 -7 14 -17 11 6 -57 6 30 38 -3 46 43 -39 21 -35 65 -34 -17 -12 -17 -15 8 16 19 3 -3 9 26
3212B6K4m5oM2k4j0%K3o7M9k7J1J7Pm8M5Nok4J6m8K8M5rl8K4j6J3PK2m5jnJ1K5
$$ 26 50 5 -1 41 17 7 7 30 -37 12 -15 -4 13 20 -28 17 22 16 -8 8 -40 -12 33 24 -14 10 -6 7 14 36 -9 -10 -15 -4 21
3247B1K2n0j5M0L1j5p6P3k0n2N5n6O1l3L0ojK2j4j3j6j7N5J4o1n1P7Kk0N8l3k0
$$ 21 43 -7 -22 18 49 34 -42 31 11 -41 14 -42 19 -14 16 10 9 31 17 4 -12 -29 26 40 -21 -72 5 7 -13 45 12 -8
3279hL4j2m1M4k2m2M1QKL4m8%K5K4j1j1rK8p9N2k6j8J9QJ5j3O9j5q5L6L3k1j4
$$ -8 26 14 -27 17 -5 -47 -6 2 4 38 -10 -10 15 39 28 17 8 36 -43 9 -17 -35 -16 -8 7 -6 63 48 -37 -1 32 11 -3
3312cM1o2MN5km7K5%J9k5l6RJ8L2o3L8J4p6M4j2L1J6K3m3K6Nk0k9N4o9Q8p7K1
$$ -3 38 -24 -20 35 33 -14 11 11 30 5 -31 -22 -4 28 -35 3 17 -59 -15 -27 4 20 43 0 26 31 11 -18 36 -33 55 -22 -1
3345aOk6j1L8K5j9Ok3J5n3O0k4J9j0Qm2M6LnJ6rm2M2K8p2J9kjK0k9l3P8k8O2q8
$$ -1 5 -21 -32 6 31 12 18 -5 10 -43 17 -7 12 2 10 -32 14 17 12 28 19 -23 19 47 -25 -6 -8 -9 11 -18 -51 27 -1 61 -27
3380b7lJ1O5n5j2lL0k6K8l3M0k7M7k2j7N6j1j7n7J2j5pM6l4O9l2MJ7rl8j6L7O
$$ -27 -30 -19 46 -9 -21 -24 6 -20 8 -25 15 -12 35 13 -4 52 41 24 -33 -21 -36 -43 3 -31 38 6 10 27 18 -20 -36 1 7
3413GJ5k5%K1Om5J6k1N8n6M2k8l3L2l9M4K3j3j0rJ8j8J8MJ2K9q9N2m8k1M3j8J0
$$ 7 22 -3 -3 18 24 -21 -5 -26 32 -24 18 -10 -43 -11 -50 -6 17 4 -6 -15 3 -15 3 7 19 48 -41 11 -37 -58 -15 -33 -23
3446b3Rk2J3K5L5q1M9j4j2ojL4K5l1L2l1K1j1o0R0q0O8m4K4mon4M0k7Q9n2K9J1
$$ -23 -14 -36 -23 2 37 -44 5 -9 -21 -27 -28 6 31 0 32 1 22 11 -49 41 -39 29 -15 9 5 -1 -55 -15 -42 47 -5 24 35
3479C5l3mj5kNJlJ3M1jLl6m2M5k4jKK3M8q2K6j8k6J04n9J4l8J5PJ4k5M1k6K7n1
$$ 35 2 -2 -17 -19 -14 -13 -16 -3 38 37 40 4 -38 7 -17 -18 -16 7 55 -27 -1 -19 -45 59 0 14 -24 -9 -2 12 -13 28 2 29 -22
3514b2l%jM3pk7l4QlO3J4k8l6R2qPj3m8M0k9rM3m7N7m4J8l4j5O6m3NL0k9lJ1j5
$$ -22 -25 -25 -26 17 10 -17 -51 -43 -46 17 31 3 -33 59 51 58 45 -3 37 8 -1 42 -5 52 8 26 -8 -23 43 0 5 35 6 3 14 -1
3550aRl3J9Qj3K0J3l8J7L8m6J2m0J2J2k2L1LL0n4O3q4%M5j2L6Jm5M8k8j5L3J7
$$ -1 8 -25 -6 2 -11 9 22 -16 1 39 -7 5 -35 -23 -11 -33 -2 1 31 -23 40 -44 -44 1 -11 25 26 -19 29 1 -14 19 36
3583C6J4Kn4jk5LK6J8k5k9mK6p1O8L9j4J2k9J7j7j6M1j9pj8J7O8m1ll8N1nl4n
$$ 36 50 52 -2 -3 -28 -25 1 19 -6 -35 -39 -13 -84 -16 23 9 21 -8 9 -8 -24 17 -2 -9 -27 -10 58 17 14 -24 27 22 -12 -17
3617a7pP4m6jJkJ1MoL9n5j0O4o7P3n2K1Qk4n9K5J4L0n4L2M5j7mPnk4L3k6M9j5
$$ -17 -24 50 4 3 4 2 13 17 11 50 -5 -15 49 -18 55 3 24 32 8 -51 -26 -12 18 -36 -4 41 24 20 27 22 -2 31 5 54 39
3652C9k8OL7m8L4l4K4q3P2k8l4P7J2n3k6J4J4Lk1L5k8mj7N2l5L1l9K3pN4q0N5
$$ 39 11 17 54 6 40 6 30 -53 19 -9 -43 34 46 -7 -33 -19 -5 -2 -23 12 -16 -20 -37 15 -20 11 -28 -5 -12 42 -38 17
3684A7k6m8J14r4O5k7PJ2oq2R5k9nK0K8k1m6%L0L8p1L3J7L4mj17J25l2rj9L3m6
$$ 17 -9 -57 57 -37 28 1 8 20 14 -68 27 -2 -7 13 41 20 -26 -26 4 42 -29 4 21 55 51 -66 59 27 18 -1 32 -14
3716a4KK4m8J33n6lo6L1L3m6J9K7n8O5n1PM3m2M5p3L6m7K1M5K9qo8MK%ML7m1L7
$$ -14 -12 12 -36 97 41 38 -28 3 36 -10 9 36 -22 43 -8 -1 42 0 45 -28 8 -39 -18 27 56 48 -20 -16 -14 -14 -10 27 -14 23
3750B3k6oJ7L5m3Rj7l6O6m1N5o8N9q4N0K9mK1l2n4M5m9N6J4Kk0p5L0K8K8m4O9
$$ 23 -3 -9 8 43 0 9 -8 -44 22 -19 36 -32 27 -57 -7 22 18 39 7 -47 -2 -51 5 19 21 1 -74 -44 -16 12 -32 37
3782C7r2P3k3K9p3L6k9P0KJ3l9L1m6NO0m2lLL2r5j3P4j10J09o3O6n9lO8j8L1j9
$$ 37 -55 18 -5 24 -49 -13 -42 28 30 43 4 35 -11 -6 54 12 9 12 44 -51 -64 10 -100 9 -54 12 -47 -50 18 0 31 12
3814A2l7J4jK6rj5N5q6N6j4j2K4k2k8M8m7P3o7KO2p0QpK4RK1m1RK4Pm8J8N0q3
$$ 12 -25 -11 -12 14 5 -10 45 -41 15 1 -11 13 -9 -37 11 -36 37 -30 -28 34 -36 -28 -35 -11 -2 19 -22 -13 11 18 -30 -12 38 -45
3848d5NN5n6N5l2j5K8J2j1M4n3J7q4K2P3j2QmNl7L3J2L5o7J7k8KNk8J6JL8k7%
$$ -45 -40 15 -41 14 -18 -33 -5 7 -4 40 -13 4 -80 -58 15 3 11 7 12 -25 8 20 55 -12 5 -23 -21 -16 -44 -28 -27 11 -16 -16
3882a6j6J8%L8j4k2j4nPk6K8L0kK4j5J4k7l4O3n8O4k2J8m6k7jN2QOo3J7J4J7m0
$$ -16 -32 -14 -14 24 10 -12 -26 -31 -24 -50 -22 8 6 30 15 29 2 -32 31 -27 37 15 33 -13 -40 -41 11 19 25 -38 -21 -7 10 -30
3916c0M8j0j0O5l7k1m%k9M2l3jNL0j5M6l7j0N5j01MQ6k4k4k4K9MnL8n2lk5O1j5
$$ -30 18 8 -2 63 26 5 1 1 -28 14 -19 -20 -15 15 0 46 9 -1 54 -47 -43 43 19 -5 -29 0 4 -1 37 -15 -18 -43 18 3
3950CJ0k3N1o1J8M3l3n2K2J9L7l8k6N8m3J00q2K0p2N3pL5l7L8o7L8M0n1OJ4j2
$$ 3 13 -10 41 -20 -2 41 8 -44 -22 -3 34 -4 -30 28 -15 85 3 23 -49 4 -3 32 -5 33 -34 4 44 -7 -1 13 1
3981Ak1KK1l9J09r1L6Kk5J1j1K1k1M4k7o3Q7m1lm2K7O2o9K8rO5k0K1o6J0R%j7
$$ 1 -20 -18 3 -36 73 -18 18 20 -5 6 -5 16 -5 39 12 -51 36 -5 -8 -50 -23 39 -30 -2 -11 54 34 55 -11 -1 8 8 -9
4014iN1q8P1m2P0q2P6n6k3l3N3L9l6L7kj2p5O8nK6m7K1K8J5o3L1K9j9j0oj3o7
$$ -9 42 -46 25 -17 53 -29 47 -9 -32 -65 -12 27 -9 28 26 14 -61 7 2 28 -19 2 30 45 -18 13 42 23 13 7 -6 -73
4046g3Q3Rk6M5l3jJ8l7M1m8J01r4l9L2ML2l3M3k5L8l2N1m2rjL7m8L8k7J1J4o6
$$ -73 10 19 -7 38 5 4 22 -15 26 -22 79 -15 -54 -22 -18 14 -19 24 -1 37 5 56 14 5 4 41 -7 31 4 15 29 -37
4078c7l0P2L6l3l4oP1j5mJ4j3p8R9q2K0N5l5QK4k5l0O3l5j2QPM5q7L4N2m2j7M
$$ -37 -67 5 41 8 -26 -32 39 24 20 34 21 -57 42 -40 -20 35 0 8 32 7 -23 40 5 -7 1 8 53 -34 0 52 10 -7 -3
4111cKqK9l2L1m4N3j4o6N4kK0kp1R5o8P0m3lj5J6j1M4m9M0k2J8jj2oJ6J3k4J6
$$ -3 -1 -9 20 -12 19 -25 28 14 -52 2 0 20 18 -53 42 -26 44 1 -2 -17 -1 -12 32 -17 23 1 19 18 6 0 16 29 5 21
4145B1Kko8N8j8J9j1L1m3jM6m6L4k1k8J9L8mllk9M5J1l3M4m9J0l1m1N7j9L0p2
$$ 21 23 21 -47 11 -7 12 1 32 -11 -12 34 -12 22 1 -27 -8 30 26 23 20 -9 36 47 14 58 9 19 -12 -53 4 -15 15 -57
4178e7M1K1l3J8M8J4q3L4nM3n3Pl4O2o6Q2n3J3Lqk3N1k0Pj2PM9o9j4J4rL3P2j28
$$ -57 -16 5 -28 -10 38 52 -31 3 -2 41 -12 -5 -39 23 -43 39 -14 -1 2 -6 -29 22 2 9 -3 4 53 -16 -30 -16 -25 8 80 -48
4212d8O6m3m3N8N7n7RN2pq0O7n0M4j7m4J8J2j2J6k0P7m0QPl2L5l8J9Km8O7o5J5
$$ -48 18 -25 -68 -10 47 -10 -1 51 44 -36 31 -19 25 8 -36 -18 -6 -18 -2 -22 55 15 23 30 -2 33 -5 14 16 -32 35 -30 -15
4245a5K1k1J1J1%j4K7Jl7QNj8L9m5k1J5J6Jj2j9P5n2J0k7J8K5M3q8N6K2n1K0N8
$$ -15 6 -15 -4 7 7 -7 20 21 -16 -8 -3 -21 18 -27 -48 -33 -17 -16 -28 -47 28 -24 -14 -41 -23 2 45 -43 13 35 -16 4 62
4278F2p6J3%K0j2l9l0L0N5l9O4n9PkL1Kk2m5P9j6lj6rj8M9n3L5k5J1ol2L9N1l8
$$ 62 -14 -1 -1 19 7 -32 -62 -32 23 -16 48 -11 -4 -6 25 27 5 -40 39 23 20 4 -5 -23 26 -27 8 -17 -6 -12 -44 -5 46 8
4312HMm2M4Qj0LOm7L0k5J4j3kM4j0L7m5k3QN2j05Q6j7j4NKL5l8l5PK0k2L5l2J6
$$ 8 12 -30 14 22 12 15 21 -26 4 -21 -7 -20 -22 22 12 49 4 -19 -11 41 -64 22 5 -9 -4 -2 33 -5 -40 -33 -13 -35 0 -32 -16
4347a6O3r0Lj8M2L4j3K5o1QJ9m8K6N4l3N3p3L1M8o2M2l0QL0m6K0K4m8k1O3j6J6
$$ -16 47 -43 -40 -58 -16 18 5 30 -31 -23 -4 -52 -26 28 -5 48 -25 6 54 -8 34 4 12 42 -4 16 40 -8 -29 34 18 34
4379C4Km5PqJ3k6M2j6M0p1O4k7p1J11p2k2k4L9R1j12O0On0KK4jP3k6o4J3J5Kl
$$ 34 36 -9 -2 -10 3 -23 19 3 43 -28 36 9 -62 49 -23 -45 -69 -30 61 -51 9 15 -35 -33 -9 -10 63 37 -27 -14 1 3 0
4412@K3j4j6J8M1r7K7MpM7m0J6j9L9n3M9Kj4L1K9o3j7J0j0K4m2JM6rpk5N0Mp9
$$ 0 23 9 -7 11 52 -45 -18 -14 -21 26 -14 2 -17 22 -31 18 20 6 37 66 3 -14 -4 -14 10 -32 -31 15 6 -1 -26 24 28 -51
4446e1N8j6K4n6K0j1P2j5mj5lN4m5m1j2M1k6N3j6Klj4L6l5j7L9l4K6k0K4m5L9
$$ -51 7 -9 15 -41 -21 -32 40 25 21 6 3 57 12 -29 -41 0 -26 27 11 13 10 -4 32 -3 -20 19 -15 11 -9 15 -30 9
4478Il5M9l7j5O2m0NN6o3J3LJ2o9N4J1m7P3j4j9m1K4P4p6M8l3K5k7l3m5P4J6r
$$ 9 -26 23 -14 -29 33 -7 -2 54 -9 4 7 19 -50 4 15 -32 41 27 8 -33 -9 65 -11 37 4 29 2 -31 -76 -2 14 5
4510EKm0RN4r2K2L8k6L5M5l7l2J6K8o1J8l7N2O1m2k5k3OJ3kK0M5l1QJ2n9K9r%
$$ 5 7 -33 -24 30 -62 -40 -2 -28 7 52 15 -17 -1 27 -34 -16 -53 -1 60 18 -7 -30 -24 -11 -13 7 52 21 29 41 -18 11 2 2
4544BN0k1Lm9Mj6N8p1L0j2O0n7M1q2K6k7O3j3M1J6L4q1j8L0L5l9J1lKm2M7j6L5
$$ 2 52 31 34 -15 -11 -27 31 -40 -10 -22 38 -19 22 -60 -34 -61 2 -11 30 46 80 -1 -19 11 46 7 18 15 17 -25 22 6 41
4577D1l5mK0j4J4J5p0j1O3J6l7l5P1m0jQMk8N6n2j4L8ol6K0Pj9k2M5k8j8O0K3
$$ 41 6 2 22 8 22 37 -33 -44 19 35 -2 -37 34 -6 -7 1 5 -23 33 -19 -33 5 -1 -37 -17 -10 -29 -51 -6 -34 -52 8 31
4610C1l3L1PK9p4N5m3J6j9m4O5k4j7N4l9o2P1L0o8L2J4Jo6M6N6q0MJ5L5m9MJ4
$$ 31 -2 29 36 65 -9 46 3 19 0 -44 21 -3 -20 34 -5 -67 4 34 -34 -2 12 13 -53 -7 49 -31 -27 -12 23 -26 -22 -8
4642hlK9k5k0j4RK0mkK3j9K7LJ6q0L1NJ8L7p3K3k3J7L3l8O0p3MQK2Lj0MRK0k8
$$ -8 -11 18 -7 -27 -41 -32 -12 -16 -18 5 -14 13 16 32 -48 -17 -12 6 43 -30 -7 -30 -13 20 -18 42 -31 -27 -19 3 6 -4 0 9 29 1
4678Ak0j6M6n8QP3q5N6j0J1MJ7n5J4k6M9l0L9LrPj7Q6j10N2l9J7Nm7M5m4rRO5
$$ 1 -19 -35 11 -47 -39 34 -51 5 -5 6 10 27 -28 -14 -40 9 -21 18 21 12 19 2 88 -22 30 -9 8 13 -34 11 -33 -42 -33 32
4712C2k5M0p2L9k7J5j5M0JOk5lk3K5Mm8M9o0O6K6q7J2J5j8R1m6j8K0j6j6O0n6
$$ 32 7 47 -25 14 -13 2 -13 27 28 34 9 6 -17 8 12 -36 13 -47 19 45 -42 -30 -15 -33 58 12 -6 14 -2 -18 42 -14
4744a4N3j4k3OK5l9j1L1NMK7Ln6J2L4q4J7N5j06O1M6l3n7Q7K1k7j5RJ4p6nK2M5
$$ -14 39 25 2 8 33 -6 -17 14 19 23 50 53 -3 9 43 -41 -24 31 -75 -14 32 -1 -58 29 50 23 8 17 31 -45 -50 -28 17
4777A7m8LKL0k0J2mpL8Mk3M2j5m4K5l3M9l4N4j8k6L7o2PL1J5q0L7rM0ql3L0K6
$$ 17 -31 -28 -26 4 -16 -4 -8 -15 23 27 4 46 31 -13 12 -21 28 -6 48 30 4 41 -21 -14 17 32 -48 -11 -20 20 12 -21 9 35
4811C5j23P4K5k0M3m1pPJ9oN0m7j7j4k9R1k6N5o3J7Qj2n9lN6k7J8Nl5M6j4nk7
$$ 35 -88 -14 11 -9 34 -7 -14 -7 12 6 56 9 -8 -22 -51 40 14 69 6 23 31 19 -40 -43 13 -14 4 9 -26 20 6 1 -26
4844b6N9op8O5K4m5J8k4L4%k9J4k4j1j0PK4J5l1Oj2J5j7j1P7n6NK9PjnMk6N8k4
$$ -26 33 27 -51 14 38 -7 11 -13 21 21 -8 6 -18 -29 -39 -32 -8 7 -24 -18 -30 -15 -32 -43 34 -22 -17 12 19 18 13 17 -9 49 25
4879B5k8O1k8k5J8k2nK7m7L7j0J2k2k3K7K4KL0j01M5k2K5pl6P4jl7POJ2n8N6K3
$$ 25 -3 58 30 5 23 1 -4 23 -24 13 3 15 -7 -30 -3 21 23 53 -48 -3 -25 0 -7 -43 31 30 -7 0 6 18 -40 16 39
4912C9j44J03k9K1M1n4J3M5n2o7Q1j5J0J6k1j0J8K4Nj2J9j03O7k5J9l9R2k5k5
$$ 39 -105 -2 -31 -10 31 -23 -10 35 -17 -84 -3 -18 -8 8 -13 -23 -5 19 24 12 31 -72 -5 -30 -11 -50 42 17 -8
4941hJ6n7P8L1q4M4o6P5Ql0j6j4L3k1j8L2rM5o2L5Mk9M3j3k0j2N6m3K9qj1K0k6
$$ -8 8 -49 29 60 -24 20 -46 29 37 7 -9 -23 10 -11 -29 3 -6 39 -23 12 16 -13 30 17 -3 -15 41 -2 27 19 8 28 2
4974BO0ro1q1J08qm0M2l7O4m9K0k8M1l5Pj4K5J7j1J5rK3k5k0n6O3o7N1L7K6l7
$$ 2 62 53 -8 -89 19 11 -29 13 -24 40 -9 11 -17 24 -11 -4 -18 7 24 13 28 19 42 17 -3 -59 4 -63 -12 25 51 14
5006A4o6N5nj0L2m0j6P7q1L9K0J7l8j2L7j3Mm0J3K3Ml5Kk3L2L7n9O5n4M8Km3k
$$ 14 -52 3 -2 -12 20 -20 -36 41 -40 -1 19 36 -2 -14 23 10 14 -26 -13 10 14 -21 -19 -42 -10 27 -32 33 -21 27 29 -14 -16
5039a6j8O5OJ6n3J2K3n5J5k9J0k1N2L0l3qk3N0k9L8j6m0J6J9J2m4M8l8K6K8p9
$$ -16 -34 31 37 53 0 12 35 -20 -5 -34 -24 -45 7 37 4 -4 -27 23 -6 32 16 -24 -8 11 23 -21 27 -11 15 43 -36
5070c6J9M7n9K2nmO1m8J9k7L3n1K2L2Jn9R9l7q4Q9m3N%K5L9l7k1K3j6m6N6j6K7
$$ -36 -17 30 -29 -7 -12 -16 45 -3 16 -11 22 -29 -7 25 26 -33 66 29 -55 34 -9 -4 -4 21 60 23 2 25 9 -37 19 3 30
5103C0j00J9O1k1K3j4L9l3J3l0rl0M3N0p1L6o2L5J00o4RL9m3o9N3J2jJ2k0j2P8
$$ 30 -70 -51 10 -11 12 -2 37 4 17 -13 -22 -52 -9 41 -30 6 -56 -21 79 15 24 63 20 -49 4 16 15 27 7 -5 73
5134G3p9lM3k7M5m9J8kk2K5k9j3J3P1q1K3L9l5jmn8O0j4k4M0J0L0k4n2J3M0p3
$$ 73 -6 -9 34 7 52 3 21 19 -3 22 -7 -20 -7 64 -17 6 45 10 9 5 -53 7 -7 -31 9 19 49 25 -27 -14 26 -47
5166d7M4l0J6pP3l3j3J4kK8k1j0k0K7n4O2J6o8N5p7P0n3OkN6l8qL0k3N1m5j8M6
$$ -47 -3 -33 -17 -24 49 16 3 17 15 43 22 12 -8 19 -35 27 43 -25 30 -47 23 -30 -24 -26 30 -8 -16 14 -9 42 -3 -21 25
5199B5m5N7Jo0L1j4j2NK%j6K6j7Kk9K4L2l2LL2ok2N0m8M8o6M1Kj5on6N1L7j2l4
$$ 25 -20 37 38 -22 9 -5 -17 -12 -10 -10 -26 0 -17 -15 -44 -20 12 -20 -17 15 9 -13 37 -11 37 -29 12 14 -1 -7 -63 -12 25 13 -21
5234b1K2j0j4lJ6L6n4K1nk7J09r0L7j8L2l4Kj1%K8m5J0NJ9M3J1o1J4jr6P9J2N
$$ -21 1 -9 -23 -26 -10 26 -28 -7 -12 -39 70 -20 17 -1 31 -3 -1 -12 -12 16 -29 -19 -14 5 48 59 -2 12 11 -85 -6 6 11
5267A1J5J7jl0l1L4K6n3J2j6M2l8M7j0J4j9m5O6l2l4K5k2N0n7N8J6j0n4L0n3N8
$$ 11 26 43 42 12 -19 15 41 -12 0 -16 26 -12 35 25 39 20 -25 41 9 -25 0 -22 28 -29 29 45 35 -19 11 -42 16
5298A6rPlO4l1j8k2Ql3O2m6m2O0n2O7jl7K2ml2M3l5L0jj1K5k4m6P0o5M9m9L7j8
$$ 16 7 14 11 75 44 26 4 12 -21 41 -5 -47 13 -39 28 27 -10 12 8 -24 19 -16 14 13 2 27 3 -43 27 -38 11 -38 -1 -19
5332a9jO1m2k9L4%J0om0M4j3mnPJ1l5K8Poql1L6J9l5K6l8L5jmL4q3K3Q2p1J9J8
$$ -19 -20 41 -1 -30 4 4 14 8 -32 12 -1 -5 -10 -3 8 -27 1 8 2 -6 -37 -1 18 -17 9 -29 6 5 1 35 -48 -25 57 -14 5 23
5368B3nm0N1k4Qm4M8k1O5j10M4K6Lm9J0Nl3L2N1l6J7L5n5j6J2L0k7Nl6J05n3l8
$$ 23 18 -22 29 5 13 -31 17 -4 61 -49 -5 21 24 -25 -15 -10 -43 -11 40 4 21 56 1 -15 -3 27 0 5 -31 74 21 -17
5400a7N5k9j8j1M4K2l0m9K9RKL2k%m6k1MJ9K9Nj7k5O8l8o7K9%J6L2l7O8j4m1L5
$$ -17 38 9 -9 -20 24 46 16 -33 -4 5 7 39 37 37 -9 -30 -26 -7 22 27 10 -15 53 15 -52 -23 -23 -7 25 -12 56 42 1 36
5434C6m4M6n0j0M4p9L9N5k5k7J7L8Om8k5K6K0l7K9l1J6NQJ7o7J29m5lk4Om1kJ7
$$ 36 -8 38 -12 -22 22 -57 -18 37 12 -15 2 40 46 -2 -27 -1 19 -18 11 -20 -4 1 9 26 -41 88 43 40 16 22 -19 -21 -4
5467dJ6M2o0j0N0l4l8j0P2n7J6L5L0m7k7oL1ql1L8M9p5K5j7J5Ql4Q1m3L3m1L2
$$ -4 12 54 -6 -16 34 0 -38 -48 24 -33 -17 18 48 1 -26 -32 -1 -9 -40 -2 47 -28 -3 -20 -5 3 -31 50 7 40 -1 31
5499C1Pm6J4j9j3J4K9Rq7P2k6Q9p1K3m3k7K8n5J7P1k6J4m3O0j9j8K2J0n8L8k0
$$ 31 38 -8 6 -13 -26 -12 17 26 -61 11 -15 74 3 26 -17 -44 -16 -71 -54 17 -9 5 -38 22 3 -15 7 17 -41 -3 -23
5530b3K0K1j4j7j2N2n7M4QLNm1N2K2l5K0l8K1m7K1rl4P4o7P3n0Llj5M2l2K5k4
$$ -23 -3 18 4 -13 -25 27 -30 14 22 25 30 -11 41 63 28 48 10 31 -16 5 -4 -38 36 -31 42 -8 -5 -8 -23 19 -13 12 -12
5563a2J1mkK8Jm9QmM3mj0j2J3QJ4o9M5j9L5nl5R6r8M1LK9k9l0L4k1J0J8n2N1l4
$$ -12 -1 -5 -7 21 22 -27 -19 -23 20 16 6 -6 7 15 29 -40 5 -14 21 16 -19 77 -21 20 23 52 23 -7 27 6 16 34 -18 33 -1
5598aJ8l9P0l7K5l5K0p4K0L5l9J6l6M0M3m7pN0m4K9k2m6R8p7KN8j3k2L8j3l2j5
$$ -1 17 -22 48 11 36 1 21 -53 -33 2 -37 -21 -57 -17 26 -21 -28 22 -22 7 -15 -61 37 -40 -38 20 7 -15 23 10 -22 -37
5630c7N3L4n6o5R8m4J4n0R6Ln2j5L1j8j1PN1o0k2R8n9M5m7K1j0N4r3j1O1K3m5
$$ -37 16 50 -6 -71 27 -17 -3 -53 43 46 -6 -21 10 -8 -19 -12 39 -21 -43 55 -4 41 -6 15 5 59 -34 -45 16 39 -6
5661fJ4K2J1n7LO9o6K7k3j7K3J2J9n5M1k1O4o7JJ0j1M9Rj07N1K0j8P6j19P6m8
$$ -6 8 30 41 -16 -13 56 -10 17 -6 -23 0 12 31 -24 17 -4 60 -7 -6 4 -7 42 51 -56 -5 15 -3 73 -46 30 -18
5692a8N6qj00P8J3j7K5L7o5J7j5NnL8l8L3J3r1M8Ql1L4rO5q1N9m8N0m1Pm6L4M
$$ -18 38 30 -70 8 21 4 29 66 1 18 3 8 3 41 3 36 49 -42 6 14 -17 17 8 73 -8 51 3 53 12 19 -27 7 11
5725A1rJ0qL2o6O8k4j4J4K3l2J6L1n3l7O8l1rN3o1Nk0O0o0N1N1r3J2lJj8M8K6
$$ 11 2 12 4 36 -30 38 14 0 14 37 5 21 52 -1 -38 30 -1 -10 43 -18 -13 -33 27 -33 18 69 -24 -12 -15 -14 -32 16 42
5758D2k0J7n5K7PN0p2j0M4%m1j6L6%Ml0k2L0k7oL6m2N7j1J3PJ2L6l5m9J4jLL8
$$ 42 22 39 -16 11 18 68 -4 -14 30 30 -11 -27 9 9 13 -17 -39 -9 -36 -42 -6 -48 9 -2 11 18 30 66 31 -18 -4 -5 -2 36
5792C6k3j9LN7n1J1o3k2P9K5jj0K1k6m4N2o3l6J04n3L5Lj0k1K4m7J8mM1j2l0N0
$$ 36 13 -6 -3 54 3 14 -49 -71 8 33 32 22 43 17 -27 25 -38 -74 30 -23 12 15 5 -16 8 -39 -21 -25 16 4 -26 24
5824B4l8j1J9j1pj5J4M0l3j3M3J7k4mM0l6L2l0n6K9LL8k0J0m5L2k9N3K1m6lNK
$$ 24 -14 -25 -6 -17 -24 -39 -25 15 -18 -31 12 29 5 1 41 5 37 7 -49 -20 -17 21 1 11 -34 -2 -31 22 43 -3 -6 -1 1
5857Aj8J3j3q0R4QJnK9n2J3j1M8m0j1N3rm3l4L7j5M7j2l8j3Q1J2n2j6N7o8M5j2
$$ 1 -17 -4 -17 -97 -3 5 6 1 30 -22 -9 -20 28 -12 -23 30 21 -22 -56 -19 -34 13 1 -37 -50 31 43 -9 -25 32 -36 9 -3
5890cJL0n1L2J5k4k7J2K1k0M6o0K1j3j3L8qk8QJ4l8N4l7O5l4J7j6n6P7l5J5J8
$$ -3 -2 28 -23 9 24 0 -27 -15 6 -14 32 -28 -7 -20 -33 5 -3 -31 -23 -9 -47 7 -30 35 1 18 2 -54 23 -12 3 21
5922B1J1m8K2j3jj7PM3%n0j7K8m3R3o6J8QJj9J8l3O5q0O5ql4mj4LJ1L8J3j5N8
$$ 21 32 -16 6 -7 -8 -25 -18 25 25 -25 -42 -14 -57 36 -30 -12 -4 -3 -22 -4 -37 28 -52 13 5 -29 -33 -47 -44 -33 5 18 3 61
5956F1l0J7k1k5jRK6Pj7n7PL0J9m3P0p6O0j4j2Jm3L0l6kM7L0n8j6N9kj8l9M7j0
$$ 61 31 48 27 2 1 10 36 43 26 -31 -24 6 25 -18 52 -24 36 22 10 11 -32 -2 -38 -40 7 37 -21 -37 22 20 2 -37 10 0
5990@r6R4j8l2K8k3L3L0Pk5N3l8%p6J01p8L4j5%kmL4o3Q6NK9n9mn1Q0Ml1MOo5
$$ 0 -96 -2 -20 -52 -24 -47 -14 16 23 -2 51 13 13 -63 38 -40 -6 -21 -21 -23 -27 7 -56 30 35 64 5 1 -50 30 34 3 7 13 -52
6025e2MO9j2l2M8m6m0J02Pk7k0k0N3n2O4p4L6LpJ5K1Pn3M5n3J8m4O8n3M3K2q0
$$ -52 -48 21 9 -23 25 -21 -61 41 48 21 1 -19 34 -18 46 -28 8 11 4 19 40 47 -6 39 -14 4 -40 28 -25 18 40 -40
6057d0pQ0k2M7n3k5M%Ml9P6J2q8O7K4o5mJ4mK0K0n3K9K3l9M6J4n4l8O4n3R3o8
$$ -40 -47 33 11 58 5 -20 -16 -16 -12 -51 25 37 -51 16 40 -25 -29 -15 -19 1 21 -32 -3 20 -19 27 41 -13 -51 13 -40 53 -15
6090a5J2m4P5J8n7P0n9Pk3j0Qj7M2j0l4j0L9L9j0k2k4j9O7pm0J5p0R2p4K9M6j9
$$ -15 -3 -47 28 46 -11 59 0 7 -16 -26 -18 -35 7 -3 -37 -47 -8 31 21 -1 -25 -44 23 16 -24 -9 -79 13 -61 -32 14 -5
6122eJ8K5l5K1Ok8J8oJ5%kq4N5k2N4k9M0j3j6nj0j2n1O1l3J7N9m4q%K8M8n3pP
$$ -5 13 38 3 24 30 2 20 14 29 29 27 -57 -2 -24 30 1 41 28 12 7 -3 -15 -66 -5 -38 -21 38 -6 -14 -14 14 62 9 2 9
6157IM3m1k4O5o4lK3km0K0L1j2L9j2rO1m6l3J2L0o4K8k3M4l1o3M9jp1N3L4M1m8
$$ 9 52 11 -13 52 -12 -15 8 6 -34 -14 17 5 44 32 23 84 38 5 17 47 -17 11 -12 32 1 -62 -13 -14 -85 -32 2 43 -5
6190ej9No3L4K9L2K9n0j7l9P8J3mJ7j8k1OK2K1k3q7P0l3J3J4m0M6j6M4q4L4kL8
$$ -5 -24 -19 -82 -48 -19 13 42 -8 -25 -64 14 27 23 40 22 1 7 29 50 27 -60 10 -23 -10 4 -36 10 -6 38 -46 -12 -14 24
6223B4j0l7j1%%Q1m2k0J5o7Q0Ll7L3Rn6M4j3J2MJ9n4%nO1m8J8Qj1oO4j03O9j5
$$ 24 14 -23 -34 -34 -34 47 5 -15 0 -67 13 16 -21 12 21 -35 9 -4 8 12 31 -23 -23 -28 33 -15 3 11 0 -6 58 -45 24 9
6257Iq9J12l7RL4Np3M8k5Nj1J1J4K1pj1k5j4K5M5r0O0J4k3LOJm0L2K6m3N0k0q
$$ 9 -80 32 -5 4 38 43 -30 18 -7 -2 -13 -2 12 33 26 15 -10 -24 1 46 -44 16 30 7 10 16 17 -23 9 35 -8 42 22 14
6291A4J8pl6N9n7NK7K2l7rkj8J5k1N3p5N9qm6Q5l9m1P3m8pm7J17r7OP0l5J7k7
$$ 14 32 25 -11 48 -9 -4 23 45 8 -1 -3 -21 -6 -27 26 -49 10 2 -44 41 2 -39 34 -14 -21 -68 49 -48 -42 28 -7 10 -17
6324a7Qj1L0J3L7m5pKjm0O3qk4l1%N0L2n5L4j4j2l3L2J3l8lL4J0n7K8p6M6K8j4
$$ -17 -9 -20 10 23 60 15 8 10 9 -31 32 24 0 -31 -31 19 51 -4 30 16 4 -29 3 16 -22 -25 9 19 -38 -10 -86 -40 -12 -26
6358b6%jj5MQ4k7K6o6j3O8n4L8p1Q5n2j6k4K0R4n0%lJ7kj3L8l6L5J6m1j9L3n2
$$ -26 -26 -27 -42 -38 46 19 45 -21 -34 34 -20 18 -53 32 -20 -36 -60 -40 54 4 4 1 18 16 3 41 5 40 56 15 -4 29 -23
6391b3M4l7Mj7L6k3Mm2K5L1Qm8M0jOL9q7J2lP4p2Q4m5o0P0m2N5km4N6k3KRm0K2
$$ -23 21 -16 -12 -29 7 -16 -12 -54 -29 2 10 -38 2 1 7 46 -41 -29 -32 42 -30 54 9 -51 19 -23 32 30 -14 42 19 21 30 -10 12
6426A2m7MN4Kk0L1ol4J3pjk1J6J3k1Mkj8K1O8m5j1M8k1LNj03P4n4K3j3M0n4K0
$$ 12 -35 -31 23 25 5 36 30 -4 9 2 1 -20 -4 9 -12 -8 -10 -28 -7 61 16 5 53 32 35 40 -63 11 -43 -20 -33 7 -47 -27
6460b7J7nj4L2lk9L8Jm8N9Qrk0j2oJ3J3%J0K3J1p7j3K4M7o6j9L3N2J0j8Km7J2
$$ -27 -10 -15 -29 3 0 -29 9 10 -38 21 29 20 0 -12 -18 -5 8 8 18 41 52 -25 -38 -14 33 -33 -52 -19 33 43 25 27 -20 -8
6494hP4j04jO4Jj4K9l4L6Lk9l2mO0l4l3K0n6K1Q1p9M6N4m3l7qj5L8MJ9l1j1PN2
$$ -8 66 -38 -39 25 26 12 41 7 43 46 17 -15 -19 41 7 -26 -6 -62 -41 40 -39 7 61 18 -19 -27 -42 -4 0 19 -12 -23 -16 36
6528C6l2OnoN3k6J2m4m5L4K2j7j2K1PK8Nm1%J3k6N0o7P9r4N6N5q5j6J4M1nn3M3
$$ 36 4 10 5 -1 52 26 38 -6 -51 -17 5 -12 -24 -3 4 32 37 -4 -4 9 -17 33 -34 45 -49 7 62 -23 -39 -25 16 11 -42 1
6562Am5O3m6j4O1J7p6K6M2j4L3n3l7rJ06m7j8%RP5l7l4K8j8Ql4J6j4k5O0Ok9r
$$ 1 -44 19 -27 -41 20 37 -39 -13 29 15 48 -5 -42 -51 55 8 -10 -10 -1 74 37 3 31 13 21 -13 3 -11 -36 24 30 1 -8
6595hKk7K9J5o5O6mN1m7jJj8o9J10l6L0o4M5j0l0M4j6j2pN4%m2J8j6pK2j2l1N4
$$ -8 -6 -33 -4 11 -54 12 8 59 12 11 12 -6 -75 35 -1 29 -35 10 0 -30 14 -2 -14 -21 33 33 -9 9 -7 -14 8 -4 -35 19
6629A9j0MOj2M7q9M3KJ1o2L2j9j9M6k1KJ9Mj8j4J6L6p1M0QM2q1L2J3m2K7L6J9
$$ 19 9 13 19 7 54 -35 8 10 21 -41 -9 -28 -47 -1 -22 -20 -1 3 -15 -29 -13 23 -48 -8 0 42 -39 -7 6 -36 -9 27 46
6662D6m8l9K7L4jJ7q0M7k2O4p1L1L3k4n2L5Ro6J3RLJ8J18j38O1l5%ml5R0l3l3
$$ 46 -2 -41 -14 20 19 36 -44 3 -19 45 -26 5 38 14 -38 -3 6 -60 -47 -38 -35 -17 101 -37 24 -11 -11 -15 -50 40 7 -26
6694b6k6Q3lm0Rn5Q1pm6JkP4o0k1oM3Ol0L3N8p2O5n3KKJ2o4oJ4O6m6L9m4K9j2
$$ -26 -52 31 28 -12 -3 -58 23 16 -30 -29 -31 43 -17 -38 -44 -1 5 -25 8 66 -6 59 6 8 10 22 -42 -48 -34 32 -14 25 -19 10 -2
6729bN1m2L8m6m1M0Jj4J4%k6nL4m6N0mj9M2m7J6L4J3n3M9q1L7LJ4l3%L6l0K8L5
$$ -2 49 7 45 -1 -42 -2 -1 -15 -1 -1 -27 -32 2 -44 6 2 -17 25 -22 -6 28 41 -12 37 -44 -7 -4 10 -23 -23 13 -17 11 46
6763D6p5L0n0J01k8n3M2m5N2Jj2J6l2jJ8J1n3J1N3M5j01M6n5QJ4O0j5k8k8k0O4
$$ 46 -29 1 -49 52 24 -29 13 -32 20 21 9 25 -7 -8 10 21 -32 -21 32 77 -24 22 -33 -25 -11 49 34 6 -22 -42 22
6794B2l6P1p0k0L1L7p3Q7m1J0J3m9j8L7N0m2j4M6j3m7L9k3J4k6K8Pk8Lk2M6%r
$$ 22 -14 57 -13 -33 -2 35 -38 49 8 18 31 -18 -36 1 51 9 -5 41 28 -19 20 -3 11 -15 13 20 -8 -5 -27 19 19 10
6826A0klL7k6L1p9K7j1K8J4J3o5KK8L9Ll6J7j0l1J9L9l8qPN%J6p2K0K0OK5p4R0
$$ 10 8 5 42 16 47 -32 -5 -16 12 26 39 -26 -24 4 43 46 10 27 17 -14 5 44 6 -2 5 10 10 26 -46 -26 -6 0 25 -49 41
6861D1k2l0k7J2j0M3n4L1k9R1k9kn9O3j8m7P5n6L2m0P4k4j3k9O7m8l9N8K2np9
$$ 41 19 -11 -38 -26 -36 7 -47 -16 -45 46 17 15 -44 19 1 -46 29 -27 5 -35 39 15 2 -27 40 -8 -47 11 33 28 -51
6892e1K8KJ6nM1p2Q2rn3J9m8Q8k9n8J03m6m2N4l9M7o4L8o0P6n2L2PK1o8R9l8m
$$ -51 -23 -21 -5 -10 31 -41 41 32 -21 -2 -50 38 9 -49 54 8 -34 20 -19 28 -36 2 -58 18 -34 -2 5 26 -42 57 19 15
6924A5oK3Qm3K7m8K3n1P5Kl6LK1J0oj3k5J7K4j4j4LJ0j7k1j4M1pJ2j4K6J9M0q5
$$ 15 9 32 40 -3 24 -24 -1 -52 23 25 -11 -8 13 23 17 4 -21 -4 20 6 -8 -5 5 -12 -33 -47 -6 -13 -1 -15 11 30 70 -15
6958a5J1L9j8Ol2k0P6m1m2M9MO1q2jL7k5K5%l0Jj7rK4K7l2L3k0Jo2M0L0m6J4k7
$$ -15 -4 35 17 23 -9 -29 47 6 -36 13 17 78 -4 -5 32 7 32 32 2 3 -14 -23 1 28 -4 29 9 10 -52 -12 18 -28 -14 -41
6992d1P6n3K1J4o0K9jK9n6O7o9J1JO5K1j0m9K4p4O0OPn3M7j0MJ5m7O8J7m0Lj7
$$ -41 35 -18 3 17 -43 -14 -15 14 -42 25 -44 -33 -32 33 54 44 -5 19 -55 5 11 18 -35 12 2 6 21 -26 42 59 19 22 5
7025En0O1nQj8Kj3l6M9m5M6jk9N1Mn7K3Lo%QM2j8Rq4R3rnPm7K7j1jM7j9qk9J8
$$ 5 -45 16 11 19 1 3 -10 -46 3 -42 4 3 -26 25 29 -28 -5 -2 -8 -8 0 42 24 33 -51 42 33 28 35 -12 15 4 3 50 31 23 -6 12
7063A2mJ8nj3l0M5k3l2JO9j9lp1L1N5l0Jk7K6M7o0O7j05O8n5OL1mJ5nqPKK0K9
$$ 12 8 26 21 8 -22 23 0 -32 -31 38 19 16 -55 -24 31 1 2 -25 1 48 -12 55 -50 18 -37 -31 0 -4 11 6 -2 5 7 27 56
7098E6n2k6R3j13K5M4p3P0J4j0p6L9O1K1p0RPjJ2kj5L3k1r3L3N6m9J0j7K4O4m4
$$ 56 4 -22 71 -42 -17 27 -46 24 38 28 -48 -9 52 73 3 12 19 18 30 28 13 46 25 -68 -35 21 -28 -18 -35 -11 53 9
7130IJ8o1P0k2J5pl8K5k5nO0qk8M7j2k6MJ6m3jM9j9o7J00l9kk6QRl5K3l9R4lm2
$$ 9 27 -34 36 14 29 22 -16 9 -16 -21 39 31 3 50 38 12 16 32 -11 -12 37 18 -49 51 12 10 -16 -8 1 -34 -11 -50 44 41 -1
7165aLp5R2Pk2j2Jll0N2l0O0Pon2M6n2J2k3P3j3k8mJ4n5J5lO3m1K6j9j8lM7K3
$$ -1 2 -73 19 26 4 -8 -7 -10 -40 12 -18 42 49 43 -9 37 -15 -3 -26 47 34 6 2 16 -39 -24 -27 36 -5 21 2 -16 -19 28 51
7200E1n0joL7J0p0j4rO0J6j2Ok2k0L9n2NJ8l3N1JJ2J7Lp5O4j9K3j6m0M4m1L4J1
$$ 51 1 0 -6 31 41 -29 -43 -52 8 24 12 18 -4 -24 15 -37 -32 -14 -47 4 5 17 34 37 -38 26 7 30 14 -26 18 -23 11 22
7234B2k3R1j07j1O5l2j3Rnj3MK0l1qN5l2K2l1L3%rj1K6J1Jk4m7j4Q4jj1j4k6m9
$$ 22 -1 90 -17 -28 37 5 -8 1 -4 -17 -13 7 -24 -32 23 -9 13 -18 15 15 6 -5 21 32 33 9 -38 -52 32 31 20 6 -20 -69
7268f9M6N2n5J7K8J8m0N7q6N4oJ2m2j2MO3k5oj1oKO2p3NJ5Jj1J0j6l4jO1k0j1
$$ -69 -23 29 -26 -9 19 37 -3 54 -32 22 16 28 -14 -26 -22 41 16 10 -1 -7 -5 57 -16 -11 4 5 -6 4 -12 -46 -47 14 -6 -17
7302a7j2K1K2k6M6m7QL5m3J3J8m4%K0K8l9L2j9lNJ8l7K0pK3k2K9n5L0p3Q9K3m9
$$ -17 -29 -8 14 -12 34 -13 -5 30 -13 0 18 -26 -26 -6 22 -17 15 -4 -7 -2 16 -21 -1 -8 15 -7 22 -33 -3 -76 13 36 -13
7335a3m0L6L8j1K5m3J8L8jo5J00n0n0O6n8M0J3k9K6j1k9l1L7rnJ4k4MN4ln5L9
$$ -13 -53 -17 21 10 35 -8 10 48 47 -18 82 32 -18 48 -10 30 43 14 40 29 0 -31 6 -3 -8 6 -18 -14 40 37 -18 21
7367B1nlmmO9j15L4J2K6m0J0KJ5j5J1J6l0k0K0M7o8L3L1j1l9j5kL5j4k4J1K8%
$$ 21 16 13 9 5 74 -41 -7 5 31 -9 1 3 18 3 14 30 0 -20 0 47 -21 12 43 32 -7 -22 -24 11 -3 -27 -16 12 12
7400A2n1L4o7M8k9M0L4m2J6RlpJ3pRnP1j16O6l1j8P5k8o0K4j9N6NQl0K0l4J4j6
$$ 12 -39 -5 -72 -24 -53 -13 21 -21 -5 4 1 -6 7 0 9 4 75 -41 25 -6 -24 51 23 -37 -13 -32 24 29 37 7 27 -7 7 -9
7434iM1o5O3op8R4m7M2m6K8LRm1qK1pMrJ9J5j08M2K8%K9m7Q2l8N1n9oK4L1m5J
$$ -9 32 -33 30 24 -54 40 -7 35 -11 17 20 29 -12 -20 1 -6 -2 -11 8 23 -85 -43 -15 -15 14 -33 49 11 62 3 -3 21 52 7 8
7469HL4n1O2o2L0k0L4kK1o1kj7P9o0K2J2%m4qP9m5orjkk1M7Pj3o7M3J6M1p8M5
$$ 8 42 -9 53 -9 21 1 35 33 54 -7 -9 -26 53 -7 15 27 27 -17 -25 54 9 3 -6 -7 -9 -30 17 24 11 -56 -13 3 44 -34 11
7504A1p1Q1%K2k6l5LOJ8L1l7K3j4lL0m4L0mk1j6L6j8Kj2J6m2N1l6j0k0L3J1K3
$$ 11 -60 21 21 43 17 -18 -15 -9 9 40 3 26 12 9 39 -5 25 21 0 -16 20 2 4 -8 8 -34 17 -19 -29 -49 -16 -5 18
7537A8l1K0l6L0jK3k3J4p7O9j4j1k7Q5Rk3K1l8Lk0Oj1L1L3n1L9J7n1J3j0J5KL2
$$ 18 -13 7 -29 1 0 23 0 14 -63 6 -8 -19 -46 39 48 25 46 8 11 -9 -3 -14 17 50 -1 38 55 4 17 7 22 24 56
7570E6p0J8l0M4k5O2q4j7L4K7l5L8j8l1N1jmjNn3QO0m9k3L3jOJ2jk4mJ6J9k6l7
$$ 56 -14 4 -26 18 -7 55 -29 -46 -12 15 -20 18 0 -31 20 19 15 14 19 -34 -26 34 -15 -38 -5 -6 0 12 11 -13 -17 -1 18 -8 -45
7605d5M3%l3QlQ2l3rl7K3K5l7L1Jj7Ml5M0plJ9NMo8L1M5o0M5m5P6n6k9J6MK9L7
$$ -45 -2 -2 -35 -27 -30 52 19 10 -27 -4 21 -16 15 16 -1 3 -32 8 1 -2 17 22 26 -42 -11 34 -26 19 -26 50 -6 -35 -19 -15 14 51
7641E1j0o8L7ml1K2J8M6j25R8rJm3J2j1P5q0K1o7K0M9m3K7qJ6k2Q2o6P8p2L3n1
$$ 51 41 -27 10 6 -25 -3 15 61 -64 34 25 26 -17 -5 -16 59 -21 0 -67 -47 2 -41 -14 -22 -6 -28 54 -12 66 -6 27 -24
7673b4k6M1n3N0jN7k8k8Ml5Q4o5Oj3N3j1%pKL5j4l0K1J3m2j8Q8r1L9l4O7n1KM4
$$ -24 -50 -9 -62 -12 -13 44 16 -12 -8 -43 41 -24 -18 -31 22 11 11 4 6 41 27 -3 18 31 -11 -29 59 -32 7 -27 40 -11 -9 35
7707C5n0JpK8m4K6Ql8k7R0J7l5K2l2L0K3l5n5N6Ml2j2J0M3p5O2J6%pk6pmj1Q2
$$ 35 -15 -14 -21 7 -37 -11 -3 -41 -68 22 39 4 26 -6 24 47 12 -43 13 17 -15 -27 -17 26 -49 13 29 29 22 -4 -11 -15 -26 56
7741E6k7oj2j7N6n3n9L5O2m9K2m1O9q3M5QRJ4m4Q8q4kj1J2QL8r0L3OL4Mm9K1j9
$$ 56 29 23 11 -6 50 -3 -62 -27 35 -14 8 -33 36 -47 -2 6 15 29 -15 73 -11 -13 -24 -12 -4 34 -56 -23 -17 17 21 -28 -7 -26
7775b6J5RpJ2m8L6j8N4r3RK1O8l8kn0K4L5PMm6k0O6K8m8j2O2lj04M3P1n8N8lp9
$$ -26 -11 -2 -9 3 -45 -9 -27 27 -66 -57 -36 32 -6 -8 -58 -34 1 8 12 -34 -54 12 40 -8 -20 42 39 -65 -22 49 -9 49 46 -33
7809c3J27r3K6m2M6mnn6J7J3m3K0J7Ll3k4M0j9jM5k5Q3j7q2N0mlKm4P0k6k7K4
$$ -33 94 1 27 -15 31 27 22 -34 -17 -4 -47 -27 -10 -7 -40 -64 -24 -43 -44 1 -24 59 42 -40 10 6 3 5 -39 31 5 -22 2
7842BL2n8K9j3J4J6m6K2L5j6p4L6K5pJ0K2n1j8P9k5Lm5N5j8J7o1K1M8l7l7O8m5
$$ 2 34 -24 5 -8 6 22 -24 -2 33 17 -57 -21 4 -3 7 29 -22 -40 39 14 17 -28 27 9 26 -35 -14 34 -3 -40 28 -17
7874a7L3j9k0L6%j9l7lM9J4J9Lk0Qj5M5qp0K9l7N1j6j4J8K2o1P4j5Jp9M4L5k6
$$ -17 16 -3 -23 13 13 -6 -43 -46 3 17 36 39 19 27 12 57 49 -21 8 -29 22 6 -8 10 32 -29 45 30 31 -48 -4 31 5
7907Em1K0M3j7l0oJ4k7O4L7o7M7l1pM8l9Nql1Q7j00O5j9Oo7J3J1L0L3j7k6L1j6
$$ 5 -36 -16 27 10 -20 -26 -12 -39 25 62 -5 42 11 4 52 13 18 10 -21 66 -34 31 12 18 -49 -36 -25 5 38 21 -5 26 10
7940A0MNm7P7j04M0J0m2O1K7m2jk5K0L2m6L6l7J3LJ6k1J7k4l%P6l7j6qRK6k9P2
$$ 10 14 19 -28 49 -55 -15 -5 -47 14 41 -1 -2 -27 -7 25 -21 15 -22 -9 -6 10 -11 6 -18 -21 -21 55 18 2 -6 3 29 0 72
7974G2j44J10RJ6k9q0O7k6K3mn4P1l0NOn1NL1J5rk7O0j9o6P6m4M7l3m5J7J4L9
$$ 72 -72 38 47 63 34 -46 21 -5 18 14 -40 31 1 6 12 -39 -34 -3 12 3 -24 36 17 -49 27 -17 30 -3 -48 -31 -17 22
8006B2J0J0l4K3j3K4o8J6O2m1m6L3L0l4PK9Lm0j7P2j5k1l1N0j3m6J01p2m8N0J5
$$ 22 32 42 8 31 18 42 -26 -10 52 11 -35 -2 28 -6 1 30 33 -7 -24 48 33 12 -19 31 18 -28 73 1 -47 3 18
8037A8k7k3j2N5k3OlL5p0M7K2l1N0m5lk1J2K9n4R0j2r2R2J7n1ml0QL0pm6Q3p4
$$ 18 -9 -32 -44 11 -12 -6 -9 26 -44 3 25 -6 44 -1 -4 -25 -13 16 -38 52 40 -52 40 57 6 2 -28 -20 10 3 -43 40 -34
8070c4M5j6K1k3j7L0k3j4N6m4k2P8n3M3n2O5q2L5j4k7M5K9k1j3%O0m8L1l6Ok5
$$ -34 11 -5 16 -7 -24 6 -17 -31 25 -19 -41 37 -16 27 -25 40 -42 -7 -21 -48 -3 26 5 -8 -8 52 4 35 -1 5 -20
8101b0O0n1oJ5J6nK9qpl4L5o2K9N3o7lL3J0k1kk1P1n5j5K7k2J6j5M2j1nrk8l2
$$ -20 40 -11 -17 -2 14 9 38 30 23 -11 24 -38 -9 44 -23 -26 7 17 -4 -6 -27 44 -11 -26 1 -21 -5 -20 22 11 6 -3 -31 -63
8135f3P1J9j1j3J5PJ1o3L4Mmj2J4K8k9o1O1K8m7j2R4q6L0m1M5l5k9O5o1P7l4J4
$$ -63 8 27 16 3 18 25 36 -27 7 11 7 -5 9 37 8 -53 8 36 -11 -23 71 -15 15 -26 19 -16 -45 20 -41 36 2 16
8167A6l3L1M8p4k9L0N2n2K0qL4k1q0L3J8k4O9n2MN4m3J6k8P4
$$ 16 -17 14 62 -12 -41 -11 41 -11 9 1 35 14 -66 -33 -15 -39 30 -22 -18 36 -7 9 -19 55
8191E5
$$ Imaginary data points
##PAGE= N=2
##DATA TABLE= (X++(I..I)), XYDATA
0@%%%%%%qQmJ2j6K4l2L2m0N6p2Q8j04J28j52J78k18K56k99L53m08M74n47O27p20
$$ 0 0 0 0 0 0 0 -8 0 -4 8 -8 16 -16 16 -24 32 -40 48 -56 72 -80 98 -120 136 -163 190 -218 256 -291 336 -384
31c84Q22r35J059j196J349j517J701j905K126k368K632k920L240l586L963m376
$$ -384 438 -497 562 -634 715 -802 899 -1006 1120 -1248 1384 -1536 1704 -1882 2081 -2295
47b295M825n318N859o457P116p840Q647r549J0567j1722J3040j4569J6364j8504
$$ -2295 2530 -2788 3071 -3386 3730 -4110 4537 -5012 5555 -6167 6873 -7696 8668 -9836
61i836K1113k4377K8596l4287M2436n5164P8032j32008N00084M46636p03460m49022
$$ -9836 11277 -13100 15496 -18791 23645 -31519 46513 -85495 414589 861225 157765 -291257
73b91257j92593J76488J25016J41856J03547J20994p2669j86239j87855k4856
$$ -291257 -483850 -307362 -182346 -40490 63057 184051 111382 -74857 -262712 -287568
83b87568P91L547R0079L41684L92598J04859l52608m82477k08141J84593K95967
$$ -287568 -286777 -283230 -193151 148533 541131 645990 293382 -189095 -397236 -212643 83324
94H3324J73934K7258k4335j08328k18173k35178p4932R7004J33565P0089Q1321
$$ 83324 257258 284516 260181 151853 -66320 -301498 -376430 -279426 -145861 -75772 5549
105E549J49378R7011j39755l12561j84361J49581L43385K42739J8183r9480j07231
$$ 5549 154927 251938 112183 -200378 -384739 -235158 108227 350966 369149 269669 162438
116A62438j29156j70489j06204P1924J87614J17096k8710p8475m4245o3334j40897
$$ 162438 33282 -137207 -243411 -171487 16127 133223 104513 26038 -18207 -81541 -222438
127b22438j18633P6468K71910K46033K4539j47512j26960k6476m514l5074O573
$$ -222438 -341071 -264603 7307 253340 277879 130367 3407 -23069 -27583 -62657 -56084
138e6084J15008J45856L1924j12536j50368r8475n9101l9922L9490J63818J85873
$$ -56084 58924 204780 236704 124168 -26200 -124675 -183776 -223698 -184208 -20390 165483
149A65483L0908j61655j90293m2291J02104J08177L7703K1168O0006M8151m3223
$$ 165483 196391 34736 -155557 -197848 -95744 12433 50136 71304 131310 179461 136238
160A36238j15173r3029k6072J0804K9700P6033J09467L8104j21550k09404j08444
$$ 136238 21065 -71964 -98036 -87232 -57532 18501 127968 166072 44522 -164882 -273326
171b73326Q8661J81247J05984j0672m1368p222j598l7732m6731o19M2079L5660
$$ -273326 -184665 -3418 102566 91894 50526 43304 41706 3974 -42757 -43376 -1297 34363
183C4363J9060L4345L4579m3670j46570j41291M849J54844J57833K7525q6864
$$ 34363 53423 87768 122347 78677 -67893 -209184 -204335 -49491 108342 135867 49003
194D9003q8949k8358O739J0737K8095N5116M5813k60k7382j0745M61l8472q0711
$$ 49003 -39946 -68304 -61565 -50828 -22733 32383 78196 77936 50554 39809 40270 1798 -78913
207g8913m2538O4947J24862O1870n7657j11612o8042L161L8004M4319N0505M5034
$$ -78913 -121451 -56504 68358 130228 72571 -39041 -107083 -103922 -65918 -21599 28906 73940
219G3940M357m5323m9854q602J9517K867j6400R900N4774M8060k2425q4262p2304
$$ 73940 78297 32974 -16880 -25482 -5965 -3098 -19498 -9598 45176 93236 70811 -13451 -85755
232h5755q376L7306L9752L0677K8937J2247k9236n8196l6090J8662M9642L5126
$$ -85755 -94131 -56825 -17073 13604 42541 54788 25552 -32644 -68734 -50072 -430 34696
244C4696R699N808P253j5748m8439m6442k647L7224L4473N491r261l319n272k6004
$$ 34696 44395 50203 57456 41708 -6731 -53173 -55820 -18596 15877 21368 12107 8788 3516 -22488
258b2488l5843q866L4532N1987L3008L460j4804k4957l2203k4054Q399M2674M1966
$$ -22488 -58331 -67197 -32665 19322 52330 55790 40986 16029 -16174 -40228 -31829 10845 52811
271E2811K980l4998l6375j1860K778l555q909M456K4569K8235J1654r600k2233
$$ 52811 55791 20793 -15582 -27442 -24664 -28219 -37128 -32672 -8103 20132 31786 22186 -47
284d7k4875j5284J0580M1035M8082J6754l0177n1853l2455M126K3172J5669N97
$$ -47 -24922 -40206 -29626 11409 59491 76245 46068 -5785 -38240 -34114 -10942 4727 5324
297E324m842k626j530l709o652r026q235J844K1035L5759K7320m985l6738l9025
$$ 5324 482 -2144 -3674 -7383 -14035 -23061 -31296 -29452 -8417 27342 54662 49677 12939 -26086
311b6086j0401K3161L4539J9478n315k2340k4113j4720j953P111P940K815M57
$$ -26086 -36487 -13326 21213 40691 35376 13036 -11077 -25797 -27750 -20639 -12699 -9884 -9427
324i427N737J1637P145q008j9738j4035P444K7513K9301J1168j3323k8212k5603
$$ -9427 -3690 7947 15092 7084 -12654 -26689 -19245 8268 37569 48737 35414 7202 -18401
337a8401r103J0129J9568J3862j553j4236j4994n780K967L743J82N52P407J4208
$$ -18401 -27504 -17375 2193 16055 14502 266 -14728 -20508 -17541 -13798 -13616 -13064 -5657 8551
351H551J3669L494r970j7565j3071J362J6678K1349J0277j0179k4927k2788p021
$$ 8551 22220 25714 15744 -1821 -14892 -13530 3148 24497 34774 24595 -332 -23120 -30141
364c0141R567J4983Q617j184n620l779O28L133K072j074j840L380J1740J4322
$$ -30141 -20574 -5591 3026 1842 -3778 -7557 -6929 -3796 -1724 -2798 -4638 -1258 10482 24804
378B4804M999j1330k1550j6406L90J5083J6768N758q648j6862j4396l433Q656
$$ 24804 29803 18473 -3077 -19483 -19093 -4010 12758 18516 9868 -6994 -21390 -24823 -16167
391a6167J3275P844j218m365Q17O594M633l788r695n872M143J1633J0807J973
$$ -16167 -2892 4952 3734 -631 186 6780 11413 7625 -2070 -7942 -3799 7834 18641 20614
405B0614r921j7753j5162j809J3460J7943P433q109j4447p350M124R047N652M06
$$ 20614 10693 -7060 -22222 -24031 -10571 7372 14805 6696 -7751 -15101 -10977 -1930 3722 4128
419D128j791n51K360M764L554l265j1417j1954l27J4175J6571K681j4580j8721
$$ 4128 2337 1786 4146 8910 12464 9199 -2218 -14172 -14499 -324 16247 18928 4348 -14373
433a4373p893O876J3477J0107K335m890q332m990L538R536M935o423j0764j327
$$ -14373 -22266 -15390 -1913 8194 10529 5639 -2693 -7683 -4145 5391 10326 3903 -6861 -8188
447h188J1682J2447j368j5179j5087k556R357J2342P953N28p748j2168p133N820
$$ -8188 3494 15941 14573 -606 -15693 -18249 -8892 3450 11403 11931 4183 -7985 -15118 -9298
461i298J4432Q702n610j1965l012Q429P938l573j0789o311K929O954N172K669
$$ -9298 5134 13836 8226 -3739 -6751 1678 9616 6043 -4746 -11057 -8128 -1174 3998 6667
475F667q2n388r955n430P559J5330P688p183j1765k943N809L589m132m434K102
$$ 6667 6585 1197 -8758 -14188 -6629 8701 16389 9206 -2559 -5502 307 3896 -236 -4670 -2568
490b568M771p91n062j184M129R59n957m464O148J2254M979o565p946J20L934p89
$$ -2568 2203 1412 -3650 -4834 -705 254 -5703 -10167 -4019 8235 13214 6649 -1297 -1177 2757 1968
506A968l748K683Q464J886j1245j3660r00J0839P299m590p605R08P142L489j993
$$ 1968 -1780 903 9367 11253 8 -13652 -14552 -3713 3586 -1004 -8609 -7701 -559 2930 937
521I37j06L388J24n495j425J0563J3077k675k0049j6869M351J8000R160q588j3933
$$ 937 831 4219 4343 -1152 -2577 7986 21063 18388 -1661 -18530 -14179 3821 12981 4393 -9540
536i540n085L187M205L382N132L213n417r295K681J8637J5559p832k3924j2354
$$ -9540 -14625 -11438 -7233 -3851 1281 4494 -923 -10218 -7537 11100 26659 18827 -5097 -17451
550a7451J3499K2641N584j5457j8007n836L188M110M703N421j281j2056j1027
$$ -17451 -3952 18689 24273 8816 -9191 -15027 -11839 -7729 -3026 2395 1114 -10942 -21969
563b1969P003K2508J3806j1791k2104l121K1704K1636j293j8334j3824k65N352
$$ -21969 -14966 7542 21348 9557 -12547 -15668 6036 27672 26379 8045 -5779 -6044 -692
576f92L010K205J511n878j5070j0064R299J9795O040j5288j5870O197K2488J3236
$$ -692 2318 4523 6034 156 -14914 -24978 -15679 4116 10156 -5132 -21002 -14805 7683 20919
590B0919p801j3925j703Q562N071j521m31J593n456j3182p342Q137J2340k289
$$ 20919 13118 -807 -2510 6052 11123 9602 9171 10764 5308 -7874 -15216 -7079 5261 2972
604B972j6161q588J0873J5450O5j2255m235J1398J2519l60p272m28O392Q80p949
$$ 2972 -13189 -21777 -10904 4546 4611 -7644 -11879 -481 12038 11678 4406 3978 10370 11250 3301
619C301m811N350M867p049j1979q77J0544M167j1432j2722M821J8313R438r017
$$ 3301 -1510 3840 8707 1658 -10321 -11198 -654 3513 -7919 -20641 -15820 2493 11931 2914
633B914j2202J894J2310O942k856l524J438O9n651l758N847P633n846j7735q711
$$ 2914 -9288 -7394 4916 11858 9002 5478 6916 6985 1334 -2424 3423 11056 5210 -12525 -21236
648b1236J2034J8051J060j6672j3348N380J5691Q490k399l764o28j694k552M007
$$ -21236 -9202 8849 9909 -6763 -20111 -14731 960 9450 7051 3287 2659 965 -1587 2420
662B420J1087M287j2404j8166k523J6840J4899o890k1189j0965R136J5140N068
$$ 2420 13507 17794 5390 -12776 -15299 1541 16440 9550 -11639 -22604 -13468 1672 6740
675F740m465m712j713j269P72Q439J1808J024j4730j4352M487J8757R433j2351
$$ 6740 2275 -2437 -4150 -5419 -4647 3792 15600 16624 1894 -12458 -7971 10786 20219 7868
689G868j9883n636J1264J1692j41p409m634p73l35K274Q619Q900k345j2701p418
$$ 7868 -12015 -17651 -6387 5305 5164 -2245 -6879 -7652 -7987 -5713 2906 11806 9461 -3240 -10658
704a0658R160J6044L058j3815j3508J750J1044M812n793p114j402R66o67P06N484
$$ -10658 -1498 14546 17604 3789 -9719 -7969 3075 7887 2094 -5020 -6422 -5456 -6123 -5417 67
719F7M925l475q635r01J0561R771l271j1009l537Q159Q086l082r478l621M110
$$ 67 4992 1517 -7118 -8019 2542 12313 9042 -1967 -5504 2655 10741 7659 -1819 -5440 -1330
734a330L081k949l440J285K329k026l596J985O723K590n623n105M784J0289K393
$$ -1330 1751 -1198 -4638 -3353 -1024 -3050 -6646 -4661 2062 4652 -971 -6076 -1292 8997 11390
749A1390q587q273K619Q850L272n849p287j098K708P84q68P84J055k921m800J187
$$ 11390 2803 -5470 -2851 5999 9271 3422 -3865 -4963 -2255 -1471 -2339 -1555 -500 -3421 -8221 -7034
765g034Q771P225l482j0179l664Q503J0877J123q213p299j61L967K608K86j169
$$ -7034 1737 8962 5480 -4699 -8363 140 11017 12140 3927 -3372 -3533 434 3042 3328 2159
780B159l359n393k928M445Q533K541p660q962J220J0811Q770j744q162m630K652
$$ 2159 -1200 -6593 -9521 -5076 3457 5998 -1662 -10624 -9404 1407 10177 8433 271 -4359 -1707
795a707N177K616k18j717l990m863j021M930N767j116q249o400K985R198M817
$$ -1707 3470 6086 5868 4151 161 -4702 -5723 -793 4974 3858 -4391 -10791 -7806 1392 6209
810F209l799o555j347M000M473J941j48j205k618k945K04M404L621k303o856l855
$$ 6209 2410 -4145 -5492 -1492 2981 4922 4774 3569 951 -1994 -1790 2614 6235 3932 -2924 -6779
826f779K993N380J072l978l573L55K964K063L22M40L16j130j667P62L318K344
$$ -6779 -3786 1594 2666 -1312 -4885 -4530 -1566 497 819 1259 1575 445 -1222 -460 2858 5202
842E202j657m025j689K063K263r62k725q90J208O22j132p55J145J656j92j468
$$ 5202 3545 -480 -2169 -106 2157 1195 -1530 -2420 -1212 -590 -1722 -2477 -1332 324 132 -1336
858a336j92K152J885m12j422k48J066J01j083o28R97J005j318k970j205K060K516
$$ -1336 -1528 624 2509 2097 675 427 1493 1594 511 -117 880 1885 567 -2403 -3608 -1548 968
875I68l6k202j477P02J708J194M20O0m18j128n54J467K492M48k755l401o16K652
$$ 968 932 -1270 -2747 -2045 -337 857 1277 1337 919 -209 -763 704 3196 3644 889 -2512 -3128 -476
893d76K806j91k859k501j25J691J963J212j77j753j681K63K678K845J54l018l093
$$ -476 2330 2139 -720 -3221 -3346 -1655 308 1520 1343 -410 -2091 -1828 850 3695 3849 831 -2262
910b262P4L006K352n93k807k447m33J497K047R62p73k028j817N80K989K775j29
$$ -2262 -2188 818 3170 2577 -230 -2677 -3110 -1613 434 1396 623 -1405 -3222 -2642 347 3122 2993
927B993k689k251O01K700K080n29k188j998l22P89J390P72p52k211j670L82K095
$$ 2993 304 -1947 -1346 1354 3434 2905 717 -1281 -1603 -814 576 1348 596 -1615 -3285 -2903 -808
944h08K198p5j880j535P31K082J669Q4r53j101m99K63Q62P55k81j606j919l39
$$ -808 1390 1315 -565 -2100 -1369 713 2382 2466 1513 412 -87 176 1038 1793 1512 -94 -2013 -2352
962b352J161J259o3j103j058J70J062J003O79K38p1n62k49P31J283N32q89j559
$$ -2352 -1191 68 5 -1098 -2156 -1986 -924 79 758 996 925 363 114 845 2128 2660 1771 212
980B12r17L56P43M3p43p98o02m71J07Q89J123M21r76q21M50J786J575j0j128q57
$$ 212 -705 -349 394 437 -306 -1104 -1706 -2177 -2070 -1181 -58 363 -613 -1434 -984 802 2377 2367 1239 382
1000C82jN98M96J73m02j426j502n70R62J580K35j583j789M2J740J863M84o70p93
$$ 382 381 979 1475 1648 1246 -180 -1682 -2252 -1290 290 525 -1058 -2847 -2805 -1065 798 1282 612 -181
1019a81k45O60J135J236K35j496k054o87J557J882o0k400k370k59J520J780J70
$$ -181 -426 234 1369 2605 2840 1344 -710 -1397 160 2042 1982 -418 -2788 -3047 -1527 253 423
1036D23p34j048n97L96J604K010O04j446k156l00K197K205j67k514k144o1J422
$$ 423 -311 -1359 -1956 -1560 44 2054 2658 1212 -944 -1244 953 3158 2991 477 -1667 -1728 -306
1053c06J142m0r62j280j004O3J546K030M74j679j955J95K510K083m13k153j213
$$ -306 836 796 -166 -1446 -2450 -2387 -841 1189 1663 -16 -1971 -1776 734 2817 2404 251 -962
1070i62O21J221N36l73o50q92r41k83J181J473Lj859j558P65K205J105q93j346
$$ -962 -341 880 1416 1043 393 -499 -1440 -1723 -542 931 934 -925 -2483 -1718 487 1592 699 -647
1088f47l0J152N65m50k62K86J24p53o14M71R50j56j374p73Q48J142j89j091k01
$$ -647 -677 475 1040 590 328 614 738 -15 -629 -158 792 636 -738 -1511 -663 479 290 -801 -1002
1107a002J197Q14o61j272K55J498Q55r10j295l7P79K10m35r2M81j61j219p12J328
$$ -1002 195 1009 348 -924 -669 829 1684 774 -521 -558 221 431 -4 -96 385 224 -995 -1707 -379
1126c79J819L2k171j604J120K582Q65j393j766k25Q28O92L34K27j31j301j622
$$ -379 1440 1472 -699 -2303 -1183 1399 2264 871 -895 -1120 -292 400 734 961 830 -471 -2093
1143b093L20K459J932j257l178j287K054K847N79j899j866k4J045R05P27M08p11
$$ -2093 -1773 686 2618 1361 -1817 -3104 -1050 1797 2376 477 -1389 -1413 -368 537 1264 1672 961
1160I61k008j325J264K860J260k234l372o40K646K564q2k093j483K23J005Q83
$$ 961 -1047 -2372 -1108 1752 3012 778 -2594 -3234 -588 1976 1894 -199 -1682 -1459 -454 429
1176D29Q01M42r59j920q55J773K856M19k793k775K98K690J667r12k022p97N81
$$ 429 1230 1672 713 -1207 -2062 -289 2567 2986 193 -2582 -2284 406 2073 1161 -861 -1658 -1077
1193a077N87L88O90L79q88j524j62J935K123l39k444j558J246K282L58j669j318
$$ -1077 -490 -102 588 967 79 -1445 -1607 328 2451 2112 -332 -1890 -644 1638 1996 327 -991
1210i91K20P62k5m51J84L90l93j108J12J508J083q49j561J01J859J207j081j612
$$ -991 -771 -9 -34 -485 -301 89 -304 -1412 -1300 208 1291 442 -1119 -1018 841 2048 967 -645
1228f45k2J596P82j020j398o5P74J27o64j98M57n2q73k69J295J511k97k014q53
$$ -645 -667 929 1711 691 -707 -772 2 129 -535 -733 -276 -328 -1201 -1470 -175 1336 1039 -975 -1828
1247a828J776K417K49k081j722M18J583O98n71r24o36m93m71Q12J573L37j855
$$ -1828 -52 2365 2614 533 -1189 -771 812 1510 939 15 -621 -1114 -1585 -773 800 1137 -718
1264g18k068L05K842K252p62k618j133J403K203O87q04j112q64m95K66J291R97
$$ -718 -2786 -2481 361 2613 1851 -767 -1900 -497 1706 2393 1589 477 -387 -882 -616 675 1672
1281A672q01k423j678J202K805J138j818k269j50K009J930Q0q58p90j42j4N66
$$ 1672 871 -1552 -3230 -2028 777 1915 97 -2172 -2322 -313 1617 1697 839 49 -93 -107 459
1298D59J013N63j132k051q81J370J919m5k024j622N70J729Q31m87o79rK26K77
$$ 459 1472 2035 903 -1148 -2029 -659 1260 1215 -809 -2431 -1861 -132 699 212 -467 -476 -250 27
1316B7L77Q01M17p48j270j72J305Q56p15j575o53P56P83k49q45j62M84L92k09
$$ 27 404 1205 1622 874 -396 -568 737 1593 878 -697 -1350 -594 189 -60 -905 -1067 -583 -191 -400
1335d00L0N01M80k91m75L14Q60K44p66q45K68Q81Nr79q02K56P52N5p19l24L55
$$ -400 -370 131 611 320 -155 159 1019 1263 497 -348 -80 801 806 -173 -975 -719 33 88 -631 -955 -600
1356f00M67p4q9L55N74j52o98P5Q09P11m67j180m53O56Q71j74r57o41K66L52J32
$$ -600 -133 -207 -296 59 633 481 -217 -142 667 1378 911 -269 -722 -66 805 631 -326 -967 -701 -349 -217
1377b17R7J47j29m51k95O23J166L11q08j165J28J061P73l21j050o21J56N77K17
$$ -217 -120 27 -102 -553 -848 -225 941 1252 444 -721 -593 468 1241 920 -130 -751 -595 -18 199
1396A99J4k28m24n38m5J060R28j75j156p49N74J322O00o73r94l39M96M50K06j01
$$ 199 213 -15 -439 -977 -1022 38 966 791 -365 -1114 -540 782 1382 709 -285 -624 -128 322 528 427
1416D27l84n80l43K24Q25N50n02j033l63Q65J078J58o64o37k9N61L61M6k67k14
$$ 427 43 -537 -880 -656 169 719 217 -816 -1179 -314 764 922 258 -379 -408 153 514 560 293 79
1436G9l81j20K44M58J32n78o07j1O55N22j46n41k02M33L14J1j11P6N8j53q2K6
$$ 79 -302 -422 -178 280 412 -166 -773 -784 -129 393 247 -294 -496 -63 251 262 151 227 285 132 50 76
1458G6J57J29m33l31K00K17l3k38j85J98L11P8k89q2K09L96K4k50j53J07J35l0
$$ 76 233 362 -71 -402 -202 15 -18 -256 -441 -243 68 146 -143 -225 -16 380 404 154 1 108 243 213
1480B13q2k2m7k36k28J52M03J21m14m34O5M41M33q7l45k37J79K47J90N2o2k67
$$ 213 131 109 62 -174 -402 -250 153 274 -140 -574 -509 -68 365 278 -67 -304 -125 122 312 364 302 35
1502C5j99n7L45K54m4m84m56J16N38L50k16m10j76Q7K84L31O3j13l15j88J10L88
$$ 35 -164 -221 124 378 334 -150 -606 -490 48 398 182 -228 -404 -317 -33 298 361 248 -67 -255 -145 243
1524B43L81j73n88l07K11M23K75k57m97k04J67K17K67Q3j44k75k67K07M10K89
$$ 243 624 451 -137 -444 -233 190 465 208 -289 -493 -326 -109 158 241 97 -178 -445 -238 172 461
1544D61j60m17k44K05L76J24k39k22q5M4J07K71j2j97k16j35J96L34J79k37l47
$$ 461 301 -116 -360 -155 221 345 106 -116 -201 -157 -50 221 209 12 -204 -339 -143 191 370 133 -214
1565b14o9K37K34J5j97j11K0LN1R6J2m7j33q3J25J93P3k10j71O5J35Q1j12j12
$$ -214 -283 -46 188 203 6 -105 -85 -82 -31 65 77 30 -103 -186 -61 132 205 -5 -176 -111 24 105 -7 -119
1589a19Q5R8j30j06k3K20P4p2j10M3N3K3n2J04N1L5j52j27O8J67Q2j79k98k8K07
$$ -119 -34 64 -66 -172 -195 25 99 27 -83 -40 13 36 -16 88 139 174 22 -105 -37 130 212 33 -265 -293 -86
1614h6K16m3j81n9n1R0J06K56L5j49k85j21L73L29Km47l16P0K22J90K8k63k01
$$ -86 130 87 -94 -153 -204 -114 -8 248 283 134 -151 -272 101 430 432 -15 -331 -261 -39 151 179 -84 -285
1637b85m7R5K23L48n6l18l47R5M89L50j18n04k76J46L72J44j33k24j88q4J16K28
$$ -285 -332 -237 -14 334 278 -40 -387 -292 197 547 429 -75 -351 -205 167 311 178 -46 -234 -318 -202 26
1659B6K60j36l73k60K66M85K15k86l65j21K49K98M5o3k91j24l0P2K45L3q0m25
$$ 26 286 150 -223 -483 -217 268 483 197 -168 -289 -40 258 303 240 -51 -175 -205 -133 112 145 65 -360
1681c60p6L10L66R9l40j57L8K89J16j22m8o3k5p3j0R0L8j29k54j09K82K58j04
$$ -360 -436 -126 240 339 -1 -158 -120 169 285 163 115 52 27 -46 -56 34 72 -57 -311 -420 -138 120 16
1704A6j41n0K44J66n5j42M2J06N4q7j04l3Q4j63r5o2J69o2j54p5J19K90R6k17
$$ 16 -125 -175 69 235 180 38 80 186 240 153 49 16 100 -63 -158 -220 -51 -113 -267 -342 -223 67 163 -54
1728e4j81K48L03J34k21j42J6Q0m1m6j8p4j81k25PK94K03j59m15j00M17M48Q8
$$ -54 -235 13 316 450 229 87 103 183 142 96 78 4 -177 -402 -395 -101 102 -57 -472 -572 -155 293 381
1751C81k03k49Q6J95J70N1j8j56k89k45J42L75L1m63o00N9N23M08j12l30j38J72
$$ 381 178 -71 15 210 380 431 413 257 -32 -277 -135 240 271 -192 -792 -733 -210 198 86 -244 -382 -210
1773b10K96K33J24L0j72l25kL65K30j13o08l92J12M05J33k79l35j9K19J87J52
$$ -210 86 319 443 473 301 -24 -26 339 569 456 -152 -544 -432 -27 106 -173 -508 -527 -308 -121 31
1794C1O4Mp1r1J46L74K21k19m12k22K44K95j63l65k25J6J63j01KQ7P2k6J0J55
$$ 31 95 99 28 -63 83 457 678 459 47 -175 69 364 201 -164 -389 -373 -210 -311 -309 -222 -150 -176 -166 -11
1818a1K19J39j14j78P4K43P3k53k33J5O0pj78j64M6M6l9j8O6J68j4l4P1J73K04
$$ -11 208 347 233 55 129 372 445 192 -41 -26 34 27 -151 -315 -269 -223 -262 -280 -214 -46 -60 -94 -23 150 354
1843C54k2k67kJ71J78j43k91j84Q3Q5oj73m8K9n7MJ43K42J31j96j37L2L54K45
$$ 354 332 65 63 234 412 269 -22 -206 -123 -38 -44 -217 -265 -236 -293 -289 -146 96 227 31 -106 -74 280 525
1867E25j35k85j32N7R6l9j00j16j59m2j4J58J86nk04j30J85L72K83j73k63k4J19
$$ 525 390 105 -27 30 126 87 -13 -129 -288 -330 -344 -186 0 -5 -209 -339 -154 218 501 328 65 41 160
1890A60J43O9k08j42r8j33M5R0J17j53l24j07K86L40O4j79j63J41K67K09n1j02
$$ 160 303 372 164 22 -76 -209 -164 -74 43 -110 -434 -541 -255 85 149 -30 -193 -52 215 424 373 271
1912B71n5j65PN9N4j25k46k50K7K79J48q8k73k6K53L33N2j40k0L7J54o2J9J23
$$ 271 216 51 58 117 171 46 -200 -450 -423 -144 4 -84 -357 -383 -130 203 255 115 95 132 286 224 243 366
1936C66j64k03j16Q7J03r4k07k13P8K63J16j18j59P9K19J27K7%m1M3m2mJ00J7
$$ 366 202 -1 -117 -30 73 -21 -228 -441 -363 -100 16 -102 -261 -182 37 164 191 191 150 193 151 147 247 264
1960B64k39j67m8J70M4j30k24r8J76K38l2n5L6L5J04J00P8N8q3j43k9P0J22n4
$$ 264 25 -142 -190 -20 24 -106 -330 -428 -252 -14 -46 -101 -65 -30 74 174 252 310 227 84 55 125 247 193
1984A93k56j30m3J28R6r4j76O2Q0R7Q6O5k4o1l5J02J40R1j75j71m4J4K01p6k03
$$ 193 -63 -193 -236 -108 -12 -106 -282 -220 -140 -43 43 108 84 23 -12 90 230 321 146 -25 -69 -55 146 70 -133
2009a33j52PR7J03O1m2ol2N7Q6J21M6l3j49J9Q7L3m9j41l8J6j4plm1no2R2O6O1
$$ -133 -285 -278 -181 -78 -17 -59 -65 -97 -40 46 167 213 180 31 50 137 170 121 -20 -58 -42 -56 -63 -66 -107 -112 -174 -82 -16 45
2039D5M6p8m1M2P2J56j45q0k2PP6q3l9pm7l5nN5R6m7jq8J33J05L0q5m5L6L9O6
$$ 45 91 13 -28 14 86 242 97 17 -5 2 78 -5 -44 -51 -98 -133 -138 -83 13 -34 -35 -123 10 115 145 60 15 51 90 156
2069A56j04n5k2Km2k9RO4o3j7K9M5K1O6l7r3J09J00k7o0l0RO6r2o0m8M4Nm5j8
$$ 156 52 -3 -25 -23 -65 -94 -85 -21 -84 -101 -72 -27 -6 60 23 -70 39 139 112 52 22 31 97 5 -55 -103 -59 -54 -99 -117
2099a17P0j4j4j6N1J74m2pl5l2Q9P3p2o7q2L1Q2j3p3m9n9n6j1J05J06j0r1p3J50
$$ -117 -47 -61 -75 -91 -40 134 92 85 50 18 107 180 108 41 -41 -10 72 59 -14 -63 -122 -178 -189 -84 22 12 -79 -152 -2
2128bJ15Mk1o0qJ3P9j11K5j3o2n5N8N1k1j04j8kJ07P1j2o2jM0O0N1J9o1o2q4O9
$$ -2 113 117 96 36 28 41 120 9 34 21 -41 -96 -38 13 -8 -112 -130 -132 -25 46 34 -28 -29 11 71 122 141 80 18 -66 3
2159CL4K8o0r6ok8J04M4mj00RLR4M0q9N9k5N0mQL8p6o8k1O9knr3K5K1N2jm7R1
$$ 3 37 65 5 -91 -97 -125 -21 23 19 -81 -72 -69 25 65 -24 35 10 60 56 64 102 26 -42 -63 6 4 -1 -94 -69 -48 4 3 -44 47
2193D7m2J8K8Nj5m1oj2N8Mk5p5jK5j3J02l8o9rJ02K4r6l5M8n1M8O3nJ3p7LJ2L8
$$ 47 5 23 51 56 41 0 -6 -18 40 44 19 -56 -57 -32 -45 57 19 -50 -59 43 67 -29 -64 -16 -67 -19 44 39 52 -25 -22 -10 28
2226B8j2k0o8Ql8J13l6M0o7M1L9kML3jJ4m9l6Q7m0J2j43nN5L7O3n9JopP2k8P2
$$ 28 16 -4 -72 -64 -102 11 -25 15 -52 -11 28 26 30 63 62 76 27 -9 78 38 50 -93 -98 -43 -6 57 -2 -1 -7 -14 58 30 102
2259A02j1j05n2N8J25l0n4o9l6O9M1m3l0Rk8N6k2Q0o0J5j6m5Q5J32n1j27Mj8O9
$$ 102 91 -14 -66 -8 117 87 33 -36 -72 -3 38 -5 -35 -26 -54 2 -20 60 0 15 -1 -46 39 171 120 -7 -3 -21 48
2288D8J3p0Nl9k7L4LJ0Pm5m9K0J30N5o1n4j9J11M9n1j5l3O4r4pK6j2L1q3K0K1
$$ 48 61 -9 -4 -43 -70 -36 -33 -23 -16 -61 -110 -90 40 95 34 -20 -39 72 121 70 55 22 86 -8 -15 11 -1 30 -53 -33 -12
2319a2L0j2Pr6J41q1R2m8o3Q2mK4o0j1K2k9NO2o8J4m8L6l4Q6Kn9j7l7J08N8m7
$$ -12 18 6 13 -83 58 -23 69 21 -42 40 36 60 0 -11 11 -18 -13 49 -19 -5 -53 -17 -51 35 37 -22 -39 -76 32 90 43
2350D3j2m9J9N4K9q1K5Oj10L6O8N6q1m5rJM7O2l5n7j9J3O6mqK1m3j5J2kO0r4j4
$$ 43 31 -18 1 55 84 3 28 34 -76 -40 28 84 3 -42 -51 -50 -3 59 24 -33 -52 -39 27 23 15 36 -7 -22 -10 -12 48 -46 -60
2383f0j2Q2M4k2n5K7k5K5J7L8M5n6k6n5j5P6Kjo9k1K5P3K7j39K8J3O3K1k3N1j5
$$ -60 -72 10 54 32 -23 4 -21 4 21 59 104 48 22 -33 -48 28 30 29 -40 -61 -36 37 64 -75 -47 -34 29 50 27 78 63
2414F3k9o0M2M5j5o7n3J9N6mr9K1L6OrM6k5J6M8kk4M0jjONLj7k0J5j06L6K6pl1
$$ 63 34 -26 16 61 46 -21 -74 -55 1 -3 -102 -81 -45 -39 -48 -2 -27 -11 37 35 11 51 50 49 55 60 63 46 26 41 -65 -29 -3 -10 -41
2449d1l5K1J7jJ8K0l8QK4J1M9L0q1o0J07JQn5m7l3M4jN5l9m4j0Q7j3L0JQp1L1
$$ -41 -76 -55 -38 -39 -21 -1 -39 -31 -7 4 53 83 2 -58 49 50 58 3 -44 -77 -33 -34 21 -18 -62 -72 15 2 32 33 41 -30 1
2482AN5O8o8j0l9k7M1O1r6j6mn0O0mNj6k4n3R4Q1K1jq5K0RL8k0n6N3l1o1M5n8
$$ 1 56 124 56 46 7 -20 21 82 -14 -30 -34 -84 -24 -28 -23 -39 -63 -116 -22 59 80 79 -6 14 23 61 41 -15 38 7 -54 -9 -67
2515f7L9k2K7J0j0K3k1L2n0N6J3j0PPj9O7m6L0n1RL5p0pl0N4m0k2JKM4L5l8K4
$$ -67 -28 -50 -23 -13 -23 0 -21 11 -39 17 30 20 27 34 15 82 36 66 15 24 59 -11 -18 -48 6 -34 -56 -55 -53 -9 26 -12 12
2548A2n2M5J4J7n0P7j00JN4m4Q0p0k0NN7n2K1j6Mk4L1L3rn3J7M4QlK6k5j5oJ1
$$ 12 -40 5 19 36 -14 63 -37 -36 18 -26 54 -16 -36 -31 26 -26 -5 -21 -17 -41 -10 23 14 -39 -22 22 30 27 53 28 13 7 18
2581A8j2kM2j12J8K7K3J5j6n2L3k6J6N2p1NJ2P4o8P4n8lK7k3L3Mj4m4mK9J8l3
$$ 18 6 4 46 -66 -48 -21 2 17 1 -51 -18 -44 -28 24 -47 -42 -30 44 -24 50 -8 -11 16 -7 26 30 16 -28 -32 -3 15 -18
2613a8PN0p3KPM4K3m7k3k1N6L7ql3pl9K1R4m8m5nL6n2J7O4no5RL1k5%k8JJ1M0
$$ -18 -11 39 -34 -32 -25 19 42 -5 -28 -49 7 44 36 3 -4 -43 -22 72 24 -21 -26 10 -42 -25 39 34 -31 -22 9 -16 -16 -44 -43 -32 8
2648HR2q8J6o1l0Q4N0p6K3m6m2J00k3L6o9ll7M9M0L9l8n8Lj6M9L7l5j6k7J9L9
$$ 8 100 12 28 -33 -63 21 71 -5 18 -28 -70 30 7 43 -26 -29 -66 -17 23 62 24 -34 -31 -47 2 39 4 -12 -39 -20 19
2679A9N2n5J8m0J3N7k4J2q1l2Q5K3m3%Qk6L5j3J7jk8j6K0ON3o5%LN2Mj6l8J6n
$$ 19 71 16 34 -6 7 64 40 52 -29 -61 24 47 4 4 12 -14 21 8 25 24 -4 -20 0 6 59 -6 -6 -3 49 53 37 -1 15 10
2713A0n2M1M2n5orj4N5L2q3pk3Q4lj8L5l2kM5m4O0n0j1M4l9Om6Q4j35Q1j7J4l4
$$ 10 -42 -1 41 -14 -20 -29 -43 12 44 -39 -46 -69 15 12 -6 29 -3 -5 40 -4 56 6 -5 39 0 6 -40 44 -91 -10 -27 -13 -47
2746d7M8l0Jk4P0oL3J1o4pJ9K6k6qQk9J3j3M1j4k8Lm2M3N0m1L0J6k6on3P9k0l2
$$ -47 1 -29 -28 -52 18 12 45 56 -8 -15 4 30 4 -4 4 -25 -12 -25 16 2 -26 -23 -65 -22 28 -13 17 33 7 1 -52 27 7 -25
2780b5j8L6O6m4n2jMkLM7jj3pj2L6Qj4L7o0j4QM4q5P6m7j7kL4j6n1O5O3l7%L8
$$ -25 -43 -7 59 15 -37 -38 -34 -36 -33 14 13 0 -7 -19 17 25 11 48 -12 -26 -18 26 -59 17 -30 -47 -49 -15 -31 -82 -17 46 9 9 47
2815D7j4nJ8m9pN0k7M8l4nN3q4Nlm2K3nL4n3j9L5K2R4p6OOj0j9J5m7P6j8K2p5
$$ 47 33 28 46 -3 -10 40 13 61 27 22 75 -9 -4 -7 -49 -26 -31 3 -50 -69 -34 -12 82 6 12 18 8 -11 4 -43 33 15 37 -38
2849c8M8J4l3L1l9k6L3JL4n2K2k6L5M5m3k5k2L8L3qJ3lm3j2N4l5l6L2L0r3L8O9
$$ -38 10 24 -9 22 -17 -43 -10 -9 25 -27 -5 -31 4 49 6 -19 -41 -3 30 22 35 32 -11 -23 31 -4 -40 -8 22 -71 -33 36
2881C6m7QORm2R5n8KpMM9mo6N2o5m0L0K6n8M3rj1N7Pj9J4loM5j7kk5K2lj9l3N
$$ 36 -11 -3 3 12 -30 65 7 9 2 6 55 51 -15 37 -28 -68 -38 -12 -70 -27 -36 -47 10 17 -2 12 9 3 48 31 29 4 26 23 4 -29 -24
2918b4oQ2k2p5j7P9m9J0L4j8m0M7l6N9k0K7l7K9k9L9k5J2m9LL0RPJ3Rr2Q8m8k
$$ -24 -30 52 30 -45 -62 17 -32 -22 12 -6 -46 1 -35 24 4 31 -6 23 -6 33 8 20 -29 -26 4 13 20 33 42 -50 38 -10 -12
2951a2Rm6N3Pk5QM5m6j7P6j5j4p5L8mN1j3l6K5J4j0M0k4j0r7R1Pm6O2n8M0j7j9
$$ -12 -3 -49 4 11 -14 -6 39 -7 -24 52 37 23 -52 -14 -18 33 20 -16 9 23 13 53 29 19 -78 13 20 -26 36 -22 18 1 -18
2984a8k8R1q2J3J8O9p7K9K4k1J3l5k5j5N4o4N7nK8L3l2k0l5K1K9l0P5m5l6j2K8
$$ -18 -46 45 -37 -24 -6 63 -14 15 39 18 31 -4 -29 -44 10 -54 3 -2 26 59 27 7 -28 -7 22 -8 67 22 -14 -26 2
3015BJ3j1kOo8M1L8k1J4m2M3n4O0j4k6L6k6M8J8p7P9j00L6l3O2L6kj13L4M6Mj4
$$ 2 15 4 2 8 -60 -19 19 -2 12 -30 13 -41 19 5 -21 15 -11 37 55 -22 57 -43 -7 -40 22 58 56 -57 -23 23 27 13
3047A3j2ln3P7l7P5K1q4k5l6O0K0m0K6pj2L2OmJ0n0l8P8K0m6K7m3M0NqNJ3j9L5
$$ 13 1 -2 -55 22 -15 60 81 -3 -28 -64 -4 16 -24 2 -5 -17 15 21 17 27 -23 -61 17 37 -9 18 -25 15 20 12 17 30 11 46
3081D6o2PL4K7k6p4N7n1K5OPK4%j7M8q7L7j8qN8J0Jj19Q9l0KK8nKk8P5o2pN3k8
$$ 46 -16 -9 25 52 26 -48 9 -42 -17 -11 -4 20 20 3 51 -36 1 -17 -25 33 43 44 -75 14 -16 -14 14 9 11 -17 58 -4 -11 42 14
3116A4k2K8qJ5l5J4k6M4pl9K7K2l5k4N4l3K5ok4n2J07rj9%l4J3J7J2jLkp2j8K8
$$ 14 -8 20 12 27 -8 6 -20 24 17 -22 5 27 -8 -32 22 -11 14 8 -16 -68 39 30 11 11 -23 -10 7 19 18 21 19 -53 -71 -43
3150d3O1J9q5Q5j4l5Pl5N8rL6l9k0J4j3j8K3J4L6mqn9M9n5nN5k5L5l8K5J6o0J7
$$ -43 18 37 -48 37 23 -12 -5 -40 18 9 45 6 -14 0 -13 -31 -8 6 42 38 30 -29 20 -35 -40 15 -10 25 -13 12 28 -32 -15
3183a5J0k6N4n9O2k7j1kJ6j3nJ6P3p7j7j2QL8m3M2k4M6Ml2J4rQJ6Pn0k0K2pkN5
$$ -15 -5 -31 23 -36 26 -1 -12 -14 2 -11 -16 0 73 -4 -21 -33 -25 13 -30 12 -12 34 38 6 20 11 19 35 42 -8 -28 -6 -13 -15 40
3218D0p1M6l0N2jj5m3J9MJK4n3k2ML2K0N4o2k1L6QlJ8m7l8Q5n8M4nkK0m7lL5j4
$$ 40 -31 15 -15 37 36 21 -22 -3 1 2 26 -27 -49 -45 -13 7 61 -1 -22 14 22 19 37 -10 -48 37 -21 23 18 16 36 -11 -14 21 7
3253Gj3M0n8N7m2Pj5k0M5j8N8n9M0Nq9L3JKJ8k3k6K5J2rJ3N0k4moL0n6K0J8J1
$$ 7 -6 34 -24 33 -9 -2 -17 -37 8 -10 48 -11 29 34 -55 -22 -21 -19 -1 -24 -50 -25 -13 -22 -9 41 17 13 7 37 -19 1 19 30
3287C0K5m8Pj9J6Lk2m9J2K5Rl3Q4j11Q9n3M6k1k9L0L8m3j7J0K8l5L7kk7QJ8k3
$$ 30 55 7 14 -5 11 14 -8 -57 -45 -20 -11 -44 40 -71 18 -35 11 -10 -39 -9 29 -14 -31 -21 7 -28 9 7 -20 -12 6 -17
3319a7J4l0M2J9q4P8pMmlo1R9p0M8r6M5K1m8N6k0QPO2p4QL2L1o8K2%l9M7k9Jk4
$$ -17 -3 -33 9 28 -56 22 15 19 15 12 -49 50 -20 28 -68 -23 -2 -50 6 -14 -6 1 63 -11 -3 29 60 -8 14 14 -25 22 -7 -6 -30
3354c0rM8n1M9qk5L2k3J0N6o0j8N5n4M9j4k0j0J6j3L7K1m3L6j4p6L1N6mn5j8J2
$$ -30 -39 9 -42 7 -1 -26 6 -17 -7 49 -11 -29 26 -28 21 7 -13 -23 -7 -20 17 38 -5 31 17 -59 -28 28 24 -31 -49 -37
3386c7K0L3lJ3o6M8L5ll7l7j3K7K2Nko7O4l2K4J3mJ4J0l4rl9L8K3%M9m8Nn5L4
$$ -37 -17 16 13 26 -40 8 43 40 3 -34 -47 -20 2 7 5 -62 2 -30 -6 7 3 17 27 -7 -16 -55 -17 6 6 55 7 12 -43 -9
3420iJ7J9j8k9K2J5n8M9l3kJ8L2j3l3nP4n4L3l3jqJ0L6Kpo5O5k3K4M5o3j9lk1
$$ -9 8 27 9 -20 2 17 -41 8 -25 -27 -9 23 10 -23 -28 46 -8 25 -8 -9 -17 -7 29 31 24 -41 24 1 25 70 7 -12 -15 -36
3454c6j9P7j0m6L2pK5k0L7j9kM9j8o2J8J9Pjq3K9MLj9K8QPK8M7m5n1J9j3N1m8
$$ -36 -55 22 12 -34 -2 -9 16 -4 33 14 12 61 43 -19 -1 18 25 24 -59 -30 -26 -23 -42 -14 -6 1 29 76 31 -20 -1 -14 37 -11
3488a1JJ4O1r2oK8L6n8k7M9MJ0m1J5moR8p3nRm1QN1Rm6j8K8rmM3k3KK2lm7J4O2
$$ -11 -10 4 65 -27 -33 -5 31 -27 -54 -5 -1 9 -32 -17 -21 -27 71 -2 -7 2 -39 -31 20 29 -17 -35 -7 -16 -20 23 0 2 24 21 -26 -12 50
3525E0p2QL8m9J1M4j0L1n6m1M0J6nL2j8M9q9J9n6J3P5l4k3K9k1mN4n6K0k9M5J4
$$ 50 -22 -14 24 -25 -14 30 20 51 -5 -46 -6 10 5 37 19 68 -21 -2 -58 -45 30 -4 -27 2 -19 -23 31 -25 -5 -34 11 25
3557B5o3J1l0N9LnlL2J7n2L0l5J4o1O0OL8l1qm0L3j1ll1R0k0k6L7J0n6J3k7K0
$$ 25 -38 -27 -57 2 5 0 -3 29 46 -6 24 -11 3 -58 2 8 46 15 7 -33 0 -11 -14 -45 45 25 -1 36 46 -10 3 -24 -4
3590dnj4N6j8l2j5MJ8Lj5j3R6m1k4L5j6m7j2M1NL1j7l4J6rL6n8M5l7N4l3m1O4
$$ -4 -9 -23 33 15 -17 -32 -28 -10 -7 -22 -35 61 20 -4 31 15 -32 -44 -3 2 33 16 -18 -2 -11 25 -33 12 -25 29 -4 -45 19
3623A9j6J7Qo0L0M1m9J1K5j4L8n4NNk6J1Oj9K7k8k0K9K6J8m1K7L5r3L8j5OJ2K9
$$ 19 3 20 28 -32 -2 39 -10 1 26 12 50 -4 1 6 -20 -9 -3 -22 5 -23 -43 -14 12 30 -11 16 51 -42 -4 -19 -13 -1 28
3656B8j2k3L8Jm7k0P0j7m3Nj7N5k2K1J3o3j6J22r2j7O1o4O5n3K0J8J6l7j4%M2
$$ 28 16 -7 31 32 -15 -35 35 18 -25 -20 -37 18 -4 17 30 -33 -49 73 -19 -36 25 -39 26 -27 -7 11 27 -10 -24 -24 18
3687A8K3n2L6L2j07J6N8rn9O8m1M4j4j4kl7K2m3L5M1L4l5K7n0L3m0K2M1l2m4L2
$$ 18 41 -11 25 57 -50 -34 24 15 -44 24 -17 27 13 -1 -3 -40 -18 -61 -26 15 49 14 41 -9 24 -16 6 47 15 -29 3
3718CRl2LL6nl5K9j5J1jk2K2J7l6j4j1N0N6o1k0k4J1L6L5kk5K7k7kp5O5K1K4p6
$$ 3 12 -20 -17 19 14 -21 8 -7 4 3 -19 3 20 -16 -30 -41 9 65 4 -16 -40 -29 7 42 40 15 42 15 13 -62 3 24 48 -28
3752b8lP6q0OJ3P2l4ql1J7J8o6N5jl3l0O1pJ0m8KL6j1QqK1L2m3k0JlO8n3nj0l4
$$ -28 -31 45 -35 -29 -16 56 22 14 -17 0 18 -48 7 6 -27 -57 4 -3 7 -41 -39 -3 -14 -6 -14 7 39 -4 -24 -23 -26 42 -11 -16 -26 -60
3788f0Q6NNl3j9M9rn5O1m3K5M8n2ln3L9k4J7PK1j07K6O7l9M7RM5m3l4k1k1R0Q
$$ -60 26 31 36 3 -16 33 24 -31 30 -13 12 60 8 5 -48 -9 -33 -16 -9 12 -95 -69 -2 -41 6 15 60 17 -17 -38 -59 31 39
3821C9j7K3k3M8r3K3qj0O5on1j6L0K2l6k4M0l7L2k8K8Lk8j6K3K7ol0M0M3q7L3
$$ 39 22 45 22 70 -23 0 -8 -18 47 41 -10 -26 4 26 -10 -34 6 -31 1 -27 1 4 -24 -40 -17 10 4 -26 14 57 -30 3
3853Cj3K5o0M2L2LK3n2n8Q3o0N4l7M3p8K4P1j8k6m0N1jk6K1Nnl1LK0K8l0K8%J4
$$ 3 -10 15 -45 -3 29 32 55 3 -55 28 -32 22 -15 28 -50 -26 45 27 1 -39 12 11 -15 6 11 6 -25 -22 -2 26 -4 24 24 38
3887C8o4L3l2L1qj9K4nNk2M6N2p0k6K4LrM1k6k0K7j3K2mm7K1J3KK2j5J5L6j06
$$ 38 -26 7 -25 6 -2 -21 3 -2 3 -19 27 79 9 -17 7 10 1 42 16 -4 23 10 32 28 -19 2 15 17 39 24 39 75 -31
3920c1M7m0K8QJ0j0j0L2k3j5J3ok1NJ6Mm0M2k9K8L3l4M6K3r3L8n2N0M3q4K9J9
$$ -31 16 -24 4 12 22 12 2 34 11 -4 9 3 -18 -13 3 7 -33 9 -20 8 41 7 53 76 -17 21 -31 19 62 -22 7 26
3952B6Omk3O7n6K6m7pM6m1L5l9K3K8l0J1Km3lkP4n0k2O7j7kJm9pJ6J4jJ4l4N2
$$ 26 32 28 5 72 16 42 -5 -12 34 -7 28 -11 12 40 10 21 23 -20 -23 -25 49 -1 -23 44 27 25 26 -23 -30 -14 0 -1 13 -21 31
3987C1m0K1mn0K0K8L9o0jN1k6Ln8N3jn5P2l2K3n1k2K1L3nJ3k1M8n5O0m3k0j3j5
$$ 31 -9 12 8 -42 -22 6 45 -15 -16 35 9 12 -46 7 6 -49 23 -9 14 -37 -59 -38 -5 -10 3 -18 30 -25 35 -8 -28 -41 -56
4020e6L8J0J3j0k0M9m2M8o2O0j3j6rK6J0k1kl9L5K4M4o1L6p8K7%MO8p9N6m0m0
$$ -56 -18 -8 5 -5 -25 24 -18 30 -32 28 15 -1 -10 16 26 5 3 -36 -1 23 67 6 42 -36 -9 -9 -5 63 -16 40 0 -40
4052d0J6K4N8m2l4j3oL7L6p5N9Qqk3k0M3j5N%M6o1l4Q0p6N2m6M7j4m5O5j3L7l3
$$ -40 -24 0 58 16 -18 -31 -37 0 36 -39 20 28 20 -3 -23 20 5 10 10 56 -5 -39 41 -35 17 -29 18 4 -41 24 11 48 15
4085A5k0QJj3M7j3o7mM5J5j2k7N7L2p7j7l1J1P1l9M3l4m2N3lj0kL5Lm6k1R9m2
$$ 15 -5 3 4 -9 38 25 -42 -46 -1 14 2 -25 32 64 -13 -30 -61 -50 21 -18 25 -9 -51 2 -1 -11 -13 22 25 -21 -42 57 15
4118A5PN9j07M7m0K7l8K3j3L6J3o7O8m0nK3OL3m4K2k7n6L1J6l3M2N5p1L1J2j9
$$ 15 22 81 -26 21 -19 8 -30 -7 -20 16 29 -38 30 -10 -15 8 14 47 3 25 -2 -58 -27 -11 -44 -2 53 -18 13 25 6
4149Fl9K7%K8Nol0k3j8P5j6J7L0k4kk9L3Rm1l2O2j5n2kk2O0P1m5q3N9J8j0k2l6
$$ 6 -33 -6 -6 22 27 21 -9 -32 -50 25 9 26 56 32 30 1 34 43 2 -30 32 17 -35 -37 -59 1 72 27 -56 3 21 11 -11 -47
4183d7O3k1JRQj6qK2q4J08l1J8nn5L0L5l2M3m4qnl0M0L4j7n8O8j2JO0m5r4M8J7
$$ -47 16 -5 -4 5 13 -3 -11 11 -73 35 4 22 17 -38 -8 27 -5 38 -6 -14 -19 -49 -9 25 8 -50 18 6 7 67 22 -72 -24 -7
4217gJLj3PK0J2j4Rj1J6n5K0MM1o0J5J1L5m3J5K1l4m1K5rL0L5lk8QJ9r8L0M2L6
$$ -7 -6 -3 -16 -9 11 23 9 18 7 23 -32 -12 -8 33 -27 -12 -1 34 -9 6 27 -7 -48 -23 -32 -2 33 30 2 10 29 -69 -39 3 39
4252C9qj8PNk8k2m0J14j3p3O6m4K4L6j3Ql3j6Jk9M0Km3K5QM3q7P9l4j4L6j2k7
$$ 39 31 13 20 25 -3 -25 -65 49 36 -37 29 -15 9 45 32 40 7 -9 -8 -37 3 5 -38 -13 -5 38 -49 30 -4 -18 18 6 -21
4285b1J2P1p4P9n4PnJ0n6O6j5m6K0J6J0L7m6m3M4j2L6m6L2J2l5m4RM3k5K0oRj6
$$ -21 -9 62 -12 67 13 20 15 25 -31 35 20 -26 -6 10 20 57 11 -32 12 0 36 -10 22 34 -1 -45 -36 7 -18 2 -4 5 -11
4318a1Qk5J7K0j5M1J0r4J19m3j5K9l5mj9M3m1Rl5L1OM7m1J0m4N4j6m9N5J0l6r
$$ -11 -3 -28 -11 9 -6 35 45 -49 70 27 12 41 6 2 -17 26 -15 -6 -41 -10 -4 43 2 12 -32 22 6 -43 12 22 -14 -23
4350b3O3m7M7m3M7K3l4m2mN0l7M5m6k6O0l5P7r9J9L8k5N8Pm0l6l2M8nL8p0N7m5
$$ -23 40 -7 40 -3 44 67 33 -9 -13 37 0 45 -1 -27 33 -2 75 -24 -5 33 8 66 73 33 -3 -35 13 8 46 -24 33 -12
4382a2J2k3k0k5O7L2p1P4o4pO8l9rNK2pl0L5n1J3lJ3Q0rl9k2rN4k0n1P0l2j0L2
$$ -12 0 -23 -43 -68 -1 31 -40 34 -30 -37 31 -8 -17 -12 10 3 -27 8 -43 -30 -33 -20 60 51 12 -10 -19 35 15 -36 34 2 -8 24
4416B4m8RL7j2Rj1nl4J3Q3q1K5m3J06o9J7l3L0Pn6JL6mK5nrKm4O6m5O8j27R1N
$$ 24 -24 -15 22 10 19 8 3 -31 -18 65 -16 9 -34 72 3 20 -13 17 24 -32 -31 5 1 26 21 12 14 -30 36 -9 59 -68 23 28
4450B8K0m8J9m3O1K1m3lj0N3m1k2kL7j4J3l4k8O8m7jK9k0J1LPq9R4K6l1l2O5j02
$$ 28 48 0 19 -24 37 58 15 12 2 55 14 -8 -10 27 13 26 -8 -36 32 -15 -16 13 -7 4 7 14 -75 19 45 14 -18 47 -55
4483e5R8k6pl5JK5m3M0j7K5K1k5J9j8k8lJ9M9k3J4n5M9o7lJ8K1j3J9j6J1pL0N4
$$ -55 43 17 10 -25 -24 1 -42 -2 -19 6 27 2 21 3 -25 -28 -9 40 17 31 -24 25 -42 -45 -27 -6 -19 0 -16 -5 -12 18 72
4516G2j02Ok7N6K9op1J52r2m3M0J9k4r3M3L3J7pL2m8J7QJ7oj6K2j0J1J0j6l9J4
$$ 72 -30 -24 -51 5 34 28 -43 109 17 -26 14 33 9 -84 -41 -8 9 2 34 -14 3 11 28 22 6 28 18 29 39 23 -16 -2
4548bOj0l4M6k4K4j8M2pn1N3jm1Rkk0J9j0jL0K5l7M3o6J7M8k0J9n7M7ol2M5l0
$$ -2 4 -6 -40 6 -18 6 -12 30 23 -28 25 24 -17 -8 -10 -30 -11 -21 -22 8 33 -4 39 -27 -10 38 18 37 -20 27 21 -11 34 4
4582Dk1l3%L4L3l3J6k7N2k9LqJ0l1M4qj2nN1mk7Kpj1K0N%J2m1N8l0j8m3K4M1J3
$$ 4 -17 -50 -50 -16 17 -16 0 -27 25 -4 -1 -9 1 -30 14 6 -6 -11 40 36 9 11 4 -7 13 18 18 30 -11 47 17 -1 -44 -20 21 34
4618C4Po0k7L1J6M6Qn0k0J5J0j1j2k2M7m3J1L6m3J9j4RK0m5O7K4r0J1L1Mj7J0
$$ 34 41 -19 -46 -15 1 47 55 5 -15 0 10 -1 -13 -35 12 -31 -20 16 -27 -8 -22 -13 7 -38 29 53 -37 -26 5 9 -8 2
4650BK2kj8lOLM8j5n4K7m0M0k5K6nL9l7KK1m3K9J4qK9m4j0l2J0l9J1L2M5nm7L3
$$ 2 24 22 4 1 7 10 58 43 -11 16 -24 16 -9 17 12 51 14 16 37 -6 23 37 29 58 14 4 -28 -18 -57 -46 -14 31 26 -21 12
4685A2K8n6K1j6NK9j5ol5l0R4m9Mk8O6OJ6m8J6l5M9l7R0r1l6O8m7NL9jJ3J1r5
$$ 12 40 -16 5 -11 -6 23 8 2 -33 -63 31 -18 -14 -42 24 30 46 -2 14 -21 28 -9 81 -10 -46 22 -25 -20 19 18 31 42 -53
4718e3K5rP8mn6%K3k9L2m3L6k5K6n1P2km4KL8K8l5j0nl1J9oK8Lnqj2K9m5J5oM4
$$ -53 -28 -37 41 37 -19 -19 4 -25 7 -36 0 -25 1 -50 22 20 -24 -22 16 44 9 -1 -6 -37 -18 -24 4 7 2 -6 -18 11 -34 -19 -25 19
4754A9j0j0L7rk0K0Kl0k2nK2pJ0k9L1L1qj1%j1rL6j6J7N5o2K3J0o6P9o6J9nnK1
$$ 19 9 -1 36 27 7 27 29 -1 -23 -28 -6 -13 -3 -32 -1 30 22 11 11 0 -9 27 11 28 83 21 44 54 -12 67 1 20 15 10 31
4789C1K3j00JJ3P3l9K3k9rM0j8K2m1J8Mm9ON9n2M4n7N5k7K7m7K6Mk6QRL8n1Pk
$$ 31 54 -46 -45 -32 41 2 25 -4 -13 27 9 31 -10 8 12 -37 -31 28 -24 20 -37 18 -9 18 -29 -3 1 -25 -17 -8 30 -21 -14 -16
4823a6K5qm1j1L9J7kJ0jRq6N4J5j6J6K0j6mK6p5O7o6M7j8QO6k8k4r%l8K7LJ4k4
$$ -16 9 1 -40 -51 -12 5 3 13 12 21 -65 -11 4 -12 4 24 8 4 30 -45 22 -44 3 -15 -7 59 31 7 -2 -2 -40 -13 -10 4 -20
4858b0OM3l3l7MJ1M7JK4o2lP1q8LM5K6j5rjk7L3j2P4q3k8M4k1%P9r1L6M7j02m
$$ -20 -14 29 -4 -41 -37 -26 21 22 46 -16 -19 52 -36 -33 12 38 23 14 13 -14 19 7 81 -2 -30 14 -7 -7 72 -19 17 64 -38 -42
4892d2L6L7Mo1J1l5O0M8m5J3po0N0l0l4PK0L9Rm1K2qj0L6r2N3J7N9o6N8n7nj3
$$ -42 -6 31 35 -26 -15 -50 10 58 13 26 19 -41 9 -21 -55 -48 -28 11 20 -21 1 -7 -17 19 -73 -20 -3 56 -10 48 -9 -14 -27
4925b7P6l9k5%L2o5J2m4O4Qj3K7M0l2K9m6k6J9Rj3L1pqPj4nM8K2j7Lp8L2M2k7
$$ -27 49 10 -15 -15 17 -48 -36 -80 -16 -8 -21 6 46 14 43 -3 -29 -10 -1 -14 17 10 2 9 -5 -10 38 60 43 46 -32 0 42 15
4959A5K6p5N3J2Pl2l9K4K0k4%J4J3J4p0P5q4O1l3L8n2rL1k4P1k9jK7r7P7rRl9
$$ 15 41 -34 19 31 38 6 -33 -9 11 -13 -13 1 14 28 -42 33 -51 10 -23 15 -37 -46 -15 -39 32 3 2 29 -68 9 0 9 -30
4992c0M1k9K2j0L6Ll0l9j2M1N0n4KO6l7l5k9J19p5J5K0l2k3K5N8p8Om5N4j6K6
$$ -30 11 -18 4 -6 30 33 3 -36 -48 -7 43 -11 -9 57 20 -15 -44 75 0 15 35 3 -20 5 63 -15 -9 -54 0 -16 10
5023A0k4K8J3kK2m7J7K5m8j2L4k1L2r1N2K6J9o6L6K5n2jJ2L7oj6m1M4jKnK3r7
$$ 10 -14 14 27 25 47 0 17 42 -6 -18 16 -5 27 -64 -12 14 33 -33 3 28 -24 -25 -13 24 18 2 -39 5 4 6 1 24 -73
5056g3J12l7J8k3k3jK7nq2J19n4M8l1J6j8J5K5m2j0J4MJ1K4k4J3J6o5PQ8n0K1
$$ -73 39 2 20 -3 -26 -27 0 -5 -87 32 -22 26 -5 11 -7 8 33 -9 -19 -5 -1 10 34 10 23 39 -26 -19 69 19 40
5087D0kk3rQJ5j5j9k6J2O2j9o6N8J1k7j4RJ1j7J4JMJ5j0J9l1J4p1K2J9K7l1k8
$$ 40 38 15 6 14 29 14 -5 -31 -19 43 24 -42 16 27 0 -14 -5 6 -11 3 4 8 23 13 32 1 15 -56 -34 -15 12 -19 -47
5120d7KM4m0J8L8l5l1O1J6n3N6q0Q0o1M3l0P1n9j4K2l2nQ2o9J4npk8J4oRP1r6
$$ -47 -45 -1 -41 -23 15 -20 -51 10 26 -27 29 -51 29 -32 11 -19 52 -7 -21 1 -31 -36 46 -23 -9 -14 -21 -49 -35 -41 -32 39 -57
5153e7J00m5oj2M0o5N1oJj8K6%P1p7OLK3o9J5J9KL4k0j1nL6q9Q5m7k3j6R5l8k
$$ -57 43 -2 -8 -20 20 -45 6 0 1 -17 9 9 80 3 9 12 35 -34 -19 0 2 36 16 5 0 36 -53 32 -15 -38 -54 41 3 1
5187AJ5o8J01r9O4m8K2Jk0K7N1p2j5k6L7mN0K8o9k1K5MQ2l8M8k8r8Q2n0nKL2n1
$$ 1 16 -52 49 -50 14 -34 -12 -11 -31 -4 47 -25 -40 -66 -29 -33 17 45 -24 -45 -20 -16 66 28 76 48 -50 32 -18 -23 -21 11 -40
5220d0J9K6j7J3LJ8j7k6L0l0k9rM7L3j0L1q3QP5k0l2J4Oj4J8k7m7M1L8K5nj6p1
$$ -40 -21 5 -12 1 4 22 5 -21 9 -21 -50 -59 -12 21 11 42 -41 -33 42 22 -10 4 10 -4 14 -13 -60 -19 19 44 39 23 -48
5253d8M1p3J06n0O4j0jj9qJ3L5n7Prj6l3O4j3rPk4M4k8N1m2m2O1m5qJ8K9j3%l
$$ -48 -7 -80 26 -24 40 30 29 10 2 15 50 -7 0 -9 -25 -58 6 -7 -16 -9 -33 11 -17 34 -8 -50 11 -34 -42 -24 5 -8 -8 -11
5287a1L2mnj5oQ6j19K3j7K7KJ0j6K4K3q7M8M7n1K9ll0mP5l1p2L8K6j5NK4p5P5
$$ -11 21 17 12 -3 -9 77 -42 -19 -36 -9 -7 3 -13 11 34 -53 -5 42 -9 20 17 -13 -17 58 27 -45 -7 19 4 9 33 -42 33
5320C3j1l1J2JK2J4o3O8l4M0l9Mk3NN1l9J0L6m3l3%N5n7rL6RK8n3M0pqj7oOm0
$$ 33 22 -9 3 4 26 40 -23 45 11 51 12 16 -7 -2 49 10 20 56 13 -20 -20 35 -22 -31 5 14 42 -11 29 22 14 -3 -9 -3 -43
5355d3R2m0j0K2l5j4M4l0k1O1l3Qkk0oL3l4L8jm8J1M4l7K0k8N9l8J7K9p8J8K4
$$ -43 49 9 -1 21 -14 -28 16 -14 -35 26 -7 1 -1 -21 -27 6 -28 10 9 -39 -28 16 -21 -1 -29 30 -8 9 38 -40 -22 2
5387BM0k3n6K6j3j4K9l2M6Qk5Jj0o4O2J2J7k5L1K6k0j3j3j8l2N8M2o0L7l2M2k0
$$ 2 42 19 -37 -11 -24 -38 -9 -41 5 13 -12 -11 -21 -85 -23 -11 6 -19 12 38 18 5 -8 -26 -58 0 42 -18 19 -13 29 9
5419Inl7L0L7o8Pj3L2%rJ3K4jprjLn0N2k4K0K6m5Jj9M1kmmjoJ6l5L0L8n3K2L0
$$ 9 4 -33 -3 34 -34 -27 -40 -8 -8 -17 -4 20 19 12 3 2 5 -45 7 -17 3 29 -16 -15 -34 7 5 1 -3 -4 -10 6 -29 1 39 -14 8 38
5457C8pn0O2rn3Nl4P0J9l0m5N3K7m1K6l0J7k4j3N4l5j3L4k8QmK2L8q3NRm5J02
$$ 38 31 -19 43 34 -19 -14 -48 22 41 11 -34 19 46 5 31 1 18 -6 -19 35 0 -13 21 -7 1 -3 19 57 -26 -21 -12 -57 45
5490D5m0j1m7JM6olNj7J8K5j3J6k3K1k0nJ9nK7ml5k0ON6l7m0O6k8j0J6M3q4M8
$$ 45 5 -6 -53 -52 -6 -12 -15 -10 -27 -9 16 3 19 -4 17 -3 -8 11 6 33 29 -6 -26 -20 36 -1 -41 25 -3 -13 3 46 -38 10
5524A0lk5M0l0J7K0r0N8k6jk8N0QJ0L8J4o3J1Pj2j2j9J6JM1Qj6J8j3L7o3K5p1
$$ 10 7 -18 22 -8 9 29 -61 -3 -29 -30 -58 -8 0 10 48 62 -1 10 17 5 -7 -26 -10 -9 32 40 24 42 29 66 3 28 -43
5557d3L2O5m6M0m7n7N2KK2N8k4p4L5j9M9m9k3J1j9K4J2pRNnKMj1P0q1O1o2M4l2
$$ -43 -11 54 8 48 1 -56 -4 -2 20 78 54 -20 15 -4 45 -4 -27 -16 -35 -11 1 -6 3 8 3 5 9 -2 68 -13 48 -14 30 -2
5591bJ0l2L8j9l3M3l9J7N6o0K8K5l6j3J9M7n4Qm4K9L2n4M0m4L5K7lK0l7K0rlJ7
$$ -2 8 -24 14 -5 -38 5 -34 -17 39 -21 7 32 -4 -17 2 49 -5 3 -41 -12 20 -34 6 -38 -3 24 21 41 4 24 15 12 29
5624B9m6L5k4j0L5j8J9j9JK1l0LJ6lqL9Lj21O4J1Rl3K7j1l0K6QNk8%J6M7Ql8m3
$$ 29 -17 18 -6 -16 19 1 20 1 2 23 -7 -4 12 9 1 40 43 -78 -14 -3 6 -27 0 -11 -41 -15 -7 -2 -30 -30 -14 33 41 3 -40
5659d0L1J4j5j4j3K7j2K5l1O7o4LK1L1j0rl1M8o6M2J0M4p0K1k5MK3m1N1M4j22
$$ -40 -9 5 -10 -24 -37 -10 -22 3 -28 39 -25 -22 -1 30 20 11 -20 28 -38 4 14 58 -12 9 -16 -12 11 -30 21 65 -57
5690e7P3K8m1k2L6Kl0L1Om9K3Nl0L2J1%j5J6Mqpl1M3j1J6j8K5j3L3l8n1M6n3L7
$$ -57 16 44 3 -19 17 19 -11 20 26 -23 0 5 -25 7 18 18 3 19 23 15 8 -23 20 9 25 7 32 19 52 14 -37 9 -44 -7
5724gN2k3qn0j1Q8m7O%k1J5QO2r5N1q3M4j5j7M7J3M3m2Op9N8M4j8lj05N4P6l5
$$ -7 45 22 14 -36 -47 41 -6 0 0 -21 -6 2 64 -31 20 -63 -19 -34 -51 -4 9 52 10 16 -63 -5 39 21 18 -87 -33 43 8
$$ [...]
8191b3
##END NTUPLES=NMR FID
##END=
