##TITLE=1H_Pr 6-2-DMF
 CDCl3, 8 sc, 
 29.5.2019
##JCAMPDX= 6.0         $$ Bruker NMR JCAMP-DX V2.0
##DATA TYPE= NMR FID
##DATA CLASS= NTUPLES
##ORIGIN= UXNMR, Bruker Analytische Messtechnik GmbH
##OWNER= root
$$ XWIN-NMR		Version 3.5
$$ Wed May 29 14:49:00 2019 Russian Standard Time (UT+4h)  she@DPX200
##.OBSERVE FREQUENCY= 200.13155
##.OBSERVE NUCLEUS= ^1H
##.DELAY= (6, 6)
##.ACQUISITION MODE= SIMULTANEOUS
##.ACQUISITION SCHEME= undefined
##.AVERAGES= 8
##.DIGITISER RES= 18
##SPECTROMETER/DATA SYSTEM= spect
##.PULSE SEQUENCE= zg30
##.SOLVENT NAME= CDCl3
##.SHIFT REFERENCE= (INTERNAL, CDCl3, 0, 15.7039)
##AUDIT TRAIL= $$ (NUMBER, WHEN, WHO, WHERE, WHAT)
$$ ##TITLE= Audit trail, XWIN-NMR		Version 3.5
$$ ##JCAMPDX= 5.01
$$ ##ORIGIN= Bruker BioSpin GmbH
$$ ##OWNER= she
$$ F:/spectra/data/she/nmr/H-F/1/audita.txt
$$ ##AUDIT TRAIL=  $$ (NUMBER, WHEN, WHO, WHERE, WHAT)
(   1,<2019-05-29 14:47:43.01 +0400>,<she>,<DPX200>,
      <created by zg, POWCHK disabled, PULCHK disabled
       configuration hash MD5:
       00 E9 B6 7A A2 85 ED C7 34 08 36 98 17 FE 4E 26
       data hash MD5: 16K
       03 35 79 CB 7E B9 D4 66 6D 53 FA 39 26 E9 A2 1A>)
$$ ##END=
$$ 
$$ hash MD5
$$ A9 FC 01 DB A4 AA 40 77 44 CA A3 FE 24 4E 0C 22
##$RELAX= 
##$RELAX= 
##$RELAX= 
##$RELAX= 
##$RELAX= 
##$RELAX= 
$$ Bruker specific parameters
$$ --------------------------
##$DU= <F:/spectra>
##$EXPNO= 1
##$NAME= <H-F>
##$PROCNO= 1
##$TYPE= <nmr>
##$USER= <she>
##$AMP= (0..31)
100 100 100 100 100 100 100 100 100 100 100 100 100 100 100 100 100 100 
100 100 100 100 100 100 100 100 100 100 100 100 100 100 
##$AQSEQ= 0
##$AQ_mod= 1
##$AUNM= <au_zg>
##$AUTOPOS= <>
##$BF1= 200.13
##$BF2= 200.13
##$BF3= 200.13
##$BF4= 200.13
##$BF5= 200.13
##$BF6= 200.13
##$BF7= 200.13
##$BF8= 200.13
##$BYTORDA= 1
##$CFDGTYP= 0
##$CFRGTYP= 5
##$CHEMSTR= <none>
##$CNST= (0..31)
1 1 145 1 1 1 1 1 1 1 1 1 1 1 1 1 1 1 1 1 1 1 1 1 1 1 1 1 1 1 1 1 
##$CPDPRG= <>
##$CPDPRG1= <>
##$CPDPRG2= <>
##$CPDPRG3= <>
##$CPDPRG4= <mlev>
##$CPDPRG5= <mlev>
##$CPDPRG6= <mlev>
##$CPDPRG7= <mlev>
##$CPDPRG8= <mlev>
##$CPDPRGB= <>
##$CPDPRGT= <>
##$D= (0..31)
0 1.2 0 0 0 0 0 0 0 0 0 0.03 0 0 0 0 0 0 0 0 0 0 0 0 0 0 0 0 0 0 0 0 
##$DATE= 1559126862
##$DBL= (0..7)
120 120 120 120 120 120 120 120 
##$DBP= (0..7)
150 150 150 150 150 150 150 150 
##$DBP07= 0
##$DBPNAM0= <>
##$DBPNAM1= <>
##$DBPNAM2= <>
##$DBPNAM3= <>
##$DBPNAM4= <>
##$DBPNAM5= <>
##$DBPNAM6= <>
##$DBPNAM7= <>
##$DBPOAL= (0..7)
0.5 0.5 0.5 0.5 0.5 0.5 0.5 0.5 
##$DBPOFFS= (0..7)
0 0 0 0 0 0 0 0 
##$DE= 6
##$DECBNUC= <off>
##$DECIM= 24
##$DECNUC= <off>
##$DECSTAT= 4
##$DIGMOD= 1
##$DIGTYP= 9
##$DL= (0..7)
0 120 120 120 120 120 120 120 
##$DP= (0..7)
150 150 150 150 150 150 150 150 
##$DP07= 0
##$DPNAME0= <>
##$DPNAME1= <>
##$DPNAME2= <>
##$DPNAME3= <>
##$DPNAME4= <>
##$DPNAME5= <>
##$DPNAME6= <>
##$DPNAME7= <>
##$DPOAL= (0..7)
0.5 0.5 0.5 0.5 0.5 0.5 0.5 0.5 
##$DPOFFS= (0..7)
0 0 0 0 0 0 0 0 
##$DQDMODE= 0
##$DR= 18
##$DS= 0
##$DSLIST= <SSSSSSSSSSSSSSS>
##$DSPFIRM= 0
$$ [...]
##$SUBNAM2= <"">
##$SUBNAM3= <"">
##$SUBNAM4= <"">
##$SUBNAM5= <"">
##$SUBNAM6= <"">
##$SUBNAM7= <"">
##$SUBNAM8= <"">
##$SUBNAM9= <"">
##$SW= 24.9336996594482
##$SWIBOX= (0..15)
0 0 2 0 0 0 0 0 0 0 0 0 0 0 0 0 
##$SW_h= 4990.01996007984
##$TD= 16384
##$TD0= 1
##$TE= 0
##$TE2= 300
##$TE3= 300
##$TEG= 300
##$TL= (0..7)
0 120 120 120 120 120 120 120 
##$TP= (0..7)
150 150 150 150 150 150 150 150 
##$TP07= 0
##$TPNAME0= <>
##$TPNAME1= <>
##$TPNAME2= <>
##$TPNAME3= <>
##$TPNAME4= <>
##$TPNAME5= <>
##$TPNAME6= <>
##$TPNAME7= <>
##$TPOAL= (0..7)
0.5 0.5 0.5 0.5 0.5 0.5 0.5 0.5 
##$TPOFFS= (0..7)
0 0 0 0 0 0 0 0 
##$TUNHIN= 0
##$TUNHOUT= 0
##$TUNXOUT= 0
##$USERA1= <user>
##$USERA2= <user>
##$USERA3= <user>
##$USERA4= <user>
##$USERA5= <user>
##$V9= 5
##$VALIST= <valist>
##$VCLIST= <CCCCCCCCCCCCCCC>
##$VD= 0
##$VDLIST= <DDDDDDDDDDDDDDD>
##$VPLIST= <PPPPPPPPPPPPPPP>
##$VTLIST= <TTTTTTTTTTTTTTT>
##$WBST= 1024
##$WBSW= 4
##$XGAIN= (0..3)
0 0 0 0 
##$XL= 0
##$YL= 0
##$YMAX_a= 527843
##$YMIN_a= -715291
##$ZGOPTNS= <>
##$ZL1= 120
##$ZL2= 120
##$ZL3= 120
##$ZL4= 120
##$ABSF1= 10
##$ABSF2= 0
##$ABSG= 5
##$ABSL= 3
##$ALPHA= 0
##$AQORDER= 0
##$ASSFAC= 0
##$ASSFACI= 0
##$ASSFACX= 0
##$ASSWID= 0
##$AUNMP= <proc_1d>
##$AZFE= 0.1
##$AZFW= 0.1
##$BCFW= 1
##$BC_mod= 2
##$BYTORDP= 1
##$COROFFS= 0
##$CY= 11.3945322036743
##$DATMOD= 1
##$DC= 2
##$DFILT= <>
##$DTYPP= 0
##$F1P= 18.9103706918063
##$F2P= -1.10871071338519
##$FCOR= 0.5
##$FTSIZE= 0
##$FT_mod= 4
##$GAMMA= 1
##$GB= 0.15
##$INTBC= 1
##$INTSCL= 1
##$ISEN= 128
##$LB= 0.24
##$LEV0= 0
##$LPBIN= 0
##$MAXI= 10000
##$MC2= 0
##$MEAN= 0
##$ME_mod= 0
##$MI= 1.114404
##$NCOEF= 0
##$NC_proc= 0
##$NLEV= 6
##$NOISF1= 3.799351
##$NOISF2= 2.8
##$NSP= 1
##$NTH_PI= 0
##$NZP= 0
##$OFFSET= 15.70392
##$PC= 1
##$PHC0= -8501.12
##$PHC1= 18.80025
##$PH_mod= 1
##$PKNL= yes
##$PPARMOD= 0
##$PSCAL= 0
##$PSIGN= 0
##$REVERSE= no
##$SF= 200.130013532006
##$SI= 16384
##$SIGF1= 3
##$SIGF2= 2
##$SINO= 400
##$SIOLD= 16384
##$SREGLST= <1H.CDCl3>
##$SSB= 0
##$STSI= 0
##$STSR= 0
##$SW_p= 3612.71676300578
##$SYMM= 0
##$S_DEV= 0
##$TDeff= 0
##$TDoff= 0
##$TI= <>
##$TILT= no
##$TM1= 0
##$TM2= 0
##$TOPLEV= 0
##$USERP1= <user>
##$USERP2= <user>
##$USERP3= <user>
##$USERP4= <user>
##$USERP5= <user>
##$WDW= 1
##$XDIM= 8192
##$YMAX_p= 0
##$YMIN_p= 0
$$ End of Bruker specific parameters
$$ ---------------------------------
##NTUPLES= NMR FID
##VAR_NAME=  TIME,          FID/REAL,        FID/IMAG
##SYMBOL=    X,             R,               I
##VAR_TYPE=  INDEPENDENT,   DEPENDENT,       DEPENDENT
##VAR_FORM=  AFFN,          ASDF,            ASDF
##VAR_DIM=   8192,          8192,            8192
##UNITS=     SECONDS,       ARBITRARY UNITS, ARBITRARY UNITS
##FACTOR=    0.0002004,     1,               1
##FIRST=     0,             0,               0
##LAST=      1.6414764,     0,               0
##MIN=       0,             -715291,         0
##MAX=       1.6414764,     527843,          0
$$ Real data points
##PAGE= N=1
##DATA TABLE= (X++(R..R)), XYDATA
0@%%%qJ6j6J6k4M0m8O4q8J04j28J60j92K31k76L25l84M52n27O12p10Q17r35J072
$$ 0 0 0 0 -8 8 -8 8 -16 24 -24 40 -48 56 -72 88 -104 127 -149 176 -208 244 -283 329 -381 436 -499 573
27E73j222J383j565J770j993K236k505K796l116L474l865M289m757N272n836O461
$$ 573 -649 734 -831 939 -1054 1182 -1323 1473 -1643 1831 -2034 2255 -2502 2770 -3066 3395
43C395p154P922q782R749j0842J2094j3538J5223j7229J9665k2686K6552l1718
$$ 3395 -3759 4163 -4619 5130 -5712 6382 -7156 8067 -9162 10503 -12183 14369 -17349
56a7349L9007n0154O9553j12894L77424n9350n46803L57118L01407J69884j68980
$$ -17349 21658 -28496 41057 -71837 305587 246237 -300566 56552 357959 527843 358863
67C58863l91201j51952M17012J81076j73519j11858q6961j55621K21392K48945
$$ 358863 -32338 -184290 232722 413798 240279 128421 41460 -114161 107231 356176
77C56176j94111k60619J7307M3390J72250J61398k97992l42351K68341L20953
$$ 356176 162065 -98554 -81247 -37857 134393 295791 -2201 -344552 -76211 244742
87B44742j33833k13248r4354r507K61607J63102l13252k13809K20669J20167l8707
$$ 244742 110909 -102339 -196693 -206200 55407 218509 -94743 -308552 -87883 32284 -6423
98f423N1207j14791j94549J59944J99137q7969n2111k5739j51838J19902L08948
$$ -6423 44784 -70007 -264556 -104612 94525 6556 -45555 -71294 -223132 -103230 205718
109B05718j07389k90142L0620J20418P4448J08376j48678k62913J70788K79590
$$ 205718 98329 -191813 -161193 -40775 33673 142049 -6629 -269542 -98754 180836
119A80836j19856j40180M6717m0073M1853J72038j07278j91327J17577Q7426p8968
$$ 180836 60980 -79200 -32483 -72556 -30703 141335 34057 -157270 -39693 47733 -31235
130c1235P0970J7895j83158M4630J92712p1072q4636N1811q7710j5425K15981
$$ -31235 39735 57630 -125528 -80898 111814 40742 -43894 7917 -79793 -95218 120763
141A20763k8514k30407N8928J29661n6683L4690K6666j63337K4230J88831q1716
$$ 120763 92249 -138158 -79230 50431 -6252 28438 55104 -108233 -84003 104828 23112
152B3112j16834J07734p661p8982J15526J0248j43887Q0343R5839j35542J629
$$ 23112 -93722 14012 6351 -72631 42895 53143 -90744 -10401 85438 -50104 -48475
163d8475J21689r8176n0377J39394l7699r9130J02672J0934r4567R6649L0442
$$ -48475 73214 -24962 -75339 64055 26356 -72774 29898 40832 -53735 42914 73356
174G3356j61703N2115J50112j03963o9128R2749l8790j3580J35674p3421j63237
$$ 73356 -88347 -36232 113880 9917 -59211 33538 -5252 -18832 116842 43421 -119816
185a19816J25177J11702j06814o417K2699j06417O5623J60109j08507j14725Q7514
$$ -119816 5361 117063 10249 3832 26531 -79886 -14263 145846 37339 -77386 10128
196A0128j0399k7080J40138m0509k08220N9131J44515m8924R95J2962j53330J6213
$$ 10128 -271 -27351 112787 72278 -135942 -76811 67704 18780 19775 32737 -120593 -104380
208a04380K11959l8514j52736L8056O01l3438J36293P574j91965K8515J38429
$$ -104380 107579 69065 -83671 -45615 -45014 -78452 57841 65415 -126550 -98035 40394
219D0394n8784j1868O6315j14252m0506J72504j0471j38864N3359L2421o0344
$$ 40394 -18390 -30258 36057 -78195 -118701 53803 43332 -95532 -42173 -9752 -70096
230g0096R8535L9752j71826O805J59789l8822n2144N1756q9176m0054J88737K0895
$$ -70096 28439 68191 -103635 -96830 62959 24137 -28007 23749 -65427 -105481 83256 104151
242A04151j76834J1363O9573l5055Q0672M7746j83319m1933J72995N740o8395
$$ 104151 -72683 -61320 8253 -26802 53870 101616 -81703 -123636 49359 55099 -13296
253a3296L5940p2532o3896J66342N3671j66680j1089P4177n0269M7581Q1294j41841
$$ -13296 22644 -49888 -113784 52558 106229 -60451 -71540 2637 -47632 -51 81243 -60598
265f0598p2501J53230K3208q1093L8510l4792p9203J30955P4507j56701k9751
$$ -60598 -133099 20131 43339 -37754 756 -34036 -113239 17716 92223 -64478 -94229
276i4229R5422l1652K0300Q3987j17026q5435J52955M5136r9446K7914q34q6152
$$ -94229 1193 -30459 -10159 73828 -43198 -128633 24322 69458 -29988 -2074 -2908 -89060
288h9060R8186J00380j32516n1800R7352k4408n529R2712q5156j07921J29919
$$ -89060 9126 109506 -23010 -74810 22542 -1866 -7395 85317 161 -107760 22159
299B2159O3320j09521J3152L1434q0438O4072J03612j23353o9315J17249j176
$$ 22159 85479 -24042 -10890 20544 -59894 4178 107790 -15563 -84878 32371 31195
310C1195m8203O5000n2203r7958J21805P6682j25654j3717N9855n9765L7859J03717
$$ 31195 -17008 47992 -4211 -102169 19636 96318 -29336 -43053 16802 -42963 -5104 98613
322I8613j13186r5449J21143L4858o0882M9006k8169j05817R9337J06646j08484
$$ 98613 -14573 -110022 11121 45979 -14903 34103 5934 -99883 -546 106100 -2384
333b384m3104N9178m8047J9620J16063q3357j20455R8803N7080o1133M1388l638
$$ -2384 -45488 13690 -34357 -14737 101326 17969 -102486 -3683 53397 -7736 33652 30014
345C0014j16798O1469J26092q4182o5627N8930l3067m862J13652m9716j29903
$$ 30014 -86784 -25315 100777 16595 -49032 9898 -23169 -28031 85621 35905 -93998
356i3998P8899P3266o7343K2185K0008j06293L3602J30724p0044q4852P0231m546
$$ -93998 -15099 58167 -9176 13009 33017 -73276 -39674 91050 21006 -63846 6385 1839
368A839k9892R1777k5199j26043O7673R3271p2853p725L9997q1301J6680J30445
$$ 1839 -28053 63724 38525 -87518 -19845 73426 573 -7152 32845 -48456 -31776 98669
380I8669n9970j07452P1358K5492m3790P0495m992j29500M7283J14758o1002l5191
$$ 98669 38699 -68753 2605 28097 -15693 54802 49810 -79690 -32407 82351 21349 -13842
392a3842M1898o7659l640J32809l5012j25285N1889M4478m5263O0103J6365j33458
$$ -13842 28056 -39603 -43243 89566 54554 -70731 -18842 25636 -19627 40476 56841 -76617
404g6617J5843J29831l8655n5466L9346n2390k3480J27316n839j32511K9839O2711
$$ -76617 -60774 69057 30402 -25064 14282 -38108 -61588 65728 59889 -72622 -42783 19928
416A9928m0404M3295L1765j23566q035J36839j9874p4991L6977k6145l5557J11012
$$ 19928 -20476 22819 54584 -68982 -77017 59822 39948 -35043 1934 -24211 -59768 51244
428E1244J5860j33243J2708Q2007l5218J2500M0063j01506k2633J33643o800r4092
$$ 51244 67104 -66139 -53431 28576 -6642 5858 45921 -55585 -78218 55425 48625 -45467
440d5467L4220M427m3420Q6927L1180j28648j284R9598k7468j6131M3179p4911
$$ -45467 -11247 -6820 -50240 36687 67867 -60781 -62065 37533 10065 -6066 37113 -37798
452c7798l5202J25792R802j04949K3578K7799m4934O7055M7388j21852k2680J10689
$$ -37798 -73000 52792 62594 -42355 -18777 9022 -35912 31143 78531 -43321 -66001 44688
464D4688j0907l4682M4017n6293n2139J16924L5889j09319K948M1255m1661M9567
$$ 44688 33781 -901 43116 -13177 -65316 51608 87497 -21822 -18874 22381 -19280 30287
476C0287N9753j12889m6690J12681N934n2866L7723l7100o4704J00676N3659j11974
$$ 30287 90040 -22849 -69539 43142 49076 -3790 33933 -3167 -67871 32805 86464 -25510
488b5510j6351N7946l3872K3353O1323r4465n9257J10448J9885p0362K6852r723
$$ -25510 -41861 16085 -17787 5566 66889 -27576 -86833 23615 43500 -26862 -10 -9733
500i733o1871Q1171O1343j10659k9553P9623j7953o230N5221o9113o0422J08462
$$ -9733 -71604 9567 70910 -39749 -69302 10321 -7632 -13862 41359 -27754 -88176 20286
512B0286L4341q5590J2142J9225n0855O0191O6624j03796m4147R0874K45k6413
$$ 20286 54627 -30963 -18821 404 -50451 9740 76364 -27432 -71579 19295 19540 -6873
524f873M8497n0296p2581R7817N9463q6593j2439K6007m3478M9153Q0095r6160
$$ -6873 41624 -8672 -81253 16564 76027 -10566 -23005 3002 -40476 8677 88772 -7388
536g388p5148Q9118K8458l1257L5429m2931q2496R2774Q5150r0714m1946L9880
$$ -7388 -82536 6582 35040 3783 39212 -3719 -86215 6559 91709 995 -40951 -1071
548a071k5001L1801P8095q2612q6868Q9212M6759m4418K4280k0238q2890P4890
$$ -1071 -26072 5729 83824 1212 -85656 3556 50315 5897 30177 9939 -72951 1939
560A939J00597q2291o1611M5420r192J8948P8026p3467j05346Q7380P6875n4720
$$ 1939 102536 20245 -41366 4054 -5138 13810 91836 18369 -86977 403 77278 22558
572B2558q827r365o3517O5346R7435r0306p7510O4446J0585j2574N9700m3967
$$ 22558 13731 4366 -59151 6195 103630 13324 -64186 260 10845 -1729 57971 14004
584A4004r9664O6035P7789n4891j2857P364o8485L6611J10946o1834j00461M4678
$$ 14004 -85660 -19625 58164 3273 -9584 -2220 -70705 -34094 76852 15018 -85443 -40765
596d0765L1265m823N2305m3318j11580O7808J10614n8421n3315J9660k9843K8815
$$ -40765 -9500 -14323 37982 -5336 -116916 -49108 61506 3085 -50230 -30570 -60413 -31598
608c1598R1246o0075r7855O1421M7288l3313L2888n807r4284L7360J03492m1412
$$ -31598 59648 -427 -98282 -36861 10427 -22886 10002 4195 -90089 -52729 50763 9351
620I351m9965K2958l3739J1074J07732l4036j25855L8102Q3245j3274M690k2426
$$ 9351 -40614 -17656 -51395 -40321 67411 33375 -92480 -54378 28867 15593 20283 -2143
632b143q5819N4027J24046o1047r5433M3091K1597m374N9265l0430r8194N1018
$$ -2143 -87962 -33935 90111 29064 -66369 -23278 -1681 -6055 53210 22780 -75414 -24396
644b4396P6643m4487k402K3307p6382J337J16989j0600q8142N823M025R660R3784
$$ -24396 52247 7760 5358 28665 -47717 -46380 70609 60009 -28133 -22310 -18285 -8625 85159
657H5159k1272j50263J9015J33385l663n2337j6626m9826L2561J17023l8233j14842
$$ 85159 63887 -86376 -67361 66024 62361 10024 -6602 -56428 -23867 93156 54923 -59919
669e9919L4188M7678k6549M0496J7575r6317j0326Q3923j164r565J5203q3307
$$ -59919 -25731 21947 -4602 35894 53469 -42848 -53174 30749 29585 20020 35223 -48084
681d8084l2348J39745M3638j24294m3042M3414K9783O2699p912j34262n426J39648
$$ -48084 -80432 59313 102951 -21343 -64385 -20971 8812 71511 63599 -70663 -76089 63559
693F3559P937p5093N897j3551j8937Q0079K2030q4357p37L2926l5169M2019O9650
$$ 63559 71496 -3597 2300 -11251 -30188 49891 71921 -12436 -13173 19753 -15416 26603 96253
706I6253q9956q0781Q1604N6763j8836p353o3855m4152J19134O9613j19944n7203
$$ 96253 6297 -74484 7120 63883 45047 37694 -26161 -70313 48821 118434 -1510 -58713
718e8713O4504J3936J2148K8048p4444m6493Q7196K3552n6925K4390j059p0523
$$ -58713 5791 19727 31875 59923 -14521 -61014 26182 49734 -7191 17199 16140 -54383
730e4383M3252Q1668n3132m9674K0845j5207K8396P6887o7572j02988P2521P9321
$$ -54383 -11131 70537 17405 -32269 -11424 -26631 1765 78652 11080 -91908 -19387 59934
742E9934m1647j7939r982m3755N6263P3967p5460n5231O1913L607k4385M8984
$$ 59934 18287 348 -9634 -53389 2874 76841 1381 -53850 8063 11670 -12715 36269
754C6269j5973o9673M2616M4187m4072J1580K3455o6308O621Q8468k9252o3533
$$ 36269 20296 -49377 -6761 37426 -6646 4934 28389 -37919 -31298 57170 27918 -35615
766c5615L2624O567j6209N2718j3794q2993L9719O8774m8246k1689L3169l3375
$$ -35615 -2991 3576 -12633 40085 26291 -56702 -16983 51791 3545 -18144 15025 -18350
778a8350k40O4312l5315n8442N5348J8700m9579K8656K0118n9189J8941N5423
$$ -18350 -18590 45722 10407 -48035 7313 26013 -23566 5090 25208 -33981 -15040 40383
790D0383m6212j8718M6786k9928k1310O4787j6354o9166M3497L8670m4060R886
$$ 40383 -5829 -24547 22239 -7689 -28999 35788 19434 -49732 -6235 32435 -11625 -1739
802a739J6120n3766K4221P0282n4749n2460N5636R688k5144L5777j9849n9173
$$ -1739 14381 -39385 -15164 55118 369 -52091 3545 13233 -11911 23866 4017 -55156
814e5156N5979N0039o3239j1120L8587l5080N049O3243m1273n4979N2417J6793
$$ -55156 823 50862 -12377 -23497 15090 -19990 -14941 48302 7029 -47950 4467 21260
826B1260l1875L6491m120p1507L7542P1779m5447l1054K7269k6117Q136P2927
$$ 21260 -10615 25876 21756 -49751 -12209 59570 14123 -16931 10338 -15779 -7643 65284
838F5284l6374p9663M4545M3631k8963J6808p51o8687K5481Q0773l7323m5547
$$ 65284 28910 -50753 -6208 37423 8460 25268 24517 -44170 -18689 62084 24761 -20786
850b0786K7641j7359q124O9748j4713q4319K5705M8482k6572J2261J2843o9806
$$ -20786 6855 -10504 -18628 51120 36407 -47912 -22207 26275 -297 11964 24807 -44999
862d4999L389Q5289j8800n6920K2056n664j6327O2409r7q6628J5409O2422k3622
$$ -44999 -41610 43679 24879 -32041 -9985 -15649 -31976 30433 30336 -56292 -40883 21539 -2083
875b083m057K0451n4932p453Q2987r034o3504K3478R445k7285M9553K1413p8264
$$ -2083 -6140 14311 -40621 -48074 34913 25879 -37625 -14147 -4702 -31987 17566 38979 -39285
888c9285j999O1291j7157q057L1260m9134k9625P9711J3542o4900J1106J6159
$$ -39285 -41284 20007 2850 -5207 26053 -23081 -52706 27005 40547 -24353 -13247 2912
900B912k8894M1685L2770p5147j7204O7270q903k3472L0510l2113l6683O8532
$$ 2912 -25982 15703 48473 -26674 -43878 23392 14489 -8983 21527 -10586 -47269 21263
912B1263K2630o6953M581K6575l0956K7177M2225o6276l3164O8131O939l1007
$$ 21263 43893 -23060 -18479 8096 -22860 4317 46542 -19734 -52898 15233 22172 -8835
924h835K3510k2662m0885O2883L7415o8798j1682L6954k0606J3787M2051n5160
$$ -8835 14675 -7987 -48872 14011 51426 -17372 -29054 7900 -12706 1081 43132 -12028
936a2028l9892O6730J4835m1596K0115m523m4026M6213M4675o1419k0878M3649
$$ -12028 -51920 14810 29645 -11951 8164 3641 -40385 5828 50503 -10916 -31794 11855
948A1855j4860l79M3143m1812m8696O1303K8014m6746Q267O136m1570L6860N2857
$$ 11855 -3005 -3384 39759 -2053 -50749 10554 38568 -8178 89 6225 -35345 1515 54372
961E4372n9046l5079M7741k410j0312L9983l2165n6569N5175M2205m7135l767
$$ 54372 -4674 -39753 7988 5578 -4734 35249 3084 -53485 1690 43895 -3240 -7007
973g007J3411l7700K7452O0198n3694m9691M7848J1879j7705L2903k2263o0482
$$ -7007 6404 -31296 -3844 56354 2660 -47031 817 12696 -5009 27894 5631 -54851
985e4851M8563N4817m7751j8789K0150k8829J7032O0653m4659n9233M6855K4060
$$ -54851 -6288 48529 778 -18011 2139 -26690 -9658 50995 6336 -52897 -6042 18018
997A8018k4565K4676r465o0712L6733O1641m3112k9073K6496k0432K775N8040
$$ 18018 -6547 18129 8664 -52048 -15315 46326 3214 -25859 637 -19795 -17020 41020
1009D1020k9362o2512M0270L3455k9297J5974M363n6211K3434O5791l6037l8892
$$ 41020 11658 -50854 -10584 22871 -6426 9548 13911 -42300 -18866 46925 10888 -28004
1021b8004K9993q776o911N3292j7984o8635L2527M6406k8571L012Q932n0681J4233
$$ -28004 1989 -6787 -13698 39594 21610 -47025 -14498 31908 3337 6349 15281 -35400 -21167
1034b1167P1523k8512n2537K7249M443j2311M6489q240p2061K3115N6709k6059
$$ -21167 50356 21844 -30693 -3444 999 -11312 35177 26937 -45124 -22009 34700 8641
1046H641j1094J5415m1540L086P0241k0764o1157K6525J7307j9196L5571J700
$$ 8641 -2453 12962 -28578 -25492 44749 23985 -37172 -10647 6660 -12536 23035 24735
1058B4735o8828J5994O4788k4765k4544K0630k8608o541O6199j0584o6568K1253
$$ 24735 -44093 -28099 36689 11924 -12620 8010 -20598 -27139 39060 28476 -38092 -16839
1070a6839K9128k1345K4713J1799o4880L421O8361j6496l4230K1651j9294j6294
$$ -16839 12289 -9056 15657 27456 -37424 -34003 34358 17862 -16368 5283 -14011 -30305
1082c0305O1095L574o9242J2345L8634k0829J2461J8453n6746p040O9484q349
$$ -30305 30790 34364 -34878 -22533 16101 -4728 7733 26186 -30560 -37600 31884 23535
1094B3535m5033J9697n027k1000N1764J1502p0223L966M9576j7007j740K1479
$$ 23535 -21498 -1801 -6828 -27828 23936 35438 -34785 -30819 18757 1750 10 21489
1106B1489m5985j5040O9039J059n2920J5005Q829k2950M0463J9123o6449n134
$$ 21489 -24496 -39536 29503 30562 -22358 -7353 1476 -21474 18989 38112 -28337 -33471
1118c3471N6346j2747j5144K4569l2375k3474O2701R184n7087J0431K0855k4771
$$ -33471 22875 10128 -5016 19553 -12822 -36296 26405 35589 -21498 -11067 9788 -14983
1130a4983K6281K6724n8436j3161N8920p918k7226K4910j8586k9557N4594J7262
$$ -14983 11298 38022 -20414 -33575 25345 17427 -9799 15111 -3475 -33032 21562 38824
1142C8824o0140L981L2478k3158J2453L0979n0110k1194O0637J189l7691K1334
$$ 38824 -21316 -17335 15143 -8015 4438 35417 -14693 -35887 24750 25939 -11752 9582
1154I582n554l1850M7108K6250o1587o747M3486j5571p23K9677m2342k8713O3044
$$ 9582 4028 -27822 19286 45536 -16051 -22798 20688 5117 4394 34071 -8271 -36984 26060
1167B6060J1964m7888R987O814k7417L7495L1333o1889j8382N0885n535j3178
$$ 26060 38024 -9864 123 6937 -20480 17015 48348 -13541 -31923 18962 13427 249
1179B49K6688l2625l6025N7077K4398n0967o64J4508k6772K7263L9139n5214l2442
$$ 249 26937 -5688 -41713 15364 39762 -11205 -11869 2639 -24133 3130 42269 -12945 -45387
1192d5387M9848O345j8463K3414k3659m1990N1868L6741n0957j1671K3050k1298
$$ -45387 4461 10806 -7657 15757 -7902 -49892 1976 38717 -12240 -23911 -861 -22159
1204b2159J5799M3401m3943m0187M6477J4070k3054K3428j0613m8777L7479N0055
$$ -22159 -6360 37041 -6902 -47089 -612 13458 -9596 13832 3219 -45558 -8079 41976
1216D1976m0888k0949K1638j8926J0823N1945l5464n5375M1606K9921k4172J2241
$$ 41976 1088 -19861 1777 -17149 -6326 45619 10155 -45220 -3614 26307 2135 14376
1228A4376m672m6886L1507N4325m1001l0083L0812j1785o510M6511j8001n4629
$$ 14376 9704 -37182 -5675 48650 7649 -22434 8378 -3407 -9917 36594 18593 -36036
1240c6036L0667L0201k6832J3051R474n1220J1070O0982k4222l8257K2491n534
$$ -36036 -5369 24832 -2000 11051 20525 -30695 -19625 41357 17135 -21122 1369 -4165
1252d165r743M5384j0733o0841K5595M2553l0073l483K0308l6106o56N0643k0068
$$ -4165 -13908 31476 20743 -40098 -14503 28050 -2023 -5506 14802 -21304 -21960 28683 8615
1265H615l5476L1259j548k9299L7663J4488n3355M632L8342k0464m33K2566l9250
$$ 8615 -26861 4398 2850 -26449 11214 25702 -27653 -23021 15321 -5143 -5576 16990 -22260
1278b2260j2706O0816n083n2199J8835J9074k0468K1739Q089m8995J3490M9498
$$ -22260 -34966 25850 20767 -31432 -12597 6477 -13991 7748 15837 -33158 -19668 29830
1290B9830l0888k4595L5395j0330k1880L6874j490m0063K5489J8148l5592J6652
$$ 29830 -1058 -25653 9742 -588 -22468 14406 12916 -27147 -1658 16490 -19102 -2450
1302b450K9063m5312r664N1615j0301k9633K0101r433j4985M6524o24o2459J7950
$$ -2450 26613 -18699 -28363 23252 12951 -16682 3419 -6014 -20999 25525 24901 -37558 -19608
1315a9608M8762k5779j1328J7808k8073P60M9365k1276m1651L4583Q817l3249
$$ -19608 29154 3375 -7953 9855 -18218 -17458 31907 10631 -31020 3563 12380 -20869
1327b0869K7619J9525m7205P21L7126j7271j049K3870l9976j9484O4944Q207n6846
$$ -20869 6750 26275 -20930 -20209 16917 -354 -1403 22467 -17509 -36993 27951 36158 -20688
1340b0688M203K0073j0037K7703P915o0633J833O1273j3601l0762K1360j3389
$$ -20688 -16485 3588 -6449 21254 29169 -31464 -29631 31642 18041 -12721 8639 -4750
1352d750j9838M5146Q035m7432R264J9840k5870K1422L2560n1199k6772N0943
$$ -4750 -24588 20558 28593 -18839 -9575 10265 -15605 5817 38377 -12822 -39594 11349
1364A1349R241k2030J1213k2149k5312N5107K4954o0827j0243L4743j0896O366
$$ 11349 20590 -1440 9773 -12376 -37688 17419 42373 -18454 -28697 6046 -4850 1516
1376A516K5176m0176k4314N0250O019l1833K0565k005l8842L1365L8516l9397
$$ 1516 26692 -13484 -37798 12452 18471 -13362 7203 5198 -33644 -2279 36237 -3160
1388c160j5945K3370j6836P243M3336l2998m7975M2093K6542k7487R045q68l8031
$$ -3160 -19105 4265 -12571 -5328 38008 5010 -42965 -872 25670 -1817 7228 6360 -31671
1401c1671K8425M4960l9957k4916L2183r620r450L9109j5861m4815L0829K4282
$$ -31671 -3246 41714 1757 -23159 9024 -596 -10046 29063 13202 -31613 -784 23498
1413B3498l0101J1435J3856m2934P810M9973k3854l0464K5986o348j4619L9215
$$ 23498 -6603 4832 18688 -24246 -16436 33537 9683 -20781 5205 -1143 -15762 23453
1425B3453n163n0793K2831L4477k9396n08K1032l1788j768M5125j9997l2690L2448
$$ 23453 18290 -32503 -9672 24805 -4591 -5099 15933 -15855 -17623 27502 7505 -25185 7263
1438G263K376k9484K8878J1522m2490J1920L1957k8274l436L0239k7541j5403
$$ 7263 9639 -19845 9033 20555 -21935 -10015 21942 -6332 -9768 20471 -7070 -22473
1450b2473M4428o828l7706K5304J1055k8610K1489J5698m2589O606M1694k6087
$$ -22473 21955 15127 -22579 2725 13780 -14830 6659 22357 -20232 -13626 28068 1981
1462A981j9780L0966j2047j8337L6242m966m0955K6810K3095l3953O365K2999
$$ 1981 -17799 13167 1120 -17217 19025 14059 -26896 -86 23009 -10944 -4579 18420
1474A8420l2548m1M1391k3464k7365L2833j408k4741L0262K737m3795J9567L3582
$$ 18420 -14128 -14169 27222 3758 -23607 9226 7818 -16923 13339 16076 -27719 -8152 25430
1487B5430l0558n294K3522k6389l784M4985j8029l9975K9625J4113k4636K0136
$$ 25430 -5128 -10422 13100 -13289 -17073 27912 9883 -30092 -467 13646 -10990 9146
1499I146N984m3080J5765M2742k8682j8524K6153j5576j1074M1884q615m4242
$$ 9146 15130 -27950 -12185 30557 1875 -16649 9504 -6072 -17146 24738 16123 -28119
1511b8119K2999K1010k4237J5245J4489m5473L121M9775j5095k7616J8776j0674
$$ -28119 -5120 15890 -8347 6898 21387 -24086 -20965 28810 13715 -13901 4875 -5799
1523e799j2009M4264q57n3768J2296L4045j7239M377J3408m0557l225N3105q291
$$ -5799 -17808 26456 25599 -28169 -15873 18172 933 5310 18718 -21839 -25064 28041 19750
1536A9750l6590J6417j250j6917L7932R847n3725J865L8231j2013j243J6322l6905
$$ 19750 -16840 -423 -1673 -18590 19342 29189 -24536 -22671 15560 3547 2304 18626 -18279
1549a8279j3328N5096K694m2901R167P432j7127L1685J5610n2712n392M4359q583
$$ -18279 -31607 23489 26183 -16718 -7551 -119 -17246 14439 30049 -22663 -28055 16304 7721
1562G721j1344J9520k6307k0918M8874J1817m3035M792J3128j9684K4716K5012
$$ 7721 -3623 15897 -10410 -31328 17546 29363 -13672 -8880 4248 -15436 9280 34292
1574C4292m8439j6976M5300j78j7035J7801k0825k5789M6128K0235m6272l191
$$ 34292 -14147 -31123 14177 13999 -3036 14765 -6060 -31849 14279 34514 -11758 -14949
1586a4949K0581j5930J5195K7758m2374k4415M4996P127k3148J4404j1330k9424
$$ -14949 5632 -10298 4897 32655 -9719 -34134 10862 17989 -5159 9245 -2085 -31509
1598c1509L8509K8701m4862j2912K6089j0949O065K8653l4200l0670M3194J5396
$$ -31509 7000 35701 -9161 -22073 4016 -6933 -868 27785 -6415 -37085 6109 21505
1610B1505k8643Q775p80k8937K8989L3652m0931j8563K9763o469l209K9167k4033
$$ 21505 -7138 1637 857 -28080 909 34561 -6370 -24933 4830 -1639 -4848 24319 286
1623B86l6196L7745K3606l0346L552O657k8018K0218L7582l4656k6524L1033L85
$$ 286 -35910 1835 25441 -4905 -1353 5304 -22714 -2496 35086 430 -26094 4939 5324
1636E324j0837K7144j4550l9860L1332L0185l0999l371J3596k5519J0394L9928
$$ 5324 -5513 21631 7081 -32779 -1447 28738 -2261 -5632 7964 -17555 -7161 32767
1648C2767k8294l3278L0192P403j5980K2212o455m0639K5375L6157l0267j2181
$$ 32767 4473 -28805 1387 8790 -7190 15022 8567 -32072 -6697 29460 -807 -12988
1660a2988J9107j8900K085L9083k1578l7869K8721J6417k1414J5338K123l7732
$$ -12988 6119 -12781 -10696 28387 6809 -31060 -2339 14078 -7336 8002 10125 -27607
1672b7607J7392L9813k7145j9590K2879j1085o035L6437j2845m1302K4834K3256
$$ -27607 -10215 29598 2453 -17137 5742 -5343 -11378 25059 12214 -29088 -4254 19002
1684A9002k2865P434R536l4156Q339M2741k1954k7007K3297l776j2596L2266l822
$$ 19002 -3863 3571 13107 -21049 -12710 30031 8077 -18930 4367 591 -12005 20261 16439
1697A6439m3199J7188L0429k1830j27J4253l0675N74M4366j4201l4033J9634M555
$$ 16439 -26760 -9572 20857 -973 -1100 13153 -17522 -16948 27418 13217 -20816 -1182 3373
1710C373j5305K7568K773m5012J0732L7124j8125r566J6318k3553o365M3865o853
$$ 3373 -11932 15636 18409 -26603 -15871 21253 3128 -6438 9880 -13673 -20038 23827 16974
1723A6974l9887J6760J3937j7752K0052R411m2034L641M1220j5164j7172J8420
$$ 16974 -22913 -6153 7784 -9968 10084 19495 -22539 -18898 22322 7158 -10014 8406
1735H406j5617j2690M0007J5m2109J2813K0730j8593J1729J5371l7594l848M2537
$$ 8406 -7211 -19901 20106 20121 -21988 -9175 11555 -7038 4691 20062 -17532 -21380 21157
1748B1157r971k2778J8061p963j8149L4937Q612m2547N444K6242j6968M397J9855
$$ 21157 11186 -11592 6469 -1494 -19643 15294 23906 -18641 -13197 13045 -3923 474 20329
1761B0329l2328j2365M1732j523k8484J5284j050k0851K9752J5345m1689j874
$$ 20329 -11999 -24364 17368 15845 -12639 2645 1595 -19256 10496 25841 -15848 -17722
1773a7722L0954j2926l806K1145k5654j8061M0207N782l3232R943Q445k0721K0943
$$ -17722 13232 306 -3500 17645 -8009 -26070 14137 19919 -13313 -3370 5075 -15646 5297
1786E297J9986l8263q266L5012q729j2319K0866j5792k1980L5339J0848l4848
$$ 5297 25283 -12980 -21246 13766 5037 -7282 13584 -2208 -24188 11151 21999 -12849
1798a2849O198J5982k0296J1371K3799l2806j4130L5290k770j8544J8465p901
$$ -12849 -6651 9331 -10965 406 24205 -8601 -22731 12559 9789 -8755 9710 1809
1810A809k5458L0702J7550l6027r03K1894j6764M278K5668k8000k1180L5523N118
$$ 1809 -23649 7053 24603 -11424 -12327 9567 -7197 -2919 22749 -5251 -26431 9092 14210
1823A4210k3520J4223j944k5691K5048K4171l4447r609K4962j1045j306K6272
$$ 14210 -9310 4913 2969 -22722 2326 26497 -7950 -17559 7403 -3642 -4948 21324
1835B1324k2842k7456L3873J4505k6021O914M309k4974K0390K9881l2672j8980
$$ 21324 -1518 -28974 4899 19404 -6617 297 4606 -20368 22 29903 -2769 -21749
1847b1749K7523k629p176K2954j6241l1316L0952K1821k8138K07J0358k2305J1668
$$ -21749 5774 3145 -4031 18923 2682 -28634 2318 24139 -3999 -3792 6566 -15739 -4071
1860d071L2475k6032k5031K6292K149j1847K2053q406l4966K2228K8603k4100
$$ -4071 28404 2372 -22659 3633 5782 -6065 15988 7582 -27384 -5156 23447 -653
1872f53o326J2421k0429M674L6174j9845l1709K3166J0019j5084J7195n09l4663
$$ -653 -6979 5442 -14987 -10313 25861 6016 -25693 -2527 7492 -7592 9603 9094 -25569
1885b5569J5293L2140k1096j1226J6691j6828m097L6389r609l4506J6773J3650
$$ -25569 -10276 21864 768 -10458 6233 -10595 -14692 21697 12088 -22418 -5645 8005
1897H005j4610J6035N570l7347O857L8770j4428j8815J4693j0719o339L4144n290
$$ 8005 -6605 9430 15000 -22347 -15490 23280 8852 -9963 4730 -5989 -12328 21816 16526
1910A6526l8244J5430K1545j8085O331J2611k9548j241L5312j1377k0630J8621
$$ 16526 -21718 -6288 15257 -2828 3503 16114 -13434 -14675 20637 9260 -11370 7251
1922G251o936j6642K9604P311l6786N241K2862j4502L504J5299k8529p815L8439
$$ 7251 315 -16327 13277 20588 -16198 -10957 11905 -2597 907 16206 -12323 -20138 18301
1935A8301m545k8563J4314M133j6759K0703Q833l3363M265K7321j6770o192K1269
$$ 18301 13756 -14807 -493 3640 -13119 7584 16417 -16946 -12681 14640 -2130 -8322 12947
1948A2947j7406j5801L0917K235k5627J1770N952j9311J9053J7375l4779o679
$$ 12947 -4459 -20260 10657 12892 -12735 -965 4987 -14324 4729 22104 -12675 -19354
1960a9354L3097o156j3033J3930j3269j3016L3950L885l6627Q268K0614j5943
$$ -19354 13743 7587 -5446 8484 -4785 -17801 16149 20034 -16593 -8325 12289 -3654
1972c654N285J5610k6760o396L2627o824k0090J7586m355k0463K6130J3651l2648
$$ -3654 1631 17241 -9519 -15915 16712 9888 -10202 7384 3029 -17434 8696 22347 -10301
1985a0301j493K0477j2052M641J8442k9113j5424L7595N438k7588P615K023j5812
$$ -10301 -11794 8683 -3369 1272 19714 -9399 -24823 12772 18210 -9378 -1763 260 -15552
1998a5552K3466J4369l5393m825K8561r446n848J9094j8265k0143L0815J0446
$$ -15552 7914 22283 -13110 -17935 10626 1180 -4668 14426 -3839 -23982 6833 17279
2010A7279k5052O194M564k0393J8787K5730l1991j7534K6826Q04n979J5950j7476
$$ 17279 -7773 -1579 2985 -17408 1379 27109 -4882 -22416 4410 5214 -765 15185 -2291
2023b291k4088L2301J9335k9946l412J1999j3821J1201K3308k7242j9126K8063
$$ -2291 -26379 5922 25257 -4689 -8101 3898 -9923 1278 24586 -2656 -21782 6281
2035F281L054j4206J5525o326k6527K1966K3007k5063n719J2807j4845N353K8442
$$ 6281 9335 -4871 10654 4328 -22199 -233 22774 -2289 -8008 4799 -10046 -4693 23749
2048B3749k0655k6898K4118J0575j5426J2037k720k6750J8174K6836k4585j2184
$$ 23749 3094 -23804 314 10889 -4537 7500 4780 -21970 -3796 23040 -1545 -13729
2060a3729J8292r543k852K4936j3044k6099K1908J2372j9628R367P360k5819Q161
$$ -13729 4563 -4980 -7832 17104 4060 -22039 -131 12241 -7387 1980 9340 -16479 -8318
2073h318K8356j8708j4461J8389o932q047K5049o786k9813J8374J9000j9812J534
$$ -8318 20038 1330 -13131 5258 -1674 -9721 15328 8542 -21271 -2897 16103 -3709 -2175
2086b175J0692k0141M569K7915j8571k0163K3175J933j5708J6317N1k5117J5179
$$ -2175 8517 -11624 -7055 20860 2289 -17874 5301 7234 -8474 7843 7894 -17223 -2044
2099b044J9756k3112l286J7811j5008m086K5871j2020k2836K0261P361j7126J2074
$$ -2044 17712 -5400 -8686 9125 -5883 -9969 15902 3882 -18954 1307 8668 -8458 3616
2112C616M375k6254J1170K6891k0736j3419J8164o210n593K2689j0416k6926K1241
$$ 3616 7991 -18263 -7093 19798 -938 -14357 3807 -2403 -7996 14693 4277 -22649 -1408
2125a408J6625k0353K719R111k0727O783K7156j7842j8130J9092j408r734K1764
$$ -1408 15217 -5136 -2417 6694 -14033 -7250 19906 2064 -16066 3026 1618 -8116 13648
2138A3648l742l0485J4374K2375j5573j996P856k0382M132L2903j4105k7291J5550
$$ 13648 9906 -20579 -6205 16170 597 -1399 6457 -13925 -9793 23110 9005 -18286 -2736
2151b736P758r316J6279k191l1501J2744K8184j6182r298J1365j4586k165L0491
$$ -2736 5022 -4294 11985 9794 -21707 -8963 19221 3039 -6259 5106 -9480 -11645 18846
2164A8846p514k8903J2705J0133j1068J5046L888l2527M335L2776r735j4392R555
$$ 18846 11332 -17571 -4866 5267 -5801 9245 13133 -19394 -15059 17717 7982 -6410 3145
2177C145j1432m706L1048k506l2840Q734J6911j1170Q426Q749k8353k143L1933
$$ 3145 -8287 -12993 18055 15549 -17291 -8557 8354 -2816 5610 14359 -13994 -16137 15796
2190A5796n798j6567J1070p956j1893K8402O843l2899Q97J8938p941N461J1200
$$ 15796 9998 -6569 4501 -3455 -15348 13054 19897 -13002 -12105 6833 -1108 4353 15553
2203A5553k7256q091L3750M05k2048P630j232j2269K2950R861l1683k175K2631
$$ 15553 -11703 -19794 13956 14361 -7687 -57 -1289 -13558 9392 19253 -12430 -14605 8026
2216H026p878j518J4127k0419j3099L0284N233k3386N470L955j4186J8137J4778
$$ 8026 148 -1370 12757 -7662 -20761 9523 14756 -8630 -3160 795 -13391 4746 19524
2229A9524k9666p486K5531m449o829J3815j4359j5765K7478R050k5370L430R886
$$ 19524 -10142 -17628 7903 3454 -3375 10440 -3919 -19684 7794 16844 -8526 -5096 4790
2242D790j4731J1018J8409k5313j1602K5236j120j0984J4070r253j9540K3763
$$ 4790 -9941 1077 19486 -5827 -17429 7807 6687 -4297 9773 520 -19020 4743
2254D743J5210k5645k153J3116j2005O402J9477k2423j6486K5817M013j5721J0557
$$ 4743 19953 -5692 -7845 5271 -6734 -332 19145 -3278 -19764 6053 10066 -5655 4902
2267D902l049j9806J9361J7561k4676o850J6821r385P35J9305j7201j9859K4378
$$ 4902 1853 -17953 1408 18969 -5707 -12557 4264 -5121 -4386 14919 -2282 -22141 2237
2280B237R370j8858O657K369j8772J4593K0844k3525j1243J9783m669n264J8029
$$ 2237 11607 -7251 -594 1775 -16997 -2404 18440 -5085 -16328 3455 -1214 -6478 11551
2293A1551j0800k1913K1248J4061j9785K759P520j7494Q324K3563j8815j6137
$$ 11551 751 -21162 86 14147 -5638 -2879 4641 -12853 -4529 19034 219 -15918
2305a5918J9003J2q785J6958o283k4320J7409J8941j8754l340J0786j5218L195
$$ -15918 3085 3097 -5688 11270 4987 -19333 -1924 17017 -1737 -5077 5709 -9509 -6314
2318f314K5150j4803k1275J8292N371j1936J3872j092k5871J2881K2773j6680
$$ -6314 18836 4033 -17242 1050 6421 -5515 8357 7265 -18606 -5725 17048 368
2330C68q216J2029j1501j369K5478j0403k5207J5849J1526j3481R088L324k4133
$$ 368 -7848 4181 -7320 -8689 16789 6386 -18821 -2972 8554 -4927 4161 7485 -16648
2343a6648Q429K5891j4916j3651J4048o295n455K2427m889k6617J3409J5420j3746
$$ -16648 -8219 17672 2756 -10895 3153 -3142 -8597 13830 8941 -17676 -4267 11153 -2593
2356b593M228P211k1105K456K7302j1052j7311J3424j399r057J9805L71k7296
$$ -2593 1635 8846 -12259 -9803 17499 6447 -10864 2560 1161 -7896 11909 12280 -15016
2369a5016Q620K0124j3163j107J0219j8184k645K7464n911k1578J1299L325j0708
$$ -15016 -6396 13728 565 -542 9677 -8507 -11152 16312 10401 -11177 122 3447 -7261
2382g261J5954M797k7422L495K3159j0023o098J0893j4416o552K6873j018k5122
$$ -7261 8693 13490 -13932 -10437 12722 2699 -3399 7494 -6922 -13474 13399 12381 -12741
2395a2741Q582Q547j0884J1688P827k6072r12K6247p391j1100J1290r541r207
$$ -12741 -4159 4388 -6496 5192 13019 -13053 -13965 12282 4891 -6209 5081 -4460 -13667
2408a3667K4934K783k6197N208J3984j1137O663J1238k3245m933K6372l678j4868
$$ -13667 11267 14050 -12147 -6939 7045 -4092 2571 13809 -9436 -14369 12003 8325 -6543
2421f543J0887m715j2295K1480P468k6041R29J6796j0168K363J3525j9732j0167
$$ -6543 4344 -371 -12666 8814 16282 -9759 -8830 7966 -2202 161 13686 -6046 -16213
2434a6213K6601O63j8120Q415L38j3858J7089J1980k5616l469J9434o818l213
$$ -16213 10388 11051 -7069 1346 1684 -12174 4915 16895 -8721 -12190 7244 426 -2787
2447b787J4242j5535j3526K4594O023k0140M664M792j3222J3374J5049k4282q422
$$ -2787 11455 -4080 -17606 6988 13011 -7129 -2465 2327 -10895 2479 17528 -6754 -15176
2460a5176K2037k319p204J1757j0806j5034K2907J0555k2455J017R576j1293P712
$$ -15176 6861 4542 -2662 9095 -1711 -16745 6162 16717 -5738 -4721 4855 -6438 1274
2473A274J6772k1259j1714K2226J038j0919J0750n845j7215J9507J4588k2173
$$ 1274 18046 -3213 -14927 7299 8337 -2582 8168 2323 -14892 4615 19203 -2970
2485b970l994J2512r244L614J7804j8057j7271K2704O105j4142P138j631j7908
$$ -2970 -6964 5548 -3696 -82 17722 -335 -17606 5098 11203 -2939 4199 2568 -15340
2498a5340J6031J8801k1931r269J4902n825l16J7527j4356k0602K0234J1815j5164
$$ -15340 691 19492 -2439 -11708 3194 -2631 -2947 14580 224 -20378 -144 11671 -3493
2511c493L267J925j7596J2428K2214j9289j5106J5303l65l673J6592j0164k3217
$$ -3493 -226 1699 -15897 -3469 18745 -544 -15650 -347 -712 -4385 12207 2043 -21174
2524b1174J8598J6503j5314j195N355j5334P762K4103j5956j9198J6105L468o583
$$ -21174 -2576 13927 -1387 -2582 2773 -12561 -4799 19304 3348 -15850 255 3723 -2860
2537b860J3518m331k3897J3638K0582j4882n071Q298j3225K098K4991j0586k2487
$$ -2860 10658 6327 -17570 -3932 16650 1768 -3303 4995 -8230 -6132 18859 8273 -14214
2550a4214J2746P710q515J1774m00k5307R230K3867j2967r654R344r854j497K3754
$$ -14214 -1468 6242 -2273 9501 9101 -16206 -6976 16891 3924 -5730 3614 -6240 -7737 16017
2564A6017p317k4873J2002J1617j0868P901L993k3021L888K5010r885j3462J0894
$$ 16017 8700 -16173 -4171 7446 -3422 4479 8472 -14549 -10661 14349 4464 -8998 1896
2577A896n973o720K2410j307k6016P802J5656j0128K924P391k0682K78K6282p406
$$ 1896 -4077 -10797 11613 10306 -15710 -7908 7748 -2380 544 7935 -12747 -12469 13813 6407
2591F407j8119J1209P49r205J6883K278k4285O223J8270j1855j752J1146j4813
$$ 6407 -11712 -503 246 -8959 7924 10202 -14083 -7860 10410 -1445 -3197 7949 -6864
2604f864n814K3788k917j8903J0124L263j1327J4300O903k4329J006K1608q352
$$ -6864 -12678 11110 8193 -10710 -586 2677 -8650 5650 12553 -11776 -10770 10838 2486
2617B486p517J1287j0784p431K3300p36k2405Q078J0474j2123P418R564k0318
$$ 2486 -5031 6256 -4528 -11959 11341 10605 -11800 -3722 6752 -5371 2047 11611 -8707
2630h707k253K2302o916j1130J1976n650j1102J9795M951k3544M444J3256r816
$$ -8707 -10960 11342 4426 -6704 5272 -378 -11480 8315 13266 -10278 -5834 7422 -2394
2643b394L706J0481j9263n441K4951k769j6980Q786O19j0312J6162O111k3945
$$ -2394 1312 11793 -7470 -12911 12040 9271 -7709 1077 1696 -8616 7546 13657 -10288
2656a0288J896J8478r465k850J1885j3731q462K2129Q20j8516Q315L472j2784
$$ -10288 -8392 10086 621 -2229 9656 -4075 -12537 9592 10412 -8104 211 3683 -9101
2669i101J2946J1294k2824l903J9920n959n033J1584j1757j1947K2680N455k0902
$$ -9101 3845 15139 -7685 -11588 8332 2373 -2660 8924 -2833 -14780 7900 13355 -7547
2682g547L636Q332j1042R105J2587k1305p063K1110k560r583J1422o362j5351
$$ -7547 -3911 4421 -6621 2484 15071 -6234 -13297 7813 5253 -4330 7092 730 -14621
2695a4621J9250J0560k0870J5J0206j0471N830J5909j8592j3001K0841L499j1929
$$ -14621 4629 15189 -5681 -5666 4540 -5931 -101 15808 -2784 -15785 5056 8555 -3374
2708c374P895l475j5246J7255J4096k1732m915J4251o832N4J4731j3826j4414
$$ -3374 4521 1046 -14200 3055 17151 -4581 -9496 4755 -2077 -2023 12708 -1118 -15532
2721a5532J9951N403j5400O914K457j6012J1009J6362j7793p989J4896n753l299
$$ -15532 4419 9822 -5578 1336 3793 -12219 -1210 15152 -2641 -10630 4266 -1487 -4786
2734d786J6433r730j8873J7409J1130j5231K308N119j4623Q057J8621j6522j2595
$$ -4786 11647 1917 -16956 453 11583 -3648 -1340 3779 -10844 -2787 15834 -688 -13283
2747a3283J6984j045p934J3603m503j9026J4780J3642j6182l45R173j3413K541
$$ -13283 3701 2656 -5278 8325 3822 -15204 -424 13218 -2964 -3309 5864 -7549 -5008
2760e008K0155j2348j5806J4584L114q920J1714k016k1084J2165J9019j5698p348
$$ -5008 15147 2799 -13007 1577 4691 -4229 7485 5469 -15615 -3450 15569 -129 -7477
2773g477J1191q561k66J8799j0528j8466J5702P829j2925P214L612j8532O900
$$ -7477 3714 -4847 -5113 13686 3158 -15308 394 8223 -4702 2512 6124 -12408 -5508
2786e508J9022j3289q661J1913o874m685J9431m891k1329J1084J2552j1380L417
$$ -5508 13514 225 -8436 3477 -3397 -8082 11349 6458 -14871 -3787 8765 -2615 802
2799H02N854j8047M099K2017j1247j3992J2770j305p601J5772p45k1330Q824J4917
$$ 802 6656 -11391 -7292 14725 3478 -10514 2256 951 -6650 9122 8377 -12953 -4129 10788
2813A0788j2548J022R046j5717k203K2906n716j7237J0486J720q918J4241L411
$$ 10788 -1760 -738 8308 -7409 -9612 13294 7578 -9659 827 2547 -6371 7870 11281
2826A1281k4150N242J9719j0611m860R580j1631m186K1484l346j9588R336O834
$$ 11281 -12869 -7627 12092 1481 -3379 6201 -5430 -9616 11868 8522 -11066 -1730 5104
2839E104j1245R739P344k0715J63K0075p374q097J0928q655q544K0854J711k1560
$$ 5104 -6141 3598 10942 -9773 -9610 10465 3091 -5006 5922 -2733 -11277 9577 11288 -10272
2853a0272N948J0980j0511N836R451j9109k992K1505m511j2628J0649l027j1008
$$ -10272 -4324 6656 -3855 1981 11432 -7677 -10669 10836 6325 -6303 4346 1319 -9689
2866i689J7253N632k1402L036J3497j0133J904J2892j6553q262K1467J74j5062
$$ -9689 7564 13196 -8206 -5170 8327 -1806 98 12990 -3563 -11825 9642 9816 -5246
2879e246P898p8j1418J4777Q819k2025j625J7056o582l460J1285j2284j0078K0710
$$ -5246 2652 2574 -8844 5933 14752 -7273 -8898 8158 1576 -1884 9401 -2883 -12961 7749
2893G749L032j8180N763M922j1714R752J1980k0109n382J8389m403o894J1747
$$ 7749 10781 -7399 -1636 3286 -8428 1324 13304 -6805 -12187 6202 1799 -5095 6652
2906F652q835j2979J9500P039j9109K044Q590j0583O374J3171j8094q339J9691
$$ 6652 -2183 -15162 4338 11377 -7732 -5688 2902 -7681 -1307 11864 -6230 -14569 5122
2919E122j337j0003J0136m202j4426J6352J0473j8935n64J1060r195K672J4839
$$ 5122 3785 -6218 3918 -284 -14710 1642 12115 -6820 -7384 3676 -5519 -2847 11992
2932A1992j4812j2840J9177L466j2206Q059j089j5334J3428J4151j8132n588J3151
$$ 11992 -2820 -15660 3517 6983 -5223 2836 1747 -13587 -159 13992 -4140 -9728 3423
2945C423o112r63J4520j1384j5421J7297P683j3984M621L008j4506R309J6665
$$ 3423 -2689 -3652 10868 -516 -15937 1360 9043 -4941 -320 2688 -11818 -2509 14156
2958A4156j6334r488J4612l083m999J4328p288j7237J4959J1200j4782J189O904
$$ 14156 -2178 -11666 2946 -137 -5136 9192 1904 -15333 -374 10826 -3956 -2767 4137
2971D137j3499N249J8257j3715j2455J4383K21p468J2623k868j8471J1816J4034
$$ 4137 -9362 -4113 14144 429 -12026 2357 2578 -4890 7733 4865 -13606 -1790 12244
2984A2244j3606j965Q728j1093P29J9319j0492j6026J3399M847r766R924N28j8768
$$ 12244 -1362 -3327 5401 -5692 -4963 14356 3864 -12162 1237 6084 -3682 6242 6770 -11998
2998a1998Q536J7403j2922o423J0080p947k253J8368o845j8987J2463Q652j1139
$$ -11998 -3462 13941 1019 -5404 4676 -3271 -5524 12844 5999 -12988 -525 8127 -3012
3011c012O148L317j7320M974J9542j1458j0770J1806m603n510J6922l937j9511
$$ -3012 3136 6453 -10867 -5893 13649 2191 -8579 3227 -1376 -6886 10036 6099 -13412
3024a3412J0179J2103j1688K527O654j5763J325K0293q715j3826J1268j60p981
$$ -13412 -3233 8870 -2818 -291 6363 -9400 -8075 12218 3503 -10323 945 785 -7196
3037g196J4219P45k0629O955J5074j0832j381Q549j3056k247K0611n143j6358
$$ -7196 7023 7768 -12861 -5906 9168 -1664 -3045 5504 -7552 -9799 10812 5669 -10689
3050a0689R665L033q783J1508M006k0352K919J8176q629n373R489j0269n132J9639
$$ -10689 -1024 2009 -6774 4734 8740 -11612 -8693 9483 854 -4519 4970 -5299 -10431 9208
3064I208j515j8765P120P862r649Q096O436j8347o79J9871o448r446J0054o284
$$ 9208 7693 -11072 -3952 3910 -5739 2357 8793 -9554 -10233 9638 3190 -6256 3798 -2486
3078b486p733J8077K007k0292N273J1115r200L988Q606j6669l753K0759l712j2919
$$ -2486 -10219 7858 9865 -10427 -5154 5961 -3239 749 9355 -7314 -11067 9692 5980 -6939
3092f939R212j637r780J4822N450j9883K129J4007q663K66J0453j3430p472J9413
$$ -6939 2273 636 -9144 5678 11128 -8755 -6626 7381 -1282 -1016 9437 -3993 -11465 7948
3106G948J98j4550P151K023j1262J2386Q870j9728j780J6201n778m195J0785j0497
$$ 7948 8146 -6404 747 2770 -8492 3894 12764 -6964 -8744 7457 1679 -2516 8269 -2228
3120b228r285J8631L557j6925M847O133j0643Q250J0519j7374n252J7742l341
$$ -2228 -11513 7118 10675 -6250 -1403 4730 -5913 2337 12856 -4518 -9770 7972 4631
3133D631p974J0110o068j1605J6976O678j7970J654Q960q231L866J2232j6397
$$ 4631 -3343 6767 699 -10906 6070 12748 -5222 -3568 5392 -2839 1027 13259 -3138
3146c138p626J8559J8j1131P675j900j1883J3926R009j8356j344J2987q260J06
$$ -3138 -10764 7795 7813 -3318 4357 2457 -9426 4500 13509 -4847 -6191 6796 -1464 -1358
3160a358J2401j1945j1124J7090L211j2559O169J380j3338J1000J2294j6780n954
$$ -1358 11043 -902 -12026 5064 8275 -4284 1885 3265 -10073 927 13221 -3559 -9513
3173i513J3798m933k910J2325r772j3011J5961O701j3435L047M599j2487P328
$$ -9513 4285 -648 -3558 8767 -1005 -14016 1945 8646 -4789 -1742 2857 -9630 -2302
3186b302J4593j4738q604J3978j930o118J2385n691j5446J3795J0158j3787L09
$$ -2302 12291 -2447 -11051 2927 997 -5121 7264 1573 -13873 -78 10080 -3707 -3398
3199c398P065j0958L939J5827j2188j2270J4016J822q146J0299k111j5869J0812
$$ -3398 3667 -7291 -3352 12475 287 -11983 2033 3855 -4291 6008 3897 -11972 -1160
3212a160J3026j3409l439R729r072n01J6241q384j4228J2264M932j0201P739K201
$$ -1160 11866 -1543 -4982 4747 -4325 -4826 11415 3031 -11197 1067 5999 -4202 3537 5738
3226E738j6066O308J5646j1568o017J0068o442l920J5712m304j6592J0022P935
$$ 5738 -10328 -4020 11626 58 -5959 4109 -2333 -6253 9459 5155 -11437 -1415 6520
3239F520j0206M797M866j4898L324J6760r494r429J0644k882o400J3978j506j6878
$$ 6520 -3686 1111 5977 -8921 -5597 11163 1669 -7760 2884 2 -6398 7580 6074 -10804
3253a0804Q299J0803j0627J170P547j2549j64J7099o976j2427J0848N23q517J1671
$$ -10804 -2505 8298 -2329 -1159 6388 -6161 -6325 10774 3798 -8629 2219 2742 -5775 5896
3267E896J886j7291N159J4049j0025k617Q953r861l210J6828m594j4808R687M655
$$ 5896 7782 -9509 -4350 9699 -326 -2943 6010 -3851 -7061 9767 5173 -9635 52 4707
3281D707r425P708M318j6057L032J5311q839n934R883o784o163J5575q30j6404
$$ 4707 -4718 2990 7308 -8749 -5717 9594 755 -5179 4704 -2080 -8243 7332 6502 -9902
3295i902P116P689r382N583O315j5477k43J7701o070r631Q687l007p094J4654
$$ -9902 -2786 4903 -4479 1104 7419 -8058 -8301 9400 3330 -6301 2386 -621 -7715 6939
3309F939J675j8143N032J1516q769J232Q066j2637l426J7648l284j2456Q221P9
$$ 6939 8614 -9529 -4497 7019 -1750 -518 7548 -5089 -8515 9133 5849 -6607 1614 1693
3323A693q838J2581M887j7664J090J3405o759j725Q973j1450n958J7992l0j4927
$$ 1693 -7145 5436 10323 -7341 -6251 7154 395 -1330 7643 -3807 -9765 8227 8197 -6730
3337f730N968L712q907Q975P236j6849j852J5139m828n454R299p271q809J5406
$$ -6730 -762 2950 -5957 3018 10254 -6595 -8447 6692 1864 -3590 5709 -1562 -10371 5035
3351E035L539j4628L568N961r798O428J0408j5178n917J5519j341p413Q103m675
$$ 5035 8574 -6054 -2486 3475 -6323 105 10513 -4665 -10582 4937 3596 -3817 4286 -389
3365c89j0570J4668O993j6095L00R041p900K902J1159j2441q599J5755O09r638
$$ -389 -10959 3709 10702 -5393 -5093 3948 -3952 -1050 10109 -2332 -10931 4824 5433 -4205
3379d205P562r39j2158J0608J0491j4460l234J0502o279j73J2343j0190j1749
$$ -4205 3357 2418 -9740 868 11359 -3101 -6335 4167 -2112 -2285 10058 -132 -11881
3392a1881J4790M825j1458M485K119j1287Q233J1434j4202m980J1838l801m064
$$ -11881 2909 7734 -3724 761 2880 -8407 -174 11260 -2942 -7922 3916 115 -3949
3405c949J1248o062j2177J2104O409j1349K767N146j1572M352J4175j1289r002
$$ -3949 7299 1237 -10940 1164 7573 -3776 -1009 4137 -7435 -3083 11092 -197 -9199
3418i199J1763r08n399J0001l605j4033J1444R821j2237q38P207q767J574J3548
$$ -9199 2564 1656 -3743 6258 2653 -11380 64 9885 -2352 -3190 4017 -4750 -3176 10372
3432A0372r436j0436J2289J462q069Q210Q2j3831P145J2554j1157l376Q072p526
$$ 10372 936 -9500 2789 4251 -3818 4392 4474 -9357 -2212 10342 -815 -4191 3881 -3645
3446c645o01J4416p101j3970J0929N981q974M925J957j3053O043J3736j1073o729
$$ -3645 -4246 10170 3069 -10901 28 6009 -2965 1960 3917 -9136 -3093 10643 -430 -7159
3460g159J0117l734m345J2395l497j4093R131P664r553L073N119j2713K010J5377
$$ -7159 2958 -776 -5121 7274 3777 -10316 -1185 6479 -3074 -1 5118 -7595 -5585 9792
3474I792p225r671Q251j033m934J1369q72j5778O850J1315q822o55O464j0357
$$ 9792 2567 -7104 1147 114 -4820 6549 5677 -10101 -3251 8064 -758 -1413 5051 -5306
3488e306m97J6075n994j1798Q808J740p257R536K053j5774L974J3001p513l179
$$ -5306 -5803 10272 4278 -7520 1288 3028 -4229 5307 7360 -8414 -4440 8561 1048 -2131
3502b131O927q285k639J5784l057j4376P029N139p266O622L494j4417J436J4703
$$ -2131 4796 -3489 -6128 9656 6599 -7777 -748 4391 -2875 3747 7241 -7176 -5740 8963
3516H963o646o644Q239n311n056J3425Pj4778N350P604p997M053O285j3279j502
$$ 8963 2317 -4327 3912 -1399 -6455 6970 6977 -7801 -2451 5153 -2844 1209 7494 -5785 -7287
3531g287J5291m270q770P605k630o780J2631K633j5625K926J0039o960Q13P420
$$ -7287 8004 3734 -5036 2569 -61 -6841 5790 8423 -7202 -4276 5763 -1197 -384 7036
3545G036j0949l931J5164j807j1062O892K28p920J0406N149j5346O1J2166n658
$$ 7036 -3913 -7844 7320 5513 -5549 1343 1571 -6349 4057 9206 -6140 -6079 6087 429
3559D29j861P307q827n707J4396J313j2809M237L942q013P373P033j4442k700
$$ 429 -1432 5875 -2952 -8659 5737 7050 -5759 -1522 2420 -5593 1780 8813 -5629 -8329
3573h329J3707l651n599P940n884p674J3686L293j3741L101O073p372M239Q448
$$ -8329 5378 1727 -3872 4068 -1816 -9490 4196 7489 -6252 -3151 2922 -4450 -211 8237
3587H237j2614n096J4065j903p159P530k979r207J1493O475j4229N94Q540o800
$$ 8237 -4377 -9473 4592 2689 -4470 3060 81 -9126 2367 8842 -5387 -4793 3747 -3053
3601c053J426R367j0636p339J3704J215q823N603m54r791R530Q383j3166k501
$$ -3053 -1627 7740 -2896 -10235 3469 4684 -4139 1464 1010 -8781 749 9132 -4034 -6535
3615f535R677m699j139R808q195r591J2952M100j0500L920K325r700O755J0708
$$ -6535 3142 -1557 -2696 7112 -1083 -10674 2278 6378 -4122 -202 2123 -7577 -822 9886
3629I886j2404n521J0998k315l838R215n352j0627J1437O816j1075R41M881q239
$$ 9886 -2518 -8039 2959 644 -3194 6021 669 -9958 1479 8295 -2780 -1839 3042 -5197
3643e197M145J1141j0243p718J0991J08n959Q191k293j1687R524Q515j0467j279
$$ -5197 -1052 10089 -154 -7872 3119 3227 -2732 5459 3166 -8521 1003 9518 -949 -2228
3657b228O734p451M50J2474q033r986J0510K301p658O536O70j2305O567J1295
$$ -2228 4506 -2945 -2495 9979 1946 -8040 2470 4771 -2887 3649 4319 -7986 -1419 9876
3671I876j0383l460P782n681j839J1630n497j1734R306M821q098M261K451j1689
$$ 9876 -507 -3967 3815 -1866 -3705 7925 2428 -9306 0 4821 -3277 984 3435 -8254
3685h254M305J2405q765o661Q076k838l368J0575l091j2429P932P571q904J588
$$ -8254 -3949 8456 -309 -6970 1106 -1732 -5100 5475 2384 -10045 -2113 5458 -3446 -1858
3699a858M995j0124J421J3035o500q873Q645o50n603R392J71j3138N606R857q089
$$ -1858 3137 -6987 -5566 7469 969 -7904 741 91 -5512 3880 4051 -9087 -3481 6376 -1713
3714a713j083O575q221j361J3044m090j0663P861K512p396P528K622j2765L145
$$ -1713 -2796 3779 -4442 -5803 7241 3151 -7512 349 2861 -4535 2993 5615 -7150 -4005
3728d005J1128p006l637P703o798l574J2760j856j2097N920M954o652M515M444
$$ -4005 7123 117 -3520 4183 -2615 -6189 6571 4715 -7382 -1462 3492 -3160 1355 5799
3742E799j2165P28J2781n710o049P344l584n413J1218N37j2705M538P361p443
$$ 5799 -6366 -5638 7143 1433 -4616 2728 -856 -6269 4949 5486 -7219 -2681 4680 -2763
3756b763K214O146j0284j758J2902l330q470O914q81o569J0054L049j3354K363
$$ -2763 -549 5597 -4687 -6445 6457 3127 -5343 1571 690 -5879 4175 7224 -6130 -3767
3770c767R380o401m50O909q326l860J2934j437j0113N903K246p939P943M805j2657
$$ -3767 5613 -788 -1238 5671 -2655 -6515 6419 4982 -5131 772 3018 -4921 3022 7827 -4830
3785d830J21J0537n183k479P596o723n975J2341J332j1438L677M225o797N205
$$ -4830 -4709 5828 645 -1834 5762 -961 -6936 5405 6737 -4701 -1024 3201 -3596 1609
3799A609O817j2390k256J1888l148n475P151m265o702J0746L974j2458J807O835
$$ 1609 8426 -3964 -6220 5668 2520 -2955 4196 -69 -6771 3975 7949 -4509 -2702 4133
3813D133p015K463Q381j0394n366J2520o13p156N693j690q297R481O551j2392
$$ 4133 -2882 -419 7962 -2432 -7798 4722 4109 -3047 2646 956 -7341 2140 8691 -3701
3827c701p43Q246n299K88Q170q251o958J2003J541q790M613J563r449P176Q200
$$ -3701 -4444 3802 -1497 -1209 6961 -1290 -8248 3755 5296 -3494 1119 2682 -6767 409 8609
3842H609j1184k944Q794m393j592Q838o055r046J0561M393r195K568K947q437
$$ 8609 -2575 -5519 3275 -1118 -2710 6128 73 -8973 1588 5981 -3214 -646 2301 -6136
3856f136M844R661r778o090R775j488m286Q385l652j0562R491O777r906Q68N270
$$ -6136 -1292 8369 -1409 -7499 2276 788 -3498 4887 1235 -9327 164 6941 -2965 -2097 3173
3871C173p736K264J0589q398p585R583O44n638P298j270j0931P861Q157r778j272
$$ 3173 -4563 -2299 8290 -108 -7693 1890 2534 -3104 4194 2924 -8007 -146 8011 -1767 -3039
3886c039O765o378l5J0649o220r301R056L058p611N600J109j0442M991J0038q715
$$ -3039 3726 -2652 -2687 7962 1742 -7559 1497 4555 -3056 2544 3653 -6789 -1798 8240 -475
3901d75l837P742m395k693J0230l828j0698Q024N051q053L379M006j0472K683
$$ -475 -4312 3430 -965 -3658 6572 2744 -7954 70 5121 -2932 447 4453 -6019 -3336
3915c336J0616o743o198P860k239m182R581j550j1934O532P539p560P62N023q818
$$ -3336 7280 537 -5661 2199 -40 -4222 5359 3809 -8125 -1593 5946 -1614 -852 4171 -4647
3930d647N01J2224o058q192P276Q06n695P662Q04j1869M865R320p710j378O173
$$ -4647 -4146 8078 2020 -6172 1104 1910 -3785 3877 4681 -7188 -2323 6997 -713 -2091 4082
3945D082o907j897J1980l809j0259P117K849o225N632K601j1727K519J1326o364
$$ 4082 -2825 -4722 7258 3449 -6810 307 3156 -3069 2563 5164 -6563 -4044 7282 918
3959I18m800O874m535l500J1058j585j1499N667N775p169L593M508j0504m9J1961
$$ 918 -3882 2992 -1543 -5043 6015 4430 -7069 -1402 4373 -2796 797 5305 -5199 -5248 6713
3974F713m563o128O164k952m896J0372J432j2606L415P287n744J465N346r643
$$ 6713 2150 -3978 2186 -766 -5662 4710 6142 -6464 -3049 4238 -1506 -41 5305 -4338
3988d338k104J3046k255q977N367M69o034Q689K604j2393J524R986n294j657O477
$$ -4338 -6442 6604 4349 -4628 739 1208 -4826 3863 6467 -5926 -4402 5584 290 -1367 5110
4003E110p368m386J2320k99j0048M571J916o746P047N461j2255j328J0724l202
$$ 5110 -2258 -6644 5676 5377 -4671 -100 1816 -4930 2117 7578 -4677 -6005 4719 1517
4017A517l706O386o037n585J1771J261j0757L071M935o731M310O238j0709k611
$$ 1517 -2189 4197 -1840 -7425 4346 5607 -5150 -2079 2856 -3875 435 6673 -4036 -6647
4031f647J0867k282n436O517l255p179J0054M247j1201J087O078n856K400P564
$$ -6647 4220 1938 -3498 3019 -236 -7415 2639 6886 -4315 -3228 2850 -3006 -606 6958
4045F958r203n475J1748J63p705N094o51p131Q433N841j1762n52Q329n037l38
$$ 6958 -2245 -7720 4028 4191 -3514 1580 929 -6202 2231 8072 -3690 -4242 4087 -950 -1288
4060a288P794p144o796J0797J892q129L664J158p738O262P978j0852l300Q682
$$ -1288 6506 -638 -7434 3363 5255 -2874 790 1948 -5790 472 8450 -2402 -5702 2980
4074B980k530k619P521n419p845J0147M063r790J918M040p361M010Q292q906n268
$$ 2980 450 -2169 5352 -67 -7912 2235 6298 -3492 -1574 2466 -4895 -885 7407 -1499 -6767
4089f767R190j025m361P037k427r707Q256O603r144J88M839o711J848J0386q081
$$ -6767 2423 1398 -2963 4074 1647 -8060 196 6799 -2345 -2157 2682 -4029 -2181 8205 124
4104A24p894R599J426n626N673j029r484P082P763r042k331O767n274o12R727
$$ 124 -7770 1829 3255 -2371 3302 2273 -7211 -129 7634 -1408 -3739 3028 -2246 -2858 6869
4119F869n518q924Q597K948o609M490J591j0107M640R921q087m421O947l147k608
$$ 6869 1351 -7573 1024 3972 -2637 1853 3444 -6663 -2023 7898 -189 -4610 2337 -810 -3418
4134c418R173l705r915P446N444p139J991L575q637K077J0381p113n872P770j474
$$ -3418 5755 2050 -7865 -419 5025 -2114 -123 3452 -5185 -3108 7273 160 -5712 2058 584
4149E84m703Q475q82j0928O272O522p032P36M931p657n66J1626m888q327P446
$$ 584 -4119 4356 3474 -7454 -1182 5340 -1692 -956 3975 -3682 -4248 7378 2490 -5837 1609
4164A609O72n908P198J166j1020M053R080o901k031O097o258k145J1153l332r207
$$ 1609 2281 -3627 3571 4737 -6283 -2230 6850 -51 -2082 4015 -2243 -4388 6765 3433 -5774
4179e774O072L004o411N311K901j0568J508J0637n676m615O740m225l757J0285
$$ -5774 298 3302 -3109 2202 5103 -5465 -3957 6680 1004 -3611 3129 -1096 -4853 5432
4193E432j242j0751N095N491p004K757N009r434l28J0812m248o734O944j525n357
$$ 5432 4190 -6561 -1466 4025 -2979 -222 4787 -4647 -4975 5837 1589 -5145 1799 274 -5083
4208e083Q606J129j0925L762O913o328K55O452q021k549J1497k374q083N572Q64
$$ -5083 3523 4652 -6273 -2511 4402 -1926 -1671 4781 -3240 -5789 5708 3334 -4749 823 1687
4223A687o646P833L219j1175Q31R414n266j700O341o363m436J1403l52r777M526
$$ 1687 -4959 2874 6093 -5082 -4251 5163 -103 -1803 4538 -1825 -6261 5142 4790 -4987 -461
4238d61K843o281N568M830j0840p59J0129l985m167O770m454n929J0316J852j0150
$$ -461 2382 -3899 1669 6499 -4341 -5100 5029 1044 -3123 3647 -807 -6736 3580 5432 -4718
4253d718K913M734n946K910O377r772k596J0765k342n814O410k477o746Q855L637
$$ -4718 -1805 2929 -3017 -107 6270 -3502 -6098 4667 2325 -3489 2921 444 -6302 2553 6190
4268F190j0252Q32O730n388M59P645p997m770R918K09o987N123k8p568P319N888
$$ 6190 -4062 -3230 3500 -1888 -1429 6216 -1781 -6551 3367 3576 -3411 1712 1684 -5884 1435 7323
4284G323j0024j292P929m691j083P717o129p012R881K040p993L875J953p620N211
$$ 7323 -2701 -3993 3936 -755 -1838 5879 -250 -7262 2619 4659 -3334 541 2494 -5126 85
4299H5P667r587l251Q386k709l436P495l631q112Q532M400q954K354L559p057
$$ 85 7752 -1835 -5086 3300 591 -2845 4650 1019 -7093 1439 5839 -3115 -761 2798 -4259
4314d259K810Q815q122n184Q722j060n029O969j501r359P238O469q851K27N397
$$ -4259 -1449 7366 -756 -5940 2782 1722 -3307 3662 2161 -7198 40 6509 -2342 -2115 3282
4329C282o501P53R135o339o880Q565R05o123N689M67r434N294Q050q419j656O342
$$ 3282 -3219 -2466 6669 330 -6550 2015 2920 -3203 2486 2953 -6481 -1187 6863 -1556 -3212 3130
4345C130n203j542R530m292q746P540L302o854M080K038q829K904R473o925m611
$$ 3130 -2073 -3615 5915 1623 -7123 417 3719 -3135 945 2983 -5846 -2942 6531 -394 -5005
4360e005P097l144l055Q788k301r832O608N493p432J832M133q091R30J0394n976
$$ -5005 2092 -1052 -4107 4681 2380 -7452 -844 4649 -2783 -951 3182 -4909 -3979 6415 439
4375D39n950P087o35m940P619J29j0426M697P551p092k39N467o716r95J0622l810
$$ 439 -5511 1576 941 -3999 3620 3749 -6677 -1980 5571 -1521 -1760 3707 -3009 -4004 6618 2808
4391B808q214O517J223n506O000J463j0171L288Q674o181k433O462n757k760J0195
$$ 2808 -5406 1111 2334 -3172 2828 4291 -5880 -2592 6082 -99 -2532 3930 -1827 -4587 5608
4406E608k019r334N459L402o279M730L679j0716J155J0093m724m505N945l498
$$ 5608 3589 -5745 -286 3116 -3163 1567 5246 -5470 -4315 5778 1054 -3451 2494 -1004
4420a004m130R587l92j0547M445N759o026K151M708q619p96J0391l764o553O513
$$ -1004 -5134 4453 4061 -6486 -2041 3718 -2308 -157 4551 -4068 -4864 5527 1763 -4790 1723
4435A723j130n688Q305K253j0856K642O875n459L58N953p621l075J1103j678p888
$$ 1723 593 -5095 3210 5463 -5393 -2751 4124 -1335 -977 4976 -2645 -5720 5383 3705 -4183
4450d183N040R15o037O885L540j0464N95Q554m684k430O617n799m463J0004M54
$$ -4183 857 1772 -4265 2620 6160 -4304 -3709 4845 161 -2269 4348 -1451 -5914 4090 4544
4465D544q818L702L066o477M956N346r867j901R532k972l888O415m065o138R284
$$ 4544 -4274 -572 2494 -3983 973 6319 -3548 -5449 4083 1111 -2777 3638 -427 -6565 2719
4480B719L079j0424K046N693o067K584O373q759l258R912j487n911N931j303p484
$$ 2719 5798 -4626 -2580 3113 -2954 -370 6003 -2756 -6014 3898 2411 -3500 2431 1128 -6356
4495f356Q162M411r752K88O833n211M47O934p011n395J0155L71o965M379R17p597
$$ -6356 1806 6217 -3535 -3247 3586 -1625 -1178 5756 -1255 -6650 3505 3876 -3089 1290 2207 -5390
4511e390O147O088r231j820P793m221j665P473n071o589Q940K386q260L656K495
$$ -5390 757 6845 -2386 -4206 3587 -634 -2299 5174 103 -6486 2454 4840 -3420 236 2731
4526B731p605M194P555q260m063Q548k294l710O993l273p852Q207M742q835J427
$$ 2731 -4874 -680 6875 -1385 -5448 3100 806 -2904 4089 816 -7036 1171 5913 -2922 -1495
4541a495M317o686K433Q077p241n757Q437o5n062N981j004q290O444O198q398
$$ -1495 2822 -3864 -1431 6646 -595 -6352 2085 2020 -3042 2939 1935 -6355 89 6287 -2111
4556b111p00O032n267j32Q653n682p118Q304J654o186M340J302q810M554P962
$$ -2111 -2811 3221 -2046 -2178 6475 793 -6325 1979 3633 -2553 1787 3089 -5721 -1167 6795
4571F795p782k715O796m006j968Q131l476q398P124L690p105L044K927q097K738
$$ 6795 -987 -3702 3094 -912 -2880 5251 1775 -6623 501 4191 -2914 130 3057 -5040 -2302
4586b302Q907o722m627P175k277l749P961k177q925N875N717p053R81M352p224
$$ -2302 6605 -117 -4744 2431 154 -3595 4366 2189 -6736 -861 4856 -2197 -1216 3136 -4088
4601d088O78R728n081o705O511K22m461O540K32r857M668P392o633j426N480n760
$$ -4088 -3410 6318 1237 -5468 1043 1265 -3196 3344 3576 -6281 -1613 5779 -854 -2280 3200 -2560
4617b560q00R375l796q043O511K117n590M612K377r169K350Q593n865k782N621
$$ -2560 -3360 6015 2219 -5824 687 2804 -2786 1826 4203 -4966 -2616 5977 112 -2670 2951
4632B951m263l048R322j412r324M863M373n987L471L577r138R99R475m741n173
$$ 2951 -1312 -4360 4962 3550 -5774 -911 3462 -2525 946 4523 -4615 -3616 5859 1118 -4055
4647d055N962k129m422Q737J73r661L733N559n783J470M967p936j388R679k445
$$ -4055 1907 -222 -4644 4093 4266 -5395 -1662 3897 -1886 -416 4551 -3385 -4773 4906 2461
4662B461o590N534n12n129P161K084r869K158P353n538j80N195o542k344R530
$$ 2461 -4129 1405 893 -4236 2925 5009 -4860 -2702 4651 -887 -1067 4128 -2414 -4758 4772
4677D772j432p822M980J754n602M746L707r200N58Q359m751k603O030m414m730
$$ 4772 3340 -4482 498 2252 -3350 1396 5103 -4097 -3539 4820 69 -2534 3496 -918 -5648
4692e648Q980R42q600L485L615o118L554N102q473j884R044k687m610N726k492
$$ -5648 3332 4274 -4326 -841 2774 -3344 210 5312 -3161 -5045 3999 1312 -3298 2428 -64
4707f4n411P633K936r201K201M680n323J397O758p411l839R069j060n577N239
$$ -64 -5475 2158 5094 -4107 -1906 2774 -2549 -1152 5606 -1805 -5644 3425 2365 -3212 2027
4722B027q65o659O820M541q956J76O529m614n48O615n759n177R086P75p158L873
$$ 2027 1162 -5497 1323 5864 -3092 -2916 3613 -1001 -1549 5066 -693 -5870 3216 3991 -3167 706
4738G06J611o629M718N834q593j365P224l618k535P440m477o318P908K658p631
$$ 706 2317 -4312 406 6240 -2353 -3718 3506 -112 -2647 4793 316 -6002 1906 4564 -3067
4753c067K330L315o485K808P099p537l616P923k031l947O452k052p026O426M490
$$ -3067 -737 2578 -3907 -1099 6000 -1537 -5153 2770 739 -3208 3244 1192 -5834 592 5082
4768E082q032J411M532o087R27P964n772n414P628k76m695N335j83q060N427O153
$$ 5082 -2950 -1539 2993 -3094 -2167 5797 25 -5389 2239 1963 -2732 2603 2420 -5640 -213 5940
4784E940p506j094N747m833o78P919m705o317P115J666n887L956J615p617L399
$$ 5940 -1566 -2660 3087 -1746 -2424 5495 790 -5527 1588 3254 -2633 1323 2938 -4679 -1280
4799a280P250o787k976O494l317k387P477k497p919O300L550o315K260L298p408
$$ -1280 5970 -817 -3793 2701 -616 -3003 4474 1977 -5942 358 3908 -2407 -147 3151 -4257
4814d257J555Q546n937m654O681j526l818O678n66q645N226N402o532N09M813
$$ -4257 -2702 5844 -93 -4747 1934 408 -3410 3268 2702 -5943 -717 4685 -1847 -1338 3475
4829C475o488j98Q595l806o467O006N88m861N708J146q920L230P007n393j510
$$ 3475 -3013 -3211 5384 1578 -4889 1117 1705 -3156 2552 3698 -5222 -1992 5015 -378 -1888
4844a888N021n273j441Q394k104p511M943K362n609M756K712r171K184Q088n197
$$ -1888 3133 -2140 -3581 4813 2709 -4802 141 2503 -3106 1650 4362 -4809 -2625 5463 266
4859B66l202N530l234l211P790p02q370M503L873n776K817L674p686l41Q553l465
$$ 266 -2936 2594 -640 -3851 3939 3237 -5133 -630 3243 -2533 284 3958 -3728 -4069 4484 1019
4875A019m786N560j816m209P419Q21q379K401N784n297P16M675o695j641Q957
$$ 1019 -3767 1793 -23 -4232 3187 4008 -4371 -1970 3814 -1483 -767 3908 -2787 -4428 4529
4890D529k528n929N174l90m827O325K240q321J100O720m521j142N505n770k915
$$ 4529 2001 -3928 1246 856 -3971 2354 4594 -3727 -2627 4093 -428 -1570 3935 -1835 -4750
4905d750Q589j30p429L602K091n412M673M316q932n29P576k848k809N037l587
$$ -4750 3839 3709 -3720 -118 1973 -3439 1234 5550 -3382 -3911 3665 817 -1992 3045 -542
4920e42m358P789J118p598K289L576n099K610N244p517k296Q159k151l957N365
$$ -542 -4900 2889 4007 -3591 -1302 2274 -2825 -215 5029 -2488 -4784 3375 1224 -2733 2632
4935B632k250n489O764L184q246J276M853m465O15O134o527l413P956k65n672
$$ 2632 382 -5107 1657 4841 -3405 -2129 2724 -1741 -1126 5008 -1519 -4932 3024 2759 -2913
4950b913M260j26n972N757M634p880q38O239m240j89N807m792m903P421J400o047
$$ -2913 1347 1221 -4751 1006 5640 -2240 -3078 3161 -1079 -1268 4539 -253 -5156 2265 3665 -2382
4966b382L102J036n862M609N138p434k192O905k563k249N569l011o296O744L284
$$ -2382 720 1756 -4106 503 5641 -1793 -3985 2920 357 -1892 3677 666 -5630 1114 4398
4981D398p028J837K766n829K836O563o595l902O894r03l596N186j708o586O086
$$ 4398 -2630 -793 1973 -3856 -1020 5543 -1052 -4954 1940 1037 -2559 2627 919 -5667 419
4996D19M704p297M82M161m789O38O810n189n363P163N30m723M422K58o889M213
$$ 419 5123 -2174 -1692 2469 -2320 -1682 5128 -61 -5424 1739 2269 -2454 1968 2226 -4663 -450
5012d50N890o737r74M973m075q30P004l598o363O141K443n732L235J484o660K489
$$ -450 5440 -1297 -2271 2702 -1373 -2203 4801 1203 -5160 981 3424 -2308 927 2411 -4249 -1760
5028a760P113n955l031N709k427k414O922k262p499N454L970n824J575K981o562
$$ -1760 5353 -602 -3633 2076 -351 -2765 4157 1895 -5604 -150 3820 -2004 -429 2552 -4010
5043d010J588P739m667n249O142q05l776O016n42p524M065N620n968K1M203n500
$$ -4010 -2422 5317 650 -4599 1543 738 -3038 2978 2436 -5088 -1023 4597 -1371 -1350 2853 -2647
5059b647j05P876l622n992N632Q62m610M977P96p384K492O771n129j892M834m330
$$ -2647 -2752 5124 1502 -4490 1142 2004 -2606 2371 3167 -4217 -1725 5046 -83 -1975 2859 -1471
5075a471j616P587k041p215M746K827n138L361K568p422J161P144m372l032M992
$$ -1471 -3087 4500 2459 -4756 -10 2817 -2321 1040 3608 -3814 -2653 4491 119 -2913 2079
5090B079k475l421P226k32p802L507M047m968K028L318o795k54Q213l167n041
$$ 2079 -396 -3817 3409 3177 -4625 -1118 2929 -2039 -11 3307 -3488 -3742 4471 1304 -3737
5105c737M781p02l868O255P87p785K314N472m671L0M648n472j943Q078j849o127
$$ -3737 1044 342 -3526 2729 3516 -4269 -1955 3517 -1154 -1124 3524 -1948 -3891 4187 2338 -3789
5121c789M489R29m939M777K802p757J080O217l556j740M432m039l067P591k78
$$ -3789 700 1629 -3310 1467 4269 -3488 -2408 3809 253 -1487 2945 -1094 -4161 3430 3152
5136C152o841L534K314m771L207L642p270l65P158k968k919M662k693m624O837
$$ 3152 -3689 -155 2159 -2612 595 4237 -3033 -3398 3760 792 -2127 2535 -158 -4782 2055
5151B055J751p243K113L477m523J900M785o391k248P500j585m434M194o73n292
$$ 2055 3806 -3437 -1324 2153 -2370 -470 4315 -2076 -4324 3176 1591 -2843 1351 678 -4614
5166d614O377K754p512R17M732l807J63M744m893l372P387k32n622M120M08n373
$$ -4614 1763 4517 -2995 -2078 2654 -1153 -990 3754 -1139 -4511 2876 2644 -2978 1142 1550 -3823
5182c823M619M241p319n16N536l090j562N748l876m485O560J457o186K912J987
$$ -3823 796 5037 -2282 -2798 2738 -352 -1914 3834 -42 -4527 2033 3490 -2696 216 2203
5197B203n550L058N331o461k328O271k073k436M787k228n043N410L058o575J326
$$ 2203 -3347 -289 5042 -1419 -3747 2524 451 -1985 2802 574 -4469 941 3999 -2576 -1250
5212a250L275m609J670N321m955m148O765q90l950M616p34n875M847M525o492
$$ -1250 2025 -2584 -914 4407 -548 -4696 2069 1179 -2771 1845 1111 -4764 83 4608 -1884
5227a884k61M499l953j34N784l652m919N919R75m723L763Q38o340L374N489n706
$$ -1884 -2145 2354 -1599 -1733 4051 399 -4520 1399 2374 -2349 1414 2252 -4088 -714 4775 -931
5243i31j621M946l290j171N946k573n977N512K546n315K488K032o051K016O381
$$ -931 -2552 2394 -896 -2067 3879 1306 -4671 841 3387 -1928 560 2592 -3459 -1443 4938
5258D938n280l254N235j417k866O150j771o372M476L916n229O81L519n629M73
$$ 4938 -342 -3596 1639 222 -2644 3506 1735 -4637 -161 3755 -1474 -793 2726 -2903 -2430
5273b430O950m158m165M959k18m032N692m3p470L491N313m954m07L822m269r64
$$ -2430 4520 362 -3803 1156 938 -3094 2598 2555 -4915 -1424 3889 -1065 -1472 2350 -1919 -2883
5289b883P008k803n340M641J250m103L659J387o606K015O060m353j927M577l550
$$ -2883 4125 1322 -4018 623 1873 -2230 1429 2816 -3790 -1775 4285 -68 -1995 2582 -968
5304i68k163O637j062o298L891K242m415K479K993o594L35O884l373l280M294
$$ -968 -3131 3506 2444 -3854 37 2279 -2136 343 3336 -3258 -2923 3961 588 -2692 1602
5319A602j935l009O139k3o788K656M226m752J274L822n767j210P077j683m685
$$ 1602 -333 -3342 2797 2774 -4014 -1358 2868 -1884 -610 3212 -2555 -3765 3312 1629 -3056
5334c056M224m36m241N138J993p178J558N084l726l70M270m785k345P212r44n485
$$ -3056 1168 732 -3509 1629 3622 -3556 -1998 3086 -640 -1010 3260 -1525 -3870 3342 2398 -3087
5350c087L548R15m327M046K828o728L4O196l366j769M379l428l572O903M69o260
$$ -3087 461 1376 -2951 1095 3923 -2805 -2771 3425 59 -1710 2669 -759 -4331 2572 3041 -3219
5366c219K851K720m812K611M014o571r63O524k350k951M468k460l922N870J730
$$ -3219 -368 2352 -2460 151 4165 -2406 -3369 3155 805 -2146 2322 -138 -4060 1810 3540
5381C540o666J937L376m185J424M766n578k807O854q53m213L961o98m939M962
$$ 3540 -3126 -1189 2187 -1998 -574 4192 -1386 -4193 2661 1808 -2405 1556 858 -4081 881
5396H81L342o872O14M466l441o1N323m952l487O615J98m861K927Q10m983L591
$$ 881 4223 -2649 -2035 2431 -1010 -1071 4252 -700 -4187 2428 2626 -2235 692 1502 -3481 110
5412A10M542o600j280N605k400j649M938k915m682N724J514n322K225K126m803
$$ 110 4652 -1948 -3228 2377 -23 -1672 3266 351 -4331 1393 2907 -2415 -190 1936 -2867
5427b867K239N214n708k887N878j302k869M997j793n800N625K853n693P50L421
$$ -2867 -628 4586 -1122 -4009 1869 567 -2302 2695 902 -4898 727 3580 -2113 -1363 2058
5442B058m425R77N670m764l665N840j35l883L977Q1n930L740M904n629o27M094
$$ 2058 -2367 -1390 4280 -484 -4149 1691 1556 -2327 1650 1731 -4199 -459 4445 -1184 -1811 2283
5458B283l862O2N661l411m763N215J418m746L311J147o005L041N317n165k157
$$ 2283 -1579 -1517 4144 733 -4030 1185 2603 -2143 1168 2315 -3690 -649 4668 -497 -2654
5473b654M471k150k082O075k180o281N257K717m731J808K093n230J317N934m263
$$ -2654 1817 -333 -2415 3660 1480 -4801 456 3173 -1558 250 2343 -2887 -1570 4364 101
5488A01l522N106j428k896N483j022o476L816M437n136O98L015m790R4O595l396
$$ 101 -3421 1685 257 -2639 2844 1822 -4654 -838 3599 -1537 -839 2176 -2614 -2520 4075 679
5504F79m586M669J92l150M250J53o363K774N424m549p00L620l938j313O910j935
$$ 679 -3907 762 954 -2196 2054 2207 -4156 -1382 4042 -507 -1207 2413 -1525 -2838 4072 2137
5520B137n938M267J484m171L307J792o474J878N887l974k327M234k849k097N909
$$ 2137 -3801 466 1950 -2221 1086 2878 -3596 -1718 4169 195 -2132 2102 -747 -2844 3065
5535C065n43o399L095L211m061J857K940n866O5O776l406l488M326j173l651N665
$$ 3065 2522 -3877 -782 2429 -1632 225 3165 -2701 -2636 4140 734 -2754 1572 399 -3252 2413
5551B413L38o731K504M219m197R46L607n203j424O837j631m607L533J67l874M674
$$ 2413 2751 -3980 -1476 2743 -1454 -508 3099 -2104 -3528 3309 1678 -2929 604 771 -3103 1571
5567A571J929o957J437N187l794n90M344m347k574O720m14n772L138J433m114
$$ 1571 3500 -3457 -2020 3167 -627 -1217 3127 -1220 -3794 2926 2512 -3260 -122 1311 -2803
5582b803L432L357o642K5N809l085j951M716l134l652O264P01o110K336K919m562
$$ -2803 629 3986 -2656 -2631 3178 93 -1858 2858 -276 -3928 2336 3037 -3073 -737 2182 -2380
5598b380K107M059n844j275O635k417l506M434j582m102N551J816o458J358L946
$$ -2380 -273 3786 -2058 -3333 3302 885 -2621 1813 231 -3871 1680 3496 -2962 -1604 2342
5613B342m095Q16M827n136k705O682r29m301L596J93m858M192L646o800L81M894
$$ 2342 -1753 -937 3890 -1246 -3951 2731 1802 -2499 1097 1290 -3568 624 4270 -2530 -2149 2745
5629B745l433n79N207m549l640O243Q43n350L037J131n011L486M437o404j287
$$ 2745 -688 -1267 3940 -609 -4249 1994 2837 -2513 524 1655 -3356 130 4567 -1837 -3124
5644c124N529k478j667M651k286m791N607J906n739J987K128m515J958N242n258
$$ -3124 2405 -73 -1740 2911 625 -4166 1441 3347 -2392 -405 1723 -2792 -834 4408 -850
5659h50k891N732j191l053M538j203n447M578L638n804L96M069m594M86N494m168
$$ -850 -3741 1991 800 -2253 2285 1082 -4365 213 3851 -1953 -1557 2512 -2082 -1596 3898 -270
5675b70l754N841J01m537M372j5n300L299M177n067r30M727l833j045N741k651
$$ -270 -4024 1817 1918 -2619 1753 1738 -3562 -263 3914 -1153 -2083 2644 -1189 -2234 3507 856
5691H56m927N212J844n129K554K194n964K342N655n516j848M965k170k687N737
$$ 856 -4071 1141 2985 -2144 410 2604 -3360 -1018 4637 -879 -2727 2238 68 -2619 3118
5706C118j978n201M253K981n309J788K864n123O81O023m005l105M622j000l451
$$ 3118 1140 -4061 192 3173 -2136 -348 2516 -2607 -1926 4097 92 -3013 1609 609 -2842
5721b842N037o0o009L217M031m687r0M173m657n02N894k802m632N208J08m034
$$ -2842 2195 2135 -3874 -657 3374 -1313 -1403 2770 -1887 -2389 3505 703 -3929 1279 1387 -2647
5737b647L935J444o103K202M920m466j219M703l702j878O235j216n931M086J677
$$ -2647 1288 2732 -3371 -1169 3751 -715 -1934 2769 -933 -2811 3424 2208 -3723 363 2040
5752B040m269K881K394n921P33O031l830k384M592k611k889O161n93n976L298
$$ 2040 -2229 652 3046 -2875 -2142 3889 59 -2325 2267 -344 -3233 2928 2335 -3641 -343
5767c43L103m492J560L240n198j016O525k447l954M564q20l838N013Q77o176J959
$$ -343 2760 -1732 -172 3068 -2130 -3146 3379 932 -3022 1542 722 -3116 1897 2774 -3402 -1443
5783a443M294m310K61M037m585j607O409j391m681M303J75m336L847K360o205
$$ -1443 2851 -1459 -1198 2839 -1746 -3353 3056 1665 -3016 1287 1462 -2874 973 3333 -2872
5798b872Q27N275l676j095M523l694l127O575k51n523L321J771m622L062L258
$$ -2872 -2045 3230 -446 -1541 2982 -712 -3839 2736 2485 -3038 283 2054 -2568 494 3752
5813C752n744o56N952k956k495M408j912m395N986R81n994K275K843m072J606
$$ 3752 -1992 -2648 3304 348 -2147 2261 349 -4046 1940 2921 -3073 -798 2045 -2027 -421
5828d21M267n580j469N762j536l459M571j665m366N161K306o361J320L875l812
$$ -421 3846 -1734 -3203 2559 1023 -2436 2135 470 -3896 1265 3571 -2790 -1470 2405 -1407
5843a407K79M675m236l148O340o53m555L631K92m837M049L605o312K66M757l253
$$ -1407 -1128 3547 -689 -3837 2503 1850 -2705 926 1218 -3619 430 4035 -2277 -2011 2746 -507
5859e07j047M965l050m214N616R67n018K885J478n155K406M727n194j615N009
$$ -507 -1554 3411 361 -3853 1763 2730 -2288 597 2075 -3080 -674 4053 -1141 -2756 2253
5874B253k252j945M761j972n190N209K355n591J839K675m553J137N112m357l200
$$ 2253 1 -1944 2817 845 -4345 864 3219 -2372 -533 2142 -2411 -1274 3838 -519 -3719
5889c719N656j134l288M813o68n788M033L504m834l18M211m132k68N992l707m165
$$ -3719 1937 803 -2485 2328 1660 -4128 -95 3409 -1425 -1743 2468 -1664 -1932 4060 353 -3812
5905c812N190P04m474L577Q42n679L266M346m983j221M656l018j895N785k414
$$ -3812 1378 2082 -2392 1185 2027 -3652 -386 3960 -1023 -2244 2412 -606 -2501 3284 870
5920H70m515M495J849m671K419K496n789J626N150m413k224M677k117k599N693
$$ 870 -3645 850 2699 -1972 447 2943 -2846 -1220 3930 -483 -2707 1970 -147 -2746 2947
5935B947j282n580L856L166n189J620L359n177K33O120l572l948M871p99l224
$$ 2947 1665 -3915 -59 3107 -2082 -462 2897 -2280 -2047 4073 501 -3447 1424 625 -2599
5950b599M842K36o177K931L877m272k53M089m235j200O413k346m883M306J226
$$ -2599 2243 2479 -3698 -767 3110 -1162 -1415 2674 -1561 -2761 3652 1306 -3577 729 1955
5965A955m339L700J622o399K216M842m252j229M415l344j918N603j149n456M074
$$ 1955 -2384 1316 2938 -3461 -1245 3597 -655 -1884 2531 -813 -2731 2872 1723 -3733 341
5980C41K162m728K618K963n998L65N885l339k963M657j811l152N454J68o547K993
$$ 341 2503 -2225 393 3356 -2642 -2277 3608 269 -2694 1963 152 -3000 2454 2622 -3925 -932
5996i32L162m381J768L208m938j235O490k493l752M717j017l939M674J795o498
$$ -932 2230 -2151 -383 2825 -2113 -3348 3142 649 -3103 1614 597 -3342 1332 3127 -3371
6011c371J920M559l871n23M513m449k279O357j192m628L808Q04m500L486K799
$$ -3371 -1451 3108 -763 -1286 3227 -1222 -3501 2856 1664 -2964 844 1648 -2852 634 3433
6026C433n880M77N152l564j462M461k921l431N875O01n774K703K615m700K511
$$ 3433 -2447 -1970 3182 -382 -1844 2617 -304 -3735 2140 2741 -3033 -330 2285 -2415 96
6041I6L612n840o51N595k614k647M441j811m109N165J700n945J935L377m248J068
$$ 96 3708 -2132 -2783 2812 198 -2449 1992 181 -3928 1237 2937 -3008 -1073 2304 -1944 -876
6057h76M186m605k252O060j276m132M288k51m480L886K845n792P07L980l363l88
$$ -876 3310 -1295 -3547 2513 1237 -2895 1393 1142 -3338 548 3393 -2399 -1692 2288 -1075 -1463
6073a463M806l725l032N603m8m718L517P12m712L107L559n323m69N256l469r35
$$ -1463 3343 -382 -3414 2189 2141 -2577 940 1652 -3060 47 3606 -1717 -2186 3070 -399 -1334
6089a334M353k474m360N269J380n363K400K621m673J802M117m783k265N624j653
$$ -1334 3019 545 -3815 1454 2834 -2529 -129 2492 -2181 -379 3738 -1045 -3310 2314 661
6104F61k825M361j215m754M435K696n282R18L330m344J01N619m203l350N713n22
$$ 661 -2164 2197 982 -3772 663 3359 -1923 -1005 2325 -2019 -1918 3701 -502 -3852 1861 1339
6120A339l977M053J40n122L255L796n021j00L931l493p90N559l163m087N431L48
$$ 1339 -2638 1415 1555 -3567 -312 3484 -1537 -1637 2294 -1199 -1989 3570 407 -3680 1751 2099
6136B099m569L157J722n382K328M547m961j015M377k826j721M839j298n112M467
$$ 2099 -2470 687 2409 -2973 -645 3902 -1059 -2074 2303 -523 -2244 2595 1297 -3815 652
6151F52K147m941K143K220m832J022N504m085k911M699j129l091M853n29n447
$$ 652 2799 -2142 1 2221 -2611 -1589 3915 -170 -3081 1618 489 -2602 2251 1722 -3725
6166c725L614L133m764N72L721m003q02N561k821l930M690j47l979M346Q85n727
$$ -3725 -111 3022 -1742 -1170 2551 -1452 -2254 3307 486 -3444 1246 1099 -2880 1466 2351 -3376
6182c376K456M108m399m37M184l274j846N594k032m534M163J259m262L053K313
$$ -3376 -920 3188 -1211 -1648 2536 -738 -2584 3010 978 -3556 607 1866 -2396 657 2970
6197B970n578J477M442l701j908M439k282k234M768n01n153L395K351m596J993
$$ 2970 -2608 -1131 3311 -390 -2298 2141 -141 -2375 2393 1892 -3261 134 2485 -2111 -118
6212a18K903m902r0N373k877k780M358j440l312M521P06n437K223L616m232M17
$$ -118 2785 -2117 -2207 3166 289 -2491 1867 427 -2885 1636 2342 -3095 -872 2744 -1488 -1071
6228a071L672m360r84N620j945m077M217j49l731L743K275n924J310M353l642
$$ -1071 2601 -1759 -2743 2877 932 -3145 1072 923 -2808 935 3210 -2714 -1404 2949 -693
6243f93j214M726l704k319N757o08m608L063J397m314K833L262n714K5N065k896
$$ -693 -1907 2819 -885 -3204 2553 1945 -2663 400 1797 -2517 316 3578 -2136 -2111 2954 58
6259E8k014M124k239l067N197N81n160K279K412m150J685L577m797j315N432k069
$$ 58 -1956 2168 -71 -3138 2059 2640 -2520 -241 2171 -1979 -294 3283 -1514 -2829 2603 534
6275E34k842L963o55m498M694J730n660J670L560m058L02M204l828k272N011n16
$$ 534 -2308 1655 1000 -3498 1196 2926 -2734 -1064 2496 -1562 -1260 2944 -884 -3156 1855 1339
6291A339l976L576N06m768L768K789n179K87M162l171j416M907k626l547N366
$$ 1339 -2637 939 1445 -3323 445 3234 -1945 -1658 2504 -667 -2083 2824 198 -3349 2017
6306B017pm325K542J857m734J907M462n306n70M925k700k211M528j875l845M626
$$ 2017 2010 -2315 227 2084 -2650 -743 3719 -1587 -2157 2768 68 -2143 2385 510 -3335 1291
6322A291J409m973K066K458m519J437M092m165j998N114j938k369L987m61m789
$$ 1291 2700 -2273 -207 2251 -2268 -831 3261 -904 -2902 2212 274 -2095 1892 1431 -3358
6337c358L675K458m699Q91L351l705m53N217l407l218M727n6l815L558M68m645
$$ -3358 317 2775 -1924 -1033 2318 -1387 -1840 3377 -30 -3248 1479 1423 -2392 1166 1634 -3011
6353c011K560L756m793m91M266l160j225N021k285l917M236J085m189K667J897
$$ -3011 -451 3305 -1488 -1979 2287 -873 -2098 2923 638 -3279 957 2042 -2147 520 2417
6368B417m863J593M562m203j710M395k201k341M486r21m220L542K207m641J671
$$ 2417 -2446 -853 3709 -494 -2204 2191 -10 -2351 2135 1214 -3006 536 2743 -1898 -227
6383b27K609m125K13M783l149l037M700j217l096M223J26n095K408L519m092O28
$$ -227 2382 -1743 -1530 3253 104 -2933 1767 550 -2546 1677 1803 -3292 -884 2635 -1457 -829
6399h29L381m161q29N733k640l523L861K96l478L168J497n390J832M012l844o59
$$ -829 2552 -1609 -2438 3295 655 -2868 993 1289 -2189 979 2476 -2914 -1082 2930 -914 -1573
6415a573L568k732j720N066j138m501L846J108l916K532K162m828M22M810l330
$$ -1573 1995 -737 -2457 2609 1471 -3030 816 1924 -1992 540 2702 -2126 -1704 3106 -224
6430b24j704L907k044k293M188N8m755K690K760m282J359K956m449l01M970k204
$$ -224 -1928 1979 -65 -2358 1830 1888 -2867 -177 2583 -1699 -340 2616 -1833 -2134 2836 632
6446F32l276L942n49l572M115R83m855J628L664l963J83L740m161j046M987j177
$$ 632 -2644 1298 749 -2823 1292 2275 -2580 -952 2712 -1251 -1068 2672 -1489 -2535 2452 1275
6462A275m118L650L71l604L375J646n017O29M564l198j152L776k651k379N138
$$ 1275 -2843 807 1178 -2426 949 2595 -2422 -1793 2771 -427 -1579 2197 -454 -2833 2305
6477B305l13m773L146J777m049J815K944m434o75N053k772j987L967j643l074
$$ 2305 1992 -2781 365 2142 -1907 -92 2852 -1582 -2257 2796 24 -1963 2004 361 -2713
6492b713L871J358m994J905K497l732J228L740m322j557N055j604l113L308O0
$$ -2713 1158 2516 -2478 -573 1924 -1808 -580 3160 -1162 -2719 2336 732 -2381 927 987
6507I87m105L826J922m701R92L329l388k46M155l193k331M997q27m010L104Q77
$$ 987 -3118 708 2630 -2071 -1079 2250 -1138 -1384 2771 -422 -2753 2244 1417 -2593 511 1388
6523A388m272K976L194m654o05M398k757j391M266k342l331M447P92m435K466
$$ 1388 -2884 92 3286 -1368 -1973 2425 -332 -1723 2543 201 -3130 1317 2109 -2326 140
6538A40J734m065J444L840l926j211M023j644k391M013j052m009L854J882m253
$$ 140 1874 -2191 -747 3093 -833 -2044 1979 335 -2056 1957 905 -3104 750 2632 -1621
6553a621J304K265l735P24L835l253k400M515p12k953L284J62m370K916L116m905
$$ -1621 -317 1948 -1787 -1063 2772 -481 -2881 1634 922 -2031 1253 1415 -2955 -39 3077 -1828
6569a828N05L232k874m90M247k746k938L890J20l142L098Q57m668K428L392m021
$$ -1828 -1323 1909 -965 -1455 2792 46 -2892 998 1118 -2024 1074 1931 -2737 -309 3083 -938
6585i38o08L532j976j702M243k027l304L652J369m078K012K181m220J062L789
$$ -938 -1546 1986 10 -1692 2551 524 -2780 872 2241 -1837 175 2356 -1864 -802 2987
6600B987l299j608M180k149k236M021l94m680L343K085l798R20K933l691j74M309
$$ 2987 -312 -1920 2260 111 -2125 1896 1502 -3178 165 2250 -1548 -628 2305 -1386 -1560 2749
6616B749k480k898L767l58l017L020Q87m687K494L164l807n42L661l012j185M469
$$ 2749 269 -2629 1138 780 -2237 783 1670 -3017 -523 2641 -1166 -1708 1953 -1059 -2244 2225
6632B225j580l732L776P71l816K966J408m410J249L850l253j507L953k251j938
$$ 2225 645 -3087 689 1460 -2356 610 2018 -2392 -1143 2707 -546 -2053 1900 -351 -2289
6647b289M223p86l841K661K039l557J573K086l618RM359k505k220L913j522k651
$$ -2289 1934 1148 -2693 -32 2007 -1550 23 2109 -1509 -1500 2859 354 -1866 2047 525 -2126
6663b126L787L11m576K498K400l741P79L025l547p75M534j841l013L526k64l265
$$ -2126 1661 1972 -2604 -106 2294 -1447 -668 2357 -1190 -1965 2569 728 -2285 1241 977 -2288
6679b288K800J712m379J545K713l067m50L673k770k081M577p57l544K913O47l730
$$ -2288 512 2224 -2155 -610 2103 -964 -1414 2259 -511 -2592 1985 1228 -2316 597 1244 -2486
6695b486K816K074m279O10L621k382j614L817j936k670M138O6m100K396J945l824
$$ -2486 330 2404 -1875 -1265 2356 -26 -1640 2177 241 -2429 1709 1775 -2325 71 2016 -1808
6711a808J525K990m021n57M193j814k341L587j027l176L738P02m074J298K855
$$ -1808 -283 2707 -1314 -1871 2322 508 -1833 1754 727 -2449 1289 1991 -2083 -785 2070
6726B070l304L33L238l197j486M142j015l032L306r4l373K613J817l722M53L363
$$ 2070 -1234 -901 2337 -860 -2346 1796 781 -2251 1055 961 -2412 201 2018 -1704 -1251 2112
6742B112k601j521M462k501k776M359J15l768K431J156l617K035L026m001r55
$$ 2112 -489 -2010 2452 -49 -2825 1534 1649 -2119 312 1468 -2149 -114 2912 -1089 -2044
6757b044L926j905j714L939j721k895L387J099m182J929K176l573M79L740l330
$$ -2044 1882 -23 -1737 2202 481 -2414 973 2072 -2110 -181 1995 -1578 -1099 2641 -689
6772f89j455L836j423k160L388m56l678L083J849l493K69L111l336M3L843k789
$$ -689 -2144 1692 269 -1891 1497 1041 -2637 446 2295 -1198 -929 2182 -1154 -1111 2732 -57
6788e7k665M002j49l323L232M95l759J952K809l718m0L211k611j550M462j816
$$ -57 -2722 1280 1131 -2192 1040 1535 -2224 -272 2537 -1181 -1221 1990 -621 -2171 2291 475
6804D75l094L624N87l391K214J364l718J492K934l152j123L831k138j612L610
$$ 475 -2619 1005 1592 -1799 415 1779 -1939 -447 2487 -665 -1788 2043 -95 -1707 1903
6819A903r23l346L086J452l758J381K066l335M10L801k921j852L490o50k925L292
$$ 1903 980 -2366 720 2172 -1586 -205 1861 -1474 -1064 2737 -184 -2036 1454 804 -2121 1171
6835A171L61m058K257K560l281J73K943l199p22M283k001k964L475j40l007K863
$$ 1171 1532 -2526 -269 2291 -990 -817 2126 -1073 -1795 2488 487 -2477 998 858 -2149 714
6851G14J018m222K146K827l643k82L264k350j746M538j300l426L382O26l536K229
$$ 714 1732 -2490 -344 2483 -1160 -1442 1822 -528 -2274 2264 964 -2462 920 1546 -1990 239
6867B39J979m070O37L791l029j226L538j616k416L942k48l975K600J921l318R96
$$ 239 2218 -1852 -1215 2576 -453 -1679 1859 243 -2173 1769 1521 -2454 146 2067 -1251 -255
6883b55K489l477m51M072k046k475L227m18k839L200Q14m091J680K986l500j8
$$ -255 2234 -1243 -1694 2378 332 -2143 1084 666 -2173 1027 1841 -2250 -570 2416 -1084 -1102
6899a102L088k658j340M048j198l377L209M13l597K922J719m062Q87L105k512
$$ -1102 1986 -672 -2012 2036 838 -2539 670 1083 -2514 408 2127 -1935 -1048 2057 -455
6914d55r35L424k418j643L593l82l447K330J483l173J863K248m010M8L479k427
$$ -455 -1390 2034 -384 -2027 1566 1184 -2263 67 1550 -1623 240 2488 -1522 -1474 2005 -422
6930d22j197L255j288k666L427R17l987J842J958l314J124K637l485p05M271j851
$$ -422 -1619 1636 348 -2318 1109 2026 -1961 -119 1839 -1475 -351 2286 -1199 -1904 2367 516
6946E16k589L095J50l394L056J381m452J410K946l152k33L686k565k241L868l68
$$ 516 -2073 1022 1172 -2222 834 2215 -2237 -827 2119 -1033 -1266 2420 -145 -2386 1482 1114
6962A114l219K687Q23l497K305K246l844J93L505k695j227L859k108k560L814
$$ 1114 -2105 582 1405 -2092 213 2459 -1385 -1192 2313 -382 -1609 2250 142 -2418 1396
6977A396K09l644J931J689l603J887K710l855o39L958j690k151L456j176k793
$$ 1396 1605 -2039 -108 1581 -2022 -135 2575 -1280 -1919 2039 349 -1802 1654 478 -2315
6992b315K776J554m053J758K294l568N11L359k700j990L885o66k717L074k58l358
$$ -2315 461 2015 -2038 -280 2014 -1554 -1043 2316 -384 -2374 1511 845 -1872 1202 944 -2414
7008b414K969J773m206P67L075k564r80L776k239k573M281n37l121K345J253l770
$$ -2414 555 2328 -1878 -1111 1964 -600 -1580 2196 -43 -2616 1665 1128 -1993 352 1605 -2165
7024b165J869K632l353n63L569k406j322L731j406l078L392Q04l249J520J642
$$ -2165 -296 2336 -1017 -1580 1989 -417 -1739 1992 586 -2492 900 1704 -1545 -25 1617
7039A617l146Q26L519l364j307L781j719k120L602j78l981K836J684l811J176
$$ 1617 -1529 -703 2816 -548 -1855 1926 207 -1913 1689 1511 -2470 366 2050 -1761 -585
7054e85K532l188J39L773k779k293L889j200k411L282L51l662J944K542l905N28
$$ -585 1947 -1241 -1102 2671 -108 -2401 1488 288 -2123 1159 1510 -2152 -208 2334 -1571 -1043
7070a043K543k357j060M081j555l423L807N30l564K218J619l744Q79L690l599
$$ -1043 1500 -857 -1917 2164 609 -2814 993 1523 -2041 177 1796 -1948 -1069 2621 -978
7085i78p11L665j925j942L751n28l896K846J543l604J644K542l617k22M140k351
$$ -978 -1689 1976 51 -1891 1860 1332 -2564 282 1825 -1779 -135 2407 -1210 -1432 2708 357
7101C57k208L314j221k357L373k5l276J948K046l457Q28K838l326o55M155j903
$$ 357 -1851 1463 242 -2115 1258 1233 -2043 -95 1951 -1506 -678 2160 -1166 -1821 2334 431
7117D31k606L095J55l449L197J310m200J151L191l092n31L308k734j182L704r49
$$ 431 -2175 920 1075 -2374 823 2133 -2067 -916 2275 -817 -1348 1960 -774 -1956 1748 799
7133G99l106L116M77l323K085K130l624J74L361k489j294L492j429k748L993j85
$$ 799 -2307 809 1286 -2037 48 2178 -1446 -1272 2089 -400 -1694 1798 369 -2379 1614 1429
7149A429l618K222J666l257J614K293l780n9L322j473k057L268r07k653L088Q08
$$ 1429 -2189 33 1699 -1558 56 2349 -1431 -1490 1832 359 -1698 1570 663 -1990 1098 1906
7165A906m082J871K337l489M67L378k912j548L600q74k618K629Q26l566K773J252
$$ 1906 -2176 -305 2032 -1457 -990 2388 -524 -2072 1528 654 -1964 665 1491 -2075 698 1950
7181A950l915P37L462l165k37L327k439j962L893n02l357K730J087l312J714K120
$$ 1950 -1965 -1228 2234 -931 -1168 2159 -280 -2242 1651 1149 -2208 522 1609 -1703 11 2131
7197B131l476j01L337k022j598L577j338k597L153M40l503K070J748l524J267
$$ 2131 -1345 -1446 1891 -131 -1729 1848 510 -2087 1066 1506 -1997 73 1821 -1703 -436
7212d36K813l099j261M060j688k175L183n80l019K896J413l918J439K445l138
$$ -436 2377 -722 -1983 2077 389 -1786 1397 817 -2202 694 2107 -1811 -372 2073 -1065
7227a065j4L342k493k058L835p81k933K644R40l541J803K753l776K49K826k256
$$ -1065 -1079 2263 -230 -2288 1547 766 -2167 477 1417 -2124 -321 2432 -1344 -1095 1731 -525
7243e25o41L067j743k896M080k39l293K462J629l636J332K602l257p51L758k078
$$ -525 -1166 1901 158 -2738 1342 1103 -2190 272 1901 -1735 -403 2199 -1058 -1809 1949 -129
7259a29j622L424p25l490L001J553l775K049J644l454Q02L302k919j683L729j241
$$ -129 -1751 1673 948 -2542 459 2012 -1763 286 1930 -1524 -722 2580 -339 -2022 1707 466
7275D66k544L232K31l905K830J731l651P96L060l021m89L739k456k254L633m05
$$ 466 -2078 1154 1385 -2520 310 2041 -1610 -814 2246 -775 -1264 2475 19 -2235 1398 993
7291I93l011K812J080l889J634K563l195j30L162k457j206L586j337l166L236
$$ 993 -2018 794 1874 -2015 -381 2182 -1013 -1143 2019 -438 -1644 1942 605 -2561 675
7306F75Q33l134J750J557l280Q46L125l092j047L400j513j752L209n41l463K987
$$ 675 1508 -1626 124 1681 -1599 -753 2372 -720 -1767 1633 120 -1632 1577 1036 -2427 560
7322E60J470l555J280K467l205j94L279k251j529L250r78k711L186O97l719J581
$$ 560 2030 -1525 -245 2222 -983 -1177 2102 -149 -1678 1572 594 -2117 1069 1766 -1953 -372
7338c72K425l245L04K766k422j252L965j635k715L121L14l202K621J313l777R37
$$ -372 2053 -1192 -888 1878 -544 -1796 2169 534 -2181 940 1254 -1948 673 1986 -1791 -854
7354h54K853k513j028L464k244j862L779n15l616K635J690l527J859J670l312
$$ -854 1999 -514 -1542 1922 -322 -2184 1595 1080 -2536 99 1789 -1738 121 1791 -1521
7369a521L63L405k287k048L644j394k183L402R8l344J858J638l054Q45K903l270
$$ -1521 -1158 2247 -40 -2088 1556 162 -2021 1381 1479 -1865 -7 1631 -1423 -578 2325 -945
7385i45o48L785k090j656K859k46l198K784J615m406J447K912k927m48L465k607
$$ -945 -1593 2192 102 -1554 1305 1059 -2139 645 2260 -2146 -699 2213 -714 -1162 2303 -304
7401c04j823L955q97l078K860O92l494K214J994l807N90K991k462r17L252k046
$$ -304 -2127 1828 931 -2147 713 1405 -2089 125 2119 -1688 -1098 1893 -569 -1486 1766 -280
7417b80j921L660r6l711K396J807l576J441K431l349m84L361j366k080L243r99
$$ -280 -2201 1459 1363 -2348 48 1855 -1721 -280 2151 -1198 -1682 1679 313 -1767 1476 477
7433D77k753L306O65l387J178K519l288L46K911k680j174L737j163k542K947J56
$$ 477 -2276 1030 1695 -1692 -514 2005 -1283 -937 1974 -706 -1880 1857 694 -1848 1099 1255
7449A255l336K605J569l699R24K788k705o96L388k204k042L583k87l096K384J284
$$ 1255 -2081 524 2093 -1606 -682 2106 -599 -1295 2093 -111 -2153 1430 1143 -1953 431 1715
7465A715l510J481K493l111k62L411k653j064L076j269k677L106R01l643K012
$$ 1715 -1795 -314 2179 -932 -1194 2217 -436 -1500 1576 307 -2370 736 1637 -2006 6
7480FJ733l234J128K733l107r02L331j356k248L300n53k659K267J444l733J230
$$ 6 1739 -1495 -367 2366 -741 -1643 1688 332 -1916 1384 831 -1828 439 1883 -1850 -620
7496f20K681l270J38L222k108k130L623q19k516K497O22l596K200K297l832R01
$$ -620 2061 -1209 -1071 2151 43 -2087 1536 717 -1799 698 1320 -2276 -76 2221 -1611 -710
7512g10K589k441r54L779j924k417L199J74l166K199J087l337J459K736l088n12
$$ -710 1879 -562 -1516 2263 339 -2078 1121 1295 -1871 328 1415 -1922 -463 2273 -815 -1327
7528a327L208k312j417L611r32l074K871Q44k952J554J773l429L07L580k639j579
$$ -1327 1881 -431 -1848 1763 831 -2243 628 1472 -1480 74 1847 -1582 -1275 2305 -334 -1913
7544a913L451j098k255L185Q4l902K956J728l521O17K540k683o37L377j931j952
$$ -1913 1538 440 -1815 1370 1454 -2448 508 2236 -1285 -668 1872 -811 -1448 1929 -2 -1954
7560a954L415k42l121K531P99l124J236K745l038k45K781k160j611L606r76l068
$$ -1954 1461 1219 -1902 629 1428 -1696 -460 2285 -753 -998 1783 -377 -1988 1618 642 -2426
7576b426L108P70l285J798K036l653O80L180k821j099L391j400k135L229k52l122
$$ -2426 682 1452 -1833 -35 2001 -1652 -972 2208 -613 -1712 1679 279 -1856 1373 1121 -2001
7592b001K227J541l078J265K169l297j54L502k149j913L350q89k420L028M76l421
$$ -2001 226 1767 -1311 -46 2123 -1174 -1328 2174 25 -1888 1462 573 -1847 1181 1657 -1764
7608a764J368K223k992M03K635k636j062L815j304k654L000K2k699J923J599l598
$$ -1764 -396 1827 -1165 -762 1873 -763 -1825 1990 686 -1968 1032 1054 -1645 278 1877 -1721
7624a721Q20L023k749o59L130k235j628L630q94l053K901P52l190J721K060l345
$$ -1721 -901 2122 -627 -1286 1844 -391 -2019 1611 717 -2336 565 1317 -1873 -152 1908 -1437
7640a437N6L416k724j014L074j045k608L634J8l389J682K062l160J043K513k899
$$ -1437 -1381 2035 -689 -1703 1371 326 -2282 1352 1370 -2019 -337 1725 -1435 -392 2121 -778
7656g78q73L560j657j941K787j17k994K641J179l579J284L026l335j54L082k482
$$ -778 -1651 1909 252 -1689 1098 981 -2013 628 1807 -1772 -488 2538 -797 -951 2131 -351
7672c51j295L410r90k620K503K41k648K116J772l622L42L264k898n27K948j795
$$ -351 -1646 1764 774 -1846 657 898 -1750 366 2138 -1484 -1142 2122 -776 -1303 1645 -150
7688a50k002L348m6l050K136J836l613J191K321k964m63L230j541k021L325r11
$$ -150 -2152 1196 1150 -1900 236 2072 -1541 -350 1971 -993 -1456 1774 233 -1788 1537 626
7704F26k696L110M67l379J363K081k866M43K944k472j466L472j277k257K760N30
$$ 626 -2070 1040 1507 -1872 -509 1572 -1294 -851 2093 -379 -1845 1627 350 -1907 853 1383
7720A383l078K034J864l647N91K777k644o42L225j738k276L557k70k856K064J218
$$ 1383 -1695 339 2203 -1444 -853 1924 -720 -1362 1863 125 -2151 1406 1136 -1720 344 1562
7736A562l229J180K834l386l21L208k250j190L068r06k462K560O93k919J701J312
$$ 1562 -1667 -487 2347 -1039 -1360 1848 -402 -1592 1476 570 -1892 668 1361 -1558 143 1455
7752A455k926O54K919k788p25K797j151k014K843m2l216K628J307l047P93K805
$$ 1455 -1471 -817 2102 -686 -1411 1386 235 -1779 1064 1022 -2194 434 1741 -1306 -513 2292
7768B292l077l90L410k508j579L290r63k190K563M76l114J948J965k972jK338
$$ 2292 -785 -1175 2235 -273 -1852 1438 475 -1715 848 1324 -1790 158 2123 -849 -850 1488
7784A488k049r37L234j326k597L203J97k853K054J161l513J172K856k752o65K930
$$ 1488 -561 -1498 1736 410 -2187 1016 1213 -1640 414 1575 -1938 -766 2090 -662 -1327 1603
7800A603j679j629L170n06l110K576J052l074J288K317l290l6L132k070j493L039
$$ 1603 -76 -1705 1465 959 -2151 425 1477 -1597 -309 2008 -1282 -1318 1814 -256 -1749 1290
7816A290j061j828K674K64l239J878J706k896N07K399k252o66L126j622k088L194
$$ 1290 229 -1599 1075 1339 -1900 -22 1684 -1212 -705 1694 -558 -1224 1902 280 -1808 1386
7832A386p63k724K713J081l399J275K388k753j08K679k027j357L436j192k765
$$ 1386 623 -2101 612 1693 -1706 -431 1957 -796 -904 1775 -252 -1609 1827 635 -2130
7847b130K498N60k479J564J998l166J13K761k346j063K994j510j873L074K20l374
$$ -2130 368 928 -1551 13 2011 -1155 -1042 1719 -627 -1690 1304 -206 -2079 995 1215 -2159
7863b159K300J284k911J289J783k507m62L532j738k144K979q30k439L009N60l255
$$ -2159 141 1425 -1486 -197 1586 -921 -1383 2149 411 -1733 1246 416 -2023 986 1546 -1709
7879a709J442J946k924O91K468k309j202L444j177k195K472J43k794K036J448
$$ -1709 -267 1679 -1245 -554 1914 -395 -1597 1847 670 -1525 947 1090 -1704 332 1780
7894A780l030Q63K211k311o12K723j926j603L399n52k415J819R20k753J136K013
$$ 1780 -1250 -387 1824 -487 -1099 1624 -302 -1905 1494 942 -1473 346 1266 -1487 -351 1662
7910A662k774J46K567j818j042K572r06k201K461N66l039J800J479k699N64K592
$$ 1662 -1112 -966 1601 -217 -1259 1313 407 -1794 667 1233 -1806 -6 1473 -1226 -662 1930
7926A930k518j036L254j197j934K436k96k499K619Q12k892P87K105k285N0K479
$$ 1930 -588 -1624 1630 433 -1501 935 639 -1860 759 1571 -1321 -534 1571 -714 -664 1815
7942A815k258j341L258o35k270K146O13k958J693J753l047j09K893j876o95K704
$$ 1815 -443 -1784 1474 839 -1431 715 1328 -1630 63 1816 -1231 -1340 1553 -323 -1018 1686
7958A686j314k261K908J19k836J797J530l400J451K034k410m62K739j556j315
$$ 1686 372 -1889 1019 1138 -1698 99 1629 -1771 -320 1714 -696 -1158 1581 25 -1290
7973a290K479p26k517K832R01l139J212J720k399j1K665j981j398K886o98j990
$$ -1290 1189 463 -2054 778 1679 -1460 -248 1472 -927 -938 1727 -254 -1652 1234 536 -1454
7989a454K448L44l111K029J406k640M59K198k695k37L032k032j259K283n4k271
$$ -1454 994 1338 -1773 256 1662 -978 -519 1679 -1016 -1253 1779 -253 -1512 771 717 -1554
8005a554K072P76l096J749J961k664m06K693j848q49K834q07k557K157N94k600
$$ -1554 518 1294 -1802 -53 1908 -756 -1162 1531 -317 -1166 1668 861 -1696 461 1055 -1545
8021a545J873J055k773N13K526k048r49K645j171j465K572k39k780J756J243k369
$$ -1545 328 1383 -1390 -877 1649 -399 -1348 1297 126 -1339 1233 994 -1786 -30 1213 -1156
8037a156O12K037k380k69K876j769j471K702o24k136K720K2l087J579K110k808
$$ -1156 -544 1493 -887 -1156 1720 -49 -1520 1182 558 -1578 1142 1164 -1923 -344 1766 -1042
8053a042M73J917j850p93L199j600k002K370o8j871J400J498l046J010K434k770
$$ -1042 -569 1348 -502 -1295 1904 304 -1698 672 604 -1267 133 1631 -1415 -405 2029 -741
8069g41m49K952j786j644L077p81k531K336P44k353J158J562k516Q7K182j586
$$ -741 -1190 1762 -24 -1668 1409 628 -1903 433 1177 -1176 -18 1544 -972 -885 1297 -289
8085b89j262K821j010j742K511J19k738J637J377k711P19K094k380m36K841j266
$$ -289 -1551 1270 260 -1482 1029 1148 -1590 47 1424 -1287 -568 1526 -854 -1290 1551 285
8101B85j919K523j19k598K347O15k712J188K018k127n23K640k118p51K611o85
$$ 285 -1634 889 770 -1828 519 1134 -1578 -390 1628 -499 -1022 1618 -500 -1251 1360 675
8117F75k111J930K79k255J882J357l012P38K163k215l80K306j213j743K617n6
$$ 675 -1436 494 773 -1482 400 1757 -1255 -517 1646 -569 -949 1357 144 -1599 1018 962
8133I62k216J284J046k395R19K205k653m80K879j435j598K581q75j974K203J050
$$ 962 -1254 30 1076 -1319 -400 1805 -848 -1328 1551 116 -1482 1099 224 -1750 453 1503
8149A503k914J024J729k288N43J900j674j409K709o25k007K275K97k570J687J847
$$ 1503 -1411 -387 1342 -946 -403 1497 -177 -1586 1123 498 -1509 766 1063 -1507 180 2027
8165B027l087K67K020j765l75K454j444j709K776r4k606J983Q89k669J377J757
$$ 2027 -1060 -793 1227 -538 -913 1541 97 -1612 1164 1070 -1536 447 1336 -1333 44 1801
8181A801k472l01K403j737j037K327m67k262K532L43
$$ 1801 -671 -972 1431 -306 -1343 984 517 -1745 787 1130
8191A130
$$ 1130
$$ Imaginary data points
##PAGE= N=2
##DATA TABLE= (X++(I..I)), XYDATA
0@%%%Qj6QqJ6j6K4m0M8n5P0q3R7j17J37j62J95k27K61l04L52m03M61n27N97o76
$$ 0 0 0 0 8 -8 0 -8 8 -8 16 -24 24 -31 39 -44 53 -64 73 -89 106 -121 140 -164 188 -215 246 -281 316 -360
29c60P67q63R68j086J215j355J511j682J865k067K293k541K813l114L446l818
$$ -360 407 -456 512 -574 641 -714 797 -885 980 -1087 1206 -1335 1478 -1636 1810 -2008
45b008M238m711N248n864O581p431Q453r703J1281j3349J6182k0316K6945l9268
$$ -2008 2230 -2481 2767 -3097 3484 -3947 4506 -5197 6084 -7265 8917 -11399 15546 -23722
59b3722O9689k75809m85449N31766L98518m6167k68351k84499j1791M60141J89280
$$ -23722 45967 -229842 -715291 -183525 214993 168826 -99525 -384024 -395815 64326 253606
70B53606k96504j69404N0464k0923J87355K20720k18216k75351J25486J67699
$$ 253606 -42898 -212302 -161838 -182761 4594 225314 7098 -268253 -142767 24932
80B4932Q9017O2973k44537k67877L03590L48868k13500k82538K3501J03721J91915
$$ 24932 113949 176922 -67615 -335492 -31902 316966 103466 -179072 -155571 -51850 140065
91A40065R7457l03826k07199K81931J78431j37313m2539n1496j38334J50913K15118
$$ 140065 237522 -66304 -273503 8428 186859 49546 7007 -44489 -182823 -31910 183208
102A83208j36855j41880L1279n0877P9361K43058j28138l24960P3769K19253K2921
$$ 183208 46353 -95527 -64248 -115125 -35764 207294 79156 -245804 -172035 47218 70139
113G0139l884j15475j99594J69512K92908j50711k21523Q6976M9817q55J19042
$$ 70139 66255 -49220 -248814 -79302 213606 62895 -158628 -71652 -21835 -22690 96352
124I6352p7849j95608J22112J53955j00696o416N3539j36169J8122K05147o2550
$$ 96352 18503 -177105 -54993 98962 -1734 -8150 45389 -90780 -72658 132489 69939
135F9939j50356O7135Q26l4522J64827n229k37183M8779J93187o0766m8732M5007
$$ 69939 -80417 -13282 -12456 -46978 117849 112620 -124563 -75784 117403 56637 7905 52912
147E2912j09459l674J90501n4500j62784J02332N8427r9264O8144M9467j40656
$$ 52912 -56547 -60221 130280 75780 -87004 15328 73755 -25509 42635 92102 -48554
158d8554L4350J26633j16375n0616J37032n3963r1915J28035N569j29230P5473
$$ -48554 -14204 112429 -3946 -54562 82470 28507 -63408 64627 70196 -59034 16439
169A6439N7820j10351M2609O6093j38918J0590J65057q4945j17149J07037J5810
$$ 16439 74259 -36092 6517 72610 -66308 -55718 109339 24394 -92755 14282 30092
$$ [...]
##END NTUPLES=NMR FID
##END=
