##TITLE=1H_Pr 6-1 mat
DMSO+CDCl3
 8 sc, 
 12.3.2024
##JCAMPDX= 6.0         $$ Bruker NMR JCAMP-DX V2.0
##DATA TYPE= NMR FID
##DATA CLASS= NTUPLES
##ORIGIN= UXNMR, Bruker Analytische Messtechnik GmbH
##OWNER= root
$$ XWIN-NMR		Version 3.5
$$ Tue Mar 12 16:34:29 2024 Russian Standard Time (UT+4h)  she@DPX200
##.OBSERVE FREQUENCY= 200.1313
##.OBSERVE NUCLEUS= ^1H
##.DELAY= (6, 6)
##.ACQUISITION MODE= SIMULTANEOUS
##.ACQUISITION SCHEME= undefined
##.AVERAGES= 8
##.DIGITISER RES= 18
##SPECTROMETER/DATA SYSTEM= spect
##.PULSE SEQUENCE= zg30
##.SOLVENT NAME= D2O
##.SHIFT REFERENCE= (INTERNAL, D2O, 0, 15.7039)
##AUDIT TRAIL= $$ (NUMBER, WHEN, WHO, WHERE, WHAT)
$$ ##TITLE= Audit trail, XWIN-NMR		Version 3.5
$$ ##JCAMPDX= 5.01
$$ ##ORIGIN= Bruker BioSpin GmbH
$$ ##OWNER= she
$$ F:/spectra/data/she/nmr/H-F/1/audita.txt
$$ ##AUDIT TRAIL=  $$ (NUMBER, WHEN, WHO, WHERE, WHAT)
(   1,<2024-03-12 16:33:31.82 +0400>,<she>,<DPX200>,
      <created by zg, POWCHK disabled, PULCHK disabled
       configuration hash MD5:
       00 E9 B6 7A A2 85 ED C7 34 08 36 98 17 FE 4E 26
       data hash MD5: 16K
       B1 C3 E7 8B C0 D9 ED BC 15 ED 2E B4 D5 A6 52 B4>)
$$ ##END=
$$ 
$$ hash MD5
$$ FE 57 71 2E EE D8 9D 00 E7 28 4E FB B7 C6 76 2F
##$RELAX= 
##$RELAX= 
##$RELAX= 
##$RELAX= 
##$RELAX= 
##$RELAX= 
$$ Bruker specific parameters
$$ --------------------------
##$DU= <F:/spectra>
##$EXPNO= 1
##$NAME= <H-F>
##$PROCNO= 1
##$TYPE= <nmr>
##$USER= <she>
##$AMP= (0..31)
100 100 100 100 100 100 100 100 100 100 100 100 100 100 100 100 100 100 
100 100 100 100 100 100 100 100 100 100 100 100 100 100 
##$AQSEQ= 0
##$AQ_mod= 1
##$AUNM= <au_zg>
##$AUTOPOS= <>
##$BF1= 200.13
##$BF2= 200.13
##$BF3= 200.13
##$BF4= 200.13
##$BF5= 200.13
##$BF6= 200.13
##$BF7= 200.13
##$BF8= 200.13
##$BYTORDA= 1
##$CFDGTYP= 0
##$CFRGTYP= 5
##$CHEMSTR= <none>
##$CNST= (0..31)
1 1 145 1 1 1 1 1 1 1 1 1 1 1 1 1 1 1 1 1 1 1 1 1 1 1 1 1 1 1 1 1 
##$CPDPRG= <>
##$CPDPRG1= <>
##$CPDPRG2= <>
##$CPDPRG3= <>
##$CPDPRG4= <mlev>
##$CPDPRG5= <mlev>
##$CPDPRG6= <mlev>
##$CPDPRG7= <mlev>
##$CPDPRG8= <mlev>
##$CPDPRGB= <>
##$CPDPRGT= <>
##$D= (0..31)
0 1.2 0 0 0 0 0 0 0 0.06 0 0.03 0 0 0 0 0.0002 0 0 0 0 0 0 0 0 0 0 0 0 
0 0 0 
##$DATE= 1710246811
##$DBL= (0..7)
120 120 120 120 120 120 120 120 
##$DBP= (0..7)
150 150 150 150 150 150 150 150 
##$DBP07= 0
##$DBPNAM0= <>
##$DBPNAM1= <>
##$DBPNAM2= <>
##$DBPNAM3= <>
##$DBPNAM4= <>
##$DBPNAM5= <>
##$DBPNAM6= <>
##$DBPNAM7= <>
##$DBPOAL= (0..7)
0.5 0.5 0.5 0.5 0.5 0.5 0.5 0.5 
##$DBPOFFS= (0..7)
0 0 0 0 0 0 0 0 
##$DE= 6
##$DECBNUC= <off>
##$DECIM= 32
##$DECNUC= <off>
##$DECSTAT= 4
##$DIGMOD= 1
##$DIGTYP= 9
##$DL= (0..7)
0 120 120 120 120 120 120 120 
##$DP= (0..7)
150 150 150 150 150 150 150 150 
##$DP07= 0
##$DPNAME0= <>
##$DPNAME1= <>
##$DPNAME2= <>
##$DPNAME3= <>
##$DPNAME4= <>
##$DPNAME5= <>
##$DPNAME6= <>
##$DPNAME7= <>
##$DPOAL= (0..7)
0.5 0.5 0.5 0.5 0.5 0.5 0.5 0.5 
##$DPOFFS= (0..7)
0 0 0 0 0 0 0 0 
##$DQDMODE= 0
##$DR= 18
##$DS= 0
##$DSLIST= <SSSSSSSSSSSSSSS>
$$ [...]
##$SUBNAM2= <"">
##$SUBNAM3= <"">
##$SUBNAM4= <"">
##$SUBNAM5= <"">
##$SUBNAM6= <"">
##$SUBNAM7= <"">
##$SUBNAM8= <"">
##$SUBNAM9= <"">
##$SW= 18.0517328524113
##$SWIBOX= (0..15)
0 0 2 0 0 0 0 0 0 0 0 0 0 0 0 0 
##$SW_h= 3612.71676300578
##$TD= 16384
##$TD0= 1
##$TE= 0
##$TE2= 300
##$TE3= 300
##$TEG= 300
##$TL= (0..7)
0 120 120 120 120 120 120 120 
##$TP= (0..7)
150 150 150 150 150 150 150 150 
##$TP07= 0
##$TPNAME0= <>
##$TPNAME1= <>
##$TPNAME2= <>
##$TPNAME3= <>
##$TPNAME4= <>
##$TPNAME5= <>
##$TPNAME6= <>
##$TPNAME7= <>
##$TPOAL= (0..7)
0.5 0.5 0.5 0.5 0.5 0.5 0.5 0.5 
##$TPOFFS= (0..7)
0 0 0 0 0 0 0 0 
##$TUNHIN= 0
##$TUNHOUT= 0
##$TUNXOUT= 0
##$USERA1= <user>
##$USERA2= <user>
##$USERA3= <user>
##$USERA4= <user>
##$USERA5= <user>
##$V9= 5
##$VALIST= <valist>
##$VCLIST= <CCCCCCCCCCCCCCC>
##$VD= 0
##$VDLIST= <DDDDDDDDDDDDDDD>
##$VPLIST= <PPPPPPPPPPPPPPP>
##$VTLIST= <TTTTTTTTTTTTTTT>
##$WBST= 1024
##$WBSW= 4
##$XGAIN= (0..3)
0 0 0 0 
##$XL= 0
##$YL= 0
##$YMAX_a= 274244
##$YMIN_a= -428668
##$ZGOPTNS= <>
##$ZL1= 120
##$ZL2= 120
##$ZL3= 120
##$ZL4= 120
##$ABSF1= 10
##$ABSF2= 0
##$ABSG= 5
##$ABSL= 3
##$ALPHA= 0
##$AQORDER= 0
##$ASSFAC= 0
##$ASSFACI= 0
##$ASSFACX= 0
##$ASSWID= 0
##$AUNMP= <proc_1d>
##$AZFE= 0.1
##$AZFW= 0.1
##$BCFW= 1
##$BC_mod= 2
##$BYTORDP= 1
##$COROFFS= 0
##$CY= 11.3945322036743
##$DATMOD= 1
##$DC= 2
##$DFILT= <>
##$DTYPP= 0
##$F1P= 15.7292609196834
##$F2P= 12.9074282941183
##$FCOR= 0.5
##$FTSIZE= 0
##$FT_mod= 4
##$GAMMA= 1
##$GB= 0.15
##$INTBC= 1
##$INTSCL= 1
##$ISEN= 128
##$LB= 0.24
##$LEV0= 0
##$LPBIN= 0
##$MAXI= 10000
##$MC2= 0
##$MEAN= 0
##$ME_mod= 0
##$MI= 1.114404
##$NCOEF= 0
##$NC_proc= 0
##$NLEV= 6
##$NOISF1= 3.799351
##$NOISF2= 2.8
##$NSP= 1
##$NTH_PI= 0
##$NZP= 0
##$OFFSET= 15.70392
##$PC= 1
##$PHC0= -25303.67
##$PHC1= 11.98731
##$PH_mod= 1
##$PKNL= yes
##$PPARMOD= 0
##$PSCAL= 0
##$PSIGN= 0
##$REVERSE= no
##$SF= 200.130013532006
##$SI= 16384
##$SIGF1= 3
##$SIGF2= 2
##$SINO= 400
##$SIOLD= 16384
##$SREGLST= <1H.CDCl3>
##$SSB= 0
##$STSI= 0
##$STSR= 0
##$SW_p= 3612.71676300578
##$SYMM= 0
##$S_DEV= 0
##$TDeff= 0
##$TDoff= 0
##$TI= <>
##$TILT= no
##$TM1= 0
##$TM2= 0
##$TOPLEV= 0
##$USERP1= <user>
##$USERP2= <user>
##$USERP3= <user>
##$USERP4= <user>
##$USERP5= <user>
##$WDW= 1
##$XDIM= 8192
##$YMAX_p= 0
##$YMIN_p= 0
$$ End of Bruker specific parameters
$$ ---------------------------------
##NTUPLES= NMR FID
##VAR_NAME=  TIME,          FID/REAL,        FID/IMAG
##SYMBOL=    X,             R,               I
##VAR_TYPE=  INDEPENDENT,   DEPENDENT,       DEPENDENT
##VAR_FORM=  AFFN,          ASDF,            ASDF
##VAR_DIM=   8192,          8192,            8192
##UNITS=     SECONDS,       ARBITRARY UNITS, ARBITRARY UNITS
##FACTOR=    0.0002768,     1,               1
##FIRST=     0,             0,               0
##LAST=      2.2672688,     0,               0
##MIN=       0,             -428668,         0
##MAX=       2.2672688,     274244,          0
$$ Real data points
##PAGE= N=1
##DATA TABLE= (X++(R..R)), XYDATA
0@%%%%%%%%%%%%%%%%%%%oJ0j2J6j6J6j6K0k5K9l4L7m0M8n4N6o2P0p8Q8j00J09
41E6j17J30j46J60j76J94k12K34k60K86l14L49l86M26m74N32o00O80p77R00j059
62e74J271j566K003k698L934o557J4216p6705l61992L6974L12916K43313O8360
75B32895p1720n1489M3429m1025k17496j53337Q5809J79215J41881N6360j08728
86I5794j56933l7345j4611n4454J5459J06175J32939J09433j7288j83188j50089
97a54108M4525Q4669N741L2870Q3012P1272K457j61175k21361n628K03863J34429
109A20566m0992q2803k3181M2576N1820o8678j46590N853J54671J12673J4983
120A40898p6233j16144k4061O6961O969o6210Q709J03996P6154j8609j24897j38186
$$ y = [0, 0, 0, 0, 0, 0, 0, 0, 0, 0, 0, 0, 0, 0, 0, 0, 0, 0, 0, 0, -6, 4, -8, 8, -8, 8, -8, 12, -13, 16, -18, 19, -21, 27, -27, 29, -33, 37, -41, 47, -53, 56, -61, 69, -77, 83, -93, 101, -111, 123, -137, 149, -165, 184, -202, 224, -250, 282, -318, 362, -415, 485, -574, 697, -869, 1134, -1564, 2370, -4187, 10029, -66676, -428668, -391694, -78778, 164535, 232895, 161175, 109686, 153115, 112090, -105406, -258743, -172934, 6281, 148162, 204522, 95794, -61139, -98484, -113095, -167549, -152090, -45915, 87024, 196457, 179169, -4019, -154108, -109583, -24914, -19173, 13697, 96709, 167981, 170438, 9263, -212098, -217726, -13863, 120566, 79574, -3229, -26410, 16166, 67986, -692, -147282, -141429, 13242, 125915, 140898, 64665, -51479, -75540, -8579, -1610, -67820, -59111, 44885, 121039, 102430, -22467, -160653]
132a60653L5238J52008M0041o2074k0180M3681M6334j9676j01217p1581P3516
143d4563J26381R789o5177l2006k738K1541N740p0325n0360O6996J00621K1157
155H7056o1488q4752l5862N8780P5856k5086n4124L9161O7056M404o0256q0878
167g0133J3J01533N8392o1851o7594K4150N3776K73n2688o6414P458R9413M9429
180G5757n5929n5551m564K8309L2993j3105n0278M224Q2076M4285n6377p5665
192d3825k4195M6287Q1832j68q5357k5672O1465M3079k7800o3201k9899M4299
204b3155P3388p80o9267j9483M1279K0737j0873l3528k6079M0331O3078q260o0944
217a3556k9615K0330L4435J5759k4229l5900K8742N5306k1129o2110j8070L3721
$$ y = [-160653, -125415, 26593, 66634, 4560, -15620, 28061, 74395, 54719, -46498, -118079, -44563, 81818, 91607, 26430, -5576, -8314, 13227, 18967, -51358, -101718, -34722, 65899, 87056, 25568, -59184, -95046, -36266, 39590, 14504, -39620, -459, 66597, 71001, 10745, -70133, -70120, 31413, 89805, 27954, -39640, -15490, 38286, 38559, -14129, -80543, -73085, 26328, 75757, 19828, -35723, -40287, -11978, 21015, 7910, -42368, -38144, 43932, 88217, 31840, -43825, -68020, -21733, 60099, 59931, -25426, -51098, 10367, 53446, 25646, -37555, -67454, -23155, 50233, 49453, -19814, -39297, 1982, 22719, 11846, -21682, -47761, -7430, 55648, 47388, -13556, -43171, -22841, 11594, 27353, 3124, -32776, -4034, 51272, 30143, -31967, -50037, -16316]
229a6316N4881J2186n9373m5177M1932O2629j5722o2951k5951K6472N8805K8823
241F0238n3635n5125K0806M2106P416k2657k7483M901M7180K9961m3508n6756
253d6556J1381M5947K6031j1007m6181j4000N0890K8900m0865m5051R660M2644
265A1793K3543j9277m3529o547M9106J9708m2439l0437J3572L7054K9467j9424
277B2590n0128j0182M1043K9313j8861k9209m846K2650L3712j0726n4195j2281
289d1120M3149L2663j1322l9053j9117L0668M0500j1702n4638j5686M3817L6067
301C4226o152l5689k7811K2780L9863o527l6820j3320K5718L1702K88l0992k8688
314c1422J3805M0421K619l1458j6442J3119L0882Q002l4543l0304J6175L9607
$$ y = [-16316, 38565, 50751, -8622, -53799, -11867, 50762, 35040, -27911, -53862, -27390, 31415, 60238, 6603, -48522, -27716, 14390, 21806, -851, -28334, -23433, 23747, 53708, 10200, -46556, -35175, 10772, 36803, 25796, -20385, -34385, 16505, 45405, 4540, -40511, -30851, 11793, 35336, 16059, -27470, -34017, 15089, 34797, -7642, -38079, -24507, 12547, 42014, 22590, -27538, -37720, 3323, 32636, 13775, -15434, -20280, 2370, 36082, 25356, -28839, -41120, 2029, 34692, 23370, -15683, -34800, -4132, 36368, 24666, -29972, -45658, -1841, 34226, 28074, -7615, -35426, -12646, 27217, 20690, -16130, -29450, -3732, 27970, 28258, -2734, -31422, -17617, 22804, 25423, -6035, -22477, -9358, 21524, 29526, -5017, -35321, -19146, 20461]
326B0461O940l3622k2890J5917L2641Q741l4553l0870K0819L9719Q720k9484l0656
339b8117R378L4355J3623k3650l1562P195L4419J2722k0807l0198k159L1738J8197
352B5134j8416k7930o40L0912J7574k1245k8491j039L0943K3294j8805l1442j506
365b1657K9003K0733j9232l0756r10K7594K4277j3480l5088n924K6882K1527q972
378A3997k9677q605K4243K4957o218l2216j1845K3779K1955m764k4274j5688K0331
391d025K6871o886k9155j2520K0764K4885l034k4592j7031J7007L1648l730k9874
404i672j2279J4812K5771M412k6425k0521J4196K8185J701k6067j5519R445K2019
417A0058J0939k3444k3173J4154K5217L650j8194j7923N936K4964J1700k1005
$$ y = [20461, 27401, -6221, -29111, -13194, 19447, 28188, -6365, -37235, -16416, 23303, 32023, 2539, -28117, -18739, 15616, 29239, 5589, -25973, -18778, 15641, 28363, 7556, -22642, -24801, 6937, 25134, 6718, -21212, -21852, 9060, 26634, 5389, -23102, -24141, 6802, 30096, 11291, -20151, -21657, 7346, 28079, 8847, -21909, -22819, 4775, 29052, 15572, -19516, -25440, 1442, 22969, 13997, -15680, -24285, -42, 24915, 18697, -13519, -25364, -1585, 20370, 15606, -8668, -24356, -4025, 22846, 15960, -13195, -25715, -4951, 19934, 16900, -7692, -24723, -7716, 23932, 20202, -9672, -21951, -7139, 18632, 23044, -3381, -23902, -9706, 18479, 20180, -5887, -21406, -11961, 10058, 20997, -2447, -25620, -11466, 13751, 17401, -793, -18716, -12780, 12184, 23884, 2879]
429B879k4232J1184K5460M155j5480k1680k05K9004J2850k2899k2856N714K3053
442F947J0895j2756k3107l140K8153J6858j9835j9610K471J6357J6626p578k5918
455a3637l820K3772J4921j4390k0160k311J3722J9623m474k9479m363K4607J2909
468A6920q590j8144r473J6172K3477n258k7625n777K1760J1976m974j5178j5196
481a9910J4202K5636p501k3767m809J3254J4412J652j6400j6772J3402K6370n057
494A4712k2772n373O656J6616J0081k1308k0673J4431K2663k012j7514j0608L362
507a1739J8086J3267j9636k1178J4922J7744j364q140j2865o72K1971J0634k0648
520C82j7485J1740J4942Q31n998j6198m891K6047J0455k3245j3491O787J1802
$$ y = [2879, -21353, -10169, 15291, 19446, 3966, -17714, -17919, 11085, 23935, 1036, -21820, -16106, 6947, 17842, 5086, -18021, -21161, 6992, 23850, 4015, -15595, -13124, 3233, 19859, 12281, -13637, -17457, 6315, 21236, 6846, -13314, -15625, -1903, 17720, 13246, -16233, -20596, 4011, 16920, 8330, -9814, -19287, -3115, 20362, 15104, -12521, -18298, 3462, 15438, 10464, -4714, -19910, -5708, 19928, 12427, -11340, -16149, -2895, 11517, 13169, -3231, -20003, -6601, 19769, 14712, -8060, -13433, -6777, 9839, 19920, -1388, -22061, -7630, 15033, 13021, -4493, -15101, -11739, 6347, 19614, -22, -21200, -6278, 11466, 10102, 1962, -10903, -11575, 10396, 21030, 382, -17103, -5363, 9579, 10410, 4412, -11786, -16677, 9370, 19825, -3420, -16911, -10124, 1678]
533A678J0860m421k1545n251K6085J2578j8739j1695J464P074J8224q94k6674
546a1256m085K1969P590j0913r708m447O245J8093j804k6228n59K1963K611p158
560B313o520r619J0031K1394o822k3563m5J7057N370j314q392j7033R218K5955
574A8030o960k1213n06O925R412P913j2246j9700J1025K4469o058j7452p38K528
588d571Q943J1870j6345j8939J5403J6840q304j0089k899l50J1912J1732j6389
601a186j7448J5086J3901m619k150q912o734J8449J3216j7681j5260Q570J0180
614E412K166q57j4206r244K1844J1673k0612r907Q425O045P181j065j7185k729
628a3059K0935P074j6943n820N103K136J1173J243k2056k614J9436L447q959n346
$$ y = [1678, 12538, 8117, -13428, -18679, 7406, 19984, 1245, -10450, -8986, -1912, 16312, 15418, -11256, -15341, 6628, 14218, 3305, -6403, -10850, -4605, 13488, 11684, -14544, -15103, 6860, 9471, 2313, -4207, -13826, -3795, 17599, 10777, -12786, -12831, 4226, 9596, 8282, -110, -17143, -7925, 18030, 11070, -10143, -10649, -3724, 5688, 13601, 1355, -18345, -7320, 17149, 11091, -6361, -7099, -4571, 4372, 16242, -103, -19042, -3639, 13201, 4897, -5192, -8091, -8441, 3471, 15203, -1186, -18634, -3548, 10353, 5734, 3584, -5328, -12062, 6387, 19603, 1922, -13338, -4768, 5412, 7578, 6721, -7485, -16729, 5115, 16788, -3824, -13731, -5306, 739, 7920, 6855, -10330, -13059, 7876, 14950, -1993, -7813, -2710, -574, 10599, 11842, -10214, -12828, 6608, 10055, 1096, -4250]
642d250n390L065J7422J316k2589l900J8183L699l167l563j2441O085K0436m899
656A0007j9722R24J2350K285l94n329j2403O738J9288p782j5979L789M752M050
670B574P365q933j4690Q994J7091m582j1963o84P16O870J1530j3284j7088J2385
684c699J3609n513o348n029k010J1959J0086j3611j3198J1423R728l626k70o754
698c253o709J5137R198j4689q642O960M685K357K71j1455o931J6716Q724j5469
712c100n949N324K601P787L04j5265j630J6883L642j1702l397K126Q86R705O95
727H910j7765j027J5175J037n136k737p073K756J5173m39j6967k307J3002K932
741E534q58l065j0983M682J7296o286j4717L495P057J413M40m538q855N990J3268
$$ y = [-4250, -9640, -6575, 10847, 12163, -10426, -14326, 3857, 7556, 4389, 826, -11615, -5530, 14906, 10007, -9715, -8791, 3559, 5844, 5450, 121, -12282, -5544, 13744, 5962, -10017, -6228, -1476, 2574, 9939, 1006, -13684, -4690, 12401, 7819, -4144, -4828, -4112, 2758, 14288, 1004, -16084, -3699, 9910, 4397, -1951, -6980, -8990, 2969, 13055, -556, -13754, -2331, 7397, 3771, 3501, -3253, -9962, 5175, 14373, -316, -8958, -1998, 2687, 5044, 5315, -6140, -13071, 3645, 12369, -3100, -9049, -3725, -1124, 6663, 6967, -8298, -9928, 6955, 10597, -1105, -4502, -2376, -1490, 8215, 8910, -8855, -9882, 5293, 6330, 1194, -1543, -8616, -5860, 9313, 8874, -8093, -10400, 2602, 5534, 4676, 1611, -9372, -4690, 12606, 6320, -8397, -4902, 2155, 3568, 4008, -530, -9385, -3395, 9873]
756I873p275j0609N433K139J438P642p350j1859Q150J1695l274p635k195j488
770e315P503J0815j1132j6309R636J1868l447l938n601k554J1716P185j1382q718
784i673R094O485m165R6k732m687R751M975j1181l234N111N63K063J300q003n653
800i890J1669P648j0433o034K653K746R127M45j5768k120J5288M718q796n756
814d503M50L533P086q75j2856N4J1436n20m383j5l788P87Q358n48q515n70O345
831A476J910R0j626q497K004J2999j912j1353r96M993N302J406p771p304O105
846c174J1707m051j0285J547M679K633K656o219o187O580N909k872l683j882m7
861b689L690M891m585q757L596P036k59j727n549k407R320N621p187p505L318
$$ y = [9873, 2598, -8011, -2578, -439, 999, 8641, 1291, -10568, -2418, 9277, 6003, -1632, -3827, -5315, 2188, 13003, 1871, -14438, -4802, 7066, 3619, -319, -5920, -8474, 3242, 10427, -955, -9673, -579, 5906, 1741, 1837, -895, -5582, 4169, 9144, -2037, -5271, -160, 403, 2466, 3766, -4237, -9890, 1779, 9427, -1006, -7040, -4387, -1641, 7486, 7931, -7837, -9957, 5331, 10049, 1253, -4503, -4053, -520, 6566, 5691, -7165, -7111, 4325, 3805, -578, -593, -4381, -3594, 4764, 4216, -4299, -4869, 1476, 3386, 3476, 1850, -6647, -4643, 8356, 6444, -4909, -5905, -912, 4390, 5796, -1975, -9279, -3174, 8533, 4482, -5803, -4256, 423, 3056, 5712, -507, -6694, -114, 5795, 2923, -760, -2642, -2689, 1001, 5892, 1307, -7450, -3854, 3182, 2923, 1196, -4353, -6760, 2560, 8181, 994, -6511, -3193]
876c193P614J233l998n027q37Q531K918q916l686M055K640J647k619m657L00N231
892A236L258m604m034J377K914M513j54q496j495P530M047k754o200k512N272
907a02N978j929q566j904P725L273k787l893k622M339N412k906m746j98L618K976
923C668j552l064k454K056N250j382n177j183K322M481R26o243l536M090O012
938D214O53o698k958L961N043J174n934m457M431M480j85m129m050K254M705J03
954B607k972m230J525M794J003k625l557K80N454J976l562l131j94N645K816n093
970G36m301J027M603K594m577m353P11M427K937m026m295J900L103K870j414n181
986c239M22M496K022j772l809o60L502K768p76n596j892N574J945j883k839k983
$$ y = [-3193, 4421, 5654, 1656, -3371, -4208, 4323, 7241, -1675, -5361, -1306, 1334, 2981, 362, -4295, -3995, 1236, 4494, -110, -4144, -2767, 147, 4660, 4506, -3990, -5485, 2045, 6092, 3338, -2862, -5374, -102, 5876, 3947, -4619, -6523, 1202, 4475, 1688, -2205, -4827, -488, 4924, 2018, -2728, -2926, 692, 3668, 2116, -948, -3402, -1346, 3904, 2522, -2655, -3838, -1516, 2965, 3891, -2352, -5888, -1798, 4214, 4867, -1831, -4789, -828, 4215, 5389, -545, -5002, -571, 3909, 3724, -405, -4455, -2201, 2504, 2607, -365, -4595, -3070, 1724, 2727, 102, -3455, -3175, 2279, 4255, 693, -2438, -2632, 3013, 5829, 736, -3565, -2538, 2065, 4659, 82, -4271, -3560, 867, 3804, -222, -4517, -2617, 486, 3356, 1942, -3239, -2817, 1679, 3701, 1929, -1880, -2540, 962, 3730, 2954, -2642, -4534, 1040, 2985, 1102, -1737, -4720]
1002d720L513N564k315m899r04M074L357j283k970k451K142N702j906n441P65
1017a772J445K085R71m185l039L088M704j198m935M70J758J676K715m215m442
1032d874M956M253j590k861k393M52L891K197m393n133L820M376j885o11k326
1047b121k280N633L053m868k562K831K507k11m21k472k015N406K591o434j622
1062b985L105k13J669J31n437n64N967J689m624j783J847J49L894J469p192r66
1078c844O985j43k677n29j877P42M816j66o875k5N974j164k480J239l085J152
1094a957O228k525n723K288L621q30J60m5m202J162P015k689o291K532J046m15
1110f25L943k424o256L653N935k641l973J689L6M12M377l215o030N455M143m883
$$ y = [-4720, -1207, 4357, 2042, -2857, -3761, 313, 3670, 2387, -583, -3034, -892, 4810, 2904, -2537, -1772, -327, 1758, 2729, -1456, -4495, -1407, 3297, 2099, -2836, -2366, -608, 1068, 3783, -432, -4874, 82, 4335, 2745, -116, -2509, -2057, 1834, 4031, -362, -5495, -1675, 2701, 816, 205, -2121, -4401, 1232, 4285, -583, -3145, -314, 2193, 1982, 1561, -911, -2926, 2480, 5071, -1363, -2985, 120, -93, 1576, 1707, -3730, -4294, 1673, 3362, -1262, -3045, -1198, -1049, 2845, 4314, -2878, -3844, 3141, 2998, 321, -208, -2085, -1343, 3473, 3307, -3568, -3593, 2381, 1217, -1263, -24, -3109, -1957, 4271, 1746, -3977, -1689, 1932, 1102, 1262, 1217, -2985, -1823, 5192, 2503, -3788, -1256, -210, -625, 3318, 894, -5362, -1709, 4226, 1585, -2388, -699, -663, -251, 4126, 911, -5119, 336, 4479, -404]
1126d04l96J137k113K040L200m164m436N336K826l888J257n56m377N409M873o602
1142h58k722M275R82j5J228l542l969N893L981p014j336M219k214R79K529n642
1158c226j063O582K41m789J241K203k346K465K849o350r52O948j432l234K042
1173A179k527j257N655J81p463L39O338j311k191J926l846M9P730k319o486L556
1189d47K702k550J517N07m278P18N827k884m622L984k12k389M724j355o044L722
1205a080N033l333k118J591j093O56N036l429o707N722L860n181M57R26l334L108
1221A14L342m890k748N324Q93l715K124N10m568M718M187o494j160M302j778K09
1237C70K831l752l696N676K563o042o56L089k368J983L236o246j265P335p80m465
$$ y = [-404, -800, 337, -1776, 264, 3464, -700, -5136, 200, 3026, -862, 395, -161, -4538, 871, 5744, -858, -3580, 695, 1677, 1662, 2890, -652, -4621, 1272, 5253, -1761, -3097, 1122, -1092, -113, 2416, -3226, -4289, 2293, 2534, -2255, -1014, 1189, -1157, 1308, 4157, -2193, -3145, 3803, 2371, -863, 1179, -1348, -2605, 3050, 3231, -4232, -3893, 2445, 1134, -1057, 869, -2977, -2928, 4802, 2483, -4003, -447, 2255, -295, 1222, 1729, -2549, -1831, 3996, 1112, -3510, 474, 262, -2127, 2597, 1242, -4802, -1080, 3953, 620, -1498, 93, -1000, -344, 4692, 1263, -5444, 278, 4138, -1043, -586, 340, -2994, 114, 3456, -1434, -4182, 1142, 2035, -1680, 444, 954, -3614, 1104, 5291, -1203, -2363, 1939, 161, 370, 3201, -551, -4247, 1429, 3992, -2050, -2706, 383, -1985, -2, 3234, -3012, -4277, 3058, 2278, -2187]
1253b187K124P48j991L008K087n979j59O204k901k865L639k444j995N331m97n889
1269c766J472M108k103j19K294m231m22P282j896o311L537J627k438K991k67n321
1285c563K081N286l547l604L888j40k551M130r22n457M414L639m509j85K445j898
1301d93j16M155k568m751M228K612m557J453Q71m507L050M456n007k648M239P40
1317A157j690J418m17l767M459L429n761j045M712k153q32K463k874j861M303
1332A541R39m818M66K897k542J126L205m786j313N931q47l016J932o15j976L565
1348A689J629m987j095M898j580k007K632k470j350M922o00n096K259L055j891
1363Hm88J492j761l73M335j504m449K975J229k494K126j6l917J452L631j854k214
$$ y = [-2187, -63, 685, -1306, 1702, 3789, -2190, -2349, 3855, 954, -1911, 1728, -716, -2711, 2620, 2123, -3766, -2294, 1814, -289, -408, 1886, -2345, -2767, 4515, 2619, -3692, -155, 1472, -966, 2025, 1758, -3563, -1482, 3804, 257, -3347, 541, 401, -2150, 1980, 1058, -4399, 15, 3654, -855, -1040, 1405, -493, -609, 3546, 978, -3773, 455, 3067, -1490, -37, 834, -3673, -623, 3833, -1174, -3822, 417, 1157, -533, 885, 468, -3299, 1160, 4589, -1172, -2217, 2495, 342, -490, 1973, -901, -2762, 1541, 2480, -2338, -1872, 1025, -1517, -391, 2814, -1972, -3285, 2646, 1799, -1217, 715, 100, -1876, 1689, 3318, -1669, -2764, 2134, 554, -1453, 1179, -1291, -2641, 2281, 1681, -3415, -1156, 1899, 8, -480, 1012, -749, -1122, 3213, 1709, -2740, 235, 1464, -1030, 1096, 1080, -2837, -1385, 2246, 392, -1822]
1380a822J697k68j221L759p57m760K900L040k592R1O50j904J257K801k601k957
1396b687K948J826l203N28Q65k407K005K326l580n54K911l26q65J262o48k244
1412a843K575K258l748n25K259j472P80J819l524j241L436Q37k707k74J058m49
1428g61R87J416l102m49M060j060k029J578l49p83J791j35k413J84K331r44j012
1445f90J287j737n46L202m54k878J150J213k11N88p48j417P26K891j292k691J419
1462a88P03q23J323r84k408J856J771j505o72M56J25J22J384l15k400J652J513
1479A610j175O3j66j145J427R74j772j160R26J300j310k82K65p68J291J185k248
1496i85r1J393l4L63n0r48r0J015J459j599j267P81p9O55R11k547q17K213P13
$$ y = [-1822, -125, -393, -1614, 2145, 1388, -3372, -472, 2568, -24, 67, 717, -1187, 70, 2871, 270, -2687, 261, 2087, -1116, -588, 277, -2130, -125, 2201, -1379, -1933, 978, 652, -213, 1049, 401, -1843, 732, 2990, -758, -1283, 976, -496, 284, 2103, -1421, -2662, 774, 1611, -1096, -1370, -312, -761, 226, 1642, -1460, -1909, 2151, 1091, -938, 640, 291, -492, 1299, 1164, -1249, -1065, 1266, 322, -690, 597, -1140, -1686, 1516, 1062, -1816, -666, 547, 336, 924, 176, -1241, -515, 2376, 1084, -1607, -188, 515, -308, 1015, 31, -2377, -521, 1250, -255, -927, -471, -346, -224, 1160, 845, -1555, 97, 1610, 435, 498, 332, -813, 614, 1588, -184, -1344, -418, 882, -428, -710, -445, -1213, 78, 1263, -985, -1076, 317, 283, 646, 596, -352, -442, 573, 2032, 433, -834, -53, -132, 523, 1434, -1113, -1930, 283, 996]
1515I96j017j144K1J272O13q9j285l78K354k03j393L51k26L27N09o84n98m8K00
1534d22N36k84k91j56l96J674L11j416k82P01J000P58k125l09P29R50L25j753
1552d50p42J316O22p95o44k68R01L24l98k24m28R31N68p25L36k74l65R32L52l69
1572F00r51K6Q99P0o63m46r99J511J312k145o69R64Q34K08m49o12K08J107N80
1591A385j749j41J481n79k73M31j070l84J186j41p67L23j37p5P16R37j730j008
1609a595K418M32j107K46q16K47J658k77k136J64J544k71j479R92m70o46J754
1626F58o00j748J579Q05j345Q02M63j208L00J621p14j329P89M66r84J488k13k796
1644a966J381J934j319j064O61O6k58J454n93j909J618J763k158K81J266j864
$$ y = [996, -21, -1165, -1144, 128, 741, 652, -633, -1011, 1343, 1140, -253, 98, -128, 199, 708, 24, -574, -622, -422, 114, -170, -461, -617, -1013, 661, 972, -444, -726, -25, 975, 1733, -392, -701, 28, 978, 1303, -450, -1192, 124, 746, -49, -693, -961, -60, 264, -134, -358, -786, 145, 713, -12, 324, 50, -315, 617, 969, 600, -351, -325, 574, 644, -19, -465, -1464, 47, 1359, -786, -1455, -491, 343, 551, 102, -510, -302, 805, 1385, -364, -505, 976, 397, 124, 555, -515, -899, 287, 146, -621, -298, -435, -510, 206, 1143, -587, -1595, 823, 1255, 148, 394, -422, -175, 1483, 1206, -930, -766, 778, 507, -972, 20, -450, -1096, 658, 58, -1690, -111, 694, -651, 151, 614, -594, -294, 1327, 613, -716, 73, 539, -445, 1043, 830, -1966, -585, 1349, 30, -1034, -373, -307, -565, 889, 296, -1613, 5, 1768, -390, -109, 1157, -707]
1660g07N95J581j545j100J638N0j329Q75K94j843J091J951k406p08K371n23m60
1677a75J053j038p70J939O71k186k68K008j525j01J694k072j016K973r04j706
1693a423J378J98j048Q95J383k151o11K878p27j668K052j058j092K397N2k874
1709a419P86J699j260o74J564j172j078K786m15k821K020J002j906J202R05k281
1725a062N01K619j517j970K101J11j886J877j09k981K032K114k695j9J684j429
1741f29k29K173j031k074K329J426k738R12J183k548O78K682k600j173K391m64
1757B88j406J215K98k317J725K072k957l14K900j427q74K293j403j392K299M35
1773A435k740Q77J842j949m30K578k375j363L387p35k083K142k27j967K191J334
$$ y = [-707, -112, 1469, -76, -1176, 462, 512, -817, 58, 352, -1491, -400, 1551, -855, -1563, 808, 285, -175, 878, -160, -930, 1009, 1680, -506, -774, 1234, -291, -392, 1302, -770, -1786, 1187, 283, -1423, -45, 153, -895, 0, 1383, -768, -1379, 1499, 772, -896, 1156, 98, -994, 1403, 1455, -1419, -633, 1066, -194, -868, 696, -476, -1554, 1232, 817, -2004, 16, 1018, -888, 314, 1219, -1062, -561, 2058, 541, -1429, 672, 783, -1103, 774, 665, -2316, -284, 1830, -865, -884, 800, -629, -858, 1315, 284, -1790, 539, 1965, -773, 139, 1322, -1226, -548, 2134, -466, -1639, 752, 288, -1118, 97, 395, -1922, -197, 1875, -1082, -1396, 1504, 77, -797, 1496, 93, -1299, 1000, 1435, -1305, -428, 1414, -535, -965, 1613, -762, -2125, 1262, 527, -1556, 586, 359, -1608, 583, 1917]
1789A917k633m27L095j401j607K073q96j748L151n48l352K190J624k309j42J766
1805G53j268q58L009r73k397K458M53k724K143J298l278P44K604j822j251J988
1821H79q38j653K568j63l402K377K296l176n7K164j261l52K325j484j789K498
1837I32P93l004J061J998k874M08K652k682r43K437j006j124K354l23k803J915
1853b09K322k654n40K710j843j97K272j933j441L002j87l128J605J525k086j14
1869h96J684j723o93L253j415k012K659k03k161J947J266k386p6K138j163p62
1885e43J953j446j661K906J7l125J412J630j897k3J542j650J75K051q98k031K583
1902I95L37k569J559J165k738R83J716j956k88J596r36j222K218j81k702J605
$$ y = [1917, -716, -1143, 1952, 551, -1056, 1017, 121, -1627, 1524, 976, -2376, -186, 1438, -871, -1013, 753, -515, -1373, 1636, 663, -1734, 724, 1177, -1547, 596, 1894, -1384, -640, 1964, 142, -1109, 879, 41, -1612, 956, 793, -2609, -232, 2064, -1112, -1169, 995, -266, -618, 1707, 223, -1566, 932, 1725, -1279, -218, 1780, -1094, -686, 1966, -716, -1659, 778, -228, -1352, 1002, 679, -2124, -209, 2113, -541, -1081, 1629, -214, -411, 1861, -72, -1513, 1489, 1302, -1826, -221, 1304, -782, -896, 788, -935, -1628, 1625, 210, -1802, 857, 654, -1507, 440, 1706, -680, -756, 1382, 219, -543, 1410, -36, -1697, 1209, 1226, -1899, -487, 1143, -754, -777, 765, -885, -710, 1341, 443, -1588, 995, 1332, -1237, 322, 1487, -1251, -268, 1448, -508, -796, 800, -136, -1358, 860, 679, -2023, -418]
1918d18J926k200R3J543j602L43K254j985j150K146L81k400Q18J291k160O78J756
1935A314k200m49K489j348j032K021n32j460J113J411j751J19J271j096r1K151
1951A930k243j310K736k25k135Q70N52p90K39J199j662m75K351p82j753K325j14
1968G13j823J827J54j447N30J054j107l12J221q69j412K114J40k168J011Q25j142
1985f91R32J84j480O75J739r98j408J506Q05j777P07M72j773J235P79j815J37
2002g71J459r67q30J452J57j595R84P77r26L15R09j661M47K028j555j034J077
2019B66M14j192N01j66p13Q82Q36j627l94J978r47o85J295m12m62R88J75r80L74
2038A31Q93r55k29J265q63j081J491m43p84P18m93n42J125J40j112k81J445J96
$$ y = [-418, 1508, -692, -599, 944, -658, -315, 1939, -46, -1196, 950, 1331, -1069, -251, 1040, -1120, -442, 1314, -886, -1335, 1154, -194, -1226, 795, 263, -1197, -84, 1327, -424, -305, 966, -130, -221, 1930, -313, -1623, 1113, 888, -1247, -377, 175, -615, -376, 823, -839, -1314, 1037, 255, -1498, 827, 713, -1110, 717, 871, -576, -46, 1008, -99, -411, 810, -59, -1471, 643, 783, -1385, -374, 451, -691, 241, 425, -1055, -380, 1359, 361, -1047, 459, 1264, -513, 194, 666, -1107, 128, 907, -908, -771, 688, -279, -1109, 343, 500, -1095, -111, 666, -260, 55, 964, -697, -250, 1778, 223, -811, 266, 680, -512, -11, -177, -890, -8, 828, -799, -1193, 785, -162, -847, 448, 36, -426, 562, 737, -243, 131, 1024, 69, -160, 1105, 242, -839, 652, 209, -575, 143, -350, -892, 233, 373, -739, -1020, 425, 621]
2056F21r30N02J23o24J139l17j113N85Q38j001j58M98k49l59N18K00j109Q49L2
2075D5n17N85M34q73L29O39l76k35j5J33LJ36q5q40L52R31r48j30L07rJ58L7p5
2098a4j90J88M95l65j52N45n71m2O98n46k2J18j59J94k30k79L4q2L94Q0q39M76
2120b69L68J80L7l28j97N89q6r5l95K64L83m16j52J8j73M14j38k92K51k61J93
2141a05J8k64M23j51k58Q66j46l49J0j25L02K36m40p6j60J92L12p94K87J85j16
2162a53L70m61k01M42K75j74k07J43L32j87j91L91o27J58L23n27M4K90m19J90
2182a89L10k20m12M23M11l89O3L59n69J73J033r18l18O84l44k36Q2R4m18jO74
2203B92q41k53J078l78m80Q03k79k34O71l9l69O7N93n35j76R10q94o88J293j99
$$ y = [621, -309, 193, 316, -308, 831, 514, -599, -14, 824, -177, -335, 163, -86, -445, 73, 273, -836, 13, 45, -472, 113, 547, -326, 3, 642, 266, 31, 16, 149, 152, 288, 203, -637, -285, 646, -302, -432, -125, -134, 24, 61, -14, -204, -16, 479, 114, -38, 507, -64, -106, 592, 46, 24, 142, -17, 177, -53, -332, -298, -380, 14, 94, -745, -269, 99, 279, 316, -12, -209, 380, 294, 199, -196, 68, 451, 35, -117, -99, -272, 142, 4, -288, -37, -298, -105, -87, -351, 72, -79, -337, 529, 383, 34, 44, -81, 221, 457, 17, -59, -219, -27, 285, -509, -222, -37, -153, 217, -244, -445, -3, 272, 98, -109, 34, 366, 179, -12, 379, -248, -90, 233, -294, -250, 40, -379, -189, 121, -99, -511, -88, 323, -66, -3, 356, -213, -40, 993, 75, -243, 441, 97, -139, -57, 37, -381, -382, 292, -549, -802, 276, -102, -582, 221, -58, -292, 379, 340, -29, 38, 631, 96, -80, 830, -64, -752, 541, 342]
2223C42r47N06Nn83P53N6o83K92O96m82o15P88J86q02J113o7j050O21L55p59M2
2244b33N65l04p12R31j42p72O54K90r65P50N83j476O54J072p37m48P20J40o98
2263a28L16J01j067O49R38j668L07J126j053n03J434l83p58P16M97q97L33R87
2281I47j481J08J781j347o76J198m59m70P02j72p62O28P39j338k91J502o57p98
2299h46J371l45p58J268p1j280J131K89j016J07J011p80j020J452k10j278J438
2316D63k75j478J565M50j628N99J193p91o18R31m0j054J394P9j948J351P71j373
2334d09P3J071r68m23J319p89q51J193N65j645Q43J136k121O84J578j382l03J206
2352G77o53o84J104K05j846Q88J169j912K34J647j380j90J452j027m95J500k09
$$ y = [342, -605, -99, -94, -677, 76, 132, -551, -259, 437, -45, -660, 128, 314, -488, 625, 558, -492, 129, 484, -275, -233, 332, 28, -684, 247, 105, -667, -13, 277, -688, 62, 645, -831, -177, 895, 158, -290, 430, 570, -128, 188, 289, -778, -129, 809, -859, -552, 574, -479, -982, 452, 69, -689, 27, 524, -373, -40, 947, -534, -426, 1355, 8, -668, 530, 71, -399, 303, 131, -631, -3, 736, -602, -893, 609, -48, -846, 525, 180, -578, 690, 619, -661, 470, 759, -257, -150, 861, 81, -939, 513, 303, -975, 463, 188, -1290, 275, 725, -903, -304, 889, 98, -520, 411, 371, -683, 711, 790, -1158, 193, 964, -409, -336, 735, -233, -656, 663, -126, -977, 216, 781, -864, -21, 1115, -1006, -322, 1256, -126, -429, 777, 124, -560, 544, 749, -1097, -209, 960, -952, -718, 929, -451, -641, 811, -216, -711, 789, 580]
2369E80j216O94R72j389j37J641j380n57J610n76r52J109j39j344Q56J056j619
2386g91RJ545j041l76J404o78r13J730k60j506J150M96j238L35O55q18n40J458
2404F21n30j334J683Q8j841J519N51j676P26J125r42m02J393p15j015J531J5j990
2422a193J230R21j840M19J240j460pJ291p51p68J116L45j390J078Q17j571N20
2439cJ109j261k29J396r28p97J547m91j265Q08J034j726J74J528j349l02J765
2456A010j142p15J559o7j320P51O58j143J65J232j177n88J553j074o99J595k36
2473C62j301J232J81j116J28J191p25l45J598j078q52J603j38j353J062M29j470
2490e92O26N70j194j59J379q01r19J642k64j431J268M99j426Q02J080j337O6Q27
$$ y = [580, -636, 58, 1030, -359, -496, 1145, -235, -792, 818, 242, -710, 399, 260, -1084, -228, 828, -791, -782, 763, -278, -654, 750, 72, -841, 889, 629, -877, 273, 769, -469, -134, 521, -297, -837, 621, 91, -1243, 440, 528, -1313, 206, 757, -919, -193, 932, -10, -412, 981, 266, -749, 782, 797, -1193, 37, 958, -882, -463, 777, -683, -690, 601, -150, -918, 198, 543, -847, 231, 1048, -523, -3, 1106, -155, -384, 1012, 84, -713, 834, 343, -922, -114, 920, -806, -632, 896, -453, -755, 1010, -132, -847, 712, 645, -675, 76, 734, -409, -244, 988, -189, -777, 776, -298, -997, 598, 362, -939, 293, 474, -642, -514, 677, -48, -393, 1205, 127, -725, 878, 740, -613, 449, 878, -592, 34, 604, -590, -749, 630, -171, -1090, 552, 288, -1143, 125, 624, -802, 0, 1080, -257, -191, 636]
2508F36m38p39J036j20j338R69N58j392Q24N81j296K38J482r90o82J196k43q33
2526e51P06O49j329N23J199j682P7J047r19l39J029o85n54R17N96j193K26R78
2544F95j152O3J282j058m80J346m69o45P87J91r58M60N49r82m33J267o61n67J298
2563E33p73n10J042J80j155M63R65p83K4Q28p10o43J242j79j117R61r2j104Q95
2582F7K57q95J52P90o47m74J015P4p98Q40J95j162N38N63q54M12M88q06Q0L35
2602A70R0r44P06L79j053M00N58o83P2O69n74j07P62k63n81N71K09n04K4N13n37
2623a23m79R03n90j66Q15l98n68O64R2k48o5N10m86J58P11o87m07R93m76k94J75
2644C4n0k28J79L64n58k85O46j84m17P35j09n60R07m15k32L60O6j73J99j46r1
$$ y = [636, 198, -541, 495, 375, -963, 6, 564, -828, -4, 577, -719, -481, 1001, 11, -671, 525, 282, -551, 155, 804, -525, -2, 1197, -485, -408, 639, -280, -619, 410, -275, -829, 88, 684, -509, -283, 695, -457, -394, 888, -170, -650, 696, 227, -418, 369, 560, -398, 62, 611, -371, -804, 463, -198, -765, 533, -240, -750, 292, 472, -683, -220, 745, -38, -14, 814, 104, -539, 703, 524, -593, 368, 276, -828, 67, 324, -571, -419, 371, -276, -750, 265, 339, -459, 381, 576, -586, -48, 515, -339, 73, 561, -245, -165, 170, 260, -684, 22, 401, -652, -252, 306, -377, -305, 364, -210, -317, 445, 182, -399, 172, 381, -123, -99, 414, -123, -602, 301, -289, -455, 360, -38, -606, 58, 150, -98, -163, 347, -139, 19, 730, 43, -364, 629, 153, -141, 34, -16, -244, -65, 299, -259, -544, 102, -82, -499, 236, 127, -433, 474, 59, -173, 187, 253, 80, 279, 133, 42]
2665D2j87K47J08m74L21J8l95K26J4m64L21L34k17L02j88Oj08J71L54m76L22K43
2687E20l96n1j9k81R0K37m5k99J39K71k98L1K04k5l3M4j17L4K66j93J37j3j12
2710I1J07l41K45l18QK10k79J39K70k54j35K72J2N9Rj74K68l7M3N6k81K41l4j96
2734a9J47k89O2k1o3J17n8j41K87k09J8K06j30J69K14r6j05p8K14m8l01J64K44
2757B84l44N3n4k61K36k6J81l80J66J63q6J28K95m60J73M30n88M09%l65Q8J77
2779B19j62l20K25j01j96K27J83m28J46M85m50l4M18l39K52J14p1k92M29K04o36
2800a27o9M70j96k68N12n12j76O55o3k61l4K17k54KN74l57l36O15j26n26N41R
2822B90n66K13K10k83J6M30n28j05N85k11o27O65Q0m68M97J48l01R3J70l66o4
$$ y = [42, -145, 102, 210, -264, 57, 75, -320, -94, -80, -544, -223, 111, -106, 196, 8, 14, -94, 77, 431, -45, 277, 520, 124, 73, 54, -227, -137, 100, 55, -244, -105, 166, -132, -101, 103, 78, 45, 89, -28, 6, 272, 79, 216, 203, 91, 198, -143, 102, -216, -208, 2, -277, -138, 132, -122, -257, 15, 27, 86, 95, -79, 189, 152, 195, 251, -30, 211, 177, -19, 128, -161, -99, -120, -183, -66, -124, -265, 22, -187, -169, 37, -93, 76, 290, 194, 89, 11, 225, 177, -124, 40, 284, -60, -7, -61, -322, -86, -112, 69, -311, -145, 18, -68, 60, 355, -105, 68, 498, -90, 319, 319, -46, 42, 219, 57, -263, -38, -139, -335, -108, 75, -353, -207, 278, -172, -206, 212, -127, 125, 239, 168, -124, 305, 509, -127, -196, 274, 78, -190, 322, -190, -366, 289, 226, -35, -69, 148, -106, -104, 470, 113, -223, 392, 266, -260, 281, 290, -276, -63, 147, -136, -120, 310, -218, -323, 262, 51, -576, 89, 169, -299, 198, 346, 45, 138, 308, -58, -122]
2843a22O53j47o62K78K81p72N37J31o83M12L01l76n7M67q2n34M30M71q97M13M26
2864D68o97J91O00q26N4N85l60m16N32m3o43L18P31q71J43O88q46m2J019l90p45
2885e50Q95J7m77K43L35n90k12Q31r97L2Q73n78m05J015l29m93P14j81m30K69
2905a8P96r68k63J179o22m33P52j39q51N85K54o98M01L55o40k43R73l41p89J260
2925E50J04j194Q76P6n27K96M30r62R3P09k07q93P74qp75N79N43j057M66O29j113
2946f11J82R01l44m83Q59O4j118O66M55r36K53R44j279L9J208r80l03P48k43n93
2966e71N79M84j033M04P03r02j40J089o10l07R49m45o70O03J12o43K32P34p14
2985a46n82J201m59m46O24k07m64R47m9q76M94P27q79l04R57n37m70Q59n63l02
$$ y = [-122, 531, 384, -278, 0, 281, -491, 46, 177, -506, -94, 207, -169, -226, 241, 159, -375, 55, 526, -371, 42, 468, -229, -38, 562, -264, -210, 375, 15, -401, 131, 88, -555, -237, 494, -377, -234, 454, -392, -434, 585, 195, -550, 345, 362, -115, 128, 463, -127, -339, 492, -505, -473, 400, -178, -583, 432, 103, -390, 324, 143, -287, -18, 778, -190, -453, 726, 104, -329, 423, 284, -567, 18, 272, -426, -25, 330, -310, -553, 420, 79, -710, 550, 654, -540, 336, 412, -115, 181, 611, -351, -258, 451, 244, -649, 125, 117, -658, -79, 464, -593, -127, 502, -611, -429, 472, 128, -355, 504, 568, -550, 116, 571, -365, -112, 832, -447, -408, 800, -180, -483, 265, 22, -571, 8, 492, -541, -137, 566, -336, -476, 613, 3, -304, 645, 200, -470, 133, 245, -398, -166, 568, -146, -728, 473, 14, -432, 192, -15, -479, 468, 419, -457, 37, 764, -115, -419, 538, 1, -469, 390, -173, -475]
3005d75R31j54j031N30O72q28R2O85j03o86P61j1q84Q59K20j107M56P11r42J5
3025b89Q29n85l54Q19k77q90R59K03j129O05P35r03p5R53n93l44Q59k78o42Q49
3045D52J83j316M58R17j093j0R26o54m26R63m91l83P73K38r81J60R74p84m65J297
3065G38q68k36J077p25n67P82J84j018L56P75p37k25O68k19n52J045k79o26P99
3084C72j5r43N21P07o43j95N89m61k45N97j78p88P03L18j172P02O78r93L25O51
3104E30n81j26O74j96o96P46J68r95M08N28p69L7N33n52k33P60j89o44N34L91
3124C28q52M11Q78j040J96N11l29l08P13l60o14O70L53q46O2P88p47j42P84n74
3144a18l15Q62m88n20R84J28p63L28L95n01j77N30m79k18O37j87o68P47J78o68
$$ y = [-475, 456, 302, -729, -199, 473, -355, -263, 422, 319, -367, 394, 383, -501, 358, 578, -529, -73, 638, -304, -289, 540, -45, -399, 420, 143, -747, 212, 415, -714, -109, 626, -277, -352, 601, 8, -336, 523, 245, -397, 452, 635, -681, -223, 694, -399, -409, 517, -137, -563, 400, -91, -474, 299, 537, -444, -284, 690, -94, -559, 738, -130, -366, 711, -14, -581, 201, 385, -633, -277, 498, -239, -464, 204, -15, -567, 478, 199, -427, 372, 357, -586, -65, 642, -1, -196, 393, -68, -313, 284, 106, -682, 21, 339, -833, -131, 547, -446, -121, 530, -51, -177, 497, 301, -395, 351, 519, -476, -68, 460, -309, -272, 261, -291, -524, 236, 47, -597, -63, 328, -524, -113, 765, -275, -79, 432, 103, -205, 508, 148, -466, 204, 557, -289, -227, 561, -186, -328, 456, -118, -433, 429, -59, -579, 405, 533, -230, 98, 493, -8, -185, 345, -134, -352, 285, 98, -570, 177, 355, -313]
3164c13L55O5k60k6M80k10l05N68m1m76L09L65p45M94j88l02K91K20m57j99N67
3185A92k00m44N87J16o80M28L70n99J86M08k78j53O65m32k86K23J71n77K61L26
3205B84m50N3M44n52q5M21j53k96L62Jj12l5L71l71L9M26l92J52J63k86k41L18
3227F1j03k81K98L00l70j60O01m47qM78j81l49M78O7k94K60j40l58L4L27k82m3
3249a12K82m3n96P73m08k43L38K27l49K69N9l00K03k6J79l33M1K21k01J82J1k78
3271a04K07k59n7k6J43K29k93M38j93j65q5K66j79M6K29k20K39q9J8k44J88R7
3293A86m04J08J66l06N9J80l89L78M9l03J85O9j13R8l6K46j07j64K52q9l1l2m1
3316c9j52J62k55K34j15P8J3k2j8K42j6J72l05O5L24l82J27J0o2N0q5j81L04m33
$$ y = [-313, 42, 107, -153, -179, 301, 91, -214, 354, 313, -163, 146, 511, -234, 260, 72, -230, 61, 281, -176, -375, 192, -8, -452, 135, 251, -429, -1, 369, -230, -44, 364, 86, -67, 598, 166, -120, 103, 274, -303, -42, 284, -166, -113, 331, -221, -306, 115, -38, -334, 28, 29, -83, -118, 253, -118, -79, 347, -45, 107, 270, -16, -257, 61, -42, -323, -25, 275, -95, -255, 346, -101, -109, 369, 188, -161, 317, 384, 90, 350, 210, -148, -114, 213, -69, -112, 170, 127, -469, 304, -104, -347, -9, 218, -131, 138, 197, -103, 100, 74, 253, -80, -39, 182, -19, 163, 174, -104, 103, -156, -213, -239, -96, 133, -160, 278, 85, -80, -165, 101, -78, -32, 197, -23, 216, 127, 145, -99, 89, 186, -218, -110, 56, -250, -191, -11, -400, -22, 27, -276, -91, -22, -135, -37, -73, 173, 66, -98, 154, 65, 34, 2, -39, -191, -29, -284, -50, -165, -87, -74, -96, -114, 128, 112, 284, -21, 44, 368, -14, 113, 123, 61, 111, 26, -155, 149, -284]
3340b84K26k3M7q6J00O7J15k26K17O8l06J67lj64J79J34k15o1N6j06j04K87M0
3363A25m83K64L65o80M63j7l14M66l4j53p7L27k65j88J00R4j12J90J59k68r9L06
3385A69n32J1M26j15j29K57J31m03J46M68n08o9O28l86o7L14l14j39J64p7N5q4
3407e4L60m73j00N31l94K9M14k54n2J98m8l54L49J42l95Q6L70j93m23O27l59m63
3429d56O02l4n42N36j59rK04q2j69J8K21J30m92N98J1m90K82K59p15L12L16n21
3451a80Q0J97l44m2L48K12n93J46N94q39M23L89n67J61M65l67j89L25k14j56P3
3472g8K46p41M34L91n93j45P05k87k25N32k34j05K86K06o77J93L66j71l54N46
3492B95l31k07L91Q5n53L03J52m43J31N13o17j22P45n51j55O68j23m48M60k7l02
$$ y = [-284, -58, -81, -34, -120, -20, 47, 162, -64, 153, 221, -85, 82, 79, -85, 94, 228, 13, -48, 8, -98, -202, 85, 125, -358, -94, 271, -409, 54, 37, -277, 189, 155, 2, -75, 252, -13, -201, -101, -7, -119, 71, 230, -38, -137, 169, -363, -352, 74, -41, -170, 87, 218, -185, -39, 429, -79, -148, 480, 94, 27, 341, 27, -112, 52, -25, 30, -54, 306, -167, -267, 264, -130, -101, 313, 59, 7, 205, 157, -197, 152, 294, -101, -15, 355, 162, -261, 366, 7, -456, 146, 112, -430, 106, -53, -62, 142, 60, -109, -91, 130, 260, -232, 366, 377, -113, 169, 428, -287, 25, 341, -180, -100, 97, -247, -289, 59, 271, -322, -176, 418, -421, 2, 391, -176, -15, 450, 83, -106, 219, 5, -151, -78, 168, -573, -139, 252, -341, -486, 219, -68, -293, 239, 5, -100, 186, 392, -285, -92, 274, 103, -251, 295, -36, -243, 148, 233, -320, -17, 135, -308, -177, 336, -281, -403, 342, -209, -364, 304, 181, -267, 193, 166, -136]
3513a36L6M56m51k06O55l31m03M98r8o08R01K46q42M30K02n89J34L68j43n01M93
3534A11M29j035N58J87n12K66K40n21J03P01p41O9M54k20m89M04K67n11L81M10
3554E51p57K4N63o42J24K92P9o27J40M16o12L00N42q63K65M12m11j08P21l21l39
3575b51M14m2l59J25M84l91j11O08p03k21O86k81m93O92N8n55L78J80m59n1O81
3596C89k61o28P05mn57N51O7n76L76K28n72M3M76k99k08M18j8p03M88M28r22P68
3618A89M80r46o2O47k94j76L57K67o86m3L77n17L20J82n96J73O44m76k41P55j88
3639A66l57L10L89q74K16P20n75k45N25k10l17N01k00m54L07Q6m85N41J77m15
3659a94j30O75m49j93O44k82m15O20J09o14K39L15n11J18L39m01l55O97o0l08
$$ y = [-136, -100, 356, -95, -301, 354, 23, -380, 118, 20, -588, 313, 559, -283, 147, 349, -240, -106, 262, 119, -382, 111, 540, -495, 63, 250, -262, 4, 244, -277, -174, 527, -214, -145, 309, 89, -400, 4, 271, -240, 141, 551, -206, -182, 381, -261, -137, 155, 234, -393, -253, 163, -449, -149, 393, -470, -205, 207, -204, -312, 409, 88, -251, 163, 121, -238, -113, 371, -20, -131, 477, -226, -447, 239, -42, -535, 157, 215, -340, 38, 218, -241, -292, 389, 128, -500, 205, 201, -356, 195, 262, -314, 62, 290, -282, -239, 237, -62, -270, 148, 130, -573, -85, 343, -579, 189, 669, -277, -339, 308, 14, -162, 195, 462, -224, -267, 110, -407, -87, 95, -501, -328, 316, -160, -401, 354, 166, -191, 119, 508, -366, -150, 570, -5, -250, 275, 65, -252, 249, 49, -405, -98, -12, -497, 44, 221, -194, -324, 351, -98, -291, 353, 71, -344, 276, 385, -229, 10, 325, -186, -68, 271, -130, -485, 212, 152, -156]
3679a56M10j1o13M57K15m85K4N64j87m03M65k27l32O04q1m88K30J00j32j16K53
3700I1p6j84M90j13n47M49O3l42K48P9l53M37J43l40j2K86l85k12K45jl72N16
3722A10N8o27L63K82j94l03N12j67k17M49o5l80J15O28p13j31O93n46l7N26l22
3743C4m87N68j64l28L85J83m42P0N91n67q2O34k67n08P65k35m98O39k53j38m9
3764a49K09o4j7K01k69k05N05r5m35N34Om87L28k35J59q7M25k69k51L42j21l29
3786c04K33J74k75J49J30j56j52K17k4j04J11p8p8J45L28n41K52Q8m82L39m5L3
3808d0j34K33om77K77J65R4j50J90j49r4J17K9j92L23k1l33J70J07j98l3J80j30
3831g2J0J4j11j76N17l41J72N0r1J27M3J8j49J5K02j52l87N65k23j27J32j39N5
$$ y = [-156, 254, 243, -370, 87, 302, -183, -159, 405, 218, -185, 280, 53, -279, 325, 244, -244, -14, 86, -46, -162, 91, 15, -169, 321, 208, -339, 110, 173, -169, 79, 158, -195, 242, 385, 45, 33, 319, -66, -278, -33, -34, -406, 110, 168, -459, -96, 186, -8, -311, 201, 34, -183, 266, 201, -179, -64, 564, -149, -280, 413, -133, -170, 356, 34, -453, 115, -49, -377, 8, 191, -251, -181, 410, -157, -239, 395, 128, -380, 385, 150, -348, 291, 38, -100, -149, 60, -4, -21, 180, -89, -294, 211, 116, -319, 215, 221, -266, 62, -173, -14, -101, 324, 55, -196, 146, 25, -304, -71, 103, -172, -23, 107, -49, -201, 16, -8, -112, -1, -79, -157, -12, 316, -225, 27, 115, -367, -28, -73, -40, -174, 59, 53, -424, -147, 18, 112, -38, 152, 3, -91, 26, 55, -137, 186, 165, -168, 2, 109, -89, -122, 58, -72, -62, -48, -159, -335, 182, -159, 13, 63, -28, 99, 142, 160, 11, 26, 228, 76, -311, 254, 31, -96, 36, -103, -48]
3854d8J41k87l6J62j6K02l02K94nj85J59j10M2j10K41k05p0J61k61n9N18l2j90
3877Dj83M06k91j04L09r3k0Q4o9l8jj00R6L1J52n9j32j33J11n6K09r6J0j17p9
3902a59K20l96L51p9K52k53K39m5P8r3j21J88k14L08l27m0J51j79K1n8r6L83k06
3925g5Nl7k07J26K71j54K27J5j10K63n24M3J19n4J16k7o8K04k93K88j66k82J30
3948a90M4J8K31j44L1J00o8m2M1J45n8p3N2J11n05K80j0MJ30n8k54K11j5J28j10
3973amQ8O9o5l2l4k24N19l63O7J64q1k33K38o8j11k3R0j28o4L84k94J3J81rk21
3999a42M34l47m8K23R7j92r8K95l09j85L25p8k85J69j4J6J80J02k26m1M29j45
4021A60k34J89l5j66M37m35K5J21N2m06L50k7PK8J56l61J67K48l11j11J28K22
$$ y = [-48, 93, -194, -230, -68, -84, 118, -184, 110, 105, -80, 79, -31, 11, -99, 142, -63, -133, 28, -233, -292, 226, 194, 4, -179, 227, -64, -168, 141, 48, 28, 112, 43, 5, 4, -96, 0, 31, 183, 124, -8, -141, -30, -86, 123, 27, 37, -80, -159, 61, -335, 16, -63, 189, -64, 175, 130, 208, 115, -6, 182, -32, 276, -51, -91, 60, -119, -98, -156, -252, 131, -75, -70, -107, -314, -188, 83, -71, 156, 171, 61, 324, -200, -157, -38, -92, 24, -3, -71, 133, -160, 128, -38, -320, -190, -146, -128, 103, -41, -10, 90, 22, -20, 21, 166, 108, 35, 87, 198, -307, -27, -37, -33, 97, 39, -215, -4, -19, 109, -1, -5, 83, 152, 87, 55, 21, -203, 316, -47, 20, 184, 103, -130, 108, 40, -71, -94, -4, -132, -196, 188, -106, -93, 88, 79, -142, 292, -55, -103, 120, 217, 25, -73, 222, -87, -272, 53, -25, -310, -141, -155, -139, 41, 143, -83, -124, 305, 160, -74, 115, 80, -86, 351, -84, -59, 62, 114, -292, 58, 31, 38, 66, 222, -139, 28, 276, -35, -146, -18, 204]
4043B04j37m3J74j04j77K76j65k05L17Jm58L48J81m51L6K51J0j39J21j23p6K40
4065H1o2j60L29J54n32J99L65m51j36M61m44l0K41j80J01k3J65m90L15K59j73
4086a1j40L53m11J01L88k17j54K97J08o38J51L96l45j3L56m04K4M12k9m89N06
4107B41om08J72J28q8j03K58j43k66N11l59j32L55r8m63L10L27l87L2M00k48j70
4129a37L02j73j36J73L11o11J61M56m74j26L86j54k62L82nk10K77L0n41K62J73
4150H4j90M1M74m56k29L94j52k66L29R9l84L98J18n68J25N47l80j84L85l24QL26
4172A95L1m87K54L08m09O6N01m57m84N81j22k86M66m5m17J25L54m18j89N46j25
4193a2j89K47J0l09M41M6j91JJ92l55K7M27m62o3L01m7l98M60Mn13Q9M48m08J68
$$ y = [204, 67, 24, 198, 94, -83, 193, 28, -177, 140, 141, -317, 31, 212, -239, -203, 48, 58, -81, 40, -83, -159, 81, 19, -141, 188, 342, -190, 9, 374, -77, -213, 248, -196, -226, 15, -165, -64, -87, 78, -412, -97, 162, -11, -151, 202, -209, -108, 280, 63, -91, 206, 314, -324, -173, 223, -122, -135, 221, -183, -159, 253, 224, -265, 241, 235, -173, -1, 127, 39, -64, 194, 51, -215, 296, -63, -195, 160, 62, -401, -91, 236, -151, -119, 281, 33, -137, 165, -8, -144, 29, 340, -271, -110, 346, -128, -254, 132, -22, -284, 98, 93, -117, 160, 190, -351, -89, 84, -106, -65, 409, -47, -276, 118, -34, -300, 29, 128, -256, 142, 260, -308, -183, 364, -16, -200, 185, -139, -131, 195, 226, -261, -7, 301, -108, -42, 459, 2, -482, 99, -23, -309, 157, 112, -305, -180, 174, -244, -433, 113, -12, -201, 46, 56, -253, 188, 234, 43, 44, 236, -119, -92, 335, -127, -190, 111, 64, -334, 126, 130, -383, -294, 154, -254, -86]
4217h6M50l96j34O23m95j59N19k28n39M99J40l87Q4K34r7m6K04k58j57K97K13
4238B81n37K42J63l91R2J50K9k31L35Lm90O21k34q3n8K34m26K28R0k67R4M19m57
4261a93KM39L8k62j10K71k48LK88j19j89K09j40k85M30k00l47O02l11MM7K35j69
4284ek70O41l55l04M72L0m06L25L11o26K95k7m3l86L13O8k01J74n7k57K59J46
4306I7k71M7M15k35l3J33r4n4R0Q2j57O1k00Q0q0J61j51j88N00k03j68K92l5l02
4330b13K56K67m86N5K78q5k03J34l0j01J40kj17kP4j28J13M0K9r8L34l75j98L72
4354E4Jk26K39m0j47r0N27m67J6L18j29k04M42k19m09M32r0j08R4K1n1O3K54k53
4378B8j7R0q0j24J2J91j23P0P7k45K19j59P9m11M82K72m55J93lj18R7L1k17K69
$$ y = [-86, 364, -32, -166, 457, -38, -197, 322, 94, -445, 54, 194, -193, -109, 125, 28, -18, 186, -72, -229, 68, 281, -256, -14, 149, -242, -150, 0, 29, -202, 133, 136, -354, 267, 33, -50, -108, 126, -300, -72, 18, -249, -155, 264, -193, -191, 248, 286, 24, -86, 185, -63, -60, 228, 109, -80, 129, -11, -296, 134, -66, -413, 189, -122, -118, -71, 164, -5, -275, 366, 11, -293, 179, 209, -197, 128, 439, -187, 108, 81, 38, -348, -35, 33, -168, 6, -51, -308, -49, 97, -174, -127, 288, 53, 20, 153, 59, 5, 95, 177, 20, 81, -119, -39, -119, 42, -109, -297, 203, 0, -168, 124, 89, -213, 43, 310, -176, -121, 157, 72, -131, 3, -27, -128, 12, 10, -107, -109, -35, -163, -50, -10, 19, -79, 255, -120, -318, 54, 55, -171, 68, 28, -119, -209, 318, -149, -133, 185, 56, -148, 294, 75, -334, 98, 8, -100, -6, 15, -36, 27, 281, 28, 11, 101, 21, -103, -91, 100, -23, 47, 124, -121, 98, -61, 18, -393, 89, 361, -94, 99, 96, -22, 75, 106, -111, 158]
4402A58m8j5j58O3K27j45k19R5j98L36j26p2l0L09p3p2N0n3O4r2J18k1j3j87O3
4427c9j99L06r7j4O7q3j18J55k2j80J17K42k32K28p7J1k51L50p6j80L59k56j1
4450@j7k4j19l7J49m4LM70k41k24J16q2J7K29k77L0L0k8j90J70N4R8p8m3n9O7
4476c0r7k9j0o7K02Q1j42j4J52R3k53l3K14j05J1o2J61o5J76j07j46J39j2qn3
4501dm4p8L62l05m0j5j9J00o2K01o1j33J35K34k29p2K01j28j23p6J01Omk0j14
4526a87J68m1J88j36j7K18k94J45N7j23J10n4Mr3L34m39n0L62j99K12q4k65q7
4549b71J41J60o2k54L63m3J5J09n5l71M00%m01L82j06M9j20L5M6k37M4K85k48
4572a39K16J79l22K4P0k60K39R2j77K04m9j19l7mL27k54orm7p7R0q6q3K16O4l1
$$ y = [158, 110, 95, -63, 0, 227, 82, -137, -42, -240, 96, -30, -102, -132, 177, 104, 32, 82, 29, 93, 1, 119, 98, 85, -102, -39, -238, 68, -29, -43, 24, -59, -177, -22, -44, -224, -107, 135, -97, 131, 54, 65, -186, 164, 88, -92, 267, 11, 0, -17, -41, -160, -197, -48, -92, -89, 381, 140, -84, 32, -50, -33, 196, -81, -51, -21, -49, -239, -69, -15, 83, 5, -38, -97, -30, -127, -156, -166, -233, -31, 50, -92, -106, 46, 139, -114, -147, 67, -38, -27, -89, 72, 7, 183, 76, -70, 69, 57, 49, -4, -48, -126, 236, -69, -109, -124, -143, -43, -105, 96, 35, -98, 37, 271, 42, -30, 171, 43, -80, -156, -55, -49, -53, -73, -187, -19, -60, 128, -8, -25, 193, -101, 44, 101, -22, 88, 34, 38, -55, 279, -160, -210, 152, -47, 165, 81, -184, -271, -130, 30, -32, -286, 77, 34, 49, 158, 103, -268, 132, 132, -269, 113, 7, 56, -64, -29, 17, -220, -176, 109, -139, 77, 256, -66, -42, 28, -232, 7, 99, -78, 126, 77, -42, -79, -83, 244, -10, -16, -25, -72, -149, -59, -145, -228, -12, 52, 21]
4598B1O9J34l07NJ60j22KQ1k0J9N4L6m38J43K80j78J07J94k49q6qL5j46N26l11
4623Aj49K19J51j70K4J13k68K38j28jq3L08m12k32M97K1j53k8K44l54p3M28j19
4646G4q0J70j14k96J07J00j27K92j09p9P3j4j64M5J46O3j9j20j5Q0P9J58k31j13
4670i4K55j53j30J56o3n3P2J24k50L17ol38J81L0p0n6K92j50j16N0P1o7K2J75
4694A99k93R5K13k96j68K74q0J37mM9k11N4Jr8N2J43q3p5L52k51j65K84P0l44
4718a45L60m3k99L4L73m12j82N69j63j91J12J00k72J90K02l06N4J47k1n3Q0j13
4740B1q4O0J02l31J97J60l85L14J36j75q0j5K84j59j84K65k30j07M46n5n29N45
4762A96n2l08K63j37k95M87j29k89K08k1k93K37K21l89L01J04j48L9J61l60R1
$$ y = [21, 90, 224, -83, -78, 82, -40, -38, 43, 23, 42, 96, 132, -306, -163, 117, -61, 46, 240, -9, -95, -103, -68, -214, 312, 1, -148, 71, 222, 52, 76, 189, -79, 159, 31, 30, -53, 255, -157, -389, 108, 129, -24, -52, 192, -162, -235, 193, 74, -6, 164, 50, -246, -139, -39, -166, 126, 17, -62, 11, -3, -167, -122, 24, 87, 68, -52, -67, 13, 92, 250, 19, -94, 161, 8, -122, 34, -29, -82, -10, 114, -136, 181, 175, -163, 18, 48, -22, -78, 214, 64, -52, -2, 69, 2, 24, 199, -94, 1, 214, -82, -250, 24, -56, 81, 77, 126, -85, -31, -30, -128, -76, 67, -16, -91, 261, 10, -155, 129, 199, -145, 215, 172, -127, -93, 280, -132, -314, 255, 92, -99, 13, 113, -159, 31, 233, -73, -19, 128, 107, 54, 134, 21, -63, -3, 99, -232, -35, 125, -260, 54, 190, 15, -65, -80, 204, 45, -139, 126, -104, -211, 235, 180, -349, 196, 144, -164, 99, -38, -333, 154, 25, -264, -56, -77, -370, -133, 88, -301, 0, 104, -44, -5, 156, -204, -113]
4783a13O2QJ03q3K02l91l0M38j47j91J87m3j00J61k08j8L78j47k41K74k32J71
4805D0k20M33j76k50J47J52l80K79m2q7q9J87r5N5J97qk36J89j28J20j32K44l14
4828a14k3L93j80k0R7j14j26K25j33r3j19M28m33L14K27k07k06K88k2l52J71K12
4850B13r8j90K80m48J87K81m98K49K08k26J21l2o2n7n3K61j92p7L15k26p4M33
4872C15k19o0J55k27k02L00%j02jjQ2j68L44l25k04N36P2j72r8R0m6N6o8q6k38
4897b67L59p6k52K49M7k00P2j4N1j35J70P9j34K04l39K69J26p3k08P2L7j40m1
4920a44K18j48J33q0Qj64K09M4k66JL80k59M0J81j65J44j84K70k52J26k79L1J38
4943a8O5j66J68j54k9J36j26K91l75K33J46j27N4J68k81k4J7Oj23K26q5k13L41
$$ y = [-113, -51, -43, 60, -23, 179, -212, -242, 196, 49, -142, 45, 2, -98, 63, -145, -163, 215, 68, -173, 101, -131, 40, -180, 253, 77, -173, -26, 126, -254, 25, -17, -104, -193, -6, -101, -46, 151, 143, -93, 96, -32, 88, -44, 200, -114, -137, 256, 76, 56, 153, 39, -87, 138, 5, -88, -207, 221, -212, 102, 329, 122, -84, 204, 182, -170, 1, 213, 115, -75, 205, -243, -56, 225, -273, -24, 184, -42, 79, 47, -15, -72, -125, 136, -56, -133, 182, -44, -118, 315, 96, 36, 191, -36, -238, 62, 62, -40, -41, -42, 40, -128, 216, -109, -313, 223, 295, 123, 25, 115, 69, 125, 57, -29, -267, 92, 16, -236, 13, 60, -140, -68, -82, -31, -166, 4, 83, -51, 153, -186, 83, 209, 136, -72, 0, 37, -103, -144, 74, -74, 59, -21, -13, -177, 32, 76, -190, -189, 191, -68, -28, 153, -12, 132, -52, 218, -34, 92, -187, -156, -18, 47, -119, 49, -105, -134, 2, -124, 167, -208, 25, 171, 44, 98, 266, -15, -39, -22, -16, -139, 87, 2, -211, 130]
4966A30j51p3r5L25k14k01K52r6j30L18n5l07J45K31J4L4r9k0q4J48rj77Q7M8
4990B1O1r2J80l52R2N0M6P3j53K3k1J87j44J07j41K3kR9j84L8J37J3j77OJ41r4
5016f3P6j90j42J55J1L28j66k38L59r4j96K82j02L1O7N4k92K14p5j81K8M63l60
5039c1M8L3j71P5l2J6K0J13j56K32k31L1J9j10J48k6J53j50p6l3K22j42Q2j50
5063a16J99l0r2Q7KK0j09J27j27J42m5J45l02J13j20k1L2n2J87j08J60k72J82
5086BJO0j30J62k46J43Pj11K62k77Q1j6J6Nn4L2Q0rp2j93J48J71k0j23K81k42
5112d2n8J1o9K37k89R0L85l74p3K20k7j44R2J66k22K2J13l0P0j28O6O0j4k22J17
5137d3R9n1J64k27Q5n2J30j40J7J28p9J1J3k7q1J20P3j99MK8q0j02J67J71L9j16
$$ y = [130, -21, -94, -189, 136, -78, -279, -27, -123, -253, 65, 10, -297, -152, 79, 93, 127, 28, 8, -76, 72, 63, -114, -27, 21, 82, -10, 170, -182, -90, -40, 6, 79, -74, -51, -72, 115, -29, 78, -63, -40, -42, 57, -127, -89, 48, 61, -116, -110, 31, -63, 13, -177, -319, -164, -153, 175, 9, -229, 130, 36, -160, 122, 20, 51, 118, 172, -120, 94, 19, -162, -134, 329, -31, 17, 50, -121, -46, -78, -62, -42, 71, -85, 147, -84, -53, -34, -144, 4, -22, 131, -19, -95, -128, 94, -48, 34, -116, 83, 53, -39, 48, 50, 70, -39, 88, -39, 103, 58, 203, -99, 14, -106, -127, -95, -147, 40, -68, 92, -180, 2, 3, 63, -67, 95, -151, -8, -1, -112, 150, -127, -46, -62, -46, -41, -95, -63, 17, 8, -64, -257, -109, 62, 42, -81, 200, -42, -100, -89, -158, 79, -210, -120, 265, -109, -182, 38, 11, -133, -41, 125, -97, -75, 38, 8, 78, -50, 16, 76, 62, -160, -43, 56, 5, 169, -58, 27, -25, 105, -35, -18, 110, 31, 42, 55, 28, -53, 67, 140, -59, -55, -27, -107, -209, -42, 129, 168, 52]
5163E2j75J76J43k33M6J3P9kq1o0q5K93j9k41%M0R8j56r2K70j33M9o4J24j95J72
5189A9m0j32J15o6J12J12mj27k18K23J47o2p2L9l2J22J39k96J00p9m3P2K32j35
5213A26j58j07J69k22J49j1k07K63o7j2J75Jk12J95p2Q5k73L81m1j60J07k34j69
5236b94L81j8j0j27J16L5k33M25n23K10J32k09P6M8m5m3n9J84P6P3l09J47j67
5259a34P3J05k64K16J5p8j17K44k18JL99k74j48K34J1j46J09N6j97K70m1k49J07
5282b6O2o4j34K27P3j05M3j73J35r0K50p6r6M4m9m4o3L36l56K07l0p9J47Q8k81
5307e4J76j2k28J0J10J32j38J84j41pr3J88k42M2J77rk70J11N7O7j7mm0M0P9j42
5333b4j34J25j27MR9J13O0j04K16k20N7Q0q5oq1j68O7K85o8j03K8l4K0L8K08k94
$$ y = [52, -123, 53, 196, -37, 9, 22, 101, 99, 18, -42, -127, 166, 147, -94, -94, -54, 44, -112, -204, 66, -67, -18, -82, 42, -153, 19, -21, -153, -38, -104, 8, 120, 116, -11, -229, -6, 141, 79, 7, 46, 14, 136, 275, -21, 79, 0, -43, 29, 261, 126, -32, -139, 30, -192, -43, -54, -261, 2, -65, -77, 98, 99, -113, 82, 10, 95, -178, 203, 162, 2, 109, -125, -294, 87, 69, 59, -68, 48, 83, -150, 275, -248, -38, 94, -115, -39, 9, -36, -79, -138, 46, 122, 195, -114, 33, -134, -61, 44, -220, -4, 11, -67, -184, 60, -158, -157, 242, -32, -180, 54, 65, -81, 28, 84, -113, 157, 116, -133, -26, 36, -28, -162, 65, 138, 33, 76, -97, 38, -52, 198, 122, 26, 70, 21, -23, -86, 250, -106, 101, 71, -8, 139, 227, -54, 122, 110, -118, -108, 2, 134, -4, 180, 39, 32, -61, 127, -115, -73, 104, 95, -175, -64, -7, 60, 43, 39, -1, 39, 118, -24, -158, -33, -160, -156, -57, 56, 116, 12, 228, 8, 65, 145, 60, 54, -27, -195, -128, 157, 89, -14, 14, -20, 0, 38, 246, -48]
5359d8nL02l51k5J96j56P4L4P2l35L44j6m05L70K15k56l2J76P4j75J7J11l27P0
5383g6K9j22J43n8K46k99K48o0j70J09J14l16J47RM5o7K2J26o5mK5j58J37R6n2
5408D9j2nj51P6K93k15j45Q6j67R1j08K09j41J3L40l76J75J58k2l03N0K64k65
5431a06Q6J27q2n1J85k89Q0K62r0j69N3q6L3J36p0j02J22Jp4K46j65jl6j50J28
5456a2l6J02j19l3k72L78j55J08O5k64M1L15k96J33K30j47j50J96J13j56k37Q0
5478a16J87j81K61q3j9%M7j89J9J17k08J38J37m6j14K31K8l56J28o4j82R0L12
5501A37j54PK02k80J2J28j32P8l8K41j18Q6K3k45J3Q5r0J53l3j49j2NK40j12m7
5526@J15j0j55j8J64m2p8LjJ33k57L25j76R9k1p5J21j56j3K17p2k19J90N8l5l7
$$ y = [-48, -53, 249, -102, -127, 69, -87, -13, 21, 93, -242, 102, 86, -319, 51, 266, 10, -22, 154, 228, 53, 70, 181, -146, -76, -47, -169, -26, -84, 162, -137, 111, 51, -119, -10, 104, -212, -65, -56, -11, -78, -56, 70, 5, 1, 26, -132, 5, 101, 49, 37, 32, -119, -43, 250, 35, -110, -24, -191, -100, -208, 1, -140, -127, 213, -163, 12, 170, 148, -155, -105, 159, -106, -20, 107, 25, -26, 159, -130, -50, 212, 122, -47, 6, -80, -47, 89, 19, -83, 39, 40, -34, 212, 47, 46, 10, -140, -12, -48, 54, -65, -98, -370, 8, -147, -39, 26, -238, -197, 118, -178, -45, 185, 38, -112, 84, 197, 41, -196, -116, 71, -110, 151, 68, 49, 49, 96, -93, -74, 43, -165, -27, 110, 64, -50, 181, 209, -147, -19, -83, -265, -175, 137, -17, -10, 192, -88, -76, 52, -80, -2, -40, 201, 83, 169, 192, -53, -40, 45, -45, 108, 75, -74, -86, -81, 159, 47, 0, 115, 105, -50, -68, 96, 54, -24, -21, -22, 111, -146, 179, 3, 102, 81, 6, 127, -29, -42, 175, 103, -116, 74, 132, 97, 60]
5552F0n5o7MJ33j23j22J33M3J09j91M8K67j65j97K06l05K24q9Q4r7J05l7R6J5
5576G9k7j57J53L1j00l3J51LjO3r5n5O4j58O2r5K52o1k6l37L29m4Lk2J1M3J24
5603A57k36K43l1j24m4j8O9k8l4p7R4J53j31J11M9k08R4k42J34K64j24j17J11
5626F5j03L29l70K27o7j22j88K09l17J87J35k49L01R1k90R9K44k28J23j30JJ51
5648I8j5o0J96k22l1Q6J6j05J07k38K85k68K53j83R1j24P9j11J39k3K34j28q9
5671a3K6K9K2K5j57R8nj19j3M9p1o6L86k80j06K84j56j17J84k1j35K48J4L8k43
5696i9J25Q9l9np3J94j84k09J01J79m1R5j21K0R7j88Q9mK8k05R9n3K36k14J17
5721C4J11l6r9k8j18K10j80J98l0j66M7Qm4J54m1J26K7k67J40K8l2j03k2Q9o8
$$ y = [60, 5, -62, -58, 75, -48, -170, -37, 6, 115, -76, -28, 239, 74, -123, 83, -222, 2, -87, -3, -100, 5, -32, 64, 79, 52, -105, 48, 79, -21, -54, 97, 100, 99, 162, 67, 12, 76, -82, -20, -115, 137, 76, 50, -287, 42, -2, 1, -21, -10, 33, 157, -79, 164, 133, 9, -35, -53, 16, -12, -46, -123, -29, 124, -7, 104, 153, -55, 39, -203, -69, 195, 71, -46, 65, -38, 291, -79, 148, 81, -41, -229, -20, -337, -150, -15, -264, 37, 128, -162, -63, 181, -47, 76, -54, -53, 98, 83, 23, 219, -3, -34, 52, 68, -37, 70, -168, 117, -151, 102, -81, 10, -114, -35, -146, -7, -30, 204, 76, -13, 13, 42, 64, 89, -68, 30, 25, -94, -107, -58, -129, -195, 191, -89, -195, 89, -67, -184, 0, -21, -156, 92, 106, 144, -99, 26, 115, 76, 71, -2, 192, 8, -201, -100, 79, 38, 133, 12, 32, 129, -59, 30, 26, 54, -151, -52, -105, 131, -83, 34, 145, 109, 10, -18, -136, 74, -106, 92, 62, -104, -57, -49, -93, 61, 20, 146, 173, -94, 46, 74, 42, -61, -83, 6, -62]
5746f2P9k04L18k18O6J14j44n7J11Q0j86J52KP9Qj85m4J14j0j06j3PJ87K8j94
5771g8O0p1n0R8K73l26J01j95J16J21J25l30K11Jj45R5l0LJ09O3k47j11L52p7
5795F8j53j1J20n7j62K79k71J87j68J33J24k70J92J22o6q7N7k4L9M1O0j17k70
5818b34J94J72j17o4K0K58l70K4K48r7j31J93j02j72J66m6j11L41j5P8l44N8J18
5841F7k47J32o3N8L8k2J83k09J40m0J30o0k59J52O0j69R5J19j38Q2o3l7j23K35
5865F1n7j59N4R9j5l57M49j25K36k51J16j38qK63rl49J11J57k43J87j72J57k30
5888b23M50m20M6L02k32O5J08r0j18L09j30j35m1J08R8o2J3k1j68J48lKj79M9
5912a24J30j1r0J02n0R0l7r5J31J36j82M9j90K6J21L5L1K25j88o2j36M4J09j58
$$ y = [-62, 17, -187, 131, -87, -21, 93, -51, -108, 3, 83, -103, 49, 51, 130, 138, -47, -91, 23, 13, -93, -106, -99, 88, 116, -78, -18, -89, -139, -41, 232, -94, 7, -188, -72, 49, 174, -156, 55, 56, -89, 6, -24, -21, 88, 151, -96, -207, 145, 68, -85, -96, 24, -33, -195, 84, -187, 0, -168, -35, 89, -181, 11, 133, 67, -20, 37, 13, 52, 93, 153, 36, -234, -40, 132, 15, -49, -29, 229, -141, -117, 131, 34, -97, 96, -6, -178, -12, -58, -169, 172, 157, 235, -109, -51, 67, -180, -48, -111, -53, -15, -37, 146, -63, 77, 37, 167, 107, -152, 0, 60, -109, -14, 105, -33, 49, -14, -51, -174, 61, 4, -155, -101, -2, -17, -374, 75, -50, 186, -65, 51, -87, -95, 168, 159, -190, -79, 78, -165, 22, -150, 7, -223, 227, -193, -147, 155, -77, -12, 96, 6, -112, 197, 67, -68, -109, -1, 97, 35, 48, 27, -141, 7, 4, 6, -173, -124, 6, -5, -95, 7, -43, 47, 10, -85, 46, 182, 0, 49, -141, -115, 6, 41, 72, 297, 109, 47, -89, -45, 64, -94]
5936i4J77M1n2n8J12l14L55J7o1j1q6J6j92R5L0p6j35N2K60j09j15O2L6Km6Q0
5962a4R3k55P0J5J11r9J3o1J26o4J01O9k13J85q0J12o9J04q2j73L01j67j11L30
5986B42q1j57j00o8O9J9M9K8j09J27k17j4K71j54k3nJ71j27J61j13J20j11Q3k28
6010a67J07J01j84KL34k63m8N7L60n66J83J4R6Q9Pj18m9M6l0rj4J2K66k69K45
6035B02k21N3qk49J21J0L12j95o5j4P2p3J05j26K23j62O0o8LJ20r0l1j35N5J07
6060Fn9J16p8J04j41r7M9P8p2p1L69j35k53L47k11J17k17m7J03L43k37k23L06
6083I7J84j91j77L07k85pK67o0m24L48J48j31k2n6q9R9J9J35j35K7k20m7K24Q8
6107I9r2M9K5j98P7J44n9m0n5J94k33L29k08j04J40m9j01L0K36o2k5J07k68j17
$$ y = [-94, 83, 124, 72, 14, 126, -188, 167, 184, 123, 112, 26, 42, -150, -55, -25, -101, -236, -184, 76, -33, -148, -86, -50, -48, -94, -14, 79, -176, -106, -91, 20, -79, -66, -127, -1, -65, 36, 105, -108, 77, -3, 109, 40, 144, 62, -111, 190, 23, -88, 242, 161, 4, -96, -164, -95, -76, -27, 1, -108, 19, -198, -212, 59, -95, -118, -123, 48, -79, 82, -31, 89, -22, 61, -167, -60, 41, -143, -141, 193, -70, -118, -61, 299, -267, -84, -70, 26, 115, 122, 4, -45, 1, -29, -38, -52, -40, 226, -43, 202, -19, 34, 26, -223, -102, -92, 220, 25, -40, -54, 18, -55, 50, -76, 147, -15, 45, -23, -20, 100, 10, -21, -156, -101, 6, -53, 63, -15, 89, -52, -149, -100, -22, -94, -165, 204, 69, -184, 163, -48, 69, -148, -195, -92, 251, 14, -209, 97, 281, 90, -87, 220, -65, -72, 195, 135, -289, 59, 207, 76, 54, -2, -91, 8, 27, 162, 27, 54, -166, -213, 11, 99, 7, 56, 81, -117, -40, 104, 45, 5, -50, 144, -89, 240, 32, -72, 68, 19, -82, -52, 184, 122, 97, 204, -64, -181]
6131a81J64L8O3j59J25j15N4Q9j33L4J54q5p2l8R8j97P7P0j05P8M0P6K2K6j11
6156A2O3jJ54q1k76J96j75K20q4J07r3j06R9j4Ok7mj02J31j22k0J79oj35R8r3
6182g4Q7m3j31J6K79j83j1K90l47j0J6N8o2J46P7l8k47J63l6J2o4J7J87K9N6q8
6208I9J0j25J76k41R1Q9M1j84M8nN4j06K2P8j09J27J0J44j21k73L3L92k06m8j8
6233b2j14K16M5r2j63J38l7K7j99N1Q8O8j42k3J81Q8Q2j44J53j65o9K0J30m9p8
6258a0n1K26j80J36m9k79K62k24J21M9q5O6j03J70n1j23P2o0J64j44K4N9n8J2
6282e6k3J23k54K41O9p5m1j83Q7K22L5j17O2q5j9N8K3N3l15J31N1o2J18j73K74
6307A44j51r6k7J71j58J36r6K2j0M4m1K81q5k23J08J62j94j20K48j13O3j3j6J00
$$ y = [-181, -17, 21, 84, -75, 50, -65, -11, 78, -55, -21, 133, 48, -24, -62, 36, -161, -84, -14, -119, -41, -1, 75, 97, 123, 12, 75, 74, 228, 147, -129, 67, -108, 112, 28, 135, 42, -64, 35, 21, 27, 0, -4, -106, 25, -97, -117, 62, 56, -79, 19, -74, 13, -30, -161, -145, 134, -49, -60, 230, -117, -127, -111, -53, -115, 31, 108, 70, -177, -14, -50, -38, -102, -85, 102, 131, 187, 99, 109, -16, 160, -81, 10, 99, 140, -44, 4, -1, 53, -53, -31, 47, -62, 65, 75, 219, 98, -175, -142, 250, 44, -4, -22, -136, 80, 125, 33, -130, 8, -29, -2, -201, -150, -62, 6, -136, -159, 22, 110, 192, 48, 201, 36, -33, -13, 117, 68, -10, -61, 165, -15, 121, 72, -207, 55, -169, -48, 1, -84, -18, -121, 49, -2, -125, -53, -113, 51, -93, -69, -10, -68, -56, -79, 44, -210, 31, 100, 25, -16, -199, -112, 110, 145, 28, 90, 5, -14, 44, 67, 120, -195, -64, -13, -75, 43, -130, 144, -7, -103, -130, 41, -117, 19, -77, -55, -65, -21, -62, 219, 134, -89, 19, 181, -13, -133, 115, 2, 65, 52, 36, 136]
6331A36J0o6j77J34r0k6L15m04M34r1l47K18Pk3j24J7j24L35k36J42j32l5J6O5
6355d6L9J37k02J13j4m7qN6j46J54j43J97j12oJ39k07R3l5k8J6j3K50Lp2k73J0
6381a45J36J87j84J33j81J04Q3o1Q9k93K91J2k26L0r6J72j64J23o1J55O2l14J20
6404b8j18P5K62l10J53J01k43R8N9J1j13K13j51Q1j66R2M1J4n4j17PJ39m4p0J58
6429I0J1j77j3Q3j18J07J9o2J71O8k01q7R2K3k8P8j22O9%J25r8p4J96j79j5j48
6455a90J44j2j4J61j41K70j11j28k35L63k02j0J6J15N6r6J18N3k38J04p5oP8j86
6479a66K93j40l3J7J25k09rN6K38k07K9m2J06j69J51p2L1L4J71p9j37l0j6K34
6503A76j37k0k00L00j7m9k0j40J21q0J20j16j60L05l48J05L42l64J13J33Q0j68
$$ y = [136, 146, 80, -97, 37, -53, -79, 236, -168, 266, 175, -172, 46, 53, 30, -94, -77, -201, 134, -102, 40, -92, -127, -111, -46, -7, 130, -72, 41, 27, -20, -28, 28, -118, 36, -107, 90, -22, -28, 111, -96, -3, -38, -66, -50, -63, 187, 190, 118, -155, -145, -9, 178, -6, 127, -54, 50, 133, 72, 161, -132, 159, 171, -55, -25, -121, 51, -113, 10, -51, 104, 166, -148, -28, -146, -71, 191, -119, 34, 135, -108, -10, 49, 60, -53, 160, 9, 90, -76, 16, 57, 71, 17, -100, -93, 46, 2, -68, 90, 101, -76, -89, -6, -124, -17, 2, -60, 111, 179, -22, -109, -17, 6, -22, 56, -66, 3, 3, 128, 30, -44, 152, -27, -42, -190, -46, -58, -72, 89, -52, 218, 107, -21, -256, 107, -95, -105, -89, 26, 82, -14, 104, 157, -81, 23, -52, -58, 20, -166, 127, -13, -46, -29, 96, -113, -122, -66, 172, -35, -6, -48, 58, -111, 40, -32, -1, 33, 204, 125, -12, -42, -58, 176, 39, 19, -181, 119, 102, 53, 33, -107, 14, -66, 54, -62, -222, 83, -265, -160, 182, -182, -69, 64, 144, -24]
6525b4j62J34K7q0M4n5J11P0j56L4n6N7n2l7K06k01k3K43J89k38J01j60o5J54
6549F1j30J47k06n4K35r3O1K1k92K61m5j7J09O0k31m5J3K83k34N2m0J22p0J1P6
6574E5lM7j07l0k4J21q3p1j23J28j1PP6J00J38l46J7l4N4J74j9j92J18O1O4Q7
6600B04k51N8j02K9J59k10K44M8j97j6K24j52Jj53P6n5J61M9k10P5j33j16K48
6623a9Q2o2J8q2L40m79J36Q1r2N3O8j2q2J82j03k48P6J39j67J72l3j14J54R0j72
6648g4P9LKO9j04J46n3M1j75Q5j23O0N4j12N2O8J56Jk60J41j27O4k7m0LK97k49
6675b3J2P0k21J15k2Q5J53j35n7R8r0k3r2J02R9j6o0Nq9q5K66k13J51p4m0K05
6701A21l56K38k6K03l00J62j17J52p7J68k55J75n1K02j46k54Q2K5O0n6J61j56
$$ y = [-24, -186, -52, -25, -105, -61, -116, -5, 65, -91, -57, -113, -56, -108, -145, 61, -140, -163, 80, 269, 31, 132, -28, -93, 61, -69, 78, -128, -182, 53, -40, 21, 42, -250, 11, -34, -51, 58, 118, -113, -158, -145, 138, -96, -44, -84, 38, -32, -21, 55, 52, 99, -8, -38, -62, 59, -24, -95, -218, -90, -101, -94, -18, 82, 220, -126, -109, -143, -89, 85, 66, -126, -8, 53, 117, 204, -47, 11, -91, -62, 97, -113, 131, 179, -18, -34, 190, 38, 39, -114, -38, -93, 68, 117, -93, -18, -151, -267, -19, 63, 1, 19, -63, 277, -202, -66, 15, -77, -24, 44, 32, -50, 132, 29, -219, -143, -4, -171, 1, -32, -146, 8, 98, -74, 5, 8, 10, 79, -25, 121, 68, 109, -66, 19, -104, -44, 10, -102, -50, 18, 174, 175, -85, 56, -71, -7, -34, -74, -71, 226, -23, -11, 59, -162, -47, -69, 16, 169, 34, -23, 75, -15, -38, -130, -28, 71, 55, -5, 0, -89, -174, 92, -121, 30, -44, -84, 121, -235, 3, -23, 180, -120, 42, -75, 77, 0, 168, -87, 88, 37, 239, 93, -161, -79, -54, 6, -50, 111, -45]
6723d5J59k20J09q2j81K50q3K33j69oN4o1qN4k8j83K45j4j24M3O7R7n9k30K64
6748H2n6j05Q1j04K16o9l2M5j25mj27L77q0m2l7O3q3L3Jj23J6J05K3k79J97q9
6774a16J87kj37J06O6o1J32l64N2J26m1o3Q3Mr3J70j31K30P0j62j8l23L55k28
6798a58L02p3r7J69j26p5Q2M2j11K7J20k85J34Q9O3j26j42q5K85j19P8j02J63
6821E5O0j33R5l83L64k08Q6J11j67L22m0k81Q9p6J09j09J49m5Q1O6j33l51N19
6844A80N6j62N0j69Q2j18J38o8K18j79q5Q5J84l1j7l26R7K48j59J53k06J15m6
6867D0p2l5MO4J2j66K69j38l4m1J37j7m0Rm2J9J19m4P6q5K0ok59L26m9j57J94
6894A04k06J57j01J9J9m0K7J23k12K73j97k40J96K29k69J66j06j05J57q9J12L9
$$ y = [-45, 114, -106, 3, -79, -260, -10, -93, 140, -29, -35, 19, -42, -50, 4, -24, -207, 38, 24, -100, -57, 10, 107, 48, -182, 82, 26, -79, 2, -102, 114, 45, 13, 58, -67, -71, -198, 179, 99, 57, 20, 83, 0, 33, 34, -89, -73, 32, 55, -224, -27, -116, 71, 69, -68, 38, 104, 43, 175, -189, -137, -11, -52, -115, -32, -28, -121, 49, -82, 148, 218, 56, 38, -285, 70, -158, 144, 71, -26, 143, 17, -58, 24, 66, -45, -18, 102, -183, -49, 40, 103, -23, -165, -250, 35, -84, -6, -108, 55, 115, -18, 77, -306, 58, -150, -64, 47, -120, 202, 162, -119, -30, -106, 3, -106, 43, -2, 79, 145, 12, -339, 180, 236, 74, 124, -45, 37, -81, 57, -11, 207, 28, -57, 28, 212, 181, 164, -162, -65, 183, 24, 177, -29, 86, 40, -32, -67, -63, 1, 13, -153, 116, -22, -56, -97, 40, 23, -17, -8, -50, -31, 88, 44, 120, 35, 55, 49, -210, 116, 67, -90, 104, -102, 55, -46, -27, -8, -48, -21, 102, -110, 163, -34, -274, -78, 151, -118, 48, -58, -163, -6, -95, 17, 56]
6916E6l2ON5q7r7L00k55P2J62k51m0lJ11J09k90P6L7N3J58j84J00J36j61j6J63
6941A78j24j81J20J99k35J44j12J32j61J51r5j05J14k50l3J29J27N7j10m3J26
6962B8lK75j81k89K51O6K0k5o5j19J40k26K5K07%j9p7k25K42k01J34n9J35N4j02
6987a4R9j85KJ69l5%j91J58J48p7k35K47r8K0j35j25K78j68J17R5j27J20n3O7
7011G7r9K04l25L03j36j26k2J25q9R0J38j19p4K05n4k08K4K16l45K52k5q9n8L7
7035i8K02k60J62n2J8oJ45j54N4Q2oj80K44k39Q0J50r1j00J96n1p3j8M8k02J64
7060A5lj13J27J7j91K49j72Q0k2L7J32j69l6j36K86k13P7j02J33rj85K49q2OK22
7085A97k14J60j01m0O3p5j42J52KLQ6k44J51J39J7k93O3j1Mj6K22j84j1j32m2
$$ y = [56, 24, 30, 85, -2, -99, 201, -54, 18, 180, -71, -111, -114, -3, 106, -184, -108, -71, -18, 140, -44, 56, 192, 31, 15, 178, 54, -127, -7, 192, -43, 101, -11, 121, -40, 111, 16, -89, 25, -225, -258, -129, -2, 55, -55, -98, 28, 25, 300, 119, -170, 81, 147, 167, 142, 77, -42, 98, -128, -103, 104, 104, 85, 8, -217, 25, -176, -42, -101, 34, 88, -14, 85, -100, -98, 71, 36, 36, -155, 3, 151, 74, -161, 86, -12, 8, -127, -252, 26, -142, -25, 70, -57, 63, 10, 77, -22, 182, -143, 160, 24, -102, -124, 1, -88, 2, 140, 21, -53, 152, 98, -110, -86, 130, -215, 37, 12, -77, -135, -98, 104, -156, 6, -46, -28, -34, 111, -43, 11, 93, 87, -93, 151, -88, -8, 142, 51, -49, 147, 96, 23, 5, 53, -149, 15, 12, -101, 26, 43, -148, 101, -71, 9, -13, 24, 156, -13, -49, -185, 101, -112, -35, -137, -4, -13, -198, 51, -31, -25, 197, -17, 143, 42, 2, 65, -10, -152, 0, 2, 5, 91, -153, -2, 137, 154, -139, -76, -87, -83, -99, 123, -61, -72, -204, -246]
7110b46J07m5J15J59j09j07J57q6J37k13Jj5J77N5m5r5J99j86K19j12j6jj65K1
7134i4k1Q0R8j53K06j66J58J63j81r1O6k31K51j81j52J78J03r0J46L6r9j12j7
7157a03PO7k2r9O1m3J52l1M7k24Q9R9o8M9Q6m0M7j38M2K08j18K8J26k24o7J59
7183I0J01j27j50N4j39J40o9J20M0j97M4J86l46K48J2k04K91k55K58nq8M2k17
7206a71K37n5n7J46J00j46nJ06l84K12O5J16k21j4K4J70j44K5k7j15J68m7J1l6
7230d2O2k02M50k05KL0j18j91NK51j8p2m2J73m6J19k12N1M3N7l46K62q8J32Q5
7255A40k08l2Q0m4J14J2l7J02k39J00K3J02j05M5j00R6J27k06M2O6j10O8R0k3
7279A03k83J2J88%L0P4j6k66R9O1lo3Q0mj66K67k82K42j01J13O2j27m3J0R7j71
$$ y = [-246, -139, -184, -69, 90, -19, -126, 31, -55, 82, -131, -130, -145, 32, 87, 42, -53, 146, -40, 179, 67, 51, 50, -115, -94, -115, -35, 63, -90, 116, -50, 108, 271, 90, -1, 65, -166, 85, -96, -248, -70, 33, -57, 89, 125, 26, -86, -103, -96, -29, -51, -150, -89, -132, 20, -11, 36, -188, -99, 0, -68, -19, 67, 27, 74, -64, -22, 186, 68, 96, 222, -2, -69, 90, 191, 64, -86, -32, -171, -31, -100, 20, 60, -137, -93, 93, -253, -5, 7, -197, 94, -161, 97, 92, 4, 46, -171, 66, 11, -46, 100, 200, 54, 49, 155, -229, -17, 48, 164, -57, -71, -47, 123, -21, 4, -23, -138, 30, -17, -6, -42, 20, -182, 268, 63, 65, 95, -23, -214, -209, 42, 24, -48, -90, 83, 37, 156, -56, -5, 38, 95, -251, 11, -77, 55, 140, -68, -100, -20, -64, 50, 62, 25, 127, -112, -12, 11, 113, 8, 53, -47, 49, 176, -30, 12, 78, -32, 36, 126, 103, -180, -168, 20, 20, 50, 124, 108, -158, -59, 2, -1, -64, 16, 12, -154, 113, -169, 73, -28, 85, 147, 20, -23, -13, 84, -87]
7305h7J77j31J45j10K1k34K13j07Q7M9L9Op4k40J81k8K67j02R4Oq2j39J2O5l1
7330cJ81j97l0l3K2K04k26j5K44j08j34J0k5J22n9m3J6o3K30L3k88K16P0q7oJ28
7356A59n0l19M62l87J97j93J37N8j13P1J58k43N4J09N1m3k42L57j59R9j00j53
7378i0K04j33J72m9no9j06p4J02l9J33j81J83j88L7L1o7P7M7P8J55k89q8J02j17
7403a74R1k3j28J23K03J21q2k18L5L2J7L0l8J05j05o5j63J35q3K84j09R5l29L05
7427E9j25j91K54l6o4M6J56k49J63j95J57j2M9M4j99J61j25M0J6o1R9j90K13j41
7451a31L3o5J29j64L62k52L2O3K9Q5j64J75r4m0q3J82k73M16k73J00j16Q6L4n5
7475A6J17k03K05K1q0j77J95K7j09p8j3K2Q2L8p5j13Q9P2j72O0l2Q0J46j85j02
$$ y = [-87, 90, -41, 104, -6, 15, -219, -6, -113, -26, 23, 62, 68, -6, -246, -65, -93, 174, 72, 166, 172, 90, -49, -37, 28, -3, 178, -19, -49, -82, -60, 144, -82, -97, 147, 39, -95, -85, -110, 12, -47, -90, -74, -137, 93, 126, -162, 54, 124, 37, 31, 159, 109, -210, 252, -135, 62, -131, 6, 64, -49, 22, 180, -63, -9, 100, 151, 108, -134, 223, 64, 163, 63, -90, 114, -19, 153, 104, 99, 30, -76, -150, -48, -87, 46, -135, 48, -140, -103, -72, -139, -62, -15, 63, 218, -71, -159, -57, -174, -83, -106, -234, -111, 92, 213, 131, -87, -52, -20, -3, 27, -11, 94, -11, -76, -239, -104, -187, 97, -12, 83, -246, 59, -66, -257, -3, -39, -103, -57, 99, -150, 13, -182, -25, -37, 12, 56, -143, 18, -107, -67, -51, -112, -13, -203, 10, -131, -98, -163, -34, -198, 164, -88, -56, 7, 36, 121, -43, 132, 38, -2, -85, 97, -176, 240, -33, 67, -49, 37, 71, 16, 133, -70, 135, 156, 76, -101, 94, 121, 12, -66, -79, -57, 25, 63, -12, -125, -36, 36, -136, -76, -108, -28, 118, -67, -169]
7500a69K19j05N0p1N5r0J55q1J8O0j03R5K7N5O2l55R3J71k70K40p3K6l4K7o8Q6
7526B0K3K5n7l4J8q9R4J37l41L52j55k26K39k9j76P7L7K39m4pm1r7Jm1J52k55
7552a78R7J26j11J82j09Jj61L23l1j37n3k6j2Q1l6N8l6O5j45j5N8J29q0K1j20
7577a09K40j49j71K22j8L2j81J13O9k99K65l8j3j8O0n4J18K4j43n8J94l6j32n4
7601a36J41J21j58K4n2q0J64j76J0K53oj68o8J62l6K1l1k9R5j21k8J06P9j28K6
7626a5J23l3j58K37l00J63Q5j15R4j4k46L62j98o0O4K3L0o7j61mJ0K21l70J90
7650a39J84k00K12j25O7m9M0J4l4k92K22k8Q0K79j35p9j64M8K46j57k0K3r1J72
7674G4P3p4p3J99k52K62j72L1K3M4k96K31Ln8l3K81j19j86J02j07QP5r9J31j9
$$ y = [-169, 50, -55, -5, -76, -21, -111, 44, -37, -19, 41, -62, 33, 60, 115, 177, -178, -85, 86, -184, 56, -17, 9, -25, 2, -66, 20, 43, 68, 11, -23, -5, -94, 0, 137, -204, 148, -7, -233, 6, -23, -199, -122, -85, 154, 110, 103, 62, -35, -34, -75, 77, -178, -81, 45, -66, 116, 7, 8, -153, 170, 139, 2, -51, -77, -89, -8, -44, 14, -22, 43, -102, -117, -59, 70, -10, 11, -109, 131, -18, -189, 33, 15, 47, -134, -21, 48, -251, 14, -24, -37, -55, 5, -49, 69, 93, -50, -108, 86, 50, -82, -136, 5, 126, -32, -8, -60, -140, 24, -152, -142, 111, 105, -63, -131, 31, -5, 16, -15, -44, 51, -70, -98, 8, 87, -41, -15, 108, 75, -83, 154, -146, 17, 102, -13, 81, 67, -179, 183, -15, -75, -11, 12, 42, -25, -186, -190, -180, 41, -329, -139, 45, -155, 57, -68, -1, -50, -10, 4, -30, -322, -100, -128, -48, 231, 96, 17, -147, -99, 147, -10, -30, -7, -98, 74, 147, 73, 0, 199, -53, 209, 37, 68, 91, 135, -161, 70, 73, 15, -18, 263, 144, -42, 60, -47, -39, 36, -63, 68, 49]
7699D9m4Q5j23J93J15l18NK4M2K16j70O5m0j46J6J59l78K48l1J15k06K46J21n9
7723A84j33O9p9j62K04q9O1k8j55j0J3j4K89k11j33J44J49k15J00L7j79K61k91
7746a88K36J02m69M54j50R1J8j03J34j33K9jj6o2n7Q5l2N7J35r8j29K9R4N2Pq1
7772DM5o5L1n4k5K36j83o3J83k01J61j34q1J55M6J3j5j08jJ62j67K2k0O8j4j67
7798a72K17o0q5j7K36k06j25K77j03L1J9Q7l87M06l2R5j74O5k94J49L9L3J73k52
7822h0k06K66L3k44K95j76Q6n5pN9%J14j1j79J78j24J42%j76J32j29J46j27k3
7846h6R4KJ75k40J22N2q3j02k6K3P0j1J30o3R5k60P2j82J85J61j21QM0J4p7k0
7872b8rj4r7N1J8k7J06k34K37K76k45r8M5m2N5J00j1J30p9j80l6K84k35R4mK05
$$ y = [49, 5, 90, -33, 160, 275, -43, -38, -14, 28, 244, 74, 139, 99, -47, -31, 128, -250, -2, -33, 82, -124, 122, 243, 184, 51, 120, 41, -121, 83, -6, 55, 27, -128, -138, -125, -139, 150, -61, -194, -50, 99, -116, -16, 21, -158, 103, -188, 48, 150, -319, 135, -15, 76, 94, -9, 125, -8, 21, 20, 4, -58, -115, -30, -62, -5, 130, 32, -97, -68, 26, 78, 85, 4, 49, -16, 15, -39, -64, 172, -11, -74, 109, -92, 69, -65, -146, 9, 55, 68, 53, -55, -56, 106, -61, -39, -59, 9, -5, -172, 45, -15, -100, -117, 119, -87, -212, 65, -38, -7, 12, 99, -288, 118, 86, 181, 7, 72, -222, -73, -34, -1, 172, -80, -286, -20, 13, -231, 64, -112, -26, -81, -88, -29, -29, 85, 74, -105, 73, -51, 91, 91, -85, 47, -82, 64, -63, -86, 8, 10, 185, -55, 67, 119, 36, -66, -92, -69, 1, -10, 120, 57, 152, -108, -36, -218, -33, 128, 7, 15, 55, 69, -8, -28, -37, -51, -148, -97, -79, -106, 0, -234, 3, 279, 34, -64, -19, -61, -6, 94, 83, 213, 134, -46, -82, 202, -33, 61, 57, 262]
7898B62m59J22NL7J83j35p1k1J33j48J38p7J11j04p6j02K53j11J8K85j61p2j0
7921@K18k02K4k00J72N2P4j86K52k8l18J29%K89j44j89l8L4J37j13J29k5j18N1
7945@J28kl11J04J33j32J47J31k74M0K95k02j18J69j49N4K8N8J13k11l4r7J70
7968D0j01K7l9QJ05l1j01Q4K1PN3j61M6N8N7J31j95j30J17O9m7l9Q4N4j61q0J14
7995a0N8L1m7j40J26J77l78K59k48J38k5j20J68J76j70L3K9q3M9Q6j38J36m01
8018b94K46j15J3J48n4r0N6J2P4J16O3o5L8j6k46j4M6K28o6K4j62L2q7J28J16
8043A31j17K24j86p5J99j02j50K14j73R4q0q2J09J49l72K24m6K03l3j82jJ5J3
8066b4j1j29Q3K65r9p6p9K17j39P3j25r0J25l1K8p2J72J1M0k40K47j85J21r5O8
$$ y = [262, -197, -75, -70, -33, 150, 15, -56, -77, 56, -92, 46, -31, 80, -24, -100, -202, 51, -60, -42, 243, 82, 10, 0, 218, 16, 40, -160, 12, 64, 138, -48, 204, 176, -142, -13, -13, 276, 132, -57, -95, -61, 76, -37, 92, 67, -51, 0, 128, 126, -185, -81, 52, -80, 67, 198, -76, -36, 259, 57, -61, 108, -41, 13, 41, 99, 212, 1, -33, -130, 40, -61, -34, -73, -65, 40, 9, -92, -8, 13, 20, 73, -88, -42, 16, 73, 204, 9, -121, -4, 65, 18, -21, 63, 117, -44, -124, -10, 48, 79, 32, -108, 18, 195, -183, 76, -172, -34, -59, -179, -11, 165, -5, 28, 57, -26, 23, 109, -29, 107, -294, -48, -163, -150, -2, -56, -146, -90, -78, -4, 112, 175, 110, 148, 132, -114, -128, -82, 146, 80, 104, -58, -26, -113, 15, 131, 14, 238, 52, -23, 176, 74, -76, 138, -35, 59, -21, -103, 6, 155, -217, 7, -39, 164, 131, -51, -52, -37, -24, -35, -164, -81, 184, 85, 9, -70, 147, 8, 81, -44, -134, -9, -40, -12, -84, 88, 99, 139, -101, 146, -39, 82, -13, 55]
8091E5j20j1K68k13l9J57J60l11P9%n1J74q5j09K21k04K22k16j6j8K11j35M4K5
8115H8p0qk18J30K52l24K4n9L09k45J59M6l07K49k3L1N0q5l1L6m1J36j62J85k77
8140a55K81k26K89n1j52ol3K70J08l83j08K62k27O3L09m43J93K0q5J19j21j89
8162b65J92R2j56K98j60r1R6Q6n3k0oppJ00k40J4J19j5p2J48k04Q4Q8j30J22K42
8188B55j83p8k0
$$ y = [55, -65, -76, 192, -21, -60, 97, 257, -54, 25, 25, -26, 148, 63, -46, 175, -29, 193, -23, -39, -57, 154, 19, 63, 88, 18, 10, -208, -78, 174, -150, -126, -185, 124, -121, 38, 84, -223, 26, 3, 34, 84, -1, -32, 4, -37, 99, -63, 122, -155, 126, -100, 189, 138, -14, -20, -53, 217, 325, -58, -166, 96, -131, -68, 241, -202, -9, 11, -74, 45, -76, -265, -73, 19, -137, 161, 1, -90, 6, 92, 39, 19, 13, 6, -1, 99, -141, -127, -8, -23, -95, 53, -151, -67, 21, -109, 13, 255, 72, -6, -26]
8191b6
$$ Imaginary data points
##PAGE= N=2
##DATA TABLE= (X++(I..I)), XYDATA
0@%%%%%%%%%qJ6j6J6k4L2m0M8n6P2q8J04j28J53j77K09k49K92l38L90m48N13n84
32c11O64p54Q53r62J081j211J356j515J688j875K081k308K552k821L118l439L790
49A987m176M601n068N585o161O803p526Q346r283J0367j1637J3152j4996J7295
63I289k0255K4232k9897L8670n4227R0140l30357j15368N37886J20955m4657j96186
75C0225o7533Q395P655j42076j4605J91599K25069L5515p1941j81825j56314l136
87a38972P0674k157M6884J01163O7892k0510j08665j85302p9964J28492J57824
98C7359J6716N448M8191M040p0103j40784j21409R9317K45753R1590j26180j28053
110c8115j2854M4854K5049n9350r6872N5313J76781O4839p7268j13224q5109K1433
$$ y = [0, 0, 0, 0, 0, 0, 0, 0, 0, 0, -8, 8, -8, 8, -16, 16, -24, 24, -32, 40, -48, 56, -72, 81, -96, 113, -136, 156, -182, 208, -240, 273, -311, 353, -401, 452, -510, 571, -640, 716, -799, 889, -986, 1095, -1213, 1339, -1482, 1636, -1803, 1987, -2189, 2412, -2656, 2929, -3232, 3571, -3955, 4391, -4892, 5475, -6162, 6990, -8006, 9289, -10966, 13266, -16631, 22039, -32188, 57952, -272405, -387773, 150113, 271068, 226411, 30225, -37308, -28913, -21258, -163334, -177939, 13660, 238729, 274244, 202303, 20478, -135836, -138972, -68298, -70455, -23571, 77592, 145484, 124974, 16309, -168993, -248957, -120465, 37359, 54075, 59523, 107714, 111754, 41651, -99133, -220542, -121225, 124528, 216118, 89938, -38115, -50969, -6115, 18934, -40416, -137288, -81975, 94806, 159645, 82377, -30847, -115956, -94523]
122i4523J02267L1644n1238J3730R1204K3587q4361j21642p0502Q7508J64097
133I1771J2119j08573l6365M2540K3255l8978p5267j6813J05448J18441k5126
144I2452j01873k8181K5280K3730O961m3070k1992P9291P8409l3121r9659o9074
156i0847P562P6194O4724l7537o6314L2384N8343k4993o7243m0558L9637J06326
168E7678L8320q1361o5979M0908N9851j5557n6359l2328L3194Q9513K0994q8847
180B7o2953K0153M0230K1894j8092l9501J2817O9479J8035p6866o4854K0588O9677
193A0634O2158j9921q8346j5012P4774L2670m7768n6491m05N8740N5300k3168
205D3165p7929j4240N5543K0077k6324k5473o005M1033M6999k8187o8229j3742
$$ y = [-94523, 7744, 39388, -11850, 1880, 93084, 116671, 32310, -89332, -159834, -72326, 91771, 103890, -4683, -41048, 1492, 24747, -14231, -89498, -106311, -863, 117578, 92452, -9421, -37602, -12322, 11408, 18369, -24701, -46693, 32598, 111007, 77886, -21773, -90847, -83285, -7091, 57633, 20096, -46218, -13834, 44509, 19516, -47727, -88285, -48648, 57678, 95998, 14637, -51342, -10434, 49417, 33860, -22499, -54827, -21633, 67880, 88874, 27, -62926, -42773, -2543, 19351, 1259, -38242, -25425, 44054, 62089, -14777, -79631, -59043, 10634, 72792, 52871, -35475, -50487, 24287, 56957, 9189, -47302, -47707, 11033, 66333, 43165, -34764, -49004, 6539, 26616, 292, -25181, -31186, 9847, 56846, 28659, -39570, -53312]
217e3312M3180L6858L59k8431k6317K5486M5362k8566o2159M169N2576L9991j0705
230C8491o0582l0646N1637N5663l0171o6428l712M9370M5547J482o2074m8242
242e9665L7688N0774n570l1912j7508J4934L8452J0432m9559m6261L0202N7345
254B9352R067k8238l7864k807N0832K2052m8164l6970K7167M6892P753l3111l6138
267c0177M458M6387J3665m8346k5545L0525L5199P989l1496m3720N002M8586K2859
280C5386k9506l0289P987K6639J9416j7800m6290N33N2632K3947k8380l8140n042
293b8907L6038K9867k2525m9647j989N3055K7464k6867l8358j3961K9914L6450
305C0534j4843l9219l185L2911K4126j4413l3982j5382K3856L7661m486l7296
$$ y = [-53312, -10132, 26726, 27085, -1346, -27663, -2177, 43185, 14619, -47540, -43371, 9205, 49196, 38491, -22091, -52737, -1100, 54563, 24392, -42036, -45748, 3622, 49169, 50651, -11423, -59665, -21977, 28797, 23227, -8685, -26193, -11259, 27193, 37625, -11934, -58195, -27993, 29352, 38419, 10181, -27683, -30490, 20342, 42394, -5770, -42740, -15573, 31319, 39072, 5961, -30177, -25719, 20668, 34333, -14013, -39558, -9033, 26166, 34155, 2659, -41061, -36059, 12527, 35386, 5880, -24409, -16422, 10217, 29633, 11833, -34457, -33924, 18708, 42655, 14275, -23865, -28907, 7131, 36998, 14473, -35174, -37163, 15892, 43356, 16489, -21869, -35830, -5916, 30534, 15691, -23528, -26713, 6198, 30324, 15911, -18071, -33453, -9597, 28064, 23578, -13718]
317a3718r310K3314K4315l119l4940j9628K7698L6353m374l8935j6512K5585K7633
330B4362m312l5683k0998K9918L7619p007l6278k1350K0470L5290K593k9427k3597
343b8400J6353L5992K624k9414k2759R395L3082J1128k6787k4171Q429L0039R336
356B4847k8433k4281J1253L1176J3402k6190k9053R513L1185J2174k4573k7138
368b6118J0533L1003J2727k1262l2249L366L2853J3991j8391k6847J69K8697J7303
381B5775j6188k9954l601L0243J8165j5031k3276n912K2950K2574j4933k9467
393a8655l105K6022J9647j3071k6317p312K1097K5844j1037l2352l751K3504K0788
406B1302m559k7501j2903K1741K5965o082k9127r266J8594J9355Q43k4361j8827
$$ y = [-13718, -23028, 286, 24601, 21482, -13458, -33086, -5388, 30965, 26591, -12344, -28856, -3271, 24362, 20050, -15633, -36631, -6713, 30906, 23899, -12379, -33729, -13259, 22031, 24624, -4803, -28400, -12047, 23945, 26569, -2845, -25604, -16209, 16873, 28001, 1214, -22957, -14528, 15511, 24847, -3586, -27867, -16614, 14562, 27964, 1774, -27279, -17766, 13419, 25593, 1020, -26118, -15585, 15418, 28145, 6883, -25366, -22000, 10853, 24844, 6453, -20394, -20225, 8472, 25775, 9587, -20367, -23968, 6275, 24440, 9409, -13867, -19779, 3171, 25745, 10812, -18655, -21760, 4262, 23909, 10838, -15479, -22791, -1694, 24150, 13113, -19239, -22990, 514, 21302, 16743, -10758, -23661, -1920, 24045, 17963, -11164, -20430, -1836, 17519, 18362, -5999, -24826]
419b4826J9232K4997o180k2652j1687J2532K3019K689k3452j8468J7349K7310
431A9863l723k0854j3040Q236K7200P116k7991j8679J3773K3998K339j9954j7748
444a9464M569K6060J0904k5501j9413J2183J8558Q660j2314k2382K905K6433J0231
457B1429j9558j8834O920J7936J1114r647k6478o06K8673P963j7782j6268q02
470a5940J8507J7292j1074k6408l49K6018R788j3797j4025n299J5336K2019j1968
483A0100k6039J109J8855J0198o198j6773r504J5775K2648r402k6336M23J5778
496F34J2148K242j9792j5965J8882K2661q805k1379m884J0697J4582M791j9822
509d010j9143J8163K0423q885j2736n888L826J8922O043k2260j4290J7364J7585
$$ y = [-24826, -5594, 19403, 13223, -9429, -21116, -8584, 14435, 17124, -6328, -24796, -7447, 19863, 16140, -4714, -17754, -9518, 17682, 24798, -3193, -21872, -8099, 15899, 18238, -1716, -19464, -14895, 11165, 22069, -3432, -22845, -10662, 7896, 16556, 4242, -18140, -15235, 11198, 21429, 1871, -16963, -10043, 7893, 19007, 9360, -17118, -17724, 10949, 18912, 1130, -15138, -15940, 2567, 19859, 8785, -17623, -17972, 8046, 17834, 4037, -9988, -15287, 49, 22068, 10100, -15939, -14830, 4025, 14223, 8025, -8748, -18252, -2477, 20171, 10769, -15567, -15144, 634, 12782, 15024, -4768, -20733, -1851, 20810, 12005, -9374, -14258, -3561, 11021, 15812, -4010, -23153, -4990, 15433, 6548, -6188, -12076, -8250, 10672, 16715, -5545, -19835, -2471, 15114]
522A5114n304j0799q383K90K2365P742k6892j2960J5802J3076J574r006j7497
535a4878p03K4522R396k3324j2995J1434J0199R139l448k3777j395K6049N981
548A6200j6410r184L596Q265J1397m178k3555J95K5229R47j5592m636k037Q952
562h11J6661r142k3421L895K1422L672j0004p164p910R113K3028q883k5580L885
576a1239J4591M563O10j1679j4378J2168K3233q307k2142L150J1124M474N617
589A1785j2878j6439J7342J8414j2558j3958J920N081P045N981j5204j5918J6456
602b931J6668j0859q311j656k371J5081J0967j8898j4685J4603J3798l099n903
615B404q100m852J8362J1152k3077j1499J5178P517q96m103j3322j011K0010N484
$$ y = [15114, 9810, -989, -9372, -9082, 13283, 21025, -5867, -18827, -3025, 10051, 11625, 2619, -14878, -15581, 8941, 18337, -4987, -17982, -6548, 3651, 12790, 9342, -14435, -15830, 10219, 16200, -210, -9394, -5798, 2467, 13864, 9686, -13869, -13674, 11555, 12502, -3090, -7726, -9763, -811, 15850, 6708, -16713, -12818, 8604, 12276, 2272, -4892, -12802, -3689, 19339, 10456, -15124, -11239, 3352, 7915, 8525, -3154, -17532, -5364, 17869, 9562, -12580, -9430, 1694, 6168, 11785, -1093, -17532, -190, 18224, 5666, -8292, -6372, -1291, 5754, 11735, -3469, -19387, -2931, 13737, 2878, -5433, -7089, -9460, 5621, 16588, -2310, -16995, -2392, 11406, 8307, 2404, -5696, -10548, 7814, 18966, -4111, -15610, -432, 7085, 6189, 2086, -11236, -12247, 7763, 13247]
629A3247k0120o361J2333M531L588K8j7430j691K2370K699j4992m327J431M458
643b36J1565j547k1392k884K1356L832j1423l990m534N153J7526n493k1146L546
657i667J7142Q53o407m159n757N728J6661p528j9484O204J0431l38J772p344j1714
672a3607J0078J6529o984j5282K483P104M124N989j0150j5466J3824J6205r849
685D998j0724K63J766Q735O036j3704j2799J2808J2572q205n094r18l503J1821
699D052R132j6087q618J1584P288k019k453p333m049J4446Q245j7372q451J1242
713c93L514J178r12j2689r52J7033L042j4744l706P798K874L730M79j4376r55
728i079J7939Q27j1248j781j817L063J1721k114j7235j351J6011K760p607k565
$$ y = [13247, -6873, -13234, -901, 3630, 7218, 7246, -10184, -11875, 10495, 13194, -1798, -6125, -4694, -236, 11329, 9782, -11610, -14494, 6862, 10694, -729, -4719, -9253, -4100, 13426, 7933, -13213, -9667, 7475, 8328, 1921, -2238, -7995, -2267, 14394, 6866, -12618, -6414, 4017, 3679, 5451, -1893, -13607, -3529, 13000, 6016, -9266, -6783, 321, 4445, 10434, 284, -15182, -1358, 14847, 4998, -5726, -5463, -3697, 5038, 11074, -2630, -15429, -2621, 9951, 1746, -3348, -4266, -7769, 4052, 13184, -2903, -11521, 63, 7351, 5332, 2879, -4454, -8503, 5943, 14188, -3184, -11635, -393, 3121, 4299, 3387, -9302, -10254, 6779, 9821, -4923, -8629, -831, 2043, 5773, 6252, -8124, -9079, 8860, 9687, -1561, -3342, -5159, -2096, 9625, 7511, -9724, -11075, 4936, 7696, 89, -2476]
742b476n373M110J5183n380j6699N178J1514o52l419l377n099N393J1448p085
756C266j3379O787O595k284K980m995j0238Q686J2609o007r730J057L920N018
770D285O618r767j4499J0812J4732p287q266j286j40Q775N177j2446q507J0494
784a305Q111o641k878J129k579O680N815j1173l871R056J953j629Pn365l661R877
800C526O731j2127p454P021M538L048j273j3165r81J6375L626j1862n842N089
814b750N292L655k109j0178m4J3073o99q689M43k71L29O434q74q839l25P816J858
831D122l742j580m032J851J1503j638j3002O83Q820K813k129o636m854P289R778
846I246n534j1570K609P866M93r58m695m515P239O518m669m990P03K172K967K499
$$ y = [-2476, -7849, -3739, 11444, 6064, -10635, -5457, 6057, 5405, 1986, -1391, -6490, -1097, 10351, 3266, -10113, -3326, 3269, 985, 3965, -1030, -11268, -2582, 10027, 4020, -5710, -4653, -733, 4285, 10903, 1136, -13363, -2551, 12181, 4894, -3372, -4658, -4798, 3977, 9154, -3292, -11799, -1305, 6806, 165, -2713, -1584, -4163, 2517, 8332, -2841, -6712, 2344, 4297, 2668, 2675, -2690, -6351, 3526, 10257, -1870, -9324, -2303, 2235, 5283, 4010, -9155, -10136, 6239, 9865, -1997, -7839, -2750, 2542, 6197, 4088, -6090, -6134, 6939, 6240, -2449, -2006, -2277, -1948, 4486, 3612, -5227, -5552, 2264, 4122, 380, -1200, -5232, -3381, 8122, 6484, -6518, -5835, 2985, 5798, 3669, -2967, -7821, -532, 9246, 3712, -7858, -5249, 2617, 3110, 2152, -2543, -7058, 181, 6699, 2030, -2960, -2257, -85, 2882, 5381]
862E381m296p490M086Q223k381m922k823p48P665M045q549o976N548Q284o72o181
878a806k619J690P018K520q867l571O874L110q47k887m102J456N000J023n473
893a481l886L287L341J801j218p018o70Q774L117n124n198j5O411M506l921p453
909d747l00Q425K738n710m026j81L984M552m007n035J253M127K184k330l440k24
925b737L018M248j663n829J47L821K733q72o155k555N750M773j861o740j789N782
941G1M283j410n589l012N686N301k289m331k330L262M988j285m359k243K000M387
957C130m13m418k271J165M935P93m671k200J750M814J820n470l254L416M364J145
973D635m664l846K595M467J016m755m164L213L672L62k445m449R21N511N20k900
$$ y = [5381, 1085, -6405, -2319, 5904, 3523, -1399, -4222, -4970, 2695, 6740, -1809, -8785, -3237, 5047, 4375, -1806, -4425, -2735, 4283, 6803, -2064, -5635, 1239, 4349, 3502, 615, -3487, -2031, 2969, 3992, -1481, -5367, -2080, 1261, 3062, 1844, -5174, -5844, 2930, 6047, 923, -4275, -4290, 2121, 6627, 2706, -4747, -5047, 3378, 6116, 406, -3620, -3801, 183, 4735, 728, -4307, -3054, 1073, 3257, 927, -2513, -2737, 281, 4529, 2866, -2963, -2816, 1005, 3738, 2866, -3289, -5844, -94, 4679, 2818, -3922, -5711, 71, 4354, 2944, -2645, -5657, 29, 5330, 3041, -1290, -3620, -358, 4630, 3345, -1014, -3257, -1257, 3130, 2717, -1701, -3972, -2807, 2128, 2921, -1750, -3950, -2200, 2614, 4434, -1036, -4290, -874, 3490, 4635, -29, -3875, -1280, 3187, 4203, -552, -4716, -1503, 2169, 2531, 86, -4363, -3442, 2069, 2589, -311]
989c11k733O12M589J614k191m175p24O149J913m306k758m98L354L998l362n596
1005d425O69M750K335k978l053l36K315M921j974n778J740L427J009l48l124k339
1021c189L458L883k162n283M26L542K83P02l053l714N129M895l456l564j94J721
1037e76L316J142m007m343M363M884l152l148k22j328M505K568n829l027M319
1052e35K715j550j545q06m80M036L098o242k103N185O32r69J03m157j08N653J051
1069C978n982j961L492Q38Q82J144n998j286P757N36m969j27Q50P57L634l44o210
1086c009k23O971o66n069J436l40m32M974k156o572K881M736j255j831L93k020
1102b182N51O090j926o964L006L797j958K063j264n833L207O273l170n403J990
$$ y = [-311, -3044, -2432, 2157, 3771, 1580, -2595, -3319, 2830, 4743, 437, -2321, -2819, 535, 4533, 1171, -4425, -3756, 994, 3329, 351, -2702, -3038, -723, 4198, 2224, -3554, -1814, 1613, 2622, 2274, -850, -3189, 269, 4152, 1990, -3293, -2867, 675, 958, 1660, -1393, -5107, 22, 4917, 1461, -2103, -2297, -576, 2740, 3882, -125, -4468, -105, 4779, 1627, -1521, -1743, -3071, 1434, 4002, -1827, -4854, -535, 2180, 630, -915, -1721, -2201, 1835, 4933, -1309, -3412, 1773, 2405, 1436, 1539, -2618, -2726, 2927, 3978, -2004, -3965, -473, 365, 1247, 2391, -3607, -4893, 2864, 3400, -1569, -1696, -846, -89, 3545, 3201, -3009, -3232, 3739, 3073, -1996, -560, -900, -1332, 3642, 1486, -5086, -2205, 2531, 1276, -555, -162, -2182, -1631, 4459, 2533, -4431, -1425, 2372, 414, 2477, 1213, -4620, -1413, 4860, 1690, -3713, -1723]
1117a723K484j082K381j414n882M896N737n961j655L271j104O28K589l316m280
1132d431N192L619n004j138J869l267L009M990o485l733N854K145k105K17j748
1147a016k371M661M618o692k972N969p23j900K827m272k112O278M21n715N34L480
1163A015j825J24L086m678k057P677k57n241K292J30j404M351K87o808J46O516
1179C354n79m767J707j004j386O240j427p563L482M752k870m32J501k707K9N600
1195C930j702n833L379K726l742K432Q13o078K644N927m126l586K526Q28o19L323
1211B842j958o021M762N786n768j546L141k212J237L528m588l475N163K085n097
1226b121M50K544l541K101M741n869k425N870l47k036K718k037l382N039L632
$$ y = [-1723, 761, -321, 2060, 646, -5236, -340, 5397, -564, -2219, 1052, -52, 576, 3165, -151, -4431, 761, 4380, -624, -1762, 107, -3160, -151, 4839, -1646, -5379, 475, 2620, 515, 732, -1016, -3387, 1274, 5892, -800, -3772, 2197, 1474, -426, 2401, -1871, -3983, 2295, 2716, -2999, -2465, 1015, -810, -686, 2400, -2278, -4335, 3342, 3085, -2156, 136, 266, -1138, 3213, 3500, -3308, -3162, 3354, 2775, -1992, -285, -1289, -2675, 3565, 2138, -5425, -1943, 2809, -61, -493, 1008, -1699, -1670, 3930, 2228, -3605, -226, 2500, -1242, 1190, 2003, -4075, -1431, 4496, 370, -3216, -690, 138, -481, 2842, 884, -5137, -375, 5411, -357, -1903, 1238, -974, 263, 3791, -797, -4272, 891, 2976, -2121, -1671, 873, -2668, -567, 4174, -1695, -4120, 1750, 1403, -633, 2085, 48, -3334, 1705, 5337]
1241E337o184k438N199j121j067K873m448k730P158K8o145J501K958j778Q01K410
1257B354m420r82O583j526m814M002J11l285M321N47n933R24M854j619k518K039
1273F38k053j637O336n14p504L299M142k736P25R52m296J633N227k767m755L528
1289B18K118l903K118Q22n136K587M961m622k019L628r74j168L419r55m909L808
1305gM388m599q34K720l368J284M576m425l647M556J542l408M17Q21k664K304
1321c44M131n256k007N632p85k269K502j386k187L868J529n195k79L622j336j276
1337a036L246l243k869N864L33m832J350J395j680K574J867m340j452N240k16
1352B201l668K098Mk585M231j2n545J588M021k229j792J650o27p26L713j012m870
$$ y = [5337, -847, -3285, 1914, 793, -274, 2599, -1849, -4579, 2579, 2607, -3538, -2037, 921, -857, -56, 2354, -2066, -3048, 3535, 2009, -2805, 1197, 1308, -1977, 2344, 2891, -3042, -2118, 2736, 1117, -1401, 638, -1415, -3052, 3284, 2770, -4734, -1435, 2707, -29, 696, 1648, -2648, -1015, 4212, 1445, -3310, 218, 2336, -1567, 551, 1373, -3763, -1176, 3785, -837, -2856, 772, -202, -1370, 2049, 1094, -3815, -7, 4381, -218, -1052, 1668, -1700, -416, 4160, -265, -3912, 644, 2186, -1222, -805, 16, -2648, -344, 3787, -1469, -3476, 2156, 1371, -898, 1604, 218, -1969, 1899, 3428, -1767, -2046, 1576, 240, -1036, 2210, -1033, -3902, 1962, 2295, -2537, -1187, 208, -1472, 1102, 2969, -1371, -2823, 2417, 2201, -1467, 631, 635, -1950, 2281, 2269, -3276, -1688, 2333, 104, -1688, -38, -665, -1391, 2322, 1310, -3560]
1369c560L150L234l146O36J155l201J121L502j754l289J748R75j336J700K53m805
1385c617J984M469k873j803K242r71M72K486k009k754K872K479l469p23K348j752
1401f19L64K713l641j499L708N1k172R40O5j931J749K695k926j827L476k68p58
1418A20J672k273j615L664Q62l065r98J747j90p8J190k101j228L947m95l104J555
1435c90O74r86J572L53k183J49K555n18j699R52l37j540K717j69l346J198J805
1452H07q37J5j45j198P19K409q12l043J773J904j212R5J59k045J363K185j927
1469B10j351N67N55k86M18O7k037P99K530j427n86P47r12J187J242j619j060J380
1487D24J201j187j163M80J37L31J052k136j001K198k80m26J96o23J20J275O04
$$ y = [-3560, -410, 2824, -322, 314, 1469, -1732, -611, 2891, 1137, -2152, -404, 571, -765, 935, 1188, -3617, -1633, 2836, -37, -1840, 402, -569, -97, 2389, 380, -2374, 498, 2977, -492, -1215, 1133, -619, -255, 2458, -1183, -2682, 1026, 1077, -1095, -155, -90, -2021, -272, 2423, -503, -2330, 1146, 878, 120, 1792, -481, -2096, 1568, 2430, -635, -1633, 114, -76, -154, 1036, -1065, -2293, 1654, 1159, -1945, -390, 284, -702, 870, 1223, -960, -811, 1744, 1226, -473, 479, 142, -1398, 1319, 1150, -2196, -998, 807, -30, -15, -160, -1358, -639, 1770, 958, -2085, -312, 1592, 380, 475, 634, -1411, -48, 2137, 210, -1141, -574, -19, -305, 113, 180, -1857, -1058, 1472, 45, -541, 206, -706, 481, 1723, 104, -956, 424, 1625, 438, -725, -245, -108, 223, 1275, -861, -1862, 336, 56, -370, -174, -797, -677, 598, 1202]
1504A202j174j355J450Q30k10L75j821o15K329M93j693j014K67J080M98q24p16
1521h98k27J858K40j687M36N25j04N75m55n26L31K28M90n84o43J52j56Q77K52
1540F84j996k3R70Q47J24j734j57J510R77j58j262m68J724M69j044o79l77P76
1558A83M26r15K1n26O51O91j179r0O64n84R73K29n82m53K51J331N6j076j23m65
1578e17J113J288k338j149J557O47n26o44o28L32J358J24j235l02J847j35j013
1595b21J016r25l75J223m6r88K25Q9j74L16L72j185j083K326N28k049K32M90k90
1614e19J766k58j945M62K109n20j339L99K91p59R47M6k140J293J129j699K57M20
1632f0p60J37J388q2j901P16J481j006O20N84k236J048K074j535j825J322L00
$$ y = [1202, 28, -1327, 123, 953, 743, 1118, -703, -1318, 1011, 1504, -189, -1203, -936, 144, 642, -182, -898, -1125, 733, 973, -714, -278, 247, 143, 718, 263, -263, 68, 296, 786, 202, -441, -289, -445, 432, 684, -1312, -1335, -365, 482, 606, -1128, -1285, 225, 1202, 1044, -218, -686, 1038, 1507, 463, -216, -593, 183, 609, -306, -285, -811, -160, 531, -648, -738, -74, -658, 315, 544, -38, -491, -240, 1091, 1147, 71, -52, -517, 596, 1884, -454, -1603, -46, 601, 75, -569, -1197, -865, 493, 617, -618, -920, 927, 792, -221, 795, -130, -505, 718, 672, -316, -91, -2, -176, 140, 512, -673, -1756, 570, 1098, -951, -719, -229, -519, 1247, 989, -956, -494, 1615, 1095, -244, 155, 446, -313, 634, 680, -1460, -167, 962, -737, -480, -60, -820, -683, 705, 623, -1278, -562, 919, -87, 533, 1117, -1119, -71, 2003, 468, -1357, -35, 265]
1649B65l60N14k11k025Q89K546k488l42J937j053j72K016j454j055J820M15j428
1666a86J65J022j525J50K060k194j724K788j12j433J055n41r43J727J253k025
1682d63q62K610o55j184J862j097j785K639J67k540R59J066j439M8J743j859q09
1699a599K712k20k501J587O56j686K034Q43l004O34K059q10j490J260k37j395
1715a157K134J17l276J580J985k504M85J699k033j13K518r70j889J632J095j892
1731e89P45J151k674Q88K736k568j267K362q18r19J731n32k207J409K287k548
1747h13k82K541j969j81K689j541j991K455N40k106O59J056k227M99K374k372
1763f69j687L535q02j869K182m42j965K499O79k479M34J985j125j009K248j227
$$ y = [265, -95, 419, 208, -1817, -928, 1618, -870, -1212, 725, -328, -500, 1516, 62, -993, 827, 1242, -186, -21, 1001, -524, -374, 1686, -508, -2232, 556, 444, -989, 66, -475, -1418, 309, 1562, -463, -1325, 1285, 630, -554, 1308, 211, -1574, 1065, 1232, -1308, -349, 717, -722, -674, 1069, -790, -1599, 1113, 893, -1608, -21, 635, -1051, 983, 1826, -1178, -544, 1515, 705, -785, 475, 238, -1157, 977, 1094, -2182, -602, 1383, -1121, -636, 1063, -970, -1083, 1435, 465, -1424, 208, 1303, -589, 156, 1307, -1367, -479, 2257, -311, -1578, 784, -34, -953, 778, 246, -1961, -552, 1735, -813, -1095, 1446, -523, -704, 1985, 444, -1547, 908, 1448, -658, 1, 1057, -1170, -671, 1703, -669, -2356, 1179, 377, -1492, 690, 248, -1717, 782, 1461, -1018, -584, 1401, 276, -733, 1515, 288]
1779B88k356L323J76l008J598P65k226J120J607k353q84L309m15k524K037L53
1795H10k055K057J165l704J311K572k388r22J980q62j158K152k46k760J541J897
1811A390k761J019K177k953j20L178j332j866J924K64j747J615P88l352J223K901
1827B348l105j070L044j124j241J913n14k310K401J506k640M2K680k207q17L224
1843B130j932j967L000l11k206J704N55k662Q89K365k084j714L035m27j736K442
1859A081p50j908K637Q72l224P60K641j951r48J912p27j953K897m90k976K170
1875D3R85k681J153J734k239n13K720p35j315J642j06j965K280P89l235R27K392
1892A876k215n94J569j308k74J753n61k114J880J461k777O80K391k279j61K329
$$ y = [288, -2068, 1255, 1431, -1577, 21, 786, -1440, -320, 1287, -1066, -1950, 1359, 944, -1580, 457, 810, -1245, 812, 1977, -1727, -416, 2156, -232, -1154, 826, -36, -1194, 958, 712, -2048, -507, 1390, -1371, -352, 1825, -1128, -1248, 1930, 598, -1268, 656, 920, -827, 788, 1576, -1776, -553, 2348, -757, -1827, 1217, 93, -1148, 765, 251, -2059, 342, 1848, -792, -750, 1930, -277, -1094, 2130, 198, -1769, 1231, 920, -1286, 418, 973, -1689, -800, 1565, -519, -2233, 802, 375, -1361, 1081, 331, -1577, 1060, 1932, -1292, -532, 2109, 158, -790, 1122, 395, -1558, 1339, 849, -2127, 43, 1028, -1653, -500, 1234, -1005, -1518, 1202, 467, -848, 794, 688, -1277, 1003, 1792, -1443, -516, 1876, -339, -933, 636, -672, -946, 807, 246, -1868, 12, 1473, -1304, -624, 1767, -512, -673, 1656]
1908A656j604r22J882m95j333J463N72k909P81K739k242j085K180j077n12K300
1924A394j415j568K111J173k241J60J832j245n73J651j292j267K677r59j913J712
1940B37K59j898P98J609j456q99K019o05r27J953n69j870K572M13k581P51J466
1957A272j056n31P60j013p00K275l46k530J827R18k167J096J118j808M84J317
1973I16q14m72J409o86j334J561J049k603M76J739j580R9Q68j451K00J595p58
1990B14j675J425J263j779K81J067j195K31J489j551m24J677q63q15P40J88j139
2007h66L06J175j154j29J485j535k46K236q00j878J751N65q43j22N29n00QJ170
2025A152j393o99J754l71j683J165j3p82Q88K09q18l1Q26k06n77J541l50j444
$$ y = [1656, 52, -870, 1012, 517, -816, 647, 1219, -1690, -909, 1830, -412, -1497, 683, -394, -906, 1394, -21, -1589, 522, 1695, -546, -386, 1446, 201, -372, 1279, -13, -1280, 1397, 438, -1475, 237, 496, -1402, -604, 1005, -451, -1350, 669, 64, -863, 1090, 521, -1349, 1223, 1636, -945, -194, 1272, 216, -315, 445, -568, -1268, 1007, 661, -1869, -42, 876, -1291, -195, 923, -885, -401, 916, 102, -370, 1039, 353, -981, 580, 1629, -974, -498, 1241, -339, -240, 628, -823, -623, 972, 214, -1461, -36, 1227, -552, -271, 796, -399, -168, 1321, -230, -654, 1023, 160, -655, 85, 273, -866, -560, 615, -539, -668, 817, -718, -964, 1272, 472, -1406, 345, 910, 67, -55, 474, -26, -18, 1152, -241, -940, 814, 443, -1240, -75, -88, -870, 18, 227, -591, -622, 204, -2, -579, 962, 612, -832]
2043h32J318P00j414K94L27o33N13L37j113l00J056J89j513N04R96r20N86J95
2061B90j120P49R41r71j34N51J26n55K01L38o65O7M72p76M5Q48j058M3J015K6
2081D33r59J58O15J07k04L19o54J82R21q36p27R50n6l20J49n58k0K47K81k17m02
2102e91P09j93o2M23q3l13N15k1j69M68n26j99N7L63P9r92L43M10l06J86p67J71
2124d98O00J9k51J09k09M43L2k86K13l23M69N3n55P1K39q0J12o06O8K81k27L33
2146Gj1l08L40j32K04L57m82NM5J19K52n74J92M13m70M0%m76J72L22j20m07K97
2169b15L37j86k54N82l06L5N53n10q9L53m88P9L10j94l19NP02l90o57O67k85m
2191b74N64m56l17J036j3o31R1L14j98q2M19l59m83Q65m16o05P75j83o59N68%
$$ y = [-832, 486, 1186, -228, 66, 393, -240, 273, 610, -503, -803, 253, 442, -1071, -567, 429, -491, 95, 290, -830, -81, 860, -111, -245, 306, 432, -123, 78, 416, -249, -182, 290, -486, -441, 407, -651, -608, 407, 433, -526, -368, 247, 354, 150, 469, -185, -3, 918, 82, -645, 305, 249, -71, 78, -480, -500, -253, 28, -189, -591, 118, -75, -137, 286, 203, -110, 405, 384, 215, 683, 157, -42, 15, 378, 457, -535, -192, 218, -88, 98, -669, -498, 102, 121, -130, -21, -230, 213, 245, -41, 172, -151, 318, 371, -184, -113, 126, 46, 158, -448, -380, -99, -326, 7, -4, -312, 28, -104, 100, 457, -25, -20, 25, 144, 396, -178, 14, 427, -43, -3, -3, -479, -307, 15, -105, -512, -215, 122, -64, -318, 264, -42, -7, 546, 36, -53, 300, -188, -109, 201, 7, -312, -307, 395, 5, -652, 15, -270, -274, 290, -166, -483, 553, 540, -91, 0, 314, 116, 34, 453, 94, -389, 476, 60, -545, 230, 47, -612, -44, -44]
2212d4m43n8P37l17k2O49k80p79J056M36j508O63M90m59k81O34r05J15N88p9r49
2233g56N81N42j125N04O73j134Q12N80q89R6P26l73n75O94L92j310K27J070j250
2252e15J34Q22j252K16J266o42q77Q68L53n73J82O72p61K3R46j061m55J495o49
2271A92q12J114l55r86P45M04q42N5Q18o06l49J501n17j203J498M9j018P86K15
2290F89j107O94P18j080r05J754m68j576J300r0q41J001L32j557J052R07r45l50
2308d72J326k94j215R52N42j598Q63P45j804R62J002j717k1J418n93q74R13L28
2326D63j251J012M34j506P22J101j345k08J533q45o28R46nj154O67R21j717M41
2344d19J248j502j45J821r51o65J127k25p15N69P13j475L23J609j462o44J738
$$ y = [-44, -487, -545, 192, -125, -147, 502, 222, -557, 499, 935, -573, 90, 580, 121, -160, 474, -431, -316, 272, 193, -756, -175, 367, -758, -254, 419, -715, 97, 677, -212, -116, 610, 237, -338, 356, 748, -562, -335, 735, -515, -381, 441, -811, -595, 671, 29, -848, 20, 373, -200, -18, 654, -107, -84, 862, -199, -654, 841, 192, -620, 494, 139, -847, -102, 302, -540, -485, 333, -273, -622, 879, 362, -841, 657, 706, -312, 474, 689, -418, 276, 994, -86, -991, 763, 295, -1281, 19, -71, -912, 89, 421, -1136, -84, 823, -122, -472, 854, 560, -655, 297, 839, -759, 104, 849, -955, 7, 1009, -708, -729, 689, 96, -778, 135, 463, -788, 224, 658, -848, -126, 975, -370, -578, 955, 110, -518, 428, 423, -731, -64, 857, -860, -419, 829, -673, -818, 1003, 52, -613, 514, 289, -426, 143, 856, -619, -296, 1313, -149, -793, 945]
2361I45q48j083J396k09j220J338K39j396L57J340r12o61J790r25j001J701L5
2378H86j680J302M0j186M66J178j417o15J480m97r87J364M0j694J471P31k080
2395a198J077J235j308j6J031p45n68J195Rj725J343O50j839R21O68j399k22J649
2413G58o70r11J100p7j003J086O08j713N25J690j715j87J534j024n69R59j19j238
2431i66O80J056j462K91J462j437k63J677j001q12J404k57j194J271K69j231M43
2448g0J024j268m96J396n13r03J189l42j031J436mj183O58J002j227j94J317m83
2466C08j055J561j97j546J457L6j480P90R46j482l2J185r19l72J255k12j452J565
2484C56N41j665R15J057j629L73R50q69m10J202k31j667J225N73j594P75R32j599
$$ y = [945, 97, -986, 410, 201, -1019, 319, 558, -838, -481, 859, -53, -714, 1076, 151, -850, 851, 886, -794, 508, 548, -638, -172, 1006, -411, -1026, 454, -43, -1030, 334, 374, -1320, 151, 882, -1198, -121, 1114, -194, -210, 821, 76, -492, 703, 712, -1013, 330, 980, -859, 62, 730, -669, -891, 758, 88, -823, 277, 200, -803, 283, 891, -822, -297, 1393, -322, -509, 1025, 1, -568, 391, 272, -966, -286, 770, -692, -401, 1061, -376, -639, 1038, 37, -775, 629, 372, -822, 449, 718, -513, -70, 954, -314, -810, 586, 73, -830, 359, 17, -1014, 422, 418, -765, -107, 895, -332, -526, 791, 308, -747, 814, 617, -929, 528, 564, -916, -126, 820, -662, -694, 491, -428, -800, 455, 243, -1209, 356, 897, -768, 147, 1204, -425, -52, 898, 29, -381, 821, 590, -1077, 148, 721, -873, -98, 834, -765]
2502g65J95J256j048k73J199n16o88J132M20j311K86J186j382j16J341j352k96
2519g32J557q67q13J072L28j117L66Q60j081K9J148q18l93J177o48o45R36J23
2537D82r99N50M55q70j02J146j000o25J635o89r54J203K87j098Q79K98j036L22
2555a16J005p94o43J137k17r27Q47P3j204R71K48j004J73R22p48l57J022k65o73
2574e50Q10L75j405P93Q96j331M52O67r49k11Q25k61p44M64L88r08N05O04j053
2593f33J29J177q89q5P87m28q2L27J77o54K83L86o08l70Q69n76l11R98o17n53
2613f73J037o3o32K22M41n91R7Q13o32k41Q48o51m01P35q2p93O76l7o01K84L97
2634A53n08nN74j03o06Q63no55N08J19n26K88L14m36k22N20j02o18M78L86j094
$$ y = [-765, -570, 686, -362, -635, 564, 48, -640, 492, 912, -399, -113, 1073, -309, -425, 916, -436, -732, 825, -42, -855, 217, 545, -572, -206, 654, -427, -398, 750, -68, -461, 716, 68, -577, 359, 482, -517, 33, 488, -382, -484, 662, -338, -963, 672, -17, -971, 232, 519, -579, 300, 598, -438, -116, 889, 95, -548, 589, 372, -555, 292, 365, -839, 132, 380, -624, -451, 471, -277, -634, 388, 123, -550, 260, 635, -770, 23, 919, -412, 40, 707, -242, -453, 372, 111, -633, -169, 219, -689, -184, 420, -633, -504, 673, -216, -301, 486, 58, -24, 303, 480, -174, 109, 495, -113, -483, 386, -190, -501, 497, -120, -673, 364, 301, -331, -109, 332, -259, -162, 651, 19, -222, 626, -25, -426, 309, 227, -566, 110, 73, -528, -244, 153, -355, -360, 214, 111, -495, 368, 363, -292, 216, 335, -191, 97, 411, -25, -247, 273, 171, -447, 31, 417, -677]
2655f77N71L78p01L51J85j49p3L70q8j64J02N44q24J98M35m55j96N42o19L4K86
2676E0m49L60l4K09m90J32K95l29K24N84o26M7L43l42M4L06m88P4K2J32m2l05
2698b83L54m06K00K23n9j43K48n8j53Q1J50k6j65J35J43k53ML08n60M15k11k95
$$ y = [-677, -106, 272, -429, -78, 107, -42, -115, 255, 167, 3, 105, 649, -175, 23, 458, 3, -193, 349, -270, -236, 50, -399, -39, -73, 136, -354, -222, 73, -256, -32, 552, -74, -27, 316, -26, 18, 324, -164, -90, -68, 64, 22, -283, 71, -335, -135, 88, 29, -114, 134, 76, -77, 4, 154, 128, -37, 98, 241, -12, -8, 300, -260, 155, -56, -351]
$$ [...]
8191B39
##END NTUPLES=NMR FID
##END=
