##TITLE=1H_Pr 6-1 Bn
CD3OD
 8 sc, 
 13.3.2024
##JCAMPDX= 6.0         $$ Bruker NMR JCAMP-DX V2.0
##DATA TYPE= NMR FID
##DATA CLASS= NTUPLES
##ORIGIN= UXNMR, Bruker Analytische Messtechnik GmbH
##OWNER= root
$$ XWIN-NMR		Version 3.5
$$ Wed Mar 13 13:54:47 2024 Russian Standard Time (UT+4h)  she@DPX200
##.OBSERVE FREQUENCY= 200.1313
##.OBSERVE NUCLEUS= ^1H
##.DELAY= (6, 6)
##.ACQUISITION MODE= SIMULTANEOUS
##.ACQUISITION SCHEME= undefined
##.AVERAGES= 8
##.DIGITISER RES= 18
##SPECTROMETER/DATA SYSTEM= spect
##.PULSE SEQUENCE= zg30
##.SOLVENT NAME= D2O
##.SHIFT REFERENCE= (INTERNAL, D2O, 0, 15.7039)
##AUDIT TRAIL= $$ (NUMBER, WHEN, WHO, WHERE, WHAT)
$$ ##TITLE= Audit trail, XWIN-NMR		Version 3.5
$$ ##JCAMPDX= 5.01
$$ ##ORIGIN= Bruker BioSpin GmbH
$$ ##OWNER= she
$$ F:/spectra/data/she/nmr/H-F/1/audita.txt
$$ ##AUDIT TRAIL=  $$ (NUMBER, WHEN, WHO, WHERE, WHAT)
(   1,<2024-03-13 13:53:43.95 +0400>,<she>,<DPX200>,
      <created by zg, POWCHK disabled, PULCHK disabled
       configuration hash MD5:
       00 E9 B6 7A A2 85 ED C7 34 08 36 98 17 FE 4E 26
       data hash MD5: 16K
       0B 0C 3D B5 29 A7 C1 E7 CB 2F 3A 34 C8 83 60 AA>)
$$ ##END=
$$ 
$$ hash MD5
$$ 80 5B 2E CF 5B 6F 1E 61 67 AE D2 C2 47 2B 70 14
##$RELAX= 
##$RELAX= 
##$RELAX= 
##$RELAX= 
##$RELAX= 
##$RELAX= 
$$ Bruker specific parameters
$$ --------------------------
##$DU= <F:/spectra>
##$EXPNO= 1
##$NAME= <H-F>
##$PROCNO= 1
##$TYPE= <nmr>
##$USER= <she>
##$AMP= (0..31)
100 100 100 100 100 100 100 100 100 100 100 100 100 100 100 100 100 100 
100 100 100 100 100 100 100 100 100 100 100 100 100 100 
##$AQSEQ= 0
##$AQ_mod= 1
##$AUNM= <au_zg>
##$AUTOPOS= <>
##$BF1= 200.13
##$BF2= 200.13
##$BF3= 200.13
##$BF4= 200.13
##$BF5= 200.13
##$BF6= 200.13
##$BF7= 200.13
##$BF8= 200.13
##$BYTORDA= 1
##$CFDGTYP= 0
##$CFRGTYP= 5
##$CHEMSTR= <none>
##$CNST= (0..31)
1 1 145 1 1 1 1 1 1 1 1 1 1 1 1 1 1 1 1 1 1 1 1 1 1 1 1 1 1 1 1 1 
##$CPDPRG= <>
##$CPDPRG1= <>
##$CPDPRG2= <>
##$CPDPRG3= <>
##$CPDPRG4= <mlev>
##$CPDPRG5= <mlev>
##$CPDPRG6= <mlev>
##$CPDPRG7= <mlev>
##$CPDPRG8= <mlev>
##$CPDPRGB= <>
##$CPDPRGT= <>
##$D= (0..31)
0 1.2 0 0 0 0 0 0 0 0.06 0 0.03 0 0 0 0 0.0002 0 0 0 0 0 0 0 0 0 0 0 0 
0 0 0 
##$DATE= 1710323623
##$DBL= (0..7)
120 120 120 120 120 120 120 120 
##$DBP= (0..7)
150 150 150 150 150 150 150 150 
##$DBP07= 0
##$DBPNAM0= <>
##$DBPNAM1= <>
##$DBPNAM2= <>
##$DBPNAM3= <>
##$DBPNAM4= <>
##$DBPNAM5= <>
##$DBPNAM6= <>
##$DBPNAM7= <>
##$DBPOAL= (0..7)
0.5 0.5 0.5 0.5 0.5 0.5 0.5 0.5 
##$DBPOFFS= (0..7)
0 0 0 0 0 0 0 0 
##$DE= 6
##$DECBNUC= <off>
##$DECIM= 32
##$DECNUC= <off>
##$DECSTAT= 4
##$DIGMOD= 1
##$DIGTYP= 9
##$DL= (0..7)
0 120 120 120 120 120 120 120 
##$DP= (0..7)
150 150 150 150 150 150 150 150 
##$DP07= 0
##$DPNAME0= <>
##$DPNAME1= <>
##$DPNAME2= <>
##$DPNAME3= <>
##$DPNAME4= <>
##$DPNAME5= <>
##$DPNAME6= <>
##$DPNAME7= <>
##$DPOAL= (0..7)
0.5 0.5 0.5 0.5 0.5 0.5 0.5 0.5 
##$DPOFFS= (0..7)
0 0 0 0 0 0 0 0 
##$DQDMODE= 0
##$DR= 18
##$DS= 0
##$DSLIST= <SSSSSSSSSSSSSSS>
##$DSPFIRM= 0
$$ [...]
##$SUBNAM2= <"">
##$SUBNAM3= <"">
##$SUBNAM4= <"">
##$SUBNAM5= <"">
##$SUBNAM6= <"">
##$SUBNAM7= <"">
##$SUBNAM8= <"">
##$SUBNAM9= <"">
##$SW= 18.0517328524113
##$SWIBOX= (0..15)
0 0 2 0 0 0 0 0 0 0 0 0 0 0 0 0 
##$SW_h= 3612.71676300578
##$TD= 16384
##$TD0= 1
##$TE= 0
##$TE2= 300
##$TE3= 300
##$TEG= 300
##$TL= (0..7)
0 120 120 120 120 120 120 120 
##$TP= (0..7)
150 150 150 150 150 150 150 150 
##$TP07= 0
##$TPNAME0= <>
##$TPNAME1= <>
##$TPNAME2= <>
##$TPNAME3= <>
##$TPNAME4= <>
##$TPNAME5= <>
##$TPNAME6= <>
##$TPNAME7= <>
##$TPOAL= (0..7)
0.5 0.5 0.5 0.5 0.5 0.5 0.5 0.5 
##$TPOFFS= (0..7)
0 0 0 0 0 0 0 0 
##$TUNHIN= 0
##$TUNHOUT= 0
##$TUNXOUT= 0
##$USERA1= <user>
##$USERA2= <user>
##$USERA3= <user>
##$USERA4= <user>
##$USERA5= <user>
##$V9= 5
##$VALIST= <valist>
##$VCLIST= <CCCCCCCCCCCCCCC>
##$VD= 0
##$VDLIST= <DDDDDDDDDDDDDDD>
##$VPLIST= <PPPPPPPPPPPPPPP>
##$VTLIST= <TTTTTTTTTTTTTTT>
##$WBST= 1024
##$WBSW= 4
##$XGAIN= (0..3)
0 0 0 0 
##$XL= 0
##$YL= 0
##$YMAX_a= 131261
##$YMIN_a= -185368
##$ZGOPTNS= <>
##$ZL1= 120
##$ZL2= 120
##$ZL3= 120
##$ZL4= 120
##$ABSF1= 10
##$ABSF2= 0
##$ABSG= 5
##$ABSL= 3
##$ALPHA= 0
##$AQORDER= 0
##$ASSFAC= 0
##$ASSFACI= 0
##$ASSFACX= 0
##$ASSWID= 0
##$AUNMP= <proc_1d>
##$AZFE= 0.1
##$AZFW= 0.1
##$BCFW= 1
##$BC_mod= 2
##$BYTORDP= 1
##$COROFFS= 0
##$CY= 11.3945322036743
##$DATMOD= 1
##$DC= 2
##$DFILT= <>
##$DTYPP= 0
##$F1P= 15.7292609196834
##$F2P= 12.9074282941183
##$FCOR= 0.5
##$FTSIZE= 0
##$FT_mod= 4
##$GAMMA= 1
##$GB= 0.15
##$INTBC= 1
##$INTSCL= 1
##$ISEN= 128
##$LB= 0.24
##$LEV0= 0
##$LPBIN= 0
##$MAXI= 10000
##$MC2= 0
##$MEAN= 0
##$ME_mod= 0
##$MI= 1.114404
##$NCOEF= 0
##$NC_proc= 0
##$NLEV= 6
##$NOISF1= 3.799351
##$NOISF2= 2.8
##$NSP= 1
##$NTH_PI= 0
##$NZP= 0
##$OFFSET= 15.70392
##$PC= 1
##$PHC0= -25311.01
##$PHC1= 21.38731
##$PH_mod= 1
##$PKNL= yes
##$PPARMOD= 0
##$PSCAL= 0
##$PSIGN= 0
##$REVERSE= no
##$SF= 200.130013532006
##$SI= 16384
##$SIGF1= 3
##$SIGF2= 2
##$SINO= 400
##$SIOLD= 16384
##$SREGLST= <1H.CDCl3>
##$SSB= 0
##$STSI= 0
##$STSR= 0
##$SW_p= 3612.71676300578
##$SYMM= 0
##$S_DEV= 0
##$TDeff= 0
##$TDoff= 0
##$TI= <>
##$TILT= no
##$TM1= 0
##$TM2= 0
##$TOPLEV= 0
##$USERP1= <user>
##$USERP2= <user>
##$USERP3= <user>
##$USERP4= <user>
##$USERP5= <user>
##$WDW= 1
##$XDIM= 8192
##$YMAX_p= 0
##$YMIN_p= 0
$$ End of Bruker specific parameters
$$ ---------------------------------
##NTUPLES= NMR FID
##VAR_NAME=  TIME,          FID/REAL,        FID/IMAG
##SYMBOL=    X,             R,               I
##VAR_TYPE=  INDEPENDENT,   DEPENDENT,       DEPENDENT
##VAR_FORM=  AFFN,          ASDF,            ASDF
##VAR_DIM=   8192,          8192,            8192
##UNITS=     SECONDS,       ARBITRARY UNITS, ARBITRARY UNITS
##FACTOR=    0.0002768,     1,               1
##FIRST=     0,             0,               0
##LAST=      2.2672688,     0,               0
##MIN=       0,             -185368,         0
##MAX=       2.2672688,     131261,          0
$$ Real data points
##PAGE= N=1
##DATA TABLE= (X++(R..R)), XYDATA
$$ [...]
1691C40o63k78M45J73L55j91p6l02J1R4J70O4j24j41k3nj09L67k47L32K34k07
1713B19q2l67l63M82L41K65m03l38k59J70M51L91J44n65m65k37L62O80K41k94
1733C73n24j66m0M16K25j37k20J00j68oQ7j69K06K28J21j92l81l88L19L66M31
1754D81J11n82l20o2K23O25J64j37r77o11N19P55N63j3n57o28r1N87K24q1n1m21
1776b79m9J65K98J0j37L16j92K44m08l99L7K84L65J68j07m20l56p2O09N60n6o03
1798b2n22k39L91P03L59j80p07j87p5M37M73O9n15l52L5j5N97R2L7m53l3pK6O9
1822a9o2K04R1m1l8m89l27M58K16J48Q5m41m23P3O31M70K23l28r01k24K14Q22
1844C42K97n38k2p61j22R71K47m3q3n03j96L53K67q8J01k05L9N9P2j46k09L3M45
$$ y = [340, -323, -601, -156, 17, 372, 181, 105, -197, -186, -92, 78, 142, 18, -123, -146, -151, -260, 107, -140, 192, 426, 219, 137, -230, -593, -111, 230, 495, 92, -246, -505, -335, 116, 507, 651, 86, -379, -616, -254, 426, 667, 373, -151, -317, -357, 59, 284, 147, -73, 27, -141, -147, -60, -229, -23, 205, 326, 134, -247, -635, -316, 50, 481, 592, 10, -310, -372, -149, 476, 640, 503, -474, -1085, -566, 189, 752, 739, 182, -446, -537, 50, 274, 193, 142, -279, -328, -163, 135, 145, 8, 324, 132, 376, -32, -431, -394, -110, 255, 423, 316, -104, -460, -532, 77, 637, 581, -22, -544, -783, -392, 311, 670, 490, -217, -404, -479, -42, 431, 500, -15, -367, -332, -347, 250, 342, 379, -74, -107, -114, -88, -19, -81, 123, 214, 173, 135, -354, -681, -223, -7, 141, 226, -215, -638, -565, 66, 536, 759, 431, -470, -694, -480, 342, 639, 101, 79, -682, -804, 167, 414, 371, 288, -215, -411, -58, 209, 121, 222, 17, 56, 115, 187, 41, -168, -135, 310]
1867C10mk02l15k19J71N76K03r8m37n69q0L49Q58M7l53p17j4L24M48J73J7n00
1889c2m02J09L77K52j63qk90K07L6L1o8J55l26J5J47k05j01J91J93K47J1l05j26
1912e5l71J74L96J24k45j88j89O2L25K05p0j46l09n9J24L79J45j08j83O0j62m6
1934a37L99j90r4l3j09p1J77Q5L33l59k8J9j93K10J98j59m9k96K46J10K60j95
1956A24o7k7q4J00q1N7m09M11P4J50k38k90J16J92O5L43m30l94j42L40N27J89
1978E26o5n12n69L82N61K07k86m93l03J93N53J88j47j67j52j29L3L78j08n5k02
1999a67L42K83k80l17k03J77M27k44J55l76l76M29K99L11o4n15m93K3O07M77p9
2020D16k49n90o4L44L82L92k50m22m14J09N08K6K19m69J84l12R8MK81j24L5J14
$$ y = [310, 306, 104, -211, -430, -259, 317, 520, 422, -15, -584, -664, -315, 543, 590, 237, -480, -494, -170, 278, 451, 468, -32, -434, -325, 52, 304, 141, 133, -157, 50, 86, 117, 49, 204, -122, -107, 40, -165, -266, -75, 118, 365, 376, 71, -55, -426, -252, 144, 268, 23, -165, -354, -292, 33, 238, 168, 22, -287, -346, -222, 157, 302, 194, 11, 71, -91, -137, 262, 72, -22, -55, -164, -235, -58, 27, 360, 1, -27, -8, -201, 9, 207, 48, -1, -297, -51, 59, 319, 124, 57, 30, -54, 46, -35, 22, -387, 24, 98, 248, 10, -280, -164, 28, 93, 436, 6, -388, -530, -190, 337, 526, 461, -51, -620, -238, 323, 530, 244, -249, -552, -359, 194, 382, 235, 68, -84, -213, -180, 198, 90, 35, -167, 175, 458, 178, -139, -342, -165, 262, 18, 173, -203, -579, -150, 149, 460, 396, -119, -612, -589, 18, 495, 416, 167, -423, -487, -143, 239, 631, 381, -41, -455, -346, 162, 188, 407, -62, 122, -190, -92, -88, 193, 69, 104, 218]
2042B18k49k50%L00K2L33j14k67l17j79K59K32L48K7l04l21k03K78O43K38k23
2063D71n39n34J13L57O21J32l31o05k92L36O52J74k66m47l10J56K69K03J24n56
2083b72J50J18J73k58nMJ69K98j6m01o43J76L89P17M68q29q30m07N09Q52P25n25
2105E62q53o73L34N31R39pq12m50k15O76M68q9m95P4k20L72J02n05L2p3P97J50
2127F45l50n91k99L11O23O53l74q35n84N6P53J019n5q57j008P5Q01N18K84m90
2147B95q21rJ18O17J78k0m72j08K37j00J7o2L18J90k06j81j50k92K01K64N47j87
2169C74n29m21j39M54N26L56j95n97m96J71L70O02P7o05l27k21L57N31P6m6k34
2190H4k63k66P7L13K72N0j27j97j28O8J07J23J16l9r6k33k88J94K27K66R4j50
$$ y = [218, -31, -281, -281, 19, 41, 374, 260, -7, -324, -503, -244, -12, 336, 363, 59, -262, -465, -187, 456, 694, 471, -68, -602, -489, -132, 489, 621, 290, -315, -607, -271, 381, 555, 289, -158, -468, -312, -43, 160, 284, -272, -122, -4, 169, -89, -94, -90, 79, 377, 361, -40, -683, -507, -118, 599, 1067, 238, -592, -999, -490, 362, 1087, 562, -291, -964, -630, -99, 840, 833, 21, -429, -644, 32, 500, 411, -84, -10, -230, 142, 244, -261, -229, -302, 495, 645, 295, -296, -595, -284, 339, 992, 618, -217, -801, -745, 8, 1027, 972, 115, -893, -818, -17, 501, 785, 295, -526, -535, -417, 200, 378, 358, -114, -222, 15, -85, -68, -130, 188, 378, 172, -9, -159, -451, -250, 14, 561, 374, -155, -576, -715, -261, 265, 621, 426, -171, -667, -496, -126, 476, 553, -52, -379, -600, -243, 288, 364, 318, 84, -179, -445, -368, -55, 217, 267, 140, -57, -185, -117, -10, 113, 229, 190, 94, -139, -427, -233, -6, 260, 354, 204]
2212B04l58l89J47N29M39j06m41o96M8Q8R36L25n52l13n66J25O72K34L03n30m26
2233c27J37R1L35k76j38P3J14J73Q4n34%L56J76J49k28m98k28M92M04L44l41o11
2255b53n26L34N03N05k55l79m96l9L73N44L3m07k63PL50L45k38k89J56OK23k16
2277A8k8k27K25K32J10j3m50k20J1N27N27m60m08k78J4M91J41p4r6k26j03K50
2299c7L16l58J26k11m2K98j59rJ53j99K41K3J65l14l77K21L67q8O9l02j15J53
2321g9J82K2j6l6k25K5p5M25n7k23L8q7L7J38r5O8J9J6j25j69L5mJ43K38j8k05
2347b8j08P1r8M87j38k02k1l2M9k4o8l2j45K83J13J45k82j26K37L2j26O3O8l92
2371b74Q6J96J28N8j39p2k07K42J65j04j57J77k25L62j49p7j08N8J48J49l19N9
$$ y = [204, -154, -543, -396, 133, 572, 466, 25, -671, -623, -535, 401, 726, 174, -139, -705, -580, 92, 326, 629, 99, -327, -190, -99, 236, -40, -178, -105, 9, 182, 266, -268, -268, 88, 264, 413, 185, -313, -541, -49, 355, 699, 358, -253, -779, -445, 58, 563, 308, -71, -567, -606, -233, 311, 344, -63, -326, -319, 31, 376, 138, -151, 5, 11, 234, 18, -10, -237, -12, 220, 330, 317, -133, -353, -342, 185, 712, 252, -156, -434, -420, 71, 212, 138, 42, -184, -287, -37, 279, -79, 47, -164, -206, 92, -67, -76, 77, -122, 119, 142, 307, -7, -384, -163, 204, 116, 185, -117, -232, -79, 103, 125, 109, 73, -152, -127, -202, 223, 166, -57, -19, -106, -69, 69, -26, 42, 61, 77, -48, -217, -182, -186, -43, 195, 177, -28, -136, -65, -163, 324, 186, -16, -37, -69, -20, -44, -112, -144, -289, -6, 107, 252, -30, -156, 81, 113, -13, 50, 118, -274, -188, 8, 136, 194, 55, -17, -224, 18, 183, 79, -78, 99, -126, 236, 87, 10, -98, -40, 108, 257, -62, -3]
2393cJ2p2K10K40l28m1k06J41N5J70n2k78L79k43nj37K43j3l7J32j03j13m5K05
2417A11j4J83k34p6k69L34j41L52j06l12o3m9K82J25j66r9j23J10L82k45J75k61
2439a04q5N35k18r7k26j29K89K20R7k13k57q9L49J34K33m12l70M6K98R6K10k06
2461A01l40L8K8J67L42m0l27j39K91j5J43q5l82j15N36J19k66o6k00J73K89Jk47
2484Fj92j60L96o6M46k27k54k46OK53K64K26p39L1k1K42K99Q3k43l30J40l6R3
2507b9k3j01K90J1k90rkk4K18j65K03r0k43J30K55m1J18j46k12Q0j15Q7L57q2
2531A77J69n84J87k22J01K38L84m08K2k32j09K64J11m6Rk17j0M9R4J16k63K02
2553C2lk47J04J59O1j20R8J60j14j87J36MO8O9j4k84r0j57L44K1L24k98o7j25
$$ y = [-3, 9, -63, 147, 387, 59, 18, -188, -47, 8, 178, 126, -152, 227, -16, -21, -158, 85, 72, 35, 167, 64, -49, -94, 111, 97, 280, 46, -30, -299, 35, -106, 246, 140, -172, -235, -284, -2, 123, -43, -142, -265, -155, 227, -18, 157, -104, -189, 346, 128, 31, -195, -324, -35, 185, 282, 69, -188, -277, 72, 206, 439, 27, -343, -297, 1, 97, 307, 101, -239, -201, -173, -6, 336, 296, -31, -170, 121, 106, 249, 164, -218, -333, 203, 322, 56, -10, -210, -37, 252, 253, 6, -186, -346, 50, -16, 430, 203, -51, -297, -291, -38, 226, 452, -287, -256, -277, -35, 264, 347, 104, -226, -86, -122, -29, -52, -153, 137, 148, -142, -151, -153, -177, 41, -124, 79, -11, -254, -124, 131, 90, 208, 62, -150, -70, -185, -98, 259, 177, 346, -238, -51, -273, -172, 66, 450, 42, 64, -168, -277, -13, 98, 52, 61, -156, -166, -117, -23, 93, -170, 32, 29, -218, -114, 45, 106, -14, 84, 244, 130, -57, 79, 83, 151, 220, 206, -78, -168, -325, 19, 40, 364, 66, -1, -126]
2577a26j6J32J66K08m19j32K7K46M8J10p5j30j07J79m2j7K3j83P6j1J43k26m9
2600a75J26M2L41k26j45r1J71R7M7q7q3j48R7J12J10o5j79q2j39K43L07j02j03
2623F8j46j19R6K19R5j21m3j70R1J31j22L00k26m8n7j1l00L41M5qN5j09o2K3p0
2648a48okL40l40J54N0j32Q2J46o2j08n8N5k66L07R9J28j63n8q1q8K82l4n2j66
2673a21nJ93j07M07k29k64r5lR2J85J43m5k93J0K26k9o6j12K94l10J66K6J21j84
2697@J29j77J33J82l56j30K24J97J04j75p9l43L10j53K12J98k45j94j17K21K22
2718A63O3k09l05L5J61L8L35k05M6j54j19q0K79k22K00j47K54J22l83Q6p2J70
2740E6L17k31K3j27k98N5M72j33l45J25k53L13q1L43j6m22o2l9J3L70K69j49j29
$$ y = [-126, -142, -10, 156, 364, -55, -187, -160, 86, 134, 244, 169, 39, -68, 111, 69, 52, 75, -108, -32, -43, 100, -126, -175, -49, -7, 334, 108, -37, -128, 43, 140, 187, 100, 17, -131, -34, 78, 188, 123, -56, -138, -277, -34, 273, 171, 68, -78, -197, -101, 118, 213, 92, 49, -121, -30, 101, -21, 279, 53, 5, -52, -63, -363, -22, 23, 15, 70, -39, -101, -78, -148, -154, -156, 184, -156, -2, 48, -84, -2, 144, 82, -26, -84, -29, -295, 12, 111, 239, 76, 18, -63, -151, 131, 97, 45, -121, -126, 67, -40, 367, 138, -126, -221, -224, -132, 53, 196, 151, -142, -132, 94, 65, -1, -113, 181, -129, 37, 63, 184, 0, 129, -48, 85, 267, -89, -219, 5, 202, 306, 131, 52, -291, 19, -134, 78, 276, 31, -163, -280, -59, 163, 226, 17, -288, -253, -92, -54, 281, 76, 122, -32, -151, -231, 48, -174, 26, -121, 133, 255, -128, -42, -114, 56, 373, 142, 165, 38, -260, -205, 267, 134, -211, -86, -339, -26, -107, 236, 220, -202, -264, -303, -290, 80, 349, 200, 71]
2763G1j50P7m0K56R9k41j95L6K4n8J17O1M9o8j14j13R3J58p5L50k36j81k6L7J8
2788e1O5K95m7k41k77r6L62K93P7m49k74J97j66L88K24l78p3j98K84J2K02k62
2810a13M4m2K32k26O6N9j06J74lJ56n70K08k40M09J74L51m78l76rP8K72J88J49
2833C97l72n09J82N09J1p9j70j97q6K91J23J36o8p6k04R7K7lM8j4J2K3j05n7j67
2858b51J74K92L4j93k11j40n4J85L16J64k47k54j98Q3L04K57j73k50J4j58L52
2879D6J84M0k24k33J71k07K35J50j52k8pM1j37J79J68Nj39o4J03l54j12K19J16
2902@R5J05k71j44o1R7K17J86O1k65j20LJ87K58l64m1k98l1J50L16P9k05J31n1
2926C4k01J74ko4J70mj10o8o5j22K27N1J05k36j27k1J60K18J6J1j99N4l89L71
$$ y = [71, -79, -2, -42, 214, 313, 72, -123, -87, -63, -121, -4, 57, 106, 38, -76, -189, -96, 62, -13, 337, 101, -80, -106, -69, -51, 14, 309, 262, 21, -256, -352, 10, 303, 380, -69, -343, -146, -312, 76, 300, -78, -151, -349, -65, -53, 149, -113, -69, -111, 121, -105, -39, 20, -86, 88, 85, 241, -329, -121, -361, 48, 222, 573, 95, -281, -290, -212, 60, 248, 397, 25, -484, -302, 207, 218, 139, -31, -228, -314, -23, 100, 236, 168, 92, -112, -15, 12, 9, 57, 43, 55, 78, -27, -84, -251, -77, 215, 249, 56, -155, -295, -349, -164, 152, 316, 69, -185, -383, -300, 4, 261, 88, -162, -148, -306, 46, 230, 270, 46, -187, -16, -223, 12, 162, 10, -18, -25, 16, -121, 58, 226, 231, 92, 28, 131, -223, -335, -116, 0, 95, 200, -71, -215, -276, -179, 38, 224, 285, 20, -100, -97, 90, 348, -16, -57, -355, -386, -236, 80, 159, -46, 85, 34, -167, 7, 5, -59, 111, 107, -3, -71, -136, -258, -31, 20, 125, -111, -238, -259, -99, 119, 135, 146, -53, 1, -388, -17]
2950a7J16J00Rl63q9N3P3K03P7k23j80J08j6J79j04J72j16k3l8J18l70L01J88
2973A58j18L15l51r5j44K60J51n3o6J90n87K57O4J73Q3K2l96J12LK95j29k18j19
2996a93J41P8l6J2J54q3q1L7O0j45j00J65LJ18k86J31R0n1j40J55o7K5j04N5M
3021e8j9J32k81K70r0Q2l3J2n1R4oj21J71j82N4L1O4k8o3J30k27J60N4k47J75
3046B3K1k3l8PJ69o1r5M7l2k3L2k1P4j49K25l0m5j80N1q3K77k19J24q4kR4M9k09
3074a01O0m5M7J7J50l2l6J7k0J85l27R5j5M0J37j10o0j81J06R9j07K06j45m1j0
3099g1N8L24j61k72J30J01m6j4k34J77K60k11j09o6K41o7j72R5%J42J12j92o4
3122c9LN4j31J2l6j77K08Q1k96M08q2Q0P9j64N9J4j84L57l03m2R7j39J15m2k6
$$ y = [-17, 99, 199, 208, -155, -244, -191, -118, 85, 162, -61, -241, -133, -149, 30, -74, 98, -18, -41, -79, 39, -331, -30, 158, 40, 355, 4, -91, -235, 25, 176, 123, 57, 247, -340, -83, -19, 154, 237, 259, -137, -25, -22, 273, 144, -74, -193, -52, 26, -10, 2, 156, 73, -8, 29, 89, -56, -156, 9, 12, 130, -156, -25, 65, 14, -126, 29, -38, -13, -117, -62, -58, -77, 55, -226, 44, -46, 36, 3, 15, -36, 58, 52, -69, 102, -80, -26, 5, 69, 41, -22, 108, -119, 41, 95, -152, 23, 44, 21, -17, -10, 159, 98, 3, 50, 18, -5, 27, 6, 80, -69, 156, 126, 81, -99, -48, -131, 146, -73, 51, -33, -35, 59, 108, -101, -41, -86, -39, -22, 128, 96, 60, 77, 57, 242, -85, 10, -5, 35, 172, 62, 2, -179, -73, 26, -81, 125, -20, -61, -71, -13, 311, 150, -122, 8, 109, 63, 49, -185, -8, 252, 41, -68, -134, 107, 40, -132, -37, -37, 105, 217, 25, -39, -36, 18, -113, -101, -137, -314, -106, -25, -321, 87, 5, 85, 164, 0, 59, 73, -111, 246, -57, -99, -2, -141, -26, -68, -94]
3147i4Q5k11O4J28O7j04J32l0O1j36j94K16J17O5j07n5M7j71L18j90J15j40j1
3170b8j23M4J10N8j40R0J84k04rJ73r9k16L45j37j39R7rp5R9k0n0M9N6p1P0l4
3196B1p7O4J67j12o0j32J68L08j32k48L9On7K32Rk24Q8q6o8J87j39J9l8J6J3J12
3222G6L3k16J26ql6j19P1J57k05M8L29l95L2K02O7j60M9J50k70O6n4j03L51k46
3246e5R4J54k87Qk7O6Nm5L3J26j63J80J39l71o2QJ29J07L2j67N8K09j01j23k04
3271b57L62nj20J91j19q7K39k80Q5q5o0J24o4rk8K21j70K58n2l4k12L4Q2j70J48
3296hR0j04RJ96k38j19J08L1kJ08p1O5j40J90k53J01J6k05O3r9J48n3J12P0J83
3321A98p1j39P9j33j76L93j44qn6j17J94o4K17k28j91J59N9p0K43j88J52j61J60
$$ y = [-94, -9, -220, -156, -28, 39, -65, 67, 37, 98, -38, -232, -16, 101, 166, 59, 4, 51, -120, 198, 8, 123, -17, -28, -151, -107, 3, 61, -79, 11, 195, -9, -18, 155, 56, -160, 185, 48, -91, 6, -3, -78, 21, 1, -49, 0, 56, -15, 55, 21, -56, 8, 175, 63, 3, -129, 39, 347, 215, -33, 6, 12, -45, 187, 196, -28, 60, -26, -94, 93, -46, -27, -65, -49, -36, 76, 109, -107, 19, 11, -25, -144, -73, 84, -121, -73, 256, -139, -107, 95, 162, 2, 51, 201, -69, -3, -57, -160, 191, -55, 39, 193, -94, -86, -113, -47, -42, -87, -54, 72, -91, 89, 228, -143, -205, -197, -68, 39, 71, -96, -38, 171, 70, -53, -257, 105, 100, -20, 171, 52, -35, 204, -76, 9, -76, -136, -12, -76, -85, -113, 108, -62, 196, 144, 110, -102, -68, 14, -156, -8, 82, -22, -13, 183, -55, -174, -66, -35, -37, 71, 0, 65, -75, 115, -138, -37, -21, -226, -163, -262, -114, -167, -55, 15, 198, 127, -12, 67, -66, -242, 151, 7, -1, -57, -174, 20, -44, 173, -55, -246, -87, -28, -98, 145, -43, 109, -52, 108]
3344A08n9j28K51k48J22j57P7MJJ00k93K07j20O1J84p2m8R3n4m9QJ35k12n0O7
3369g2k3O4OJ16j35J06l2J82j44l61R8K10J80P4k49l7J4Q3o1r5P1p7L33j73j01
3394b3KK04j54J53k38n8J69k6j32J52J77j98j48J81l8K7Q3Lm6j06p8J84k3p8N7
3419D6o0p5J70K4n4k0l4p6J38N9%j98J7K30j58N9R3m22L40j20J97J0j81j7k03
3444b35K86M0J40j92j93J37k15J99J26l6R6l12LM3L31j21K7k69m2J25l8J48j5
3467C3j66K07l6j16O9Rj17J8J00L06k72l6j29J06J12j23J29k30l4R7R2J6J72k53
3491d6k47K73J0K34O6l57o6J15j37L95j79r7J48O8j47l0O3o2j36R7K11l06J25
3514eQk31L46k8L3n5k46L2Q3K64k1j47j90q6K45O6o5K13j42k38R6K27r9k7j71
$$ y = [108, 49, -79, 172, -76, 46, -111, -34, -30, -29, 71, -222, -15, -135, -74, 110, 38, -10, 83, 29, -20, -12, 123, -89, -139, -72, -95, -31, -25, 91, -44, 62, 30, 212, 68, -293, -195, 15, 195, 269, 20, -17, -3, 80, 19, -76, -5, -82, 251, 78, -23, -21, 183, 29, 182, -56, -114, 55, 29, -103, 49, 226, 28, -120, 61, 23, 50, 133, 136, 90, -16, -94, 90, 67, -11, 46, -14, -89, 81, 105, 51, 31, -3, -79, 59, 118, 118, -80, -63, 167, 9, 68, 161, -261, 79, -41, 156, 166, -15, -32, -235, 51, 91, 231, 39, -154, -17, -232, -33, 93, 57, 153, -159, -156, -113, 218, 97, 124, -145, -187, -62, -100, 48, 33, -133, 74, 38, -78, -9, 0, -117, -99, 1, 307, 35, -1, -130, -24, 88, -35, 94, -136, -170, -73, 19, 35, 207, -46, -293, -20, -10, 224, 290, -67, -133, -18, -155, 240, 61, -36, 112, 180, 33, 3, 66, 4, -132, -35, 176, -130, -5, 3, -228, 118, 90, 123, 68, -178, -146, -63, 201, 180, 33, -157, -243, 2, 68, 3, 216, 74, -164, -68, 159, 60, 33, -138]
3539a38P3J28l6q1J09p2p1J94k69R4J43l11K75Q7P4j30j39k68L45j81o7M04k22
3562e9P8K2n5J59J37k90n2j26J00J10M0J32k78r3J20m5K13j52J36k9j11M1K05
3585B03j75j4j18J77j53K42k56L8m0K47q7J63k54M6j70J69R9q7j01K7k%J13J97
3609B64m3j10j46j8J87K9m2l3n0m0n3J37j6r7n8J72n5r3k7q2J07J46n6Q0k37J27
3635gN1k3K01j46q9j58J11l7K58P2m34O9O5J05m9NK0K5k21R6N9nR3P3M0k67K30
3662A37l19K57jk03K42j5k1J5k65J35K40l11Q0J61k13Q3j7J78j91M3m3q1n8K65
3686I8k5j15k68K23O3M1R6j47R3j7j0j15J25p7l8K20q5k16J36K8p4n7kJ07o5K1
3712f0j08J20k5K99k15K2L4j76K02k5o2K5j34P4J29QJ44k27rr6J96l6l1k09P2
$$ y = [-138, -65, 63, 27, -54, 55, -17, -88, 106, -163, -69, 74, -237, 38, 125, 199, 69, -70, -338, 7, -174, -241, 163, -59, 19, 41, -14, 145, 282, -8, -60, -186, -86, 24, 64, 196, -82, -175, -55, -100, 113, -39, 97, 68, -43, -2, 203, 28, 14, -104, 73, -80, 162, -94, -56, -96, 151, 64, 227, -27, 19, -151, 18, 117, 30, -71, -44, -46, -46, 67, 264, 221, 111, -35, -53, 134, 163, 121, 88, 38, -2, -55, 82, 66, -31, -89, 83, 28, -65, -92, -174, -67, 79, 23, 103, -134, -7, 44, 21, 222, 76, -13, -171, -60, -97, 161, 233, -201, -132, -67, 38, -11, -6, 14, 39, -182, -86, -27, -32, 61, 134, 174, -93, 137, -182, 75, 74, -129, 113, 98, 77, 92, -173, -38, 202, -109, -29, 132, -81, 2, -15, 163, -28, 15, -28, -109, -167, 98, 73, -42, -310, -87, -24, 17, 113, -34, 59, 42, 32, -83, 42, -35, -73, 147, 62, -154, -18, 10, -64, -121, -123, -16, -81, -60, -168, -48, -73, 226, 11, 33, 67, -109, 93, 68, 6, 31, -103, -29, 100, 108, 252, 25, 16, -80, 116, 80, 49, -160, -88]
3737h8l1K21j14j20K19q4J9m7J25l15L50p2J12j91j3J07j21J11l12M29j59p2J15
3760F9k86J36J61p9L3L3j63L03j01p5l0j22J77k99K64K31k58j75J60J06j69j0
3782i4P9L0J07j02l4p1l4K0L33j20k95J79r9K42N1j24J75l74q1K07o3O1L3Mm2
3807a2O4r8J43j40l1P5j06m8J49P9R6j76K04l53J60p0O7J56j62j29O9M5Q7J15
3831A84k8j43r8J19Nj25Q7N5J01Q6k54J15j29j95J90k30M28m9M4o8q9J9q1J87
3855A31q7n1j91J80j47O4J82j48J10N1k42J31k5J53j63r8J73N0M7l0j04q3K11
3878A14j92K48j61J3o5q2J47J28j07J0k02K37k50J24j81J89R2o2o0J69l11Q7L0
3901h5k3K2n0J81o5Q9k71M01k3k27J19o9o8o5P8O9L9K2J0j77M8j71M30k54R4j60
$$ y = [-88, -119, 102, -12, -132, 87, 3, 22, -25, 100, -215, 135, 63, 175, -16, -29, 78, -43, 68, -244, 185, 26, -46, 69, -217, -81, 80, 1, 34, 67, -96, 207, 106, 31, 1, -121, 56, -243, 21, 252, -6, -181, -21, 85, -84, -94, -15, 15, 122, 20, -14, -85, -119, -99, 234, 114, -181, -2, -101, 141, 192, 68, 243, -131, -212, -5, -68, -7, 26, 30, -12, 52, -46, 97, -43, -74, 1, -105, -153, -4, 75, 171, -5, 199, -154, 6, -64, 3, 159, -3, -132, -63, -18, 69, 184, 156, 13, -85, 34, 39, -86, 1, 56, 157, 243, -11, 104, -25, -220, -30, -260, 168, 119, 163, 95, 6, 25, -56, 131, 44, -7, -198, -18, -165, -101, 81, -67, 43, 94, -148, -17, -42, 111, -52, -150, 23, 73, 120, 90, -14, -97, 114, -78, 170, 9, 22, -43, -125, 22, 150, 43, 53, -149, 88, -162, -38, -219, -30, 62, 0, -60, 109, -202, -115, -85, -108, -86, -136, 45, -20, 69, -202, 199, 176, -51, 68, -1, -69, -134, -56, 13, 52, 74, 84, -93, -45, -216, 214, -40, 54, -106]
3927a06K5R6N1j76P3N1p4o5J75r7q5J9J05J28l41K24P9k72L00o9L3Q1Jj49o4J84
3953A27j43o6J22j2j32J71k40J99j92qP4K13j61J54n6j75J43Q8k32J21qk25J85
3976e3K5K6R2o5m3l6l6J06k8J14j12K5k5N3K7m9p2j7J19J06l25J56R6j3j40J47
4002G8p7j73J65J42j6N6k5j89J08p6R7j60j5j19J40K3l7L3P9M7j38k9J01o5o4
4027a14J62j32O3K81l00l5kJ05L6L8q0j37N5J38Q8j42l9P5j38L8K8J20k11J55
4051E2M0k57K61j9j09J7k60K62k3J39K1k40k0K08L0p9nJ21k36J01R0k05O8p5J38
4076B0k6J2j6J88l38L27k61R4L3k14J50n8L0K59l17jJ10P2n6L3j00J92j43j43
4100a53K0J48k05J98m9J23L0j87n4N8n4K61j0l23J82k03M45k51K1J59k02K48j52
$$ y = [-106, -81, 15, 66, -110, -37, 14, -60, -125, 50, -47, -132, -113, -8, 120, -221, 3, 82, -190, 110, 41, 74, 155, 156, 7, -57, 127, -16, -82, 40, 28, -104, 67, -173, 26, -166, -174, -100, 113, -48, 106, 50, -125, 18, 106, -126, -5, -13, -238, -53, -28, -2, 90, 25, -18, -54, -90, 16, -12, 102, -10, 15, -10, 43, 70, 21, -51, -68, 51, 157, -168, -12, 84, 71, -69, 78, 1, -172, -7, 135, 119, 175, 150, -39, 69, -7, 90, -70, -85, -204, -64, -41, -78, -45, 34, 81, -57, -86, 15, -50, -114, 48, -84, -21, 260, -40, -75, -77, 28, 64, 102, 22, -115, -60, 78, 166, 24, -15, 60, -78, -40, -12, 108, -103, 52, 92, -165, 96, 77, -32, -15, -275, -13, -36, 103, 124, -116, -136, 72, 102, 23, 18, 139, -97, 4, 94, -111, -43, -118, 20, -6, 6, -10, 178, -160, 167, -94, 0, 33, -181, -31, -89, -59, 200, -117, -118, -8, 64, 8, 41, -59, 133, -10, -153, -133, 15, -190, 8, -41, 82, 112, -75, -129, -71, -125, 136, 126, -197, -15, -218, 227, -24, -3, 156, -46, 202, 50]
4123E0nM4j8r5R5j35l9k0J88o9J34j24J36k45J91j67K54j57k16K08J82j28J54
4146B18l03O8oJ31j40N9k28J59n9M6q0J70q6M0J02K2l5k9n7j13k9J84J29j53o2
4171e2m7K5J61J30o6k15R8j02q6J55Q0J36m13M8M7P9P0l0J83j81J22k66K3o1J88
4196B6Q6j65Q8k11L0O2K01j10p0j4o9L08j46j16L9j1J30K1j04J13l2q5j02P4N2
4221eJ7J30k8k03N4j09PQ9n1j42J42L5Q3J37j38j31M4J60j33J16M4r6Jj49R8r8
4247a26J73P6j07j29R6J32J28J07m26Jj1J83M3j91O5p3kK12j15j13q7K40j11k23
4271b58K79Po3J96j54J60L4j29k85K63R8j64j13j0K5j8L17j63q8R0j11J58k77
4294b06J78kM6j94L22P5j71N3J0J90k47k4p3kP5j84L52o3k44o0Q6Q8j39J71K6
$$ y = [50, 45, 89, 71, -24, 71, -64, -103, -123, 65, -4, 130, 6, 142, -103, 88, -79, 175, 18, -198, 10, 192, 64, 218, -85, -17, -23, 108, -32, 27, -201, -42, -101, -55, -135, 35, -51, -11, 91, 113, 78, 49, -8, -121, -150, 34, 163, 10, -52, -99, -74, 87, 217, 151, -64, 34, -68, -154, 1, 81, 217, -196, -148, -101, -22, 48, 18, 201, 20, 142, -124, -101, -162, 26, 112, -53, 35, -176, -146, -84, 117, 7, -63, -77, -146, 162, 16, -100, -61, -72, 58, 79, -25, 88, 56, -29, -131, -57, -5, 12, 142, 114, -89, -35, -144, -137, -48, -99, -241, -99, -64, 19, 156, 18, -113, -69, 91, -42, 74, 118, 22, 23, -126, -28, -126, 47, 123, 16, -113, -17, 115, 243, 350, -76, -75, -86, 97, 140, -51, 14, -59, -61, 151, 36, -77, -164, 76, -35, -258, 21, 28, -35, 161, 7, 167, 201, 72, -213, 50, 148, -16, -129, -139, -114, -132, 185, 22, -66, 24, -87, 71, -206, -28, -30, 16, -178, 144, 219, 48, 101, 111, 301, 54, 30, -43, -45, 30, -154, 198, 135, -109, -169, -83, 5, -134, 37, 63]
4319F3K8k43J98j20p2L47l47J35J67j84P8P4m6J9m1P8r7j5j69J53K3r5J88J54
4343B76l30J06mk1J71m12k2K43J27r2j72M1RJ2K14j60n9PJ17Nm8J16m7r8o6Q4
4369cp0l9n9R4J12j78K33o6j0J45o6n6j97LQ4J32N7j85K32j23J10k6j9l09L40
4394A36J5k8j4j48J4o7J33J9R8o7m5J03j28J94j90KJ5L7J49k90m9J64qk16K24
4419E3j7P1j73O8k2k1M6M1j68K72j92j6J27J26k45k15J24R9M5k73J15K03J12k20
4443f0j36J99K2K6j92K63j98Q0p3j37L02j82K1Q0k24n8K81m4J73j7j80N8o1L0
4467b7J52k8lO3j58J5L2o4K9j77R6J07JR9l03K40j09j50L45K7k25R2o0M5k18K25
4493D6j42M6N4j94N5N6j8J72M1j89J34n0p9R0J13k22j35J90J02j60J15n2j39K13
$$ y = [63, 91, -152, 46, -74, -146, 201, -146, -11, 156, -28, 50, 124, 78, 97, 56, 134, 37, 22, -147, 6, 29, -66, 122, 276, -54, 52, 48, 27, 198, -214, -236, 7, 134, 42, -130, -89, -80, -68, 146, -14, -73, -66, 51, 56, 8, 124, 77, -21, -87, -3, -73, -112, -171, -77, 35, -143, 90, 24, 14, 159, 93, 37, -160, -157, -73, 59, 116, -69, 163, 40, 150, 124, 105, -204, 136, 151, 123, 109, -39, -25, -92, 41, 60, 158, 91, 46, 149, 21, 215, 25, 27, 42, 79, 228, -62, -111, 53, 45, -171, 53, 36, 107, -66, 2, -20, -41, 5, 46, -122, 150, -42, -58, 69, 195, -50, -265, -141, -42, 3, -270, -155, 48, 160, -60, -196, 3, 25, 51, -141, 122, -76, 4, -69, -206, 96, -86, -65, 15, -209, -267, 14, -30, 143, 126, -54, 4, -57, -27, 125, 97, 94, 157, -1, 14, 46, -18, 11, -166, -70, 37, 38, 137, -166, 74, -35, -185, 160, 187, -38, 54, -6, 39, -179, 46, -96, -50, 4, -190, -135, -79, -97, 75, 116, -73, 61, 11, -68, 22, 135, -87, -222, -32, 70, -90, 25, -27, -166, 47]
4517D7j95R7Q7j54J87k97K80K5Q3p9k29L6J75l3R8ql33J70l2J80j68N7j20J03
4541b3J15j23J14j58P1K4J8j09q2L6K08j55J05J32n07K62P1q0P5k51L05j8m8M0
4565B2j33J26M3N9k18J69j21R0N2l6k74K60k96K95k8q7mj0J9J14j15J6J62m4R9
4590A60j68J01j86P3J21p7P6j72j32K53o4J3O4m2k9j8N3j54K00O2j58j25J62p9
4614f6J83j56r4N4L5LJ8Q4j78J08M0k67P8K15ok4j36L10l54l8J37qJ75q2M1K52
4640C24k45rr5l6K34l4j72j04J00j10J51R9j53J05j19m7J32J27j96J6j14J43K12
4663B09j83N5ln1L4j00r5K38r0J33o5j26J76k55M2L9j94J90J82j97R4k46N0L60
4687A97k15m6n5J06R2j5R0k16k1L0K69k35J8J50j28J02j73K1l7J67k80K20J62
$$ y = [47, -148, -51, 36, -118, 69, -228, 52, 77, 160, 81, -148, -112, 63, 30, 128, 120, -213, -43, -75, 105, -63, -6, -126, -23, 92, -31, 83, -75, -4, 20, 38, -71, -153, -117, 91, -64, 41, 173, -334, -72, -1, -81, -6, -257, 48, 30, -18, 22, -111, 15, 58, 117, -101, 68, -53, 37, 89, 53, -221, 39, -257, 38, 10, -77, -81, -91, -72, 42, -73, -57, 105, 61, 160, -8, 93, -93, -20, 101, 24, 100, -72, -204, 49, -15, -2, 62, 20, -9, -27, 26, -128, 72, 134, -24, -149, 13, -66, 117, -39, -133, -79, -44, -41, -23, 61, -117, -9, 31, -236, -158, 57, 51, 27, -109, 201, -153, -191, -54, -62, 113, 31, 72, 324, 79, 70, -25, -61, 173, 139, -33, -137, -37, -147, 4, 103, -50, 55, -64, -111, 21, 148, -48, -32, -146, -3, 209, 26, 81, 78, 27, 61, -39, -134, 104, 14, 147, 82, -44, 132, -123, -81, -42, -236, -46, 136, -61, 33, -213, -163, 197, -18, -64, -119, -13, 79, 64, 154, -62, -83, -53, 216, -19, -1, 149, 21, 123, -50, -29, -66, 101, -179, 41, 203]
4710B03l61J97Kjk81L4L95j39j47J78j62K30j30N8J9rj08OL1J59k54M1J84k20
4734g5m6O0J57j32jj40J15L30k95n9J1j21J74P6r0K4K09k48J77J21k92J42j48
4757e1N1J05q0J85j96P3k93L41j75j35K32q9J94k5j10L5k13K68l04l8J32J04j22
4780a11q6J88M4Jj02Q0J49j95k9K99k16L0L2j03j6J04j79J4N1K0J03L5r8j29K08
4805I4r1J56q6N0j93J98k1J5o4lJ04l29O1K62l1l09K02r4L1k2J16j10q9P8P1L5
4831C1K8k39L32j0q2j65j68K25jn2K02k60M09k56o2QJ00j25k5l0j15N8J57J00
4855F0M0j49m6o5K25R3k48mn4K0J60j40k5J97q6j79J85N6j02J89p3j50R3P4r6
4880b5J33l3k22J31J50j9J5j68R6J3j84j7K19k18J43R4j63j43J47kJ06j64K19
$$ y = [203, -158, 39, 41, 40, -241, -207, 188, 49, -98, 80, -82, 148, 18, 76, 95, 86, -22, -16, 15, 174, -80, -39, 145, -75, -121, -61, 96, -36, -37, -177, -62, 268, -27, -86, -75, -196, -22, 54, -36, -12, 197, -51, 126, 247, -45, 97, -51, 0, 105, 25, 210, 14, 87, -206, 135, -40, -175, 57, -32, 162, 137, 27, 62, -151, 117, -187, -225, -93, 11, -111, -197, -9, 35, 36, -66, 14, 163, -32, -61, 238, 22, 52, 84, -19, -35, 69, -110, -96, -45, -25, 78, 113, 15, -114, 94, 3, 159, 73, 123, -70, 128, 107, 122, 58, 55, 159, -170, -109, 153, 122, -187, 15, -79, -48, -70, 46, -64, -153, -75, -4, 31, 59, -180, 152, 142, 60, -105, -273, -48, -49, -101, 101, -159, 250, -6, -68, -60, 40, -85, -110, -140, -255, -197, -40, 60, 100, -49, -95, -160, 65, 158, -90, -94, -148, -128, 32, -108, -133, 64, -22, -201, -16, 40, -62, 127, 54, -96, -3, 71, -25, 108, 75, -147, -16, 134, 115, 130, -38, 58, 71, -113, -130, 89, -129, 14, 108, -55, -198, -51, -53, 53, -111, 108]
4903A08m5P3p8lj28r0k1m3J56m9O4J43j01LK53n9o5j08J00j40J72j60J11Q3k13
4928c7J40k99L55k46Q4J61k15k7J14n4J9M2r5Q8j00J33q1Q6k58L1L22k29R8j5
4952A7q0P7J1K9j02j33Q7P1j68L54k61K99k48O7P7j19Q3j30J55k23J57n1J37k36
4976a30pJ07J16n4Lj11J71j39k24K47q9K33k07J07j0j57J96j80J36K0J23mj58
4999a1K97k24j6M2L6L0k8o2j12R5K2r4N2k04K14oj30N9n0J98o6m6j90J91LJ00
5025A00k53P0K9L44l18J61q2m2J41k51M3m7k1J34M1n2J33j38r5J06j58P0jJ68
5049H2k25K82k09J61j00P0P3J0q1j13N4o4J8Q0k32K1K13j44J26j62M0J91n0J1
5073E2j56lRJ12m9K63m40L11P0l17J22J15j9j6K6q9Q7Q0j46J25o3M6k15L5N7o
$$ y = [108, 63, 136, 58, 55, -73, -163, -184, -227, -71, -120, -56, 87, -14, -11, 242, 183, 118, 10, 110, -30, 142, -18, 93, 176, -37, 103, -196, 159, -87, -3, 158, -57, -84, 30, -24, -5, 37, -58, 30, -70, 63, -18, 68, -190, -159, 163, -66, 32, 17, -63, 14, 25, 54, -48, -181, -94, -23, -191, 163, -98, 201, -47, 20, 97, -22, 61, -69, 86, -137, 20, -31, 106, -130, -137, -30, 86, 32, 35, -76, 95, -44, -268, -21, -110, 123, -84, 23, 13, -144, 52, -128, 8, 28, 151, 147, -11, 286, 62, 46, 88, 124, 154, 126, 64, -48, 47, 69, -25, 27, -177, 37, 31, -99, -40, -90, 108, 42, -4, -194, -3, 0, 100, -153, -83, -54, 290, -28, 133, 51, 9, 150, -101, -58, -105, -126, 8, 49, -3, 130, -8, -103, 3, -155, -85, -86, 82, -143, 139, -70, 91, -9, 61, 134, 144, 63, -50, 4, -60, -42, 38, -194, -173, 40, -104, 22, -140, -100, 91, 41, 52, -104, -107, -98, 14, -35, 228, -212, 99, 169, -148, -26, 89, 70, 54, 80, -9, 78, 158, 12, 137, 74, 120, -95, -60, -3, -9]
5099iq0J64j14m2J38Q7k4j62m6Q6r6Q1J83j5j99j8N8j80O8q4J52moM5m8K1K33
5126A89o7q9J33k14J39j54rJ97l87K11qJ45j51O8r6L8J86j33K4m5j0q7nJ59lj52
5152a21R3q2l0qJ03P0O2j00P9r0j0R5P2%k39J93q7j18N8J17j21K8K03k7k66J70
5178D4j29K43j74j9J82j63K34j02qp7k26J13M3P3j37K77q6j93j22J34L8O4j91
5201a82L00j50J53k74J7m4J30R6K1N0j4K9j17r6J29L1j0l33J87J4J01j1J01n7
5225G1k19K50j56Rj7q8M4J62k6K8p1J33m03R5J13Q5J15m2o9O4j08k0J2M6n9q8
5251a39P0M0J32j16k0o5P6j33J43p9J40p3m8K3J1J54k97L05j78Q1j38M0O8N2P
5276E6J5k59M2J19m8J63JK5j50J01J16j66J30o7J0K5k74J90j17N6J56p2l5j33
$$ y = [-9, -89, 75, -39, -81, 57, 144, 120, -42, -88, -2, -98, -17, 166, 151, -48, -66, -8, -188, -120, -204, -52, -56, -62, -17, -65, -44, 189, 122, 33, 166, -48, 91, -63, -72, 125, -262, -51, -59, 86, -65, 3, -93, -55, 131, -2, 22, -23, -33, -120, -125, 34, 31, -121, -28, -110, -140, -148, -45, 25, 87, -13, 66, -24, -34, 61, 133, 133, -106, 87, 0, -118, -60, 57, -64, -36, 167, 140, -126, 44, -85, 158, -16, -35, 147, -16, 218, 116, 108, 31, -195, -82, -39, 34, -103, 174, 88, -105, -227, -93, -55, 9, -182, 118, -32, 121, -153, -136, -180, -50, 46, 67, 117, 103, 132, 15, -81, 48, 79, 69, -264, -77, -63, 38, 27, 128, 71, -148, 102, -54, -45, -62, -150, -106, 56, 30, 58, -13, 120, -283, -188, -75, 10, 125, 83, 14, 78, -30, -50, -38, 8, -51, -139, -69, -29, 103, -13, -33, -98, -22, -155, -12, -91, 49, -24, -72, -49, -38, 116, -181, 124, -54, 27, -111, -71, -3, 49, 56, 71, -188, -146, -27, -75, 88, 89, 114, -36, 65, 181, 15, 145, 78, 88, 113, -161, 29, -88, -32, 124, 52, 17, -116]
5300a16J9P1j81M4L2P6J69j49%N9j65L07j82P3k78K25J1m2j21J58J42j42j24J26
5324A2L2J26k36L3p8n5K18l0J74j28n4O6p8J09n7j63K9J5P8o5p2K37J30m13L6
5349a34R8LJ71ko9j67j26J02P2Q4K2n8m0l6k3J99L6j19p8J69r8j08j4J56j14K0
5375e4L3j38K31jj83K02l00M0J64j3R2o4j03J40K9q5K20j13r7Mp6K17j64R9r5
5400a5r4J02R2%l30O2J24N6n5J12Oo8M3Qn3J13k29J92K7q5M0J39j24j73j0L6j8
5427a02N4K41k05k31L12j11N0k35J61J60j30J00j21K08l37K48n6j70J60k80L22
5448C8J08j75K0m1J18j45KM4M5M9N6l60L56p9Kq8K8J56k21J24Om5p1j32J14J08
5474A7r5K2K12j19q1j67J61n7N3o2J9Q7k12L59l72K96j19n5nL65j56j50j36J98
$$ y = [-116, -97, -26, -207, -163, -131, -55, 114, -35, -35, 24, -141, 166, -16, 57, -221, 4, 15, -27, -148, 10, 152, 10, -114, 12, 44, 170, -66, -33, -111, -166, 52, 22, 196, 68, 14, 80, 2, 111, 54, -109, -80, -65, 13, -52, -124, 113, 243, -170, -134, -36, -33, 138, 136, 67, -100, -226, -124, -52, 32, 54, -4, -44, -80, -103, 96, 132, 13, -65, 104, 6, -102, -116, 40, -74, -54, -21, -159, 72, 71, -112, 90, -210, -170, -6, -19, 73, 9, -94, 46, 75, -10, 210, 97, 0, 4, -72, 145, -19, 80, -15, -109, -7, 85, 85, -245, -183, -59, -3, -58, 54, 60, -8, 35, 43, -10, 103, -126, 66, 93, 8, 48, 187, 63, -110, -120, -84, -102, -48, 193, -12, -243, 69, -42, 8, -227, -66, 94, -36, 64, -57, 151, -186, 62, 6, -164, -4, -284, 38, 146, -29, -9, -50, 68, -77, -75, -31, 14, 63, 119, -241, 115, 36, 38, -50, -22, 134, -87, 37, 43, -2, -73, -205, -91, 17, -78, -56, 156, 37, -44, -211, -50, -107, -54, -116, -97, -10, -222, 137, -235, 61, -58, -113, -118, 247, 91, -59, -195, 3]
5498Cm0J06N7j87o0O7N5k6L8k52J90j03J83OPJ21j58j64J65j76N33l51j13Ro9
5523a59J29k5O7M4rq6J8J27m6ok10P1J88J0j45p3J6J74j92N3Q4p5P8J59m8j20
5549B4j60j24O7K14l3q6P5PRJ93r3J75k30k25J20R9O5L4l31J20q4N0J87K0q5l9
5575c1m2o2N7j9P4p5R9M2J53k28j25K00j10P9o4O5J18p3j65K70L8l78O2j7K07
5600G5j89K36q2o3P9q8J60k82R0PnJ58kJ40j36j56K35n55L37P4l6j9K35j18O7
5625A62k83J31j27M5J54n3J98k44J15k83K84l17K86R9j2k82J05ro1P8J00k8K10
5648B68l14m0P0k1J09k0k9j50n8J90j04p0K30k6j4q6n4n5J40L5l2Nj56J29J85
5673A32o8k92L51j16lJ62j83M4n0j78J21K01p3jr5K33n4k69R4R1J42n2j36j13
$$ y = [3, -37, 69, 126, -61, -121, -54, 1, -25, 13, -239, -49, -152, 31, 37, 44, 165, 7, -157, 8, -168, 365, 14, -99, -90, -159, -30, -55, 12, 56, 47, -39, -21, 106, 60, 54, -156, -85, 103, 113, -32, -105, -89, 85, -107, -54, 30, -45, 33, 192, 144, 24, -136, -260, -193, 21, -12, -98, -23, -16, -7, 186, 93, 268, 38, -187, -67, 32, 97, 131, -200, -80, -164, -114, 73, 93, 8, -31, -73, -135, -78, -97, -23, -98, 1, 43, 196, -32, -157, 43, -67, 12, -52, 13, 131, 58, -107, 163, 201, -177, -115, -132, 75, -114, 122, 40, -23, 56, -32, 128, -154, -64, -57, -62, 96, 94, 234, 98, -58, 177, -378, -41, 33, -3, -22, 213, 95, 162, -121, 10, -117, -72, 82, 29, 227, -17, 98, -185, 99, -218, 68, 167, 155, -127, -22, -31, -92, -14, 86, 58, 268, -46, -86, -16, -37, 72, 52, 23, -127, -185, 5, -99, -169, 61, 35, 21, -65, -119, -174, -34, 1, -31, -26, -182, -53, 132, 64, -228, 123, 7, 4, 166, -17, 27, -23, -201, -80, 121, 48, 47, -48, 185, 131, -138, -44, 47, 189, 137, 1, -112]
5697a12N9q2O7j25J03J33j48P0l2J28k50Q1k9M3L0m3J1R3m9K67l22N4MK9J37l14
5723a97Q4J65K6Q3k64J11j04J37Q3J45k56M8j15QK6j72K56O9k04j45J99M3j38
5746a12J66K8j56J54Nj05J57k98J62K3Q5j59J11Q6K1j71L9j70J26KK7J59r4k13
5770a27K80l05K79j79nR1J20j15k36K51r5j2n5O1R0Q9k73J16K9q9Q7K4o4rk0N8
5796iJ14k22J54L5L4j79J94j36J38k26J86j87J47l5O8m3r6K66l03J32O8j47m2
5819h9J55p1j06M0O5o5M3M7k5j6p7J36l7JJ43k06j4K22k57J4K8J26l6j56J77j13
5845g1J50P1p7j09K38k95O3R8j21P9l0O9No3L0J70k21j48L07k74K67o8j16m0J49
5870F3q1R7j22J56J3p1J10j72P1m5R2L4j74k13J56J26j01J8k0J48J28j96j23J9
$$ y = [-112, -53, -135, -68, -193, -90, 43, -105, -35, -67, 61, -189, -108, -137, -94, -64, -107, -96, -3, -52, 215, -107, -53, -49, -20, 117, -197, -113, 52, 78, 161, -103, 8, -96, 41, 124, 269, 13, 61, -54, -46, -20, -192, 64, 133, -71, -216, -17, 26, -112, 54, 82, -74, 80, 85, -20, 137, -161, 1, 24, 109, -50, 61, 147, 168, -3, 36, -134, -8, -6, 21, 180, 86, -127, 153, -152, 127, -52, -57, 34, 154, 39, -197, 54, -41, -53, -108, -47, 43, 132, -141, -25, 4, -85, 2, 26, -38, -47, -67, -9, 105, -117, 37, 72, 106, -73, 121, -15, 123, -103, 83, -104, 43, 8, 76, 33, -63, 203, -100, 32, 100, -47, -89, 66, -5, -111, -71, -6, -71, -28, 19, -6, -22, -99, 37, 0, 1, 144, -62, -76, 146, -111, -97, -69, 57, 21, -135, 42, -71, 79, 150, 73, -36, 202, -93, -30, 68, -53, 26, -4, 65, 70, 7, 37, 207, -14, -162, 145, -129, 138, 70, -46, -86, 63, -18, 79, -43, 113, 126, 55, 165, -7, 64, 19, 111, 145, -29, -242, -86, 40, -61, -43, -63, 85, 213, 17, -106, -87]
5894h7P6O2J37j15j77L3R5J5k08K78r3j3K05l45o0L39j16K1j22rK59o0j1jj87
5919h4Q7K72m10N5J67k4m3O5k2Nj08J2p2J27j60kK61o4Q1j17n2j00K66j40J72
5944A72j51j61J0Mj5J43K82k09r3M7r5m9L59l11q0K55m1J5p0r4j48L79l6p9jM2
5970G5q2lo4N4MjM7m3kN2j8J0j81K71Nj5K8l3o0j23J77j98O3J66p4Q9k47j48K07
5999d4NJ43j80m0J15L8k03K56p9L4j75N4M1L9J28j85l4J16j07R8J65k14k0J16
6023F7K4j73r4J42J39j24J60Rk22r1L30l04n3L28k91J46j09J3jq4K40p1j73K15
6047B3j03l9K52k93m0J85%l8j30J10n4R2K58j06j80J88j57q5J9J18k1p3QJ2K09
6072A55j6l9r5r3J26j19K4O5k3J1j98K57m2o1n3J67j1j31J24L2M2r4r8nM9Jj10
$$ y = [-87, -11, 51, 188, 73, -104, -71, 24, 39, -169, 109, 16, 3, 208, -137, -197, 142, 26, 47, -75, -84, 175, 115, 104, 103, -84, 3, 275, -135, -80, 87, 63, 20, 85, 63, 68, -40, -28, -100, 27, -133, -135, 126, 62, 143, 26, -26, -126, 140, 0, 172, 21, -140, -130, -126, -141, 2, 284, 75, -18, 29, -66, -115, 244, -67, -147, 108, 67, 82, 12, -82, -230, 149, 113, 34, 33, 75, -7, -10, -74, -20, -16, -17, 30, -13, -15, 37, 19, 29, -152, 119, 124, 109, 137, 104, 44, -79, 98, -100, -37, 129, 55, 144, -103, -251, -44, -39, 104, -76, -116, -1, 37, -166, 90, 11, 45, -130, -76, -35, 4, 132, -53, -87, 29, -78, 20, 185, -29, -49, 67, 91, -82, -176, -34, 105, -19, 141, 150, -72, -163, 167, -137, -190, 138, -153, -7, -116, -103, -104, -188, 52, -19, -192, 23, -80, -119, 133, -160, -200, -15, -15, -53, -183, -73, -127, -35, 223, 117, -63, 125, -32, -117, -98, 20, -1, -74, -66, -54, 155, 139, 100, 5, -88, 38, -81, -57, 8, -15, -4, -202, 55, 13, -48, -101, 66, 55, -76, 48, 80, 122, 28, -70, -75, -26, -25, -135]
6099a35P2L21q9j54Q5k12J76p6n6J04J37j20ml46J38J48J11J45k91O5j51L36j99
6122EK58j51k24P6n2N7R8j40r1K55n6O6l52L70Mj20J81q7j48L9N3j16L05q5j64
6147a9j3R3j97K51j43j63L89j58k58Q1Q9K03j20r7J22j71j83J43J08j8K01j16
6169B4Oj59J13K9n1j41J3J55m5J01m0Kj42J30J13j70Kj85K82L9l9O9j98l1R1j72
6195b04O6J22Q3k98J86J32j40J28J29l29J75k71K14K91k52j12R9j11P0K7q0J36
6217F1k9m2qj26K81j11j29J15O0L7j00p1J39k66M02r8l3j01o9K0J45j72K1k2N4
6242d2j89J78Q3j86Q3q2K76m8K1n9j05NR2j09j20J45K08k6k17P4j1j17J11n4l0
6267a19J6J80k99M24o3j42J38K1l6m7R5o4r5q3J02j9j6j13J78p9K34l41K37n9
$$ y = [-135, -63, 258, 169, 15, 100, -112, 64, -12, -68, 36, 173, 53, 49, -297, -159, -11, 100, 245, -46, 19, -132, 204, 5, 263, 112, -112, -36, -88, -31, 67, -73, -164, 91, 35, 101, -251, 119, 123, 3, 184, 97, -51, -12, 41, -75, 230, 145, -19, -32, 61, -136, 115, -28, -191, 198, 40, -218, -137, -48, 155, 35, -62, 60, -111, -294, -151, -43, -61, 140, 24, 30, -129, -16, 13, -38, -179, -166, -11, -56, 45, 5, 7, -135, -5, 108, -62, -60, -245, 37, 76, 37, 106, -92, -123, -32, -204, -138, -16, 67, -231, -45, 87, -53, 75, 204, -125, 50, -221, -7, 284, 32, -80, 19, -92, -22, 5, -75, 61, 32, -10, -18, -144, 137, 26, -103, 12, 72, 109, 9, -62, 77, -189, 213, 115, 82, -19, -88, -68, 77, -95, -74, -96, -42, -231, -53, 30, -156, -73, -155, 121, 73, 94, 35, -70, -65, 27, -82, -202, -57, 151, 125, -92, -18, -29, -146, -35, -89, -119, -103, 77, -222, 202, 139, -3, 135, 156, 120, 73, 168, 104, 9, -74, 28, 9, -7, -120, 58, -21, 213, -128, 109, 50]
6291E0n9J55j11j48Q6R3rJ06k91O5J39p3J1J28j60J30j31K0J40k98J75K5mj88
6315a49L17r4J4R5j36k29J62J94k23m2J52j10l2J84j36j61J16J81k46K44j83j35
6337b17jK92nk70J37K02m7l43L77k85JJ31J40o8p5J97j07j4k17L01j80J46m8j62
6361a15R6J16n8J24Pj82J06j02O0o9j59J24Q5j70P7Q4p1J57qn1K10l15J54nM3
6386A38j6l3n1jq8L7J19j31J41P8k86K38k75R9J60j24k1j0K23l38L43j04k2j62
6410h6J22K4j03J09Ol37J63J73O3k06J69M9j77j5K00j94J05L5o4j0r0MJ30J5L7
6435A22p5m5O6p3M0j68J76J02j38P7l27K70J12n2Ok13J95k42l6J00J28k19K45
6458E1j71K07l5j9J66j07M3j06o5J55k14l9K15q3J36k54J9J5J65j7j57J10J51
$$ y = [50, -9, 146, 35, -113, -27, 66, 57, 163, -128, -63, 76, 3, 14, 142, -18, 112, -19, 1, 141, -157, 18, 43, 39, -149, 168, 74, 88, 183, 47, -182, -20, 174, -49, -91, 61, -49, -81, 103, -33, -194, -78, 103, -143, 101, -82, -217, -218, 74, 69, -201, -64, 138, 91, -252, 125, -160, -159, -28, 112, 44, -31, 166, 59, 45, -172, 129, -51, 95, 47, -115, -19, 97, 39, 163, 170, -12, 94, -8, 52, -17, -176, -52, 33, -137, -60, 24, -47, 110, 102, 51, 261, -54, 100, 95, 138, 122, 89, 38, 37, -51, -14, 105, -26, 115, 193, -93, 145, -130, -31, 129, 5, -16, -26, 197, -141, 202, 98, 76, -86, 36, 60, -43, 66, 72, -265, -102, 71, 134, -72, 97, 146, -31, -46, 154, -40, 65, 100, 36, 26, -64, -60, 70, 85, 122, 47, 2, 68, -5, 35, -133, 43, 145, 7, 84, -243, 27, 139, 87, 93, -120, 75, -167, -203, -103, 25, -194, 51, -120, 87, 52, 33, 199, 92, 135, 29, -36, 119, -95, -134, 81, -2, 134, -120, -101, -86, 79, 62, -95, 15, 166]
6481A66j66j09Q3j72K86j01l6O7K70l33or5mL21o4j6j96K08nj30P6o4m5j66J99
6506c2jJ8J54k19J32j16J00jq3P3q1J3J9N8N9J08m01K26p6r8L05j40N5M0k7M2
6532A27j23j16O5K1m5J19n3o0N4l7p3J97n6M4q6J6L7j85K31j31J7J27j58M3K04
6557A79q0j26O6O6j39O4j36K96k96J40j04j71K32K8J88j21M7J6p5k16l7J10p2
6580a41L94j74j69Q1Q0j17J82k92K64l1k65K37kj53j2Q0J0N8j74j5K2J80j7l8
6604a2J33j4j22J8p7N9q3P5J91k76O7k37K35J05k92L47l3j43J1J28l03L20k62
6627a65J12l3J38J17l26K10L6j54R2N1o3r1J39l2k93J08J35O0m3j04L4K53o3P
6651A25j01N8m5J2ok0M8lk43R2O%Q7J5J33l4n9j27J2R9j51R8j41n7L71j95J41
$$ y = [166, 0, -109, -26, -198, 88, -13, -49, 18, 288, -45, -51, -146, -150, 171, 107, 91, -105, 103, 98, -32, 44, -20, -65, -231, -32, -33, -15, 139, -80, 52, -64, 36, 35, -48, 25, -56, -43, -24, 34, 93, 201, -200, 26, -50, -148, 157, 17, 72, 112, 85, 127, 4, -112, -47, -26, -71, 48, -5, -65, -11, -48, -121, 76, 20, 64, -22, -6, 31, -154, 77, -54, -37, 90, -68, -25, 179, 99, -27, 39, 105, -34, 30, -106, 190, -106, 34, -70, -241, -9, 19, 207, 86, 133, 149, 74, -142, -179, -69, -141, 253, 79, -90, -9, 71, -46, 136, -156, 108, 77, -188, 49, 47, -106, -118, -38, -28, 30, -144, -159, -137, 43, 26, -12, 121, 107, -15, 3, -74, -15, -98, -23, 168, -108, -41, -278, -43, 62, -230, 117, 84, -59, -48, 80, -223, 97, -165, -53, -86, 52, 169, -157, 53, 89, -65, 27, 78, 15, -76, 63, 31, -262, -154, -19, 41, -2, -106, -72, 181, 118, 125, 24, 82, 37, 49, 43, 23, 71, 68, -175, -83, -77, -77, 10, 25, 158, 124, 65, -62, -50, 49, -102, -4, -145, -202, 169, -26, 115]
6678A15j37M6R4o0n6qJ27m5Q0k6k4m0k04K86j02K8k80J55L4K1N7m8K32k59QJ06
6704A00j9j18L9J03n8q9L7m1j03J5K9J50j46n3K45k8L5q4J8K34k08k64L93k42
6728e5K0J78l84K94Ml4or0N9j07M4J15j85r1L44P9j66N4k1o1Rk6o9r8L34k7K4
6755A38j53q1R7j9k39L38k36J55p4M8K17l59J04J30l5k0N9k19K42k05J70j58K62
6778A62k18J09j15J85Kj63M3J18k52R3K09k44L15k53l6K1p5l5J70j45J58o0K09
6801A98k32J11m0j22L5J65j72O5l4m6J25j48NK8P6J29mm4k9n5l8O6j43J26j00
6826g8J35Oj24Q9L3Qq0j31J24J4J5J39j79n3K1J50j21Q6j58N2o7J16J42j27M1
6851E3O7r8J6l6j13K22k40O8k5m4J88j48L0NN2J15j23J37k12K30j00j76M4J23
$$ y = [115, -22, 24, 118, 58, 2, -6, 121, 76, 156, 130, 106, 66, -138, 148, 46, 74, -206, -51, -17, 4, 61, 13, 245, -14, -6, 100, 81, -37, 2, 105, 47, -42, -5, -46, -149, -134, -105, 45, -101, -154, 91, 63, 98, 14, 32, 266, 58, -206, 187, -55, -35, 143, -241, 53, 57, 23, 17, -73, -14, -121, -77, 38, -147, -238, 106, 185, 19, 73, 52, -9, 0, -26, -95, -193, 141, 114, 138, -15, -96, 1, -18, -257, 81, -155, 0, -74, -26, 191, -168, -64, 66, 31, 11, 70, -149, 93, -112, 58, -100, 162, -56, 53, -62, 123, 125, -38, 5, 123, -129, -36, 173, -71, 244, -9, -45, -24, -99, -134, 36, -109, 49, -11, 198, -34, 77, 37, -85, -50, 115, -57, 8, -26, -72, 53, -95, -90, -62, 14, 143, 139, 95, 66, 11, -27, 39, -104, 22, -78, 57, 63, -61, 28, 61, 69, -11, -142, -18, -4, 11, 150, -29, -82, -61, 89, -32, 54, -104, -52, -119, -3, 139, 12, 53, 120, 22, 38, 2, -111, 111, -129, -61, -86, -130, 58, -90, -60, -55, -3, 112, -11, 126, -86, 144, 44, -132, -88, 35]
6875C5J54j88J9K9rp1p5j2M3l1J7N7j04J66Q6l33K75M4j30P6Q1r9l6L0k25Q9k5
6902a37n7K99j5q9PK9K17r9j00o3ml1p1L16j73q5j0Q3j01J58j60r5J83J8j47K40
6928A13j58J22M9k18N4J41k38J79j58K7J85O6K1k16L5j6J8J41k9j65J79Q0j89
6951B3PJ64k35k8J74J56k30P9r7m9M1op7K04j82J4m7R0ok1ll5lJ76n3r4K14k28
6979e2j98Q0J33J18o1Q0j56j12J86J80l35J24j1P5r0J4J43j3j20q8J97p4l7j46
7003a63R6j14K67rM0N9J6l5k63J09J06o7j25K13r7N9q6R0k82J98J53j83J30O5
7027A77l5k55N7k21K85P0K20l40Mr9N1J36j49J50O3j42J15j65J82k4n9j12M0o2
7051a13J63k65J98jq7J56j27J10N4j17k8j47Q8J85J60j62Ll1J06l8q5j27JJ06
$$ y = [35, 189, 1, 20, 49, 40, -31, -106, -118, -75, -106, -89, -32, -136, 30, 116, -217, 58, 102, -28, 48, 129, 30, -6, 24, -201, -112, -137, -194, 105, 90, 1, 8, 37, 254, 155, 55, -8, -12, -43, -114, 202, 29, -56, -66, 17, -84, 74, -86, -181, 2, 20, -127, 113, -45, 77, 126, -92, -38, 103, -135, 44, -114, -87, 98, 164, 185, -31, 4, -12, 6, 147, 118, -47, 132, 212, 23, 30, 194, -41, -69, 105, 261, 31, 110, 13, -36, 5, -1, -78, 126, -56, -42, -89, 1, -5, -26, -29, -64, -67, 109, 56, -38, 176, -52, -250, -170, -37, 81, 20, 100, -56, -168, 18, 198, -137, -13, -24, 51, -39, -25, 118, 105, -15, -103, 94, 20, -17, -163, -67, -181, 86, 77, 117, 176, 192, 157, -106, 3, 109, 42, -83, 130, 33, 92, 6, 96, -186, 12, 165, -18, 112, 177, 142, -113, -56, -277, 8, 78, 298, -42, -38, -137, -86, 50, -99, 51, 114, -28, 87, -78, 104, 80, 21, -91, -51, -113, 50, -215, -17, -18, -105, 51, -76, 34, 88, -29, -57, -204, -116, 69, 229, 67, 70, 39, 145, 107, 22, -105, -104, 2]
7075Bm8J03j79J46pm1p5l6K84l03J81n2J45p7m6J85l1o0ok16J88K8l0o1o7N5J31
7102A13j96K0j7j5J83j80K3K16J3l7pjj39P8L2Q3k67L0K3M7k07J12J65J37j43
7127F6l54NL10M1k23J55M5M2J05j77n4N2M1j65Q4J44J1o5l9M1m7j06J73j1j62
7152h8J74l12K61l75K71J0N7k83K64j42L55k28J64j3L7k37Q0l0R3K98l53O3p7
7175a1R9n4n2O9q4kj42J08J85j74J27o7J56o8j70J06K7l4j38r4L02j1j71K35j82
7200d0Rm8K31k91L0J43Q0j68J62k04K17K0k03j4N3O6j05P5J06j28J27M1k43k6
7224a10J3J35J20j64K9p3k8O5J12j58r7K43k31O1R9O1j8j10kJ18N8p1j75J58p3
7249c8j00Q3J00j4j57J52K2N9j15K4j44J69M9j62Q9o0L1J55j77J48K4l12QJ83
$$ y = [2, -46, 57, -122, 24, 17, -24, -99, -135, 149, -154, 27, -25, 120, 43, -3, 182, 151, 91, 85, -131, 57, 85, 55, -6, -73, -18, 113, -83, -63, -80, -95, 88, -92, -69, 147, 160, 123, 116, 115, -24, 54, 86, 169, -98, -68, -45, 2, -205, -93, 72, 209, 66, -288, -283, 27, 68, -155, 0, 45, 87, 192, 15, -39, 13, 54, -111, -27, 117, 128, 63, 24, 65, 18, -88, 85, 74, -88, 86, -226, 35, -340, -69, -59, -2, -285, -21, -163, 192, -36, 128, 115, 152, -85, -5, -35, 58, 356, 3, 66, -11, 88, 34, -18, 51, -33, -35, -177, -69, 116, -58, 69, 2, 158, 90, -80, 26, 53, 19, -119, -213, 89, 78, -93, 142, -40, -31, -79, 152, -139, -109, 34, 114, -54, 108, -96, 121, 141, -62, -76, -23, 43, -62, 13, 119, -9, 118, 159, -84, -110, -97, 38, 158, -6, 23, -50, -78, -13, 99, -59, -156, 87, -144, -83, 16, 77, 59, -51, -53, 65, 123, 52, -123, 35, -38, -138, -55, 45, 31, -126, 26, 48, 107, -8, 16, -128, 41, 90, -72, 17, -43, -12, 143, -34, 114, 138, -174, -166, 17]
7273A7p3K7J77m13L04N5j7k97J83n9J31j05J17k08J71J0LQ4k4j8J25Mk08lo9N0
7299c6j18P9P3J6k4K2P3J18k17j45J23N9M0L0q5m8N1q8J15J5j00J50N0N7p7j26
7325G%r0n6K63k14J8J29k07Q7J80j24J00P8k69K13q0J09n2j97L83k82M3m9P3K6
7350H9l29M11k56Q8J47K1k61K43K7j77J52m69L94RK6p4Mk43J95j18J18M8L7k3
7374E9QJ5o1r6J24m9j27J17Q6k9j28p1M13j08r3l1N5j72k64L89j11Jj19L36k04
7399f0L3N1J20k16J50O8j88Lj85K17j82L99k55K9pR3J9l2R3Jj49Jj7J2k8j25K
7426a53L10j27p6K20J7j11J53j89j33J26J13j54n8L5J03l2l55K92j2k1On7J05
7449BRj3j43J87p1J74k00O0j24K56j69O3J48r9pJ35r1p5n9j48L87l70J81Q6l14
$$ y = [17, -56, -29, 148, -265, 39, 94, 77, -220, -37, -96, 35, -70, 47, -161, 10, 20, 23, 107, 83, 65, 190, 194, -14, -17, -86, -36, -154, -75, -2, 14, -10, 12, 85, 203, -14, -159, -36, 23, 63, 93, 8, -40, 11, -77, 38, 53, -47, 103, 153, 210, 133, 7, 7, -83, -139, 124, -90, -72, 57, -150, -63, 117, -7, 93, 171, -98, 115, 35, 144, 92, -105, 278, -4, 39, -10, 63, 89, -240, 171, -85, 3, 150, 171, -90, 153, 180, 3, 155, -314, 80, 89, 115, 41, 45, -198, -3, -121, -3, 45, 82, 59, 67, 82, 21, -75, 49, 0, -127, -10, 76, 47, -81, -152, 261, 153, 60, 29, 84, -88, -352, 37, -74, -73, -192, 144, -60, -27, 24, 144, -72, 78, 146, -42, -39, -224, -7, -189, 210, -45, -16, -23, 70, 89, 57, 150, 151, 2, 3, -14, -2, -30, -155, -153, 157, 30, -46, 174, 191, 80, 233, 44, -89, 37, 150, -4, -62, -27, 76, 44, -311, -19, -31, -52, -46, -103, 2, 11, -2, -145, 42, -29, 145, -55, 5, -119, 137, -32, 31, 179, 80, 73, 208, 117, 42, -17, -165, 222, -148, 33, 119, -195]
7474a95K62j9m3K0k17K20q2o1N2J5P2m3l5J11k01K51j76R2Q5M8j66J28k23J06
7498AK1p4Q2q2P0m7J72k15j7K47k32J39j81Q1J21j28J68o8r5NN8r8Pl4J72M2j69
7525e4K97k37mO5j03K0J7NQ9m6n6j21L42r4j70j69J58Q5p2r0J97j5J27k80j08
7550b17L78r9P5m3k17O9J39q7j68J22J43p1j89J20O8j25j5N6R0J6j64J89ROp8
7575GM0j6q6q5J55j90J06q5K02j60J66l5J70k8l25kJ01oJ96j48N7K4J74l25J33
7600D0J63k55J50r9L1r0K3N9J07q5J55j66l8J97k44J81j27J56l9n7J02k99J07
7623b8J54k88M4J66J21k07l7J75j35k6K7j24L06j88K0K6j7M7j58K16R2l87K51
7646E0K1j11M8J4j46R5N4J36j16j13Q4J4K1j81J81k59K39m5K4J02M4j32j37L72
$$ y = [-195, 67, 48, 5, 25, -192, 28, -54, -115, -63, -48, 24, -19, -54, 57, -144, 107, -69, 23, 108, 156, -10, 118, -105, 1, 22, -52, 30, -52, 18, -29, 143, -72, -89, 158, -74, 65, -116, -35, 86, -42, 126, 58, -37, -32, 26, -72, -65, -99, 73, 115, -54, 243, 6, 2, 67, -36, -16, 1, 6, 95, 49, -7, -128, 214, 120, -50, -219, -61, 24, -48, -138, 59, 44, 171, -109, -217, 161, 62, 137, 94, -123, -54, 85, -2, -170, -48, 95, 24, -165, -45, 23, -102, -117, -61, 29, 45, -119, 70, 79, 85, 7, 47, 31, -55, -140, 15, -175, -69, -154, 48, -112, 54, 19, 189, 161, -164, -166, -65, -71, 125, -23, 34, 58, 232, -93, 40, 203, -52, 98, -1, 30, -60, -37, 22, 129, 44, 199, 33, -5, 192, -52, 129, 2, 158, 119, 62, 164, -135, -28, 126, -162, -118, 48, 169, -38, -75, 100, -35, -61, -34, -158, 148, -40, -20, 6, -11, 36, -122, 94, 186, -201, 50, 71, -40, 8, 22, -124, -29, 25, 161, 45, -68, 16, 30, 51, -130, 51, -208, 31, -14, 10, 112, 156, 24, -113, 259]
7670B59k28p6P0L9P8k61J68Q6r5o3N7o2J15k09K61n2N2k02k4j07J32P8j05J62
7694G3q0N2j31J71n9L4j06P7K03k40l0Q9k5kJ38j41k11k7K06q1N3M3j24m2J56
7719dk33L30o5l3J43m0j49P8o4P6J95l03j24K30O5k67L52l4k08q8J68k89L58j12
7743a8r8p9K00k44K25oK45l64J5K69j98N1l8J02j06j34P0J19o5M8M7K08m67K99
7767H1j68N6j1p2K07k45K01N0kk73K42pr7K0J2Q2k02J89r4J56j43QL1j58K20k6
7793E7j22j55J44j9J19j06jJ10J90j33j89M0J62m4j37k1P5P0j0m3R4qp7m4J30
7818H2l15R0O4L66k58J47j17k12j17J72O7J90j77M7r7p6L17j71k49K60km5k7J39
7842G8%L3q1Lj51K9M5o5R1K3n5L1J7j13J67K2M4k48J03p6J5K00p4Q9l30K31j07
$$ y = [259, 31, -45, 25, 64, 142, -119, 49, 135, 40, -23, 34, -28, 87, -122, 139, 87, 139, -63, -87, -194, -62, 16, -89, 73, -7, 45, -86, 85, 26, 60, -46, 31, 234, -6, -36, 53, 28, 26, 164, 23, -188, -215, -9, -90, -37, 6, -118, -160, -4, -237, 93, 28, -5, 138, 98, -51, 27, -37, 39, 234, -69, -193, 37, 102, -165, 187, 153, -55, -143, 25, -264, 94, -18, -116, -195, 5, -239, -14, -20, 225, -139, -124, 145, -53, -2, -40, 62, -44, -178, -108, 11, -54, -6, 41, 249, -218, 81, -87, -31, -42, -114, 93, -152, 49, 99, 97, -176, 66, 59, -38, -18, -6, 76, -126, 63, -31, 125, -18, -10, 21, -137, 83, 57, -65, -220, -76, -95, 24, -82, -83, 27, 217, 84, -105, -65, 97, 53, -84, -105, -30, 40, 30, -13, 81, 73, -4, -48, 82, -233, -143, -79, 287, 29, 176, 59, -153, -270, -98, -31, 159, -18, 29, -68, -144, 173, 2, -247, 13, 11, -34, -61, 78, 78, 111, 30, 33, -118, -89, -44, -109, -18, 5, -50, -19, -2, -115, 52, 74, 118, -130, -27, -103, -88, 112, 38, 127, -203, 28, -79]
7869g9Q0p9k8J76Q0k62J02k4J22j48L40j64q0k2j3p6K04k82J0J76J29k37P7N4
7893E6N4r0q8M1m1m0PJ10n1P4L8j58J87l8j25K20k34J14O9P8j99o3P5j00K06j41
7919c9n5k5mK08m0J6m1j11J28O8q9p7J81j70N5L3o7o2J16N4M2j70J22J6j69j68
7945b48P8K94o5J15l09J85N5j13j7Q2j2k8j94M6J5J11j01j6K10o0Oj57J29J46
7969A52k76J63k5o3M2j44P7M6O0j75J33m1K03l47J09k0j67K07n4J52j45J72j02
7992d3j6P4J8o8J52p8j72pJ98k32K80L9r2n9J21k50K87k56K38j82J00N6M5R2k75
8017c0J44p2r8j74J88p1Q9j17N8r0J49k5J6p7J27M8j38L20q4k34K37k13J01j06
8041e2J53j8l63K24l4Q5P8J29l24K81k64K48L6k13L3M5J16j46L59n15K27j10j35
$$ y = [-79, 1, -78, -106, 70, 150, -112, -10, -34, 88, -60, 280, 116, 36, 14, 1, -75, 129, -153, -143, 33, 162, -75, 2, 56, 110, 20, -68, -27, -68, -108, -101, 9, -42, 32, 70, -88, 99, 61, -64, 156, -78, 36, 105, 183, -16, -79, -4, -104, 102, -39, -94, -119, -123, 85, 45, 61, 20, -91, 37, 105, 16, -61, 120, -50, 5, 38, -29, -91, 25, 79, 121, -49, 73, 89, -80, -248, -170, 124, 59, 174, -135, 50, 105, -8, -25, 57, 45, 17, -177, -131, -116, -5, -106, -122, 88, 28, 34, -123, 6, 152, -124, 39, 14, -49, -7, -151, -74, -28, 32, -143, -10, -51, 152, -195, -86, -106, -273, -66, -120, 32, -113, 59, -43, -59, 15, 33, -35, 117, 39, -133, -140, 58, -174, 106, 145, 53, -6, 115, -135, 152, -104, 134, -48, 52, 108, 153, 245, -30, 114, 42, -56, -230, -42, -113, -24, -141, -83, -173, -24, -49, -33, -110, 17, 65, -73, 247, 163, -71, 166, -47, 54, -52, 101, 83, -280, -56, -90, -5, 73, 202, -122, 159, -105, 143, 179, -34, -1, 44, 160, 14, 373, -142, 85, -25, -160]
8064a60N1L12j53j51K37j25J3R3k06J42L1p5J4j7q5J59l3l6N1l3L5L4J65k40M2
8089F5k77K41n0K04l69K2K99j79j68M20k08n2J27k23J32m5J7M2M6r8J82l45L33
8112A16q2r2J11L2l5j34K05j05k8o2J24j43J04o1j4L90k06q0p2J4k6J35k58J47
8136b0RJ8m7R4p4L09l09lj8j34J76p2L3k5n7K78q3q0ko9k4J74j34n5K9o9m9K16
8164A2Mj29m7J42j0K8j63K25q8J55L9j36M4J3j49k8K83k36J18j67P3K33j14j75
8188g3J80n4o
$$ y = [-160, -109, 203, 50, -101, 136, 11, 24, 117, -89, 53, 84, 9, 23, 6, -79, 80, 47, 11, 62, 29, 64, 98, 263, 23, 65, -212, 29, -21, 183, -186, -164, 135, -44, -212, 208, 0, -52, 75, -148, -16, -61, -44, -2, 44, -54, 128, -217, 116, 34, -58, 53, 85, 50, -84, 121, 16, -12, -74, 50, -93, 11, -50, -64, 326, 120, 40, -32, -18, -44, 91, -167, -20, -11, 7, -40, 54, -20, 289, -20, -23, -41, -175, 1, -71, -38, -63, -120, 158, 75, -5, -7, -76, -100, 74, -60, -115, -86, -155, -204, 12, 16, -113, -160, -18, -28, 0, -163, 62, -26, 129, 168, 32, 76, 89, -60, -88, 195, -41, 77, -90, -17, 216, 102, -73, 107, 53, 47]
8191D7
$$ Imaginary data points
##PAGE= N=2
##DATA TABLE= (X++(I..I)), XYDATA
0@%%%%%%%%%%%%%qJ6j6J6j7K5l2L8m6N5o4P3q8J05j22J38j55J79k06K33k64K98
35A58l37L80m27M77n31N93o60P33q12Q98r93J097j211J335j469J618j783J966
53A032k170K396k650K937l270L652m098M632n279O089p133Q537j0539J3646j9192
68a1410L2150j23809o8446J57528Q4067O1181j8194k6648l1591n703l9640o1847
80e2362p0218k4187K7776Q4159Q6772N8113J2303j0780l5938n2888o9190o1057
92a07497l0339K5927O6190P2814M2214R652p032j665l830k6451o2714p8841m9062
105a50634K0870Q1608R5970O0171M325l6807l9824k2498j6673k8415l8626l0258
117a00791L160M8797P3691O0739K4691j2383l9422n0471m6910l7943j9314J0131
$$ y = [0, 0, 0, 0, 0, 0, 0, 0, 0, 0, 0, 0, 0, 0, -8, 8, -8, 8, -9, 16, -16, 22, -24, 31, -33, 40, -48, 57, -65, 73, -82, 97, -109, 124, -140, 158, -179, 201, -226, 251, -280, 313, -347, 386, -426, 472, -521, 576, -635, 700, -769, 849, -934, 1032, -1138, 1258, -1392, 1545, -1725, 1927, -2171, 2461, -2818, 3271, -3862, 4675, -5864, 7782, -11410, 20740, -103069, -171515, -13987, 70080, 131261, 113067, 86419, 54828, 49125, 9485, -52362, -122580, -146767, -118991, -34832, 51940, 110053, 122356, 111576, 75638, 22750, -46440, -107497, -137836, -111909, -45719, 27095, 69309, 78961, 71929, 70264, 66434, 39983, -22731, -101572, -150634, -129764, -48156, 47814, 107985, 112310, 75503, 35679, 13181, -3492, -31907, -70533, -100791, -97631, -48834, 24857, 85596, 110287, 97904, 58482, 8011, -38899, -76842, -96156, -86025]
129h6025L8823N1795M5549K3763n96j3526j7476k5175l8753m6168l4801N65M7033
142e4992P4603O3238K2819k2210m7488m1516k0755q658j1538j4941n761J9894
154d7305N0242N9467L5371n659m0333n3974m3877k0485j261J0367K1329L2609
166c509L6259K8477Q867j4027k9049k9962k4963k1054j6645k976K0874M5471N4552
179E2315L6499l392m0982m9498l2532p481N659L110l243L926K7589M5924L8597
192G6491P476l0231n3208m5219j7739N765J5238J7462J9904K3521K5412J6447
204F1319o411k7690l3637k6088j4518l037M864J3351K6739L8374L2545O109k5362
217D6558m2196l7326j5057O337J1162O433N041J5535K8441K9921J2662j8898m1539
$$ y = [-86025, -47202, 4593, 50142, 73905, 73309, 59783, 42307, 17132, -21621, -67789, -102590, -102025, -54992, 19611, 82849, 105668, 83458, 35970, -5546, -26301, -34959, -46497, -61438, -67199, -47305, 2937, 62404, 97775, 92116, 51783, -2191, -46068, -66553, -67814, -57447, -36118, -3509, 32750, 61227, 70094, 56067, 27018, -2944, -27907, -48961, -65606, -68582, -47708, -2237, 52315, 88814, 85422, 44440, -5058, -37590, -45071, -39412, -36302, -39545, -35619, -8030, 37894, 76491, 83967, 53736, 528, -44691, -62430, -56665, -41427, -23965, -4061, 19460, 44872, 61319, 54908, 27218, -6419, -32507, -47025, -50062, -45198, -31847, -5108, 33266, 65811, 71920, 46558, 4362, -32964, -48021, -41684, -30522, -24089, -19048, -3513, 24928, 54849, 67511, 48613, 7074]
230G074m1569k1899J989J7355K0536J8579J7034J6996J1173l310j8716k7609k5242
243b7609j5193k152P817J4858K2418K6967K2239O114j4864l0752l1824j8900j604
256d2485R373J2334J1890J4138J7958J7526P637j0763k6979l2079k2973n344J1929
269c7838K0636K1885J7370J1526L945m520j3270j9538k0736j5694n200P169J7772
282a6493K1648K0873J3479K001j1309j9891k2253j8256q125K933J2445J7284J7800
295A2136J4051P706M12q538j7264k1528j9090r011M389J6950K3032J8989J0153
308C2387R8o837j1257j4083j5305j4226p074M553J5799K1500J9306R805j637j0208
322B2821j4651j6004j4136r281j121Q949J6540J8985J3858N147l263r327j3967
$$ y = [7074, -34495, -56394, -54405, -37050, -16514, 2065, 19099, 36095, 47268, 43958, 25242, -2367, -27609, -42802, -44954, -37137, -22279, 139, 27106, 49345, 55459, 40595, 9843, -21981, -40881, -42485, -33112, -20778, -8888, 5250, 23208, 40734, 48371, 37608, 10629, -21450, -44423, -49767, -37838, -17202, 4683, 22053, 33579, 37524, 33004, 19734, 196, -20540, -36234, -41434, -34265, -16493, 5155, 26028, 39507, 41508, 30199, 10308, -11945, -30201, -38326, -35393, -22948, -5664, 12136, 26187, 33893, 34305, 25767, 8503, -13025, -32115, -41126, -36737, -19787, 3245, 22234, 32387, 32485, 25648, 14391, 308, -14997, -29223, -36297, -31744, -15945, 5555, 24861, 34666, 33029, 22821, 8170, -7834, -21970, -31251, -32372, -23423, -6883, 12102, 25960, 31107, 27844, 18517, 4550]
335D550j5138j3686q371J381J2779J8996J7592J0657J074o888j1254j2577j3291
348a4176j1522m710M514J3241J7724J5763Q095j323p992j2296j3587j2285q069
361b6623j028P347J4218J6171J2393M986k687q933j2918j3597j1314n157K759
374b4383J0258J4420J3023R170K760l713r128j3084j3226j0509k767O354J2512
387h313J3846J1449N992j23n325j0041j2394j2164p096L1P759J2380J2732R476
401A8209M367n66o813j2123j3358j0535l595M191J0249J1493R620O531K806j527
415A8949o657j1172j3909j0260j709O909J2108J2285Q282L994k87l706p555j1078
429c806j0850o934M00O787J1540J0754P590L780n57n361j0304j1654r591l452
$$ y = [4550, -10588, -24274, -32645, -31264, -18485, 511, 18103, 28760, 29834, 22946, 11692, -885, -14176, -25698, -30408, -25894, -12653, 5071, 20834, 28929, 27606, 19614, 7318, -6269, -18554, -26623, -27651, -20304, -6086, 10085, 22478, 27464, 24777, 15844, 2926, -10671, -21985, -27142, -24383, -14125, 295, 13318, 22488, 25248, 21535, 12407, -677, -13903, -24412, -27179, -20825, -8313, 5533, 16982, 22974, 22851, 17526, 7485, -4909, -17073, -24169, -24138, -16379, -3999, 8733, 18209, 22576, 22010, 15197, 3074, -10284, -20819, -24414, -20223, -9974, 1519, 11139, 17670, 20476, 18949, 12292, 1120, -12789, -23049, -24758, -17849, -5741, 6544, 14826, 18820, 18533, 14827, 7272, -3806, -14656, -21590, -21190, -14403, -2863, 7891, 15481, 19261, 18704, 13343, 3039, -8615, -18206, -21658]
443b1658M099R059J0407Q177N365J775j485n295r509j1670q754j842N334J0641
457e356J0643Q215L435k99m000p240q734r126n782L8N748R182R847P640L387j343
473A6255n249r180r496p530k424K601O745Q775Q186N634K281k122o641q940q637
488i742o385j242M465P541Q440P792M686K56m203p354q415p283m101P37M265P196
504c347Q372P113L954p23n743r076q183n096j533J782N095O552O816O301L767
519A6051k102o735q955q194m732R42M376N305N915O013M685J145j994o340r061
534c681p407l313Q89M588P237O747M853L309r7m766p339p227m991j621K224M591
550f004N193N668N542L140o32n215q653r068m323J418N475N713N052L379J842
$$ y = [-21658, -17559, -8500, 1907, 10084, 15449, 17224, 15739, 10444, 935, -10735, -19489, -21331, -15997, -5356, 5287, 13502, 16937, 16638, 12638, 5398, -3336, -12462, -18244, -18206, -12458, -3276, 6571, 14211, 17598, 16255, 11006, 1826, -7670, -15200, -17624, -15023, -8278, 497, 8683, 14317, 16598, 14476, 7835, -1105, -9742, -16127, -17369, -12904, -5363, 3077, 10869, 15555, 15811, 11608, 4254, -4161, -11444, -15545, -14808, -10543, -3347, 5025, 12138, 16092, 15369, 9626, 550, -7633, -12729, -14262, -12480, -7385, -833, 5983, 12284, 16051, 13949, 7214, -1741, -9935, -14667, -13725, -9349, -4044, 1871, 7884, 12569, 13714, 11720, 5380, -3681, -11088, -14401, -13512, -8924, -1687, 5060, 9913, 13222, 13125, 8359, 1020, -6207, -11198, -12819, -10595, -6004, -811, 4857, 10399, 13539, 12907, 7692, -961, -10029, -14352, -12934, -7459, -1746, 3306, 6685, 8527]
565H527J627N6m141p037q050n255K16N357Q210O877L995O99j801l537m566m953
581c776n251k325J196L866N707N611M069J855l64l764o616p807n320k87M891P930
597c85N865J878n14q12j58m85k847o950p667k953M462R134R705M431k114m647
613E943l774k460k055k554l365j692K522N923O976L717J113k030l719m329n302
628e086n191k048L518P257P060L734j392l844k158R21Q9l486o632o052P8Q525
644d707J1582P161q26o756p729l437J214J616j821l527o62L673O920O708K083
659A1492l179n351m504l905k696q18J572L940O860N467j90l676l999j739R71K48
675D93l548o091k980M680J0290R669K912o116j0309o510N92L922K603j369l349
$$ y = [8527, 10154, 10210, 6069, -968, -9018, -14273, -14057, -8700, -490, 6387, 10382, 11081, 9280, 5743, 1177, -3776, -9027, -11352, -10156, -6290, -583, 5028, 9097, 10952, 10588, 6824, 208, -7599, -12919, -13206, -8315, -385, 5480, 7358, 6844, 6032, 5874, 5389, 2542, -4408, -12075, -15028, -10566, -1432, 8273, 12704, 10590, 5943, 2169, -291, -2346, -4900, -8265, -9957, -7435, -1512, 5464, 9181, 10294, 8264, 4545, 216, -5086, -10277, -12325, -8807, -1550, 5510, 9244, 7852, 4008, 1850, 2771, 2860, -626, -7258, -13310, -13232, -4707, 6875, 14036, 13210, 6454, -1275, -4712, -3498, -1882, -3703, -7230, -7892, -4219, 2701, 9409, 11492, 8313, 2962, -1542, -5447, -8143, -8961, -7389, -3449, 3411, 8878, 8688, 5012, 1013, -726, 245, 493, -3055, -9146, -12126, -7446, 2844, 12513, 15425, 9309, -1000, -7510, -6918, -2996, -393, -1762, -5111]
690e111j146N127P888M829j404n919o864m602n64J410J419K615M194L994J999
705G865j256m228m030p52J110k05l003l479J60O209R441O516k337r387r355l756
721a0487L864O689K171k978l956N61N777P244K831m585q595o833j415L046M330
736b336K876J220J430K004N75j935l639k900r24O36P79j713j266K304N837O908
752I856K110n180j0130o952N81O124O158J156l612l843J440O136N732j79p031
767B366q862m732K263O259N179J700o70q44J94N47j461k846k654p99R40Q66N15
784b039Q32K423M499L287j935o539p112l030K705O691M492p67m136j982K703M908
800E000L090k848p678o761q70M825O647M577m28k857j733J54L42p69k347k421
$$ y = [-5111, -6257, -1130, 6758, 11587, 10183, 4264, -2600, -7202, -7766, -6356, -4937, -2322, 1872, 5866, 7865, 6609, 2381, -1649, -2401, -1291, -1496, -4499, -7978, -7818, -1609, 7832, 14348, 12011, 2624, -6731, -10487, -6623, 66, 2237, -741, -4697, -4136, 1641, 8885, 11716, 7131, -1464, -8297, -9712, -6666, -2336, 540, 1760, 3190, 5194, 5769, 3834, 195, -2705, -3629, -2993, -2214, -3927, -5193, -2889, 2948, 9856, 11966, 6786, -3344, -10296, -9715, -3591, 2567, 3723, 111, -3732, -2292, 3844, 9576, 9397, 2366, -6496, -11228, -8965, -2706, 2473, 4173, 3503, 2659, 2853, 3400, 1939, -907, -3561, -4360, -3420, -2554, -2039, -1207, 1216, 5715, 9002, 7067, 528, -6584, -9614, -6909, -218, 4274, 3507, -629, -2611, 92, 5000, 8090, 5242, -2436, -9197, -10067, -5242, 1405, 5982, 5554, 2697, 964, 1118, 1460, 691, -1656, -4077]
816d077n79J621K286J317J447J880J614k57l020n391m474K12M289N239K185j260
832C032l465r51K751L651J00m317o472l246J873O236N587J692k118l313j743M25
848b78P43p70k229j715N89K326K594J801P98m71n47j439k735k958j288J208L848
865e23L523J156j824k048l54J479J579j327m148l492l87L502M872L982l99l142
881B449k995j051O09N85p64j587p96J479K352K611R37k61j580j710j493j506j073
898c794L65J752K679J923K13j074j252k97K9l89j472k041o82J317L076L219J149
915D721j309k357j829r80L86j43l27j37M00J923J690J305j20j431j644j587j049
932b488k00L53P53J719J548J245k14r38j185j014q62n06m76j28R01J503J911J080
$$ y = [-4077, -4656, -3035, -749, 568, 2015, 3895, 5509, 5252, 2232, -3159, -7633, -7421, -3132, 2107, 4292, 3032, -433, -1384, 1367, 5018, 5118, 801, -5671, -8917, -7044, -808, 4779, 6471, 4353, 1040, -703, -278, 465, -305, -2534, -4249, -3660, -1334, 1260, 3061, 3859, 3388, 2841, 1402, -1333, -4291, -5579, -4371, -523, 3000, 4156, 2332, 284, -70, 1409, 2988, 1661, -2487, -5979, -6366, -2864, 2008, 5990, 5591, 2449, -546, -1597, -988, -403, -1167, -2754, -3550, -2071, 281, 2892, 3829, 3568, 1988, 278, -1215, -2721, -3794, -3429, -1677, 1002, 2925, 3138, 2064, 812, 515, 544, 155, -1317, -3358, -4040, -2723, 353, 3572, 4721, 3412, 1055, -774, -1754, -1368, -1511, -1838, -1975, -1575, 348, 2038, 3343, 3223, 1792, 148, -1439, -2488, -2688, -2335, -1582, 137, 1685, 2930, 2716, 1778, 593, -421, -1283, -1789, -2265, -2393, -1492, 11, 1922, 3002]
950C002j54j042j644j060r27m86J59N02J254J315J123M26k58j150q95j105q98
967a838m35K12O07J367J341J002K00p32o84j197j515m31m36Q09J291J227Q92Q3
985A763l20m80k9p22r86j594o75O41J991K348R44m18j233j380q4j27k99o42n54
1004a856j15J123K041J053J57p39j083q68q35p69l76L93J507J731O05n56o78o38
1022I7P9N85n91j309j919rJ772K848J992l02j976k160q67Q38R66r1j089r79N66
1041a549J741J977O98n15j646j665o56n3K30L4O49J596R02K99j099j328J61K43
1059A9N74o98j698j062N71K465K869R43j637k885k175N78J983J060j49j632j092
1076a966O76K164K271k15j751k136j493O5J129Q93O25J83O43L15l48o45m77n84
$$ y = [3002, 2848, 1806, 162, -898, -1825, -2311, -2152, -1650, -396, 919, 2042, 2468, 2210, 1060, 165, -940, -1838, -2273, -2061, -1454, -87, 1254, 2256, 2456, 1724, 1040, -157, -1672, -2103, -2539, -1730, -439, 788, 1680, 1763, 1443, 963, 934, 212, -774, -2368, -3043, -2402, -411, 1937, 2881, 2463, 1230, -150, -234, -361, -660, -1302, -1856, -1971, -848, 1193, 2246, 2403, 1664, 581, -287, -1122, -1891, -2267, -1874, -367, 1364, 1969, 1413, 735, 97, 176, 761, 170, -1139, -3058, -3067, -1295, 1553, 3545, 3243, 1267, -893, -1760, -922, 44, -47, -1136, -2115, -1549, 192, 2169, 2867, 2352, 706, -959, -1615, -1668, -1438, -1404, -755, 841, 1743, 2042, 943, -385, -224, 19, 593, -105, -1803, -2865, -2294, 171, 3040, 3983, 2346, -539, -2714, -2136, -153, 907, 758, -874, -1966, -1290, 874, 3145, 2930, 1179, -957, -2450, -2385, -1256, -363, 262, 445, 1088, 1403, 1055, 410, -67, -651]
1094f51N70J06n32j060n16J244K357J874j30k324k754j427J380K244J427q25k224
1111a241o64J150K629J569p61k579k796m49J422J625J254j27m31n53O34J24m01
1128D05o95l97J55K9j95j92J54J034J860P37j413k279j678j30J712K232M25j410
1146C54j537l48J729K377N62j978k728j582L63K181K111K68o91j170N3K91P30
1163I85l47j078r15pO82M19M13M57M29P62k76j396j684n95L78J776J487k07j372
1182h9r92N22J722R92l53k076k185o09J733K170J131l19j262j108L64P80K82m42
1200B61q14p48k1O56J293L36J04jm90o39m80o04m21Q11J090N67m08l07m06L17
1220I6P69M01j017j559n37M07Q80J794O51o68j519l48J33O03O60p06j058k69O72
$$ y = [-651, -81, 25, -507, -1567, -2083, -839, 1518, 3392, 3262, 938, -1816, -3243, -1863, 381, 1808, 983, -1241, -1905, -755, 1874, 3443, 2682, 103, -2693, -3142, -1720, -95, 1159, 1032, 601, 48, 682, 806, 405, -290, -687, -532, -503, -698, -890, -736, 298, 2158, 2895, 1482, -797, -2475, -2605, -893, 1339, 1764, 354, -1183, -1531, 198, 2575, 3137, 1159, -1569, -3151, -2788, -607, 1504, 1772, 1081, -89, -36, 255, 985, 638, -440, -1355, -1362, -680, -261, 152, 609, 1038, 1800, 1524, 128, -1556, -2151, -1773, 3, 1490, 1283, -89, -1081, -559, 1163, 2155, 1802, -274, -2459, -3068, -1335, 835, 1966, 1647, 385, -723, -359, 421, 703, 261, -553, -1301, -1322, -666, 627, 963, 1067, 1066, 576, -63, -543, -1147, -1568, -757, 333, 900, 492, 185, -221, 96, 865, 1266, 249, -1310, -1847, -1440, -560, 1234, 1885, 1217, -302, -650, -517, 86, 746, 40, -1018, -1287, -615]
1239f15P42J012N68q24j136l62j52L81J45O1j78L96L12J40J80J14m54l54l82n6
1259d62n16p4P89O25L89M62m61r00k83J02O69k99l78l86k28O92J307O20n98r90
1279H0q57l41M15P87K76o03q5r1M81J116K04q53r05o85j00M84O06M36k36J21L9
1300B89o6K00n0m08n19j31J80J65KM83M80L06j36l83q43p10K62O75N33N7m06n94
1322f14N3J154P58J7j021j578n79N98J256J044m4r73p45Q7R78M77j75o91q17m47
1342a262N94P97P44j82j52l76l11O4k63j91K2M92K88j66k37k48O9R75N52j86j454
1363d31j162k88J358J567P29p25j599r69R25J150R48o14j377j319L21J299J239
1380A052N96q08j131m78M98L05m9J82m08j67M51M24m98j84N74J94L92q10j141
$$ y = [-615, 127, 1139, 1707, 883, -253, -615, -767, -386, -241, -180, -358, 38, 350, 490, 670, 784, 330, -24, -406, -462, -978, -1052, -263, 362, 751, 1213, 752, -148, -431, -329, 340, 41, -337, -723, -951, -259, 1048, 1668, 1070, 80, -777, -1118, -703, 84, 360, -243, -328, -419, 62, 1178, 1382, 529, -376, -1061, -1161, -677, -71, 365, 129, 250, 289, 223, 423, 373, -35, -554, -685, -505, -340, -338, 145, 625, 931, 795, 412, -431, -1141, -879, -204, 329, 386, -20, -614, -561, 593, 1351, 1368, 347, -1231, -1810, -1212, 44, 1088, 1044, 71, -674, -587, 391, 868, 693, 2, -815, -1262, -668, 129, 873, 691, 539, 163, -148, -84, -347, -538, -516, -24, 264, 98, -139, -387, -318, 657, 1209, 1023, -431, -1593, -1881, -523, 1044, 1773, 1048, -551, -1520, -595, 555, 1503, 889, -488, -1807, -1486, -187, 1052, 1648, 840, -291, -769, -271, 34, -15, 167, -241, -408, 43, 467, -31, -215, 359, 553, 945, 135, -1006]
1399a006r18N38J708J312J72j378j535m70J216J694L17j149k042o34Q35K142J289
1416B091l33j540j291k45Q26Q96J76q47m20P7M40L30M89m28J14mk15n36o81o6
1436a167O04J559O18n26j507j112L76J443J132p6j656j438l29J730J953N81r11
1453A274k100j046N21J566Q83m4r42j036J06R70P27l3n11m05l29j70j4l0J30N33
1473E0P44L30n67j589p1M88J322Q62q09j396r29J00J963J336L39j889j705m48
1491a869R92J467R14m66j436o00L12R27Q84n1j155n11q1L97K68J14o1K87K15j67
1511C80l56q07j62R13P72L58q61j095m63Q42J401Q89o22j811r93J63J117J617
1529A282K2j250r00n08J392Q70K7l73j021m76P3P27K58J50Nj36K78k37l72k84
$$ y = [-1006, -1924, -1386, 322, 1634, 1806, 428, -1107, -1577, -361, 1333, 1650, 501, -1541, -2175, -1340, 802, 2091, 1758, 218, -1073, -1318, -492, 404, 580, -267, -687, -610, -170, 160, 649, 221, 335, 331, 116, -420, -1101, -1167, -563, 996, 1614, 1088, -419, -1531, -1155, 288, 1420, 1344, -312, -1750, -2079, -349, 1604, 2185, 1274, -826, -1872, -1351, 215, 1098, 1054, 112, -924, -818, 152, 879, 846, 335, -70, -399, -569, -583, -613, -483, 50, 794, 1124, 557, -1032, -1103, -615, 707, 1569, 760, -636, -1565, -1465, 498, 1834, 2173, 284, -1421, -1869, -877, 590, 1504, 1038, -398, -998, -686, 241, 1125, 1074, -81, -592, -673, -276, -8, 106, 45, 332, 547, 380, 24, -783, -945, -32, 740, 1098, 237, -858, -1321, -479, 922, 1811, 1189, -622, -1615, -1452, -335, 1282, 1304, 54, -846, -1354, 38, 908, 935, 562, -459, -935, -862, -135, 123, 273, 278, 142, 420, 183, -189, -473]
1549d73K62K82J33K57n72n45J30P42P27J05q05j228m07N92J120P04j31r12r95
1568a014K02R71O68j4n63p93m43N55O77K38l3m38k59K49l4j01k83K31K05N7L9
1589A17p9l53J09O59J08j28n19o47K7M68M30N32m54m90j51J71N52n2k1n38k57
1610e16J1L13O23r8k83PJ52k93J28jl03R4L45j30N0P9k63O9K70J02l94o5l18M2
1634c79K73L87R6k89j24N1j17L58k1m06j06J0J79J74J67k38J32J54m45p4p3j06
1656c97K82K95K8m0Q9k60p3J68k5Q8N3n14K74m7l0J70J62J01k00k01J63j57l29
1679d00L67J64q2R9k16l04K03Q3K71Rm45l27J95K98M34r2j22k17k57jK05J68n6
1702b3K7j64K6L2J84j9j17L57o1K8n16J75l86M33M55M6n00n24J99K44O93k58l95
$$ y = [-473, -211, 71, 204, 461, -111, -656, -526, 216, 943, 1048, 243, -985, -1392, -800, 320, 1024, 893, -19, -1014, -812, 159, 827, 813, 250, -543, -986, -431, 246, 484, 451, 13, -246, 3, -31, -132, -415, -184, 21, 78, 117, 38, -315, -206, 453, 561, 433, -86, -733, -706, -238, 192, 724, 270, -220, -371, -200, 352, 300, 279, -259, -516, -505, -192, 431, 333, 50, 57, 209, -84, 44, 43, -260, -166, 179, 49, 99, 178, -85, -16, 254, 356, -38, -103, -421, -379, -106, 281, 377, 88, -36, 15, -102, 256, 235, -171, -277, -267, -88, 86, 253, 15, 147, 301, -144, -218, -291, -397, -115, 180, 208, 168, 257, -3, -76, 92, 67, 155, 208, -306, -32, -79, -109, 61, 223, 324, 124, -77, 86, -71, -400, -33, 131, 49, 148, -68, -372, -169, -86, 185, 194, -251, -578, -383, -85, 349, 257, 135, -82, -339, -340, -135, 33, -23, 4, -160, -134, -102, 82, 63, -54, 303, 242, 270, -246, -71, -457, -24, 431, 477, -23, -547, -348, -104, 589, 331, -64]
1725f4m06j30J75M95N74j28l89o22J63K04K02L17k77m95R4K66J14N7R6j25J00
1746B21l9l35l49l4O16J25K36k02n93j26q5Q25N05m56n46o54qQ64Q12r6m40o08
1768c67l48L16N96K45j54k77l64Q3J67M04j76Q5k48mk20Q6m0K12M8M24n6n95j54
1791c37k26L62O19J41m83n51k95L80N01O46K0p29p00P1M51K76L21j59n73k32L29
1812a68K08O47l42l26m06J71j18J83J70J55L40m06J59l78j09k4M42Q6j3l72l37
1833d38l6K57N99K32j91o32m42J06P13L86M5p48k73p0J82O89L19k55q07j68M8
1854d84L12L97j4n8l00kK8J50l0j16K8M06k84j54r4j80K62N08K70k83n80l89K77
1877c30O26K24lo91m83J41M13P96j03p10j98m15L97O47j67m6k25j5j16L13m6l20
$$ y = [-64, -470, -600, -425, 70, 644, 516, 127, -495, -332, -128, 74, 391, 114, -381, -287, -21, 93, 150, 246, 121, 221, 182, -153, -502, -536, 80, 205, 441, 239, -354, -480, -565, 260, 765, 309, -237, -891, -899, -35, 777, 681, 241, -367, -715, -399, 197, 442, 288, 11, -353, -270, -103, 301, 125, 210, -38, -42, -262, -176, -216, -4, 44, 468, 412, -183, -337, -563, -201, 418, 559, 76, -475, -770, -390, 111, 757, 777, 48, -652, -581, -130, 146, 467, 308, -265, -497, -168, 40, 687, 345, 19, -387, -216, -334, -151, 19, 174, 514, 108, 267, -111, -220, -244, 198, 284, 271, -101, -438, -474, -217, 382, 614, 423, -209, -651, -545, 168, 554, 599, -149, -422, -492, -310, 379, 698, 443, -364, -532, -484, -172, 225, 211, 153, -147, -149, -121, 29, -1, -117, -89, 317, 33, -121, -215, -395, -133, 375, 645, 362, -218, -607, -330, 296, 520, 517, -174, -657, -516, -103, 693, 590, -120, -318, -733, -336, 311, 144, 98, -127, -142, -258, 55, 9, -311]
1899c11L26M6o5nJ34j46k7J39L49m39j04k92J5M53L33l7l54j84rJ26K02L29n71
1922i2l11k2L32L5M20k15j30r4Q1j32K4J57J9l2k37J61k39K17L28J28m93nJ2j91
1946b79J99L34j04k15j36k7K49K7Q5k19m9J51P4p4k74L15J07K2pj98k66L04J61
1969A80J67k35oo07J62N78M63j34o01o08J48K98M32L07o67j79j3L36J55M52m86
1990A42k97j94J18J46L49p9l13N2J28K5N6j65j24J52q3M31m99l1j08L24K79J91
2012E00l39m27k37M65N84N3k71n60m36N04M22L79k79j78m63k97L89L52K07j97
2032A71k93j2L5n5K59k44K73O6j71k08K9K38o4K08J67k43l40j93m7K97L74K3j03
2055A67m70k35L46K66M84R1n21o28j11L17N64L70m34l13n01oN75L92N7l61o01
$$ y = [-311, 15, 61, -4, -9, 125, -21, -48, 91, 440, 1, -103, -395, -380, 73, 406, 369, 15, -169, -178, -52, 150, 479, -92, -403, -425, -93, -58, 362, 147, 17, -77, 4, -128, -104, 53, 72, 40, -197, -36, -275, -58, 270, 398, -95, -100, -88, -279, -80, 254, 150, -65, -201, -228, 21, 48, 133, -86, -135, 16, 90, 16, -258, 57, 164, 186, 179, -19, -285, 19, 180, 347, 112, 106, -501, -339, 239, 702, 568, -33, -641, -493, -195, 237, 544, -123, -302, -315, 21, 176, 628, 142, -155, -349, -231, -85, 264, 185, -128, -76, 52, 77, 133, -32, -156, -4, -87, 344, -155, -186, -294, 30, 309, 500, 161, -266, -503, -38, 546, 599, 328, -232, -668, -164, 258, 637, 358, 180, -283, -580, -191, 161, 368, 171, -122, -134, -99, -154, 105, -139, 134, 200, 29, -179, -150, 88, 24, 232, 399, 156, -184, -377, -424, -127, 247, 270, 167, -303, -538, -192, 74, 558, 649, 128, -500, -611, -294, 270, 640, 206, -107, -608, -614, -39, 353, 410, 49, -552]
2076e52J36M90l6L86k35k60J44q6K2p9j70K40L34n5m5p48j19K88Q89L37l79q20
2098c18o97L99O74P17J08o48j106p2R10M30L96n47o87k29J87P85J59j86l60l55
2118d40L98J31j7l40J58N1J77P9k38n31NP32M10no68o33j28O34Q20K78m08p88
2140c23o27K60J014M22j85o23o68OO59M76J92m42l67j60M64k52J64k13R5J78O3
2161A33p7l23n6K31M12L69n17l88l30R5P22M87k03o13n39L6M68M28M15o65m11
2182c26j94o4P03L67O7m56k81r2J37M5L50Oj97j24k1j70L82J0l0j36J18o7k98
2205b71q4L30L47n8q8k61m32J8M22M38J25k28n12l62J31M85P00j63n68m65j96
2226f92L07R61l2n24l66qJ12M15J24m41Q8j02M54K2m89j00L6L79K59j28l64rl03
$$ y = [-552, -416, 74, 38, 424, 189, -71, 73, -13, 9, -70, -240, 0, 334, 279, 234, -514, -633, -345, 544, 881, 502, -318, -1015, -616, 58, 775, 883, 235, -871, -943, -33, 397, 793, 246, -441, -670, -483, 302, 461, 275, -85, -440, -42, 89, 72, -268, -110, -59, 118, 197, -41, -572, -567, 165, 575, 570, -98, -731, -859, -225, 595, 873, 465, -323, -950, -690, 324, 746, 561, -62, -730, -724, -65, 411, 603, 161, -206, -366, 98, -154, 10, -203, -108, 70, 133, 56, -267, -323, -92, 320, 689, 172, -216, -546, -451, 271, 758, 555, -58, -597, -561, -93, 335, 750, 85, -326, -520, -584, 119, 486, 553, 97, -184, -276, -139, -94, 256, 262, 65, -59, -80, -250, 132, 142, 112, -24, 94, 27, -271, -355, -25, 322, 264, 176, -85, -517, -499, -77, 361, 486, 258, -254, -616, -485, 0, 700, 537, -31, -496, -692, -385, 576, 544, 20, -346, -354, -242, 173, 297, -144, -56, -158, 296, 318, -171, -271, -235, 144, 403, 275, -89, -98, -401]
2249d01M55M74j01k86q96K82M70N64o0j29n98l74L70N54L27l66m83j61J85K83
2269A09J12o0l15j4K31k1j07J24k48J96K77J66n73r6l22N03M46Pk28n54m2L54
2291e5L83L7j43k76l69L09K61K93l01k04j64J85M7K1J79k03n3O8K6j30n5M7J46
2314D9n5J86j11k46m0K45K74j86l25J87j03R5L41q1l9k81N0PJ36j09j09P0j9J89
2338A25j39j26%M2Q1P8J67m09j65M04q8K9J83l52n1J93M9Qk3k20J00Q5J97j16
2362E2j46r1l7L07q8L6j49k23K18K23j36J41p1j78l3L61q0j0l71L78J83l45R4
2385C5j91J29Lk9Jp9j13L5L39L0N6m59K18Q0J3K03k46J85p3j12R7R3j84j3k06
2410a88J95r0p3Q4J0L05K2k11k8k2k61K46L61k49o1k73J46j29L68L3j61k71J41
$$ y = [-401, 54, 528, 427, 141, -755, -473, -3, 561, 501, 372, -226, -600, -230, 324, 651, 285, -198, -359, -174, 109, 221, 161, -154, -168, 63, 42, -65, 59, -189, 7, 284, 450, -123, -219, -541, -38, 408, 415, 187, -367, -409, -55, 328, 365, 222, -54, -423, -114, 147, 440, 139, -65, -229, -44, 3, 24, 203, 0, -53, 15, 41, -89, -144, -97, 49, -6, 180, 69, -177, -217, 28, 302, 116, -209, -22, -125, -30, 311, 230, 191, -90, -40, -33, 103, -6, -115, -45, -64, 125, -14, -140, -140, -98, -17, 61, 228, -181, -346, 58, -30, -1, 182, -170, -221, -28, 21, 29, 6, -214, -114, -29, 168, 52, -94, -185, -222, 85, -3, 33, -116, -339, -121, 102, -34, 107, 36, -142, -175, 186, 106, 96, -275, 103, 286, -59, 35, -156, -27, -24, -53, -52, -131, -244, -209, 130, 160, 216, -243, -25, 55, 68, 271, 25, 210, 137, 25, 122, 215, 31, 18, -188, 7, -83, -156, -72, -62, 243, 265, 54, 26, 4, -257, -11, 350, 101, 40, -233, -87, -216, 152, 185, 24, -247, -106]
2433a06J28M5O3j70q0K7J93j21p8j49J39J61O7q2J4l04pN83J6j01k59j95p3L59
2457G0K97j52k80k77n8M08K85J01l76k17J26QP7p6J9j11J07L16j83l1k20R1J03
2480B7J65p5r1l32P8L98J40m7o05r0P7K50K31J64k62l70K5R4N43r6k07j27M3n9
2504a26K41k63J13j78K43p1J64N0l79J50o2J63o4j21j21J61J57J01Ok78J02q7
2526i9l8K49k7M9k06k3J10j1J57j31J5l59J89k8RN36j90j31k34P3p8J42J38n9
2550E3n0O3j72P9M9L36l32j04r3K94j44l13K89j98L57J85k03k16m4K40N7K03o3
2573B73k71j43m8L30j89N46n12k19OQ3J87K1J18l06j39J67L0K67m33L00j01R3
2595F0m2K41m84Q2L90j31j23j17k14J85P4M01o4k34p1k95K80M66k11k62r1q5K00
$$ y = [-106, 22, 67, 130, -40, -120, -93, 100, -21, -99, -248, -109, 52, 119, 37, 51, -253, -260, 323, 339, 238, -21, -216, -289, 70, 367, 215, -65, -342, -400, 8, 293, 394, 18, -199, -73, -65, 12, -64, -45, -156, -49, 267, 84, 53, -167, -76, 27, 192, 117, 26, -306, -228, 170, 310, 263, -342, -432, -355, -105, 126, 290, 28, -342, -317, -223, 320, 224, 17, -110, -67, -126, 115, -148, -35, -213, 30, -41, 123, 173, -206, -56, -118, 45, -19, -140, -261, -100, 57, 158, 164, -114, -12, -99, -137, 112, 85, 134, -72, -95, 15, 4, 161, 30, 45, -314, -125, -153, -144, 392, 202, 71, -163, -90, -168, -26, 112, 53, 3, 66, -106, -27, 22, 358, 26, -78, -171, 123, -21, -334, -45, -243, 114, 299, 96, -120, -164, 76, 133, 336, 273, 2, -141, -189, 141, -48, 498, -14, -233, -227, -144, 43, 64, 182, -124, -263, -96, -66, 201, -232, 68, -33, 60, 18, 259, -225, -143, 247, 116, -7, -124, -338, -153, -79, 322, 258, 24, -47, -342, -62, 404, 193, -69, -160, -245, -45]
2618d5J21j26K57l30M4M0J76k83K73j21n3J97j62p8MK99l72J3K60k24O2L7oJ91
2642A74k79pJ68j20M8K42k54n6j4J07J2o7J38Rp2j31K61j41QK9J49j04k48J58
2666A0j11J64P5O6l06j61L2J52Q1Mk4o3k22N19k29K81n4k09l6l2J55n3M6m1m1
2691Cn2J3k15K24j49O2P4o2K03j82n6J75J52j8j84l73J89M9J77R4N1l74j68J51
2715b16J72M09j07l17k05J0K33P1K15j09j34j26K83k61o3J67oo0l4k5M4o5J56
2738C2M8K14l06r9Qj10L65J78j34k46k39O5K82K94Nl78J4l61K78K37K15j39k00
2761B3n9k71K77J84n7k25K08k59m2NK88j49N2M3LP1k44N9k20M45J50k20j49R7
2785A0l68M71j3J7O8m13j54M18J50J97k51k05j40Q7J97OJ15j10j97k4j16L08j0
$$ y = [-45, 76, -50, 207, -123, -79, -39, 137, -146, 127, 6, -47, 150, -12, -90, -86, 213, -159, -146, 114, -110, -48, -11, -17, 174, -105, -112, 56, -64, -16, 226, -28, -84, -98, 9, 21, -46, 92, 101, 29, -102, 159, 18, 26, 55, 204, 100, -148, 10, -101, 63, 138, 204, -102, -263, -231, -79, 2, 6, -18, -81, -303, 216, -13, 268, 214, 5, -31, -63, 92, 39, 85, 44, 3, -49, -36, -251, -27, -176, -114, -40, -102, 101, -81, -137, 38, 190, 172, -12, -385, -196, -147, 30, 124, 175, -199, -367, -216, -44, 365, 258, -59, -264, -254, -21, 50, 265, 156, 22, -104, 179, -82, -145, 22, 16, -44, -78, -103, -59, -124, 32, 80, 294, -12, -111, -103, -213, 152, 330, 196, -50, -289, -224, 58, 352, 357, -21, -7, -368, -90, 147, 362, 223, 23, -36, -307, -30, 154, 97, -128, 80, -179, -221, -216, 72, -77, -25, 18, 21, 92, -152, -93, -313, 132, 282, 62, -87, 10, -358, 113, 100, 117, 185, -228, -382, 36, 186, 383, 132, -73, -213, -126, 71, 77, 192, 82, -115, -139, -255, 53, 43]
2808D3r3NJ22j15J15j13j72L35k6K9k17j20j59K2L12L39j79j8m76J27L13K25K9
2831C28j61k35l09L25L05J01j28l05j08NK58K93O3k59l14K57j58J76Rj25j88J50
2853b0K39l06Q1p1M0P0K50r9m52J18n3L10K12o9k83l44J55K75J21K32l74p5j61
2876b04K36M6K73k73k84J05O8J25m4N6q6m8j2Q0%o2p8N9KJ63M1m18O5K05R7L48
2902D60k09l12K1j37L27J29p6j92j52J88J89O4J82m78j52K9k5J42J41r0j32k39
2924c22K31q8K36l7J96j26n1o1j28J31P3j55J95N7j28j82j12K89N5K13l60K25
2946A51n47QO81r7M3l51j98J74r2M09p3j78J35j45p5K68K3k27K03l15K30L7j24
2969f0K15l51J66J47j35q6q2K19K5K45k32j86o5o5M43j76L08k93j49J45pm1P2
$$ y = [43, -50, -45, 77, -38, 77, -36, -208, 127, 101, 130, -87, -207, -366, -344, -32, 307, 128, 110, -366, -239, 74, 299, 328, 167, -68, -377, -52, 253, 354, 226, -79, -187, -182, 76, 369, 432, 173, -141, 116, -42, 134, 143, 18, -170, -20, 219, -87, -6, -77, -37, 33, 283, 184, -268, -150, -203, 107, 319, 250, -33, -377, -222, 53, 174, 406, 32, -43, -204, 32, 78, 351, 78, -206, -101, -33, 92, 48, 104, 18, -30, -42, 38, 38, -24, -102, -43, -41, 122, 163, -255, -190, 15, 112, 460, 251, -61, -40, -177, 150, 279, 203, 11, -141, 47, 236, 300, 482, 4, -148, -119, -144, -2, 139, 49, -83, -322, -91, -179, 57, 20, 216, 90, 39, -22, -150, -19, 54, -101, 94, 151, 23, -159, -271, 18, 73, 286, -74, 151, -396, -388, 293, 196, 239, -112, -310, -136, -228, 181, 108, -70, 65, -80, -155, 113, 136, -91, 112, -203, 27, 64, -60, 155, -196, -30, 117, -18, -104, -186, 33, 58, 303, 71, -115, -180, -245, 198, 22, 330, 37, -112, 33, 26, -15, 57]
2992E7J10k77k1%K12k53L41p5j96J60j48J55j36K73m02J21QJ87j24J08j51J33
3014H2j52J47l5J5Oj5pJ07j74j31n0K93j54R2L32l38Mj83K07l8K22k06l8k28J79
3039f3J59L5m8j28M7J5J5K27j74J4K3o3k34R9J5K2qK11l3j52l5Q4p3k9L1q6K29
3066A00k02J91L9k3O6k40J93j66j00K12j16jJ42r8j0J04k42K63q9j71j01K19M3
3089A3k22K03k00M24k24K09k90J58M5p6j57q0J04o5L17k11N3k22J60j17K14J00
3111A36J3j33q6k0J37J47j82k07K60m9r1N9L4P2J71k14nn2J28j63O1j63J23R7
3135G3P9j51K3J4O5j13r6J90m9J39j82j9k24J74J14m5J33q6L2O1j41o8L6K3n0
3160f8O3Q4j42N5L6p2J40r0k2L5JR2J34k41p4K21k62lJ23j04J34J60j37Rj64J00
$$ y = [57, 167, -110, -131, -131, 81, -172, 169, 94, -102, 58, -90, 65, -71, 202, -200, -79, -71, 116, -8, 100, -51, 82, -70, 77, 42, 57, 63, 48, 41, 148, -26, -157, -207, 86, -68, 24, 356, 18, 22, -161, 46, 8, 230, 24, -14, -242, -63, 96, 131, 83, -45, 2, 17, 32, 259, 85, 99, 122, 59, -175, -76, -61, -39, -47, 164, 131, -21, -56, 28, -45, -74, -43, -129, 100, -102, 89, 128, 105, 171, -69, 124, -42, -142, 70, -46, -47, 95, -3, -13, 91, -151, 112, 23, -148, -249, -30, 13, -209, -6, -206, 218, -6, 203, -87, 71, 116, 40, -117, -197, -93, -158, 159, -52, 1, -221, -61, -178, 36, 136, 149, 16, -70, -90, 47, 194, 12, -195, 65, 16, -75, -16, 18, 90, 261, 47, 42, -10, 118, -45, 16, -147, -24, 73, 152, 1, 24, 38, 103, -10, -106, 84, 35, 174, -8, -27, -251, -77, 37, -8, 125, 39, 71, 132, -9, -77, -41, -18, -68, -5, 79, -63, -8, 28, -44, 96, 6, -16, 19, 20, 112, 246, 5, -69, 152, -110, -113, 10, -94, 40, 200, 63, 72, -92, 8]
3186HK02j1j09k79J15Q4P6j93J77pq7L7j82J39P1j25N7K23j46k00K06J04k39J18
3210C9r8NJ34L7O3k15k5j80J32J05N0Jj02J73k49J55k17J87J08l3j55J58j86R3
3234b0o3K14k49j38M33l25K7N9P6o1k7J13r3N9M6J74k00l2m3k6PK28j91o4J7O6
3260a3O6j40R7J32q4kqk03J90n7Ok13L12K8l4m4J13k90J95N9jj70J83k11p7J05
3286f1R9J62k77J95j78N5j7K03q1k0j20l4J0J32m4j03J2N2L5l2L4j35K68j62J73
3311A66j77J57k24K83j49j29J25j19lM4%J12j93N9O9q2LL7j6l3J58j53J44k6l1
3336B2J34pr1l1o9j05J89j51N2J71J9k26J36J53k78r2J1J95l8K67l38J51q5l7
3360d8J29O6j99O4j45J22Q3p5j4K5P9j4L3J67j2l27J59j39p4M06k14j47J46j09
$$ y = [8, 210, 199, 90, -189, -74, 10, 86, -107, 70, 63, -24, 13, -169, -30, 41, -84, -27, 196, 50, -150, 56, 160, -79, 39, -59, -54, 80, 117, 180, -35, -60, -240, -108, -3, 47, 48, -54, 119, -130, 25, -192, -5, 103, 70, -85, 73, -113, -20, -83, 131, -118, -256, 177, -148, -121, -62, 14, -47, -74, 39, -54, 5, 51, 225, 25, -7, -50, -76, -69, 159, -32, -96, -79, -13, 53, -87, 10, 142, 58, 56, 48, -155, 35, -22, -16, -229, 83, 111, 77, 33, 146, -144, 51, 110, 109, -61, 122, -89, -166, -61, 38, 200, -77, 118, -60, -5, -22, 181, 100, 80, -40, -74, -64, 68, 24, -79, -67, -15, 20, -12, 22, -113, 155, -7, 166, -11, 146, -78, 205, 56, -73, 52, -67, -70, -26, -26, 86, -107, -48, 21, -61, -58, -21, -37, -70, 88, -65, 79, 53, 22, 156, 149, 58, 27, -42, -147, 42, -109, -57, 114, 133, -93, 43, 196, -82, -174, -163, 32, -6, 261, -77, 74, -11, -48, 81, 147, -52, 12, -133, -11, 72, -3, -17, 8, 87, 73, 106, 273, 261, -66, 93, -46, -120, 286, 72, -75, 71, -38]
3384c8m9j46K62P8l23J59J00m8N4o8j28J43N9j10p8K81k95J54K54k53L4j89L7
3407a10o9K51J80j28k16l7J05K47p7j34j02J4j67K41J2N1r6p1J66m1j4lj09R8
3431i%lK5n3q8J45j8Q2J17j92r0m2L13jm8o9j00j53K40J93p3l47l1p6K68J6K24
3458B30j53N5k78K39p6R3k4Rk43N6l2o8J61J8Q1R6j12j58Q1q1J11O2k43K22k15
3483a69O1j75K17J30j7j26k8l3J7O2K16K49m22k77L56J48l5k51J45j28n1L1oK74
3507A88j79l7m4K08P7l34L0J81j25L16k45k1j29Q9M47l16j5M9l78Q9R7K14k07
3530d5Q6j16K2L8L4N3l8Kk65L24j70K95j89o5k9J38q8k5K1N0M5K5p0r5k15M8M6
3557a83J81R9m4L4l65J18K58K97j19l04p5J88O6p4K64k33k82K1P8J88K06j76j16
$$ y = [-38, -87, -233, 29, 107, -216, -57, 43, -5, 49, -19, -147, -4, 55, -55, -133, 148, -147, 7, 261, 8, 42, -147, -110, -179, 72, 252, 124, -92, -129, -24, 223, 146, 12, -90, -76, -243, -2, 10, 61, -35, -106, 60, 19, 5, 2, -107, -9, -9, -12, 13, -40, -128, 17, -1, 81, 198, 6, -84, -126, 187, 186, 138, 69, -31, -184, 56, 249, 176, -171, -202, -278, -10, 6, 230, 77, 132, -146, 93, 17, 110, 86, 95, -148, -92, -124, -192, -31, -13, 68, 164, 52, -106, -25, -106, 5, 67, -176, 46, -169, -108, -283, -66, 64, 47, -79, -107, -140, -123, -61, 155, 404, -18, -295, 61, 209, 174, -77, 68, -60, -111, -80, -86, 188, 9, -28, -72, 136, 213, -121, -91, 90, -35, 281, 36, 15, -114, -25, 422, 106, 91, 140, -238, -149, -52, 162, -45, 41, -75, -53, -15, 19, 72, 34, 36, -229, 95, -75, 220, 31, -34, -63, 75, -13, -38, -17, 33, 78, 103, 33, -62, -277, -229, -183, -2, 97, 53, 87, -278, -160, 98, 395, 276, -28, -103, 85, 151, 77, 341, 108, -174, -153, -75, 113, 319, 143, 27]
3580B7nj89J71n9m7P4r8J16p8P9o4J2M7J54m6j95L1R9N2j6Q0O4l19J47Jk68M62
3607B32m0j0k27j17K54J04k3j70l0J78pL6k50K2N6p0Q4L3j64K46M8l35M47l22
3631b5K6J24p2k4J04m5j12MJ21j18l7j6Q5J7j5K9o4M0K28l92j27K75j65K32R4
3656A67%k57J4j39L08j57O6M8p3K60j43k10JP7o5j5K42k54K29r4k35K60R0j03
3680A7o8j0k4J36j54j6J2j7J95n1p0J54j07M7j8k44R9J57j25J54n7Q8r7k20J87
3705c2J72Q4k54O5K9p3O5J26j69n5J33q9J8j12J97k15R8J77o7j50K2J61Rj3ok22
3731a01J44j36K14p5J1N6k50J08J08J11l22J35m6J07q0o6N4P6o9K25j77J46k21
3754d8J26J84k97J37Ll00Q8M7K59k33r1K54J14k96p4K00j64j28L46k52J47o9L
$$ y = [27, 22, -167, 4, -55, -102, -28, -126, -10, -88, -9, -73, -61, -14, 140, 94, -101, -70, 29, 81, 65, 145, 209, -110, 37, 38, -230, 232, 192, 182, -45, -162, 92, 196, 173, 3, -27, 151, 144, 180, -70, -48, 8, -62, 22, 55, -109, 137, 185, -150, 297, -25, 1, 125, 53, 29, 133, 88, -24, -20, 101, -17, -54, -70, 15, 32, 17, 46, -18, 22, 250, -142, -269, 6, -159, 73, 167, 167, -90, -76, -215, 93, -64, 2, 50, -23, 237, 94, -116, -115, -38, -103, -118, 124, -130, 99, 5, -230, 30, 120, 17, -51, -61, -85, 51, -103, -119, -107, -124, 71, 20, -50, 104, -3, 44, 26, -218, -119, 38, -87, 67, 10, 98, 1, -219, -32, 140, 224, -30, 35, 64, -9, 56, 182, 13, -42, 91, 2, 20, -92, 105, -110, -12, 165, 98, -52, -30, 131, 140, 127, 121, -101, 43, -93, 121, 46, 57, 113, -137, -29, 79, 190, -132, 3, -43, 64, -16, -82, -28, 48, -21, 204, 27, 173, -48, 78, 262, -35, 102, 105, -195, -107, -60, 199, -34, -125, 129, 243, -53, -127, 73, -91, -219, 127, -125, 22, -47, -44]
3777d4J19j4l0o9J73j10J20k06J48n4n2o9n5J3J79j62K79k52P7N8L5k02oL6O7
3802b1K34j07j08p4l3K07m3J03Qj80J9J58j80j2J32j05n9J04M7k0on2J14K5r8
3827E3j56R6oO4j55j65K69J25l17L86k13l4J10j87K54m8k6Q4j87K18k54j2J52
3850E1O0r6N6j07j1q5n6J04K58k09JN5l11J63J51Q5q5j03J4m8J77M4j46q3J7R4
3876a0K3j44K51l47M04l42J94j00J53J54k06J33j76J0p6J53j63m6P1J6J47p1j33
3899a05J75j05P2j63L17l15K58n7r6J5m5k45K58J34j54K06p7k25K82k13K19N3
3921A89j89j38J63q6q9K25p4J64k00N4j05j66Q0L16p5L1j89L2j35J43J03O8r2
3944C0J00l6j88j13J25p1n3K00o8k7J23M0j00J15p6N6r2J31j32K48j90J1j17J69
$$ y = [-44, 75, 61, 31, -38, 135, 25, 145, -61, 87, 33, -19, -88, -143, -130, 49, -113, 166, -86, -9, 49, 84, -118, -124, -88, -21, 213, 106, -2, -76, -109, 98, 55, 158, 166, -14, 5, 163, -17, -29, 103, -2, -61, 43, 90, 70, 64, 12, 126, 151, 53, -103, -7, -13, 51, -104, -269, 0, 125, -192, 194, -19, -53, 57, -130, 124, 76, 50, 134, -53, 165, -89, -101, 51, 111, 15, 71, -36, -47, -132, -188, -84, 174, -35, -34, 21, -290, -127, 24, 109, 24, -79, -65, -113, 64, 108, -38, -121, -104, -10, 13, -131, 120, -227, 177, -165, 29, -71, 82, 236, 30, 163, -13, -3, -79, 74, -89, -135, -64, -48, 99, 28, -105, 70, -35, 37, -126, 191, -124, 134, 77, -19, -4, -49, -294, -36, 98, -56, 150, 73, -152, 130, -83, 136, 189, 0, -138, 25, -61, -150, 75, 1, 165, -35, 19, -86, -252, -172, 144, 69, 100, -89, -57, -192, -49, 54, 122, 30, 130, 94, -94, -207, -82, -153, -206, -6, -74, -101, 22, 62, -38, 77, 1, 57, -35, 96, -36, 212, 22, 33, -84, 85]
3968H5n6J44r6J40j42k04R3O2J3o2n1K91j73n0J31o0j64J21J9K5l7n2L3K10k60
3993d0J48J6j18j18L00k54J04J78k62J52j95K52P8k95J30j12J92m06K94j17kO5
4015a0%j6N7j95J74MN3J7k1j22J70l0j28J04P6p0j53MJ88m2J70j99j9j6j9K9j14
4042a08J63K7q5p2K04n0l9k65L00p5j86K84Mj11RM8R0j80m6J00j3J98j87k6K26
4067B10j97O7j20p0j09L82j94J20p9n4L5J12p4J39k42J03J14p1j51l1J70P9m6
4090I3qn1J51k95J47P2l34K62o9PJ23L3j23j27J18m9o0N5K42j85p9J2J92j49l8
4115f0j22K56j71M7N0M9k17J65l3J06k07o3K33oj03j22L19j84k8Q2j0J84j55Q9
4139I9o3Q0j91O0P6m2RP8K1k38J17L52l24k72R2K38k17Q8j61O6K70Jj29j15K17
$$ y = [85, 29, 173, 77, 217, 75, -129, -36, 26, 39, -23, -74, 217, 44, -6, 125, 65, -99, 22, 41, 66, 29, -23, 10, 220, -40, 108, 124, 6, -112, 188, -66, 38, 216, -46, 106, -89, 163, 241, -54, 76, -36, 156, -250, 44, -73, -75, -10, -10, -26, 31, -164, 10, 14, 67, 84, 63, -59, 111, 81, -47, 57, 133, 63, -90, -86, 102, 60, 230, 31, 12, -4, -23, 6, -108, 55, 82, -3, -75, 129, 79, 40, -225, 75, 0, -186, 98, 102, -9, 0, 48, 138, -42, -88, 12, -1, 197, 10, -16, 210, 13, 80, -40, -110, -219, 163, -31, 89, 10, -44, -9, 103, 29, 168, -74, 29, 143, 72, -79, -110, 60, 139, 93, 85, 34, 185, -110, 37, 109, -225, 37, -32, -25, 98, 131, 8, -119, -1, -50, -110, -55, 187, 2, -77, -65, 127, -22, -60, -182, 74, -97, -50, 0, 49, -168, -3, -36, 70, -137, -200, 33, 27, -76, -198, 121, -63, -91, -9, -19, 165, 10, 99, 36, 116, -75, -15, 61, 19, 28, 106, 127, -111, 6, 358, 34, -238, -146, 92, -125, -37, -198, -132, 138, 139, 10, -105, 112]
4164A12j95N9J98l5j37O9L5k69K96k13M6L5q6J47L1j78J83j03j21K44r8p3J02
4187D9q5M7K34k50J20j6O9o1R6j03j56N8l2o2P4O5j7k58R6n2P6J12q7j8N7J45
4213A01k1q7N7J16r5P1J8k09qM1Q3N0R8k94j57L40j94R6O1j31J43k47J91n5J5
4238a7J62j07k27J03J9P5L1q7O0q3kK50j36j9p4O8J66p0k7Kk1p5l9J57m2n5M0
4265E2Lk27J56J03l75K68J44k59J52N4j51j21k9J97O9l9r3pN2J12r1J32j51J70
4289A21k43QJ64Km9k02L03r0R8k31J18OR9k4k6n7n0K85k97J86j20L2k1p4N0J65
4315A53j70N8Q3k89J40OP7j55m1m7PK24J18k06N0k3K56m59L32j26k5R1j00K29
4339A83p7o5R9J68j86r6PO4k02J21Nj62L79m06K03J14l40K59J64k79n4K34j09
$$ y = [112, -83, -24, 174, 139, 2, 71, 106, -163, 133, -80, -34, 1, -85, 62, 93, -85, 98, -5, -126, 118, 20, -53, 49, -36, 11, 245, -5, 115, 99, 168, 107, 203, 100, -56, 2, -30, -92, -18, 47, 30, -228, -132, -184, -108, 4, -83, -101, -44, 101, 80, -7, 50, 166, 71, 142, 160, -49, -57, -16, 67, 117, 215, -79, -236, 104, -90, 6, 67, -64, 79, -168, 23, -32, -17, 145, 38, -189, -86, -67, 8, 39, -48, 12, -71, -73, 177, 41, 22, -52, 16, 182, 112, 85, 87, 66, -9, -48, 109, 67, 12, 52, 55, -172, -16, 87, -288, -20, 124, -135, 17, 71, -80, -201, -230, -33, 36, -3, -96, -103, -51, 61, -30, 102, -49, 121, -122, -114, 50, 52, 3, -199, 104, 14, 112, -119, -1, 5, 104, 80, 54, -3, -53, 232, -65, 121, 1, 33, 12, -62, -12, 153, -17, 41, 124, -165, -25, -19, 58, -97, -138, -185, -178, 46, 164, -42, 8, -15, 241, -218, 114, -12, -37, 54, -46, 183, 106, 41, 140, 308, 122, 26, 33, 97, -105, 16, 21, -141, 238, -168, 35, 149, -191, 68, 232, -47, -101, 133, 24]
4362B4j45J36J37j46K14j63k38R8O2N0N3N9j10l04L96k32Q8K48l29K22j27JL9
4385C3J64j49P1m3n0m2L6oN6o4j8o2L8o8J25j6j00K11k41J05J03J46l32R1o4N5
4411b1p5J1l2K41p3r6OJ00j28k51M65M4j36j1%r1mK30m0j48J35k59J72q1j26K52
4437H4j77R0J4j48K5J24p9M6l5q9M4J7J0J43J82j92L5j20j36N13l06P7j16j13
4461a07o8N14m60J58j63P5j19N7J81qj05J51m1K7lj98p4K15N0n6K05l69R7M9j18
4486a10m3K42mr0N0J24l3k61J23o0l7n6L1K77j65P0m9j3j86J41O1r7L2n1L36k24
4512HM5m1j9J2N6n0K3j5nMR6l0j50mQ0P9p0p0j31NK68j76J84J07k55J87j39k46
4540b47K44j56r9L39j7k1j16J67j66L1p0K75j05j09L2Q8j0n5K3k18J45j4J18Q
$$ y = [24, -121, 15, 152, 6, 220, 57, -181, -83, -21, 29, 82, 141, 31, -273, 123, -109, -21, 227, -102, 120, -7, -6, 33, 197, 48, 119, 76, 26, -16, 20, 14, 70, 6, -12, -74, -36, -104, 21, 5, -95, 116, -125, -20, 83, 229, -103, -12, -76, -21, -96, -85, -117, 124, 51, -45, -39, 61, -67, -318, 147, 191, 55, 44, 44, -47, -51, 179, 139, -9, 126, -133, 39, -42, -168, 84, -93, -3, 11, -137, -112, 12, -67, -21, -56, -145, -101, -84, -74, 69, 251, 59, 94, -26, -162, 351, 45, 122, 6, -107, -175, 339, -121, 37, -126, -51, -170, -113, 68, 60, -45, 106, 65, 92, 89, -109, -183, 32, 82, 26, 231, -138, -41, 8, -110, -153, 89, 85, -5, 45, 169, 136, -125, -2, -62, -99, -155, -124, 153, -12, 58, 9, -4, -190, -49, 12, -85, -53, -104, 232, 8, 53, 12, -7, 5, 61, 11, 34, 19, 14, 18, 114, 84, -66, -70, 10, 89, 19, -51, -182, -177, 91, -85, 99, 206, -49, 138, -1, -247, -3, -159, -258, 81, 64, 43, -73, 94, -72, -41, -111, 164, 59, -50, -18, 70, 60, 5, 28, -190, -45, -59, 59, 67]
4564F7M7o4j39J08j63M2Q7k5K28j80J2j8Q6j24m8NJ12n9J31K1l9p3L9n0p0k9O4
4591c2r1R3l4Q8K6pp0q0J47O0K1L9J7q6m6j7L5L1n9l3j04J80J39k09l1J05j68
4618h6J78J6j06N6l32K92J22j23J14j71K0q2J4K9j76L61o2p1J39j13N7j33J21
4641F4k36L55m9o2r5J03j13O5lJ13p4j80j5J66j29K50j4k03k7r6K93j31K8j44
4665a34Q8n0J35j34K06j00j9o0q0J31M1L6j67R7Lp8j21K37k13L02k01J11QO2j29
4690b9K14k00r8J07n2K12K1kL0j68p1L28l09j3L2j9j77J71J09r2J38j51J26Qj50
4715c5K23j84r0J54oN8q6j36Rj01M65j13l59J93p4Q8k3R1M1l2j03j2o2K58q5l
4741G6Jk3N8k02J43l5R1K6n1m8mr8p7J27QN7J12l7j10j38K6NK11j96N3J05o1L6
$$ y = [67, 114, 50, -89, 19, -144, -102, -15, -40, 188, 8, 20, 2, 88, -36, -84, -79, 33, -26, 105, 126, 87, 14, 53, 3, -67, -96, -32, -123, -30, -64, 24, 50, 43, -27, -107, 40, 100, 121, 160, 177, 91, 45, 28, 63, 94, 35, 2, -102, 78, 217, 8, -23, 82, -86, 92, 108, 2, 58, -274, 18, 140, 17, 131, -40, -20, -102, -88, -59, -235, 126, 64, -7, 132, 19, 76, -57, 64, -172, 183, 134, 72, -23, 80, -33, 32, 29, 142, 68, -112, -127, 39, -90, 160, 146, -57, -84, -180, 113, -18, 10, -134, -46, -96, 39, -95, 111, 11, -8, -68, -148, -17, 24, 60, -107, -10, -7, -85, -206, 31, -182, 120, -81, 30, 38, 100, -29, 185, -15, -113, -6, -58, 154, 175, 173, 203, 35, -36, 292, -17, -30, 2, -17, -194, -23, 86, -6, 132, -19, 107, 115, -35, 188, 4, -86, 68, 62, 120, 34, -102, -93, -194, 271, 158, -201, -8, -82, 6, -17, 74, 115, 83, -20, -32, -94, 164, 79, 76, 77, 54, 112, -90, 53, 18, 109, 135, 84, 36, 32, -66, -143, -16, -8, 49, 161, 124, 14, -124, -98, -93, 118, -78, -25, 80, 19, 55]
4769E5o7J6j52P4L4J88J1J9j59p0K55k91L79l97L19k63k47L13j9M4n1k43J47J03
4793bQ2o9q5J07k47K48j08K9O6p7k0n6L11j96jj34K77j82J84P9m1k29J03J7k04
4818a48K27j90Q5j90K50O8N6j49LJK9j23L5m4J5J39j16J31j44oJ21Nm6j2R9j39
4844d3K48k04o0P5J31p6n5k35K15j49L4J24K5J03j41O7R9J3j79Ro7k3nQ6N1q0
4870c7M2K00j72l9J28J6j06k7l12L31J2n9P7J56l14K2R3J10j30N2j25j60L69N2
4894A79j75J21j69j28O5L26m20J88J97k73n7J12K59j83Q6k59L02k98j56J60q3
4915b06K93j55J96n7n6l0Qj6K4M6j04o4N8K86k55J48J61k65j51J62J33k40J06
4938B2M1o1j06J55k2q7J59J2J02k22k5o6K78j28L3j63J49k46K13p8j61J40O6j
$$ y = [55, -12, 4, -148, -74, -40, 148, 159, 178, 19, -51, 204, -87, 292, -105, 214, -49, -296, 17, -2, 42, -9, -252, -105, -2, 80, 11, -74, 33, -214, 34, -74, -45, 21, -56, -76, -132, 179, -17, -18, -152, 125, -57, 127, 206, 165, -64, 39, 56, -148, 79, -111, -26, -216, 34, 102, 158, 9, 12, 13, 42, -81, -46, -90, -75, 64, -52, 79, -65, -71, 50, 55, 9, -3, 96, -43, 205, 1, -59, 16, 147, 71, 16, -219, -4, -153, -119, 5, 30, 133, -8, 59, 158, 171, -8, 1, -66, -89, -94, -8, 43, -37, 5, 205, 33, -6, 122, 138, 32, 5, -307, 24, 36, -23, 54, 210, -104, -82, 11, 121, -9, 43, -82, -242, 127, 179, 4, 125, -44, -172, -107, 219, -201, -13, 184, -89, -146, -34, 225, 42, 128, -131, 171, -127, -283, -123, -206, 87, -68, 128, 71, 15, -15, -7, -23, 1, 47, -57, -121, -63, 223, -32, 116, 277, 12, -139, 23, 156, -84, 22, 63, 2, -104, 51, 29, -58, 101, 113, 215, -7, -32, -98, 180, 52, 85, -78, 71, -175, 38, -40, -201, -61, 5, 4]
4962Dr4n5J41K91j91r0Op2j07J42Q2j62m5L02j64o6rp9K05J74k71J45L1Q4j89
4987A3k4j8l5Mk25L58k3l0q9L8L17k87Q9q5p1L1L8j13J02nl2N5l7j01R3j28J65
5014@k40J68K18o8k62J0K94k23MJ60j42o5J16n9k2J41J34k64L35k34p9J15o6J37
5038A08k78J87N0L8k24r3K56R0k35J52j45J40L0n1K92l38Q5j09oN9l7J39l47K46
5062Iq8J11Q3j22J6R0k33J07P8lJ42k00R5j30k8o2K41l1j7K7r3j28L25m4r0k9
5088B6q1m4K69k85K50j01j65J83r5l9J49j19J4J50k00L40k92o0K06j12j37J27
5110a6o5J1J70j64n7O4j74P1K18M3k25j66K13m1R1K8J01p1j27K2J16J4j53J22
5134B5m9J98l05K73m9RqK6j42l2lK05k42Q0J23j63K28k85Q9J54P2r8n9L2l8l6
$$ y = [4, -90, -145, -4, 287, 96, 6, 12, -60, -167, -25, 57, -105, -150, 152, -12, -78, -87, -166, 39, 213, -58, 87, 118, 202, 13, -11, -29, -64, -60, -285, 73, 50, 20, -69, -31, 286, -1, 88, 3, -68, -37, 1, -112, -10, -15, -47, 8, -29, -130, -37, -165, 0, -240, -72, 146, 78, -184, -174, 120, -103, -99, 61, -81, -146, -30, -89, -111, 30, 164, -100, 235, 1, -78, 37, -29, 108, -170, 17, 67, 105, -119, -212, 44, 134, -101, 51, -94, 46, 76, 25, 317, -21, 64, -45, -51, 8, -29, 110, -237, 9, -79, 32, 115, -7, 9, 99, -134, -27, 51, 48, 190, -10, 85, -45, -73, -135, 106, 75, 58, 85, -8, -136, 189, 145, 55, 26, -55, -99, 170, -115, 135, 34, -131, 52, -43, -82, 67, -52, -38, 112, -88, 252, -40, -100, 106, -6, -143, -16, -81, -70, 100, -64, -121, -57, -231, -160, 58, 101, -124, -290, -77, -118, -27, 1, 102, 31, -96, -74, 42, 56, -97, 25, -24, 174, -131, 142, 93, 102, 94, 120, -22, -54, -57, 148, -94, -14, 109, -54, 174, -111, -22, 132, 204, 106, 47, 79, 41, 5]
5160Ek5RK59k71L3R9j37r3J91o9j98J99J39l88L95k85J7J08j7J17j48M2pj50L31
5185A56r4R6j26p0N9Qk4j01L5pj47L18k1j30Q2q6m2K56j06j65P7o6J56r7Q0q8
5211d7k01L94j82j00J0Q0K12j19p6p0J66O8K2k50J5m6J43M0M1j97j08J69k1J6
5235d1J83p4l04M6K59O1j23j52j6R5J9K36l35J70Q2k2j42K63l23J31j02J86m9
5258D8J0j10J10k39j2K61K5q1p2o0J42q2M4L0n3K33l11O0J12J78k00J47j48J34
5282A66j72nj18J58k18L18j30o6O5n5j2M14j93j43r4p0M6K86j91K07k38m7n0Q8
5306e4O9P5M2k45K18j08j36J52J0j15K72j87J27k05J13j00L8N4J13j78N8J2N2
5329G7j55M9kJ10K16k79NL0m2M0oKO4j72J82j31r7J28%r0L7o4J91o4N9j60j47
$$ y = [5, -20, -11, 248, -23, 10, 109, -28, -121, 70, 1, -197, 2, 141, -247, 148, -137, -120, -12, -29, 88, -60, -18, -25, -175, 156, 62, 158, 32, -38, 21, 29, 5, -96, -61, -68, -215, 103, 82, -48, 34, -52, -94, 162, 56, -109, -32, -98, 58, -39, 41, -47, -248, 146, -36, -136, -126, -46, 166, 47, -29, -99, 67, 135, 157, -93, -78, -124, 19, 59, 100, -97, -205, -36, -57, -41, 142, 68, -236, -190, 69, 130, 7, -145, -161, -66, -47, 189, -146, 24, 106, 84, -58, 205, -118, 13, -89, 97, 48, 58, -52, 58, -181, -193, 68, 93, 12, -60, -120, 22, -60, -16, 14, -39, 194, -117, -57, 55, 233, 33, 180, 32, 166, -6, -11, -129, 29, -189, 129, -1, -67, -2, -57, -69, 345, 152, 9, -85, -155, -109, 177, -14, 193, -45, -92, -142, -54, 15, 90, 132, -113, 105, -3, -139, 13, 23, -92, 180, -7, 120, -85, 28, -72, -34, 20, 133, -45, 13, 25, 77, -78, -29, -31, 79, 295, 16, 21, 51, 9, 49, 43, 45, 109, -63, 119, -12, -109, 19, 19, -71, -34, -98, 93, 29, 88, -72, -219]
5356b19J30P4N9j35J41k6J46n7o3K7k62K85o0Q5O2j13J1N2j54k4N4P7J17j57N0
5381A00l36M11k11J07L5o3r6J27j4N4j70K9j7J79j54n1K95j66J8j99K08j96J11
5404Ak10J01O9J82j26j80L07Oj16p4J08k29J80q6J24L3l2k16J76q5J14qk4oJ50
5429A59j37r4O7L8nP1N7o1q7ON2j89J0J37j71J03kJ9j28K85j0k57J19P8p3L0j1
5456Fj39J66L7J00j88J10k0j54jR3q6N4n5K5N3k3jl9K4RR2pj36j2j8K6Q8R5k68
5485a69J88j8j0j90K14M3k62N1J50J1j2j42J53j87K17j05N2p5l3K55k54Q3R8N
5509F3J12k45K02k10J2r7n6L08r1r1J5n7J7K18j84J17q4M3j70J14J08k75L03j32
5533f0K51J6k37J60j56J56p6J01k35M7J46l9k16J50j53K18j35J60j92Q3J16J81
$$ y = [-219, -89, -15, 44, -91, 50, 24, 170, 113, 50, 77, -185, 100, 40, 125, 187, 74, 85, 137, -17, -41, 13, 90, 207, 50, 100, -236, 175, -36, 71, 106, 43, -53, 74, 60, 114, -56, -27, -44, 135, -19, -70, 225, 59, 77, -122, 86, -110, 1, -209, -108, -39, 143, 17, -163, 144, 150, 34, -40, 68, -161, 19, -67, 57, 90, 58, -158, 18, -67, 47, 39, 15, 9, 159, 22, -72, -5, 33, 28, 99, 156, 95, 8, 14, 66, -123, -113, 24, -147, -44, -46, -27, -155, 130, 120, -137, -18, 60, -13, 17, 6, -133, 33, 70, 170, -18, 92, 72, -82, -83, 10, -76, -22, -77, -52, 1, -22, -23, -62, -38, -29, 63, 56, -80, -92, -110, -84, 4, 99, -169, 19, 1, -9, -199, 15, 58, -204, -153, -3, 8, -4, -146, 7, -180, 37, -68, -16, -91, -124, 131, -123, -40, 58, 63, 175, -70, 132, -78, -66, -163, -219, 89, -2, -93, -78, -135, -118, 100, -84, 33, -51, -8, -178, -64, 44, -231, 72, -60, 191, 207, -30, 130, -26, 130, 54, 155, -80, -33, 113, 74, -142, 8, -145, 73, -62, 98, -94, -11, 105, 286]
5555B86l05J1n0J94o1k1qP6k69r9L07k07J08L3Q7k88Q9K76q9O9l6Q1k0k13K16
5580A67k67o1K09k0M3mj43P0J33j42P1R7j07J04j60p3J80j95K2J33j09M6j02J43
5604C5m5k7p4L0J68K6k13J40k02J72k4q0L7J67Jj01Q5j63K1M9l1R6r5J27n6j35
5630i2R9R2o2K0k35O9K1p8L92k23K8j03kj0j0K71j13l6No3j7J10l22K45J89l26
5656a51n2L61j11k8j7n4k1J60k36K0R4rM8J08O3n3j56k2k9J12Q0j98J28J17j21
5681C3Q5jj91j42O6L08j85Q8k51Q1J33j50L0J17j58L1M5O0Om0n0J49O9l0j2p8
5707A3N3p9o0L2L9k3j28K41m6K8K9j74l8J61j9J65k40j10K03P3l5j93J93p8k3
5732a6nJ86j21O1p7P8P9j69j78K42r7J53k09O3kP8n1O4j01PQ3k1j35J52o0O1r0
$$ y = [286, -19, -8, -58, 136, 75, 54, 46, 122, -147, -246, 61, -146, -38, -5, 82, -206, -117, 159, 70, 139, 103, 184, 164, -49, 167, -100, -161, 48, 28, 71, 67, -76, -6, 127, -15, 56, 153, 46, 150, -10, -83, 97, -98, -76, 57, -52, -6, -108, 35, -10, -37, -111, -81, 87, 113, -100, 40, -162, 10, -14, -94, -57, 110, 111, 10, 95, -68, -47, 2, -29, 67, -28, 99, 43, -92, 7, 99, 37, 57, -178, -109, -88, -166, 226, 3, 31, -72, -74, -84, -94, 177, 64, 28, 33, -30, -47, 63, -259, -14, 175, -151, -203, 158, 47, 19, 2, -52, -73, 87, -149, -129, -35, -44, 4, 112, 175, 122, -34, -56, -85, 27, 107, -91, 37, 154, 33, 118, 117, -74, -216, -150, 158, -27, 61, -190, -109, 24, -126, -96, 21, -137, -106, -61, -1, 5, -35, -85, 64, 133, 103, 91, 13, 66, -13, -73, -41, -2, -25, -153, 88, 42, 70, 99, -75, -113, 48, 29, 194, -46, -156, 47, 120, 85, -108, 85, 7, -16, -21, 165, 44, 105, 28, 106, 185, 16, -162, 80, -17, 136, -73, -10, -12, 66, 15, 79, -22, -15, 68, 47, -88, 64, 4, 65, -25]
5759b5Klj08K94r1N9J23l09J04k2J91j36p1j08r4J22L6o2K6k4J40M5j76K2K60
5784A95o20J32M47n09L97k16J65j29m8K56r5J69q7J74r9l4j7j33K25J23p6k60
5806d0M9j7j02J29J10k79K91k73j7K09r1P2j29J87l16K82p6k4L3j13J74k66J43
5829f4J9K42j22j18j39J28K3j1R0j17K23j60P6L0M3k78J38n5nl6J67J2j6r6N8
5854C2l3O2Ln3k54K35J80j66Oj62P7LJ72R4j51P5k3Qj85R4k22J36k6K06J4k84
5880a62K44p6j05j3J42j32K54j60J35r9J64j87J40j30rL0M2j33Lq0J5q2L74k25
5904e0o9P6mj37K09J23p7j18r4L02M4k38J30n4n2J77k99L88l21j22L21j27L4N
5928D7J1R6N7j16M1j76P6k20r1O09l32M9J14j90j18K34p1j21K22l8j47J77o6p1
$$ y = [-25, -23, -26, -134, 160, 69, 128, 251, -58, 46, 24, 215, 79, 8, -100, -194, -72, -36, -98, -72, -96, 44, 89, -87, -65, 195, -425, -293, 154, -355, 42, -174, -9, -138, -186, 70, -25, 144, 57, 231, 132, 98, 81, -52, 173, 296, 220, -40, 9, -8, -110, 19, 129, -150, 141, -132, -149, 60, -31, 41, -88, 99, -217, 65, -11, -35, -2, -115, 59, -207, -64, -45, 197, 75, -43, -182, -54, -31, -42, 48, -69, 154, -6, 70, 100, 143, -135, 3, -52, -57, -93, 74, 86, 70, -26, 32, -1, 61, 64, 11, -243, -8, 172, 6, 12, -150, -73, -70, 102, 196, 45, 120, 97, 105, -80, 14, -208, -72, -98, 108, 122, -162, 82, 6, -99, -112, 30, -102, 152, -8, 127, 28, 192, 5, 145, 15, 6, 36, 78, -55, -52, -132, -117, -199, 175, -50, -119, -43, -47, -184, 25, 148, 71, -47, -141, 161, 205, -33, 97, 43, -9, 168, -131, 257, -64, -186, 135, 8, 42, 47, 58, 154, 211, 95, 136, -40, 36, -184, -275, 334, 2, 51, 165, -25, -143, 91, 20, -101, 121, 83, -64, 113, 47, -24]
5952b4O0l5n8k4N1l3q0K06M8k9ol6k73L4J84N7P5j95j6l7K09j87J52K7j24KR3
5979D1M5j18O7KJ63m9q0n0J65k81J7mO9J04j86R8J0k91J13J25R3M3j15N8j46J20
6005A3J0r0o8J40l6o5rJ27J66j84P5k28J56J3J26j15j87J1R8O1O1j72R5nl5J98
6031A56q5m9n0J73k75J30Q8L7J33k75K2j20K0J44o0J15l38J70J33J0k0j2l1M7
6055F3k6j17J03P8p3J10k04K01j51kM5J58j16j78K2J40J24l17K46o2N9j86J53
6078G0k01L16l14J68j21L6q4p9K89j2J95j96m5j95K43k4r4R9j20K5Q7O8j8k34
6102a41K77j60J15k26R5o0J63J27j90J16p3j97R8j30L03o3k03j5j10M33l02K6
$$ y = [-24, 36, 1, -57, -81, -30, -63, -143, 63, 111, 82, 76, 40, -233, -199, -15, 42, 117, -78, -94, -131, 78, -109, 43, 70, -54, -52, 41, 86, -32, 35, 37, 200, 151, 71, 21, 186, -95, -78, -82, -13, 91, -95, 3, 13, -278, -165, -40, 53, 96, -19, 39, -107, 13, 23, -67, -135, 5, -31, -96, -105, 22, 188, 4, 79, -149, 7, 20, 146, 31, -156, -145, -47, 14, 75, -97, -2, -7, -42, 156, 71, 22, -28, 145, -130, 0, 88, 125, 258, -17, 5, -115, -95, 49, -11, 104, -234, -64, 69, 79, 59, 47, 16, 63, 37, -80, 23, 101, 28, 138, -66, 135, -16, -18, 27, 185, 69, -109, -87, 53, 177, -140, 106, 44, 103, -83, 70, -131, 185, -129, 39, -82, -46, -130, -209, 80, 68, 263, 67, 22, -173, 70, 46, -48, 51, -69, -44, 43, 111, 93, -141, 136, -24, 91, -135, -40, -100, 63, 190, 0, 116, 43, -154, -56, -186, 117, 54, -149, -164, -274, 159, -143, -117]
$$ [...]
8191a33
##END NTUPLES=NMR FID
##END=
