##TITLE=1H_Pr 5g-mat
 200.13Hz, CDCl3.
 8 sc
 
19.3.2026
##JCAMPDX= 6.0         $$ Bruker NMR JCAMP-DX V2.0
##DATA TYPE= NMR FID
##DATA CLASS= NTUPLES
##ORIGIN= UXNMR, Bruker Analytische Messtechnik GmbH
##OWNER= pz
$$ XWIN-NMR		Version 3.5
$$ Thu Mar 19 15:28:14 2026 Russian Standard Time (UT+4h)  she@DPX200
##.OBSERVE FREQUENCY= 200.1313
##.OBSERVE NUCLEUS= ^1H
##.DELAY= (6, 6)
##.ACQUISITION MODE= SIMULTANEOUS
##.ACQUISITION SCHEME= undefined
##.AVERAGES= 8
##.DIGITISER RES= 18
##SPECTROMETER/DATA SYSTEM= spect
##.PULSE SEQUENCE= zg30
##.SOLVENT NAME= CDCl3
##.SHIFT REFERENCE= (INTERNAL, CDCl3, 0, 14.3821)
##AUDIT TRAIL= $$ (NUMBER, WHEN, WHO, WHERE, WHAT)
$$ ##TITLE= Audit trail, XWIN-NMR		Version 3.5
$$ ##JCAMPDX= 5.01
$$ ##ORIGIN= Bruker BioSpin GmbH
$$ ##OWNER= she
$$ F:/spectra/data/she/nmr/H-C/1/audita.txt
$$ ##AUDIT TRAIL=  $$ (NUMBER, WHEN, WHO, WHERE, WHAT)
(   1,<2026-03-19 15:25:52.62 +0400>,<she>,<DPX200>,
      <created by zg, POWCHK disabled, PULCHK disabled
       configuration hash MD5:
       00 E9 B6 7A A2 85 ED C7 34 08 36 98 17 FE 4E 26
       data hash MD5: 16K
       E6 27 4B 76 32 D1 AF 40 D5 F6 20 19 7F E2 D5 0F>)
$$ ##END=
$$ 
$$ hash MD5
$$ C1 BE B8 53 C5 EC B0 72 98 7F 72 E1 78 A9 6D B9
##$RELAX= 
##$RELAX= 
##$RELAX= 
##$RELAX= 
##$RELAX= 
##$RELAX= 
$$ Bruker specific parameters
$$ --------------------------
##$DU= <F:/spectra>
##$EXPNO= 1
##$NAME= <H-C>
##$PROCNO= 1
##$TYPE= <nmr>
##$USER= <she>
##$AMP= (0..31)
100 100 100 100 100 100 100 100 100 100 100 100 100 100 100 100 100 100 
100 100 100 100 100 100 100 100 100 100 100 100 100 100 
##$AQSEQ= 0
##$AQ_mod= 1
##$AUNM= <au_zg>
##$AUTOPOS= <>
##$BF1= 200.13
##$BF2= 200.13
##$BF3= 200.13
##$BF4= 200.13
##$BF5= 200.13
##$BF6= 200.13
##$BF7= 200.13
##$BF8= 200.13
##$BYTORDA= 1
##$CFDGTYP= 0
##$CFRGTYP= 5
##$CHEMSTR= <none>
##$CNST= (0..31)
1 1 145 1 1 1 1 1 1 1 1 1 1 1 1 1 1 1 1 1 1 1 1 1 1 1 1 1 1 1 1 1 
##$CPDPRG= <>
##$CPDPRG1= <>
##$CPDPRG2= <>
##$CPDPRG3= <>
##$CPDPRG4= <mlev>
##$CPDPRG5= <mlev>
##$CPDPRG6= <mlev>
##$CPDPRG7= <mlev>
##$CPDPRG8= <mlev>
##$CPDPRGB= <>
##$CPDPRGT= <>
##$D= (0..31)
0 0.7 0 0 0 0 0 0 0 0 0 0.03 0 0 0 0 0 0 0 0 0 0 0 0 0 0 0 0 0 0 0 0 
##$DATE= 1773919551
##$DBL= (0..7)
120 120 120 120 120 120 120 120 
##$DBP= (0..7)
150 150 150 150 150 150 150 150 
##$DBP07= 0
##$DBPNAM0= <>
##$DBPNAM1= <>
##$DBPNAM2= <>
##$DBPNAM3= <>
##$DBPNAM4= <>
##$DBPNAM5= <>
##$DBPNAM6= <>
##$DBPNAM7= <>
##$DBPOAL= (0..7)
0.5 0.5 0.5 0.5 0.5 0.5 0.5 0.5 
##$DBPOFFS= (0..7)
0 0 0 0 0 0 0 0 
##$DE= 6
##$DECBNUC= <off>
##$DECIM= 32
##$DECNUC= <off>
##$DECSTAT= 4
##$DIGMOD= 1
##$DIGTYP= 9
##$DL= (0..7)
0 120 120 120 120 120 120 120 
##$DP= (0..7)
150 150 150 150 150 150 150 150 
##$DP07= 0
##$DPNAME0= <>
##$DPNAME1= <>
##$DPNAME2= <>
##$DPNAME3= <>
##$DPNAME4= <>
##$DPNAME5= <>
##$DPNAME6= <>
##$DPNAME7= <>
##$DPOAL= (0..7)
0.5 0.5 0.5 0.5 0.5 0.5 0.5 0.5 
##$DPOFFS= (0..7)
0 0 0 0 0 0 0 0 
##$DQDMODE= 0
##$DR= 18
##$DS= 0
##$DSLIST= <SSSSSSSSSSSSSSS>
$$ [...]
##$SUBNAM0= <"">
##$SUBNAM1= <"">
##$SUBNAM2= <"">
##$SUBNAM3= <"">
##$SUBNAM4= <"">
##$SUBNAM5= <"">
##$SUBNAM6= <"">
##$SUBNAM7= <"">
##$SUBNAM8= <"">
##$SUBNAM9= <"">
##$SW= 18.0517328524113
##$SWIBOX= (0..15)
0 0 2 0 0 0 0 0 0 0 0 0 0 0 0 0 
##$SW_h= 3612.71676300578
##$TD= 16384
##$TD0= 1
##$TE= 0
##$TE2= 300
##$TE3= 300
##$TEG= 300
##$TL= (0..7)
0 120 120 120 120 120 120 120 
##$TP= (0..7)
150 150 150 150 150 150 150 150 
##$TP07= 0
##$TPNAME0= <>
##$TPNAME1= <>
##$TPNAME2= <>
##$TPNAME3= <>
##$TPNAME4= <>
##$TPNAME5= <>
##$TPNAME6= <>
##$TPNAME7= <>
##$TPOAL= (0..7)
0.5 0.5 0.5 0.5 0.5 0.5 0.5 0.5 
##$TPOFFS= (0..7)
0 0 0 0 0 0 0 0 
##$TUNHIN= 0
##$TUNHOUT= 0
##$TUNXOUT= 0
##$USERA1= <user>
##$USERA2= <user>
##$USERA3= <user>
##$USERA4= <user>
##$USERA5= <user>
##$V9= 5
##$VALIST= <valist>
##$VCLIST= <CCCCCCCCCCCCCCC>
##$VD= 0
##$VDLIST= <DDDDDDDDDDDDDDD>
##$VPLIST= <PPPPPPPPPPPPPPP>
##$VTLIST= <TTTTTTTTTTTTTTT>
##$WBST= 1024
##$WBSW= 4
##$XGAIN= (0..3)
0 0 0 0 
##$XL= 0
##$YL= 0
##$YMAX_a= 752491
##$YMIN_a= -697186
##$ZGOPTNS= <>
##$ZL1= 120
##$ZL2= 120
##$ZL3= 120
##$ZL4= 120
##$ABSF1= 10
##$ABSF2= 0
##$ABSG= 5
##$ABSL= 3
##$ALPHA= 0
##$AQORDER= 0
##$ASSFAC= 0
##$ASSFACI= 0
##$ASSFACX= 0
##$ASSWID= 0
##$AUNMP= <proc_1d>
##$AZFE= 0.1
##$AZFW= 0.1
##$BCFW= 1
##$BC_mod= 2
##$BYTORDP= 1
##$COROFFS= 0
##$CY= -3
##$DATMOD= 1
##$DC= 2
##$DFILT= <>
##$DTYPP= 0
##$F1P= 0
##$F2P= 0
##$FCOR= 0.5
##$FTSIZE= 0
##$FT_mod= 4
##$GAMMA= 1
##$GB= 0.15
##$INTBC= 1
##$INTSCL= 1
##$ISEN= 128
##$LB= 0.25
##$LEV0= 0
##$LPBIN= 0
##$MAXI= 10000
##$MC2= 0
##$MEAN= 0
##$ME_mod= 0
##$MI= 1.114404
##$NCOEF= 0
##$NC_proc= 0
##$NLEV= 6
##$NOISF1= 3.799351
##$NOISF2= 2.8
##$NSP= 1
##$NTH_PI= 0
##$NZP= 0
##$OFFSET= 14.38212
##$PC= 1
##$PHC0= -3864.288
##$PHC1= 9.992302
##$PH_mod= 1
##$PKNL= yes
##$PPARMOD= 0
##$PSCAL= 0
##$PSIGN= 0
##$REVERSE= no
##$SF= 200.129724274929
##$SI= 16384
##$SIGF1= 3
##$SIGF2= 2
##$SINO= 400
##$SIOLD= 16384
##$SREGLST= <1H.CDCl3>
##$SSB= 0
##$STSI= 0
##$STSR= 0
##$SW_p= 3205.1282051282
##$SYMM= 0
##$S_DEV= 0
##$TDeff= 0
##$TDoff= 0
##$TI= <>
##$TILT= no
##$TM1= 0
##$TM2= 0
##$TOPLEV= 0
##$USERP1= <user>
##$USERP2= <user>
##$USERP3= <user>
##$USERP4= <user>
##$USERP5= <user>
##$WDW= 1
##$XDIM= 8192
##$YMAX_p= 0
##$YMIN_p= 0
$$ End of Bruker specific parameters
$$ ---------------------------------
##NTUPLES= NMR FID
##VAR_NAME=  TIME,          FID/REAL,        FID/IMAG
##SYMBOL=    X,             R,               I
##VAR_TYPE=  INDEPENDENT,   DEPENDENT,       DEPENDENT
##VAR_FORM=  AFFN,          ASDF,            ASDF
##VAR_DIM=   8192,          8192,            8192
##UNITS=     SECONDS,       ARBITRARY UNITS, ARBITRARY UNITS
##FACTOR=    0.0002768,     1,               1
##FIRST=     0,             0,               0
##LAST=      2.2672688,     0,               0
##MIN=       0,             -697186,         0
##MAX=       2.2672688,     752491,          0
$$ Real data points
##PAGE= N=1
##DATA TABLE= (X++(R..R)), XYDATA
$$ [...]
2321F325p146m146R780k889q642Q503L338j0074L831P368r399j835J0619m559
2335A074p033R651L84j0865O111P061j0153M98J0337p688o193J1223q40r901Q096
2350A762M897j2226J927J0418q650l833J1907l767j0315R608L756j1550M820R459
2364H213j0904l336J2153n054q324J1401J755j2946N626Q070j1313J51J2415p291
2378F16q025J1343k42j1220Q458P014j2504M56J0827q499n117J2949j949j1091
2392f984Q274M451j2127L645J0895r369m603J1383m365r177J0584L624j1772M175
2406a366P909j0406j679J2131m851p734R943J7j1296O717P417j0203K45R546p741
2421a351n750J1173p50r185P719L707j1132K520R335p627k954J0196m472q468
$$ plain form
2321 6325 -821 -4967 4813 1924 -6718 1785 5123 -4951 -1120 6248 -3151 -4986 5633 1074
2335 1074 -5959 3692 4076 -6789 -678 6383 -3770 -3272 7065 -623 -6816 4407 3567 -6334 1762
2350 1762 6659 -5567 -3640 6778 -1872 -5705 6202 2435 -7880 1728 5484 -6066 -1246 8213
2364 8213 -2691 -6027 6126 1072 -7252 4149 5904 -7042 -1416 6654 -4659 -4508 7907 616
2378 616 -7409 3934 3692 -7528 930 7944 -4560 -4104 6723 -1776 -6893 6056 4107 -6984
2392 -6984 1290 5741 -6386 -2741 8154 -1215 -5818 5565 1200 -7977 2607 6231 -5541 -1366
2406 -1366 6543 -3863 -5542 6589 1738 -5996 3947 3964 -7332 -615 6802 -3401 -3156 6390 -1351
2421 -1351 -7101 4072 3322 -5863 1856 5563 -5569 -3049 6286 -1341 -4295 5901 1429 -7039
2435g039Q864K529r336M815O684r990j340R884m922n524R885o36j0127N962N400
2450E109r201J885Q903p645m703R569j918p902Q245L329j0746L058P323q098j567
2465d359J0260m423p498Q335R82r322N794O954r655p07R066o094n205J0258n45
2480C841r354O254M271j0012K085R313p287m136R427k775q230Q435L408r841L122
2495a479P456q640k305J0156l598p072Q427J077r894M854O938q628p95R109n682
2510g6n814R003K73q636N689M934r215O79Q529n933m073Q827j854p878O456L597
2526D508q446K352P000p018k877Q357k543o339P062J726q319L326N898o882p43
2541b938P636m049n298P022L59p071M584M264p269K12O583m667l296O996j227
$$ plain form
2435 -7039 1825 4354 -4982 -167 6517 -3473 -4813 5071 149 -5375 4510 3874 -6253 -291 5109
2450 5109 -4092 -2207 6696 -949 -5652 3917 1999 -5903 2342 5671 -5075 -2017 5306 -2792 -4359
2465 -4359 5901 1478 -6020 2315 3297 -6025 -231 6723 -2932 -3639 5427 -667 -5872 4386 3841
2480 3841 -5513 741 5012 -5000 -2915 6398 -889 -5025 4402 1627 -6603 1832 5240 -4601 -1479
2495 -1479 5977 -2663 -4968 5188 1590 -5482 2945 4022 -5872 -1018 5920 -2708 -3503 5606 -76
2510 -76 -5890 3113 3386 -5250 439 5373 -3842 -3163 5366 -567 -4640 4187 2333 -5545 911 4508
2526 4508 -3938 -1586 5414 -1604 -4481 3876 1333 -5006 2056 3782 -4537 -1211 4687 -2195 -2938
2541 -2938 4698 649 -4649 2373 2732 -4339 245 4509 -2760 -2548 4035 -632 -3928 3068 1841
2556A841o020M916K697o582J755N578n223k195O626k459m839N746R77o206K837
2571e51M207n604m90N910l223l746N487jn663L976L228n906P06N100m082k363
2587c015N525j072m555M218J754n541J693M198m470j218N202k187l674M474P83
2602B115m942K422L427m654k91M772k651k974M656j82m511L032K291m305L97M118
2618B720l097k105M148p00l625L188J558m037J166L237l244j003L763j315k839
2633b185L037Q44l525J481K388l081m15L342j867j808K791Mk877J868J683k839
2649a159K22K727j905j295K605n50k166J906R37k479P10J865j959n27K128q71
2665A89j485J884K97k042J057J190j806oJ875r94j031J690k49j412R14P81j515
$$ plain form
2556 1841 -4179 737 3434 -3148 -1393 4185 -1038 -3233 3393 934 -3905 1841 2818 -3388 -551
2571 -551 3656 -1948 -2438 3472 249 -3497 1990 1989 -3674 302 3530 -2376 -1670 3430 -652 -3015
2587 -3015 2510 1438 -3117 1101 2855 -2686 -993 3205 -1265 -2483 2719 532 -3142 1332 2115
2602 2115 -2827 -405 3022 -1632 -1923 2849 198 -2776 1880 1698 -2813 219 2510 -1795 -1398 2720
2618 2720 -377 -2482 1666 966 -2659 529 2087 -1950 -784 2453 -791 -1794 1969 654 -2185
2633 -2185 852 1696 -1829 -348 2040 -1041 -1456 1886 19 -1789 1002 1006 -1871 -3 1680 -1159
2649 -1159 -937 1790 -115 -1410 1195 645 -1521 385 1322 -1157 -447 1418 -541 -1068 1060 189
2665 189 -1296 588 885 -1157 -100 1090 -716 -722 1153 159 -872 818 569 -843 71 852 -663
2682f63K91J242j053o26J375k01j203R64M75j172L33R07r11k45J117m27p69P80
2700B14K66q45M24K89n68j21M62p8l27M15M6m61J69L05j80j96K46J74j80j01J98
2721A51kl57K04L13m04j30M83k91l82M63J67p20L59N35m47m41R95l23q82R14L97
2742F02j232L74J107j086m42J449o06j112J179N50j695N70J362j597l29J796p55
2759A35j251J717L25k013R12J519j844l96K138j157j558K286N7k361J425J438
2775A372k297j31K443j443j554K572q1k505J799J397k755M51K493k135j097K775
2791A304o23k482K186J088k880Q20K280k347p54L106j350k163K621N33k935J358
2807b38K218k955k63L061j931j723L154j78l012K058J577l263N31K867k342j265
$$ plain form
2682 -663 -372 870 -183 -809 566 365 -838 126 601 -571 -238 669 -242 -487 630 203 -566 214
2700 214 480 -365 59 348 -220 -341 121 43 -284 131 177 -284 -115 190 10 -186 60 234 54 -47 151
2721 151 149 -208 -4 309 -95 -225 258 -33 -415 48 215 -505 -146 389 -58 -499 496 173 -709 205 602
2742 602 -630 -256 851 -235 -677 772 166 -946 233 783 -912 -342 1020 -577 -906 890 135
2759 135 -1116 601 926 -1087 -175 1344 -500 -896 1242 85 -1473 813 870 -1491 -66 1372
2775 1372 -925 -1056 1387 -56 -1610 962 881 -1624 175 1572 -1183 -732 1761 -374 -1471 1304
2791 1304 681 -1801 385 1473 -1407 -587 1693 -654 -1408 1698 348 -1815 806 1339 -1596 -238
2807 -238 1980 -975 -1238 1823 -108 -1831 1323 1145 -1867 191 1768 -1495 -964 1903 -439 -1704
2823a704L303q99k740K769J005l383J272K460l048n05L488j785k283L379L3l512
2839b150K052K086l493M08L375k731j563L707p60l275K947J619m128J053L312
2854B459l309j100M080j458l310L704P65m307K271K845m050l16M168k459k683
2869b700M482j14m458K907K517m722O15M467l324k199M723r23m240L612J972m965
2885b350J261M032m060j495N113j583m012M413R37n096K200L833m412q81N089
2900B989k656l604M847N12n071K928L017n087J70M880l062k610M966n51m926L521
2916B63K677n033R38M479m066k103N091j282l904M004J599n280J533L963m083
2931a204j065N214k167l861M322N90m726K923L174m677m21M336k667k602M969
$$ plain form
2823 -1704 1599 700 -2040 729 1734 -1649 -377 2083 -965 -1470 2018 233 -2050 1329 1362 -2150
2839 -2150 -98 1988 -1505 -1097 2278 -453 -2016 1691 931 -2344 603 2222 -1906 -853 2459
2854 2459 -850 -1950 2130 672 -2638 1066 1831 -2476 -205 2640 -1410 -1726 2442 -17 -2700
2869 -2700 1782 1668 -2790 117 2634 -2088 -1473 2994 -330 -2529 2194 1271 -2969 643 2615 -2350
2885 -2350 -1089 2943 -1117 -2612 2501 918 -3094 1319 2256 -2840 -640 3193 -1219 -2100 2989
2900 2989 333 -3271 1576 2088 -2983 -55 2962 -2125 -1955 2925 -137 -2747 2219 1668 -3258 263
2916 263 2940 -2093 -1155 3324 -742 -2845 2246 964 -2940 1064 2663 -2617 -1084 2879 -1204
2931 -1204 -2269 2945 778 -3083 1239 1829 -2897 26 3200 -1477 -1898 2438 -229 -2831 2138
2946B138k68m612L014K041m671J201M229l649j762M424j486l735M267J462m768
2961b175J754L212m393m86M934k400l015M261k98m572L142K865m482L78M299l760
2977g36k304N190o62m190L688J499n188J510M186l832j232M882k188m084M573
2992A112J134m842K477L375n036n76N051k604k965M966p3n259L001K996m688N15
3008a416M938l816k741M934p45m373M074K161n468R60M368l846j437N215j569
3023A239m413L949J388m875K052M080m581j034M636k304l198M833N56n017K299
3038c90K884m428N3M896k832k770M282m63m266L295K500m546P06L716l426j662
3054b451M688j006l737L397J035m270J517L439l456q71L970k033k998L919N68
$$ plain form
2946 2138 1870 -2742 272 2313 -2358 -1157 3072 -577 -2339 2085 599 -3136 1131 2593 -2175
2961 -2175 -421 2791 -1602 -2088 2846 446 -2569 1692 1394 -3178 -36 2829 -1653 -1275 3024 -736
2977 -736 -3040 2150 1488 -2702 986 2485 -2703 -1193 2993 -839 -2071 2811 623 -3461 1112
2992 1112 2246 -2596 -119 3256 -1780 -2356 2695 91 -2874 2092 2019 -3240 -239 2757 -1931 -1416
3008 -1416 3522 -294 -3035 1899 1154 -3219 855 3016 -2452 -1492 2876 -970 -2407 2808 1239
3023 1239 -3174 775 2163 -2712 -660 3420 -1161 -2195 2441 137 -3061 1772 2328 -2689 -390
3038 -390 2494 -1934 -1881 3015 183 -2587 1695 1232 -3034 261 2761 -1785 -1079 2637 -789 -2451
3054 -2451 2237 1231 -2506 891 1926 -2344 -827 2612 -844 -1715 2255 222 -2776 1143 1711
3069A711l786K138K427m196R2L812k262j863L675n10l812K731J843l704J006L073
3085B375l097j396L914j123k886L196Q74l843J416K770l111n72L654j912k447
3100b188L293J37l309K171K184l684j8L413k372j661L682n29l318K461J638l691
3116a791J085L018k835j174L484j299k675L044Q18l406J204K641l207l61L374
3131A920j747k147L014J03l065J854K100l126OK964k043j645L220l74k947K114
3147B01J446k917K91K702k168j068L014r18k455K335Q00k743R97K193k327o14
3163a231K635j072j876K312K96k576J329J626k228j50K342j488j420K479j96k181
3179a399J575J068k219L47K027j626r74K236n79j747J638O08j933O58J437j680
$$ plain form
3069 1711 -2075 63 2490 -1706 -1614 2198 -64 -1927 1748 1238 -2574 157 2000 -1704 -698 2375
3085 2375 -722 -2118 1796 673 -2213 983 1857 -1986 -570 2200 -911 -1483 2171 259 -2188
3100 -2188 1105 1242 -2067 104 2288 -1396 -1414 1999 -373 -2034 1648 1119 -2199 262 1900 -1791
3116 -1791 -706 2312 -523 -1697 1787 488 -2187 857 1675 -1731 -527 2114 -1093 -1454 1920
3131 1920 173 -1974 1040 1143 -1922 -68 2032 -1094 -1088 1876 -167 -1812 1408 1034 -1913 201
3147 201 1647 -1270 -979 1723 -445 -1513 1501 583 -1872 463 1263 -1480 -483 1710 -617 -1231
3163 -1231 1404 332 -1544 768 1064 -1512 -183 1443 -785 -935 1407 -81 -1501 978 782 -1399
3179 -1399 176 1244 -975 -628 1399 -227 -1201 1035 456 -1291 347 955 -978 -320 1117 -563
3195e63l24J958r50j522J848K38j684Q26J260j754N9J643r54j006J609k00j435
3212i51J017O91j529L04J315j147n76J520l38j190J214L61j351L86J056j027l25
3229e70J289n92r59J219K56j402P03P76j116r3J088o12o95J162k8j154R39M76
3247F87j228K28R11p72l65R68j32p59O22K82r20L42O35p29j71P89k78n48P19N8
3267C39n51J63M74n65o6O45l50m37N25M0n49L93J14l67pL55j74r7J87l6j93Q5
3289g2J23j05o6K44r0j7Q6Q4k01rJ4L2m3L1M5M5j55M3L8N1j60J44l1j73J71N8
3315H7j38Q3J76l17R5J55k21p1K09j3k54K55J3l29J32L43l73L5N06l23m34N63
3337A79lm13K31L44n42M3N24l42l87P33j46o12M39K56p31K73N93n79j16O92l78
$$ plain form
3195 -563 -887 1071 121 -1401 447 685 -999 -173 1087 -667 -608 1035 81 -925 684 484 -951
3212 -951 66 757 -772 -468 847 -300 -876 644 306 -884 330 691 -660 -274 782 -245 -570
3229 -570 719 127 -832 387 643 -759 -56 720 -396 -489 599 -13 -708 454 426 -728 211 687
3247 687 -541 -313 598 -174 -539 429 297 -462 160 442 -478 -136 499 -230 -401 388 110 -438 281 339
3267 339 -212 -49 425 -140 -206 439 89 -348 177 217 -332 61 175 -192 -199 156 -18 -115 72 36 -157 -72
3289 -72 51 -54 -120 124 34 17 103 187 -14 -23 -9 23 -20 11 56 101 -54 -11 27 78 -82 62 31 -142 29 87
3315 87 -51 32 208 -109 -14 141 -80 -151 58 45 -209 46 59 -270 -138 205 -168 -133 373 50 -384 179
3337 179 176 -237 -6 338 -204 -161 363 21 -366 367 221 -391 48 304 -427 -154 439 -140 -256 436 58
3358E8n12P66J05r18N12N78j056K19P56o02m37R46k52r39P65M66r67K08R58r28
3378b74l07J181l33r72J024K83j205M88Q27r87k81J337p41q79J271Q6j330P64
3396d8R11j451J17J423r75p61J356K2j611J082Q00j625L40J344j214o98J864m32
3414D44j473J217N80j654N70J424j376n21J652o90j254J601L15j723Q44J044j415
3431d15l14J709r52j116J754K3j761J137R59j840K89J674j284q19J653j83j579
3448a065J318P04j806M15J714j491n42J837q75j345J529M39j862Q96J321j828
3464f41k12K003j129j043J901j96j827J186J028j882L80J612j469q64K067n62
3480C52j571J750M83k104Q25J471j850k22J931r51j396J848K85k014J145J326
$$ plain form
3358 58 -454 312 417 -501 11 589 -467 -248 508 -94 -531 415 163 -776 -11 455 -512 -304 654 -274
3378 -274 -581 600 267 -705 319 602 -603 -115 712 -275 -556 781 40 -839 432 518 -812 -48
3396 -48 863 -588 -471 952 -23 -784 572 594 -1017 65 865 -760 -420 924 -290 -988 876 444
3414 444 -1029 188 768 -886 -316 1108 -268 -789 863 173 -1081 520 835 -888 -44 1000 -415
3431 -415 -729 980 28 -1088 666 689 -1072 65 1024 -816 -527 1147 -137 -956 697 514 -1065
3448 -1065 253 957 -849 -434 1280 -211 -753 1084 209 -1136 393 832 -1030 -134 1187 -641
3464 -641 -853 1150 21 -1022 879 683 -1144 42 1070 -812 -432 1180 -289 -1153 914 352
3480 352 -1219 531 1014 -1090 -265 1206 -644 -866 1065 114 -1282 566 851 -1163 -18 1308
3496A308j972n5J863j406r54K219k11k126J479R86k153M52J990j716r43K395p84
3513C72j765J963O34k308P20J677k039k97K353j014j573J975J73k329J481J476
3529A499k258k1K129j521j301K344P7k299J638J076k554N06K175j654j164K440
3545A112o88k065J921Q27k349R43J787k086o31K428r13j681K156K00k345J078
3561c06J687k122p1K315j353j601K191o0k096J729J045k342J52K029j605p47K365
3578A210p09j903J585P10j991Q40J805j878q11K253j007j388K077J87k063R29
3594a54J315k007J26K079j244j232K066o05j681J574J030k094M71J646j793o34
3610a137K153n36j631J640K73k013Q75J664j783k89J844j134j247K045J49k020
$$ plain form
3496 1308 -664 -719 1144 -262 -1216 1003 792 -1334 145 1131 -1022 -570 1420 -296 -1239 1156 372
3513 372 -1393 570 1204 -1104 -384 1293 -746 -1043 1310 296 -1277 698 871 -1458 23 1499
3529 1499 -759 -780 1349 -172 -1473 871 948 -1351 287 1363 -1191 -685 1490 -164 -1328 1112
3545 1112 424 -1641 280 1107 -1242 -299 1488 -598 -1229 1199 286 -1395 761 961 -1384 -306
3561 -306 1381 -741 -812 1503 150 -1451 740 680 -1416 313 1358 -984 -832 1197 -408 -1155 1210
3578 1210 501 -1402 183 893 -1098 -258 1547 -331 -1142 1111 104 -1284 793 980 -1083 -154
3594 -154 1161 -846 -720 1359 115 -1117 949 344 -1337 237 1267 -827 -356 1290 -503 -1137
3610 -1137 1016 480 -1151 489 762 -1251 -376 1288 -495 -784 1060 -74 -1321 724 873 -1147
3626a147J304R94k004J49J999j435r66K171m61k017J649Q57j996N94J715j953
3642e47n73K103o93j426J888J93k121R22J398j769j48J981j273j145J793R1j897
3659a223J254J081k001R7J969j416q63K217n75j789J505O41j793M31J826j547
3675a86q37J967p35j469J712N40j967O45J371j697k07J857q75j164J604R4j739
3692a086J100J085j582o2J652j218q42J637k05j514J203N93j543M62J366j344
3708b98n93J589m69j319J445K32j351Q06R62j488k35J468n80j059J479n9j370
3725h40P44R58j369J00J217r31o73J269j54j137J093M19j342L49J058r15m49J370
3743G67p05q54R60L08j180O50P90j182q7J224p12p24J228j24j042P57O63j312
$$ plain form
3626 -1147 157 1151 -853 -704 1295 -140 -1106 1065 604 -1413 236 1093 -903 -309 1406 -547
3642 -547 -1120 983 290 -1136 752 945 -1176 -254 1144 -625 -773 1208 -65 -1210 583 674 -1223
3659 -1223 31 1112 -889 -792 1177 -239 -1102 1115 540 -1249 256 897 -896 -465 1361 -186
3675 -186 -1023 944 209 -1260 452 992 -975 -330 1041 -656 -863 994 119 -1045 559 653 -1086
3692 -1086 14 1099 -483 -545 1107 -111 -953 684 479 -1035 168 761 -782 -320 1046 -298
3708 -298 -891 698 229 -1090 355 587 -764 42 1004 -484 -719 749 169 -890 589 530 -840
3725 -840 -96 862 -507 -407 810 -121 -794 475 321 -816 277 696 -646 -297 761 -154 -603 767
3743 767 62 -792 168 476 -704 -54 736 -446 -533 691 -21 -745 483 359 -683 74 737 -575
3761e75K54R46p36m97J123k18r35Q83J81j054L94R10q61k77J144n64p61R61J59
3780D77j110O15O43j014L6R57n65n74Q47r8p36N54N10r01pR10o73k85P83l00o40
3801e71Q13K21q22K29O55o16l20P61j89o53O32J24o58K82L97n24P7N41l77l55
3821c53N98k1o12M64K03m20j1N78m75l64O86j32n15M77N8m15J48L61k42k51M83
3842B45j75k82L65K3m08L08K22n53J18K87j83k01K94R5m21K52J42k00O2J61k35
3863h4K0J76j59j02K04P6k83N2K30j62j15K17j0j06J37m0j20J03m4j22K9K13j39
3886b9J4O8j1r9j0J42o2L0p3M9m9J4Lk3m5J02K6j71kR4Q4j89J71R7j66P6J38k13
3914c4r3L15j94j81K28P9l26J20K45k90oJ94j06j29L19J00m70K34K08m10J03L12
$$ plain form
3761 -575 -321 625 -111 -608 515 297 -638 245 426 -628 -234 676 -185 -462 682 118 -643 318 477
3780 477 -633 -18 625 -389 -353 604 39 -535 312 214 -522 32 542 -359 -366 544 -129 -414 369 69 -571
3801 -571 242 463 -359 -130 525 -91 -411 350 161 -492 140 264 -394 -112 285 -239 -162 379 2 -353
3821 -353 245 224 -388 76 279 -141 -152 426 -49 -413 273 141 -374 103 161 -254 -106 255 13 -238 245
3842 245 70 -212 153 176 -232 76 298 -255 -137 150 -33 -234 60 155 -266 -14 128 -72 -10 151 -84
3863 -84 -64 112 -47 -149 55 131 -152 -100 130 -32 -147 70 60 -46 91 51 -69 34 -10 -132 -103 110 -29
3886 -29 -15 53 42 -57 -67 75 13 43 -30 19 -30 -16 -13 -36 -81 21 47 -124 -126 -32 52 -137 34 131 -35 41 179 -34
3914 -34 -127 188 -6 -187 41 120 -206 -86 159 -131 -137 57 -49 -178 141 241 -229 5 213 -197 -94 218
3936B18j25l30M67J7m98J49L61m28QM40k09l58M39j05k79K44L16n37M1M50k77
3957Dm01O06n6o25O68O7n54J67N31n54m2O36m10m63P14%p11M24L77n25j55P99
3979D97m76l06N35j31l49K79K85n97J71M26n33j09P64l27n76O78J12p35L73M37
3999D18p11l4P73m51n44R02j72o91N82M20q49J37P27p40j69P84k34o50O95K64
4019D57q55L02O25p91j35Q86m96n22P78K9p27M56O08j023P9R17o88n13J056k32
4039B11q47P18M73j041L54Q07p96n06J270m07q96R45K42j113L14R30j055m6J101
4058F58n28q00J129r1j019O31O70j157J90J016q03n16J010J1j030P00O37j323
4076f15L01J094j018m17J316n08q54R69L58j202L98R50j117k5J117o07q47J068
$$ plain form
3936 218 93 -237 230 247 -251 -102 259 -169 -161 279 70 -288 151 46 -233 11 327 -210 -169 281 4
3957 4 -397 209 153 -472 196 263 -291 -124 407 -147 -189 447 37 -426 288 288 -423 1 378 -147 -302 497
3979 497 21 -285 250 119 -230 49 334 -263 -92 334 -199 -308 456 129 -447 231 343 -392 -19 418
3999 418 -293 -327 446 -5 -549 353 181 -510 72 492 -357 -220 507 -233 -402 382 148 -502 193 457
4019 457 -398 -96 529 -262 -397 489 -7 -529 249 278 -449 7 615 -408 -329 588 -100 -613 443 211
4039 211 -636 82 555 -486 -132 675 -121 -627 643 236 -660 285 527 -586 -272 658 -397 -443 658
4058 658 130 -670 459 368 -651 -20 650 -507 -317 699 -104 -620 390 401 -629 71 708 -615
4076 -615 -314 780 -238 -655 661 153 -701 268 626 -576 -178 772 -345 -370 747 140 -707 361
4094C61Q5j150P58O02j170K03J015p50p34J370k74j019R17L49j143L08J070r98
4112b00j72R73o23p75J093L02j113N78O85j111j89J228o96o98J261k17j051P44
4130A9N94j150K54J130r56o84J359l09j044J218J46j146M05P60r06j70J286o93
4148A13r01J139O4j233P70O88r75j3R83q13n91J399k43j100P93N40j203K69J072
4167G58r67l93J320n76j027J236K57j347O06Q80j275m5J434o97q25J118l1j131
4185g05O62Q48j195J14J146r91n76J230j2j149R52L29j342M89Q50q05l97J337
4203G85n95j075J159K39j050M99Q97j308j58J180m92o46J056j46j059O48O74j036
4221d28J99J069r73m95J057j85j005J045L55j232L15Q75r03k19J336n78j012J073
$$ plain form
4094 361 446 -704 54 656 -514 -311 704 -46 -780 590 316 -703 214 563 -580 -272 798 -200
4112 -200 -372 601 -22 -797 296 598 -515 63 748 -363 -552 676 -20 -718 543 326 -725 19
4130 19 613 -537 -283 847 -109 -793 566 257 -787 431 577 -569 -164 596 -310 -480 806 113
4148 113 -788 351 415 -818 -48 640 -335 -348 635 -178 -769 630 387 -713 80 620 -583 -314 758
4167 758 -209 -602 718 142 -885 351 608 -739 -133 747 -528 -573 861 164 -661 457 426 -705
4185 -705 -43 805 -390 -276 870 -121 -697 533 521 -628 324 653 -689 -200 650 -155 -552 785
4203 785 190 -885 274 513 -537 -38 859 -449 -607 573 81 -565 491 345 -714 -66 608 -428
4221 -428 -229 840 -133 -628 429 244 -761 284 639 -593 -278 597 -306 -525 811 233 -779 294
4239B94J15r79M67Q04j001j60J096p13o12J251k25q87N78N28j084K15J074r49
4257a88m10J165l53q75Q94K57r23L20P23r81j46J186n43p90J044p3r85P82M38
4276E42r25J41Q73p75m40R50q5q87Q01J87j004L24Q94p66k58R31k75q25P53K22
4296C78q86L21Q52j033l1R90o38n83Q85j0q74O71N01q50k5Q74n62n19J078k21
4316C18q39O28L72r24K29P93o59k51P12l36n23P13L2p14L85O00q87m1Q31m37m97
4337d95Q76r0p28M62L83p26J34N67n39l18P89k20o38P96J78p69K32O40o65j53
4357b84O72l18m84O19M5p15N08M17o82j3N75l84l67N36j0l37K94K95o12J70N42
4378D67n60p5L65r1m38N23J05n99K66M59o20n7O11l74l59N13J4n02L63K89o07
$$ plain form
4239 294 409 -570 -103 701 -300 -460 636 -77 -689 562 337 -550 28 556 -528 -313 761 -188
4257 -188 -598 567 214 -661 233 490 -433 -113 610 -371 -517 669 126 -664 380 307 -678 104 542
4276 542 -383 -242 631 -144 -584 366 281 -606 195 382 -622 -298 596 -170 -428 503 228 -597 156 378
4296 378 -508 -187 665 -368 -399 591 -47 -630 255 245 -629 42 543 -307 -332 542 -20 -539 539 318
4316 318 -521 107 479 -445 -216 577 -82 -333 379 43 -480 233 265 -449 -64 536 -351 -392 439 2 -495
4337 -495 381 291 -437 25 408 -318 -184 383 -156 -474 315 95 -543 253 431 -338 -106 534 -131 -284
4357 -284 388 70 -414 205 250 -465 43 460 -222 -235 340 -44 -411 125 115 -222 72 367 -245 -75 467
4378 467 -93 -168 197 106 -332 191 296 -303 -37 422 -198 -255 356 -18 -377 136 150 -352 11 300 -307
4399c07J04M23k91j04L93j58k61L18J51m76J06L65m27QK75p3l72M79Jm33K16K70
4421B07l25j2L81k96k02L46nj44J03N1k66OL42l26M6J88J8k40J55J82k97J31Q7
4444A30k94M4K87r5o4O2n3k18K86P1j70O3O1j75M7J53j36k8O3P8j68j1J46p5o0
4469e6J77j17m7J31%p9KR0n7n9P0q8J4O2j13J3J5J9K9j50J07OJ57j79J52l4k5
4496D0j34J78j17m7J40J12l57K14j0j31N2R4k2j60K38j15j07J25O5j26r1L16k31
4519g4n0K68q6k80K57N7k11Q1J90j85j61M17k73n5J87m4k73J12K07m6j52L21k64
4542e7j75M38j09l89L00K36l25j6L34m01j39N87k08l03L54K21n69R6M45m78ML74
4564B20j86l54N33P6o05K50M79n77o3O78n89k88O44m1m85L19K21m53J15M04m22
$$ plain form
4399 -307 -203 220 -71 -175 218 60 -201 117 268 -208 -102 263 -164 -156 119 46 -326 153 154 -279 -63 207
4421 207 -118 -130 251 -45 -247 99 94 -50 53 104 -162 -156 186 -140 -94 94 112 -128 27 209 -88 43 130
4444 130 -164 -120 167 72 8 70 17 -201 85 156 -14 49 110 -65 -18 135 -1 -29 34 112 -56 -67 79 4 -56
4469 -56 121 4 -43 88 88 9 11 101 44 -15 55 -33 -19 43 -70 -57 -42 -23 6 -144 -37 -31 126 -53 99 65 40
4496 40 -94 84 -33 -80 60 172 -185 29 19 -112 -60 34 12 -148 90 -25 -132 -7 58 -68 -159 157 -74
4519 -74 -124 144 58 -222 35 92 -119 -38 152 -33 -194 223 -50 -105 82 38 -235 -123 84 38 -114 207 -57
4542 -57 -232 206 97 -292 8 244 -81 -97 237 -164 -303 284 76 -227 127 348 -221 -125 320 -158 -154 220
4564 220 34 -320 213 289 -316 -66 413 -164 -227 451 -138 -426 218 177 -308 11 232 -221 -106 298 -124
4585a24j73N62o7o16M72L20p34K90N24o42j08N93k41m88O65N2p26L15M54o21P4
4606b19O37m67k97O41j20o05O16J59o24P4P35o84j97O96k64o03P42J77p78L11
4626g0N07o26j11P29l28n89P92J1o91L51M99q46lQ52o03l96Q35j39o52O30L24
4647D76r22K22P28n71k39P67k99p18P11K76r57L94O76q13r7R28m89o26Q61N5q36
4668d73N31N38j048K08J008q30l84J016m29p62Q12K97r82L98O58p55l92J117m67
4687F1p59J072J18j070M36O82q56m5J067o44n77P07P2r11P54N12j026N3R46p81
4707a89l66J140k92r30Q63L23j009L49R23j131j96J012m34p32R71K19j108O08
4725B1N35j009k5J099n61o96J037p1j004Q09O05j140J50Q85q84l34J216l12j020
$$ plain form
4585 -124 -297 265 198 -418 54 374 -360 -70 454 -188 -296 297 56 -432 233 285 -441 -126 328 -293 -219
4606 -219 418 -49 -346 295 175 -430 186 345 -279 -205 530 -154 -351 345 81 -522 220 397 -381 -70
4626 -70 437 -189 -300 429 101 -488 304 315 -376 -25 474 -372 -375 477 -126 -522 313 174 -478 152 476
4647 476 -446 -224 504 -67 -306 461 162 -556 155 431 -526 -132 544 -269 -366 562 73 -553 308 363 -473
4668 -473 58 596 -452 -244 764 -66 -450 566 137 -625 187 484 -498 -100 558 -197 -589 528 61
4687 61 -698 374 492 -578 -142 540 -316 -361 706 62 -515 192 264 -647 107 619 -407 -354 592 -189
4707 -189 -555 585 293 -637 226 549 -460 -111 812 -319 -515 497 63 -669 302 521 -587 21
4725 21 556 -453 -478 621 60 -636 401 330 -674 135 740 -400 -250 635 -249 -583 633 321 -699
4744f99R04L18j192M55R42j003j33J050o84o86J096K04j127N80N54j052M5J051
4762F23n99m88R98k38j127J010M83j143J94R63r07m51J240m08q09R96J97j250
4780g16O21Q21j070o3J027m54q40J113l9j082Q23N37j210J44R80p61m98J239k78
4799B94r85P71M09j075L72J038j070l20J153m18q77J115J84j206L68P46r00K3
4817c78J017n13p80R65j0j006Q96M60j074J28R86q25n17J102j66r10O85M33j052
4836e59M01Q16q50l87J094l94q02R50K03r32M23P11r19j79J022n70o12R92r7r64
4856f53P03M74r44J13R76p78m96J063j81q09P10K96j018K94Q02p60n8P67m29p88
4876g16J015M0r34N69O46r58p5R08n55l43P80j55q23O52M97j031K19P38o78k11
$$ plain form
4744 -699 205 523 -669 -214 728 -275 -408 642 -42 -728 368 572 -555 25 579 -473 -428 623
4762 623 24 -464 534 296 -831 179 662 -481 -287 676 -231 -682 558 150 -659 337 534 -716
4780 -716 -95 726 -344 -407 620 166 -674 439 400 -682 141 678 -532 -388 592 -169 -667 572 294
4799 294 -691 80 489 -586 -214 824 -246 -566 587 169 -708 407 591 -615 -247 499 -401 -378
4817 -378 639 126 -654 311 301 -705 191 651 -423 -295 691 -134 -651 451 285 -625 60 493 -559
4836 -559 -158 658 -192 -579 515 121 -681 269 472 -460 -37 674 -245 -424 598 28 -584 408 311 -653
4856 -653 50 524 -420 -307 669 -109 -605 458 277 -532 178 474 -544 -250 552 -208 -266 501 72 -716
4876 -716 299 339 -595 -26 620 -338 -413 495 -60 -403 377 222 -601 51 548 -483 -264 474 -204 -415
4896d15R00l53p94Q34K82r59N27N07p39j12Q27m39n01P53j18o34M24M43p63J04
4916b26O61m83l95P81l3p39M16M50q27K33N85o23j79P27j31p17O31J74p55M12
4936c8N21p20l5O18l20m26O26K4n92L13L53n93PP14n02l43P24k04m87M29K15n05
4958b21J09L97l54j97N53k92l25M23J46n89L48K39l13j38N33k64m51N33j0m25
4978b98L47J96m30P8M64l79j08M89k16m24K33J38l59J97L05l18j42L61K2l90K98
4999F4J16l63J65K83l64q4M33j62l13M13n8l02J79K54m33J06K80l05o8L08p6k02
5021a29J22M6k97K25J99k87K7J88Kj35J33O7l21J57J45k24n4J93kk9P3p3j31P1
5045c4J09q1L5K9k5o3J15P2j79K4L8o7j5j11J48k6P0o9L0O8m7l4j6P0pj30j0L3
$$ plain form
4896 -415 485 132 -662 172 454 -505 22 529 -210 -322 505 66 -435 318 200 -434 -10 433 -330 -226
4916 -226 435 -48 -443 338 305 -434 -18 432 -395 -162 423 -200 -379 348 217 -500 131 305 -450 -38
4936 -38 483 -237 -272 346 26 -400 226 250 -342 -29 324 -269 -262 452 -50 -393 331 127 -360 69 284 -221
4958 -221 -112 285 -69 -266 287 -5 -330 93 239 -350 -2 237 -76 -214 319 55 -396 137 127 -298
4978 -298 49 245 -185 -107 357 -22 -130 359 143 -281 -48 90 -269 -72 233 -85 -227 134 156 -234 64
4999 64 180 -183 -18 265 -99 -183 250 88 -225 188 130 -172 7 261 -172 -66 214 -91 -159 149 73 -129
5021 -129 -7 39 -258 -33 166 -121 -94 94 96 -39 94 161 -160 -3 142 -82 -136 57 55 26 99 26 -105 -34
5045 -34 75 -6 29 58 33 -30 85 157 -22 2 40 -27 -42 -153 -5 -31 39 -30 0 68 21 -13 -29 41 34 -96 -106 -73
5073g3R6q1R3Qn3j07J54n2j20P7J19j67P4J01j12J19Q0J2l43L15N9k69R5O8j21
5098b8j20K09j06k00K93Nj76O1J82j88L6J69p4j48K23Om07L98J06l83J74J14k27
5121h1K2K47j60k83L70J6k74J88J92l10k28N94k56k14L16J7m24L65J39l43k6L75
5143B42l19j10L14n3l41M74M5n13J87K97k98p3M56l50k31N43r6m55L58J71l47
5164i9l9M44l80k02N60j72m63L95J82m74J63L56l28k57N61o0o31O27N8o26L18
5185f7M79o98P5N57l41m82O20K08p86L52M01n35l4N89m21k35N49m2n69M83L00
5206D03o82K00O26o52k28O56l07l98M78K49p72K85O20p68J15N66m07n22Q65o8
5226B59o51L82M33p59J60N66n20l61P85j36o22N91K02p30J86P20o08l29O99q5
$$ plain form
5073 -73 23 -58 35 43 -10 -117 37 -15 -135 -58 61 -106 -32 69 -43 76 156 168 -175 140 199 -70 25 93 -28
5098 -28 -148 61 -45 -245 48 53 -123 -62 120 -68 -32 137 63 -85 138 144 -263 135 241 -142 32 146 -81
5121 -81 -59 188 28 -255 115 131 -143 45 237 -73 -301 293 37 -177 139 156 -268 97 236 -107 -133 242
5143 242 -77 -187 127 74 -267 207 252 -261 -74 223 -75 -148 308 -42 -273 270 174 -281 77 248 -99
5164 -99 -138 306 -74 -276 284 112 -351 44 226 -248 -85 271 -57 -314 247 187 -444 183 241 -385 -67
5185 -67 412 -286 -211 346 5 -477 143 351 -435 -83 318 -217 -251 338 -83 -318 231 189 -380 103 403
5206 403 -279 -79 547 -105 -333 323 16 -382 96 345 -427 -142 478 -290 -175 391 -16 -538 327 259
5226 259 -392 -10 423 -336 -176 390 -130 -491 294 158 -464 127 329 -401 -215 505 -103 -432 267 182
5246A82p34Q17Q4p04L18N09p11o7P86l52p33R05o6o74N23L76p32N0P32n70m78
5267e39J076l88p02O97K23p95J79Q11p16l16R12l66o24P65P6p44N29N44q88p7
5287c43Q39m70n98R10j40o82L97O07q99J80P51o01l56Q06l14o43P14L97r60K76
5307a29O12p19j33Q13l88n58P99K5r64O11O30q93q6Q65n62n74J081q7r25P05L58
5328D81q52R2P71n73m05R26j74r08Q76J37p94L46O44q19j81Q85l95n81Q59n8r04
5349f27M92N69q51R6P98m78n50Q57p2q45P11M44r41J17P81n71l11R20l86q24Q47
5370A76K09q57L15P30q32j32Q29l40o00P25K57r06M15N45q91LQ12m20m75P73j62
5391A74q09P30L03p24R2O57n23m32R61k87o86P83Q7p26J69P95o70j65O15k76p29
$$ plain form
5246 182 -552 265 349 -355 -37 472 -239 -306 480 128 -605 300 234 -440 83 459 -273 -223 509 -61 -539
5267 -539 537 149 -553 144 367 -428 -249 562 -154 -470 442 76 -548 217 293 -451 78 622 -266 -343
5287 -343 496 26 -572 338 198 -484 -87 520 -379 -199 552 -49 -405 401 87 -556 158 555 -405 -129
5307 -129 483 -236 -369 444 56 -502 297 322 -642 -31 599 -294 -380 485 -77 -651 430 343 -582 123 481
5328 481 -371 -279 492 -81 -486 440 266 -642 234 371 -423 -77 567 -252 -433 452 57 -524 335 277 -627
5349 -627 -135 434 -417 -321 477 -1 -551 306 234 -611 100 544 -397 -280 501 -70 -381 539 153 -671 176
5370 176 385 -472 -157 573 -259 -391 438 98 -502 223 480 -426 -11 534 -357 -354 458 38 -437 336 174
5391 174 -635 95 398 -326 -234 423 -100 -532 429 142 -544 239 326 -400 -231 564 -106 -271 344 68 -661
5412f61Q60J06p29M59M59p18jO79l64n44Q29j92p30O08L75p68J81O88p09k58Q33
5433D03k24o84N75K88q93M57O18q08q8Q37l80n87P48N6o91M79N03r17M9O66m20
5454a3m26Q38j89o65M63K62o74K78O27o68j94P76l04n98O19K11o79K86M74p08
5474b84N3O47m36l12M51N7n43L16L76n99J50N65m29j78M32m6o13L91M72p84J44
5495a70N47m36k64O10l58k87N40N5n77M04L04m92j01O34m97k03M09J85n84K84
5515CL83o54J68M81n09j86M98k6m19K37L02n37K08K85l33j37M79j67m06N56qm84
5537b66L82J78n33P0L72l37n3K82P1l94K27K14m22R5L31m47P4M03k25k51K40L16
5559C27n42M5L31k95n2K58j50k31L22R2k76J62J80k07l7K90k06k83L59K9k68J43
$$ plain form
5412 -661 199 305 -424 35 494 -224 -225 454 90 -454 375 183 -547 61 436 -332 -151 537 -172 -430 403
5433 403 179 -505 70 358 -535 -78 540 -268 -356 481 101 -486 262 318 -373 106 609 -308 -259 407 -13
5454 -13 -439 399 210 -455 8 270 -404 -126 501 -167 -361 415 111 -487 132 343 -336 -50 424 -284
5474 -284 -231 416 -20 -332 119 176 -367 -51 325 -274 -124 441 12 -166 266 220 -393 -2 470 -314 -170
5495 -170 377 -59 -323 287 -71 -358 182 237 -340 64 368 -124 -225 409 -88 -291 118 303 -281 3
5515 3 386 -268 -100 381 -128 -314 184 158 -261 -24 278 -259 -51 234 -99 -236 243 76 -330 226 218 -266
5537 -266 116 294 -239 -169 203 -134 -187 95 166 -228 -1 213 -209 -114 217 -230 -156 247 22 -229 11 327
5559 327 -215 -170 161 -134 -186 72 -78 -309 13 105 -171 -9 171 -36 -73 217 11 -272 87 116 -152 -9
5581iK36l20K0J92k06q2K47Nk10K18Lk28L7K45k50N3J13r5j00K37K3j86K17k7
5605A33l3j14R5r9j34J92J10k11J61l4j11PJ46r2l7qP4m2MJp8J05R4k05p0J82
5631C6k0p7Q7m8n4m7J02J0j0Q3j05l3N1J1J46j60J27j32J33r8O4m9N5j1l6r5J2
5658e8J09n6k8j0Nm8J07K3j09L5J36n7Nj43L4Q3m2J19j00%P6k15Q5P4J56j78Q0
5685H3oj24j8P9o3pJ25Jj56J89k3j85O2J71j75qJ49r8j80L66j18k84J14J96j57
5710f7k7K20j68l2K09j86j35J43J60l19R6K12j66p6K82j51q8K24q5j61L7L33m02
5733a47M1L24j51l42L41o8k54L26J25l96O7L08j72j01L34j34l58L27J57m59J10
5754a22L04j76j05K76k01j99J90K86m92J72L60l83l3L72k96j79L56m5l27J95K57
$$ plain form
5581 -9 227 -93 -73 119 -87 -169 78 83 -127 91 94 -134 -97 148 -102 -49 64 -31 -131 106 129 -57 160 133
5605 133 100 -14 81 -18 -152 40 150 -61 100 66 -45 -38 108 16 -21 -29 45 3 7 8 -70 35 129 -76 -146 36
5631 36 16 -61 26 -22 -76 -123 -21 -11 -21 62 -43 -76 -25 -14 132 -28 99 -33 100 2 66 17 72 61 25 -70 -58
5658 -58 51 -5 -33 -43 -38 -86 21 44 -65 -30 106 49 54 -89 -55 28 -14 105 5 5 81 -134 -49 25 181 3 83
5685 83 77 -47 -65 14 -49 -56 69 70 -86 103 80 -105 -43 128 -47 -55 94 -4 -184 182 64 -220 -106 90 -67
5710 -67 -94 126 -42 -74 135 -51 -186 -43 117 -202 -106 106 -60 -136 146 -5 -93 131 46 -115 -78 255 -147
5733 -147 -106 218 67 -275 66 -2 -256 70 195 -201 -134 174 2 -99 235 101 -257 70 227 -232 -122
5754 -122 182 6 -99 177 -24 -223 -33 253 -239 -67 293 -90 -123 249 -47 -226 130 85 -242 -47 210
5775B10m50J00M51k78k03L79m1k88K60J35o13K83L49l85r6L60k60k34M01R6m93
5796c17K31L45l80M2L48k93k67M32Jl48K71K34m78J88K58l62j84N02j56l77L99
5817H9K34n89K51L29l36k36M88k02l43N24q8m21K81J65k66r7M39k57k12N06L1
5838B90o49M45K13o03J28M96m31p9M57k77l16K63L63n71K32L95l75k07M31k72
5858f7k35M36l3m35K55M35n99m7O01m11j71M43l9m02K54L23m57K9L99m32k12N67
5880B02r1l77L11K06o51M54K92m11k21O60l48l70M80J61o19K97L65o55J76M45
5900C06k72k69N09j82l69K38K11l78J08L40m22J1L44j62l42N47L9o03J64M88l96
5921i0j35N61l67l36M83J8m22K94K51l48o8M56l47j85M83p4n92M91J18n39K20
$$ plain form
5775 210 -240 -140 311 33 -170 209 168 -120 140 275 -338 -55 294 -91 -187 173 -87 -321 80 176 -317
5796 -317 -86 259 -121 -79 269 -24 -291 141 142 -206 65 299 -179 9 267 -95 -279 223 67 -310 89
5817 89 323 -266 -15 314 -22 -258 230 28 -315 209 121 -300 -19 146 -120 -217 222 -35 -247 259 290
5838 290 -359 86 299 -304 -176 320 -111 -190 267 -10 -326 -63 300 -271 -39 356 -19 -226 205 -67
5858 -67 -302 134 101 -334 -79 356 -243 -290 311 -100 -271 172 133 -269 -15 308 -149 -120 279 -153 -365 202
5880 202 111 -266 45 251 -400 54 346 -65 -286 374 26 -344 136 297 -322 -25 340 -315 -139 306
5900 306 34 -235 274 92 -277 -39 172 -206 -98 242 -180 -169 175 13 -329 218 257 -346 -182 306 -90
5921 -90 -225 336 -31 -367 116 134 -288 6 257 -91 -159 297 -50 -235 248 174 -418 73 191 -348 -128
5942a28M71m25j98M85j92l04L90J58n41K85K81l19k05N18j41l51M47q8m84L60
5962A9J86l79%M89m18j64M60N9n40L65mm03K47M72m03k21N03k51l72M68J85n20
5984b22K43K65m48q9N42k58l00M35O7n78M18J82n05J53M17m06j56L82J7l45J95
6005IJ53m03J24M12m49n8M90j29m09L13R3l43J44M53n21r5M84j93k36K37m7l38
6027c09L71J35l31j4M57m64p1M57j70l78M43O9m09J64K19l19K2L69j82k12K87
6048A34O7l38J24L24m19j22N02l37j58L71m0l33K11K36l84l5L75l01j09L81j31
6069A8k21L63J17m54J13K36k25n8L29j49l08K42J30l64K15J38k40j5K94j03k30
6090a72L64q8l76L40M5j94J0L59l70n9K98j20k51J95J44k91N6K67k22j7L21k19
$$ plain form
5942 -128 343 -82 -280 205 13 -291 99 257 -284 1 282 -37 -242 276 135 -216 231 143 -341 19
5962 19 205 -174 -174 315 -103 -267 193 252 -288 77 73 -330 -83 389 -14 -235 268 17 -355 113 298 -222
5984 -222 21 286 -162 -251 291 33 -267 168 235 -343 75 257 -248 -95 322 -84 -240 142 159 -186 9
6005 9 162 -241 -117 295 -154 -212 278 149 -260 53 146 -197 -53 400 -121 -216 268 75 -161 76 29 -309
6027 -309 62 197 -134 -148 309 -155 -226 231 61 -317 126 195 -214 -50 169 -150 -128 241 59 -153 134
6048 134 201 -137 -13 311 -108 -230 272 -65 -223 148 108 -225 -14 222 -162 -197 178 -123 -232 149 18
6069 18 -203 160 277 -177 -64 172 -53 -111 218 69 -239 3 133 -231 -16 122 -118 -133 161 58 -172
6090 -172 192 104 -272 68 113 -81 -71 288 -82 -141 157 37 -214 -19 125 -166 -110 157 -65 -82 239 20
6112B0k28K94j3k39L21l8k31o7L29j58j28K21K8j35kJ39k10P6J31j44j8J36j20
6135c6j0L0K46j42q1J52j38p1K37j93q3R4J3r6J9P2n0q5K02n4p3J49K5j71k6J50
6161H0j50L7L5L2p7J13jj55O0J32j50q5K23p6n7J42o6q7J59q8j15KJ27l3j59K20
6187F3r5m1Q8M0j93J94m2j13J07Nr1N0O2L7j33lR3j29J41J4m1k6o0J09m6Q5n0
6214B5L7r4O1q3j08J52m3P2loL8m2o1J46n0q9rO0k8J2J18j08K2l9k6o0J11L5o5
6243b5o5J62j05rN2j8J1o3J3R6j6j35J01k0L2k9l5O2J00j97J77k9o9O3Qp3j2J51
6271A28p8l2L4L9q6%o6R6nl8n9q0J30K0k3N4J05k75L0J61m2n8J39p5j36J43J04
6298A30j72J22m0r1K7J31j09j42J47P0j20K1J63j55o3J29j3qJ1j7Kj37O8nk4P3
$$ plain form
6112 20 -208 86 73 -166 155 117 -114 -181 148 -10 -138 83 111 -24 -26 113 -97 -21 110 -34 -52 84 -36
6135 -36 -46 -16 230 88 7 159 21 -50 187 -6 -89 5 18 -78 -59 13 -37 -122 80 26 -47 102 127 -44 -70 80
6161 80 -70 -33 2 34 -43 70 69 -86 -26 106 -44 -129 94 18 -39 103 37 -50 109 21 -94 -92 35 2 -157 63
6187 63 -32 -73 15 55 -138 56 14 -99 8 13 -78 -28 34 71 -62 -65 28 -101 40 54 13 -13 -73 36 -10 75 25
6214 25 62 -32 29 -54 -162 -10 -53 19 16 10 48 6 -55 91 41 -48 -57 3 -25 -13 105 -3 19 -20 -46 -106 5 40 -25
6243 -25 -90 72 -33 -42 10 -8 3 -60 -47 49 33 -102 -1 -21 11 -18 -53 9 109 -88 89 60 -9 54 62 -11 -23 128
6271 128 50 18 52 91 5 5 -61 35 30 -8 -67 -147 -17 3 -20 34 139 -136 -106 55 13 -45 94 19 -117 26 130
6298 130 -42 80 40 -51 -24 107 -2 -144 3 73 -47 -26 137 -18 -81 48 35 27 38 21 23 -114 -46 -51 -75 -2
6324bj9n0R7l3K5J7M5j94P4R4k9j14K21j36n2J67o9j31NJ86j66p9J97J5k13K77
6350A33q6p3J02o6r8J57K8j57K1K03k24j41L40o5j81J14J11k24Q6j8K6J6J11o4
6374E1j55K27k8k32M5K82k66q1K99j70j12J10J24n9k7J65k08NJ16q0j07J38or3
6398f2L8K48k82J0J54j99KJ56k0j42J10L3l7r1J10l4l6J67n2j18N4L7j76J93m0
6423B3j59J06J61j74K6N0M5k31J99P8j05q8J57j18r0K22J0k14N9R2j24R4N1l2
6447C8l2J51j63k02K85j13j85L19J15k59K5J19p8k12K89r2j00J94L1j90M0J07
6469H7n1J0K5n1j28N5J03j85J01P7q9l3J72n1j02J30p2k03K44J32j55L9J24j43
6493C6q9Q7O3k44J48Ol4j10J92j30k3K39j91k9R5Q4k24K05P2j78LJ08j24j22L61
$$ plain form
6324 -2 -21 -71 26 -7 18 35 80 -114 -40 54 25 -89 132 -4 -56 111 42 -89 -84 102 -64 -143 54 69 -144 133
6350 133 47 -26 76 10 -88 69 97 -60 -39 164 -60 -201 139 74 -107 7 118 -106 -20 -38 -12 4 115 51
6374 51 -104 123 95 -137 -92 190 -76 -157 142 -28 -140 -30 94 35 8 173 -35 -30 86 6 -101 37 31 -62
6398 -62 -24 224 -58 -48 106 -93 -91 65 45 -97 13 46 9 -82 28 -6 -42 125 73 -45 9 46 -130 63 23
6423 23 -136 -30 131 -43 -17 33 78 -153 46 124 19 -69 88 -30 -120 102 112 -102 -43 49 -75 19 70 38
6447 38 6 157 -6 -208 77 -36 -221 98 213 -46 -21 98 20 -192 97 5 -95 99 130 -60 -20 87
6469 87 36 46 71 20 -108 -53 50 -135 -34 43 -46 -79 93 42 -60 70 -2 -205 39 171 16 55 179 36
6493 36 -53 34 97 -147 1 7 -27 -137 55 -75 -98 141 -50 -79 16 100 -124 81 153 -25 -22 86 -38 -160 201
6518B01l0l26J73J06k71rJ67r2J5J42k6j27J66m7j11K8K11j99j8R7mj38J26N8
6542I2j24k6J23m2r4J87j72j0m3J09j31P5Q2n6o7K25j83k4Q5j8J9n6M3L9n5J32
6568A10j53r6K14j10L7j43J11n1J51J4j16j09J56j07J57n2J3j33J25O5j79M8J38
6591I0j17J7J27l4r1P5K8j04M0j6J10k72Q1L2q9J06ql4k1J22j2m4nL3j09J52j28
6618g1l2J65j43P2r8J65n0n4J21k4q7qL4m1N3J04j37Q3J8j67P1J48p6r6M8M2o5
6645b5M9Mj7k3O1k2j38J08j26J23j9J08p5O8j75J11o0L6J7r1KP8M7j34J03k9m3
6672f2Q1n7l0P9j4M6j1Q2j33L5P6r9P2j09rmR2k7l4M7Lm4jM0j2N5J24j91r1N7
6702c9J09j16J00l0k2J07P3j20p1J18j35rM0l1jJ2kNJ5k3pQ9J6kn9j68K20K9j48
$$ plain form
6518 201 171 -155 18 124 -147 -156 11 -81 -66 76 50 -77 89 42 -69 -41 170 -29 -47 50 46 -92 34 92
6542 92 -32 -58 65 23 -71 116 -56 -66 -109 0 -131 -56 26 -30 -97 128 -55 -79 6 -12 7 -49 -6 33 -22 110
6568 110 -43 -139 75 -35 2 -141 -30 -81 70 84 -32 -141 15 -92 65 13 26 -107 18 83 -96 -48 90
6591 90 -27 -10 117 83 -8 67 95 -9 31 15 125 -147 -66 -34 -123 -17 -25 -59 -80 42 30 -14 -19 14 -95 57 -71
6618 -71 -103 62 -81 -9 -107 58 8 -46 75 51 -36 -44 -10 -51 2 106 -31 52 70 -97 -26 122 46 -50 -2 40 -25
6645 -25 24 28 11 -12 49 27 -111 -3 -129 -6 -25 83 8 76 -99 12 -48 -12 5 -86 -84 -6 41 -93 10 -19 -62
6672 -62 19 -38 -68 11 -3 43 32 114 -19 16 92 -7 65 -44 -53 -57 35 8 -26 21 24 -20 -21 19 7 62 186 -5 -96 -39
6702 -39 70 -46 54 24 2 109 182 62 -9 109 -26 -35 5 -26 -27 -15 -17 -12 3 -20 -27 62 78 76 17 -151 69 98 -50
6731e0m2R8n2J9M8L2p4r5J86j47O4K2L0j4n2mO0o7O1j00P8j38M2J93r6j04L7J17
6759E2j04%M7L1j64N3O4Nm7P4M6l6q2RR2j0r4jP1%J25q6p5L1m3n7J96L4l5o8l1
6790cR0j52O9n5J41j55J51k7r0J25j09J6L6M8n5j1JO6j36P3N3qk8n5J03j63Q3
6817HNN4j7k8q1KQ6n2l3R9k7j21J03Rm6J19j46M4Pk0Q1j97J48R%J29j61q3K05
6846I6j38R3m7n2O6Jq0k6J08n1q1J59l4P9j50N9mL1Jk4r%jN8K3l4r7o1J94j3j20
6877e4J29Qj47K3m4k6L4rR0o5J42j09Q2o0j0k7J30nj67J32j22Q1oj3Q6j5l0q3
6905e5Rj9J37q3r8M9Q8o9O9L1p8M1n3P4j47J71l4n8O2J00k69P5J05l0k0m4n9N5
6933e0J02J6j01P7Q6j04r9J29p7n0L4j5k8J84L0k39J20R4j30n8J44j38j2J28M9
$$ plain form
6731 -50 -92 6 -46 -27 21 53 -21 -116 70 -77 -13 9 39 25 -27 -31 29 -38 23 -77 1 -137 -95 98 2 -102 -65 52
6759 52 -52 -52 -5 26 -138 -85 -21 -16 -63 11 57 21 -61 -52 40 30 -64 -65 6 6 131 45 -30 1 -42 -99 97 131 96 28 -3
6790 -3 87 -65 4 -51 90 -65 86 59 -31 94 -15 1 37 85 30 19 20 86 -50 23 76 68 40 -15 88 -75 8
6817 8 13 67 50 22 -59 -57 29 -23 -56 43 16 -105 -2 7 -39 80 -66 -22 -15 -35 46 -151 -3 6 6 135 -26 -109 96
6846 96 -42 51 4 -48 18 19 -61 -87 21 -30 -111 48 14 93 -57 2 -2 29 30 6 -3 -3 -4 54 77 43 -54 -115 79 66 -54
6877 -54 75 83 -64 -41 -85 -111 -77 -86 4 -61 81 -28 54 -6 -16 -43 87 82 -85 47 -75 6 0 -13 73 58 28 -55
6905 -55 -46 -65 72 -11 -109 -60 28 -41 28 59 -19 22 -31 43 -104 67 33 -25 37 137 -132 -57 48 18 -2 -46 -105 -50
6933 -50 52 68 -33 44 130 26 -73 56 -21 -71 -37 -52 -80 104 134 -105 15 109 -21 -79 65 -73 -85 43 92
6958I2j64J05L9q0o0J47r8L7JM0o6N2J32l42J46J09j64OJ50l5j53R6P7j68O4J37
6984A00j70l1K03o3j34J09J59k54M5N6j07k2J45p8K4J84j50ol2j0n6P4P8j64n0
7009a50K78j53j7J45j59k6J37q9n0L5J63j45j48K40o0j28J87lj06k9J36o9r1K24
7033A22j72j80K73J09k14O5J70k27o8J88N6k60J96M5k65O9K34k87K00Nk1j09J89
7056A18j03rk6Q1j33p7J31N9k08K01R7k06J85P3k90j0L72l68M4J63K2k48K04m2
7080C0j12K0K18r2j75K76j43l51N41j02k17J53O0j48N7J12j02N0M2m6j55J14J09
7103A39j96O3J00k71p7M88k21j19K36J2k66J63Q4k79J27Qj7j82K67J1k43K61N9
7126A47l51K15J06j94j04M38k29j35K27o6k01J24J50k02Q9J01J8k76K22j3k56
$$ plain form
6958 92 -72 33 72 -8 -68 79 -19 18 19 59 -7 45 177 -165 -19 90 -74 -68 82 47 -106 -10 67 -101 -37 100
6984 100 -70 -101 102 39 -95 14 173 -81 -36 20 -87 -109 36 -42 -18 166 16 10 -22 -32 -88 -14 64 -100 -150
7009 -150 128 -25 -42 103 -56 -82 55 -34 -84 -49 114 -31 -179 61 1 -127 60 57 -49 -78 58 -11 -102 122
7033 122 -50 -230 43 152 -62 3 173 -54 -122 66 122 -138 58 103 -162 -93 141 -146 54 59 38 -71 118
7056 118 15 6 -20 61 -72 -149 -18 41 -167 34 131 -75 110 183 -107 -117 255 -113 -69 94 116 -132 72 30
7080 30 -82 -62 156 64 -111 165 22 -329 212 110 -107 46 106 -42 15 127 25 75 117 71 -84 30 139
7103 139 -57 6 106 -165 -242 246 25 -94 142 154 -112 51 135 -144 -17 -9 -26 -208 59 70 -173 88 147
7126 147 -204 11 117 -77 -181 257 28 -107 120 54 -147 -23 127 -75 14 115 133 -143 79 66 -190
7147a90J59J99k31j9K26j40q8K65r8k63K35J21k96K3K98k35j13M02j94j08M4J09
7169A06l40J57K58l30M9M10l19j76L67j51k30L36m9j14j49K34r8l8K24q5r6J29
7191I5j0l10K55J89k73kJ47M5k08jJ20k16K15J41k95k2L49k46j52J80J30l22K40
7214D9K05l39l9K55j49p0J30m3j8P0M0j81%J82j40k3K25o1j71J22P9k32J19L6
7238D6j49L4L12k62j23J89j8j78J66J42l09J30J99j94m6J45r0r7J84Rj94J29l
7261B2l7j45K78j10j15J46J12l06J00J54j89J3J52j33l9J79j3k20K89M5l10R9
7283b8Q1m2l4O4J2j68J71M8k34M3J62j12q1L21j10k40J58K3j88K23P2k96P2L53
7307B70j85j89J19Q0j54J15qj60J67L9n6k45L07r3o3R4J09k27R3J1k0q7J36q5
$$ plain form
7147 -190 -31 168 -63 -82 144 4 -84 181 83 -180 55 176 -120 -97 201 -34 -147 255 61 -47 -3 106
7169 106 -234 -77 181 -149 -100 310 -9 -185 182 31 -199 137 88 -26 -175 59 -39 -77 147 62 -34 95
7191 95 85 -225 30 219 -54 -56 91 136 -72 -73 47 -169 46 187 -108 -130 219 -27 -179 1 131 -191 49
7214 49 254 -85 -124 131 -18 -88 42 -1 -19 51 91 -90 -90 92 -48 -71 154 93 -78 44 123 -109 10 46
7238 46 -103 -69 243 -19 -142 47 29 -149 17 159 -150 -20 179 -15 -61 84 -6 -103 81 90 -104 25 22
7261 22 -15 -160 118 8 -107 39 151 -155 -55 99 -90 -77 75 -58 -97 82 69 -151 138 183 -127 -28
7283 -28 53 11 -23 41 53 -115 56 104 -130 -87 75 -37 -118 203 93 -147 11 34 -154 69 141 -155 -83 270
7307 270 85 -104 15 95 -59 56 48 -112 55 94 38 -207 100 7 -56 38 147 -80 13 24 4 -83 53 -32
7331c2q8K12j75L3P2K0j40J44L1nj17Q0j08j30J33L9o8k6J09L8j17J41Np2K7j7
7357a1N3q9J97j86K2J10j31J4m9J25o3r1J96j27p3J14k9k6RJ13j65R7o5J0n2Q1
7383a6l7J28o2l1mj8J59j65n8J38j5n5J26o8Pn4K0l5J11m2j24RJ40p5K6K5kl8
7411a0qJ27k14J50r3q5Q2O3Kk3k3K4lj9m9K3m2N0J22p4m2J6M1j6J3k5k8M5K0n
7441A9p5R5l9j58J21R2N4j46K7k1Q7J9K3j55O0K5o4O1Nn8j6J09p6M2l2Q2j51J
7469f9R7q9j3J85j16q3o8K20j78L9J23m8J6r9J55j14M7M6j49J40J0j08R1n3Np3
7495h6O8J14q2J9P0j26l4N9k6r6N3J62k50P9M0r0j9J41kn3R8P9k39N1K44k67j7
7522a10K32j61j17L07j17o4J08J7j72q3L05j83j88L28m8j70O6Q4k35J73K45j94
$$ plain form
7331 -32 -120 92 -83 -50 22 42 -98 46 77 72 -45 35 -73 -203 -70 -31 -99 -125 -16 22 -95 46 51 -21 6 -11
7357 -11 42 -47 150 -36 -14 96 -35 -21 -70 55 -8 -99 97 -30 -103 11 -18 -44 -35 78 -87 10 -55 -45 -97 -16
7383 -16 -53 75 13 -18 -22 -40 119 -46 -104 34 19 -36 90 22 29 -25 -5 -40 71 29 -95 -86 54 -21 5 30 28 -10
7411 -10 -18 109 -105 45 -48 -133 -51 12 14 -9 -32 -8 -11 -30 -79 -56 -98 -48 74 0 -42 -26 15 -1 12 -13 -41 4 24 19
7441 19 -56 39 0 -158 -37 55 109 -37 -10 -31 56 75 98 -57 3 28 -36 25 30 -28 -44 65 -11 31 -1 81 -70 -69
7469 -69 28 -61 -74 111 -5 -88 -156 64 -114 -75 48 0 16 -83 72 -42 5 51 -98 42 52 -56 35 -18 -13 -86
7495 -86 -18 96 14 33 103 -23 -57 2 -24 -120 -67 95 -155 -76 -36 -126 -145 -4 -6 -59 39 118 -121 -70 174 -93 -110
7522 -110 122 -39 -156 151 34 -30 78 95 -77 -160 145 -38 -226 102 54 -116 -50 34 -201 -28 217 23
7544B3k53L50k3k43K03M3k38K00M0j27qK10k71j33M20j73j39J97J07k51Q1J58
7566A73j96j80M33j17l11K50Q3k08kK36k58k4K86j51k91K76K19m15K75N8k15O3
7588a6J52j29j95L68j27k94L40J55m16N5L51l01l3L48k13l29L50R8k97J86R2k28
7610h3NL78k51k53K49j3k88L34K19l63NL11l07j27L21ml82K90J96l68l4L57k20
7633b8j45M55j80k93K40R7l46J50L13l73k3K76n8k63L59O9m25K44K80m14l9M09
7655C05m11r4L25p6j91J77J83m51J62J93k66l2K88j7m18L05J48l59K17K84m67
7676a95K2N29m30j69L74j1m33K85J79k16r8M52k96j93L92r7k76J71K13l51M3M47
7698C42l72j35K90l9l35L56m9j87P8K49l43N3K55j82k85M30J30n10K69J88l96
$$ plain form
7544 23 -230 120 97 -146 57 100 -138 62 102 -25 -33 177 -94 -227 193 20 -119 78 185 -66 15 173
7566 173 -23 -203 230 113 -198 52 135 -73 -75 161 -97 -121 165 14 -277 -1 218 -197 78 136 -79 -16
7588 -16 136 7 -188 180 53 -241 99 254 -162 -107 244 -57 -90 258 45 -284 66 164 -133 53 145 -83
7610 -83 -78 300 49 -204 45 32 -256 78 297 -66 -61 250 -57 -184 137 133 -249 41 237 -131 -165 192 -28
7633 -28 -173 282 102 -191 49 146 -200 -50 263 -110 -133 143 85 -178 181 250 -175 69 349 -65 -104 305
7655 305 -106 -200 125 49 -142 35 218 -233 -71 122 -144 -176 112 95 -323 -18 130 -229 -12 272 -195
7676 -195 -173 356 -74 -243 131 120 -313 -28 151 -65 -163 289 -7 -200 192 95 -181 -10 203 -148 -105 342
7698 342 -30 -165 125 86 -249 107 58 -129 -51 198 -145 -92 163 -19 -304 126 256 -254 15 203 -193
7719a93k0M96k85k63M11j75k43L13J76m55K24L09m69j13M61j18k72M04j8m71K54
7740d7J80k59MM55k71k90M27p2m45L09K99l91o8K55k31j74M85k9m90M18J14l58
7762a79K22J21j39k27M49k40k14M14j7m11J90L07m39L1L34k31k61M44N7n21L88
7783G8K50m42l5M56l59q7L36j62k90L77J25m30P4K91k66MK47j09k56L08ml47K12
7806b9K88l87j16N73l40q7J96J8l90L26J10k99J48K02k51j83L50Nl11L05l8l76
7828b86J37K63j21j91L55j46j35K55J08l76J58K51l50qK54k30n0O8J18l06J08
7849a24K92l65J83J04l4j84K02O3k68J42K17m26R9K78k57j6K14Ll92L19Q0k87
7871a57K25N0l02J37K89l02m7J94J5l67K35P2k06O6J31o4p3J12J54l30J02J32
$$ plain form
7719 -193 -213 283 -2 -265 146 -29 -272 41 217 -238 -14 295 -174 -287 174 56 -216 188 170 -301 -47
7740 -47 133 -126 -122 333 62 -228 199 127 -318 -9 290 -101 -169 86 -145 -319 166 137 -353 65 179 -179
7762 -179 43 164 25 -202 247 7 -207 207 190 -221 -31 276 -163 -132 202 -29 -290 154 211 -310 78
7783 78 328 -114 -149 307 -52 -139 197 35 -255 122 247 -183 -109 182 -84 -80 167 58 -198 110 106 -241 -29
7806 -29 259 -128 -244 329 -11 -98 98 116 -274 52 162 -137 11 213 -38 -221 129 134 -177 128 90 -286
7828 -286 -149 114 -7 -198 157 11 -124 131 239 -137 21 272 -78 -86 168 -62 -112 -44 74 -232 -124
7849 -124 168 -197 -14 90 56 -128 74 137 -131 11 228 -198 -99 179 -78 -94 120 123 -269 50 130 -157
7871 -157 68 118 -184 -47 242 -60 -107 87 102 -265 -30 42 -164 -98 33 -31 -104 8 162 -168 -66 66
7893F6k54J89J25k16j9K17r6m9J04O1j30rN8n8L8J58j06j13J4J52k81J89k7j45
7917a32Q7J11Rk17J72r1q2Q5ln2O2J40n2n9pJ12j14M4O1k60J00Q4l1m3J09n3m2
7944f2L3J11j01J5Lj17J3K62j34j34K04m2j50J31M4k17J51J91k13J5L6%j92K84
7968A31n1p8M4q3j0L9J01j19P6j35P8k0J30o2n8J6jk5N6j6J00j17M2R2j45j1q
7995c4k8K4NkL4k0o1R1M6k9l3o5J03L8j27K1L8nn4o5Q9nq9K04r6p9n7K11J6j13
8025d2N1N8j68J70j2k35K04K2j6j8Lj5j16N4lo0J12M4J1m6R8j53J5N9K8j50J56
8052E1Oj01Q6N4j13k7J18j73J5J82k1k11J42n9r4Q8K16j87j4K2J35n2j36J97k10
8077h6J01r7K9r8R3k1J8J07K6j86n9K05j71L3J80p6j45K08Qk97K21K35k97K2J80
$$ plain form
7893 66 -188 1 126 -90 -109 108 12 -37 67 128 -2 -11 47 -11 27 185 79 -34 -20 132 -149 40 13 -132
7917 -132 -45 66 75 -142 30 -61 -143 -58 -61 -113 -51 89 37 -22 -29 83 -31 13 74 -186 -86 -2 -33 -76 33 -20 -62
7944 -62 -29 82 -19 -4 -1 -118 -105 157 23 -111 93 51 -99 32 76 -141 10 201 -12 3 39 39 -153 131
7968 131 80 2 46 -37 -47 -8 93 -26 50 -85 -7 -27 103 41 -17 -1 -2 -27 29 13 113 -4 38 130 -15 -26 -34
7995 -34 -62 -38 -33 -35 -1 -21 -82 9 55 26 -7 -72 31 69 -58 -37 1 -4 -58 -123 -34 -39 -128 76 -20 -99 -156 55 71 -42
8025 -42 9 67 -101 69 57 -178 26 48 32 14 17 2 -114 -60 -63 -123 -11 33 44 -2 96 -57 -42 17 45 -105 51
8052 51 57 -44 42 96 -17 -44 74 -99 -84 98 77 -134 8 -51 -145 -57 159 -28 -42 -20 115 63 -73 124 -86
8077 -86 15 -82 -53 -151 -58 -79 -61 46 72 -114 -173 32 -139 -106 74 -2 -147 61 69 -228 -7 228 -69 -47 133
8102A33j73k4J86l8j80K07Q4k69r5K25r2j22K83m9j82L2L19l15R9J47j59j04K56
8125A69j08j72J23P5k75J86K19l88k2K80mk94L13m2j83J48P8k11L0K15l79K54
8147A2J76j69k31J87K94l91O8K34k47n5K81q1k70K37J34l92J84J84k12o1K07j49
8169f0j69M49p8k19J36P6k73J10K53k32j73M13j47l11K86J15m22J16L08j79k46
8190b47M89
$$ plain form
8102 133 -40 -64 122 84 -96 111 195 -74 -169 56 -36 -158 125 76 -106 -74 245 -70 29 176 17 -87 169
8125 169 61 -111 12 87 -188 -2 217 -171 -193 87 83 -211 102 60 -123 25 103 -108 -78 137 -242 12
8147 12 188 19 -212 -25 269 -122 -54 180 -67 -122 159 78 -192 45 179 -213 -29 155 -57 -118 89 -60
8169 -60 -229 220 142 -77 59 135 -138 -28 225 -7 -180 233 86 -225 61 176 -246 -130 178 -1 -247
8190 -247 242
8191B42
$$ Imaginary data points
##PAGE= N=2
##DATA TABLE= (X++(I..I)), XYDATA
0@%%%%%%qJ6j6J6k4L2m0M8n6P2r6J20j44J76k08K48k96L46m02M71n51O37p33Q40
30D48r60J095j243J407j590J790k010K252k516K804l121L470l849M262m711N203
46B731n743O330o972P679q458R316j0267J1325j2507J3840j5356J7095j9113K1482
60A1382k4313K7776l2113L7721m5286N6092p2859J02502j69917N88319k8897j147593
72f97186N51565N11845k29624k26800K50354k53845l6199L74061j28378k92495
82a76702J42719Q1279N3582O1805j37583l18693K86358L73139l84976j61556K91598
93A10970j43164j00581L02358j0288m40785K18381M41562m55560k46541M88968
103A65320M5903l28096N8243J92236k08724m8640K73330j17011j49037J35142
$$ plain form
0 0 0 0 0 0 0 0 -8 8 -8 8 -16 16 -24 24 -32 40 -56 64 -80 96 -112 136 -160 186 -216 255 -296 341 -392 448
30 448 -512 583 -660 747 -843 947 -1063 1189 -1327 1477 -1644 1826 -2023 2239 -2472 2731
46 2731 -3012 3318 -3654 4025 -4433 4883 -5384 5941 -6566 7274 -8082 9013 -10100 11382
60 11382 -12931 14845 -17268 20453 -24833 31259 -41600 60902 -109015 479304 450407 -697186
72 -697186 -145621 366224 136600 -90200 160154 -93691 -129890 244171 115793 -176702
82 -176702 -33983 47296 100878 162683 25100 -293593 -7235 365904 -19072 -180628 110970
93 110970 -32194 -132775 169583 159295 -281490 -63109 378453 -77107 -323648 165320
103 165320 211223 -116873 -58630 133606 -75118 -123758 149572 32561 -116476 18666
113A8666L9322k2256q4209n9524J42513J78112j95274l12114L36762K67149m46416
124a37269r4480L97883j7615l21147R2082K18368j83153l151J80548j47012q2373
135i7319J01293L9553n841r253n4282o2827J33646K4356j63750J00538M0074j25744
147g9556J26544Q5929k45836q3063L61258L5480l68902R0393J85971j58892J6396
158c4278J51800j27632j45497K08378P2802k19855O4866R3229j01729N5702L3722
169E1508j18124K7173J37268j19831q9828K55619q6666k95999K56655K09483k98181
180g0923r1252K89823m5926k36292J90885O4891k20567J28214J22680k17787k5425
191a11679K30836o6630j87568J67273M6865j64717J08080M5489j57175P2522J42672
$$ plain form
113 18666 57988 35732 -48477 -108001 34512 212624 17350 -294764 41998 309147 -137269
124 -137269 -231749 166134 148519 -172628 -80546 137822 -45331 -48482 132066 -14946 -97319
135 -97319 3974 43527 37686 28433 -25849 -88676 44970 69326 -94424 6114 46188 -79556
147 -79556 46988 132917 -112919 -195982 165276 200756 -168146 -77753 108218 -50674 -34278
158 -34278 117522 -10110 -155607 52771 125573 -94282 -29416 63813 -37916 17786 51508
169 51508 -66616 -39443 97825 -22006 -111834 143785 57119 -238880 17775 227258 -70923
180 -70923 -162175 127648 81722 -154570 36315 101206 -119361 8853 131533 -86254 -111679
191 -111679 119157 52527 -135041 32232 79097 -85620 22460 67949 -89226 -16704 125968
202A25968j59522r1313K31845n0403k09396K04225Q0339k50245L1916K14280j00726
213B6968j40542J67535n46j61897J46940N5546j90551M2731J63671q7665j17416
224i5226J14820J9342q2137Q7879k9223j04698J19911O0117j50375j5500J58422
235H3332n6566j14355J29388l451j19924R8884O1158j23658j7694J25739l4082
246B8771r0200Q9020l125p4744P2390J5904p4225J3531N5177l4695j7443N5886
258C6247n9913k4640J09519l7251q9186O3274N4226o7128j3356O6615n4670k0501
270c6764R7213m8466p6347O9250M3530n9193j6508M5988l1652J215N7083o5593
282b0244k3572Q0093j5328n5335L4800L0462o0536J8379O6884p9310k0155R0294
$$ plain form
202 125968 -33554 -124867 106978 56575 -152821 51404 131743 -118502 -86586 127694 26968
213 26968 -113574 53961 53415 -108482 38458 94004 -96547 -53816 109855 22190 -95226
224 -95226 19594 38936 -43201 44678 15455 -89243 30668 90785 -59590 -75090 83332
235 83332 26766 -87589 41799 38348 -81576 17308 78466 -45192 -62886 62853 28771
246 28771 -61429 27591 24466 -50278 22112 38016 -36209 -22678 32499 -2196 -19639 36247
258 36247 -23666 -48306 61213 23962 -65224 -1950 52276 -14852 -28208 38407 -16263 -36764
270 -36764 60449 11983 -64364 4886 48416 -10777 -27285 18703 -12949 -11734 45349 -20244
282 -20244 -43816 36277 20949 -34386 414 30876 -29660 -11281 55603 -23707 -43862 46432
294D6432l0819n9730N4260K7839p7070J6932Q0125o8786l6405P3455r398l8415
306b1580K5187Q844l5987K8180L4645p1584O374P3370m4474l7649M5757R149m0865
319b0633J7943L0771n3654Q925N5535m7807k3075N1142N39m4514J6245L8025l9669
332a0227q136M0662k0231j5126J7959j1r489P765N868k6294J2783K7120k9674
345g031o443J7470j250l070N1J566j0974J2068J5218k8200l66K0622j629q513
359d81q159J0883K674p116M469m037L66k405L368R332j5128n82J0565j806l80
374A563m091J450j395O957N911k0663O551J3952j2880J240N100m387n787P972
388A493N895j5886R918L783k1428J8937J5967k4922j0114K3875L145k2023J7778
$$ plain form
294 46432 15613 -44117 10143 37982 -39088 -22156 57969 -10817 -47222 26233 16835 -21580
306 -21580 3607 12451 -23536 4644 39289 -32295 -25921 47449 2975 -34674 11083 20232 -20633
319 -20633 -2690 28081 -25573 -16648 38887 -8920 -31995 19147 19686 -24828 -8583 29442 -10227
332 -10227 -18363 22299 2068 -13058 4901 4890 -4599 3166 9034 -17260 -4477 22643 -7031
345 -7031 -13474 3996 2746 -324 -273 1293 -9681 2387 17605 -10595 -10961 9661 8032 -481
359 -481 -8640 2243 4917 -2199 2270 -1767 -1401 -3806 -438 8894 -6234 -6816 3749 1943 1563
374 1563 -2528 -1078 -2473 4484 10395 -10268 -3717 10235 -2645 -1405 3695 -692 -6479 1493
388 1493 7388 -8498 1420 5203 -16225 2712 18679 -6243 -16357 7518 10663 -11360 6418
401F418M372l0345J9755K0993k5923p288J9306q293j0937L0405j2400l9047L9213
414F229K0965m2897K761K8520k1726p928M2568k3731m3792N6146J3882o1654K1095
427i562M2622m2780j5449N3440k2136m3237N6212J784o0234M4200L5131o9219
439b9228J371P4208m3434n3212P7330M831p2984M5566L4545p2662J1925P2888
451E1144n7204m2668Q6851j8864p5998P9168K8887j07857K0808J03246n8620o2897
463e4004P7095q513n6268P7959K659j08968N0044R7446q0951m8540Q4938k8889
475D008n4389R6209k605j20286N4026R8570q0886m1229P8762l7869m2672R9950
487E1589j1215j07891N7937P0259q1311j1689P5878n4168l5806J00030k5456r9109
$$ plain form
401 6418 10790 -19555 200 21193 -4730 -12018 7288 -1005 -11942 18463 6063 -32984 6229
414 6229 27194 -15703 -12942 15578 -6148 -14076 28492 4761 -39031 17115 30997 -30657 -9562
427 -9562 33060 -9720 -25169 28271 6135 -37102 19110 20894 -39340 4860 39991 -29228
439 -29228 -27857 46351 2917 -50295 27035 31866 -41118 4448 38993 -33669 -21744 51144
451 51144 -6060 -48728 38123 19259 -56739 22429 51316 -56541 -35733 67513 8893 -54004
463 -54004 23091 14578 -41690 36269 38928 -70040 -19996 77450 -3501 -52041 32897 4008
475 4008 -50381 45828 43223 -77063 -23037 75533 -5353 -46582 32180 -5689 -48361 51589
487 51589 40374 -67517 -9580 60679 -20632 -32321 43557 -10611 -46417 53613 28157 -70952
499g0952P0164N4869q3949M968P0886n6765k7852Q0448l1909o0856P6379J1381
511C6812q5741M1736O2629q0072j3545Q6082m3629n2043P4533n164o4442N7142
523A4298L0106q4929J4995P0717o0562j5040P9119n1590n4692R6664N836j07271
535f2349M2718P9557o9115j1228O0590o7709k1508J10334l0231j01323P0594M3596
547D3926q6949M3127O7892j17523j4161J43956m6865j12564R0497M3095r5353
558d0922M4886N1367j22218J6975J42390p7880r2015J13249j33j16370R0702P5575
570H5606j39264R937J30817r7001p3793J37438j3778j20643J01927N6263j52609
581g5100L1575J36212j06661n5291J45494m6321j34751J24441O8680j52172L0327
$$ plain form
499 -70952 -788 54081 -29868 -24900 45986 -10779 -38631 41817 9908 -50948 25431 36812
511 36812 -48929 -7193 55436 -24636 -38181 47901 4272 -47771 26762 21598 -42844 14298
523 14298 44404 -40525 -25530 45187 -15375 -30415 48704 -2886 -57578 39086 44922 -62349
535 -62349 -19631 59926 -9189 -20417 40173 -27536 -49044 61290 31059 -70264 330 43926
547 43926 -43023 104 67996 -49527 -63688 80268 33403 -79161 11336 54431 -40922
558 -40922 3964 55331 -66887 -49912 92478 14598 -77417 35832 35699 -80671 10031 85606
570 85606 -53658 -43721 87096 -9905 -83698 53740 39962 -80681 21246 77509 -75100
581 -75100 -43525 92687 -13974 -69265 76229 29908 -104843 19598 88278 -63894 -33567
592c3567J20558j16940n1090J41552l3978r9985J13804K6622j44278N4873J00202
603G7773j18144l347J42908q9365j18546J35961M1024j38680N0852R6610j07919
614c0873j5746J08312p0845o0287J30768l708j30952O3992O7032j04626K2165
625b4768J04283q9571o2035J06721j2344q0577Q6750K9239j10910L8668P3411
636E8867r8394p527J18129n1406q3266Q7570N989r8686O5392P1194q9552k961
648b4651P1122o8251k7350J02365k3623p8049O6293Q032q7251O0115O3324r8185
660c6109q43J00333o7860o7144J06351Q208q5766O5358K7848j15069K9096J05730
672G0133p4031m3795R7485l8596q6644R3213K9445j00314N5161P3883j13216j9203
$$ plain form
592 -33567 86991 -29949 -81039 60513 26535 -73450 40354 66976 -77302 -22429 77773
603 77773 -40371 -43718 99190 9825 -108721 27240 68264 -70416 -19564 77046 -30873
614 -30873 -46619 61693 -9152 -69439 61329 57621 -73331 -9339 57693 -46933 -24768
625 -24768 79515 -10056 -72091 34630 22286 -58291 28459 57698 -53212 -14544 58867
636 58867 -39527 -47054 71075 19669 -63597 23973 29962 -68724 -3332 67862 -21690 -24651
648 -24651 46471 -21780 -49130 53235 29612 -48437 17856 25888 -61363 -1248 62076 -36109
660 -36109 -36952 63381 -4479 -71623 34728 42936 -42830 22528 50376 -64693 -35597 70133
672 70133 -3898 -47693 49792 11196 -75448 17765 47210 -53104 2057 75940 -37276 -56479
684e6479J14656n3666o3953J15350j1332j31092P6917Q2517j17943N435J23356
695H3766q5764p9054J26729n200j16250R1594O7689j35710M92J15011p5705m8687
707f1089J23911l0175j11842R4169M3692j23217M5167J11334j08117n2507J24773
718E6099l5847r9055J06401L8231j26921L6122R2183r9907k5074J25521m3137
729B4616r3296R3551K3361j08542M8254Q1886r1312k0145R1514n4413n6654J00637
741C9457j57r6739N9093N3006r6168O475R3723n8802m7228Q7494j9164q1912O9832
754H910M0825q5550J8816O7538o8032k6037Q2478k2752n6627O0443Q351p0197
766d1834L7689M3349o5506O543O4754n4004l5441P3950r394n9339N1312K4095
$$ plain form
684 -56479 58177 4511 -59442 55908 44576 -86516 -9599 72918 -45025 -39590 83766
695 83766 -1998 -81052 45677 40477 -75773 15821 83510 -52200 -51708 63303 -12402 -61089
707 -61089 62822 32647 -79195 14974 58666 -64551 -19384 91950 -16167 -68674 56099
718 56099 20252 -78803 27598 65829 -61092 -24970 67213 -32694 -57768 67753 24616
729 24616 -68680 24871 48232 -60310 -12056 69830 -21482 -41627 49887 -4526 -61180 39457
741 39457 39300 -57439 1654 54660 -41508 -35033 58690 -112 -47340 40154 20990 -60922 8910
754 8910 49735 -35815 -16999 50539 -17493 -43530 38948 16196 -40431 20012 28363 -41834
766 -41834 -4145 39204 -26302 -19759 44995 -9009 -44450 29500 20106 -39233 12079 36174
778C6174o9157J9142N4191n5087j3389O7019l2159m9204N8918P379n9989L7425
790A263L6235o3832M289O0453m4237k9175O6363j3789n8048N1733K2317o9548
802c5976K4535N7562o0946k0456P1171k6012n3756O1919J5039p1902L0714N0838
814D2730o4332q587O9902l5512m4689O4192J319o6105M1935M1219o7296J867O4349
827D0992m4145l5784O7006p877o1446M7449L0749o7966J0930O0438m5826k9376
839c4856O1713j0685n2401M4931K1906n8214J7376M6418m8151j6016N6875j9104
851I792m3438M5031J3226n2467K0343L7785m3585p611M6793k4016k9409M4253
863A6697J460m5687K6238K9299m1637k468L9109k2954k1269L6535m301l3741K5303
$$ plain form
778 36174 -32983 -13841 40350 -14737 -28126 38893 6734 -42470 16448 23827 -36162 1263
790 1263 37498 -26334 -22045 38408 -5829 -35004 31359 17570 -40478 11255 33572 -35976
802 -35976 -11441 46121 -14825 -35281 35890 9878 -43878 18041 33080 -38822 -8108 42730
814 42730 -21602 -30189 39713 4201 -40488 23704 25023 -41082 853 42072 -25224 -23357 40992
827 40992 -3153 -38937 28069 20192 -41254 6195 36944 -31022 -20092 40346 -5480 -34856
839 -34856 26857 16172 -36229 8702 30608 -27606 -10230 36188 -11963 -27979 28896 9792
851 9792 -33646 11385 24611 -27856 -7513 30272 -13313 -20924 25869 1853 -27556 16697
863 16697 18157 -27530 -1292 28007 -13630 -16098 23011 57 -21212 15323 11022 -22719 2584
876B584J5889l3530P316K6505k5624r490L2949r472k6373K3250R634k5487J0742
889a107J6058k4263n69K5897j3694j7261K0823K193j9063J1570R700j9713K986
902f443J7998j3080q113J7230m564j2506J4159K789j6194O691J1903j2164l287
915e581J2422o654p850J2605p66j2403Q465N965j1268J909R299p974m342J0848
929D675r17q725N563L415o657K692M413p382m69Q084k359n682K354R25j372K876
945A434J58m977M14N641K03l400j744K66L583J562k368j222r89M33M541p17p809
962d991J005Q230j564n100K135j145k678P460O73j0160M507Q956r100k598J0746
977F376o111q920J3284L907j4815L423R987j0858j455J2803r113p331J6323k596
$$ plain form
876 2584 18473 -15057 -7741 18764 -6860 -16350 16599 7127 -19246 4004 13638 -11849 -1107
889 -1107 14951 -9312 -9881 16016 2322 -14939 5884 8077 -10986 584 10284 -9429 -6443
902 -6443 11555 -1525 -9638 7592 3028 -9478 4681 7470 -8724 -2033 9870 -2294 -5581
915 -5581 6841 187 -7663 4942 4176 -8227 238 6203 -5065 -3156 6143 -1831 -6173 4675
929 4675 3758 -4967 596 4011 -2646 46 4459 -2923 -3392 4692 2333 -3349 -995 -70 -1442 1434
945 1434 1592 -3385 -2971 2670 2873 -527 -2271 -2005 1578 3140 772 -450 -1439 -1006 3535 2818 -4991
962 -4991 -3986 4244 2680 -2420 -285 -1430 -4108 3352 4025 -6135 -1628 7328 -1772 -4370 6376
977 6376 265 -8655 4629 8536 -6279 -2856 7131 -3727 -5182 7621 -1492 -8823 7500 4904
991D904j6536J2786R353j9380K265K0180j3261j2009J9481j202j6963J3087N661
1004H366j9119Q932J6785k0754o788K4237p956j8734J9723N333k3099J1759J7497
1017A6182k3338m359K3674j0528j2977K1160l069k1664J9076J1898k9639L025
1029a0559K6767j8057j0817K6294r931k2951K5146Q500k9873J0658K2872k4571
1041f522m556K8413j7533j9770L2252O81l2622K1265J8525l4761L531L2073k5244
1054d268j5810L6354p079l1737K9324J2526m0822J3543L3574l4417r996M2348
1066B3540j8160l2119L9400P793m5737K0053L2849m0179n346M3291k5627k7964
1078b8206M5875j859m6805L2581K8629m9101L164M6902l5410k5870N2982o790
$$ plain form
991 4904 -11632 1154 10507 -8873 -6608 13572 311 -11698 7783 6581 -10382 2705 8366
1004 8366 -10753 -1821 14964 -5790 -12578 11659 3703 -15031 4692 10025 -13074 -1315 16182
1017 16182 -7156 -11515 12159 1631 -11346 9814 6745 -14919 4157 16055 -13584 -10559
1029 -10559 16208 -1849 -12666 13628 3697 -19254 5892 14392 -15481 -4823 18049 -6522
1041 -6522 -11078 17335 -198 -19968 12284 12965 -19657 1608 20133 -14628 -11097 20976 -4268
1054 -4268 -20078 16276 9197 -22540 6784 19310 -21512 -7969 25605 -8812 -18808 23540
1066 23540 5380 -26739 12661 20454 -25283 -5230 27619 -12560 -17906 25385 -242 -28206
1078 -28206 17669 15810 -30995 1586 30215 -18886 -15722 31180 -4230 -30100 22882 16092
1090A6092m8047L9027K3364n5623J0261M6300m1772j7067N7478j7942m8227M6020
1102I864J7764n7382J9864M5950m7980j3548N5791k5390m0967N2906R065n7411
1114c1474K7436L8384n3067m389N7635l1236l7742N2863Q28n4000L5307L3655
1126C4200n4497J316N0297l6003k7019N5552n147m8674L6790K1367n4044J1818
1138a4044M5941l9377j6545N0265j9769m1483M5180J4408n0036K0789L5196m5862
1150a5337n779M9477k5507k9348M6127l922m7401L2473K6056m6248Q921M1291
1162C0803l9694j9599N0449j2536l6378M2701P719n3035K2110L5237m4689k12
1174a7124N0937l2700l4621N0053n86m7010L8547K6955n7237O017M7442m0272
$$ plain form
1090 16092 -31955 7072 30436 -25187 -14926 31374 -10398 -27465 30013 12071 -36156 9864
1102 9864 27628 -29754 -9890 36060 -11920 -25468 30323 4933 -36034 16872 25937 -31474
1114 -31474 -4038 34346 -18721 -23110 34525 3289 -34453 18410 19238 -34762 545 34200
1126 34200 -20297 -18981 31316 -4687 -31706 23846 18699 -29975 6815 28182 -25862 -14044
1138 -14044 31897 -7480 -24025 26240 6471 -35012 10168 24576 -25460 -4671 30525 -15337
1150 -15337 -21116 28361 2854 -26494 19633 15711 -31690 783 26839 -19409 -10488 30803
1162 30803 -8891 -28490 21959 9423 -26955 15746 23465 -29570 -7460 27777 -16912 -17124
1174 -17124 33813 1113 -33508 16545 15959 -31051 7496 34451 -22786 -16769 30673 -9599
1186i599j8268N8448j7039n0339M3848J6457n5610K5888M7545n3822j5182N8273
1198C0600k8263l9978O1403P182o4803K9876L7577o1079J530O7193l7228m0787
1210c6777N9739n410o1241M7720L8332o5244N420N6571n0017k9034P0663r728
1222B0994n9120M7981K2963p0163J9346O1674n0673k2423O4354k6359n5455N9105
1234A2224K2806o5309K2641M7693o0235j5696O8374k2133m4081N5477N308o5505
1246c8436L0424M4346n2479k153N6488l8830m0281N7553L158n2103L7842K9188
1258C4717n9947L400N2785l5266k1353N5746j3756n1514L8733K1126m9659J8214
1270f774M2401m5983j7147M8867j8754l0996M6918N147n0599K2738K8556m3711
$$ plain form
1186 -9599 -27867 30581 13542 -36797 7051 23508 -32102 -6214 41331 -12491 -27673 30600
1198 30600 2337 -37641 23762 30944 -33859 -3983 33594 -27485 -25955 41238 4010 -36777
1210 -36777 22962 17552 -43689 4031 42363 -22881 -17461 39110 -10907 -39941 30722 20994
1222 20994 -38126 9855 32818 -37345 -17999 43675 -6998 -29421 34933 8574 -46881 12224
1234 12224 35030 -30279 -7638 40055 -20180 -35876 32498 10365 -33716 21761 27069 -38436
1246 -38436 -8012 36334 -16145 -18298 38190 -640 -40921 16632 19790 -32313 5529 34717
1258 34717 -25230 -21830 30955 -4311 -25664 30082 16326 -35188 3545 24671 -24988 -6774
1270 -6774 35627 -10356 -27503 21364 2610 -28386 18532 23679 -26920 -4182 24374 -19337
1282a9337M658M7129l1750k7514M3670q156l9221L8968K0252m8170R683L5193
1294B5405l7948j0082M9189j6694l5906L7098M576m4607K5754L2238m2053j696
1306a4726M0791l0735k4192M8660j862m2984L0778J9296m9199R588M4372l4740
1318d953j8026M6705j6461m0441M1083J6090m6993J8230L5692m4662j0818N0524
1330B5970j9565l4044M4228L882n0539K5757L2829m4727kM6503l1206k9869M8057
1343A7274q61m5126L2531K5481n0092L937M5010l2462k0961M8031r396m2661L4109
1356D814J9059m5307J2330L8568l6854j5723M4312j4614l4087L8139J0603m4327
1368b3087J6531L1228l6755n889M2248j9893k9008L6887L801l8811K1972K4622
$$ plain form
1282 -19337 -14679 32450 700 -26814 16856 8700 -30521 8447 28699 -19471 -9788 25405
1294 25405 -12543 -22625 26564 9870 -26036 11062 15638 -28969 -3215 29023 -13030 -14726
1306 -14726 26065 -4670 -28862 19798 17936 -25048 5730 25026 -24173 -14585 29787 -4953
1318 -4953 -22979 23726 7265 -33176 7907 23997 -22996 -4766 30926 -13736 -24554 25970
1330 25970 6405 -27639 16589 20471 -30068 -4311 28518 -16209 -16211 30292 -914 -30783 17274
1343 17274 16413 -28713 3818 29299 -20793 -16856 28154 -4308 -25269 22762 13366 -29295 4814
1356 4814 23873 -21434 -9104 29464 -7390 -23113 21199 6585 -27502 10637 21240 -23087
1368 -23087 -6556 24672 -12083 -17972 24276 4383 -24625 12262 16063 -22748 -776 23846
1380B3846l6917j67L4917k3717j9651L6309k859l2899K3489J5868l3838O949K9470
1393B0800k5098j1861L1815j0293k4625K6672P513l0628J2391K1686k6799m535
1405a2962K8927j3932j8312K5332O01k5847J6412J4570k4980K560K2973j7827
1417b485j1137K4948m945k1044J8799Q313k4008P701J7769j9413m513K2238j0683
1430A540j5648K0665K397k1724J1967J3785k1071K23K0835j3668j1091K0733k436
1443F507j8433J4049Q644k0200M871J7235j5901p088K0017o516j5662J6624M656
1456H803j9191Q030J4013j6640l069J8000q383j2218J6593J434j7109R499J0257
1469A0019j6092K67J5264j0274q113J5176j594j3895R772P245j3995K254J2489
$$ plain form
1380 23846 -13071 -13238 21679 -2038 -21689 14620 11761 -21138 2351 18219 -15619 -8670 20800
1393 20800 -4298 -16159 15656 5363 -19262 7410 14923 -15705 -3314 18372 -8427 -12962
1405 -12962 15965 2033 -16279 9053 9654 -16193 219 14789 -10191 -7631 15342 -2485
1417 -2485 -13622 11326 6381 -14663 4136 12449 -11559 -3858 13911 -5502 -10015 12223 1540
1430 1540 -14108 6557 8954 -12770 -803 12982 -8089 -7866 12969 -699 -11790 8943 6507
1443 6507 -11926 2123 10767 -9433 -4562 12673 -3228 -10316 9701 3185 -12477 4147 8803
1456 8803 -10388 -2358 11655 -4985 -8054 9946 1563 -10655 5938 7372 -9737 -238 10019
1469 10019 -6073 -5806 9458 -816 -8929 6247 4653 -9242 530 7775 -6220 -3966 8523
1482H523j0220n212J3521l565j0669J0039L637j2001M160R092r769k856J1107
1495E787m600q118R092J814r241M956N574q603j9Q242n006m607P854K15p115M066
1511B91L559o732P50N784m168k264N370j532m407L754J573m497J532L976l256
1526b67j721L738r88k631K449J078k283O55J360j562p25J466l01j526Q95J136
1542G73p98q67P89M93j028j75J656l06j564J758J111k824L91K296k169j082L511
1559A965r48l590L203J506n079J210M793m039j757O120k289n266N281K250p043
1574c683K735O426o706k532Q310l477o956Q112K108r384M128P095r423j510J0295
1589E538n029p440J0748J182j1784O695P513j2066pJ2461p621p489J2790q69j2765
$$ plain form
1482 8523 -1697 -6909 6612 3047 -7622 2417 6054 -5947 -1787 7305 -2464 -5320 5787
1495 5787 1187 -6931 2161 3975 -5266 -310 5264 -3339 -3358 4884 -122 -4729 3125 3340 -3775 291
1511 291 3850 -2882 -2132 3652 -516 -2780 2590 1058 -3349 405 1978 -2519 -987 2989 -267
1526 -267 -1988 1750 762 -1869 580 1658 -625 30 1390 -172 -897 569 268 -1258 -363 773
1542 773 -25 -892 -103 390 -638 -813 843 537 -1027 731 1842 -982 -591 1705 -464 -1546 1965
1559 1965 1017 -2573 630 2136 -2943 -1733 3060 -979 -2736 3384 1095 -4171 1110 3360 -3683
1574 -3683 -948 5478 -1228 -3760 4550 1073 -5883 2229 4337 -5047 -919 6176 -3247 -4757 5538
1589 5538 509 -6931 3817 4999 -6785 -90 7423 -4643 -4650 7811 190 -7299 5491 4622 -8143
1604h143Q683P361j4119J376J3663j0111p080J5142k742j3709J1607O242j5634
1617g464M125J3779j2666n704J6208n371j3550J4285M676j7063O609J2627j5491
1630e000l058J7053p936j1629J6147J990j7436Q934J1422j6604o06J7468j0664
1643H1r930J6892j394j6280J1894Q351j7512L191J5816j3619p175J8264n069j5030
1657a1520J4900N213j8008P202J3678j6028l318J7881q751j2107J7326R23j8166
1670a0775J0977J0332j8547J809J7487j3250q500J9161m249j6678J5588O878k0090
1683i857O546J5878j7372m361K0997r453j5118J8898K019k0914J1936J4089k0892
1696g604l71K1150j4439j2533K3044j676k1081J6124R860k3911N070K1208j8047
$$ plain form
1604 -8143 540 7901 -6218 -4842 8821 -1290 -8370 6772 4030 -9679 1928 8170 -7464
1617 -7464 -3339 10440 -2226 -7930 8278 2907 -10643 3642 8318 -8745 -2136 10491 -5000
1630 -5000 -8058 8995 1059 -10570 5577 7567 -9869 -935 10487 -6117 -6723 10745 81
1643 81 -9849 7043 5649 -10631 1263 9614 -7898 -4707 11109 -2510 -9685 8579 3510 -11520
1657 -11520 3380 8593 -9415 -2213 11465 -4563 -7881 10000 1249 -10858 6468 7391 -10775
1670 -10775 202 10534 -8013 -6204 11283 -1967 -10467 8694 4445 -12233 3355 10233 -9857
1683 -9857 -3311 12567 -4805 -9166 11831 2378 -12740 6158 8177 -12737 -801 13288 -7604
1696 -7604 -7975 13175 -1264 -13797 9247 7571 -13510 2614 12474 -11437 -6367 14841 -3206
1709c206q769K4443p653k0765K0866P642k5453R694J9367k3314n596K6492j1342
1722B406j8106K4148K515k7119J4183J8286k5128l95K6808j7416j7034K6933r64
1735I117k5618J8964J4089k8757K548K5680j9626j1595K9411o098k6082K1286
1747C319J0946k8242R098K3890k3806r615K7709r743k1137K5041O779k8967J0730
1760c998J9872k4584k995K8648j3587j9524K3915J263k5743J6518J7446k5807
1772h576o58K3909j7144j3208K7228j924k3647J6984R682k5938O515K2823j8657
1785b611r053K3451r335j9615K2253P165k3758J0227J5857k3147k520K4912j1426
1798B400j4274K1619k149k3720J5483J3740k1906L594K0373j9004j0806K4332
$$ plain form
1709 -3206 -11975 12468 4815 -15950 4916 12558 -12895 -3201 16166 -7148 -12744 13748 2406
1722 2406 -15700 8448 10963 -16156 -1973 16313 -8815 -9210 17598 182 -16852 10081 9117
1735 9117 -16501 2463 16552 -12205 -9657 16023 -3603 -15198 14213 8115 -17967 3319
1747 3319 14265 -13977 -4879 19011 -4795 -14410 13299 3556 -17581 7460 14239 -14728 -3998
1760 -3998 15874 -8710 -11705 16943 3356 -16168 7747 9010 -16733 -215 17231 -8576
1772 -8576 -9234 14675 -2469 -15677 11551 9627 -14020 2964 12646 -13292 -6777 16046 -2611
1785 -2611 -11664 11787 2452 -17163 5090 12255 -11503 -1276 14581 -8566 -11086 13826 2400
1798 2400 -11874 9745 7596 -16124 -641 13099 -8807 -5213 15160 -3844 -14650 9682
1810I682m264j8122J9278N636k5667Q056J8772j9109l191K4124j2907j8455K1850
1823E683K972k2068J5061J4533k5140r47K2813j4893j1475K5719l556k4544J6721
1836H79J0842k4197P558K2891k0739j0445K4565p988j9548K3331P616k7554Q258
1849d531J8841k3004l615K8024j1789j9452K2672J935k5531J5644J8536k4839
1861g109k050K3962j6518j4923K7035K39k4955J5728J2056k6071L685K4935j6890
1874h76j1670K4055n965k2753J9904J1301k4301N933J9492k0697q133K5380o623
1887E047j8105J9366M562k4310R278J8027j9148l266K1648j2258j5723K0752K353
1900H223j9871J2649J1713k1074L80J9564j2375r417K0132l735j8889J4130Q328
$$ plain form
1810 9682 5418 -12704 6574 12210 -13457 -5401 13371 -5738 -8929 15195 2288 -16167 5683
1823 5683 8655 -13413 1648 16181 -8959 -9906 12907 -1986 -13461 12258 8702 -15842 879
1836 879 11721 -12476 -4918 17973 -2766 -13211 11354 3366 -16182 7149 14765 -12789 -4531
1849 -4531 14310 -8694 -12309 15715 3926 -15526 7146 9081 -16450 -806 17730 -7109
1861 -7109 -9159 14803 -1715 -16638 10397 10636 -14319 1409 13465 -12606 -8921 16014 -876
1874 -876 -12546 11509 5544 -17209 2695 13996 -10305 -4372 15120 -5577 -13710 11670 5047
1887 5047 -13058 6308 10870 -13440 -4162 13865 -5283 -8549 13099 841 -14882 5870 8223
1900 8223 -11648 1001 12714 -8360 -7980 11584 -791 -10208 9924 6189 -12700 1430 9758
1913I758j8879N724J6046j6283o392J8422o212j3244J6464L471j8732P732J2155
1926A0030j5978m22J7459j0341j0988J6253r83j5403J1823Q763j7135K079J4533
1939I690j2427o503J7763m338j4310J3171M494j6619O454J3264j4307l494J6123
1952H961p762j1505J5469K026j6196Q713R694j5734L11J5587r917q664J5414j834
1966D563j4833J1484P813j5849K920J3949j2431o118J6155m062j2890J2491M555
1979G747j5551M979J1953j2710l423J5018o422j0790J3163K243j4233P155R430
1992H559j2982j043J3507p490q470J2913p1j2902Q279P294j2717J182J1466q536
2006a011o031J2089j886j0494Q799M919j1894K797R764q953l498J1202l667q612
$$ plain form
1913 9758 -9121 -3397 12649 -3634 -10026 8396 2184 -11060 5404 8875 -9857 -2125 10030
1926 10030 -5948 -6370 11089 748 -10240 6013 5030 -10373 1450 10213 -6922 -4843 9690
1939 9690 -2737 -9240 8523 4185 -10125 3046 7540 -9079 -2625 10639 -3668 -7162 8961
1952 8961 1199 -10306 5163 7189 -9007 -294 9400 -6334 -6023 9564 -353 -9017 6397 4563
1966 4563 -10270 1214 9027 -6822 -3902 10047 -2384 -8502 7653 3591 -9299 3192 7747
1979 7747 -7804 -2825 9128 -3582 -7005 8013 1591 -9199 3964 6207 -8026 -871 8559
1992 8559 -4423 -5466 8041 551 -7919 4994 4923 -7979 300 7594 -5123 -3941 7525 -1011
2006 -1011 -7042 5047 3161 -7333 1466 6385 -5509 -2712 7052 -1901 -5399 5803 2136 -6476
2020f476Q934K386j0349M251P398r013j344R558m817o462R016L00q827N342N281
2035E178q411O23P950n713m081P907j179p129N857L289p800J782O278o110k191
2050c750P161k218n336N841J360o665K802M668n702o90O209l076l989N560l4n479
2066c338L362L123n195L55M716l442k557M992q79m228L569J967m521J175L533
2081B632l235j291L879j232k932L159Q54l591J464K213k938m86L160j532j803
2096a679K401L05k507J176J579j962J0J948r55j280J758k38j538J137O29j229
2112d45K45Q75q43k89N07j11l91N48J86n23K20J3O6P8k36L19L11m83j55N20m29
2133a7n28P91K52j032K91Q42j111j51J473q89r32J655j45j580J458O97j821K99
$$ plain form
2020 -6476 2458 4844 -5505 -1254 6144 -2869 -4213 5345 528 -5934 3082 3382 -5445 -103 5178
2035 5178 -3233 -2610 5340 -373 -4454 3453 2274 -4855 1002 4291 -3509 -1727 4551 -1559 -3750
2050 -3750 3411 1193 -4143 1698 3058 -3607 -805 3863 -1839 -2529 3680 604 -3385 2175 2141 -3338
2066 -3338 24 3147 -2048 -1693 3023 -419 -2976 2016 1137 -3091 478 2445 -2076 -901 2632
2081 2632 -603 -1894 1985 753 -2179 980 1834 -1757 -293 1920 -1018 -1504 1656 124 -1679
2096 -1679 722 1027 -1480 -304 1275 -687 -677 1271 316 -964 794 556 -982 155 784 -445
2112 -445 -200 675 -168 -457 50 -61 -452 96 282 -241 -21 -8 58 136 -100 219 530 47 -108 412 -17
2133 -17 -545 246 498 -534 -243 599 -512 -663 810 -79 -1011 644 499 -1081 377 1074 -747 -448
2151d48J718j505q31K063m67j930J826O66k607R08K233k414k36K495j525j640
2167a694K588J78k947K173J766l189K48K993k599j340L505r32k975L022R48l856
2183b111J442K988l511o03M128j916l061M157J65m284K782K600m614M87M430l468
2199c89k357N114j029m853M411J955n765J790M735n189j271O063k494m581N721
2214A861J193o658L237M625o529m92P068m193m380P073j91p328M822M253p667
2229c306P23P709n750m155Q365j296p615O551L548q762K103P449o995l184R086
2244D471k576p508P414K665r468L540P326q363j968R649m265o977Q908J405r682
2259e429M867O572r195p27R844n546o148R412k10r533O186N575r694Q08R191o848
$$ plain form
2151 -448 1270 -235 -1066 997 530 -1400 426 1092 -1515 -607 1626 -788 -1024 1471 -54 -1694
2167 -1694 894 1072 -1875 298 2064 -1125 -877 2116 -483 -1823 1682 750 -2225 797 1745 -2111
2183 -2111 -669 2319 -1192 -1795 2333 417 -2644 1513 1678 -2606 176 2776 -1838 -1351 3079 -389
2199 -389 -2746 2368 1339 -3514 897 2852 -2913 -1123 3612 -1577 -2848 3215 721 -3860 1861
2214 1861 3054 -3604 -367 4258 -2271 -2763 4305 112 -4268 2805 2614 -4714 108 4361 -3306
2229 -3306 -2583 5126 -624 -4779 3586 2290 -5325 1226 4774 -3988 -1885 5564 -1431 -4615 4471
2244 4471 1895 -5613 1801 4466 -5002 -1462 5864 -2499 -4467 5182 917 -6060 2848 4253 -5429
2259 -5429 -562 6010 -3185 -3912 5932 386 -5762 3650 3440 -6093 93 5668 -4026 -3218 5973 -875
2275h75m957J0098j398q904P583L903j0201K487Q430p833l060R862l539p772Q184
2290B008K465r725M341P072r119j317R772n261n770R219m5r440N900N168r270
2305d002J436Q870p049m544R557k224q022Q144K885j0033L228P305q379j700J0202
2320E674m541p157Q909P07r704O246O420r963J57R432p165m994J0827j533r408
2335f093P243L945j0845K962R752q686l373J0790m308q796J0031L026j1140M602
2349h90P853j0809j546J1938n568p602J0906j14j1787P051P671j1057M13J1111
2363G570q439o807J2301r04j0619Q877N035j3007K307J1010q893m204J2524l853
2377B898j1046R748M179j1818M524R862j1383l498J2279m673q345J1395J953j2836
$$ plain form
2275 -875 -5832 4266 2868 -6036 1547 5450 -4751 -2264 6166 -1667 -4727 5135 1596 -6176 2008
2290 2008 4473 -5252 -911 6161 -2958 -4275 5497 236 -5534 3685 3640 -5800 100 5268 -4002
2305 -4002 -2566 6304 -745 -5289 4268 2044 -5978 2166 5051 -4982 -1754 5551 -2828 -4528 5674
2320 5674 1133 -6024 2885 3592 -6112 134 6554 -3409 -3252 6180 -985 -5979 4848 3315 -6093
2335 -6093 1150 5095 -5750 -2788 6964 -1722 -5095 5695 1387 -7409 2622 5648 -5492 -890
2349 -890 6963 -3846 -5392 6546 978 -6624 4282 4168 -7619 -568 7103 -3954 -3541 7570
2363 7570 -869 -7676 4625 3721 -6898 1979 7014 -5993 -3686 7324 -1569 -5773 6751 2898
2377 2898 -8148 1600 5779 -6039 -1515 8347 -3036 -6534 5745 1072 -7273 4122 6075 -6761
2391f761N176Q236j0484m88J2285p042q265J0818Q7j0873Q166O679j1897K79J0254
2406F170p629n024J2253j730j0514P534M132j1150L802R818q912l881J0338m480
2420G27p969J0181K662j0703M205O825j0072n91J1090n425o469R406j055r838
2434g026P137O007r616J243Q460q015m260J0702j849q102P688K415j0685L557
2448b344Q159p903j698R437n057p347R247J550r153N699N598r936l45R551n850
2463c92m634R802j769r465O842M458r354K642Q629q300m022R937k847p601Q897
2478B823K362j0416L675P152q526j171J0195m872p242Q968O22r570O084O359r898
2493c455l28R110o187m824R929p10r148O297M329r632K077Q896p173l961R265
$$ plain form
2391 -6761 -1585 6651 -3833 -4321 7964 922 -7343 3475 3562 -7311 855 7534 -4363 -4084 6170
2406 6170 -1459 -6483 5770 4040 -6474 1060 5192 -5958 -2156 7662 -1250 -5131 5207 727
2420 727 -7242 2939 5601 -5102 -897 5928 -4144 -4735 6355 930 -5539 3867 2812 -7026
2434 -7026 111 6118 -3498 -2255 6205 -1810 -6070 4632 2783 -5319 2369 4784 -5901 -2344
2448 -2344 5815 -2088 -3786 5651 594 -6753 2494 4044 -5109 590 6188 -3748 -4093 5458 -392
2463 -392 -5026 4776 3007 -6458 384 4842 -4512 -1870 6759 -1541 -5563 4374 1527 -6074 2823
2478 2823 5185 -5231 -1556 5596 -2930 -4101 6094 1222 -6020 2948 3570 -6000 84 6443 -3455
2493 -3455 -3783 5327 -860 -5684 4245 3535 -5613 684 5013 -4619 -2542 6354 -819 -4780 4485
2508D485k736p872P813L329r395K774P088p860k302R558l551o595P718J302q996
2523e240M382O215p906p28Q169m724n375Q160J66p847N046M284q221Q73P517n334
2539e63l496P643j713o761N710L022p199K109O078o308k001P132k731n181O321
2554B062J152p012L112M639o077n52O545l853l883O180j81o025M417L168o344
2569b652Q90N493m418k489O096j534n107M721J851n844J979M580n034j114N555
2584B973k521l880N154O02n307K905L419n185j81N181l249k967N231n39m725L463
2600C74K353n055R83M202l631j855M997j316m082L869J520m776J586L699l875
2615a007r44M375j821l224L832N56m163K120K733l912j29L810k265k256L694j44
$$ plain form
2508 4485 1749 -6123 1690 5019 -4376 -1602 5486 -2374 -4676 4882 1331 -5264 2454 3756 -5240
2523 -5240 -858 5357 -2549 -3277 4892 168 -5207 2953 3119 -4728 318 4602 -3619 -2746 4771 -563
2539 -563 -4059 3584 1871 -4890 820 3842 -3357 -1248 4830 -1478 -3479 3653 922 -4259 2062
2554 2062 3214 -3798 -686 3953 -2124 -2676 3869 16 -3867 2313 2132 -3893 524 3692 -2652
2569 -2652 -1762 3731 -687 -3176 2920 1386 -3721 1000 2851 -2993 -1014 3566 -1468 -2582 2973
2584 2973 452 -3428 1726 2328 -2979 -74 3345 -1840 -2021 3160 -89 -3056 2175 1636 -3089 374
2600 374 2727 -2328 -1345 2857 -774 -2629 2368 1052 -3030 839 2359 -2417 -831 2868 -1007
2615 -1007 -1951 2424 603 -2621 1211 1767 -2396 -276 2457 -1455 -1584 2226 -39 -2295 1399 1255
2631A255l367K288J863l497M48L140k405j600L551p64k938K494J152l215R39K386
2647A730k259p67K729j122k165K499L60k517J452J643k299o3K299j701j199K320
2663I40j32k055J503Q41k068M40J668j559n37J901o51j367J385M69j700P29J164
2680I71j335k51J614q17j012J256P0j312P74O57j096m4J098o54p11J096k1q11
2698e28O33M64r40K52N79n02j45M10ol84K15J83k82k39M05o5k91K67N7r5j02J79
2720F5j06j17J16L24k96k45N50j40m96L29M60o77RO39l40o42P92O6r19M72Q30
2741F74j178R0J151o84q14J213K9j256P90J036j618L9J581j082j036J884l44j667
2759a192J264R88j986K80J826j399r34K196l67k050J698J022k569P22K021j908
$$ plain form
2631 1255 -2112 176 2039 -1458 -1010 2130 -275 -1875 1676 912 -2026 468 1620 -1595 -656 1730
2647 1730 -529 -1296 1433 311 -1854 645 1005 -1512 -60 1583 -716 -779 1520 -181 -1380 940
2663 940 808 -1247 256 1097 -971 -531 1137 -422 -959 942 291 -1076 309 778 -922 -193 971
2680 971 -364 -615 999 182 -830 426 496 -816 -42 615 -481 -525 573 -81 -792 304 283 -528
2698 -528 105 569 -371 -119 460 -42 -187 223 217 -167 48 231 -51 -290 115 50 -241 26 83 -12 -114 65
2720 65 -41 -158 -42 282 -14 -259 291 151 -345 -16 444 -233 -224 415 75 -567 225 291 -628 -156 674
2741 674 -504 -414 737 53 -761 452 481 -775 15 1051 -567 -528 1053 -29 -1065 819 475 -1192
2759 -1192 72 1060 -926 -646 1180 -219 -1153 1043 676 -1374 324 1346 -1223 -501 1520 -388
2775c88r15K555q15k040K053Q32k736J074K070k407m05K553j219j867K499L72
2791A216k781J416J882k700j32K807j801j662L002l19k795K066J441l029N58K697
2807A866k207j172L014q52k473K551R24l230J154K343k828l89L081j606k198K978
2823I56K48l116J929J869l224M05L064k346j756L447m95l056K628J211l621J223
2839f34K858l009q59L666j645k756L354N20l688J964K543l778l6L813k239k483
2855b409M191l33l987K842K139m285Q15L754l275j796M509j242l749L546J565
2870B285m651J407L793m070r00M752j896l555M236O26m703K444L267m614l82M710
2886B749k796l029M982o5m897L254K666n094O79M788l431k628N183j127m559L986
$$ plain form
2775 -388 -1303 1252 437 -1603 450 1282 -1454 -380 1690 -717 -1122 1431 212 -1655 844 1216
2791 1216 -1565 -149 1733 -967 -1099 1708 -93 -1755 1247 928 -1867 199 1640 -1389 -831 1866
2807 1866 -341 -1513 1501 649 -1824 727 1651 -1579 -425 1918 -910 -1299 1782 176 -2022 956
2823 956 1204 -1912 17 1886 -1338 -933 2131 -215 -1971 1476 981 -2075 553 1764 -1857 -634
2839 -634 2224 -785 -1644 2022 377 -2379 975 1495 -2193 -229 2314 -1464 -1500 2313 74 -2409
2855 -2409 1782 1449 -2538 304 2443 -1842 -1027 2727 -548 -2344 2165 923 -2826 720 2285
2870 2285 -2366 -959 2834 -1236 -2136 2616 720 -2835 1401 2027 -2676 -232 3035 -1579 -1961 2749
2886 2749 -47 -3076 1906 1841 -3056 198 2864 -2230 -1551 3237 -194 -2822 2361 1234 -3325 661
2902F61K150n092J174M245m280j573N424j688m140M445J014n281K126M003m433
2917a245q52N075k637l735M870O07m746K781K976m997m8M868k833k715M869p42
2933A496m832L562K307m615J137M028l897j861M898j386l713M284J103n075J756
2948h08L482m106l41M701k546l439M343K55m334L094K722m723j4M288l160k011
2964b597M988j100m182L463J606m667J612M172m093j345M530k093l456M636Q82
2979B356m859K233K806m536k1N018k629l021M611n00m793L727K676m898O78M192
2995C040l929k090N279r48m241L993J335n296J582M446m120j194N181k469m021
3010c452M581J099m768K376L326m945n36N097k654k980M939k0n261K915K959m569
$$ plain form
2902 661 2811 -2281 -1107 3138 -1142 -2715 2709 1021 -3119 1326 2340 -2941 -815 3188 -1245
2917 -1245 -2097 2978 341 -3394 1476 2083 -2663 118 3094 -1903 -1951 2917 84 -2631 2238 1496
2933 1496 -3336 226 2533 -2082 -945 3083 -814 -2675 2223 837 -2876 1408 2511 -2564 -808
2948 -808 2674 -1432 -1773 2928 382 -3057 1286 1541 -2793 301 3023 -1700 -1714 2574 -586 -2597
2964 -2597 2391 1291 -2891 572 2178 -2489 -877 3295 -798 -2143 2387 294 -3162 1474 2356
2979 2356 -2503 -270 2536 -2000 -2021 2997 368 -2653 1958 1458 -3335 392 3068 -1830 -1152 3040
2995 3040 -889 -2979 2300 1352 -2889 1104 2439 -2857 -1275 3171 -949 -2143 3038 569 -3452
3010 -3452 1129 2228 -2540 -164 3162 -1783 -2319 2778 124 -2856 2083 2063 -3198 -283 2676 -1893
3026a893M64M778l713k659M794n04m116L740J943n057R27L991l593j391M985j580
3042A116m024L737J109m538K120L444m129r17M326k106k959M363N46m447K197
3057a62K493m062K76M205k708k357L945o59l773L215K023m150Q12L299l387j127
3073b117M148j141l069L128P28l925J750L019l467m02L471k205k492L896L3l414
3089b059K159K060l826L83L475k366j746L627p06l467L044J446l743J154L050
3104B485l289j149L695j258k664L166N72l671J644K577l212k00L416k013k163
3119b064L310r2l094K148J899l500L17L080k328j511L383m83l094K371J348l287
3135a597Q84K670k533j049L232j123k337K761O28l077J171K093k688k84L053j546
$$ plain form
3026 -1893 -1429 3349 -364 -3023 1771 1267 -2849 891 2834 -2223 -1296 2695 -898 -2289 2696 1116
3042 1116 -2908 829 1938 -2600 -480 2964 -1165 -2082 2244 138 -2821 1542 2088 -2359 -162
3057 -162 2331 -1731 -1455 2750 42 -2315 1630 971 -2802 413 2436 -1714 -902 2397 -990 -2117
3073 -2117 2031 890 -2179 949 1677 -2248 -498 2521 -946 -1348 2123 -82 -2574 1322 1355 -2059
3089 -2059 100 2160 -1666 -1283 2192 -174 -1920 1707 1001 -2466 578 2024 -1719 -565 2485
3104 2485 -804 -1953 1742 484 -2180 986 1558 -2113 -469 2108 -1104 -1304 2112 99 -2064
3119 -2064 1246 1154 -1940 208 2107 -1393 -1076 2004 -324 -1835 1548 1065 -2029 342 1690 -1597
3135 -1597 -713 1957 -576 -1625 1607 484 -1853 908 1536 -1541 -370 1723 -965 -1249 1804 258
3151B58k049K659K62k731J424J897k790RK673j633j436K461k28k331J850J190
3167A485k674O03K207j938q75K364p64j874J848O75k372J011J640j889m61K245
3183A231j056j386J952J05k105J251J145j923R4J935j303j019J966l59j631J266
3199A63R35k088N67J554j497n31J756n84j342J480M09j681Q17J117j621l8J550
3216I66q80j038J499M4j561R48P55j293J42J305j070n78J315j35j268J214L71
3233G36j294M47Q22r17l17J154n02p84R47J41j069M76P87q73j97J010m49q49J050
3252C19N1q93N47M82p07j6P08m72m97Q33j78n99M41L21o12J48N33n42k70N45o8
3273G4m14M58K54n24Q0M54n45J42L59k66k10J76J21l11N7J25j07l2K72k19m3J24
$$ plain form
3151 258 -1791 868 1130 -1601 -177 1720 -1070 -1061 1612 -21 -1457 1004 776 -1555 295 1485
3167 1485 -1189 -586 1621 -317 -1192 1172 408 -1466 382 1057 -1315 -304 1336 -553 -1014 1231
3183 1231 175 -1211 741 846 -1259 -8 1137 -786 -692 1243 -60 -1079 887 528 -1103 163
3199 163 1098 -990 -423 1131 -366 -897 859 275 -1067 413 822 -859 -42 1075 -546 -584 966
3216 966 86 -952 547 591 -970 -22 733 -560 -418 887 -183 -761 554 419 -849 365 736
3233 736 -558 -111 711 -206 -523 631 129 -655 292 433 -636 -160 627 -246 -443 567 118 -731 319
3252 319 370 -523 24 506 -201 -217 491 19 -478 355 177 -422 19 340 -272 -124 409 -133 -403 142 74
3273 74 -340 118 372 -152 -72 382 -163 -21 338 72 -138 38 159 -152 -95 30 -77 -109 163 -56 -99 25
3295B5O1M6J4j43J6p1M3QN7j70J54Q5r9p6K8P2j75K34m6j66j7J69o7NK95r9k81
3322i8J63N1k92J53K33l06j5L64k51j65M67k15l93L18K36m93K14L20m73j74O85
3343C29l03l19N94p2n65L57M40o64n2P78o02l45P51j69o67M79M11p38K14O83q60
3364c20j63R73k83r33J055N1q10L56P05r47q0J046n06p96J116q9j108Q13N54j109
3384d75j4J271q48n85J363k88j283J101M56j459M47J254j263l49J291m08j201
3401i90J372L41j561O28J090j301k74J611p51j152J569O1j484Q44R36j466j32
3418f59J615r83r47J594R5j754J152R00j715J71J612j211p73J696k09j706J464
3435C42N80j831O06J469j595m12J712p02j292J538L49j739P61J236j646k22J995
$$ plain form
3295 25 86 132 146 3 19 -52 -9 -1 56 -114 40 125 26 -50 -22 50 -125 109 63 -103 -120 49 -18 -13 282 183 -98
3322 -98 65 116 -176 -23 210 -96 -111 253 2 -163 304 89 -304 14 250 -243 -29 291 -182 -356 329
3343 329 26 -293 301 229 -336 21 461 -203 -255 523 -79 -424 327 158 -509 -30 381 -357 -143 540 -320
3364 -320 -483 490 207 -726 329 380 -430 -74 631 -316 -396 650 144 -652 464 375 -733 80 634 -475
3384 -475 -489 782 -66 -651 712 424 -859 242 698 -761 -314 940 -323 -672 619 211 -990
3401 -990 382 723 -838 -210 880 -421 -695 916 165 -987 582 643 -841 3 939 -527 -659
3418 -659 956 -27 -974 620 715 -1039 113 1013 -702 -531 1081 -130 -903 793 584 -1122 342
3435 342 922 -909 -303 1166 -429 -841 871 169 -1123 415 764 -975 -214 1022 -624 -846 1149
3452A149j052j231J736N8j717J235R56j776R2J661j332o80J831n63j428J430M33
3469H02j932Q70J450j674k07J841j052j401J961J14j888J181J283k194P9J985
3485A218j297q97J895l78j857J544O91j887N43J671j634p37K186p51j611J964
3501F63M70k244Q54J635k180j5K118j198j410K019L4k231J525J287k247Q1K042
3518A203j480r08K363m44j987J561R56k402O05K153j983q73K375q01j802K087
3534F23O50k511R74J677k230l58K535j112j471K041P6k480J546J540k287j9K221
3551A415j549j327K392r9k155J639R89k635O09K216j778p25K209q36j823J856
3567C98P07k172R45J546k037n87K312p67j658K129Q1k265J081J635k086P1K104
$$ plain form
3452 1149 97 -1134 602 660 -1057 178 1134 -642 -550 1111 -221 -901 930 367 -1061 369 802
3469 802 -1130 -260 1190 -484 -691 1150 98 -1303 658 772 -1116 65 1348 -846 -767 1218
3485 1218 -79 -976 919 541 -1316 228 919 -968 -425 1246 -388 -1125 1061 310 -1301 663
3501 663 1133 -1111 -257 1378 -802 -817 1301 103 -1307 712 746 -1485 40 1327 -920 -839 1203
3518 1203 -277 -1185 1178 734 -1253 308 1264 -1138 -533 1620 -363 -1236 1139 338 -1464 623
3534 623 1273 -1238 -264 1413 -817 -1175 1360 248 -1223 818 894 -1586 -40 1500 -787 -806 1415
3551 1415 -134 -1461 931 832 -1323 316 1305 -1330 -721 1495 -283 -1008 1201 365 -1458 398
3567 398 1105 -1067 -122 1424 -613 -1200 1112 345 -1313 816 897 -1368 -287 1348 -738 -667 1437
3584A437j482j301K085o7j916J670P64k204L86J844j509q09K106m29j944J659
3600B90N25j890R88J494j860m80K022j053j186K010rj984J129J093k003L27J807
3617A220j381j005J984m86j667J620R12k133M93J600j853k93K184p39j568J737
3633F25J86k087J187J529k020j19J820j235j242K135M4k077J435R44k209L94J880
3650A190j283q18J926m81j915J688Q05k046P07J614j984n70K115o63j484J780
3666E81L04k128R32J507j752p1J667j034j209J785J90j899J297R35j809J14J671
3683A081j287p83J807k49j743J383O83j646L18J610j538n01J755o21j226J467
3699E10L02j726P68J055j372l25J663q19j057J441N0j519J034Q46j417J29J350
$$ plain form
3584 1437 -45 -1346 739 672 -1244 426 1190 -1014 -628 1216 -293 -1102 1004 575 -1369 290
3600 290 815 -1075 -87 1407 -453 -933 1089 36 -1150 860 851 -1133 -4 1089 -914 -587 1220
3617 1220 -161 -1166 818 332 -1335 285 1197 -936 -443 1157 -696 -989 1195 456 -1112 625
3633 625 811 -1276 -89 1440 -580 -699 1121 -114 -1356 779 823 -1254 181 1125 -1084 -690 1190
3650 1190 -93 -911 1015 534 -1381 307 1112 -934 -227 1387 -597 -1167 948 285 -1199 581
3666 581 885 -1243 -311 1196 -556 -627 1040 6 -1203 582 772 -1127 170 1105 -704 -590 1081
3683 1081 -206 -989 818 569 -1174 209 892 -754 -436 1174 -364 -865 890 269 -957 510
3699 510 812 -914 -146 909 -463 -788 875 56 -1001 440 490 -1029 5 851 -566 -437 913
3716I13j054o80J478k74j138R81M84j430M71J251j256l98J305l97j040J141K12
3733E69j319P89Q18j317m6J276p83p23J318j85j114Q70O24j406L26J115r85m15
3751e88J152l88q88R52N62j359K87J034j028k62J113m62p78J044K5j105O23P42
3769F76j046k8J122q33n19J061j44r62O61N94j122K67Q42o41m74R93l38q18Q68
3788A59L87j004M13O02p76k37R29l71n83O78J67r21L90O11o88J9O97n57l26Q04
3808C93j7q53N76K81o45O4O38o15k03N93n2n18M72J41n68J12N41n36m8N49l19
3829a4l24N57L1n42L15L28o30R3M77l69j68N04j50m26M45J6k68mL01l17J4L41
3851B10j16l47L57q4k30K94J46k83j08L84k42q2K12l1k17J76J87l53j2L23k54
$$ plain form
3716 913 -141 -821 657 383 -755 226 710 -720 -249 1002 -254 -652 653 256 -784 357 569
3733 569 -750 39 857 -460 -506 770 -13 -736 582 397 -717 153 777 -629 -303 812 -173 -588
3751 -588 564 176 -712 240 802 -557 -270 764 -264 -526 587 125 -653 391 416 -689 -66 676
3769 676 -370 -398 724 -109 -628 433 289 -673 -12 582 -540 -273 569 -72 -546 447 109 -709 159
3788 159 546 -458 -45 557 -219 -456 473 102 -481 197 364 -557 -167 444 -244 -225 472 -85 -411 393
3808 393 376 -477 99 380 -265 -201 437 -178 -381 212 160 -358 114 255 -313 -201 340 -196 -244 305 -14
3829 -14 -338 219 250 -292 23 351 -279 -186 291 -78 -246 258 108 -318 127 143 -125 -129 172 -145 -131 210
3851 210 94 -253 104 20 -210 84 230 -53 -161 223 -19 -101 111 80 -137 39 226 -127 -139 184 -70
3872g0MJ60Kj31J00Qk01J27J60j83o4R1J08j25L1j32j6J64j05Q8q8L8J41o7J2
3897E2m5R7j19l2J53j5k36K25Pk67J54J16k46O9J09K3k46K78k0k79K27J55j69
3920in8K48j92j11K07J9k44Q2K63k81j23N39l00l21L82J0l01K04J79m43P6M58
3942B84k94j37M35j90k94K97Q5m17J53M37l68l02N33l17l92O57J8m26K27L77n25
3963a59j6O03l01l62N95j53m56L67K48p31J44M69l85j14N54Lq64P32J15o76L61
3984b6K24l67N9N00l34l98O51j22o56M92L50p00J4O33l52m24Q17k80n59O88P7
4005B87n99K82M56o50j23Q71m65n02P53k1o87L50N43q31N3Q36n51m56Q68j49r36
4026f71Q00L91r73K80Q09q81k10Q99k50p81Q97J73j153N91P18r52j85J147o04
$$ plain form
3872 -70 -66 94 96 -35 65 73 -128 -1 159 -24 -88 3 111 -14 17 -115 -131 33 -72 16 -72 -34 107 40 52
3897 52 7 104 -15 -47 106 91 -145 80 87 -180 -26 90 -156 -87 22 45 -201 77 57 -222 5 160 -9
3920 -9 -67 181 -11 -122 85 104 -140 -58 205 -76 -199 340 40 -281 101 111 -190 14 193 -250 -174 284
3942 284 -10 -147 288 98 -196 101 186 -231 -78 359 -9 -311 222 -95 -487 170 188 -238 -11 366 -159
3963 -159 -175 428 127 -235 360 207 -249 118 366 -365 -221 248 -137 -251 303 306 -558 174 289 -387 -26
3984 -26 198 -169 -110 390 56 -342 309 187 -469 23 373 -327 -313 320 -32 -456 361 81 -478 210 287
4005 287 -312 -30 426 -224 -347 524 59 -443 310 289 -398 -48 495 -336 -283 553 2 -454 414 265 -671
4026 -671 129 520 -453 -173 636 -245 -455 444 194 -587 310 483 -670 -79 639 -313 -498 649 45
4045D5q27J168O2j175O43P36j137J97P58n07n07J070k18j090Q82N18j075K64R69
4064G76j089k86J158m41q49J077K03j196N00P78j100N9J145p06o56R99M2j136
4082g22P72N50j013J9J047q51m13J187l18r42Q82L10j162M34Q89r66j68J061m60
4101A36q42J012L06j264O04O54j062J5J245p76p08J131j57j037Q65N10j021J47
4119b42J081j000k90J071l74q85Q87K78j122L64R76j037j24J203p95p55J179J12
4137E27j274Q25N86j110j50J324p43n31J167k23j158R17M88j334N37J026j224
4154c50l19J246m66q47J168L19j521N67R53j110q8J233p37q52J293j82j135R78
4172A50O43j232M5J077q96m75J408l38j273J020M39j328N43J187j212l07J159
$$ plain form
4045 45 -782 386 448 -727 -84 652 -485 -288 470 -37 -544 526 308 -782 100 618 -457 -193 776
4064 776 -313 -599 559 118 -731 346 549 -647 -147 631 -469 -410 735 29 -627 372 414 -722
4082 -722 50 600 -413 -394 653 -198 -611 576 258 -684 198 508 -654 -220 669 -297 -465 596 136
4101 136 -706 306 612 -652 -48 606 -456 -441 804 28 -680 451 294 -743 122 632 -389 -242
4119 -242 839 -161 -451 620 246 -639 248 526 -596 -232 744 -293 -417 786 -9 -764 415 527
4137 527 -747 78 664 -446 -596 728 -15 -546 621 398 -760 157 645 -689 -152 874 -350
4154 -350 -669 577 111 -736 432 751 -770 -203 750 -360 -448 785 48 -804 489 307 -828 150
4172 150 793 -439 -394 683 -213 -688 720 382 -891 129 568 -760 -217 970 -242 -549 610
4189F10n34j005J415J17j214M90Q74j154j26J293p33o73J193k52j088Q15Q23j295
4207d44J25J117r43n15J195k65r66J027K00j212M49R47r70k41J156o03q56J049
4225B50K99j214O64N91j012q4J133n99p63J277j28j023O86N88j229K76R29o56
4243a5m93J004l64q51J047K54j142L69Q29r72j26J102n25p51Q69P0j012P08O16
4262F17j034%J048p39n92J190k5r85O77K73r53M01Q34q67k88R67m08p73Q60K55
4282D58q46L71O11r87p5J074n27o38J014j01r72O25O21j057N7Q59n09m37R04j46
4302B99q86Q19K59r40L77P47r02k56J003m47o19P88J98q98M23N78p89j32Q46n19
4322e1m89R27j91o97O49L50q80K33O23o57k19O90j50o72O21L86j017M61N62p34
$$ plain form
4189 610 76 -929 486 603 -611 -121 753 -401 -527 766 33 -640 553 301 -787 28 851 -444
4207 -444 -319 798 -145 -660 535 270 -696 331 531 -681 -232 715 -255 -496 660 57 -799 250
4225 250 549 -665 -1 590 -422 -506 627 28 -735 542 414 -609 77 665 -564 -288 641 -15
4243 -15 -508 496 132 -719 328 582 -560 -191 638 -334 -460 642 117 -634 235 305 -707 1 617
4262 617 -417 -417 631 -108 -700 490 465 -520 157 430 -523 -122 712 -155 -443 524 116 -657 203 458
4282 458 -388 -17 594 -393 -468 606 79 -559 455 354 -618 7 628 -429 -372 487 -22 -459 445 299
4302 299 -587 232 491 -449 -72 675 -227 -483 520 73 -546 242 440 -458 -35 543 -246 -378 468 -51
4322 -51 -540 387 196 -501 148 498 -382 -149 474 -183 -402 288 138 -534 87 473 -544 -83 479 -255
4342b55J8N90j22p24Q69j28o77L66M31n87l6O41m84l18P51r1o98M59M09p37K09
4363a14N26l93k70N38j91m36M99L3o24K79M47m27j09O47l02n82O85O2n34L20K51
4384C05m03j70O40m54j94N64j27m28L91J45n15J76L12k70j08M14k32m13O11j16
$$ plain form
4342 -255 -237 353 231 -493 376 248 -429 -63 368 -219 -255 386 -98 -416 335 244 -454 5 414 -323 -114
4363 -114 412 19 -251 287 96 -340 159 192 -432 -153 294 -133 -242 405 103 -479 206 268 -266 54 305
4384 305 -98 -268 372 -82 -276 288 161 -267 124 269 -246 -70 242 -28 -136 278 46 -367 244 128
$$ [...]
8191E6
##END NTUPLES=NMR FID
##END=
