##TITLE=1H_Pr 5g-Dep
 200.13Hz, CDCl3.
 8 sc
 
19.3.2026
##JCAMPDX= 6.0         $$ Bruker NMR JCAMP-DX V2.0
##DATA TYPE= NMR FID
##DATA CLASS= NTUPLES
##ORIGIN= UXNMR, Bruker Analytische Messtechnik GmbH
##OWNER= pz
$$ XWIN-NMR		Version 3.5
$$ Thu Mar 19 15:41:22 2026 Russian Standard Time (UT+4h)  she@DPX200
##.OBSERVE FREQUENCY= 200.1313
##.OBSERVE NUCLEUS= ^1H
##.DELAY= (6, 6)
##.ACQUISITION MODE= SIMULTANEOUS
##.ACQUISITION SCHEME= undefined
##.AVERAGES= 8
##.DIGITISER RES= 18
##SPECTROMETER/DATA SYSTEM= spect
##.PULSE SEQUENCE= zg30
##.SOLVENT NAME= CDCl3
##.SHIFT REFERENCE= (INTERNAL, CDCl3, 0, 14.3821)
##AUDIT TRAIL= $$ (NUMBER, WHEN, WHO, WHERE, WHAT)
$$ ##TITLE= Audit trail, XWIN-NMR		Version 3.5
$$ ##JCAMPDX= 5.01
$$ ##ORIGIN= Bruker BioSpin GmbH
$$ ##OWNER= she
$$ F:/spectra/data/she/nmr/H-C/1/audita.txt
$$ ##AUDIT TRAIL=  $$ (NUMBER, WHEN, WHO, WHERE, WHAT)
(   1,<2026-03-19 15:40:05.45 +0400>,<she>,<DPX200>,
      <created by zg, POWCHK disabled, PULCHK disabled
       configuration hash MD5:
       00 E9 B6 7A A2 85 ED C7 34 08 36 98 17 FE 4E 26
       data hash MD5: 16K
       4C E6 05 AC DA 03 DA 54 84 0F F9 08 E2 5A 63 CE>)
$$ ##END=
$$ 
$$ hash MD5
$$ 54 F4 20 2C 30 23 1E 75 81 51 BF F0 5F EA C6 20
##$RELAX= 
##$RELAX= 
##$RELAX= 
##$RELAX= 
##$RELAX= 
##$RELAX= 
$$ Bruker specific parameters
$$ --------------------------
##$DU= <F:/spectra>
##$EXPNO= 1
##$NAME= <H-C>
##$PROCNO= 1
##$TYPE= <nmr>
##$USER= <she>
##$AMP= (0..31)
100 100 100 100 100 100 100 100 100 100 100 100 100 100 100 100 100 100 
100 100 100 100 100 100 100 100 100 100 100 100 100 100 
##$AQSEQ= 0
##$AQ_mod= 1
##$AUNM= <au_zg>
##$AUTOPOS= <>
##$BF1= 200.13
##$BF2= 200.13
##$BF3= 200.13
##$BF4= 200.13
##$BF5= 200.13
##$BF6= 200.13
##$BF7= 200.13
##$BF8= 200.13
##$BYTORDA= 1
##$CFDGTYP= 0
##$CFRGTYP= 5
##$CHEMSTR= <none>
##$CNST= (0..31)
1 1 145 1 1 1 1 1 1 1 1 1 1 1 1 1 1 1 1 1 1 1 1 1 1 1 1 1 1 1 1 1 
##$CPDPRG= <>
##$CPDPRG1= <>
##$CPDPRG2= <>
##$CPDPRG3= <>
##$CPDPRG4= <mlev>
##$CPDPRG5= <mlev>
##$CPDPRG6= <mlev>
##$CPDPRG7= <mlev>
##$CPDPRG8= <mlev>
##$CPDPRGB= <>
##$CPDPRGT= <>
##$D= (0..31)
0 0.7 0 0 0 0 0 0 0 0 0 0.03 0 0 0 0 0 0 0 0 0 0 0 0 0 0 0 0 0 0 0 0 
##$DATE= 1773920404
##$DBL= (0..7)
120 120 120 120 120 120 120 120 
##$DBP= (0..7)
150 150 150 150 150 150 150 150 
##$DBP07= 0
##$DBPNAM0= <>
##$DBPNAM1= <>
##$DBPNAM2= <>
##$DBPNAM3= <>
##$DBPNAM4= <>
##$DBPNAM5= <>
##$DBPNAM6= <>
##$DBPNAM7= <>
##$DBPOAL= (0..7)
0.5 0.5 0.5 0.5 0.5 0.5 0.5 0.5 
##$DBPOFFS= (0..7)
0 0 0 0 0 0 0 0 
##$DE= 6
##$DECBNUC= <off>
##$DECIM= 32
##$DECNUC= <off>
##$DECSTAT= 4
##$DIGMOD= 1
##$DIGTYP= 9
##$DL= (0..7)
0 120 120 120 120 120 120 120 
##$DP= (0..7)
150 150 150 150 150 150 150 150 
##$DP07= 0
##$DPNAME0= <>
##$DPNAME1= <>
##$DPNAME2= <>
##$DPNAME3= <>
##$DPNAME4= <>
##$DPNAME5= <>
##$DPNAME6= <>
##$DPNAME7= <>
##$DPOAL= (0..7)
0.5 0.5 0.5 0.5 0.5 0.5 0.5 0.5 
##$DPOFFS= (0..7)
0 0 0 0 0 0 0 0 
##$DQDMODE= 0
##$DR= 18
##$DS= 0
##$DSLIST= <SSSSSSSSSSSSSSS>
$$ [...]
##$SUBNAM0= <"">
##$SUBNAM1= <"">
##$SUBNAM2= <"">
##$SUBNAM3= <"">
##$SUBNAM4= <"">
##$SUBNAM5= <"">
##$SUBNAM6= <"">
##$SUBNAM7= <"">
##$SUBNAM8= <"">
##$SUBNAM9= <"">
##$SW= 18.0517328524113
##$SWIBOX= (0..15)
0 0 2 0 0 0 0 0 0 0 0 0 0 0 0 0 
##$SW_h= 3612.71676300578
##$TD= 16384
##$TD0= 1
##$TE= 0
##$TE2= 300
##$TE3= 300
##$TEG= 300
##$TL= (0..7)
0 120 120 120 120 120 120 120 
##$TP= (0..7)
150 150 150 150 150 150 150 150 
##$TP07= 0
##$TPNAME0= <>
##$TPNAME1= <>
##$TPNAME2= <>
##$TPNAME3= <>
##$TPNAME4= <>
##$TPNAME5= <>
##$TPNAME6= <>
##$TPNAME7= <>
##$TPOAL= (0..7)
0.5 0.5 0.5 0.5 0.5 0.5 0.5 0.5 
##$TPOFFS= (0..7)
0 0 0 0 0 0 0 0 
##$TUNHIN= 0
##$TUNHOUT= 0
##$TUNXOUT= 0
##$USERA1= <user>
##$USERA2= <user>
##$USERA3= <user>
##$USERA4= <user>
##$USERA5= <user>
##$V9= 5
##$VALIST= <valist>
##$VCLIST= <CCCCCCCCCCCCCCC>
##$VD= 0
##$VDLIST= <DDDDDDDDDDDDDDD>
##$VPLIST= <PPPPPPPPPPPPPPP>
##$VTLIST= <TTTTTTTTTTTTTTT>
##$WBST= 1024
##$WBSW= 4
##$XGAIN= (0..3)
0 0 0 0 
##$XL= 0
##$YL= 0
##$YMAX_a= 110856
##$YMIN_a= -86806
##$ZGOPTNS= <>
##$ZL1= 120
##$ZL2= 120
##$ZL3= 120
##$ZL4= 120
##$ABSF1= 10
##$ABSF2= 0
##$ABSG= 5
##$ABSL= 3
##$ALPHA= 0
##$AQORDER= 0
##$ASSFAC= 0
##$ASSFACI= 0
##$ASSFACX= 0
##$ASSWID= 0
##$AUNMP= <proc_1d>
##$AZFE= 0.1
##$AZFW= 0.1
##$BCFW= 1
##$BC_mod= 2
##$BYTORDP= 1
##$COROFFS= 0
##$CY= -3
##$DATMOD= 1
##$DC= 2
##$DFILT= <>
##$DTYPP= 0
##$F1P= 0
##$F2P= 0
##$FCOR= 0.5
##$FTSIZE= 0
##$FT_mod= 4
##$GAMMA= 1
##$GB= 0.15
##$INTBC= 1
##$INTSCL= 1
##$ISEN= 128
##$LB= 0.25
##$LEV0= 0
##$LPBIN= 0
##$MAXI= 10000
##$MC2= 0
##$MEAN= 0
##$ME_mod= 0
##$MI= 1.114404
##$NCOEF= 0
##$NC_proc= 0
##$NLEV= 6
##$NOISF1= 3.799351
##$NOISF2= 2.8
##$NSP= 1
##$NTH_PI= 0
##$NZP= 0
##$OFFSET= 14.38212
##$PC= 1
##$PHC0= -3863.8
##$PHC1= 9.392301
##$PH_mod= 1
##$PKNL= yes
##$PPARMOD= 0
##$PSCAL= 0
##$PSIGN= 0
##$REVERSE= no
##$SF= 200.129724274929
##$SI= 16384
##$SIGF1= 3
##$SIGF2= 2
##$SINO= 400
##$SIOLD= 16384
##$SREGLST= <1H.CDCl3>
##$SSB= 0
##$STSI= 0
##$STSR= 0
##$SW_p= 3205.1282051282
##$SYMM= 0
##$S_DEV= 0
##$TDeff= 0
##$TDoff= 0
##$TI= <>
##$TILT= no
##$TM1= 0
##$TM2= 0
##$TOPLEV= 0
##$USERP1= <user>
##$USERP2= <user>
##$USERP3= <user>
##$USERP4= <user>
##$USERP5= <user>
##$WDW= 1
##$XDIM= 8192
##$YMAX_p= 0
##$YMIN_p= 0
$$ End of Bruker specific parameters
$$ ---------------------------------
##NTUPLES= NMR FID
##VAR_NAME=  TIME,          FID/REAL,        FID/IMAG
##SYMBOL=    X,             R,               I
##VAR_TYPE=  INDEPENDENT,   DEPENDENT,       DEPENDENT
##VAR_FORM=  AFFN,          ASDF,            ASDF
##VAR_DIM=   8192,          8192,            8192
##UNITS=     SECONDS,       ARBITRARY UNITS, ARBITRARY UNITS
##FACTOR=    0.0002768,     1,               1
##FIRST=     0,             0,               0
##LAST=      2.2672688,     0,               0
##MIN=       0,             -86806,          0
##MAX=       2.2672688,     110856,          0
$$ Real data points
##PAGE= N=1
##DATA TABLE= (X++(R..R)), XYDATA
0@%%%%%%%%%%%%%%%%%%%oJ4j6J6j6J6j9K7l2L2l8M6n1N9o7P5q6R7j06J17j32J48
$$ 0 0 0 0 0 0 0 0 0 0 0 0 0 0 0 0 0 0 0 0 -6 8 -8 8 -8 8 -11 16 -16 16 -22 24 -27 32 -35 40 -46 51 -55 62 -70 78
41G8j64J81k00K23k47K73l01L32l66M01m41M86n37N91o54P26q04Q95j001J127
$$ 78 -86 95 -105 118 -129 144 -157 175 -191 210 -231 255 -282 309 -345 381 -423 472 -529 598
61E98j276J458j687J980k368K904l682M788o820J14961k6724j68304K4621R5482
$$ 598 -678 780 -907 1073 -1295 1609 -2073 2715 -4105 110856 84132 -84172 -59551 35931
75C5931L2577n2206k0530K0935k7214K2897L8057r499n2468k9749O3176K1550
$$ 35931 68508 16302 -4228 16707 -10507 12390 50447 40948 -11520 -41269 21907 43457
87D3457k7134m2449M664L1858j6145Q443k702j9684j5879J9891N1023m2413m3021
$$ 43457 16323 -26126 -21462 10396 -5749 2694 -8 -19692 -35571 -15680 35343 -7070 -50091
100e0091K9519M8649j4016n1010L1173K3642j6641r455J8648J1919m0715J7447
$$ -50091 -20572 28077 14061 -36949 -5776 17866 1225 -8230 10418 22337 -18378 -931
112i31L5032k2456l7765J3257O3026k8470o4718J7555O7156J479q4433n44O5772
$$ -931 34101 11645 -26120 -12863 50163 21693 -43025 -25470 41686 43165 -41268 -41812 23960
125B3960J4593n1632k5669M9824L381k5299L259J4760m211k5842K1841J6877j5123
$$ 23960 38553 -13079 -38748 11076 14457 -10842 -7583 7177 2966 -22876 -1035 15842 719
138G19j1774K892J3763j1479R295R178j7661j0408J0490L4716j5826l5338Q343
$$ 719 -11055 -8163 5600 -5879 3416 12594 -5067 -15475 -4985 29731 13905 -21433 -13090
151a3090K7675R214l0824j899J5746n121p220N026J5770k2360j3015K1394J0110
$$ -13090 14585 23799 -7025 -8924 6822 1701 -5519 -493 15277 -7083 -20098 1296 11406
164A1406r275j7367J5227M094j5416J0527J6307o337l4458Q985M3394O0m1191
$$ 11406 2131 -15236 -9 4085 -11331 -804 15503 9166 -25292 -16307 27087 27147 -14044
177a4044k0612M2652K2325k6645k0027M670J9384k209n40k577j6045M768J7177
$$ -14044 -34656 7996 30321 3676 -16351 -11681 7703 5494 4954 2377 -13668 -8900 8277
190H277P781k0695q885J4085N016J33o776J998m339m071J4436K464p779j5689
$$ 8277 16058 -4637 -13522 563 5579 5712 -1064 934 -3405 -7476 6960 9424 1645 -14044
204a4044L271K2586J502j9732j3900K0803J4156j2532r583J453R597k503L986
$$ -14044 -10773 11813 13315 -6417 -20317 486 14642 2110 -7473 -6020 3577 1074 5060
217E060J888j6893L367J7450K709k1735n790K1445L964j3806r193J1704O000q044
$$ 5060 6948 -9945 -6578 10872 13581 -8154 -13944 7501 11465 -2341 -11534 170 6170 -1874
231a874p8j326L616l99j681M759k491k281r05O546J392p427p4K811K665m430K443
$$ -1874 -1952 -3278 338 -61 -1742 3017 526 -1755 -2660 3886 5278 -2149 -2223 588 3253 -1177 1266
248A266K028j0403K911R790Q02j3057m355J5499M080r241o923O055O540k364j415
$$ 1266 3294 -7109 -4198 5592 6394 -6663 -11018 4481 8561 -680 -7603 -1548 4992 2628 1213
263A213l350K356Q49K68K765n669j794K319M195j389p218L538M130k470m323N466
$$ 1213 -2137 219 1068 1336 4101 -1568 -3362 -1043 3152 1763 -5455 -1917 2213 -257 -4580 886
279H86L783q579k02P160L417o997n415Q682J888l392k514j9J732k52J751k351
$$ 886 4669 -3910 -4112 3048 6465 -532 -5947 2735 4623 1231 -1283 -1302 430 178 1929 -422
295d22k548j14L763L066o131j898L203M565o27o975L105M397j561k461R28K359
$$ -422 -2970 -3084 679 3745 -2386 -4284 -1081 3484 2857 -4118 -1013 3384 1823 -638 290 2649
311B649l103q24K301J634l934k815N301m72j904n35K20K030j810J566J449k679
$$ 2649 -454 -1278 1023 2657 -1277 -4092 1209 737 -1167 -1702 -1482 548 -1262 304 1753 -926
327i26j140L608K980m549k266K419L783j687n867K942K230j624n55j119R73l03
$$ -926 -2066 1542 4522 -27 -2293 126 3909 2222 -3645 -703 1527 -97 -652 -1771 -798 -1101
343a101L31J285q41j743J326L330j918j049N20R10J523l108O14J952k538o10J339
$$ -1101 -770 515 -326 -2069 -743 2587 669 -380 140 1050 2573 -535 79 2031 -507 -1117 222
360B22J161j951j990O85K916j65l225J198L63R75J578j642j5r17J139L173j300
$$ 222 1383 -568 -2558 -1873 1043 878 -2347 -1149 -786 189 1767 125 110 -807 332 3505 2205
377B205l681k98L270N43j796k031J23J506r31J706k61l315J006K335J711j285
$$ 2205 -1476 -1774 1496 2039 243 -1788 -1665 -159 -1090 616 355 -2960 -1954 381 2092 807
393H07k453N48K140J819j017j846j629J969J891j269m92k537p2L166j97k075j130
$$ 807 -1646 -1098 1042 2861 1844 -2 -1631 338 2229 960 468 -2069 -2141 1025 828 -1247 -2377
410b377J651R13j386R01K077j651k046K874J312j433M34r74r31q5K390J157l836
$$ -2377 -726 187 -1199 -298 1779 128 -1918 956 2268 835 1269 295 -636 -721 1669 2826 -1010
427a010k142J652K121J302j735m305p2O271J816l805l187J293L688M58L57j925
$$ -1010 -3152 -1500 621 1923 188 -4117 -4189 2082 3898 93 -3094 -1801 1887 2345 2702 777
443G77m193K408N028l77m484k706Q12L559K857k778n271j179O822M247n863l978
$$ 777 -3416 -1008 4020 3643 -841 -3547 -2735 824 3681 903 -4368 -5547 1275 5522 -341 -4319
459d319K188L944J558k309j726L34O52O28J163q71j859j258K69L534k28l886k2
$$ -4319 -2131 1813 3371 1062 -664 -330 322 950 2113 1242 -617 -1875 -1606 1928 1700 -2186 -2208
476b208Q75R65J020m87j51q21j134K192L818r15m733k613M421O311l424o468j60
$$ -2208 -1333 -368 652 165 14 -807 -1941 251 4069 3154 -1579 -4192 229 6540 3116 -3352 -3512
493c512K674L208M09l698l586P72M514L247k118m906k270L161Q020J664j0666
$$ -3512 -838 2370 2779 -919 -4505 -3733 781 4028 1910 -2996 -5266 -2105 5915 7579 -3087
508c087n195Q998P618l747q446j433N635L621j205m296k836K708L315j528m34
$$ -3087 -8282 716 8334 4587 -3859 -5292 343 3964 2759 -1537 -4373 -1665 1650 122 -312
523c12L06l173R84N093R64n056k357M719K847k937j751M41J39J264m77k601K034
$$ -312 -6 -3179 -2195 2898 3862 -1194 -3551 1168 4015 1078 -673 -232 -93 1171 694 -1907 127
540A27J551m081j882M692L213m555l083M414J096k207K430O55m827J16N749J680
$$ 127 1678 -2403 -4285 407 3620 -935 -4018 396 1492 -715 1715 2370 -2457 -2341 3408 5088
556E088l827m792m97M397N321j891j0395j568J1773L358q544l907L370K738J667
$$ 5088 1261 -3531 -4028 369 5690 3799 -6596 -8164 3609 6967 -1577 -5484 -2114 624 2291
571B291Q62l211m029L178N498k002k845N27l061M16P256R9r185k593Q206L320
$$ 2291 3153 -58 -4087 -909 4589 2587 -258 269 -2792 -2376 4880 4979 -4206 -6799 1407 4727
587D727n893k462K958k3P00K461k130k154J568R96M71R28q49k806o7L756k3l924
$$ 4727 -1166 -3628 -670 -693 7 2468 338 -1816 -248 748 1219 2147 1298 -1508 -1575 2181 2158 -1766
605a766J016J912l698M15M820j113m645m55M202K593k682k684k87K309M380n91
$$ -1766 -750 1162 -2536 -2121 2699 1586 -3059 -3514 688 3281 599 -2085 -2372 -63 4317 3726
621C726o006n72L926J357r28k278j312J678J442n77j369r33M84Q0J580K841l187
$$ 3726 -2280 -2852 1074 2431 1503 -775 -2087 -409 1033 456 -913 -1846 -1362 -1282 298 3139 -48
638d8m684M201N020k461l461L88K796L24j607l68p05k31J972n75k317J29L48R07
$$ -48 -4732 -531 4489 2028 -1433 -1045 1751 2075 468 100 -605 -836 1136 561 -1756 -1627 -1279 -372
656c72J231j803r17K779J121k437j674L128K579k932j917J848j67k77J164j582
$$ -372 859 -944 -1861 918 2039 -398 -2072 1056 3635 703 -1214 634 467 190 1354 -228
672b28j966J481J854q75k214j24J767M90M24k24j613P99J518n29J234K48l578
$$ -228 -2194 -713 1141 266 -1948 -2072 -305 185 609 385 -1228 -429 1089 560 1794 2042 -1536
689a536l77M761P44n490j610M997J036m449M68J232k085J657L177k416l037K397
$$ -1536 -1913 2848 3592 -1898 -3508 1489 2525 -1924 -1456 -224 -2309 -652 2525 109 -2928 -531
705e31L022j743j709J906K6j071J804o63k713J829J228k554K42K245j706l034
$$ -531 2491 748 -961 945 971 -100 1704 1041 -1672 157 1385 -1169 -927 1318 -388 -3422
721c422K929L351l983k004M453P8l350K502J706l262pL947o98m501J121L894j978
$$ -3422 -493 2858 -1125 -3129 1324 1402 -1948 554 2260 -1002 -1009 2938 2240 -2261 -1140 2754 776
738G76k476J878j29j123J180n42j081R23J066r40l43J521Q8k256J921K530l164
$$ 776 -1700 178 49 -1074 106 -436 -1517 -594 472 -468 -811 710 798 -1458 463 2993 -171
755a71j065L136r23j843J512L45k100m85K491M0l613N63L260r99j099O82o10J138
$$ -171 -1236 1900 977 -866 646 991 -1109 -1594 897 937 -2676 -2113 1147 148 -951 -269 -879 259
773B59J199j093m84P14O41m30p58N48k76j284J515L91k780P03J802j505o69J336
$$ 259 1458 365 -119 595 1236 806 48 596 320 -964 551 942 -1838 -1135 667 -838 -1507 -171
791a71N34j040l92J964L46k044R03J295q01J11k20q24Q86M1q17j73j84J60Q7k67
$$ -171 363 -677 -1069 895 1241 -803 100 1395 594 705 485 -339 547 588 -229 -402 -586 -426 -339 -606
811f06L07p24J32J722p20j196J638M85q49J35L61K94o43l28N94k41m02k8r37M76
$$ -606 -299 -1023 -891 831 111 -1085 553 1038 189 324 685 979 336 8 602 361 -41 -69 -1006 -530
831e30R16j255m02J105k08j61N53L05m13k00J559N3j955P76J462j502m37J201
$$ -530 386 -869 -1271 -166 -374 -535 18 323 -90 -290 1269 1322 -633 143 1605 103 -334 867
849H67o17j105N58M09o88n51R90n2j288J308Q96j346M82Q75n90J65P65l56p68
$$ 867 250 -855 -297 112 -576 -1127 -137 -189 -1477 -169 727 -619 -137 738 148 313 1078 722 -46
868d6K49J019q71j180J214k98j440J063P89j466m68J031Q51m72o26Q09j77o7J663
$$ -46 203 1222 351 -829 385 87 -1353 -290 499 -967 -1435 -404 447 -25 -651 158 -19 -86 1577
887A577p22j390J039N74n66l9o54l36L52K38J19j134n97J423j56l60R52p81l41
$$ 1577 855 -535 504 1078 512 473 -181 -517 -165 73 192 -942 -1539 -116 -272 -632 320 -461 -802
906h02J397K52j65k10m30N91mk11M93j428k80J286n63m09P0p26K54Q34k16K49
$$ -802 595 847 682 472 42 633 629 418 911 -517 -797 489 -74 -483 -413 -1139 -885 -51 -267 -18
926a8m30k40J277P1N0o5j063O03J214n33o04l89o19R97K12o54n49p12Q44J261
$$ -18 -448 -688 589 660 710 645 -418 185 1399 866 262 -127 -746 251 463 -191 -740 -1452 -608 653
946F53q69o70L0N14J364k34r33J87L04M83L86r12m37K41k96M94j86p86l1j83M79
$$ 653 -216 -886 -856 -342 1022 788 -145 42 346 829 1215 303 -134 107 -189 305 119 -667 -698 -881 -402
967d02O67r05l32Q41J36L08J06k70M92k24l94R78k23m53k69n39R35J73j285k85
$$ -402 265 -640 -972 -131 5 313 419 149 641 417 23 1001 778 325 56 -483 452 625 -660 -945
987i45K76J29O24q6o49j37J88J206M30j079j90K70P15J130j058j697N35J099J43
$$ -945 -669 -540 84 -2 -651 -788 -600 606 1036 -43 -233 37 752 1882 824 -873 -338 761 904
1006I04r24j068L15N10J10K18r23m38J129J89K70K60p80k31J213P84o73j538M78
$$ 904 -20 -1088 -773 -263 -153 65 -858 -1296 -167 22 292 552 -228 -459 754 1538 865 -673 -195
1025a95J516j111o99Q27n60m38M59l04l7K01l16K15J65N76M22j330M44J315j088
$$ -195 1321 210 -489 338 -222 -660 -201 -505 -542 -341 -657 -442 -277 299 721 -609 -165 1150 62
1044F2K68J013j087n83Q13J20m52p99k8L93l61J007k60k104J244K081j438o95
$$ 62 330 1343 256 -327 486 606 154 -645 -673 -280 -641 366 106 -1998 -754 1327 -111 -806
1062h06J105P3p8M58K14n51r19J243M87j619M53J68j357J112R27j972o31J595
$$ -806 299 372 294 752 966 415 -504 739 1226 -393 60 228 -1129 -17 910 -1062 -1693 -98
1080i8P14j081m63J590j94j322J770M34j987P02J193j085k95O52j91r02j11J089
$$ -98 616 -465 -928 662 468 -854 916 1350 -637 65 1258 173 -122 530 339 -563 -674 415
1098D15q49q87J585l54j269J255P12j189R7Q24J76k75M20K59j135K20J247r59
$$ 415 -434 -1321 264 -90 -1359 -104 608 -581 -484 340 516 241 661 920 -215 5 1252 293
1116B93j190J339j90j019O27J05p08k93R53L98p38o9O73k18M40N55j017J60R55
$$ 293 -897 442 252 -767 -140 -35 -743 -1036 -83 315 -423 -492 181 -37 403 958 -59 101 1056
1135A056o09m61L74j11l37r5M55o64r93J148N55j396N42R74r48K33P70k73k73
$$ 1056 447 -14 360 249 -88 -183 272 -392 -1385 -237 318 -1078 -536 438 -510 -277 493 220 -53
1154e3L56P12o33o28J122l82j068J143j84j523R00N53j129j1Q03Mq09K77J410
$$ -53 303 1015 382 -246 876 494 -574 569 385 -1138 -238 315 -814 -825 -22 -18 -827 -550 860
1173H60j167n79K493p54j615J376M77j433L69P63m67q93M31N48j650J50J676j155
$$ 860 -307 -886 1607 853 -762 614 1091 -342 27 790 323 -570 -139 409 -1241 -1091 585 -570
1191e70o40J956p25j255J600O10j148J26J349l64j779J201J487k633l3K156j514
$$ -570 -1210 746 21 -1234 366 976 -172 -46 1303 939 -840 361 1848 -785 -818 1338 -176
1208a76j327J548K10j546M13J616o76j657J641J061j965O77K025j722n91J753
$$ -176 -1503 45 255 -1291 -878 738 62 -1595 46 1107 -858 -181 1844 122 -469 1284
1224A284p13j265J067O83j330p37J751m17k259J488J473k233L04K005j083j290
$$ 1284 571 -694 373 1056 -274 -1011 740 323 -1936 -448 1025 -1208 -904 1101 18 -1272
1240a272J444R60j136k69J463m30j591J397N93j783M74R94j339m39Q41k24n29
$$ -1272 172 1132 -4 -273 1190 760 -831 566 1159 -624 -150 844 -495 -934 -93 -317 -846
1257h46N21Q23j033m38J525k30r61J244L73j215N32Q40r50m66P60L10j121j47
$$ -846 -325 498 -535 -973 552 322 -639 605 978 -237 295 1135 185 -281 479 789 -332 -479
1275d79Q59r21m24R84k31m40O88k02m27N97M61l88o4Q79j80j209R35O90j439J24
$$ -479 380 -541 -965 19 -212 -652 36 -166 -593 4 465 77 13 892 712 -497 438 1128 -311 -187
1295a87J199j046r37Q29P5o27o7Q19k24q53J056N63j177P23P60r09L09P92r73
$$ -187 1012 -34 -971 -142 -67 -694 -761 58 -166 -1019 37 600 -577 146 906 -3 306 1098 125
1314A25l50P53K08r29l84R06n37j134J445J34j626J033R34r92j23R09J93o83L31
$$ 125 -225 528 736 -193 -577 329 -208 -1342 103 237 -1389 -356 578 -414 -537 372 565 -118 213
1333B13R71r09p88J331j78j191J058j04j367P58L79r55j0P42K74j106K80J469
$$ 213 1184 275 -513 818 640 -551 507 403 -964 -206 173 -782 -792 -50 224 -882 -602 867
1351H67j143m89J975m55j477J258N94j177j07Q15k92r91N05P02j391j46J475j008
$$ 867 -276 -765 1210 755 -722 536 1130 -47 -154 661 369 -622 -117 585 -806 -952 523 -485
1369d85p54J465l4j070P45P72n21l02Q78J74j289O93R81j567k11J425q24j011
$$ -485 -1239 226 192 -878 -133 639 118 -184 694 868 -421 272 1253 -314 -525 900 76 -935
1387i35R28K19r21j85J163p8j234Q32Q75j024L74R84j026m3R12k79n25j2O06o20
$$ -935 -7 212 -709 -894 269 191 -1043 -211 664 -360 14 998 -28 -71 841 562 37 25 631 11
1407A1m10P97k81j193P51N71j099L96N18m40q9P98K16n59j11Q91k40o62Q77j71
$$ 11 -399 398 117 -1076 -325 246 -853 -457 61 -379 -468 330 546 -13 -124 767 527 -135 742 571
1427E71q27N13N7n31o8K2m0k44K61L81o69o4J129m98l68Q50j87k40N09j0j59k99
$$ 571 -256 257 314 -217 -285 -263 -303 -547 -286 95 -574 -638 491 -7 -375 475 288 48 557 547 388 89
1449H9J57K36p12L6L41q09J22O23n58j10L32k7J64J11N0L04k94K37L51o10K20
$$ 89 246 482 -230 -194 147 -662 -540 83 -475 -585 -253 -280 -116 -5 45 349 55 292 643 33 253
1470B53M27p49J40K60m84j50K37k34J27k97J33K42m21L98M44o69N64K73m76N03
$$ 253 680 -69 71 331 -153 -303 -66 -300 -173 -470 -337 -95 -516 -118 326 -343 221 494 18 521
1490E21J64m53ro0K25k34m99L54q9l75K13J02o34N00O5l7K01p8J35K75k01M03
$$ 521 685 232 223 163 388 154 -345 9 -80 -455 -242 -140 -774 -274 -209 -246 -45 -123 12 287 86 489
1512D89m9m25L51M1m49L18k92k28K90l27l9J10l44L25j63LN63k42p9M94j88J65
$$ 489 440 15 366 407 -42 276 -16 -244 46 -281 -320 -210 -554 -229 -392 -389 174 -68 -147 347 159 324
1534C24J61k43J67J4k81J75k04m41J61j52M8P9l33K14R3p0J99L6k08N96l7m5J71
$$ 324 485 242 409 423 142 317 113 -328 -167 -319 -271 -192 -525 -311 -218 -288 -89 -53 -261 335 298 253 424
1557D24j47K0mj77R8j32k93L40m51r8K05q8k08L55n4J1N2J70J50j79K12L75l85
$$ 424 277 297 293 116 214 82 -211 129 -322 -420 -215 -303 -511 -156 -210 -199 -147 23 173 -6 206 581 196
1580A96j23N40m85j6K67m85M2j62o2l8j79J70K65m21K12N69o91K98L75j21P4K66
$$ 196 73 613 128 112 379 -106 -64 -226 -288 -326 -505 -335 -70 -491 -279 290 -401 -103 272 151 225 491
1602D91j19R1m11J07J25o29K23J87n86K96J25n04K97J87k30J88M2L34k36Q0M99
$$ 491 372 463 52 159 284 -345 -122 65 -521 -225 -100 -604 -307 -120 -350 -162 -120 214 -22 58 557
1623E57j26n93O31Oo12M29K6n43J40Q5j94k53l9M30k83l4O51l16m04Q58j33l81
$$ 557 431 -162 469 475 -137 292 318 -225 -85 0 -194 -447 -486 -56 -339 -373 278 -38 -442 416 283 -98
1645i8M46J43k71j57L95n0o53J17N46q57k71R45n89l08N64J28n76K54N71lm81
$$ -98 348 491 220 63 458 408 -245 -128 418 -439 -710 235 -354 -662 -98 30 -546 -292 279 276 -205
1666b05O55K61p72J62P10p95k70Q13l89o65N44R1n02l34O96Q5q62O72N12r51L09
$$ -205 450 711 -61 101 811 16 -254 559 170 -495 49 140 -362 -696 0 85 -777 -105 407 -544 -235
1687b35J021o90l34P17J28n26K9N61m82p01P11N1r44L80N11p98m1P67k22m89N50
$$ -235 786 96 -238 479 607 81 110 671 189 -512 199 250 -694 -314 197 -601 -642 125 -97 -586 -36
1708c6O50o79k28J090l34o90Q53K1r27L52M46p00k76M78L8q39L04Q46q62l28J250
$$ -36 614 -65 -293 797 463 -227 626 647 -280 72 518 -182 -458 20 58 -781 -477 369 -493 -821 429
1729D29n33m53R28J41n96K29L34j08o37N77L74j008J24P55r40m12J100n66m11
$$ 429 -104 -557 371 512 -84 145 479 371 -266 311 685 -323 -199 556 -384 -796 304 -262 -673
1748f73M31L44m57j27O83J71p57N37O71j041K02Q38q15k43P20k65n50J9M16l35
$$ -673 -242 102 -355 -482 201 372 -385 152 823 -218 -16 822 7 -236 484 219 -331 -312 104 -231
1768b31n48Q40K43j057N85N16q15L04Q00n22k49N19J4l58j71P66m04n56O45k47
$$ -231 -779 61 304 -753 -168 348 -467 -163 637 115 -134 385 399 41 -130 636 232 -324 321 74
1788G4q81P10M28r44K60M14l31k34M68L97m69N4R51p55o31J102j14p58O10J40
$$ 74 -807 -97 331 -613 -353 61 -270 -504 -36 361 -108 -54 897 142 -489 613 499 -259 351 491
1808D91p31k32N72k17m68L18N34r17r8J158n79m12J036Mo41L33M19l78l94Q99
$$ 491 -240 -472 100 -117 -585 -267 267 -650 -748 410 -169 -581 455 459 -182 151 570 192 -202 697
1828F97j37r23K94O14j113o3R17n40m26N83K78p81J30Q66j42o46R18K27j171N32
$$ 697 560 -363 -69 545 -568 -631 286 -254 -680 -97 181 -600 -470 396 254 -392 526 753 -418 114
1848A14Q19r44j48Q00l92p44L09M58p37k45J115l59r96R94L74j175N32J094o59
$$ 114 933 -11 -159 641 249 -495 -186 272 -465 -710 405 46 -950 44 418 -757 -225 869 210
1867B10n99P98K67q53K2R36o84p24J106k02j222P13O30p66l07Q24L8q88M96Q56
$$ 210 -389 409 676 -177 -155 781 97 -627 479 277 -945 -232 398 -368 -675 149 187 -701 -205 651
1887F51q64k06J248n44p55J045N9p15J87M33n21n50L52M72r92J42J025q22l04
$$ 651 -213 -419 829 285 -470 575 634 -81 106 539 18 -532 -180 292 -700 -558 467 -355 -659
1906f59R17k27n31P17L7k06K5K87M6m49K30N10q34p7O16o94k83O56j44l80K54
$$ -659 258 31 -500 217 254 48 73 360 406 -43 187 697 -137 -214 402 -292 -575 81 -63 -443 -189
1927a89K16l29j17N11K26n84M19L84o22O2N48l10j95K95j69k98m4K44k16l01M73
$$ -189 27 -302 -419 92 318 -266 153 537 -85 -23 525 215 20 315 146 -152 -196 48 -168 -469 4
1948Dl9o44O07L20n64J99M67l26j46M36J7k14p3M77m39m65P71k82p08N02J17m43
$$ 4 -35 -679 -72 248 -316 -117 350 24 -122 314 331 117 44 521 82 -383 388 106 -602 -100 17 -426
1970d26J85K10j12l35M23K65n15J26P67m91k57Q00l22m35L71O0m44k56N06j03
$$ -426 -241 -31 -143 -478 -55 210 -305 -179 588 97 -160 640 318 -117 254 314 -130 -386 120 17
1990A7n72L71L21o00JQ13n50j83N99K5k61L2N39j82m94M52K1o51L48K36o82K8
$$ 17 -555 -184 137 -463 -462 351 -199 -382 217 242 -19 13 552 370 -124 328 349 -302 46 282 -400 -372
2012c72N54l51k30J22L57l35k79P58o9m92O87J75p25L89L17m95J16J19o0k82j34
$$ -372 182 -169 -399 -277 80 -255 -534 224 155 -337 350 525 -200 189 506 11 127 246 186 -96 -230
2033b30M43l74m67P27p9o20O14J64m57J77K32m2QmL08k41j91M88l84k97M86k50
$$ -230 213 -161 -628 99 20 -600 14 178 -279 -102 130 88 96 92 400 159 -32 456 72 -225 261 11
2055A1m10L71j21j89P0m1L68k72m8M14m8k31N27k71k21L91m9k56L27k20j2j44
$$ 11 -399 -28 -149 -338 -268 -309 59 -213 -261 153 105 -126 401 130 -91 300 251 -5 322 102 90 -54
2077e4k2J28l69l9M16l13q1M22k52J2L72j77J48j22J15J0j06M0K32l41r3J73k55
$$ -54 -76 52 -317 -356 60 -253 -334 88 -164 -152 220 43 191 69 184 194 88 128 360 19 -74 99 -156
2100a56m3J65l10J15jP3N5m8L4K06j02R3J68j82K17l5j15R9p7q9J1j81j7J55k91
$$ -156 -199 -34 -344 -229 -230 -157 -102 -150 -116 90 -12 81 249 67 284 249 134 233 156 67 78 -103 -120 35 -256
2125b56J40l6j13J74j2j17K76M6n1J26j6K7J15j67O6r8j20J60l50R2O4j71Q9p
$$ -256 -116 -152 -265 -91 -103 -220 56 102 51 177 161 188 303 136 202 104 -16 144 -206 -114 -50 -221 -132 -139
2149a39j91K84K2k23K71%J08kL5J20j08k03L87j87l46L57m4k43R0o8k39J37k1
$$ -139 -330 -46 -24 -247 24 24 132 130 165 285 177 -26 361 174 -172 185 141 -102 -12 -80 -319 -182 -203
2172b03NJ8JK90j44q7M29o4k62L66qk28j0J8O4k79j15K04k52q2L97l06j53M10
$$ -203 -198 -180 -179 111 -33 -120 309 245 -17 349 341 113 103 121 185 -94 -209 -5 -257 -339 58 -248 -401 9
2196Ij25j01L10O1p7m0J51J43k79J13K19l82j21L71k87k35K69r4k52J44K64j12
$$ 9 -116 -217 93 154 77 37 188 331 52 165 384 2 -119 252 -35 -270 -1 -95 -347 -203 61 -51
2218e1m48M12K63m91L92L88n12Q6K86n4k40M6J17k49j34J05R8n17M05J85n09J87
$$ -51 -499 -87 176 -315 77 465 -47 39 325 271 31 77 194 -55 -189 -84 14 -503 -98 87 -422 -235
2240b35M74m09k2K99J59k50J31K05m8l18L79l1o60M17J23l82p6J15k7j58J18K64
$$ -235 239 -170 -192 107 266 16 147 352 304 -14 365 334 -326 91 214 -168 -244 -129 -156 -314 -196 68
2262F8l18J3L91j56j33M60j38j41J95M4j48l6M6Q6n06K49J80m86R7L99m74QL90
$$ 68 -250 -237 154 -2 -135 325 187 46 241 285 137 101 147 233 -273 -24 156 -330 -233 166 -308 -300 90
2285I0j78j62K72J68lk57K33J17m55M03K30n77J39L14o78J26L66j36k71o7M47
$$ 90 -88 -250 22 190 187 -70 163 280 -175 228 458 -119 20 334 -344 -218 148 12 -259 -326 121
2306A21k51l19N55J37o33N15L24o65J08N96m01k06K45K01m53q5M80l42n58P52
$$ 121 -130 -449 106 243 -390 125 449 -216 -108 488 87 -119 126 327 -126 -211 269 -73 -631 121
2326A21O0p94M84L27n41N1N74n2l88J43N90m96l38R42m09o77O34J32p96K13N20
$$ 121 181 -613 -129 198 -343 -292 282 230 -158 -15 575 79 -259 683 274 -403 231 363 -433 -220 300
2347C00m47k60N04jm86M6O81m00l21P45o7n38L82L65n27kL13j02n99L83L51p12
$$ 300 -147 -407 97 96 -390 -344 337 -63 -384 361 294 -244 138 503 -24 -26 287 185 -414 -31 320 -392
2369c92KQ36o51m00P66q0m16K24M25k25l30N37Q5o21M28M14n90k04N25n02k47
$$ -392 -390 446 -205 -605 161 81 -335 -111 314 89 -241 296 381 -240 188 602 12 -192 333 -169 -416
2390d16L51K85m58m9M21k64l72M81K32m70K76L06l20k07M83j42k71J67L70n10
$$ -416 -65 220 -238 -287 134 -130 -502 -21 211 -259 17 323 3 -204 279 137 -134 33 403 -107
2410a07k28N43k01m66N06N7n82K95K32l18P8L77L5l34J26K99j12l69O81k45m46
$$ -107 -335 208 7 -459 47 104 -478 -183 49 -269 -191 186 221 -113 13 312 200 -169 512 267 -179
2431a79N36j19n39J90K75l71j59L43J79o24K90N65m21j51N91l94j56L48P2j54
$$ -179 357 238 -301 -111 164 -207 -366 -23 156 -468 -178 387 -34 -185 406 12 -144 204 276 122
2451A22k09M29k49m40L79J33n51J63N09o46l2M45ql52M60P9k62l14P11l0n69L60
$$ 122 -87 342 93 -347 32 165 -386 -223 286 -360 -392 53 45 -307 153 232 -30 -344 367 337 -232 128
2473A28M98p38rM96n03j82L03J4l32J23L44l51k75N60K38q04N17L82n92Q1M22
$$ 128 626 -112 -121 375 -128 -310 -7 7 -325 -202 142 -209 -484 76 314 -490 27 409 -183 -102 320
2494C20j73k54L26J09m39k72O22k53m42O15o4n66L85J83l09p6L09R9k56N0M42
$$ 320 147 -107 219 328 -111 -383 239 -14 -456 159 95 -471 -86 97 -212 -288 21 120 -136 -86 356
2515C56l84k24O57j11n14L76j2m44R7J86l2k33L36jn63J70N76l97j75O36j23l41
$$ 356 -28 -252 405 294 -220 156 144 -300 -203 -17 -49 -282 54 53 -510 -340 236 -161 -336 300 177 -164
2537a64L14K72m82J8K90k9m39K26K93o78K35L18l57k61L87J68l62J85K64j00l12
$$ -164 150 422 -60 -42 248 219 -220 6 299 -379 -144 174 -183 -444 -57 111 -251 -66 198 98 -214
2558b14N07nm51L54J93m35J79J42j73k14O0J09k82r7L40r8m12M73J37m46M41J10
$$ -214 293 288 -163 191 384 -51 128 270 97 -117 -57 52 -230 -327 13 -85 -497 -24 113 -333 108 218
2580B18l92J62K25p1k27Q5L14k64j48L87l13l09L94l1l10K35l2p6J07o9J12r7
$$ 218 -174 -12 213 142 -85 0 314 50 -98 289 -24 -333 61 30 -280 -45 -77 -153 -46 -115 -3 -100
2602a00J37K60j90j80M59j56k71L18l26p1R7nP8j74k5M0p9m3L21j59J9J73j42
$$ -100 37 297 107 -73 386 230 -41 277 -49 -120 -23 -28 50 -124 -149 -109 -188 -231 90 -69 -50 123 -19
2625a9L9J16j9l1j23J80R8k52k9J22l31K26J96m25j3K94r8m1l1K10Jj20J52J11
$$ -19 20 136 117 86 -37 143 241 -11 -40 82 -249 -23 173 -252 -265 29 -69 -110 -141 69 70 -50 102 213
2649B13k53R1J98k88J35P6k57J3j7J14l9k90J45R5o4P8R8k19K71o0l7P1N9O8L2
$$ 213 -40 51 249 -39 96 172 -85 -72 -89 25 -14 -304 -159 -64 -128 -50 48 -171 100 40 3 74 133 201 233
2674B33j57j1P2j33J62j70j27J09l6o8J47j53J00n7K2J34j64R0J42r0P4M8m5n
$$ 233 76 65 137 4 166 -4 -131 -22 -58 -126 21 -132 -32 -89 -67 67 -97 -7 135 45 119 167 122 117
2698A17o1O9Oj81j29K85k80J18O1j21R5R9k06M9K09k30K93o7j69N9q2J59J8j33
$$ 117 56 125 131 -50 -179 106 -174 -56 5 -116 -21 78 -128 -79 130 -100 193 126 -43 16 -66 93 111 -22
2722b2mM1k39J86p4j08L14k50k9J54o7J39l5m6J04n6MQ0r0K6K46l00o5K90k05
$$ -22 -26 15 -224 -38 -112 -220 94 -156 -185 -31 -98 41 6 -40 64 8 12 92 2 28 274 -26 -91 199 -6
2747fm4R6k43N0K3m7J55k1m5J02o4J75J9r8m6K14k87N7J17j21J83n5m6p3n2O5
$$ -6 -50 46 -197 -147 -124 -171 -16 -37 -82 20 -44 131 150 52 6 220 -67 -10 107 -14 169 114 68 -5 -57 8
2773Hj07j62K29R2j55J26R4k50K02L7k4L4k24K48L1k10Q5L3k03K40j91q4N8J42
$$ 8 -99 -261 -32 60 -95 31 125 -125 77 114 90 124 -100 148 179 -31 54 87 -116 124 -67 -151 -93 49
2797D9r2j06K09K0j09N6J86j16k40L54j30j76K51q7j65L7N0P2l07J00L08l39j90
$$ 49 -43 -149 60 80 -29 27 213 97 -143 211 81 -95 156 69 -96 -59 -9 63 -244 -144 164 -175 -365
2820c65N19j40j33K73n5k50J98R1ro6J36K8k82J19J33l13n1K63q0k02P8J07j77
$$ -365 154 14 -119 154 99 -151 47 138 129 63 199 227 -55 64 197 -116 -167 96 16 -186 -108 -1 -178
2843a78l9L72o1k75L06J14l57K11K16l48r4K67k9k18M9J72k11j42L51k13k56L83
$$ -178 -217 155 94 -181 125 239 -118 93 309 -39 -133 134 105 -113 -64 108 -103 -245 106 -107 -363 20
2865B0J29l79J16J93o9J0O9P9k10J0L67l24k31M14j07k83K51J6k69jJ40K7k17
$$ 20 149 -230 -114 79 10 20 89 168 -42 -32 335 11 -220 194 87 -196 55 71 -198 -199 -59 -32 -249
2888b49J45K57m14J29L07q4k15L18J7l07K03K2m2j76J62Rk08j7K96l35o6M11k04
$$ -249 -104 153 -261 -132 175 91 -124 194 211 -96 107 129 87 -89 73 82 -126 -143 153 -182 -248 163 -41
2911d1j42L06Qk56J00J94j10j56K76P9m47J61K78l22k1J86j68k04L35q2j16MK37
$$ -41 -183 123 131 -125 -25 169 59 -97 179 258 -189 -28 250 -72 -93 93 -75 -279 56 -26 -142 -138 99
2934I9l5k52L01J20l93J80K85m39J53J59j32j94J69J42k31j57L55n3m05L02J17
$$ 99 64 -188 113 233 -160 20 305 -134 19 178 46 -148 21 163 -68 -225 130 77 -328 -26 91
2955I1k72J16J83j23k33M58j23k53J34L73l21k13M64q0l72L55m8l07j0K50q6j68
$$ 91 -181 -65 118 -5 -238 220 97 -156 -22 351 30 -183 281 201 -171 184 136 -171 -181 69 -17 -185
2977a85J95J05l08J16L84l24r7M17j68k30K62O1k92j08L11j50k36J89K67n21P9
$$ -185 10 115 -193 -77 307 -17 -114 303 135 -95 167 228 -64 -172 139 -11 -247 -58 209 -312 -233
2998b33M67l37kK92nl46j9L79j81j22K85P3m95K61K53n25N1L51j97j80J22K71
$$ -233 234 -103 -105 187 182 -164 -183 196 15 -107 178 251 -244 17 270 -255 -204 147 -50 -230 -108 163
3020A63j46k20L84q7l78L69Q3l47L01J92l43m6K63r8l20J43K33j67k68L58m5m31
$$ 163 17 -203 181 94 -284 85 168 -179 122 314 -29 -75 188 90 -230 -87 146 -21 -289 69 24 -407
3042d07M38N8j50KJ57j89m5P9K80k38j16M04k79k04L80q7k57J75N4k81J07K51
$$ -407 31 89 -61 -59 98 -91 -136 -57 223 -15 -131 273 -6 -210 170 83 -174 1 55 -226 -119 132
3064A32k12m0N9K46k38n5L28k68mK59q0r0J5k1n2j41J75j12j91J94J45k07n2L16
$$ 132 -80 -120 -61 185 -53 -108 220 -48 -52 207 127 37 52 31 -21 -162 13 -99 -290 -96 49 -158 -210 106
3088A06j65p0J62R4j99J6J39j44L7J32O0l03M8L03l14m0K49k02o1P4L2j10J6L08
$$ 106 -59 -129 33 127 -72 -56 83 -61 -24 108 168 -135 -87 216 -98 -138 111 -91 -152 -78 -46 -156 -140 168
3112A68j38k70L80j2j43N9K12k49k4K15j06j60J0Q3j1l0J98k02k19K88n5j69L6
$$ 168 30 -240 140 128 -15 44 256 7 -17 198 92 -68 -58 25 14 -16 182 -20 -239 49 -6 -175 -139
3135a39K02p3q2J95J05k76J39J06k50L3L96l93j23K72k1o4r3J4N6k69J62J99k24
$$ -139 63 -10 -92 103 208 -68 71 177 -73 -40 356 -37 -160 112 91 27 -66 -52 4 -265 -103 96 -128
3158a28O6K25j13q8J81j73q7R8J12j29o1K23j6l48J07L34m06J38J62j26m6J82
$$ -128 -62 163 50 -38 143 -30 -117 -19 93 -36 -97 126 110 -238 -131 203 -203 -65 97 -29 -75 107
3180A07n7p0R2l1O0j23K40j13k10J09J51k03q8J88M8j70l0J27n4q4J95r9j69L63
$$ 107 50 -20 72 41 101 -22 218 105 -105 4 155 -48 -136 52 100 -70 -100 27 -27 -111 84 -15 -184 179
3204A79j24j22J62kq5n7N4R8l6k02K31r0j86J96k3j69R3k5j14K15M4j06J01L0
$$ 179 55 -67 95 93 8 -49 5 103 67 -135 96 6 -180 16 -7 -176 -83 -108 -222 -7 37 -69 32 62
3228F2P5m6p1M2r8J02J76j87r0O1k4j18Q4O4K6j51J6P6n6k1J15j34J27j5n2R0
$$ 62 137 91 20 62 -36 66 242 55 -35 26 2 -116 -32 32 58 -93 -77 -1 -57 -78 37 -97 30 15 -37 53
3254E3q7R6k9O1r2K7r4K3J23j79J04L4j28J04m0n4K12k12Q8qj21J40M1j25rJ11
$$ 53 -34 62 33 94 2 29 -65 -42 81 -98 6 40 -88 16 -24 -78 134 -78 10 2 -119 21 62 -63 -72 39
3280C9r2R0k0o3M3m8m6N2j1Q3m5r8J37k8k8O8r1J6O8q4K10p6j45J92j87j5J94
$$ 39 -53 37 17 -46 -3 -51 -97 -45 -56 27 -18 -116 21 -7 -35 33 -58 -42 26 -58 152 76 -69 123 -64 -79 115
3307A15r6L1j41j6O8j8o6J22J17j61J27j22j9J58m5L7r9j3L8N7m9M3l1p0P0M2
$$ 115 19 50 -91 -107 -39 -57 -123 -1 116 -45 82 -40 -59 99 54 91 -8 -21 17 74 25 68 37 -33 37 79
3333G9n6k0k7M4j02M1P8q1K7J09n1q3J02k6k9j6R1j13j4J64j75l9M2J32j28m8
$$ 79 23 3 -24 20 -82 -41 37 -44 -17 92 41 -42 60 34 5 -11 80 -33 -47 117 -58 -97 -55 77 -51 -99
3359i9K46j32r6J45q5P9j23J58m5l6j5O6j27j8K38j21o8J0M1j93J34P6o4j29K96
$$ -99 147 15 -81 64 -21 58 -65 93 48 12 -3 63 -64 -82 156 35 -33 -23 18 -175 -41 35 -29 -158 138
3384A38j01j07N2K02k32K4J74k10k8J60q5j51J32N6j07J45Jn0j16P3L7l4L1O2
$$ 138 37 -70 -18 184 -48 -24 150 -60 -88 72 -13 -164 -32 24 -83 62 63 13 -103 -30 7 -27 4 66
3408F6l8Np5K36j45kO6j22p0K15q7k24J31O5j31J39K4M3j47KJ95j44L2J77k90
$$ 66 28 33 -42 194 49 47 113 -9 -79 136 49 -175 -44 21 -110 29 53 96 -51 -49 146 2 34 211 -79
3433g9L4K04j15M4k7k9j06N9J22j08j03Q5J53k71Q9K03k42n4J41K4o9R3J1L3k61
$$ -79 -45 159 44 88 61 32 -74 -15 107 -1 -104 -19 134 -137 -48 155 -87 -141 0 24 -45 48 59 92 -169
3458a69K22J36k35OJ69k47J27J6q9p1N1J29o5j2P2n5j74J84J90l38P4J44pj33
$$ -169 53 189 -46 -40 129 -118 9 25 -64 -135 -84 45 -20 -32 40 -15 -189 -5 185 -153 -79 65 58 -75
3482g5J15J14k81P1J64j28L6Q3q0j98J94J33l66K26J84q2j42J75Ok63O5J80p8
$$ -75 40 154 -127 -56 108 -20 16 99 19 -179 15 148 -218 8 192 110 -32 143 149 -114 -49 131 53
3505E3j36K43p5n4k23K96j86N5J60j11l7o2J36j35M5K60k59N7J79j44k8Q7n9r4
$$ 53 -83 160 85 31 -192 104 -82 -27 133 22 -15 -77 59 -76 -31 229 -30 27 206 62 34 121 62 -32
3529c2o3K36m3k04J20R4k70R4Q1o2o5K63k06N4m3J08p3o9J25P3j56J31k2k31J53
$$ -32 -95 141 98 -106 14 108 -162 -68 13 -49 -114 149 -57 -3 -46 62 -11 -80 45 118 -38 93 71 -160 -7
3554gL1j0j27J36J01j08j57K03j08rJ68M9k67JO8J15j64J50q6k3N9j6q0L1J29
$$ -7 24 14 -113 23 124 16 -141 62 -46 -55 113 162 -105 -104 -36 79 -85 65 -21 -44 15 -1 -81 -50 79
3579G9J0k49K17o8o6O8L0q7mJ01Q7j02mJ71k80K3J51k6k34J08N9J17j77Q0M0l80
$$ 79 89 -160 57 -11 -77 -9 21 -66 -70 31 118 16 12 183 -97 -74 77 51 -183 -75 -16 101 -76 4 44 -336
3605c36L56J7j94L4K63j91N9J44p5j56R5J46j10j31J15m6j66J56Q7j70o1K16q
$$ -336 20 37 -157 -123 140 -51 8 152 77 -79 16 162 52 -79 36 -10 -176 -20 67 -103 -164 52 44
3628D4p5L2K0M0o3Q5q3Ok0J43l29J98J57k30k0J73n8j18P4J32j39j20K41L1j66
$$ 44 -31 1 21 61 -2 83 0 6 -14 129 -200 -2 155 -75 -95 78 20 -98 -24 108 -31 -151 90 121 -45
3653d5J78o6k12J58j5J26j85J10Q2j60k1J82k60k6L32j49k08J92p1p7J36J38q4
$$ -45 133 67 -145 13 -2 124 -61 49 131 -29 -50 132 -128 -154 178 29 -179 13 -58 -135 1 139 55
3676E5k55J82R7j26P2J39k26NJ53q1n8M3m6j09Q2J61j05k11K00N0m1oQ0p2K1R2
$$ 55 -200 -18 79 -47 25 164 -62 -57 96 15 -43 0 -46 -155 -73 88 -17 -228 -28 22 -19 -25 55 -17 4 96
3702I6J2j38M6M5j06J5R6pj03L3R1j61j1M2lj9L7J09p6O6K3n6k4O7k6j8P8o6p3
$$ 96 108 -30 16 61 -45 -30 66 59 -44 -11 80 -81 -92 -50 -53 -72 -35 74 -2 64 87 31 7 74 48 30 108 42 -31
3731c1J7R6Oj28M9J00p6j92L08k18j37K48J05j95j9J10m7R2p0O3j45n6K21m5l7
$$ -31 -14 82 88 -40 9 109 33 -159 149 -69 -206 42 147 -48 -67 43 -4 88 18 81 -64 -120 101 56 19
3756A9Q3n2l9N2q3rL8N2r2q4Q5Q9j07P6J9j17m9K41j97K6LQ3p3QO1mj48qJ08o2
$$ 19 102 50 11 63 -20 -29 9 61 -31 -115 -30 59 -48 28 47 -70 -119 122 -75 -49 -46 37 -36 -28 33 29 -119 -127 -19 -81
3786h1K1N6j15J53j1k9nJ2N9P9j64m8R8n0M2o2L2j65K27j04M7M3l9p0j4J82P4
$$ -81 -60 -4 -119 34 23 -6 -11 1 60 139 -25 -73 25 -25 17 -45 -13 -178 49 -55 -8 35 -4 -74 -88 94 168
3813A68k73J36JK2J3Rk1K5q5n4J2J9R4j88mP5R6j10J5JnN3o6J15r9L9Q7m7mN0
$$ 168 -105 31 32 54 67 76 55 80 -5 -59 -47 -28 66 -122 -126 -51 45 -65 -50 -49 -54 -1 -67 48 -51 -12 75 28 24 74
3843G4j23l9J35j05Q2Q5j76KP6j5O1p4J2J38j19r3J37m3r4J85k42K47p8j02K0
$$ 74 -49 -88 47 -58 24 109 -67 -65 11 -4 57 -17 -5 133 14 -79 58 15 -79 106 -136 111 33 -69 -49
3868d9n7J95kj96J15n2Q9n5N4j00O6R1j93K04j53L4J27j45P0J33k63R8q0m3L7
$$ -49 -106 89 87 -109 6 -46 43 -12 42 -58 8 99 -94 110 -43 -9 118 -27 43 176 -87 11 -69 -112 -75
3893g5Nk1Q8j42Q9O6N5p0K22k55kJ36jr9p8O6L6j17J75j12K1j12J19n7J06r1R1
$$ -75 -70 -91 -3 -145 -56 10 65 -5 217 -38 -40 96 95 -4 -82 -16 20 -97 78 -34 -13 -125 -6 -63 43 -48 43
3920D3k9j28J73n9n6R6Oj3m9j1J73j28p0K4N2J0n8j44RK00q4n1J5P0J2k1J12l9
$$ 43 14 -114 59 0 -56 40 46 33 -16 -27 146 18 -52 -28 24 34 -24 -168 -159 41 -43 -94 -79 -9 3 -18 94 55
3948E5o0j9K06k08m0O5k4j6J00J5j29Q6l8j6m4N0p4R8p3J06j00J24j03P3M6k4
$$ 55 -5 -24 182 -26 -66 -1 -25 -41 59 74 -55 31 -7 -23 -67 -17 -91 7 -66 40 -60 64 -39 34 80 56
3974E6K8j05K8m5k7RJrj1M1o5J26j34N7Q5o2LO1o3n2J70n3k40K17K3j28P1J04
$$ 56 84 -21 7 -38 -65 -56 -55 -64 -75 -34 -99 27 -107 -50 35 -27 -24 37 -26 -78 92 39 -201 16 39 -89 -18 86
4002H6o7o7N1J7j27M9L9j18j8J85nk7PN4j69Q9O8j47M7K2K9p1J58o0K3j13J54
$$ 86 19 -48 3 20 -107 -58 -19 -137 -155 30 25 -2 5 59 -110 -21 47 -100 -53 -31 -2 -73 85 25 48 -65 89
4029H9p8l8J04m5o4J74o2o6o5K3J88j90N4LK0r4R2q1j18J04O3j2j70J58N7q0M
$$ 89 11 -27 77 32 -32 142 80 14 -51 -28 160 -30 24 27 47 -47 45 -36 -154 -50 13 1 -169 -11 46 -34 -30
4056c0M0O4k5J35k36M3J30o4p0M9M5j35n0J54p7p1J23k7J9q4J13l0m1J51J7j77
$$ -30 10 74 49 184 -52 -9 121 57 -13 36 81 -54 -104 50 -27 -98 25 -2 17 -67 46 16 -25 126 143 -34
4082c4J1J19r7K2Q1J5q9r0J92k27l6J61n5j6j8R3j05Q0M6j32Q0J07p8K2n7O0J6
$$ -34 -23 96 -1 21 102 117 28 -62 130 -97 -133 28 -27 -43 -61 32 -73 7 53 -79 1 108 30 52 -5 55 71
4109G1j77Q6J00l9j10J35j49N3M5j37M0Q3k7q0rQ3K7N7J00j34j43J38J1m6P3k0
$$ 71 -106 -20 80 41 -69 66 -83 -30 15 -122 -82 1 -26 -106 -115 -32 -5 52 152 18 -125 13 24 -22 51 31
4135C1p8j7L9j1k9r8K15p5%J1n5J5k5K25j97m2J00Q6q8j4R2Pj42R1p7r8J17k5
$$ 31 -47 -64 -25 -36 -65 -163 52 -23 -23 -12 -67 -52 -77 148 -49 -91 9 95 7 -7 85 92 -50 41 -36 -134 -17 -42
4163d2q5Q8P3l6l9M0ml2qP6j0o6R9J2j68J35p5n8J55J0p5j3o7J19M7j48N0j08
$$ -42 -127 -39 34 -2 -41 -1 -5 -37 -45 31 21 -45 54 66 -102 33 -42 -100 55 65 -10 -23 -90 29 76 -72 -22 -130
4191a30M4J28J8k6J0J33j23r8O8nj0m7O3l7m9Q5k2n6Q5QL4rp0J50j54Q5j09oj2
$$ -130 -86 42 60 34 44 177 54 -44 24 19 9 -38 25 -12 -61 24 2 -54 31 39 73 64 -6 144 -10 75 -34 -40 -52
4220e2J15j13J4R8J2r5L1L7n2j66K01k4j37J29M7j07R3R9j92jK70j77nO8k1j3
$$ -52 63 -50 -36 62 74 -21 10 47 -5 -171 30 6 -131 -2 45 -62 31 130 -62 -63 207 30 25 93 72 59
4246E9o9N2K8k01J30O9k07J56qm5m8J55Mj11L2J5j15J9K38r4k33J64Q1p7j25J57
$$ 59 -10 42 70 -131 -1 68 -139 17 9 -36 -84 71 75 -36 -4 11 -104 -85 153 59 -174 -10 71 -6 -131 26
4272B6k2n8J10k5J7q3J23k66O0J60n6M2L4L9j88J82j10J05j56R9k1p5N0Q5o7p3
$$ 26 4 -54 56 31 48 -35 88 -178 -118 42 -14 28 62 101 -87 95 -15 90 -66 33 12 -63 -13 72 5 -68
4298f8P2K4n3mL2k7K05j45M3j74J29q6O7pJ07j38m0OK4L0n5R9j7JJ0j26n0J98
$$ -68 4 28 -25 -29 3 -24 181 36 79 -95 34 -52 15 8 115 -23 -63 -57 -33 -3 -58 41 24 25 35 -91 -141 57
4326E7oo3p9K28k9n7j04P2l9O0p8Np0M3J3noM6n2J29q5J58j26j42J78J1n4k2R6
$$ 57 51 -12 -91 137 108 51 -53 19 -20 40 -38 -33 -103 -60 -47 -52 -58 -12 -64 65 -20 138 12 -130 48 59 5 -17 79
4355G9k3K5J5p2j23J04L1j19O6K0M4p2%p5P6O5j29K5J46j00j8J61p4p5K0J2m1
$$ 79 56 81 96 24 -99 5 36 -83 -17 3 47 -25 -25 -100 -24 41 -88 -63 83 -17 -35 126 52 -23 -3 9 -32
4382c2o0Q2M1j02k8J31J1j7k4k7Q5r0P0Q5r5N3m0k7o1k5J15L9m2P6j79kR2n7j6
$$ -32 -92 -10 31 -71 -99 32 43 26 2 -25 60 -30 40 125 30 83 43 16 -45 -70 45 84 42 118 -61 -63 29 -28 -44
4411d4L6L8lo3Q7r9J30k0j22J09k0J1m7ml1N9Ml0k4M8o3l7R0j40P3n8Q1N4P0p1
$$ -44 -8 30 27 -36 51 -48 82 62 -60 49 29 40 -7 -11 -42 17 21 -9 -33 15 -48 -85 5 -135 -62 -120 -39 15 85 14
4441A4o4K10j57J37j74J03j39M0pJ5p0N6L3r0J42j10j4J28p3L9p6P0L6J2n0nJ2
$$ 14 -50 160 3 140 -34 69 -70 -30 -37 -22 -92 -36 -3 -93 49 -61 -75 53 -20 19 -57 13 49 61 11 6 18
4468A8J04m9M2q0k5n8j01K5Q3P9p4m2P5n2K02j41J14j31PM8M0j4j07J05p8j5o
$$ 18 122 73 115 35 10 -48 -149 -124 -41 38 -36 -78 -3 -55 147 6 120 -11 -4 44 84 70 -37 68 -10 -25 -31
4495c1Ol1Q4j65J18m7N4k9P2Q4k02J69j83K12m3n7L8m3Q8n5l0K7j54J48l1m5k9
$$ -31 -25 -56 28 -137 -19 -66 -12 -41 31 115 -87 82 -101 111 68 11 49 6 94 39 9 36 -118 30 -1 -46 -75
4522g5j07K11k8n4RN9M7jo8J9l0m7J48n6n3PN9L4j51K0j28J09N1q3N9N5M1m6J44
$$ -75 -182 29 1 -53 -44 15 62 61 -7 12 -18 -65 83 27 -26 -19 40 74 -77 -57 -185 -76 -25 -108 -49 6 47 1 145
4551A45k03L9J85j02l3n1k8K5L1o3K4L3n5j3L2p3R2Q0j71l7R2P6l5O6R6k30J36
$$ 145 -58 -19 166 64 31 -20 -48 -23 8 -55 -31 2 -53 -66 -34 -107 -15 65 -106 -143 -51 25 -10 56 152 -78 58
4578E8p3qK8j04L0Q9j08lJ21j4p2j16K01q5J17j53R1J84k56J54q5m9M8l9k4N3
$$ 58 -15 -23 5 -99 -69 20 -88 -91 30 16 -56 -172 29 -56 61 -92 -1 183 -73 81 -4 -53 -5 -44 -68 -15
4604a5K3nj50J00Q9r9l4k0QP8O2J9j2q9J5O2P9n7p3M6n2M1l5l8L2l3Nom9O6N6
$$ -15 8 3 -147 -47 42 -57 -91 -111 -103 -25 37 56 44 -45 -30 32 111 54 -19 27 -25 16 -19 -57 -25 -58 -53 -59 -108 -42 14
4635A4K5n3r7K0N6P9l7Np5J03lJ4m1p6OnjqL0n9oJ98p0j02R4O6p8l9Q2NqK0O7
$$ 14 39 -14 -111 -91 -35 44 7 12 -63 40 37 51 10 -66 -60 -65 -66 -74 -44 -103 -109 89 19 -83 11 77 -1 -40 42 47 39 59 126
4668A26o8q7Q6rj58P0qj2O9ml1p7J66k0o3J29j18J7J19q6O7k9j1n0O8p3p1J4O6
$$ 126 58 -29 57 48 -110 -40 -48 -60 9 5 -26 -103 63 43 -20 109 -9 8 127 41 108 79 68 18 86 13 -58 -44 22
4697B2r7r3l9J66l3K4Q9q4O8K3o7O0j1M4m8n5J12j0q0n1KkN9L3j1l5j17M3L9j0
$$ 22 -75 -168 -207 -41 -74 -50 39 -45 23 46 -21 39 28 72 24 -31 81 71 -9 -60 -58 -60 -1 32 21 -14 -131 -88 -49 -59
4727e9R8nj07J42n2j5P0o3J4m7M7m5k8o0J16l7l1M5%M4r8Q8J0P2j10Q8j1r7J22
$$ -59 39 34 -73 69 17 2 72 9 23 -24 23 -22 -50 -110 6 -31 -62 -17 -17 27 -71 17 27 99 -11 77 66 -31 91
4756I1J27m07K11M4j99J27l5k9M7q4J12k8N0n3n8J18%n1m5J00M9j5j8J6j19Mk5
$$ 91 218 -189 22 66 -133 -6 -41 -70 -23 -107 5 -23 27 -26 -84 34 34 -17 -62 38 87 72 54 70 -49 -45 -70
4783g0J01j19J30j8q9m1O2M6m2mK8j9P8m1Prl7K77k46j1PJ2m8P6k1Q1k11Q1m4
$$ -70 31 -88 42 24 -65 -106 -44 2 -40 -44 -16 -35 43 2 9 0 -37 240 -6 -17 -10 2 -46 30 9 90 -121 -40 -84
4812h4o5K28m6n5K8J26j65oK05j18j10J44j21J28m7K2Qj29O0J20j46n0N5p0l8
$$ -84 -149 79 33 -22 6 132 -33 -39 166 48 -62 82 -39 89 42 64 72 -57 3 123 -23 -73 -18 -88 -126
4837a26J71Ll4J6K5j6p9J71l2j59J28j34oK5l4K02j32R1j52J8K8K6J49j69N5n
$$ -126 45 48 14 30 55 39 -40 131 99 -60 68 -66 -72 -47 -81 121 -11 80 -72 -54 -26 0 149 -20 35 30
4863C0k8L3P7K5j07J6j10N8o8P4k3J3O3o7M2m9qn0R9o2j2j4P9P6mp6K5R5j14o0
$$ 30 2 35 112 137 30 46 -64 -6 -74 0 -23 -10 53 -14 28 -21 -29 -79 20 -42 -54 -68 11 87 83 7 32 127 13 -47
4893d7P9l1L2j25P6j0R8K1j00r3J98j14J03j3r4P2R8l5J3j07J3r9l2K8N2J45r1
$$ -47 32 1 33 -92 -16 -26 72 93 -7 -100 98 -16 87 74 -20 52 150 115 128 21 34 -65 -97 -69 -17 128 37
4920C7n4o5P3J3j72J12R3J12q2p8n1J15N0j72j7Q8Ql7R6j04rm8Q3OJ9K4j42Q3
$$ 37 -17 -82 -9 4 -168 -56 37 149 67 -11 -62 53 103 -69 -86 2 10 -27 69 -35 -44 -92 -9 -3 16 40 -102 -19
4948a9j50J04R6m4L3J3q1J37m8m4k6j28J98Ql4n0Qj9KJ29j39p0J62mJ7j40J34
$$ -19 -169 -65 31 -13 20 33 -48 89 41 -3 -29 -157 41 49 15 -35 -27 -46 -44 85 -54 -124 38 34 51 -89 45
4975D5R3m1PK2o9n1Q8j16l3K6M3o9o5J23M0o7l0L9j02J46Qm8L8R0p2l0o6L0n6
$$ 45 138 97 104 126 57 6 94 -22 -55 -29 14 -55 -120 3 43 -24 -54 -15 -117 29 37 -11 27 117 45 15 -51 -21 -77
5004g7J98j60j3j03K11j64NQ6l7l4L1J09n4R9j35P2oQ5n6o7jK6p6J00P3k33P6
$$ -77 121 -39 -52 -155 56 -108 -103 -17 -54 -88 -57 52 -2 97 -38 34 28 113 57 -10 -11 15 -61 39 112 -121 -45
5031d5M8m3l8n4J24M3p2j3N8K4j6Q2L6k1j04O6o5J29j42M2j16k9L9kl3R1N1J6
$$ -45 3 -40 -78 -132 -8 35 -37 -50 8 32 16 98 134 113 9 75 10 139 -3 39 -77 -106 -67 -69 -102 -11 40 56
5059E6q2l4J46o4j2k9J24J8p0K8l6o7j0m2PM0qM4k6r3J10o8l1J23Qp0P7j9Q2r1
$$ 56 -26 -60 86 22 10 -19 105 123 53 81 45 -22 -32 -74 -67 -27 -35 9 -17 -110 0 -68 -99 24 32 -38 39 20 102 11
5089A1r5K17r0J1j25M3R3j06P9j28M4p6j2J90m2j15J29pQ0r7J11r7Q7l6L5m9p8
$$ 11 -84 133 43 54 -71 -28 65 -41 38 -90 -46 -122 -134 56 14 -101 28 21 101 4 115 18 105 69 104 55 -23
5116b3J0M1j14N0q8J70j0l4j9K2R%j26L1L4Q6q1K3J24j57J26q7L3M2m4j54J55
$$ -23 -13 28 -86 -36 -124 46 36 2 -17 5 14 14 -112 -81 -47 39 -42 -19 105 -52 74 -13 20 62 18 -136 19
5143A9n7J63q2j5k4k5r3J56k4k8J6K8N0p6N4l8N6j55J32q0N6j7n4N1K7K8j45j0
$$ 19 -38 125 43 28 4 -21 -114 42 18 -10 6 34 84 8 62 24 80 -75 57 -23 33 16 -38 13 40 68 -77 -87
5171h7mJ10lJ7J7n5J08J5j18J3q0O2Q0k%j46Q6j2m1m6P4n3K6K0J6L3n0J3N5L9
$$ -87 -91 19 16 33 50 -5 103 118 0 13 -67 -5 75 73 73 -73 13 1 -40 -86 -12 -65 -39 -19 -3 30 -20 -7 48 87
5201H7q6rJ07q5j0K7j33J57k0j15Q2k8M4o2J03l3j38J71m5l1k4J54N5j92O5L9
$$ 87 1 -8 99 14 4 31 -102 55 35 -80 2 -26 18 -44 59 26 -112 59 14 -17 -41 113 168 -24 41 80
5227H0j3p8l9R6j7j01J7J5kP6L3j61J9MJ35j4n8R1j64J31j08P3k9m1O1k8j45O
$$ 80 67 -11 -50 46 29 -72 -55 -40 -42 34 67 -94 -75 -71 64 50 -8 83 -81 50 -58 15 -14 -55 6 -22 -167 -161
5255a61P1ON7j05J01J0O5m5N1n9o4J11K9j55J18J37k7q6k6lj25Q2j0p7K0Q5nk9
$$ -161 -90 -84 -27 -132 -31 -21 44 -1 50 -9 -73 38 67 -88 30 167 140 54 28 25 -100 -18 -28 -105 -85 0 -5 -34
5283c4M4O2m9j4N0Nk4O2J3j5m7m5Nj9O8j37O9P0r0K9p6N1P0%n4J66q7m7K5n7J3
$$ -34 10 72 23 9 59 64 40 102 115 100 53 8 13 -6 62 -75 -6 64 -26 3 -73 -22 48 48 -6 160 73 26 51 -6 7
5314Gk2J35j70M6j1N4n2r2KM6j58K18j32J29K7J2K5q1L0N6j5q5L1l3Q5j32J02
$$ 7 -15 120 -50 -4 -15 39 -13 -105 -103 -57 -215 3 -129 0 27 39 64 -17 13 69 54 -31 0 -33 52 -80 22
5341B2j66J30j35J05O7j91R4L1j1L6o8J08O9k28K01O5j20P7j05J4k4P1Lp4o9J07
$$ 22 -144 -14 -149 -44 23 -168 -74 -43 -54 -18 -86 22 91 -137 64 129 9 86 -19 -5 -29 42 45 -29 -98 9
5367Ij61Q5K7P8j20p9J71n8N9J13pl2m2N1m3O3l9q4l7j7O9j74J7P5O3M5m5KM3
$$ 9 -152 -67 -40 38 -82 -161 10 -48 11 124 117 85 43 94 51 114 75 -9 -46 -63 6 -168 -151 -76 -13 32 -13 -11 32
5396C2O9j2j30J13l7J3M2m0k6O7q6R3n7n9l8Q8j96J87l8k6J06k8k9k5qJ18o3P0
$$ 32 101 89 -41 72 35 48 90 50 24 91 5 98 41 -18 -56 32 -164 23 -15 -41 65 37 8 -17 -25 93 30 100
5424A00j1q7J5k6N4j25J29j15O5k6j5o0J47j40J58j39kN4j5N2N4O8j80R0o8R1
$$ 100 89 2 17 -9 45 -80 49 -66 -1 -27 -42 -102 45 -95 63 -76 -78 -24 -39 13 67 135 -45 45 -23 68
5450F8q1l0R7Oj06qK5j52J58p5L4J38n6nO1K6o0n4l0J88j12m7J27r1j16N4R3l7
$$ 68 -13 -43 54 60 -46 -54 -29 -181 -23 -98 -64 74 18 13 74 100 40 -14 -44 144 32 -15 112 21 -95 -41 52 15
5478A5o5OKK7L8O4l3lO4j81J40J3j00j2L5n7Q0n9m7P4n1l0N9j57J03R9r9J44m4
$$ 15 -50 -44 -42 -15 23 87 54 51 115 -66 74 87 -13 -25 10 -47 33 -26 -73 1 -50 -80 -21 -178 -75 24 -75 69 25
5507B5np8J85k5om4O5m2l2N4r6nJ2J11j96J0O6J2m0j2j64K57jl2l5k1L0J18nl4
$$ 25 20 -58 127 102 96 52 117 75 43 97 1 -4 8 119 -77 -67 -1 11 -29 -41 -205 52 51 19 -16 -37 -7 111 106 72
5537G2J8ll4o1L9r9q0J46o8k6O6L4n1OJ13mL4k34J47L4J16k03R7m7k3N6K5l2j04
$$ 72 90 87 53 -8 31 -68 -148 -2 -70 -96 -30 4 -47 -41 72 68 102 -132 15 49 165 -38 59 12 -11 45 70 38 -66
5566f6l2J04k16K80m0j09J6j6O1K2P9j24K0M4K8j03Q2j30L4l0R8k9n9L0p1%J21
$$ -66 -98 6 -210 70 30 -79 -63 -79 -18 4 83 -41 -21 23 51 -52 30 -100 -66 -96 2 -27 -86 -56 -127 -127 -6
5593fmM0Lk3M3Kk5Qn2O4j3L9jo5j1k9J06k11lN8J5R9J9J7j4j21R1M2j5m2j9Q9
$$ -6 -10 30 33 10 53 55 30 38 -14 50 37 76 75 10 -1 -30 76 -135 -138 -80 -65 34 53 70 56 -65 26 68 53 11 -8 81
5625H1o1J0%k1k9q0J10J5K7n9j48J94j34P8J30r5j11N6k8J19O3j27J16m2M6o3
$$ 81 20 30 30 9 -20 -100 10 25 52 -7 -155 39 -95 -17 113 18 -93 -37 -65 54 117 -10 106 64 110 47
5651D7qk03J48k1k7m5k5M2J01L4q6Jp0J09k7P2k6m8J50r7J8pJ14j51%q0J35j00
$$ 47 39 -164 -16 -37 -64 -109 -134 -92 9 43 -43 -42 -112 -3 -30 42 16 -32 118 21 39 32 146 -5 -5 -85 50 -50
5679e0n5N1J43j64K8J2R8J9r0qR0j57Q5l6J35L4k04J32j58Q3l2M1j19N6J5k3N4
$$ -50 -105 -54 89 -75 -47 -35 63 82 -8 -16 74 -83 2 -34 101 135 -69 63 -95 -12 -44 -3 -122 -66 -51 -74 -20
5706b0J26j19M7n4j6J22m2J02j34Q0j52J23j07M4L7k19K77j90M3P1Rj28K2l1J80
$$ -20 106 -13 34 -20 -36 86 44 146 12 92 -60 63 -44 0 37 -182 95 -95 -52 19 28 -100 -78 -109 71
5731G1k9p6J13o9Q9j86K51j28p1J0J04j48P0J5Qj08R1m8O8m7M0j9k6nPJ11p6j7
$$ 71 42 -34 79 10 99 -87 164 36 -35 -25 79 -69 1 16 24 -84 7 -41 27 -20 20 1 -25 -30 -23 88 12 -5
5759ek8L4Q2j5n7rn9L7n2J61j17R7m2k6o5Q2J2o2J12O6o4j27J05O3p5n9P8k42
$$ -5 -33 1 83 68 11 2 -57 -20 -72 89 -28 69 27 1 -64 18 30 -32 80 146 82 -45 60 123 48 -11 67 -175
5787a75J64J8k9m4K6N2L1j6L4K6p9L5n8N5j21J48m9n1J9R2k1q4L3l0j2QR3j60
$$ -175 -11 7 -22 -66 -40 12 43 27 61 87 8 43 -15 40 -81 67 18 -33 -14 78 57 -27 6 -24 -36 -28 65 -95
5815i5L8L6n4L6Q0O4j63PJ46j56J15o5K3j1k0R4q7Np1J00j52O1J28o3oP8o7K7
$$ -95 -57 -21 -75 -39 41 105 -58 -51 95 -61 54 -11 12 1 -19 75 -12 -7 -78 22 -130 -69 59 -4 -10 68 1 28
5843B8J47r2l3r2Q4j08N5%K4q5M9j7O3q1k8N4q0J28j8r8PJ38p3rJ08l3n6O7m3
$$ 28 175 83 50 -42 42 -66 -11 -11 13 -72 -23 -40 23 -58 -86 -32 -112 16 -2 -100 -93 45 -28 -37 71 38 -18 49 6
5872Fjj00J95j48m6J13M6j87J30l9J0m%N8j07J6K10j01r1J67k0q5P5P5k34O6k2
$$ 6 5 -95 100 -48 -94 19 65 -122 8 -31 -21 -25 -25 33 -74 -58 152 51 -40 127 107 22 97 172 -62 4 -18
5899a8O7j50J59o6J1N9m8M5k05J89p3J7J01M5p5n6k2O8L5k7m0n8N6mK2j32R4K8
$$ -18 49 -101 58 -8 3 62 14 59 -146 43 -30 -13 88 133 58 2 -20 48 83 56 16 -42 14 10 32 -100 -6 22
5927B2p0J03Oj17Q0j14J74l1K0N6k06J56p2k7Q1L0k95J66n8Q5o9m1J37K2k58L71
$$ 22 -48 55 61 -56 24 -90 84 53 73 129 -77 79 7 -20 61 91 -204 -38 -96 -11 -80 -121 16 38 -220 151
5953A51j46l5J06j27P9Jj9J84k13m4J52q2M1mn5l1N2q5N3r2J92L1r1kJ19r6J9
$$ 151 5 -30 76 -51 28 29 10 194 -19 -63 89 7 48 44 -11 -42 10 -75 -22 -114 78 109 18 16 135 39 58
5980E8q0J24k5m1K8j6lK2n5q3K8o8L2J23j01Q4o3k2J16q5J39J5k35J06lJ6l3r3
$$ 58 -22 102 77 36 64 48 45 67 12 -71 -43 -111 -79 44 -57 27 -36 -58 58 -27 112 127 -108 -2 -5 11 -22 -115
6008a15J03j02Q7K7mm4J2M2l7J1K8K1omN0n9K1K5q3P1m9qM5q6l7J00k2o2o4J34
$$ -115 -12 -114 -27 0 -4 -48 -36 6 -31 -20 8 29 23 19 69 10 31 56 -27 44 -5 -13 32 -54 -91 9 -13 -75 -139 -5
6038ek0p0K1J09jl2P9j1j3q6M8Lj1Qqj0k6K5m3r2J52o0n3J11k8o4n5J64j8N6q0
$$ -5 -25 -95 -74 35 34 2 81 70 57 -29 19 22 11 19 11 1 -25 0 -43 -135 17 -43 -96 15 -13 -77 -132 32 14 70 -10
6069a0Q7j8n3K19q7j62RP6j06q4J12M9r6K5J4ppK4M1r2J51K3j22K9M9P3m4l2k
$$ -10 77 59 6 225 138 -24 -15 61 -45 -129 -17 32 -64 -39 -25 -32 -39 -15 26 -66 85 108 -14 15 64 137 93 61 59
6098E9j44P7Q7j66j5J58p7k5L8K2J9r7N7n3J06p1N7p0qM5p6J23r8O3L1q4M1N5
$$ 59 -85 -8 79 -87 -102 56 -21 -46 -8 14 33 -64 -7 -60 46 -25 32 -38 -46 -1 -77 46 -52 11 42 -42 -1 54
6126E4j19J1j6O3rJ12o2p1Q9Rm9O6j56O3n6J29m9q3K3P7j46J33q2L5k1J0nJ21
$$ 54 -65 -54 -70 -7 -16 96 34 -37 52 61 12 78 -78 -15 -71 58 9 -74 -51 26 -120 13 -69 -34 -55 -45 -50 71
6154G1J2j9Q3j57RJ4p6K0O8j61J52o0P3j3L3j40P5o5M6%nP6j01Q9P2n0M6o2Q3
$$ 71 83 64 147 -10 -1 13 -63 -43 25 -136 16 -44 29 16 49 -91 -16 -81 -35 -35 -40 36 -65 24 96 46 92 30 113
6183A13o6j36J48k1n3q0N3NJ3m0l8P9k0K6l1LL9M7M2pj80J25k5K1J39k54J17M0
$$ 113 47 -89 59 38 -15 -95 -42 -37 -24 -64 -102 -23 -43 -17 -48 -45 -6 41 83 76 -104 21 -4 17 156 -98 19 59
6211E9p4j13R2o3o5Q7N9PP2o9k8N9m6J20n4j15J47r4n3J86o6%p8l3J18j22J22
$$ 59 -15 -128 -36 -99 -164 -77 -18 -11 61 -8 -36 23 -23 97 43 -72 75 -19 -72 114 48 48 -30 -63 55 -67 55
6238E5q4J46j89J52l1r9J17j37M7P8R8k25K61k33K1P3j25Q4j33J06J14j37K7O2
$$ 55 -29 117 -72 80 49 -50 67 -70 -23 55 153 -72 189 -44 -23 50 -75 9 -124 -18 96 -41 -14 48
6262D8k1j00O1K9qK9J04j47N2MQ0q3j36J36j24RPPj5N1j04J21K3l5Lk1M1J49j19
$$ 48 27 -73 -12 17 9 38 142 -5 47 51 131 48 -88 48 -76 -67 -60 -53 -68 -17 -121 0 23 -12 -9 -30 11 160 41
6291D1M4j89J16K4j2n2R5L9j70N8l1J7N4j71L0Q2K9J2j46J99l5K6m5J01j07q1
$$ 41 85 -104 12 36 24 -28 67 106 -64 -6 -37 -20 34 -137 -107 -25 4 16 -130 69 34 60 15 116 9 -72
6317g2J65n9q0Pn0J17p5J0M8L6Lr0l1O0N0J30j79J60p0Mj1p1m9O7J05j59R1O8
$$ -72 93 34 -46 -39 -89 28 -47 -37 11 47 50 -40 -71 -11 39 169 -10 150 80 84 73 2 -47 20 125 -34 57 125
6345A25j91J02j03M7m9K4M1n1P0Ll6j8N6J08j00q2O9M6j0p6l0J21n5r6P5M3q0
$$ 125 -66 36 -67 -20 -69 -45 -4 -55 15 18 -18 -36 20 128 28 -54 15 61 51 -25 -55 66 11 -85 -10 33 -47
6372d7n4O7j09K57p0j33J00q5O0L1l3J23o4q5J54j11q7J53k27N3J33j00j8M1J13
$$ -47 -101 -34 -143 114 44 -89 11 -74 -14 17 -16 107 43 -42 112 1 -86 67 -160 -107 26 -74 -92 -51 62
6397F2K1j99J76k1k08J51jnO7P2q2o0J64k32K4R0l6Jj8J35j76n1J63R6j95K15
$$ 62 83 -116 60 39 -169 -18 -19 -24 43 115 33 -27 137 -95 -71 19 -17 -16 -34 101 -75 -126 37 133 -62 153
6423A53p4o0m5J15j9j9m6Q4q1k1rK7n0m3J8J0O%o2O8P7j7KN4j68J26L4p8K9R9
$$ 153 79 19 -26 89 70 51 5 89 8 -13 -22 5 -45 -88 -70 -60 -54 -54 -116 -48 29 12 14 68 -100 26 60 -18 11 110
6453A10k09J72r9O4j4n3N7j41N9Q9j24J56n2o7N9R3j61O6J23j24o3J05l8K1l5
$$ 110 -99 73 -26 38 24 -29 28 -113 -54 35 -89 67 15 -52 7 100 -61 5 128 4 -59 46 8 29 -6
6478f%j9l1N4k3n7L1N1m7nJ21m7m7P7%m4J86j37mn5M9J0m5j6NqM4j38J80j22m
$$ -6 -6 -25 -56 -2 -25 -82 -51 0 -47 -52 69 22 -25 52 52 8 194 57 53 -2 47 57 12 -4 1 -7 37 -101 79 -43 -47
6509d7L5K2rL0K7J9J1j01J06j38k6j5N4J40p6j19q8J68K3j42J84j04j9J08J8m6
$$ -47 -12 10 1 31 58 77 88 -13 93 -45 -71 -86 -32 108 32 -87 -175 -7 16 -126 58 -46 -65 43 61 15
6535A5M5Q0r5n4O3J3l1j37R4k0J7l3k1j06J57j0j7NN3m1O1l8K8q3k2J76J03k61
$$ 15 60 140 45 -9 54 67 36 -101 -7 -27 -10 -43 -64 -170 -13 -23 -40 -35 18 -23 38 0 28 -55 -77 99 202 -59
6563e9L2O5k3J0j0r3J5J01m3ol6J47j28o6J14M9j50J12K1j2j8J7j8M2q3m4pq2
$$ -59 -27 38 15 25 15 -78 -63 38 -5 -11 -47 100 -28 -94 20 69 -81 31 52 40 22 39 21 63 -20 -64 -71 -153
6591a53K16m3p9J14j8j41N0JJ0JQ0l8p7Q5L5j6l5j00K04j68J19j7q8M0J10l3K
$$ -153 63 20 -59 55 37 -104 -54 -53 -43 -42 38 0 -77 8 43 27 -8 -108 96 -72 47 30 -58 -18 92 59 61
6618F1j11N6O3n3K7j02N2O1kj59K52k33J35rk9N8o5j00J49j69P1L1Rk0K0J35j79
$$ 61 -50 6 69 16 43 -59 -7 54 52 -107 145 -88 47 38 9 67 2 -98 51 -118 -47 -16 -7 -27 -7 128 -51
6645e1J51J04j73N7r3l6N4o9O8k3k2O4l6k0j4mQ3p6j6lOJ13m1P1p0j63J40L8R1
$$ -51 100 204 31 88 -5 -41 13 -56 12 -11 -33 31 -5 -25 -39 -43 40 -36 -52 -55 -49 64 23 94 24 -139 1 39 130
6674A30j31n7N6K1J01j29m1K6J1M8j02M9k1p5J00l4N0P8o3L5j14L1L2J8o0oK00
$$ 130 -1 -58 -2 19 120 -9 -50 -24 -13 35 -67 -18 -39 -114 -14 -48 2 80 17 52 -62 -31 1 19 -41 -47 153
6701A53j46o3m5JM9rR9J0j15j21J70jj5J12j08J06Ro8q8q0J85l0L6k4ok6j7N5
$$ 153 7 -56 -101 -100 -51 -60 39 49 -66 -187 -17 -18 -33 79 -29 77 86 18 -70 -150 35 5 41 17 11 -15 -32 23
6729B3p2J29r0Rk9J51l1N2j47J30q3L1p2J06j47j70K62j20p1M9R5kp5J18j36J46
$$ 23 -49 80 -10 -1 -30 121 90 142 -5 125 42 73 1 107 -40 -210 52 -68 -139 -90 5 3 -72 46 -90 56
6755E6n9o5J00k2Kk0J11o3N5j2j37J07m4K6k01J80o2l0QP5j09J31p7j2J22m9%
$$ 56 -3 -68 32 10 12 -8 103 40 95 83 -54 53 9 35 -166 14 -48 -78 -70 5 -104 27 -50 -62 60 11 11
6782A1j4J26j00Q9j48Q3q5J50p0o0j7LL4j9n0K7O3l0j3q0J25K7m7n3R4pn0k5L9
$$ 11 -3 123 23 112 -36 47 -38 112 42 -18 -35 -32 2 -17 -67 -40 23 -7 -20 -100 25 52 5 -48 46 39 -11 -36 3
6811CK9j10l6oJ87j34p1J22N3j06J2J15j05O8j0Q5r7J48j54MLl4J09r1L5oj21
$$ 3 32 -78 -114 -120 67 -67 -138 -16 37 -69 -57 58 -47 21 11 96 -1 147 -7 -3 0 -34 75 -16 19 13 -108
6838a08J01J1p5N6N1n5j6J14L9q2k4J0O0m9r0K1Q4n1l7kLm0j8O3Q6j2pj07J88
$$ -108 -7 4 -71 -15 36 -19 -35 79 118 36 12 22 82 33 -57 -36 48 -3 -40 -42 -39 -79 -97 -34 52 40 33 -74 114
6867A14j29M1q5J06k1n8N5n2Q1j16J07r3lM5Oq8j37K27P6k10J08rN2m2LR0j50
$$ 114 -15 26 -59 47 26 -32 23 -29 52 -64 43 -50 -53 -8 -2 -90 -227 0 76 -134 -26 -35 17 -25 -22 68 -82
6894h2L2J68r0nm1O6m2r7J10j2pj05L7k6J80o7p9j1Q7q7J89m9q6O0L2j7k4P5q0
$$ -82 -50 118 28 23 -18 48 6 -91 19 7 0 -105 -68 -94 86 19 -60 -71 16 -71 118 69 -17 43 75 58 34 109 29
6923B9j72J38L8k1j00N2P7j69J00J00p2O5j22K04j30o2J43m6m1l4J25k20J24K4
$$ 29 -143 -5 33 12 -88 -36 41 -128 -28 72 0 65 -57 147 17 -45 98 52 11 -23 102 -118 6 30
6947C0q1N0k2P3k14J80L9l7o9J52j82K14m1q3N1k1j9O6m0n8J2J35qj58K8j35J64
$$ 30 -51 -1 -23 50 -164 16 55 18 -51 101 -81 133 92 9 60 39 20 86 46 -12 0 135 127 -31 -3 -138 26
6974B6p2m6K4P7q3J9J40k1p0P1q6K0O5r8R0j7Q6j05M8k0p5ON1m3l6L0P0l0N2o5
$$ 26 -46 -92 -68 9 -74 -55 85 64 -6 65 -21 -1 64 -34 56 39 125 20 68 48 -27 -21 30 -13 -49 -19 51 21 73 8
7004Hk2L4j18M5J5R0L7j36L3r4J2J79j56M9N9ko4P5j51J06P5j3j15J59p2J5m3
$$ 8 -14 20 -98 -53 -38 52 89 -47 -14 -108 -96 83 -73 -24 35 33 -31 44 -107 -1 74 61 -54 105 33 48 5
7031Epn9N5Q6o5j1j04J61j41L1M1P0q0J5Qk2O0j3jL4j3k1j9Q3j32O1j09M1m5Q3
$$ 5 -2 -61 -6 80 15 4 -100 61 -80 -49 -8 62 -18 -3 5 -17 43 30 29 63 50 29 10 93 -39 22 -87 -46 -91 -8
7061hR3m9j0j05R6j2K2n4P9q1M4Pj9K1R0j51J21j53L0j10P5J7n4J42j0m7R2j02
$$ -8 85 36 26 -79 17 5 27 -27 52 -29 15 22 3 24 114 -37 84 -69 -39 -149 -74 -57 -111 31 21 -26 66 -36
7089c6J3N9k8N3j15O2k8q3J05O4Jp3j6jj5j0J11k7j42J10o1m7P1m9J07M4k0k0
$$ -36 -23 36 8 61 -54 8 -20 -103 2 66 67 -6 -22 -23 -38 -48 63 36 -106 4 -57 -104 -33 -82 25 69 49 29
7117B9m0p4P2J4k9Q1p1M9n9n7Q5n0J47l9j25J3J39j4j18l1J54M1j27J10q9J0k9
$$ 29 -11 -85 -13 1 -28 53 -18 31 -28 -85 0 -50 97 58 -67 -54 85 71 -47 -78 76 117 -10 100 11 21 -8
7144hM4l1O3j36J04m4n6O2J08j02l7N4n5O9K3k0L4m2k2j0J4J9k7J03M5k26MO6
$$ -8 36 5 68 -68 36 -8 -64 -2 106 4 -33 21 -34 35 58 38 72 30 8 -2 12 31 4 107 152 -74 -70 -4
7172dk6l1O3k3%J65j98N5nM6L9j39K16k69J24j2K3N3j40K6L5q0N4O4r6M5o8J51
$$ -4 -30 -61 2 -21 -21 144 -54 1 -4 42 81 -58 158 -111 13 1 24 77 -63 -37 -2 -82 -28 36 -60 -15 -83 68
7200F8o6mJ9J22j78L0j5J05k2J7m1l2mo2M5Mp1R1j59K7R1o7M6M4j0l2O9L6j4J9
$$ 68 2 -2 17 139 -39 -9 -24 81 59 76 35 3 -1 -63 -18 -14 -85 6 -153 -126 -35 -102 -56 -12 -22 -54 15 51 37 56
7230E6o1J25j64K4q0qN9o0K0R2n0o8P8J1p2J33K8m5lK6J43j80j7L0K6JM7m0j30
$$ 56 -5 120 -44 -20 -100 -108 -49 -109 -89 3 -47 -115 -37 -26 -98 35 63 18 15 41 184 4 -13 17 43 44 91 51 -79
7259g9m5J84p4q2J39L0j19M9q3J13o1J4k4J44j17Q4M3k17R4p0O3q1J40p5q6J78
$$ -79 -124 60 -14 -96 43 73 -46 3 -80 33 -28 -14 -38 106 -11 73 116 -101 -7 -77 -14 -95 45 -30 -116 62
7285F2j27J20j22K5Q5k2oj8OR4j07nO5j2Q2j01O5j06K9N8kj71J90j30l4J4Q0L2
$$ 62 -65 55 -67 -42 43 21 15 -3 3 97 -10 -15 50 38 120 19 84 -22 7 65 63 -108 82 -48 -82 -68 12 44
7313D4r1J18r0K5j29J19J9r0J24n1j07J9J16r8LJ23j05OO4k3M7m6k0Q5o6P9j06
$$ 44 -47 71 -19 6 -123 -4 15 -75 49 -2 -109 -90 26 -72 -69 54 -51 -45 19 -4 43 -3 -23 62 -4 75 -31
7340c1j01J59p6lQ9K5j54Q3M7l9Plo9j3N9J3j0M6k4J8j25K82q7j83Q6j9J00j36
$$ -31 -132 27 -49 -52 37 62 -92 -9 38 -1 6 3 -66 -79 -20 -7 -17 29 5 23 -102 180 93 -90 -4 -23 77 -59
7368e9L6O8j24J1O5Q7K3j11J55j70J0K9J4k1m4Q8Ol2m8%P5r3P6q0J1K7J5n2R2
$$ -59 -23 45 -79 -68 -3 84 107 -4 151 -19 -9 20 34 13 -31 57 63 31 -17 -17 58 -35 41 -39 -28 -1 14 -38 54
7397E4j9k8p5Q0O4r7P9j44Q6p3R8N3j39j6O4n9J09m8J00j58PO5K6L8j22Kj6N8
$$ 54 35 7 -68 12 76 -21 58 -86 0 -73 25 78 -61 -77 -13 -72 37 -11 89 -69 -62 3 29 67 -55 -53 -69 -11
7425a1Qk2j7N4l8j2j07J43M1j29J06o4M6j2J29j51n5P5j01J62j10O3QJ7l9M5n0
$$ -11 -3 -25 -42 12 -26 -38 -145 -2 39 -90 16 -48 -2 -14 115 -36 -91 -16 -117 45 -65 -2 6 23 -16 29 -21
7452b1P7o2J16p3n3k0m2M6rl1R3q4K1k6L0N3m7J00n3N3l2n3Q4q6K3m2Mlo1J48
$$ -21 56 -6 110 37 -16 -36 -78 -32 -41 -72 21 -63 -42 -68 -38 15 -32 68 15 68 36 -17 67 -19 4 -38 -34 -37 -98 50
7482E0j55J56k5n3%R0r7M9N7k7J7j19J0N2o8J37k9j02P0n0l8J53k66P5J66l8p4
$$ 50 -105 51 26 -27 -27 63 -34 15 72 45 62 -57 -47 5 -63 74 45 -57 13 -37 -75 78 -188 -113 53 15 -59
7509e9KJ25j50J75q5%J10j14j06J0O3J5J99j21j82O0R1j0L8o5m3M0l1j0K8r4M1
$$ -59 -57 68 -82 93 8 8 118 4 -102 -92 -29 -14 185 64 -118 -58 33 23 61 -4 -47 -7 -38 -48 -20 -114 -73
7536g3k2J75m2j62J06N6M1j45Q5p3R6o9p5P6rO0n6J33j89J10o6N3mj13J12O1j6
$$ -73 -95 80 38 -124 -18 38 79 -66 19 -54 42 -27 -102 -26 -35 25 -31 102 -87 23 -43 10 6 -107 5 66 50
7563E0j7L6j74J19n4J78o4Nm6j19p2K57l3j37R2j01RM5pP4k2n6J8P8n2Jk5R2j21
$$ 50 33 69 -105 14 -40 138 74 79 33 -86 -158 99 66 -71 21 -80 -71 -26 -33 41 19 -37 -19 59 7 8 -17 75 -46
7592d6P8k8L9n3k19K83n7M6q0Q3j79J83L3m0Q5j49N1J0J7k1j86P5O8n4N0P1r6
$$ -46 32 4 43 -10 -229 54 -3 43 -37 46 -133 50 83 43 128 -21 30 40 57 36 -150 -75 -7 -61 -11 60 -36
7619c6m3L5J5K3L8n2j3ln6J20l2J1p1J5P1j16P5P2k07R7P0o2L0J0N5j40N8O8j74
$$ -36 -79 -44 -29 -6 32 -20 -33 -36 -92 28 -4 7 -64 -49 22 -94 -19 53 -154 -57 13 -49 -19 -9 46 -94 -36 32 -142
7648a42K30j80j5J15O6p7k2k6M6M5k51J85k1PN0q8L8J18n3j9pP7j48J30k2L1j20
$$ -142 88 -92 -107 8 74 -3 -25 -51 -5 40 -211 -26 -47 -40 10 -78 -40 78 25 6 -1 76 -72 58 36 67 -53
7675e3R4Oj4l6N6o8k0Q7k2Rj47R7L6l9K9o4J3J79j84J13j27J13o3p3J25k3l4P2
$$ -53 41 47 33 -3 53 -15 -35 52 30 39 -108 -11 25 -14 15 -49 -36 143 -41 72 -55 58 -5 -78 47 24 -10 62
7703F2j43P6jj4P2j20N3m3J24r7Q5n5K8ql0l5M8K1j00R9p5pO5n4kP3j09N6M8j1
$$ 62 -81 -5 -6 -20 52 -68 -15 -58 66 -31 54 -1 27 19 -11 -46 2 23 -77 22 -53 -60 5 -49 -51 22 -87 -31 17 6
7733FrJ6pj2Qk3J19j22Q7L6q5j24J12RJ6K7j65M0P4k8k2R8r4J02p7J06k06J27
$$ 6 -3 13 6 -6 2 -21 98 -24 63 99 14 -110 2 11 27 54 -111 -71 3 -25 -47 51 -43 59 -18 88 -118 9
7761IJ1P9l0j07O0k7m1P7L7n6m9N0R3j7j94L2o4J33Mq7J29P9j27o6J74j14L3k8
$$ 9 20 99 69 -38 22 -5 -46 31 68 12 -37 13 106 89 -105 -73 -137 -4 0 -87 42 121 -6 -72 102 -12 21 -7
7789gJ3rj21J93p6j91J49L3NM9j68J67M4m2J9j11J16o3o0J50l3Nr7K0K13k27N5
$$ -7 6 -3 -124 69 -7 -198 -49 -16 -11 38 -130 37 81 39 58 -53 63 0 -60 90 57 62 -35 -15 198 -29 26
7816B6j0j7o9Q9j4p9N9L9L3m1M2m7N2n2J8L4j2k9m6PN0k9K6o7P9m8l8J42j61l
$$ 26 16 -1 -70 19 5 -74 -15 24 57 16 58 11 63 11 29 63 51 22 -24 -17 33 4 30 -37 42 -6 -44 98 -63 -66
7846f6J64J6j41M1N8Rj00k7O6M2j05J86p0p1j7p8N7KO6n3J15j10O4P1j37k8J86
$$ -66 98 114 -27 14 72 81 -19 -46 20 62 -43 143 73 2 -15 -93 -36 -34 32 -21 94 -16 48 119 -18 -46 140
7873A40l0j41O6N7m5j37n4J21K0N9j55J26l6m5J44r1m9M6RM1p0J4L6O3j29o5M2
$$ 140 110 -31 35 92 47 -90 -144 -23 -3 56 -99 27 -9 -54 90 -1 -50 -4 5 46 -24 -10 26 89 -40 -105 -63
7900f3J51r8p8o0J39O4n0m2L1O8j79Q2K7N7Qn7P3l4j15J75j24M4j2n5J47r6j01
$$ -63 88 -10 -88 -148 -9 55 5 -37 -6 62 -117 -35 -8 49 57 0 73 39 -76 99 -25 19 7 -48 99 3 -98
7927i8J0J69j36R3N8j6o3no4J05o4j40P5K4k4L9L1N1j21N7N2j08Q9K3k0J09p6
$$ -98 -88 81 -55 38 96 80 17 12 -52 53 -11 -151 -76 -52 -76 -37 -6 45 -76 -19 33 -75 14 37 17 126 50
7954E0n0p2Q8J6M2k5j4q2K3L0Ml1J7RO3m8j96N4J81q2J01p1l8K4q5P8J8L9r7N7
$$ 50 0 -72 16 32 74 49 35 -47 -24 6 10 -21 -4 5 68 20 -176 -122 59 -23 78 7 -31 -7 -92 -14 4 43 -54 3
7984CrPL2k1j14J16k6K6M7j62pJ73j26M0rp9J8MQ5r4J18k%ON9r7J9j1Ln3N8J7
$$ 3 -6 1 33 12 -102 14 -12 14 61 -101 -108 65 -61 -21 -30 -109 -91 -87 -2 -96 22 20 20 26 85 -12 7 -4 -1 -54 4 21
8016B1jj7j5O3o7P0m3Q1l3j25J54q8J27k46l6J58r0J41j37M9J4O9j25P5m6n4R5
$$ 21 20 3 -12 51 -16 54 11 92 59 -66 88 0 127 -119 -155 3 -87 54 -83 -34 -20 49 -76 -1 -47 -101 -6
8043fL5m0k3M5j18J04N2r1N2m0R0n8j1M0J0J25k21K9M0j04J25qj21M1J38l4n4
$$ -6 29 -11 -34 11 -107 -3 49 -42 10 -30 60 2 -9 31 41 166 -55 -26 14 -90 35 27 -94 -53 85 51 -3
8070cq7Q7J2J01o2j0om9P3j27l0J17o3J1M2j2l7m0J89j51pN9o4O1J6l3j25K32
$$ -3 -90 -3 9 110 48 38 32 -17 56 -71 -101 16 -47 -36 6 -6 -43 -83 106 -45 -52 7 -57 4 20 -13 -138 94
8098I4j17mPO3J3p2r4J09l1N1o4PM1L1L3l6r7l1J59J9j40J19Mr6Jo1J15p1R7j5
$$ 94 -23 -27 -20 43 56 -16 -110 -1 -32 19 -45 -38 3 34 67 31 -66 -97 62 81 -59 60 64 -32 -31 -92 23 -48 49 34
8128C4o0R0o2KJ4o9N1n0J28l5j3R1j09J33k00O6L4j26J13k8Q6r6Q8r9n6Q6q2o7
$$ 34 -26 64 2 4 18 -51 0 -50 78 43 30 121 12 145 -55 11 45 -81 32 4 90 -6 82 -17 -73 13 -69 -136
8156a36R3po1K59p8j76J89p9LJ1l5N6L3m9nr0L7L7L3m8n4R3j06K0M4k2O8K3m1
$$ -136 -43 -50 -111 148 70 -106 83 4 7 18 -17 39 72 23 18 -72 -35 2 35 -13 -67 26 -80 -60 -16 -38 30 53 12
8185A2p2Q5k9oNJ8
$$ 12 -60 25 -4 -10 -5 13
8191A3
$$ Imaginary data points
##PAGE= N=2
##DATA TABLE= (X++(I..I)), XYDATA
0@%%%%%%%%%%%%%Qj6J6j6J6k4L2l2M0m8N6p0P8q8J04j20J40j64J85k09K40k72
$$ 0 0 0 0 0 0 0 0 0 0 0 0 0 0 8 -8 8 -8 8 -16 16 -16 24 -24 32 -38 40 -48 56 -64 76 -88 97 -112 128 -144
35a44L04l41L84m30M80n36N95o59P30q08Q95r88J087j198J322j454J601j767J949
$$ -144 160 -181 203 -227 253 -283 312 -347 383 -425 470 -518 569 -629 693 -761 840 -927 1022
54A022k151K380k639K934l278L681m158M738n461O395p647R422j2162J6985k7970
$$ 1022 -1129 1251 -1388 1546 -1732 1949 -2209 2529 -2932 3463 -4184 5238 -6924 10061 -17909
69a7909R8926J0778j78601L3650J18334K7885j05656m079Q700R679k240K3543
$$ -17909 81017 91795 -86806 -53156 65178 93063 -12593 -16672 -7972 1707 -533 23010
81B3010n201o6537L743N1201K4919l3502n3436L5761K1657M066j3012j802k68
$$ 23010 17809 -48728 -44985 6216 31135 -2367 -55803 -20042 1615 5681 -7331 -9133 -9401
94i401k1093L7482K5397l0086l9814K3518O5428l7113m0036K0193L2875j0482
$$ -9401 -30494 6988 32385 2299 -37515 -13997 51431 14318 -25718 -5525 27350 16868
106A6868l1925L1423J187k7323P210K5730o752m9902K7312M4890k6416n4502R589
$$ 16868 -15057 16366 17553 -9770 -2560 23170 16418 -33484 -6172 38718 12302 -42200 -32611
119c2611P8213j8969p3124K452O6565K0023p1290j0404M7505J3143k8444r958
$$ -32611 45602 26633 -46491 -44039 22526 42549 -28741 -39145 8360 21503 -6941 -16899
131a6899L1896j3131j5066J6464J5564q869k6851J7806R430q308L243o69l735
$$ -16899 14997 1866 -13200 3264 18828 9959 -16892 914 10344 2036 5279 4610 875
144H75j7809J8681K2400j9323k7145K428M0734l760k9211j811J4967Q374j8747
$$ 875 -16934 1747 24147 4824 -22321 -19893 20841 17081 -12130 -13941 1026 9400 -9347
157i347J0209J0958j8775p403J4363J9759k0826j4145J5267N150o853m565K0058
$$ -9347 862 11820 -6955 -14358 5 19764 -1062 -15207 60 5210 -1643 -6208 13850
170A3850r984k7397J4807L1781K678m7404r261M5261J7276k7598k8797J9191J8468
$$ 13850 3866 -23531 -8724 23057 25735 -21669 -30930 14331 31607 4009 -24788 -5597 12871
183A2871m135n835q212k782o19J9807K418k4908k750J2118J2386q738p311M820
$$ 12871 8736 2901 -5311 -8093 -8712 11095 13513 -11395 -14145 -2027 10359 1621 -5690 -870
197h70l399L276N544N631j1187j1856J0786J3886L594k4386q865K3264R552j1687
$$ -870 -4269 -993 4551 10182 -1005 -12861 -2075 11811 15405 -8981 -17846 5418 14970 3283
211C283j6958Q665R976l965J401k478o576j518J8675K086k4144L59J8151Q188
$$ 3283 -13675 -5010 4966 1001 2402 -76 -6652 -8170 10505 12591 -11553 -11194 6957 15145
225A5145j8207r406J6190L812o435o215L259L390k134O69j765K424l901k35P260
$$ 15145 -3062 -12468 3722 7534 1099 -5116 -1857 1533 -601 68 -1697 727 -3174 -3409 3851
240C851k232k725l107N967K827n684L284k88m466j63R679R6j5179M79J1871N391
$$ 3851 1619 -1106 -4213 1754 4581 -1103 2181 1893 -2573 -2736 6943 7039 -8140 -7661 4210 9601
256I601j2556p961J0707M138j677n093q95M064K46J916j225j513k194K934N201
$$ 9601 -2955 -10916 -209 3929 2252 -2841 -3736 328 574 2490 1265 -248 -2442 492 5693
271E693m718l490P29N457k043o715O502J589o474j964P198L894r525k234P241
$$ 5693 975 -2515 -1786 3671 1628 -5087 1415 3004 -3470 -5434 1764 5658 -3867 -6101 1140
286A140M519n298l853M187K44J686o28k207n02j110M956l99n001j801L106M669
$$ 1140 5659 361 -3492 695 939 2625 1997 -210 -712 -1822 3134 2735 -2266 -4067 -961 3708
302C708l740m161J132N300o57m858L739J043j497p03J899K866n143r41M253O61
$$ 3708 -32 -4193 -3061 2239 1582 -3276 463 1506 9 -694 1205 4071 -1072 -2013 2240 2901
318B901l157j927K513k35l91o05P27p57k870M761J413m000j259K538M589l002
$$ 2901 -256 -2183 330 95 -296 -901 -174 -931 -3801 960 2373 -1627 -2886 -348 4241 1239
334A239l928K527L426j425k638J382m22O8o1m61O87l262J636K659k143j217J72
$$ 1239 -2689 -162 3264 1839 -799 583 161 229 168 -293 394 -2868 -1232 1427 -716 -1933 -1761
351a761K395L43j508k19K139k05k216K778K56j818p40k37L223j445l075P75P46
$$ -1761 634 977 -531 -750 1389 1184 -1032 1746 2002 184 -556 -793 2430 985 -2090 -1315 -569
368e69O98k83o44j320N99J473J662M1m320J409L826O5j706k388J654J508q26L10
$$ -569 129 -154 -798 -2118 -1519 -46 1616 1657 -2663 -1254 2572 2637 931 -1457 197 1705 879 1189
386A189r51k148r1L224j47k284j377J38L293K97j092j062r88K881J606j074j327
$$ 1189 238 -1910 -2001 1223 1076 -1208 -2585 -2447 846 1143 51 -1011 -1999 882 2488 1414 87
403H7j089P95K534K55l566p04J848M50j038j013K009j444k133K717J397j259n48
$$ 87 -1002 -207 2327 2582 -984 -1688 160 610 -428 -1441 568 -876 -3009 -292 1105 -154 -702
420g02N13m27O59K427K7k947j884L101K327j097j794l704R15N341M34n008l159
$$ -702 -189 -616 43 2470 2497 -450 -2334 767 3094 1997 203 -3501 -2586 2755 3189 -1819 -4978
437d978L088L555j85j356j538j535K230N391j237n149q25K234L907N09l755m300
$$ -4978 -1890 1665 1480 124 -1414 -2949 -719 4672 3435 -1714 -2539 -305 3602 4111 356 -3944
453c944K94O513K340o700m674M115M453n69k757j957J909J485J59J069r97j426
$$ -3944 -3650 2863 5203 -1497 -6171 -2056 2397 1828 -929 -2886 -977 508 667 1736 739 -687
469f87k9J041K864o67l930n66K387M94k42q24j520K67n73J572L032k212l719o05
$$ -687 -716 325 3189 2522 -1408 -1974 413 907 665 -159 -1679 -1412 -1985 -413 2619 407 -3312 -3917
487c917N132M983m058o344J494N106J511p05m255k908K805L813J287l749n212
$$ -3917 1215 6198 2140 -4204 -2710 2396 3907 3202 -1053 -3961 -1156 2657 3944 195 -5017
502e017K77M372N372o33r765l279J0485P006o609p797J061P528K898l644l916
$$ -5017 -4740 -368 5004 4371 -5394 -8673 1812 8818 2209 -5588 -4527 3001 5899 2255 -1661
517a661j539L282L482k510k322L90j498O00M227k19n363j240M920L162l721k190
$$ -1661 -3200 82 3564 1054 -1268 -878 -2376 -1776 2451 2232 -3131 -4371 549 3711 -10 -2200
533b200K318N78P62n3k119J381J672l200j818M242K339n051l400M194K392l564
$$ -2200 118 696 1458 1405 -714 667 2339 -861 -2679 1563 3902 -1149 -4549 -355 2037 -1527
549a527P02J745l969L24N905Q59m855l366K241N042K779l248q136k4J1245K569
$$ -1527 -825 920 -3049 -2725 3180 4039 -816 -4182 -1941 3101 5880 2632 -5504 -5528 5717 8286
565H286j0935m382O063L416p27j294k566k558L467N532k464m365J258O08J78N436
$$ 8286 -2649 -7031 -968 2448 1721 427 -2139 -4697 -1230 4302 1838 -2527 -1269 -661 -483 4953
581D953j44q725j256Q618K930p258l376M194R42j128J155j684k619K122K042n19
$$ 4953 4809 -3916 -5172 3446 6376 -882 -4258 -64 878 -250 905 -779 -3398 -1276 766 247
597B47L82p23j607P76L426N51m100L24L078k529r43M187j305n038J26M377J437
$$ 247 629 -94 -1701 -925 2501 3052 -1048 -724 2354 -175 -1118 3069 1764 -3274 -3148 1229 2666
614B666l732k874J463K905K449r18n577L76N525J273k334j853m35K238J220j500
$$ 2666 -1066 -3940 -2477 428 2877 1959 -3618 -3242 2283 3556 1222 -631 -1066 1172 2392 892
630H92j665m81P99M75K51J205k551m019M123N074l242m090J514L384N29k183m49
$$ 892 -773 -1254 -455 20 271 1476 -1075 -5094 -971 4103 861 -3229 -1715 1669 2198 15 -434
647d34P09J16J287l08k402L56J174k4M28j632j360K402P75k652j064K816K436
$$ -434 275 391 1678 1370 -1032 -676 498 474 902 -730 -2090 312 1087 -1565 -2629 187 2623
664B623k898k273K612J236r93J020o20j804J666J654j185k294m4K016Q2q46m31
$$ 2623 -275 -2548 64 1300 307 1327 707 -1097 569 2223 1038 -1256 -1300 716 798 -48 -479
681d79j309N10J729n51o8M79k233J21M566M14m823j238N327J663m959p16K713
$$ -479 -1788 -1278 451 -100 -168 311 -1922 -1801 2765 3179 -1644 -2882 2445 4108 -851 -1567 1146
698A146j470o2K585k263l569K456L028j992k236J926J073j455J347L87k081J401
$$ 1146 -324 -386 2199 -64 -3633 -1177 1851 -141 -2377 -451 622 -833 514 901 -1180 221
714B21K111k207m48K394j306k828K310K884l651l029M190Q11m027J237K680k720
$$ 221 2332 125 -323 2071 765 -2063 247 3131 -520 -3549 641 1452 -2575 -1338 1342 -1378
730a378o24L826k00m104J216M601j371l534K138R90j815P52J08j607O22Q75j083
$$ -1378 -2002 1824 1624 -2480 -1264 3337 1966 -1568 570 1560 -255 497 605 -1002 -380 495 -588
747e88q15J010L18j752R76K717k423j727L530K27k392J498J099j777k53K149J00
$$ -588 -1403 -393 -75 -1827 -851 1866 -557 -2284 1246 1473 -919 579 1678 -99 -352 1797 1897
764A897l478J08L341j003k508P88n0J65J301j184p65J205O94o1p42N39O44q92
$$ 1897 -1581 -1473 1868 865 -1643 -855 -905 -740 561 -623 -1388 -183 511 450 -292 247 891 -1
782aJ043P60k459%K491j572j379J253L68j307n58J277M84j892L91J805p48k75
$$ -1 1042 1802 -657 -657 1834 262 -1117 136 504 -803 -1361 -84 400 -1492 -1101 704 -44 -319
800c19N80m22Q35M84p96q8L12k79K84n47j27j80n46J279o81j656J339R52j096
$$ -319 261 -161 674 1158 362 274 586 307 591 44 -83 -263 -809 470 -211 -1867 -528 424 -672
819f72j69P44L58l04k01J067J15n86K39k94QJ048j300r52J238k43q66L47Lm50
$$ -672 -841 -97 261 -43 -244 823 938 352 591 297 305 1353 53 -899 339 96 -770 -423 -420 -870
839h70j30J091K74j737O84K204j314p75J746k16j137P24L62n31o11O24J50j478
$$ -870 -1000 91 365 -1372 -688 1516 202 -573 1173 957 -180 544 906 375 -236 388 538 -940
857i40M08J045j413l00J249o18k31R18j88l08L41J043k75j156J201L93j566P72
$$ -940 -532 513 -900 -1200 49 -569 -800 118 -70 -378 -37 1006 731 -425 776 1169 -397 375
875C75J099j720p62J115M41q45j048O29L74m02J041l14j487J444J260p44j36j29
$$ 375 1474 -246 -1008 107 548 -297 -1345 -716 -342 -744 297 -17 -1504 -60 1200 456 320 191
893A91l1O64o2j4n74q68J237q2j078M11l53q53J250K71q39J47n7Q58L30m31N04
$$ 191 160 824 762 748 174 -694 543 461 -617 -206 -559 -1412 -162 109 -730 -583 -640 218 548 117 621
914F21m65n43J649j67j024K95m89j1P46n33n11l75m03J058L34p16j6l54L80J666
$$ 621 156 -387 1262 1095 71 366 -123 -134 612 79 -432 -807 -1210 -152 182 -534 -550 -904 -524 1142
934A142n44p60K56k8J024K46r35n41j56L81J130j267j209L01M89O59j89j320L21
$$ 1142 598 -162 94 66 1090 1336 401 -140 -296 85 1215 -52 -1261 -960 -471 188 -1 -1321 -1000
953a000R76J95K87m70l41Q30N6L52J7q35J4K31Q3K01r80p13Q98Q5m10J04l31K67
$$ -1000 -24 171 458 -12 -353 477 533 885 902 67 81 312 395 596 -384 -1097 -199 -114 -524 -420 -751 -484
975d84K61m29R94J59n92J43K07O49L53j220l80Q08P0q7k62q92p4L20L69K78j176
$$ -484 -223 -652 342 501 -91 52 259 908 1261 41 -339 469 539 452 190 -702 -776 -456 -87 191 -985
996i85k01Q99M93O08p03j365J124J534j02q40q24M89Q36l23l69o49o56R75K79
$$ -985 -1186 -287 206 814 111 -1254 -130 1404 1302 462 -362 127 963 640 271 -378 -1034 -59 220
1015B20p71J36m34l96J392M83o78j003N53J918n52j202R07K03p51M85j8o41J75
$$ 220 -551 -415 -849 -1245 147 630 -48 -1051 -498 1420 868 -334 573 776 25 510 492 -149 26
1034B6k15j70J10qJ12r48r2J626o40n79J511n11p37J129L61n29m26K04N45l17
$$ 26 -189 -359 -249 -257 -145 -1093 -1185 441 -199 -778 733 222 -515 614 975 446 20 224 769 452
1054D52N1j05j704N67K135j679j442J213M97m63J54L56k20n65J225R97j517J22
$$ 452 503 398 -1306 -739 1396 -283 -1725 -512 -15 -478 -324 32 -188 -753 472 1469 -48 74
1072G4R67j085N47J018j876r13J702L57j326q91J411K51j648J088J031j843L71
$$ 74 1041 -44 503 1521 -355 -1268 434 791 -535 -1426 -15 236 -1412 -324 707 -1136 -765
1089g65J851q09n88R48J34o28p2R25l33j344J273J88j774O20Q67j364l27R97J23
$$ -765 1086 277 -311 637 771 143 71 996 663 -681 592 780 -994 -374 493 -871 -1198 -201 -78
1108g8m03K13L45m01q2J458k64j343J216N74j361M07M15q39j97M26L56r37n95
$$ -78 -481 -268 77 -324 -406 1052 788 -555 661 1235 -126 281 696 -143 -340 86 442 -495 -1090
1127a090R02q2l40P13o74k42J461k82o98P38J57k00L5K23j61q32N88P26j566k25
$$ -1090 -188 -270 -610 103 -571 -813 648 366 -332 406 563 363 398 621 460 -372 216 942 -624 -849
1147h49J192q94m59R79l30n06O10N38l62n81J138L96j144Q42N84j494M33J074
$$ -849 343 -551 -1010 -31 -361 -867 -257 281 -81 -662 476 872 -272 570 1154 -340 93 1167
1165A167j149m41O87L3j047rR75p51r05J878J09k025J140J236j286K32J163l42
$$ 1167 18 -423 264 297 -750 -759 216 -535 -1440 438 547 -1478 -338 898 -388 -156 1007 665
1183F65p37L49O76j088m82J770q41j374J524j99j943J189R77j250j06J172l2j474
$$ 665 -72 277 953 -135 -617 1153 312 -1062 462 263 -1680 -491 486 -764 -870 302 270 -1204
1201a204R08J967j718p99K524p72j801J513P42j825J24J364p96j757J078J178
$$ -1204 -296 1671 -47 -846 1678 906 -895 618 1360 -465 -341 1023 227 -1530 -452 726
1217G26j854j57K370j408j242J981N2j322J125J108j096p77J487K06k245J003
$$ 726 -1128 -1285 1085 -323 -1565 416 468 -854 271 1379 283 -494 993 1199 -1046 -43
1233d3J778k167q02K059q74j797J460J024j232n09J369J23j359J093J260j640
$$ -43 1735 -432 -1234 825 -49 -1846 -386 638 -594 -1103 266 389 -970 123 1383 -257
1249b57M9J663j026p39J012k06o67K00M98r87q50J388L3j354R71P72j400L60J141
$$ -257 -208 1455 429 -310 702 496 -171 29 527 -460 -1310 78 111 -1243 -272 500 -900 -540 601
1268F01n21l14P83M69o84m47R61n15q18J049j17r87M77l4p47M32M19m49r0N84
$$ 601 80 -234 549 1018 334 -113 848 333 -485 564 447 -540 -63 -97 -844 -412 7 -442 -532 52
1288E2J27p45L87J327j162k48J506o01j105Q78L45p32k12M65k69q81M36O60j084
$$ 52 179 -566 -179 1148 -14 -262 1244 643 -462 416 761 29 -183 282 13 -868 -432 228 -856
1307h56K16J059r14j28J028l97n11J065K60o92j41P27j09j243J164M34j808M34
$$ -856 -640 419 -495 -623 405 8 -503 562 822 130 -11 716 607 -636 528 962 -846 -412
1325d12J146j288o50J261j35n56Q9R17l55q45J315M48j443Q37N68j064L56Q05
$$ -412 734 -554 -1204 57 -78 -634 -545 372 17 -828 487 935 -508 329 897 -167 189 994
1343I94j027k81P83l3j110j08J166q09r25J741m6j660J054J162j155J2J022j47
$$ 994 -33 -314 469 436 -674 -782 384 -425 -1350 391 345 -1315 -261 901 -254 -242 780 633
1361F33p37K97R28j047m99J425p41j219J147J18j314L48Q41m90o07O68N84j040
$$ 633 -104 193 1121 74 -425 1000 259 -960 187 305 -1009 -661 180 -310 -917 -249 335 -705
1379g05M15J424j130m27J581k99j325J037K84q91m40Q57j8j392M57J071j136k77
$$ -705 -290 1134 4 -423 1158 859 -466 571 855 -36 -476 381 363 -1029 -572 499 -637 -914
1397i14J144n77m04J012N0n69L57O32l02m35N07K55j186N21Q16j305j36P92m66
$$ -914 230 -347 -751 261 311 -258 99 731 429 -6 501 756 -430 91 907 -398 -534 258 -208
1416b08m10M22J20m30k00Q74p1p29Q90M26q30M58O06n26l11L20j17k51L9P2n71
$$ -208 -618 -196 -76 -506 -706 168 97 -632 258 684 -146 312 918 392 81 401 284 33 72 144 -427
1437d27l86R55l63p41P88J46m90L89K87r8j65J67M66k97j30N42m05k25O40n54
$$ -427 -813 142 -221 -962 -174 -28 -518 -129 158 60 -105 62 528 231 101 643 238 13 653 99
1457I9n94O76k76m32K95j66J78j02j41O74m63L9P94n57J34P28n47j89L18l28%
$$ 99 -495 181 -95 -527 -232 -398 -220 -322 -463 211 -252 -213 581 24 158 886 339 150 468 140 140
1478A40lk18J63l78K0K21n38J07M16n28M16M43m50J11M38o2Q2k49J91K17m56K2
$$ 140 137 -81 82 -296 -276 -55 -593 -486 -70 -598 -182 261 -189 -78 360 298 380 131 322 539 83 105
1500A05K77o15J02J57m00J73j59k31L99p3J16J25k46L96K08l36L77K32k92J06
$$ 105 382 -233 -131 26 -374 -201 -360 -591 -192 -265 -149 -24 -270 126 334 -2 375 607 315 421
1520D21m3k60J02k24k8K9l20J22q0k83M51j47k68N70k00K23K96j68J72O0k71K53
$$ 421 378 118 220 -4 -32 -3 -323 -201 -281 -564 -113 -260 -528 42 -158 65 361 193 365 425 154 407
1542D07r3k23L39m04j25P1j66l5j3k67K14J78l50M09q8K3L17j18J81J05k53L43
$$ 407 314 91 430 26 -99 -28 -194 -229 -242 -509 -295 -117 -467 -58 -146 -123 194 76 257 362 109 452
1564D52L5m63K63j05l11L6j00j06K8j3Q4k81J6L90k8k77O76q9l8L75k64p1J42
$$ 452 487 24 287 182 -129 -93 -193 -299 -271 -284 -200 -481 -465 -75 -103 -380 296 207 169 544 280 209 351
1587C51j67O5j04j04J89n30j41N64n76j75O56l18j8K38j64K44j0P3M58l83P2M13
$$ 351 184 249 145 41 230 -300 -441 123 -453 -628 28 -290 -308 -70 -234 10 0 73 531 148 220 633
1609F33m86o3L78o33M3K00l61m8P6O4l6k03K60K79n52M85L42o16O01J82m36J29
$$ 633 147 84 462 -171 -128 72 -289 -337 -261 -197 -233 -436 -176 103 -449 36 378 -238 363 545 109 238
1631B38K75j45k00k40K40j43n52O36j99o24N00J84n78L56M43l47J28K43K40l73
$$ 238 513 368 168 -72 168 25 -527 109 -90 -714 -214 -30 -608 -252 191 -156 -28 215 455 82
1651H2N7O76m83o16P86j42p81M29J90p16N2N01j21m68K62M97o22mJ019m99m45
$$ 82 139 815 332 -284 502 360 -421 8 198 -518 -466 35 -86 -554 -292 205 -417 -421 598 99 -346
1672c46R32J0o68M33K92o09k96L93J30q11J97P69r77j21R92n16n59P21J97k92
$$ -346 586 596 -72 361 653 44 -252 141 271 -540 -343 426 -551 -672 320 -196 -755 -34 163 -129
1692a29lP11k30p06Q03K82r02J76O57p40k24N59l78n15K92M64n49k82R84j09q93
$$ -129 -132 579 349 -357 446 728 -174 2 659 -81 -305 254 -124 -639 -347 117 -432 -714 270 161 -732
1713g32R05L91q25K72Q60n24m06M37J96n67k41O80n81o68J047j94j017Q77K74
$$ -732 173 564 -261 11 871 347 -59 378 574 7 -234 446 -135 -803 244 50 -967 -90 184
1732A84p91L4Q13k64l30M68P18r02j25J048n12p37J020n3r54L36L28m77m07N92
$$ 184 -607 -573 240 -24 -354 114 832 -70 -195 853 341 -396 624 571 -383 -47 281 -196 -603 -11
1752a1J19p72K14R46q89k00J193k84o23Q54L6o87K41L64j19n67M33K10j017Q2
$$ -11 108 -664 -450 496 -393 -593 600 316 -307 547 583 -104 137 501 382 -185 248 458 -559 -477
1772d77Q42q66j36P87l77m45N98J96k82M9O39q4n71N58K29r48L55O83r32k13N99
$$ -477 365 -501 -637 150 -227 -672 -74 122 -160 -111 528 444 -127 431 660 -288 67 750 -182 -395 204
1793B04l93m03L14M05n40j96P29j31p60R92L48q31M33M66o64j55N55Q3m94K9N56
$$ 204 -189 -592 -278 127 -413 -609 120 -11 -771 221 569 -262 171 637 -27 -182 373 456 -38 -9 547
1814E47p01l79P94l33p62Q08K80r78L21N51k27k47O83L79r55K24P91p19m32R64
$$ 547 -154 -533 261 -72 -834 -26 254 -724 -403 148 -79 -326 357 736 -219 5 796 77 -355 609
1834F09k05q03M48L64q40j60P60l7q67N81N31j073K87J103o58l39Q24k8p66L76
$$ 609 404 -399 49 413 -427 -587 173 136 -731 -150 381 -692 -405 698 40 -299 525 497 -269 107
1854A07N39n12m75Q70j73j218O00Q44j241l4J286q09o05P14M22o94k5J074m19
$$ 107 646 134 -341 529 356 -862 -262 582 -659 -693 593 -216 -821 -107 315 -379 -404 670 251
1873B51q72J141K43j100M19Q59j078l07O15j04p49K64Q40p26n54J041k0j041Q45
$$ 251 -621 520 763 -337 82 941 -137 -444 171 67 -682 -418 422 -304 -858 183 163 -878 -33
1892c3O57q80J15Q20m22l78L94M92p48l83J003p23o15P89J00q80M74L58o21R8
$$ -33 624 -256 -141 679 257 -121 273 765 17 -366 637 -86 -701 88 188 -692 -218 140 -481 -383
1912c83L02J22k82J59Q06p03k48R61n02n37P83n5o75K19J05j74l05K81J88n30
$$ -383 -81 41 -241 -82 724 21 -227 734 232 -305 478 423 -252 -33 72 -102 -407 -126 62 -468
1932d68J37N99o08m1P86m85o8N90p6l91J15L27j47l56K84P0p17K96M18q58J34
$$ -468 -331 268 -340 -381 405 -80 -148 442 366 -25 90 417 270 -86 198 268 -449 -153 265 -593 -459
1953d59N90l51k85M31J51l11O0M78m2m10O13o8m82J75L92n89l7L70k42l51K72
$$ -459 131 -220 -505 -74 77 -234 -174 304 262 -148 465 397 -85 90 482 -107 -144 226 -16 -367 -95
1974i5K25m77k07P05j06o24O99K17o02M40J66k98L7K72J38o60J54N27o03k71N54
$$ -95 130 -347 -554 151 45 -579 120 337 -265 175 341 43 80 352 490 -170 -16 511 -92 -363 191
1995A91k93n47O67L3m79J17M27l3m39N01K98n08M3O97o11j98O73l75l75K49M2
$$ 191 -102 -649 18 51 -428 -311 116 83 -356 145 443 -65 -22 675 64 -134 539 164 -211 38 80
2016H0j88k03K14Q9o25L50M94o93J92O15k66j81M16k0k02R9R3Q0o53N12K76q69
$$ 80 -108 -311 -97 -8 -633 -283 211 -482 -290 325 59 -122 294 274 72 171 264 344 -309 203 479 -390
2038c90J97L95o34R8L44k34l6J46J80Jk07M09J27m48L15J43m83K81J08m53J29
$$ -390 -193 202 -432 -334 10 -224 -260 -114 66 67 -140 269 396 -52 263 406 -77 204 312 -141 -12
2059a2P8o9j16k03K31k5l31M73n4m22M35Q7k30K16K17j53L0j6K51k70k41L65l72
$$ -12 66 -3 -119 -322 -91 -116 -447 26 -28 -450 -15 72 -158 58 275 122 152 136 387 117 -124 241 -131
2082a31j98L61r1l47K44k0j42K23n2P1O1n8M22p6k74L71k35m3K61l33j3J38j33
$$ -131 -329 32 -59 -406 -162 -182 -324 -101 -153 -82 -21 -79 343 267 -7 364 129 86 347 14 1 139 6
2105Fj7r4j63J57r6q1L09k78K0L13j73J84jQ9O0r8j1M7n9K6J8j72L1k40Pm3N6
$$ 6 -11 -105 -268 -111 -207 -288 21 -257 -237 76 -97 87 86 175 235 137 126 173 114 140 158 -14 17 -223 -216 -259 -203
2132b03m7J47j74O9K63k07K49N7j06J33J6m5J66j62j26K61l04n7J94m15Q6J86
$$ -203 -250 -103 -277 -208 55 -152 97 154 48 181 197 152 318 156 30 291 -13 -70 124 -291 -205 -19
2154a9l92K04P1N4J34k61K99J39k30J65Q0k52J83J33m02J81j23M1q2k35K53M7
$$ -19 -411 -207 -136 -82 52 -209 90 229 -1 164 244 -8 175 308 -94 87 -36 5 -77 -312 -59 -12
2176a2l50K90K51n23L35K16k69K17J34j89L7j52L17n4l25L87k62l78M02k2m07
$$ -12 -362 -72 179 -344 -9 207 -62 155 289 100 137 -15 302 248 -77 310 48 -330 72 50 -357
2197c57K94j61L2Rl9K40j50o7M58k79j00N21j58k56K15J3j50q6M1Lk73R8J83j64
$$ -357 -63 -224 -192 -183 -222 18 -132 -199 259 -20 -120 401 243 -13 202 215 65 -21 20 23 -250 -152 31 -133
2221a33k55N33m18j6M17j29j32L27J24K1l55K34J73m29J3K88l09j25M00l32l12
$$ -133 -388 145 -273 -289 128 -1 -133 194 318 339 -16 218 391 -38 -25 263 -46 -171 229 -103 -415
2242d15K49M1j04r2L37p9k56M83J97m35J44L64m71J89O8o9k11J3J97k66j23K79
$$ -415 -166 -125 -229 -321 16 -63 -319 164 361 -74 70 434 -37 152 220 151 -60 -47 150 -116 -239 40
2264D0j01l56L20J69l57K60J04k05J18K56l3j44l1K55j79l24M44k31l08L59n6
$$ 40 -61 -417 -97 72 -285 -25 79 -126 -8 248 215 71 40 295 116 -208 236 5 -303 56 0
2285@k97J13J65j97o6J46J80k70K37N16o32N2N76m41k42N05j33k56J81M8k19k89
$$ 0 -297 -184 -19 -216 -282 -136 44 -226 11 527 -105 -53 523 82 -160 345 212 -44 137 185 -34 -323
2307c23K43K34p51M10M51o91k0O04k32l05O09K08l59o0M65j02o86M89K16q41L09
$$ -323 -80 154 -597 -187 264 -427 -447 157 -75 -380 229 437 78 18 483 381 -305 184 400 -441 -132
2328a32M50n54j96N14j03k97O1N00j87l16N24N8o87M99M75p24J00N00l53k80K00
$$ -132 318 -236 -432 82 -21 -318 -257 243 56 -260 264 322 -365 134 609 -115 -15 485 132 -148 52
2349E2J84m77j95O96l33n75Q51o3o95M50M05l49p5L39o0l16J70M92n17k38O95
$$ 52 236 -241 -436 260 -73 -648 203 140 -555 -105 300 -49 -124 215 155 -161 9 501 -16 -254 441
2370D41j84p64O03J39o50J61L85j87m95M80L04m91l9P81m46l78O62p6m37L51K22
$$ 441 257 -507 96 235 -415 -254 131 -56 -551 -71 233 -258 -297 484 38 -340 322 246 -191 160 382
2391C82l38j60K50j02l80L21K52o32J70M14l28l35N64K45m54J9L61j44k52N23
$$ 382 44 -116 134 32 -348 -27 225 -407 -237 177 -151 -486 78 323 -131 -112 249 105 -147 376
2411C76l9n67L73J73n45J78L34n01k54M77M4l18L2K50J9k38M64j08l92M71J78
$$ 376 337 -230 143 316 -229 -51 283 -218 -472 5 49 -269 -237 13 32 -206 258 150 -242 229 407
2432D07n61J72L67k50k07J17K59n86K1M82l81k90M66J32p62N83K56l13m5M32J2
$$ 407 -154 18 385 135 -72 45 304 -282 -261 221 -160 -450 16 148 -614 -31 225 -88 -133 299 311
2453C11n40K69M57m76j68P31m93m68N51j20l88L11K61l53l80L92L21n39K03P19
$$ 311 -229 40 497 21 -147 584 91 -377 174 54 -334 -23 238 -115 -495 -103 218 -321 -118 601
2473F01p41o4O23k91l11L55J90m25Q1J66o7m98M07J73o18K00N89p31mN01o9l57
$$ 601 -140 -204 419 128 -183 172 362 -63 18 184 117 -381 26 199 -419 -219 370 -361 -365 136 67 -290
2495b90L61J97k81k62P31j70m90M68N2o12J09L83l64j43K94Q3l19O3L76l27k55
$$ -290 71 268 -13 -275 456 286 -204 264 316 -296 -187 196 -168 -311 -17 66 -253 -190 186 -141 -396
2516c96O43O6n89M21L02m42j5L66j07m07J75K35n11MM83l50l64N40j4l90J85M08
$$ -396 247 313 -276 145 447 5 -10 356 249 -158 17 252 -259 -255 228 -122 -486 54 40 -350 -165 243
2538B43l15m1K79L9k76K5L73k89j30L90l39k21M05Rm27Q4J73r0l03L46K34m13
$$ 243 -72 -113 166 205 -71 -46 327 38 -92 298 -41 -262 143 152 -275 -191 -18 -108 -411 -65 169 -244
2560b44R3M04l31j2L97j88j15K09M4j33k64L03l7l36K62N8n13K56J95l19J1L59
$$ -244 -151 253 -78 -90 307 119 4 213 257 124 -140 163 126 -210 52 110 -403 -147 48 -271 -260 99
2582I9pj58R4J78j42j73L54l4l99L47Q9m78J35J22j44M0j34J70k81R6K45l0j90
$$ 99 92 -66 28 206 64 -109 245 211 -188 159 248 -230 -95 27 -117 -77 -211 -41 -322 -226 19 -11 -201
2605b01L00o3r7O5K80l10O3J37o3j79J18J48k75j58L30k15k65L65j26o6P1J47
$$ -201 99 36 -61 4 284 -26 37 174 111 -68 50 198 -77 -235 95 -120 -385 -20 -146 -212 -141 6
2627Fj14P9J1J38j25PK94l48J1L11j85k65L70j05k03O6%J0j25J20J51k12M1J57
$$ 6 -108 -29 -18 120 -5 2 296 -52 -41 270 85 -180 190 85 -118 -52 -52 -42 -167 -47 104 -108 -67 90
2651I0k03L8L37k39J03n9R2l7j27nK3j64P5K48m31J52J04j07m1J17O4P2j55P8
$$ 90 -113 -75 262 23 126 67 159 122 -5 -10 13 -151 -76 172 -259 -107 -3 -110 -151 -34 30 102 -53 25
2675B5Rr8K05J21k93J60O9k24Q2n3j9r3k3O5m6r4J23J6k4J03j0l9K34m0rL0j57
$$ 25 34 -64 141 262 -31 129 198 -26 56 3 -16 -109 -132 -67 -113 -207 -84 -68 -92 11 1 -38 196 156 147 177 20
2702B0J12n4j07Q0Nj11Nq8N9O9q0n6J03o1J06%j8P1O1q0K22k28K4O0j86O3J47
$$ 20 132 78 -29 51 56 -55 -50 -138 -79 -10 -90 -146 -43 -104 2 2 -16 55 116 36 258 30 54 114 -72 -9 138
2729A38k14Q3j56lJ92p9k2nlJ61j18l2J89j18l2J70j33j2J73k05M3O7l5k40J05
$$ 138 -76 7 -149 -152 40 -39 -61 -66 -69 92 -26 -58 131 13 -19 151 18 6 179 -26 17 84 49 -191 -86
2754h6j56O9N0n3P9q4N6K04n3L2p6J61j3o9o3O5m4R8q3j04J67k03r4R8R9j51M6
$$ -86 -242 -173 -123 -176 -97 -181 -125 79 26 58 -18 143 130 61 -2 63 19 117 34 -70 97 -106 -200 -102 -3 -154 -108
2781a08O4o2J20nM7J05j82J86O3k33M9J59k88J67rr5j11O1j08L9n3J62q3j58K68
$$ -108 -44 -106 14 9 56 161 -21 165 228 -5 44 203 -85 82 73 -22 -133 -72 -180 -141 -194 -32 -115 -273 -5
2806eJ61l49K26P3j73k3K58M4k67O8K42k24j17K37k59j51L35j3k91J96L2n8j3
$$ -5 156 -193 33 106 -67 -90 168 212 -55 13 255 31 -86 151 -108 -259 76 63 -228 -32 0 -58 -71
2829g1K00L8k14p4M15l54o6M57k90j25J09j6Nj95J95r7k68K43J82k85K8L79k37
$$ -71 129 167 -47 -121 294 -60 -126 331 41 -84 25 9 14 -181 14 -83 -351 -108 74 -211 -183 196 -41
2852d1r0K68mq3j48K53j30j29K16m4j75J09J63l71M7L27j90k78K45P6j00p5M38
$$ -41 -131 137 133 50 -98 155 25 -104 112 68 -107 2 165 -206 -159 168 -22 -300 -55 21 -79 -154 284
2875B84k31j41J88K07m73J44K13l49L3K08j3j62M3K16l64o6L34j15l01M09J11
$$ 284 53 -88 100 307 -166 -22 191 -158 -125 83 70 -92 -49 167 -197 -263 71 -44 -345 64 175
2896A75l83K00J29R4l06K13O9l53Q0L05k38k01L05o6l46L52k1l14K27K85k58n4
$$ 175 -208 -8 121 215 -91 122 191 -162 -82 223 -15 -216 89 23 -323 29 8 -306 -79 206 -52 -106
2918a06J23J76k28m3M95m21j89M28j38k24J83j8j14p1K39j03l07J37K98k23k7
$$ -106 17 193 -35 -78 417 -4 -193 235 97 -127 56 38 -76 -147 92 -11 -318 -181 117 -106 -133
2939a33K59j42j54K76j8j6L4M5rk61L07n4l44J71J14k17p0K74j96j27K62J33j97
$$ -133 126 -16 -170 106 88 72 106 151 142 -119 188 134 -210 -39 75 -142 -212 62 -134 -261 1 134 -63
2962f3k8L28j77k67M20Ol60K01J96l52R3J75j58r2N7J71l73P6J91r8k76N05n2
$$ -63 -91 237 60 -207 213 219 -141 60 256 -96 -3 172 14 -78 -21 150 -223 -147 44 -54 -330 175 123
2985A23k31M8J82r3MJ42J17m75J10L70l65k22N21k71l21M49j9k67LL31j14k38
$$ 123 -108 -60 122 29 33 175 292 -183 -73 297 -68 -290 231 -40 -361 88 69 -198 -195 136 22 -216
3007b16K31J65l91O3M58l03j28L62j29l33J51K66j60k58K30J13l97K54K19m33
$$ -216 15 180 -211 -148 310 7 -121 241 112 -221 -70 196 36 -222 8 121 -276 -22 197 -236
3027b36K5M88l07j98L65rr1j17L53j12k75L09j8n22L47K21m10L0J40j1j78J80
$$ -236 -211 277 -30 -228 137 128 37 -80 273 161 -114 195 177 -345 2 223 -187 -157 -17 -28 -206 -26
3049b6J97j41j86L88j33k10K16Q8l87L86j2k72qR9J11k44P8J88k67j10L35ol31
$$ -26 171 30 -156 232 99 -111 105 193 -194 192 180 -92 -100 -1 110 -134 -56 132 -135 -245 90 84 -247
3072b47L16L1k52J24Q6k8q8K10Jj72o9K88l11j53M64j43j65J17k8l00K15J21J1
$$ -247 69 100 -152 -28 58 30 -58 152 153 -19 -88 200 -111 -264 200 57 -108 9 -19 -319 -104 17 28
3095B8k51K08R4l12K44K65j68r1K70k30j64J3K59k51o9K24K7k46R8J54m40K66
$$ 28 -223 -15 79 -233 11 276 108 17 287 57 -107 -94 165 -86 -155 69 96 -150 -52 102 -338 -72
3117g2L22l22m4K57jk29J64M0j27p7K82k04k14J87J75l07Q0J07n9j58L2J22p4
$$ -72 250 -72 -116 141 140 -89 75 115 -12 -89 193 -11 -225 -38 137 -170 -90 17 -42 -200 -168 -46 -120
3140a20m2L57j95k14L69j22k65K21J75k08O6Q3o2j19o7K79j38k48L84j61j27K38
$$ -120 -162 195 0 -214 155 33 -232 -11 164 -44 22 105 43 -76 -143 136 -2 -250 134 -27 -154 84
3162H4K1j61J2J54j52j52L00J82m30J53J64k69Q2J12j31l2O8k3jn8L5J31j39o1
$$ 84 105 -56 -44 110 -42 -194 106 288 -142 11 175 -94 -12 100 -31 -63 5 -18 -19 -77 -42 89 -50 -111
3186a11K81l16M2L32k92J03J29p0j90R7R1n7m2K3Q0k36J37J4j82J13O9l5P2n5
$$ -111 170 -146 -104 228 -64 39 168 98 -92 5 96 39 -3 20 100 -136 1 15 -167 -54 15 -20 52 -3
3210ck8K6m7K81j91j28K57p9j39J3J96l38J78P7mo5j81K15r5r8K29j1j09O7K5
$$ -3 -31 -5 -52 229 38 -90 167 88 -51 -38 158 -180 -2 75 71 6 -175 40 -55 -153 76 65 -44 23 48
3235D8j91L41j9k12P1NjQ7k00J49p6p4N1K1j38K37q5N6n0J2o4k4O2J57j85J00
$$ 48 -143 198 179 -33 38 43 42 129 -71 78 2 -72 -21 0 -138 99 14 70 20 32 -32 -56 6 163 -22 78
3261G8P7r8j66J15l6J8j11O2Q8p4k3j2J6RN4n5J79j8j86P1Q5j18N9k9J16j32k1
$$ 78 155 57 -109 6 -30 -12 -123 -61 27 -47 -70 -82 -66 -57 -3 -58 121 103 -83 -12 73 -45 14 -15 101 -31 -52
3288e2N2R5k04Q9Jq9O1j3K4Q1j36J40J0j6q8P3j51O8L6J03j05n8j5J70j97J22
$$ -52 0 95 -109 -20 -19 -108 -47 -60 -36 45 -91 49 59 43 -45 28 -123 -55 -19 84 -21 -79 -94 76 -121 1
3314AL8r5J14m7m5P3m4n3J36m6k3J41j53j9P5j40J14n3j08J79l1r6P6Lo9J79k26
$$ 1 39 -56 58 11 -34 39 -5 -58 78 32 9 150 -3 -22 53 -87 27 -26 -134 45 14 -82 -6 -3 -72 107 -119
3341a19J49Qj70J76Q6j62J34m1r2P6jJ5k25L5J38N0o2n3O8j55P0J42n7j23K11
$$ -119 30 38 -132 44 130 -32 102 61 -31 45 44 59 -166 -131 7 57 -5 -58 10 -145 -75 67 10 -113 98
3366I8q5P9j48K63j70q6J79J0j73J34N2k04N5o6L7q8Q7q7j7J41O0j26k8J92q7
$$ 98 13 92 -56 207 37 -49 130 140 -33 101 153 -51 4 -62 -25 -113 -26 -113 -130 11 71 -55 -83 109 22
3391B2q8J13j32O6m5J11M7j54J68k9j53O5O0Pj02j08J65p0J9M0o5M0oO6r5P4r
$$ 22 -66 47 -85 -19 -64 47 94 -60 108 79 -74 -9 51 58 -44 -152 13 -57 -38 2 -63 -23 -29 37 -58 16 7
3418Gj65J53K1j00P8N1j8Kp0K7JjJ77k95m2L08m8j48J07L7kn4o9Q4j50P1J93j50
$$ 7 -158 -5 16 -84 -6 45 27 29 -41 -14 -13 -14 163 -132 -174 134 86 -62 45 82 80 26 -43 41 -109 -38 155 5
3446Em2K07j40j65P2N1j88J52J49j86K1J81J00l14J16R3p5j06J85j02n0J19j0
$$ 5 -37 170 30 -135 -63 -12 -200 -48 101 -85 -64 117 217 -97 19 112 37 -69 116 14 -36 83 73
3469G3q9q4K19p9j25R7J52k81K4K52j49p4J47M3j83J3J35p9j03J35J00k42RL22
$$ 73 -16 -100 119 40 -85 12 164 -117 -93 159 10 -64 83 126 -57 -44 91 12 -91 44 144 -98 -89 233
3493B33l72jK52l5j39Q2J05j42o6Q6J52k51J52O2k62J61R1l5r8O9J7r0q5J51k16
$$ 233 -139 -140 112 77 -62 20 125 -17 -83 3 155 -96 56 118 -144 17 108 73 -25 44 61 -29 -114 37 -179
3518a79nK21Qj91K27l0k11J46J1J11j03k8J14k0o0J47j27q1P2lj70J67J07j29
$$ -179 -184 37 45 -146 81 51 -160 -14 -3 108 5 -23 91 71 11 158 31 -50 22 19 -151 16 123 -6
3542fK0J14k14N3P2M2r7l2J34j86L2J06j36L6R4J4j14o1J37O7j78J17O9k54R9
$$ -6 14 128 -86 -33 39 81 -16 -48 86 -100 -68 38 -98 -62 32 46 -68 -129 8 75 -103 14 83 -171 -72
3567g2J23m2l9M7M2j02JJ45n5j21J75o3j78J26J26k22RK76j68nq6L2%j21K65j19
$$ -72 51 9 -30 17 59 -43 -42 103 48 -73 102 39 -139 -13 113 -109 -100 176 8 3 -83 -51 -51 -172 93 -26
3593b6k8J89rj05J9P3j30K8J13j08j36K09M7p7j95J44m8j50J99P5j72M3J20k7
$$ -26 -54 135 126 21 40 113 -17 11 124 16 -120 89 136 59 -136 8 -40 -190 9 84 -88 -45 75 48
3617D8j62K13Mj42J36J12k52j19K49p9j80J90J57k15m0K66j72j43N6J38k30N6
$$ 48 -114 99 103 -39 97 209 -43 -162 87 8 -172 18 175 -40 -80 186 14 -129 -73 65 -165 -109
3639a09K80k41L1R7n1R4j44J82k88M2J29R5k52L6J49k22R4J15o0j49L16k6j71
$$ -109 171 -70 -39 58 7 101 -43 139 -149 -107 22 117 -135 -99 50 -172 -78 37 -23 -172 144 118 -53
3662e3K0K02j57m4J92%k56Q9%p5L5J62k25J18r1J82j46n2J39p1j98K50J7o9O3
$$ -53 -33 169 12 -32 160 160 -96 -7 -7 -82 -47 115 -110 8 -83 99 -47 -99 40 -31 -229 21 38 -31 32
3687C2M6j04k36L12P4k15O5M9O0n5J23k53RK16j62j0R2J4j5j29J17P4k17P2J88
$$ 32 78 -26 -262 50 124 -91 -26 23 83 28 151 -102 -93 123 -39 -49 43 57 42 -87 30 104 -113 -41 147
3712A47k11Q9Q1N3j76JJ93k35j0J43j60M7J5J31j87m4L75k37n0N5j9L0N2o7rj68
$$ 147 -64 25 106 159 -17 -16 177 -58 -68 75 -85 -38 -23 108 -79 -123 252 15 -35 20 1 31 83 16 7 -161
3738a61J89j0j38J91k6j58L7k4K3P9N1Qq3QJ17n8j73L46j74L3L8l9q8l7J45o9
$$ -161 28 18 -120 71 45 -113 -76 -100 -77 2 53 61 -22 -14 103 45 -128 218 44 77 115 76 -12 -49 96 27
3764B7k7l2Q4j71K2R3R2k32J79JJ5Lq4M2J2RN4No5R7k00k1K38j36j47K31m7j57
$$ 27 0 -32 52 -119 -97 -4 88 -144 35 36 51 54 -30 12 24 33 87 92 27 124 -76 -97 141 5 -142 89 42 -115
3792a15K4J43j34J34M0j64M1RJ05n6p3J34m3j00n1Q7j33R8qQ6k41J71K7L3j8j2
$$ -115 -91 52 -82 52 92 -72 -31 -22 83 27 -46 88 45 -55 -106 -19 -152 -54 -62 24 -217 -46 -19 14 -4 -16
3818a6O9l3p0K5R6j24J72k13J07m1J35j19R6l5nKj01Q6r8n0M5O5O5kL6q4o2J69
$$ -16 53 20 -50 -25 71 -53 119 -94 13 -28 107 -12 84 49 44 46 -55 31 -67 -117 -72 -7 58 56 92 8 -54 115
3846A15j84N2L3P8r8m7M1N3j21R4n8j06J72r6nnM4k4J38j16j0K5O4k1j20J23o
$$ 115 -69 -17 16 94 -4 -51 -10 43 -78 16 -42 -148 24 -72 -77 -82 -38 -62 76 -40 -50 -25 39 18 -102 21 15
3873A5p0o6J12n5J00q5k0K0Ok6Q9l3j05J14J5MJ4J1j7k8j38R4Q1o5M9q4K7l2K4
$$ 15 -55 -121 -9 -64 36 -49 -69 -49 -43 -69 20 -13 -118 -4 11 15 29 40 23 -5 -143 -49 32 -33 16 -68 -41 -73 -49
3902d9o9J95k0J3J0q7N5N8j25K3R6j23lKJ35o6lp7K8K4l5K5j29K08p7m2N8j6n0
$$ -49 -118 77 57 70 80 -7 48 106 -19 4 100 -23 -26 -24 111 45 42 -35 -7 17 -18 7 -122 86 9 -33 25 9 -41
3931d1J55j70K2J27p4k6n0J02nj17R4j13P4M6J4n8q8J71L5J9k40J17pP5M3O1j50
$$ -41 114 -56 -34 93 19 -7 -57 45 40 -77 17 -96 -22 24 38 -20 -108 63 98 117 -123 -6 -13 62 105 166 16
3958A6M4O9j11n6Q0q2n9nJ17M4j20l0J32q6QKp2O0N0P1K3j9lj40J55m1j6n9P2
$$ 16 60 129 18 -38 42 -40 -99 -104 13 57 -63 -93 39 -47 -39 -37 -109 -49 1 72 95 76 73 -67 88 47 31 -28 44
3987D4q6o0J10q1J74k00J54N4j47L0l3M5r9K20j21k7R2o5Kp5J35j32m5N4Q4j92
$$ 44 -42 -102 8 -73 101 -99 55 109 -38 -8 -41 4 -95 125 4 -23 69 4 6 -69 66 -66 -111 -57 27 -165
4013a65J95J40k64j1J53r2O0r7K2R8Ln9Q4J4j0J5r9P0L7l20J26J91q0j29K06k2
$$ -165 30 170 -94 -105 48 -44 16 -81 -59 39 42 -17 67 81 71 86 -13 57 94 -226 -100 91 11 -118 88 66
4039F6k2j04Q2R4k15J76m8n8J07j22J34n5lJ1j80Q1j4o7M6J24J3j87J06N3r2Q7
$$ 66 44 -60 22 116 -99 77 29 -29 78 -44 90 35 32 43 -137 -56 -70 -137 -91 33 46 -141 -35 18 -74 13
4065A3L4k7r1O7O7M3r1Op1O4l2O5k4l9L4k4J6qO7j37nJ28O5j43J06J3p6J04m5
$$ 13 47 20 -71 -4 63 106 15 21 -50 14 -18 47 23 -16 18 -6 10 2 69 -68 -73 55 120 -23 83 96 20 124 79
4094G9j15j22J62L1j18Q6J8j15J7J83k22J07J15j28J1r6J90o9J5N0j52J14l4K4
$$ 79 -36 -158 4 35 -83 3 21 -94 -77 106 -116 -9 106 -22 -11 -107 83 14 29 79 -73 41 7 31
4118C1Qp3P0n9j2J17l6j04P4k6j05J76Q2j43J07L5L0j33K8R1k73R9qon6J05P6
$$ 31 39 -34 36 -23 -35 82 46 -58 16 -10 -115 61 143 0 107 142 172 39 67 158 -115 -16 -24 -30 -86 19 95
4145I5j68j05J96Rk41J91L7k3O9P6o8j11J97Kj75j5J62j73N4K8j22l4R6O7Kj17
$$ 95 -73 -178 18 27 -214 -23 14 -9 60 136 68 -43 154 156 -19 -34 128 -45 9 37 -85 -119 -23 44 46 -71
4171g1Q8Ml7k1J30q4L4P9q3j28O5Q9r1O7O6n4j28J13m2l0Q7lr6O0K1m1K9J7L5
$$ -71 17 21 -16 -37 93 9 43 122 39 -89 -24 65 -26 41 107 53 -75 38 -4 -34 53 50 -46 14 35 -6 23 40 75
4200G5l5n2M5m2j1J42m6q6R9N6j97rJ19j55Q8O0k6m2r7K60n5k10J76pO6p6Kj27
$$ 75 40 -12 33 -9 -20 122 76 -10 89 145 -52 -61 58 -97 -9 51 25 -17 -114 146 91 -119 57 50 116 40 42 -85
4228h5rP9J68k45m0J37q9j13L44j49k18K08L3K3m5J10j15k1L9K1qNP9r0k2J03
$$ -85 -94 -15 153 -92 -132 5 -84 -197 147 -2 -220 -12 21 44 -1 109 -6 -27 12 33 25 30 109 19 -3 100
4254A00j17o9K25m2j70M0M7mr2P6J3O2o3J15m1m0N5o4l0j26J35L4j74Q4l1q2q
$$ 100 -17 -86 139 97 -73 -33 14 10 -82 -6 7 69 6 121 80 40 95 31 1 -125 10 44 -130 -46 -77 -159 -167
4281a67J18p2JJ62k7q1J31K8r7M4N2j31n0J70M9j57K7O7k07N2J50n8J9K2j58P4
$$ -167 -49 -121 -120 42 15 -66 65 93 -4 40 92 -39 -89 81 130 -27 0 67 -140 -88 62 4 23 45 -113 -39
4307c9J2J0N6J5J17r5j39J15K4j33Q5J7ll7q7P0n4k2oN1q3k0K51p5j09J47q9k7
$$ -39 -27 -17 39 54 171 76 -63 52 76 -57 28 45 42 5 -82 -12 -66 -88 -94 -43 -126 -146 105 30 -79 68 -21 -48
4335d8J28J05j99R2k2l9n6Q8p1RO2j21J1l1J32kj80K54r2l1j5Q4j5l1N3j14P9
$$ -48 80 185 -14 78 56 17 -39 49 -22 -13 49 -72 -61 -92 40 38 -142 112 20 -11 -26 58 43 12 65 -49 30
4362C0rN3qp8Kj16P3kJ78j49R8NJ1j35J08M0r5J4J47j60jR2l9rl0J5q1o9J29j25
$$ 30 21 74 66 -12 -10 -126 -53 -55 123 -26 72 77 88 -47 61 101 6 20 167 7 6 98 59 50 20 35 -46 -115 14 -111
4392a11N1k0J65j7p3Pp8L4J16l4n4J10j20Q1o6N8l5m1N1J19j76J8j54R3OKJ01
$$ -111 -60 -80 85 68 -5 2 -76 -42 74 40 -14 96 -24 57 -9 49 14 -27 24 143 -33 -15 -169 -76 -70 -68 33
4419C3m7M5P1p7m8J64j36o8J51j01j27K05n3k5N8p6jKo3J52j56J1J2N5r7K05p4
$$ 33 -14 31 102 25 -23 141 5 -63 88 -13 -140 65 12 -13 45 -31 -32 -30 -93 59 -97 -86 -74 -19 -116 89 15
4446A5L4K4q0O1Kj49R0J4q6R5o2L2k8j2p6P3R7j12J8J13j27L6L1P6l6j01J06n4
$$ 15 49 73 -7 54 56 -93 -3 11 -75 20 -42 -10 -38 -50 -126 -53 44 -68 -50 63 -64 -28 3 79 43 -58 48 -6
4474fN7l1o4Q8l5j04J54j45J1j1n4P8Q1J10j36L6J2q9P6P6j8r9j3mk8kR9J1m8
$$ -6 51 20 -44 44 9 -95 59 -86 -75 -86 -140 -62 19 129 -7 29 41 -48 28 104 86 -13 -26 -30 -58 -60 39 50 2
4503Bq0N4M9l6N5K9k9m5P2m1mj6L7Q8n3m3K8j21J4p7m0Q5M1p5Q1j9M6J3K7m6M5
$$ 2 -78 -24 25 -11 44 73 44 -1 71 30 26 10 47 135 82 39 67 -54 -40 -117 -157 -72 -31 -106 -25 -44 2 15 42 -4 41
$$ [...]
8191D3
##END NTUPLES=NMR FID
##END=
