##TITLE=1H_Pr 5_2
 D2O
 8 sc, 
 11.3.2024
##JCAMPDX= 6.0         $$ Bruker NMR JCAMP-DX V2.0
##DATA TYPE= NMR FID
##DATA CLASS= NTUPLES
##ORIGIN= UXNMR, Bruker Analytische Messtechnik GmbH
##OWNER= root
$$ XWIN-NMR		Version 3.5
$$ Mon Mar 11 14:17:55 2024 Russian Standard Time (UT+4h)  she@DPX200
##.OBSERVE FREQUENCY= 200.1313
##.OBSERVE NUCLEUS= ^1H
##.DELAY= (6, 6)
##.ACQUISITION MODE= SIMULTANEOUS
##.ACQUISITION SCHEME= undefined
##.AVERAGES= 8
##.DIGITISER RES= 18
##SPECTROMETER/DATA SYSTEM= spect
##.PULSE SEQUENCE= zg30
##.SOLVENT NAME= D2O
##.SHIFT REFERENCE= (INTERNAL, D2O, 0, 15.7039)
##AUDIT TRAIL= $$ (NUMBER, WHEN, WHO, WHERE, WHAT)
$$ ##TITLE= Audit trail, XWIN-NMR		Version 3.5
$$ ##JCAMPDX= 5.01
$$ ##ORIGIN= Bruker BioSpin GmbH
$$ ##OWNER= she
$$ F:/spectra/data/she/nmr/H-F/1/audita.txt
$$ ##AUDIT TRAIL=  $$ (NUMBER, WHEN, WHO, WHERE, WHAT)
(   1,<2024-03-11 14:16:51.20 +0400>,<she>,<DPX200>,
      <created by zg, POWCHK disabled, PULCHK disabled
       configuration hash MD5:
       00 E9 B6 7A A2 85 ED C7 34 08 36 98 17 FE 4E 26
       data hash MD5: 16K
       E5 3F 56 92 BA 83 AB D6 26 33 72 22 47 4B 0B F4>)
$$ ##END=
$$ 
$$ hash MD5
$$ 4B D3 90 5B D3 47 6C D0 74 5F A6 CC 4D 54 B7 2A
##$RELAX= 
##$RELAX= 
##$RELAX= 
##$RELAX= 
##$RELAX= 
##$RELAX= 
$$ Bruker specific parameters
$$ --------------------------
##$DU= <F:/spectra>
##$EXPNO= 1
##$NAME= <H-F>
##$PROCNO= 1
##$TYPE= <nmr>
##$USER= <she>
##$AMP= (0..31)
100 100 100 100 100 100 100 100 100 100 100 100 100 100 100 100 100 100 
100 100 100 100 100 100 100 100 100 100 100 100 100 100 
##$AQSEQ= 0
##$AQ_mod= 1
##$AUNM= <au_zg>
##$AUTOPOS= <>
##$BF1= 200.13
##$BF2= 200.13
##$BF3= 200.13
##$BF4= 200.13
##$BF5= 200.13
##$BF6= 200.13
##$BF7= 200.13
##$BF8= 200.13
##$BYTORDA= 1
##$CFDGTYP= 0
##$CFRGTYP= 5
##$CHEMSTR= <none>
##$CNST= (0..31)
1 1 145 1 1 1 1 1 1 1 1 1 1 1 1 1 1 1 1 1 1 1 1 1 1 1 1 1 1 1 1 1 
##$CPDPRG= <>
##$CPDPRG1= <>
##$CPDPRG2= <>
##$CPDPRG3= <>
##$CPDPRG4= <mlev>
##$CPDPRG5= <mlev>
##$CPDPRG6= <mlev>
##$CPDPRG7= <mlev>
##$CPDPRG8= <mlev>
##$CPDPRGB= <>
##$CPDPRGT= <>
##$D= (0..31)
0 1.2 0 0 0 0 0 0 0 0.06 0 0.03 0 0 0 0 0.0002 0 0 0 0 0 0 0 0 0 0 0 0 
0 0 0 
##$DATE= 1710152210
##$DBL= (0..7)
120 120 120 120 120 120 120 120 
##$DBP= (0..7)
150 150 150 150 150 150 150 150 
##$DBP07= 0
##$DBPNAM0= <>
##$DBPNAM1= <>
##$DBPNAM2= <>
##$DBPNAM3= <>
##$DBPNAM4= <>
##$DBPNAM5= <>
##$DBPNAM6= <>
##$DBPNAM7= <>
##$DBPOAL= (0..7)
0.5 0.5 0.5 0.5 0.5 0.5 0.5 0.5 
##$DBPOFFS= (0..7)
0 0 0 0 0 0 0 0 
##$DE= 6
##$DECBNUC= <off>
##$DECIM= 32
##$DECNUC= <off>
##$DECSTAT= 4
##$DIGMOD= 1
##$DIGTYP= 9
##$DL= (0..7)
0 120 120 120 120 120 120 120 
##$DP= (0..7)
150 150 150 150 150 150 150 150 
##$DP07= 0
##$DPNAME0= <>
##$DPNAME1= <>
##$DPNAME2= <>
##$DPNAME3= <>
##$DPNAME4= <>
##$DPNAME5= <>
##$DPNAME6= <>
##$DPNAME7= <>
##$DPOAL= (0..7)
0.5 0.5 0.5 0.5 0.5 0.5 0.5 0.5 
##$DPOFFS= (0..7)
0 0 0 0 0 0 0 0 
##$DQDMODE= 0
##$DR= 18
##$DS= 0
##$DSLIST= <SSSSSSSSSSSSSSS>
##$DSPFIRM= 0
$$ [...]
##$SUBNAM2= <"">
##$SUBNAM3= <"">
##$SUBNAM4= <"">
##$SUBNAM5= <"">
##$SUBNAM6= <"">
##$SUBNAM7= <"">
##$SUBNAM8= <"">
##$SUBNAM9= <"">
##$SW= 18.0517328524113
##$SWIBOX= (0..15)
0 0 2 0 0 0 0 0 0 0 0 0 0 0 0 0 
##$SW_h= 3612.71676300578
##$TD= 16384
##$TD0= 1
##$TE= 0
##$TE2= 300
##$TE3= 300
##$TEG= 300
##$TL= (0..7)
0 120 120 120 120 120 120 120 
##$TP= (0..7)
150 150 150 150 150 150 150 150 
##$TP07= 0
##$TPNAME0= <>
##$TPNAME1= <>
##$TPNAME2= <>
##$TPNAME3= <>
##$TPNAME4= <>
##$TPNAME5= <>
##$TPNAME6= <>
##$TPNAME7= <>
##$TPOAL= (0..7)
0.5 0.5 0.5 0.5 0.5 0.5 0.5 0.5 
##$TPOFFS= (0..7)
0 0 0 0 0 0 0 0 
##$TUNHIN= 0
##$TUNHOUT= 0
##$TUNXOUT= 0
##$USERA1= <user>
##$USERA2= <user>
##$USERA3= <user>
##$USERA4= <user>
##$USERA5= <user>
##$V9= 5
##$VALIST= <valist>
##$VCLIST= <CCCCCCCCCCCCCCC>
##$VD= 0
##$VDLIST= <DDDDDDDDDDDDDDD>
##$VPLIST= <PPPPPPPPPPPPPPP>
##$VTLIST= <TTTTTTTTTTTTTTT>
##$WBST= 1024
##$WBSW= 4
##$XGAIN= (0..3)
0 0 0 0 
##$XL= 0
##$YL= 0
##$YMAX_a= 354966
##$YMIN_a= -431683
##$ZGOPTNS= <>
##$ZL1= 120
##$ZL2= 120
##$ZL3= 120
##$ZL4= 120
##$ABSF1= 10
##$ABSF2= 0
##$ABSG= 5
##$ABSL= 3
##$ALPHA= 0
##$AQORDER= 0
##$ASSFAC= 0
##$ASSFACI= 0
##$ASSFACX= 0
##$ASSWID= 0
##$AUNMP= <proc_1d>
##$AZFE= 0.1
##$AZFW= 0.1
##$BCFW= 1
##$BC_mod= 2
##$BYTORDP= 1
##$COROFFS= 0
##$CY= 11.3945322036743
##$DATMOD= 1
##$DC= 2
##$DFILT= <>
##$DTYPP= 0
##$F1P= 15.7292609196834
##$F2P= 12.9074282941183
##$FCOR= 0.5
##$FTSIZE= 0
##$FT_mod= 4
##$GAMMA= 1
##$GB= 0.15
##$INTBC= 1
##$INTSCL= 1
##$ISEN= 128
##$LB= 0.24
##$LEV0= 0
##$LPBIN= 0
##$MAXI= 10000
##$MC2= 0
##$MEAN= 0
##$ME_mod= 0
##$MI= 1.114404
##$NCOEF= 0
##$NC_proc= 0
##$NLEV= 6
##$NOISF1= 3.799351
##$NOISF2= 2.8
##$NSP= 1
##$NTH_PI= 0
##$NZP= 0
##$OFFSET= 15.70392
##$PC= 1
##$PHC0= -25307.62
##$PHC1= 17.18731
##$PH_mod= 1
##$PKNL= yes
##$PPARMOD= 0
##$PSCAL= 0
##$PSIGN= 0
##$REVERSE= no
##$SF= 200.130013532006
##$SI= 16384
##$SIGF1= 3
##$SIGF2= 2
##$SINO= 400
##$SIOLD= 16384
##$SREGLST= <1H.CDCl3>
##$SSB= 0
##$STSI= 0
##$STSR= 0
##$SW_p= 3612.71676300578
##$SYMM= 0
##$S_DEV= 0
##$TDeff= 0
##$TDoff= 0
##$TI= <>
##$TILT= no
##$TM1= 0
##$TM2= 0
##$TOPLEV= 0
##$USERP1= <user>
##$USERP2= <user>
##$USERP3= <user>
##$USERP4= <user>
##$USERP5= <user>
##$WDW= 1
##$XDIM= 8192
##$YMAX_p= 0
##$YMIN_p= 0
$$ End of Bruker specific parameters
$$ ---------------------------------
##NTUPLES= NMR FID
##VAR_NAME=  TIME,          FID/REAL,        FID/IMAG
##SYMBOL=    X,             R,               I
##VAR_TYPE=  INDEPENDENT,   DEPENDENT,       DEPENDENT
##VAR_FORM=  AFFN,          ASDF,            ASDF
##VAR_DIM=   8192,          8192,            8192
##UNITS=     SECONDS,       ARBITRARY UNITS, ARBITRARY UNITS
##FACTOR=    0.0002768,     1,               1
##FIRST=     0,             0,               0
##LAST=      2.2672688,     0,               0
##MIN=       0,             -431683,         0
##MAX=       2.2672688,     354966,          0
$$ Real data points
##PAGE= N=1
##DATA TABLE= (X++(R..R)), XYDATA
$$ [...]
3227F554l159m206l980k169O26K838L895L925K096K11k249m200m310k757k01K648
3243d438M158M315K826j35k597l558l802k988m78J804L508M448L205P90k023m004
3259A031m315l023n09J911L525L740L288J063j194l515l980l653j226J160L232
3274b465M745L352J350j153l303m375l349j466R07K834L974L634J792k82k845
3289C350l985m166j973N06L074M121L632J769k45k450l906l560k405l26K236M123
3305b05L999L010l14k462l709l899k439j48J877L644L758K618P42j807l629m154
3321c118k725j006J853L666M262K766P98j748l281l746l016r77J224L045L783
3336A780L293J761j078l623m220l158j185J157L148L379L504J495p24k758l465
$$ plain form
3227 6554 3395 -811 -4791 -6960 -6334 -3496 399 4324 6420 6631 4382 182 -4128 -6885 -7086 -4438
3243 -4438 -280 4035 6861 6726 4129 571 -3231 -6219 -6697 -4893 -1385 3063 6268 7058 5035 1031
3259 1031 -3284 -6307 -6816 -4905 -1380 2360 5648 6711 5517 2002 -1978 -5631 -6857 -5697 -2465
3274 -2465 2280 5632 6982 5829 2526 -1849 -5198 -6664 -5757 -2923 1051 4685 6477 6195 3350
3289 3350 -635 -4801 -6774 -6268 -3194 927 4559 6328 6083 3633 -273 -3833 -6238 -6564 -4328 -205
3305 -205 3794 6804 6490 4028 319 -3580 -6019 -6167 -4290 -646 3112 5730 6472 4665 1036 -3118
3321 -3118 -5843 -6849 -4996 -1330 2932 5698 6496 4748 1467 -2279 -5295 -6272 -5048 -2003 1780
3336 1780 5073 6834 5756 2133 -2087 -5245 -6430 -5273 -2125 1254 4758 6253 5529 2771 -694
3351f94l609k147M61L092L807L638J813o40k632l790l307j875K19K032L603L508
3367C479K560J96k118l870l890k417k5K111L653L481K478K26j992l085l501k695
3383e409q53J632L202M125L070O73j988l354l633k745o82J459K920L484K600J283
3399E784q79k869l615l346j275Q50L266L854K901J289r10k649l550k846j667L41
3415e321K576L376L457J823m03k434l946l386j878P18K500L549K929J850L8j958
3431C490l481l194k350l78K137L625L485K080L34k214l205l350k031k29J359L039
3447h83L348K689O62j518l079l494k927o91J570L069L561K489P24j166k680l269
3463a595l009j074P39K747L802K879J468r15k652l883l011r28O84K534K965L054
$$ plain form
3351 -694 -4303 -6450 -5989 -2897 910 4548 6361 5721 3089 -701 -4008 -5883 -5664 -3632 -29 3479
3367 3479 6039 6235 4117 247 -3643 -6060 -6085 -3974 -321 3160 5638 5864 3872 787 -2714 -5409
3383 -5409 -6262 -4630 -1428 2697 5767 6440 4452 1098 -2535 -5280 -5962 -4503 -1583 1901 4501 5784
3399 5784 4905 2036 -1579 -4925 -6200 -5350 -2084 1770 4671 5960 5050 2401 -1149 -3995 -5662 -5321
3415 -5321 -2745 631 4088 5911 5508 3074 -872 -4258 -6136 -5418 -2918 631 3560 5410 5448 3490
3431 3490 9 -3185 -5535 -5913 -3776 -151 3334 5414 5748 3534 329 -3021 -5052 -5281 -3922 -883
3447 -883 2465 5154 5816 4298 1219 -2275 -5202 -5893 -4323 -1254 2307 4796 5520 4354 1674 -1595
3463 -1595 -4604 -5678 -4939 -2192 1610 4489 5957 5042 2390 -1493 -4504 -5432 -4748 -2214 751 3805
3479C805J592m05k184l268l434j907M94K345L481L007J858l93k013l008l100k080
3495e210J1J674K947L353K428J76j824l239l115k134m35J648L303L127K116M92
3511E318j392k797l083k832p73J238K923L442K690Q86j492k805l258k330q10P82
3527d293K472K997K787J461p16k500l588k687j474Q97K590L207K838J088m28k076
3543B575l159k814j732K03K106L335L109J564p8k127l345k924j632J1J946K799
3559a63L067J726N05j832k763l272k181k23J570L114L291J826L62j577k885k719
3575b154k078p36J279K278L331K513O87j112k900l097k468n17R97K499L116K149
3591C787R40o42k382k895k712j296P97K232L103K730J609q34k631k983k355j196
$$ plain form
3479 3805 5397 4992 2808 -460 -3894 -5801 -5307 -2962 519 3526 5384 4991 2978 -30 -3130 -5210
3495 -5210 -5199 -3525 -578 2775 5203 5379 3555 316 -2799 -4933 -5368 -3720 -417 2710 4826 5318
3511 5318 3926 1129 -1954 -4786 -5559 -4321 -1398 2044 4734 5620 4128 1323 -1935 -4265 -5075 -4293
3527 -4293 -1821 1176 3963 5424 4708 2208 -1380 -4067 -5541 -4644 -2054 1153 3991 5079 4651 2575
3543 2575 -584 -3398 -5130 -4927 -2821 514 3623 5187 5109 2982 -363 -3287 -4919 -4908 -2962 -163
3559 -163 2904 4630 5135 3303 540 -2732 -4913 -5136 -3566 -452 2839 4665 5027 3450 565 -2154
3575 -2154 -4232 -4968 -3689 -1411 1920 4433 5120 4008 1108 -1989 -4457 -4974 -3977 -1478 1638 3787
3591 3787 4727 4085 1703 -1192 -3904 -5200 -4403 -2171 932 3662 5271 4437 1806 -1177 -3532 -4728
3607d728M85K028K816K631J461r9j760l172k948j673L32K066K786K695J756k18
3623D458j600k475l011j681o65J828K645L010K103J02j348k923k755k073j88J386
3639c187K344K950J894O80j020k345k994k459o69J014K591K754K390O50r17k234
3655A442k820k294r14P43J888K850K817J027m57k257l066k479j322P97J842K914
3671G11K485J131l07j639k318l050j663J83J847K671K900J595k79j718k753k601
3687b805j419k26J645K226K911J692N39j415k455k904k192q1J539K440K668J805
3703C968M85j296k322k669j858o72P55K302K979K255N59r58k380k717j911r47
3719d427J098K029K397K056R49m39j688k868k325j191L83K043K790K419J058m50
$$ plain form
3607 -4728 -4243 -2215 601 3232 4693 4594 2834 -338 -3286 -4959 -4627 -2561 225 2920 4676 4458
3623 4458 2858 383 -2628 -4309 -4974 -3146 -501 2509 4612 4714 3366 443 -2312 -4385 -4573 -3187
3639 -3187 -843 2107 4001 4681 3661 1316 -1678 -4137 -4806 -3792 -1201 1553 3943 4593 3676 1442
3655 1442 -1378 -3672 -4586 -3843 -1955 895 3712 4739 4282 2025 -1041 -3520 -4842 -4045 -2203 711
3671 711 3196 4327 4020 2381 63 -2987 -4650 -4467 -2620 51 2951 4546 4267 2549 -204 -2805
3687 -2805 -4224 -4450 -2805 -579 2332 4024 4563 3148 693 -2211 -4403 -4484 -2945 -505 2163 3968
3703 3968 4453 3157 835 -1834 -3692 -4364 -3609 -1307 1672 3927 4486 3528 1148 -1569 -3480 -4427
3719 -4427 -3329 -1300 1097 3153 4102 3663 1975 -893 -3218 -4409 -4026 -1983 807 3226 4284 3834
3735C834j703k427k490j363K32J420K483K776J333K00j691k532k802j426j42J793
3751b505K531K394J475J54j215k022k738k020n17J312K280L265J714L5j248k123
3767G72k543j706k83N88J984K851J651R68q19k192k612k185q61Q32K158K639J831
3784C073J154q15j931k477k006j244M95J723K586K481J364n81j900k589k378q00
3800c845M2J821K165K540J118J24j542k195k671j765j13J936K410K520J485j08
3816C922j394k185k466j565j54R83K067K731J793M34j148k201k567j934k36Q75
3832c045K417K214J928M05p87j903k581j950q65O61J920K808K203N70n80k037
3848A378k369k176n85M59J674K315J911J494k61j902k454k252j435O21J558K356
$$ plain form
3735 3834 2131 -296 -2786 -4149 -3917 -2497 -14 2762 4095 4295 2604 72 -2730 -4156 -4298 -2505
3751 -2505 26 2420 3895 4049 2834 812 -1926 -3946 -4463 -3151 -871 2394 4108 4143 2895 772
3767 772 -1771 -3477 -3760 -3172 -1188 1663 3314 4282 3463 1271 -1341 -3526 -4387 -3555 -1397 1242 3073
3784 3073 4227 3412 1481 -996 -3002 -4246 -3751 -2028 558 3039 4403 3822 1922 -667 -3045 -3845
3800 -3845 -3803 -1982 183 2723 3841 3965 2423 228 -2443 -4208 -4321 -2385 25 2545 4030 3922
3816 3922 2528 343 -2123 -3688 -3842 -2859 -792 1939 3732 4166 3018 817 -1750 -3684 -3920 -3045
3832 -3045 -628 1586 3514 3919 3132 1229 -1352 -3302 -4167 -3506 -1586 1222 3425 3995 3415 1378
3848 1378 -991 -3167 -3752 -3293 -1619 696 2607 4101 3840 1938 -516 -2768 -4203 -3582 -2024 332
3864C32K331J108m86j155k354j971j550K2J188K430K238J746N2j528k044k527
3880b168j624o5J371J992K182J627L86r99j912k471j617p18J080J927K663J845
3896C499M20j038j802k356j722q03O41J546K566J929J058m15k255k055k296q20
3912c903N66K047J921K135R03k19j570k388k039j282L87J390K374K206J269k63
3928C534j611k228k119r25n4J223K039K187J486J67j188k168k499j437k07J204
3944b596K273K176J422K14r00j937k184j386p36O90J883K480J876N16q24k233
3960G34k105j861k79N57J773K149J938O41l58j695k263k053r78M87J670K398K028
3977B783O51m68j512k128j663j019k5J381K178K082J376O0j702k089k181j352
$$ plain form
3864 332 2663 3771 3285 2130 -224 -2195 -3745 -3723 -2535 -105 2133 3879 3931 2403 359 -2168
3880 -2168 -3792 -3857 -2486 -494 1688 3315 3701 2702 790 -1681 -3298 -4016 -2936 -1009 1654 3499
3896 3499 3919 2881 1079 -1277 -2999 -3802 -3161 -1615 951 2880 3938 3523 1268 -787 -3083 -3903
3912 -3903 -3337 -1290 631 2766 3669 3450 1880 -508 -2547 -3829 -3442 -2052 322 2528 3797 3534
3928 3534 1923 -305 -2424 -3349 -3403 -2180 -141 2046 3532 3699 2511 343 -2156 -3593 -3800 -2596
3944 -2596 -323 1853 3275 3489 2589 652 -1532 -2918 -3654 -2964 -1081 1399 3275 3791 2967 734
3960 734 -1371 -3232 -3511 -2954 -1181 968 2906 3547 3189 1494 -769 -2822 -3800 -3313 -1643 755 2783
3977 2783 3434 2966 1454 -674 -2337 -3356 -3381 -2000 178 2260 3636 3696 1994 -95 -2276 -3628
3993c628L81J346J857K107J267q6q68k012k242j292l31R93J928K546J351L48j227
4010B438j914k103j463n24J018J874J771J696P21o37j820k462j535q40J149J628
4026a003K113J845M38n76j679j835j847j077M50J573K365J822R63k97j614k247
4042f06j846j010M99J248K085J616J212L4j359j814k175j344J00J224K127J988
4058A979J274k7j272j871j959j225j12P45K067K125J316M51r13j927k216j495
4074c060k05J056J655J989J312L88n45j578k086j655q58Q89J597K312J667M68
4090C346n84j643k125j580l94J71J545J875J821O98j52j501k172j599j147N02
4106b939J344K212J561J035j11j358j918j706j337O9J042K099J826J384J1j015
$$ plain form
3993 -3628 -3247 -1901 -44 2063 3330 3244 2376 364 -1878 -3170 -3501 -2508 -580 1966 3317 3665 2438
4010 2438 524 -1579 -3042 -3566 -2548 -674 1097 2793 3514 2877 1057 -1405 -2940 -3780 -2631 -1003
4026 -1003 1110 2955 3393 2817 1138 -697 -2544 -3621 -3171 -1598 767 2589 3552 3255 1641 -606
4042 -606 -2452 -3462 -2963 -1715 370 1986 3198 3232 1873 59 -2116 -3460 -3360 -2136 -9 1979
4058 1979 3253 3226 1954 83 -1876 -3101 -3213 -2468 -401 1724 3040 3491 2578 651 -1565 -3060
4074 -3060 -3265 -2209 -554 1435 2747 3135 2590 1012 -1074 -2729 -3587 -2698 -1101 1211 2878 3346
4090 3346 2762 1119 -1006 -2586 -2980 -2809 -1264 611 2432 3130 2978 1477 -695 -2294 -3441 -2939
4106 -2939 -1595 617 2178 3213 3102 1744 -174 -1880 -3217 -3148 -2106 -7 1819 3203 3214 2199
4122B199k046k098j050Q6J064J524J808J320K81n71j757k097j835k57J164J608
4138f57K090J476J10p81j481j853j499m95N44J525J900J648N81l25j451k448j529
4155b645m35M24J386J901J655P26l73j230j543j952j118J67J369K084J864Q04
4171C084o9j486j779j646r58r8J293J643J513J487Pq19j724k187j124j66Q47K004
4189a78J841J108K40j066j699j695j214m62P50J756K003J233O08q56j552k051
4205a234j389n00Q93J590J718J346N85n66j289j752j911n18L27J411K103J610
4221B424M91k49j469j751j419j002K80J091J930J518J072M3j264k014j785p75
4237b879J28J008J771J695R19J87q85j672j935j116K4O79J729J833J415R2j031
$$ plain form
4122 2199 153 -1945 -2995 -2909 -1845 -321 1487 2807 3088 2517 760 -1337 -3172 -3429 -2265 -657
4138 -657 1433 2909 3019 2238 757 -1096 -2595 -3090 -2546 -1021 879 2527 3108 2783 1332 -1116 -2645
4155 -2645 -3080 -2656 -1270 631 2286 3012 2639 1409 -134 -2086 -3204 -3037 -1668 416 2280 3084
4171 3084 3015 1529 -250 -1896 -2854 -2952 -1659 -16 1497 2984 2991 2172 448 -1739 -2863 -3029 -2182 -178
4189 -178 1663 2771 3011 1945 246 -1449 -2663 -3125 -2375 -619 1384 2617 3225 2369 817 -1234
4205 -1234 -2623 -3123 -2230 -640 1078 2424 3009 2443 1154 -598 -2509 -3027 -2700 -1289 814 2424
4221 2424 2915 2666 1197 -554 -1973 -2975 -2695 -1604 326 1844 2916 2959 1695 -319 -2104 -2879
4237 -2879 -2751 -1743 28 1723 2642 2829 1944 272 -1663 -2779 -2755 -2076 -347 1486 2901 2993 1962
4254A962j670j574j152l69P64J381J277J867K78l49j513j865j491o41Q27J455
4270h13J821J281O06o14j297j549j461r18J54J557K062J351N29M3j678j681j437
4287b044o98J05J022J689J843P64k2j095j514j465j548J72J025J891J724R68N5
4304B872j188j726j224j114m39O96J594J984J217J73q76j440k003j242j97Q10
4320b103J534J756J197M70o20j100j968j685m16M93J696J449J484O95o76j251
4336I55j788j186p19N76J011J561J457Q12j25j311j679j653r54K24J368J932J309
4353A790R43m48q87j467j505j027O7Q97J559J682J166K19j208j479j808q90k39
4370b635Q62J302J809R92K67m62j436j822j401k81O27J604J664J423M69r75j255
$$ plain form
4254 1962 292 -1282 -2434 -2803 -2039 -658 619 2486 2764 2415 902 -963 -2454 -3095 -2268 -813
4270 -813 1008 2289 2895 2281 984 -565 -2026 -2944 -2790 -1233 829 2180 2709 2752 1074 -607 -2044
4287 -2044 -2742 -2637 -1615 74 1917 2681 2659 1564 50 -1415 -2963 -2791 -1766 125 1849 2817 2872
4304 2872 1684 -42 -1266 -2380 -2819 -2123 -529 1455 2672 2845 1969 529 -1474 -2716 -2913 -2103
4320 -2103 -569 1187 2384 2854 2234 1134 -834 -2519 -2935 -2442 -746 703 2187 2882 2206 955
4336 955 -833 -2019 -2738 -2162 -1151 410 1867 2679 2554 1243 -436 -2089 -3043 -2819 -1451 481 1790
4353 1790 2733 2285 1398 -69 -1574 -2601 -2534 -1637 -78 1604 2770 2989 1781 302 -1506 -2396 -2635
4370 -2635 -1773 -471 1338 2330 2597 2135 699 -1123 -2524 -2805 -2178 -574 1090 2513 2982 2007 752
4387G52j691j275n79O33J244J519J542O28l17j468j655j490n75N99J270J397J451
4404A985O26l72q88j473j458j151K57J191J361J820P84k69q46j616j651p19o4
4421b483R49J608J348J098J13r13j491j464j453j1Q68J596J595J055K0n66j432
4438D37j412j273l94O90J262J644J228M53n72j587j305j437j88M04J249J292J421
4455A912N74j84j180j573j461p42K32J423J620R80J142n00j050j473j397o80M2
4472b315R04J632J345J123p4j263j526j569p25PQ80J540J278J068m5r64r36j612
4490a252j074k93N79J537J830R54K83p08j501j347j149l07N66J220J587J143N59
4507B627o04j126j719j450l68O35J249J384J445M05n29q61j622j189q16L26J165
$$ plain form
4387 752 -939 -2214 -2793 -2160 -916 603 2145 2773 2456 988 -667 -2157 -2732 -2133 -863 534 1985
4404 1985 2611 2239 1351 -122 -1580 -2731 -2474 -1283 78 1898 2682 2413 1567 -49 -1700 -2419 -2483
4421 -2483 -1534 74 1422 2520 2633 1720 229 -1235 -2688 -2699 -1831 -235 1360 2415 2435 1869 437
4438 437 -975 -2248 -2642 -1952 -690 954 2182 2635 2063 476 -829 -2266 -2454 -2050 -801 491 1912
4455 1912 2486 2302 1122 -451 -1912 -2654 -2422 -999 621 1601 2743 2243 1193 -280 -1677 -2357 -2315
4472 -2315 -1411 221 1566 2689 2615 1352 -174 -1743 -2468 -2461 -1581 -41 1237 2305 2260 1296 360 -1252
4490 -1252 -2326 -2619 -2040 -503 1327 2281 2564 1856 355 -992 -2141 -2448 -1882 -662 925 2068 2627
4507 2627 2023 897 -822 -2272 -2640 -2005 -756 628 2073 2478 1949 1088 -534 -1723 -2539 -2213 -1048
4524a048J409J359P99k79j320j312j380n74J37J081J226J511O15R7q24j361j487
4541a351r91l16J208J490J373P02K42r46j254j164j045k30M79J552J220J197L07
4558B473o65j497j672q72l07P44J236J258J524J94o00j141j502j004n87K56J383
4575g79J468J243M61l68j118j416j575k25K02R98J602J192Q41j25j085j552j483
4592a719r30N40R92J647J119O90m66p20j126j438p29l57R49J332J628J051K21
4609B684j005j661j281r02j22O95J235J698Q06N2m62j166j477j208l30N60J292
4626e92J644J100K98p71j133j437q77n65K42J066J684J331N99o15j064j552j339
4643a981n76N75J143J229J317O38j98j107j234j430p04K46Q79J390J275R85k17
$$ plain form
4524 -1048 361 1720 2519 2240 920 -392 -1772 -2346 -2209 -1128 98 1609 2224 2321 1497 136 -1351
4541 -1351 -2342 -2658 -1450 40 1413 2115 2357 1411 157 -1007 -2052 -2282 -1803 -251 969 2166 2473
4558 2473 1808 311 -1361 -2233 -2540 -1796 -560 698 2222 2416 1816 675 -827 -1831 -2418 -2162 -779
4575 -779 689 1932 2393 2025 907 -509 -2084 -2309 -2107 -1109 493 1685 2526 2401 1316 -236 -1719
4592 -1719 -2649 -2109 -1117 530 1649 2339 1873 1153 27 -1411 -2140 -2497 -1548 -216 1412 2463 2684
4609 2684 1679 18 -1263 -2165 -2287 -1592 -357 1341 2147 2199 1737 571 -906 -2114 -2444 -1884 -592
4626 -592 1052 2152 2450 1679 546 -891 -1768 -2333 -2091 -1025 659 1990 2589 1974 910 -642 -1981
4643 -1981 -2557 -1982 -839 390 1707 2345 2147 1040 -194 -1624 -2328 -2082 -1203 187 1462 2447 2230
4660B230r70j257j387q36r2R99J216J225R97J05o91j313j339j266NQ31J282J619
4678A358P46K24o40j202j428j159k06L42J183J701J057M12n30j426j310j025l37
4695b240M21J244R99J445N15j75j231j468j270o43L21J057J405J392N46m54q54
4712A010j418j151o71J79P40J273J284R98K7q72j376j422q15r9J191J198J209
4729A285P21J42n88j122j580p87k08L38J268J630J001K23p88j163j217j002k91
4746b138M74J152J088J160M93m35r27j488j265n82M97J046J497J149N02j13j426
4763F84j053j029p94J55R34J239J564P98n12q89j394j345l50N5O62J461J206R11
4781B303j38p60j452j293j011K72O43J451J220Q40n3p70j063j148j064k01P83
$$ plain form
4660 2230 1260 3 -1384 -2220 -2312 -1313 -97 1128 2125 2230 1539 226 -1113 -2379 -2374 -1543 -261 1358
4678 1358 2104 2328 1688 486 -942 -2101 -2307 -1965 -782 919 1976 2388 1858 432 -878 -1903 -2240
4695 -2240 -1819 -575 424 1869 2384 2209 978 -490 -1760 -2403 -2082 -1025 380 1772 2318 1864 1010
4712 1010 -408 -1559 -2230 -2051 -1311 -38 1246 2244 2271 1399 23 -1399 -2214 -2313 -1122 76 1285
4729 1285 2006 2148 1560 438 -1142 -1929 -2137 -1799 -531 1099 2100 2323 1535 372 -845 -1847 -2138
4746 -2138 -1664 -512 576 1736 2229 1794 867 -621 -1886 -2468 -1971 -925 572 1721 2223 2110 684
4763 684 -369 -1398 -2192 -2037 -1103 136 1700 2498 1986 1097 -297 -1642 -1992 -1937 -1275 186 1392 2303
4781 2303 2165 1405 -47 -1340 -2351 -2079 -1436 15 1235 2075 2022 1252 189 -959 -2023 -2224 -1441
4798a441J060J401R29K68o10j051j521j087j72P30R79J356R09M04m30r64j295
4815e35j125n58K80J218J308J300J76r8j343j036j122n41M02P32J032J245Q23
4832B158j22p32j427j250r90K07J063J338J354M33l3q01j253j228o62JN29J208
4850b07R96J365K4p48j284j318q42k30R35R22J335R28K05k57j142j455j294j12
4868b179K63J423J453O84M40k80j275j117r88l51K34Q17J442J100M92k56j001
4885I01j148j153o30Q0R09J305J088N77p7p73j173j108q39l6O90J499J197P74
4903B083P1q37j441j128o81p9Q86P68J365R84J27o22j124j485p09l82Q44J004
4921c56J162R82J41m92j015j140j224k45N57Q89J493Q79M75l17r67j356j258k33
$$ plain form
4798 -1441 -381 1020 1949 2217 1607 556 -965 -2052 -2224 -1494 -515 841 1750 2154 1724 760 -535
4815 -535 -1660 -2218 -1938 -720 588 1888 2064 1966 623 -413 -1535 -2076 -1674 -942 90 1335 2158
4832 2158 2036 1304 -123 -1373 -2363 -2156 -1093 245 1599 2032 1999 1198 -55 -1283 -1945 -1944 -1415 -207
4850 -207 789 2154 2178 1430 146 -1172 -2014 -2244 -1309 -387 948 1876 2081 1824 682 -773 -2067 -2179
4868 -2179 -1916 -493 960 1644 2084 1804 529 -588 -1576 -1927 -1693 -876 566 1666 2158 1902 901
4885 901 -247 -1400 -2030 -1950 -1041 264 1352 1929 1852 1079 -94 -1202 -2041 -2077 -1387 112 1309 2083
4903 2083 2154 1317 -124 -1252 -1933 -2012 -1126 -358 1007 1991 2118 1496 372 -1113 -1822 -2204 -1360 -356
4921 -356 806 1788 1929 1437 422 -718 -1942 -2187 -1630 -741 752 1631 2106 1789 822 -534 -1792 -2025
4939b025L73Q39J223J067O27k62p45j330j289m12q1R38J238J484L40r7r46j244
4957c02q87p69o4R08Q63J334Q85l8n18j378j242p45Q5M71J234J170Q42lo28r40
4977B78j067r54l04P19P96J390J115P0p41q64j117r75k53M47O22J368R63N35m96
4996A532j050q39j297m08L20J118J248R38L33j91q63j169j001n75k7R09J146J155
5014A279P98j09p86j498r12o53K05O05J000J053Q33K44r47q22j428r31r8P00J167
5033c00J372O69L26p17j158j159p57j05M34R83R88J138M09m91j026j345p61m62
5051a962L49J072J075J240L16n18p48j241j071m79K06Q77J150J237N56m50q36
5068G73j187q73m93J63N43J201J036P62L5q67j174j157p74p7R65J126J126O78
$$ plain form
4939 -2025 -1652 -813 410 1477 2104 1842 1097 -233 -1522 -1934 -2015 -1077 161 1645 1985 1888 942 -302
4957 -302 -1189 -1958 -2022 -1114 -251 1083 1968 1930 1412 34 -1208 -1953 -1868 -1397 -163 1007 1849 1846 1218 278
4977 278 -789 -1743 -2047 -1328 -532 858 1973 2043 1302 438 -679 -1654 -1907 -1460 -838 530 1493 2028 1532
4996 1532 482 -357 -1654 -2062 -1742 -624 624 1562 1895 1704 841 -328 -1329 -1904 -1931 -1022 124 1279
5014 1279 2077 1968 1182 -316 -1228 -1881 -1676 -1071 -71 982 1815 2059 1112 290 -1138 -2069 -2167 -1467 -300
5033 -300 1072 1741 2067 1350 192 -967 -1724 -1829 -1395 -412 576 1714 2123 1632 606 -739 -1500 -1962
5051 -1962 -1613 -541 534 1774 2090 1572 824 -417 -1488 -1967 -1761 -884 266 1503 2059 1609 773
5068 773 -414 -1287 -1780 -1617 -1074 127 1163 1925 1960 1093 -81 -1238 -2012 -2089 -1124 2 1128 1806
5086A806j60k96j145j077q99j31O50R76J318R08O5n77j107j157q76k97N87R49
5104d63J100R57K04m10j031r50r04o12M65J320R66P75J55j05p84j185p46n96K55
5123a589P33J106J082N52j04q36j165j045n40q3J115Q74J192M33r5o88r67j053
5141a078o46j22M21J396J205O69m3p90r75j053o37j39M64J122J118P00N63n17
5159A658j198j217j116j5N92Q33J373O86M11m53r58j061j003n38M24Q32J190J261
5177A701L06m63p08j388r75l63M51Q34J145P16N72j41p27j056j298o62K76P27
5195a053J252J183N33k74p52j076r05m94k03O30J079J242O44J9n37j285j092o82
5213a771j32P85R52J164Q34M5m41j183r35q88j42J99R85J171J066K25o30r61q76
$$ plain form
5086 1806 1646 1350 205 -872 -1771 -1902 -1252 -276 1042 1950 2015 1438 331 -826 -1702 -1999 -1412 -463
5104 -463 637 1594 1798 1388 357 -593 -1497 -2109 -1644 -324 642 1417 1572 1467 683 -502 -1248 -1844 -1589
5123 -1589 -856 250 1332 1884 1780 944 -221 -1266 -1806 -1889 -774 100 1292 1725 1630 942 -25 -1078
5141 -1078 -1724 -1846 -1425 -29 1176 1845 1802 1012 37 -1016 -1653 -1792 -1328 -206 912 1612 2175 1658
5159 1658 460 -757 -1873 -1888 -1296 -463 910 1596 2007 1554 596 -465 -1468 -2006 -1582 -750 440 1701
5177 1701 2007 1544 836 -552 -1527 -1890 -1439 -605 540 1256 1828 1687 960 -96 -1394 -2056 -1780 -1053
5195 -1053 199 1382 1915 1641 889 -187 -1092 -1586 -1789 -1159 -80 1162 1806 1825 1288 3 -1089 -1771
5213 -1771 -1903 -1118 -166 998 1832 1877 1436 253 -682 -1570 -1712 -1513 -528 643 1709 1934 1304 343 -533
5232e33q48l37K4J065J386O87L86j27q95j279r99m17K67P81J239R15N78m22p63
5251G08r40j103n46L7Q34J167J109P61l87p53j061j047o59J47Q45J079R99P07
5269A897m2p11j001j026r66r6P07J018J124P40Qm02r97j373m22j62L24J030J044
5288F94Q83L17m18r56j241r57l02N39R10Q86R25O16l59q57j051q48o54M55M92
5307i26J324J055M53k28q99j067j026o35M58N86J115J055M44J0o63j121j152o06
5325a823K03N65J025J010Q68l52n72p64j200m49j75L01J109J190P79J04m21j294
5343A04j024o66j87L90R88J292M55M91l73j116j001j019l62M67R12J407Q88L82
5361B028m83r27j247p82m44L00Q29J053J167L32j15r14j194j205k86K46Q11J016
$$ plain form
5232 -533 -1381 -1718 -1694 -629 757 1444 1830 1703 808 -471 -1470 -1887 -1620 -839 400 1315 1893 1471 708
5251 708 -232 -1335 -1881 -1844 -1010 157 1266 2027 1640 887 -174 -1221 -1880 -1733 -888 191 1190 1897
5269 1897 1855 1144 143 -883 -1849 -1945 -1238 -220 904 1644 1652 1250 253 -1120 -1542 -1704 -1380 -350 694
5288 694 1577 1894 1476 520 -721 -1678 -1980 -1441 -531 355 1280 1896 1537 680 -371 -1219 -1873 -1418 -926
5307 -926 398 1453 1906 1678 779 -288 -1314 -1949 -1491 -905 210 1265 1709 1719 1056 -65 -1217 -1823
5325 -1823 -1620 -1055 -30 980 1848 1496 924 160 -1040 -1489 -1664 -1363 -254 936 1715 1819 1398 104
5343 104 -920 -1586 -1773 -1383 -395 897 1352 1843 1470 354 -647 -1666 -2028 -1561 -649 758 1646 2028
5361 2028 1545 618 -629 -1411 -1855 -1555 -726 327 1494 1826 1711 797 -397 -1602 -1888 -1642 -831 185
5379A85R83N52q7m22j309r97p45J48N11J197J246N91k42n69j257q26n16j91N55
5398a193J004J147Q53%n82r01j271q52l3N23R80J314O99Nl45q22j258q74j37l1
5418a774J166J181J008L64m27r32j198r30k93K47Q78J428N82N56m54o12j261q04
5436a275p94L84P95J122J219M86k22q29j163r11l61j72P17J180R25P92l7q36j132
5455a12j004p06J40L81J347J034P21p7l37j253r07r71j10M77J125J224O52L67
5473A991q92o43j162q72k7K67Q53J136Q76L82l46j132j131j004l06N56R86R95
5491E27J187M9o7r43j153q95n31J19Q15J032J230M12k42q05j147p34o47J66N56
5510a071J115J168N36q0o56q39j487n02j08J016Q24J253N64J30p58j197r00o81
$$ plain form
5379 185 1168 1720 1633 1211 -98 -1095 -1840 -1692 -1181 16 1262 1853 1611 1042 -215 -1041 -1557 -1748 -1193
5398 -1193 -189 958 1811 1811 1229 328 -943 -1795 -1828 -1305 -325 989 1688 1693 1348 526 -732 -1606 -1743 -1774
5418 -1774 -608 573 1581 1945 1518 586 -612 -1542 -1835 -1588 -710 718 1300 1856 1402 790 -471 -1275
5436 -1275 -2069 -1685 -890 232 1451 1937 1715 886 -277 -1188 -1549 -1721 -1004 176 1101 1893 1856 1020 -112
5455 -112 -1116 -1822 -1682 -1301 46 1080 1801 1724 1387 134 -773 -1744 -1854 -1377 -252 972 1624 1991
5473 1991 1099 456 -706 -1578 -1605 -1338 -485 651 1527 1909 1563 431 -700 -1704 -2010 -1454 -468 527
5491 527 1714 1763 1696 753 -400 -1295 -1826 -1707 -892 140 1370 1782 1540 735 -412 -1146 -1793 -1627 -1071
5510 -1071 44 1212 1748 1668 1012 173 -1314 -1816 -1924 -908 -84 1169 1733 1863 1105 -92 -992 -1673
5528a673j56L89J322R50R36L7n03j015j090p40l31O13R93J076P49K44l93r92j262
5547h46o39o13M96J065J212Q45L70k48j234j159o06n02L61P80R29J051P60j01
5565A921j042j222r82p60L82R12J255P94P82l09p94q60j220m40j26N23J122J279
5583A215O33L7o73j190j247q06Q9P31Q95J204R13m3m08j048j260q33j57O59J066
5602b23J275O39L31n94j115j079o67m75M47Q02J332Q80L08j99j022j212j135j78
5620a885M42P60J126Q41N79l25p99j055j168m83L43O56J360J112O32l60q69j095
5638a88j115m52L1N43J152J056R42j88n05j391j066n81j11R89J090Q97P12m9o82
5657A084q34j246o08l37O61R80R75J028J04n32q72j148q16l20M23R21J118R06
$$ plain form
5528 -1673 -1829 -1440 -118 832 1768 1805 1302 287 -803 -1543 -1874 -1261 -268 808 1557 1801 1408 416 -846
5547 -846 -1485 -2098 -1602 -537 675 1520 1890 1642 408 -751 -1357 -1859 -1498 -718 211 1262 2022 1921
5565 1921 879 -343 -1325 -2085 -1703 -791 464 1258 2040 1731 937 77 -1143 -1583 -1709 -1186 -64 1215
5583 1215 1848 1885 1212 22 -1225 -2031 -1942 -1211 -316 888 1801 1758 1350 302 -958 -1791 -1948 -1289 -223
5602 -223 1052 1691 2022 1428 313 -766 -1433 -1908 -1461 -659 673 1553 1861 1662 640 -572 -1707 -1885
5620 -1885 -1443 -683 443 1284 1863 1538 739 -316 -1484 -1967 -1624 -968 392 1504 2136 1776 907 -188
5638 -188 -1303 -1755 -1724 -1181 -29 1027 1969 1781 1276 -115 -1181 -1762 -1873 -884 206 1103 1815 1766 1084
5657 1084 250 -996 -1604 -1941 -1280 -300 675 1703 1807 1275 403 -745 -1561 -1881 -1458 -537 581 1487
5675A487L12l41j013q60j162m62L75J032J203Q80O15m24j158r13j107k85J63R02
5693g56J156R69N06p7q94j218j096m94Q2Q90J086J019P66k28o65j062j167n62
5711a745j46P49R77J204P01J59p53j091j164p21N1M60J124Q90Q76K16l22r26j349
5730h10r05j72L32J068J340Q17N0k98j049r92q65l80J96J002J230J173K34l31
5748A640p90j425j057k56L79R70R99R35M23j87o64j237j106n65J70P30J467R54
5766A380N78k15p30j322j048l29p3P14R06J278Q86l1r13j013j190p46j2O95J012
5785a73J036Q59K72l93j285j114q32m46N52J075J347O45L52n40p87j363r76j37
5803a908K89J035J000J043O91l64j042j443r45l10L17R10J219J120J18k34q81
$$ plain form
5675 1487 1799 1458 445 -415 -1577 -2039 -1664 -632 571 1451 2066 1642 484 -429 -1536 -1821 -1658 -756
5693 -756 400 1369 1875 1798 904 -314 -1410 -1904 -1822 -932 154 1173 1939 1711 1046 -16 -1183 -1745
5711 -1745 -1891 -1142 -165 1039 1740 1899 1146 55 -1109 -1830 -1779 -1319 -195 695 1571 1787 1465 539 -810
5730 -810 -1715 -1887 -1555 -487 853 1670 1720 1422 373 -619 -1484 -1864 -1668 -666 564 1737 1971 1640
5748 1640 850 -575 -1632 -1888 -1509 -539 460 1395 1818 1631 967 -270 -1376 -1941 -1771 -1041 426 1380
5766 1380 1958 1743 1013 -309 -1357 -1686 -1759 -1045 -139 1139 2025 1994 1081 68 -1122 -1868 -1880 -1185 -173
5785 -173 863 1722 1994 1601 316 -798 -1630 -2076 -1524 -449 898 1543 1895 1355 568 -795 -1771 -1908
5803 -1908 -1619 -584 416 1459 2150 1786 744 -699 -1644 -1954 -1637 -727 492 1612 1730 1496 615
5820F15r38r21o79J87P46J069J313O28j30q43j491q23m64j01P30J188J027N52
5838A665K9l94j147j065q44m44P53J292J157Q54J87q84q55j171r86j73M68J303
5856b55R94R15L38n23r72j188p06o01N79R79J234P24K85j54j058j287p95m67K3
5875a935J298J107J283J51m18n93j378q48o00L75O53J142J200N80j54p34j176
5892d7j294p45J91R86J178R54O22n6m99j326j087p54m0O23J177R43R24K84q39
5911A195j088j212o29lN40J065R73Q98L46n59q52j395j032j91K79J101J268R31
5929A635J62m13r90j011q67l64J47R24J090J134M84j25p42j625j041l91L02R44
5947g47J060R71O58k50p43j218q63q68J40Q97J051J082J150l76q08j239r32q57
$$ plain form
5820 615 -323 -1244 -1923 -1736 -990 79 1392 2020 1890 1047 -444 -1267 -1731 -1832 -1102 86 1113 1665
5838 1665 1694 1300 153 -912 -1756 -2200 -1447 -155 1002 1856 2043 1159 304 -867 -1853 -2026 -1558 -255
5856 -255 739 1654 1992 1469 497 -691 -1397 -1998 -1419 -440 794 1518 1803 1649 591 -696 -1491 -1958 -1935
5875 -1935 -637 470 1753 1904 1486 893 -485 -1333 -1933 -1558 -905 237 1437 2017 1863 1129 -47
5892 -47 -1341 -2086 -1895 -909 269 1223 1845 1789 1290 -36 -1123 -1877 -1917 -1294 -117 826 1750 2034 1195
5911 1195 107 -1105 -1734 -1737 -1197 -132 841 1739 2085 1526 674 -721 -1753 -1944 -1665 -564 704 1635
5929 1635 1797 1384 394 -617 -1484 -1848 -1701 -777 313 1447 1931 1806 1064 -561 -1602 -1993 -1691 -747
5947 -747 313 1284 1942 1692 949 -269 -1132 -2000 -1860 -963 88 1170 2320 1944 1136 -103 -1035 -1892
5965a892K77L99J182R03Q83J52o02j166j074n59l95N98Q26J372J140j02n58q57
5983E27j307j026m26Q16J050J211R44K58m28j019j425q77k64L58R82J392R35K75
6001A976l82q71j186j134n13K78J137J088J217K89k41q57j300r07k00k18R05J046
6019A27J184O04j23p98j085j251o25n6P19J222J237O07K6n89r83j195q64k4M98
6038a369J239J204O64L18p52r79j184q96l68O07J199J105P69M71l94r37j436q03
6056a542m13N22Q50J098J158K08j28j066j188r26m53J08P99J332J182N33j41r87
6074I46j330r39n96L99L93J287J088P23m1q06j175j279o05J90M74J345J095P21
6092A890k34n90q48j329q03L06L43J008J205P71K22m29j172j456n17m80P45J137
$$ plain form
5965 -1892 -1615 -1216 -34 869 1752 1904 1302 136 -938 -1497 -1892 -1294 -468 904 2044 1942 1384 527
5983 527 -780 -1806 -2232 -1416 -366 845 1789 2047 1619 600 -825 -1702 -1966 -1608 -626 766 1701 1976
6001 1976 1594 723 -463 -1597 -2110 -1832 -695 393 1610 1899 1658 801 -499 -1406 -1606 -1824 -919 127
6019 127 1311 1915 1792 994 -91 -1342 -1967 -2023 -1304 -82 1155 1762 1788 1199 216 -979 -1843 -1867 -1369
6038 -1369 -130 1074 1738 2056 1304 325 -859 -1755 -2123 -1516 -317 788 1557 2028 1634 697 -739 -1542
6056 -1542 -1955 -1433 -583 515 1673 1881 1753 687 -501 -1427 -1880 -1772 -973 359 1541 2074 1933 946
6074 946 -384 -1323 -1919 -1520 -1127 160 1248 1971 1930 1124 -51 -1330 -1935 -1745 -1271 74 1169 1890
6092 1890 1656 1066 218 -1111 -1914 -1608 -1265 -257 948 1719 1941 1512 340 -1116 -1633 -2113 -1368 -231
6110b31J021Q12L15j84j208j063r82m76L53Q53J500J043L64n44j052j148j045
6127a672l63M77P57J161J126L87l1q74j309j142l95J30Q92J016J264L61J47r78
6145I54j170q10p90J42N44R25J265Q35K40r02j330j126p23K27P29P55J128J019
6163A912J09o89j021j375p21m06Q39J082J218Q15K31m65j136j243p79m54N57R83
6181e43J370R51M8k85p50j440j247j85N33R97J052R52M65k61j017r63q24p35N7
6200a825R21J245J142O29m61r01q87j284m39L19M78J300Q48Q51k8o94j168j131
6218a085r16K08N59J142J157N74k4l55p85j238r15k66L66J102J404Q49J37o63
6236A251q68j117r63k64N68J019J164R10J30k7j109j224j007m14K43Q89J410R85
$$ plain form
6110 -231 790 1602 1917 1733 525 -538 -1520 -1996 -1643 -790 710 1753 2117 1573 521 -627 -1672
6127 -1672 -2035 -1558 -801 360 1486 1873 1842 968 -341 -1483 -1878 -1748 -856 160 1424 1785 1932 954
6145 954 -216 -1026 -1816 -1674 -1130 -205 1060 1895 2135 1233 -97 -1223 -1946 -1719 -990 -235 893 1912
6163 1912 2021 1332 311 -1064 -1785 -2191 -1352 -270 948 1763 1994 1529 393 -850 -1629 -2083 -1526 -543
6181 -543 827 1778 1826 1541 791 -649 -1896 -2081 -1548 -551 501 1453 1918 1657 640 -323 -1147 -1882 -1825
6200 -1825 -904 341 1483 2112 1651 750 -137 -1421 -1860 -1541 -1063 237 1085 1936 1908 1214 46 -1085
6218 -1085 -2001 -1793 -1234 -92 1065 1639 1615 1260 475 -763 -1678 -1944 -1578 -476 928 1777 1914 1251
6236 1251 383 -734 -1697 -1961 -1393 -374 790 1700 1830 1803 694 -530 -1537 -1951 -1708 -819 591 1576
6254A576K96j01j164j073j006l79P9J002R66J274K98n6q46j242j091n52K32O49
6272a138J224J088O96j23o40r88j317q38J90N91J209J099Q29J08p48j290j043
6289a091m30j44L62J148J079P91M16o30j035j372p63j95K24J336J110P43N18o87
6307A380n99j342r63l73L00R82J160Q84M75l27q80j138r59m27J49Q76J181J001
6325A380K32N6p01j063j356o20K81Q98J268J102M78j3q23j244j062o91Q6P46Q71
6344a75J268O35R8n61j405r15m94l44N81J116J074Q18J07m70r78j103q91q6L83
6363a342Q84J346Q57J49m43j025j202p88m40M77R83J062R28M06k10q21j290j154
6381a623m16K57J072J239R75M44l25r57r76r83n34J32P43J228J093O38k14p59
$$ plain form
6254 1576 1872 1771 607 -466 -1472 -1851 -1772 -770 196 1470 1768 1712 866 -376 -1467 -2019 -1787 -1138
6272 -1138 86 1174 1870 1747 1107 119 -1198 -2036 -1846 -1255 -46 1053 1882 1990 1242 -48 -1091
6289 -1091 -1521 -1665 -1303 -155 924 1715 2131 1501 466 -906 -1669 -1864 -1640 -304 806 1549 2067 1380
6307 1380 781 -561 -1524 -1897 -1597 -615 545 1429 1904 1577 697 -441 -1400 -1827 -1678 -802 379 1380
6325 1380 1612 1668 967 -96 -1452 -2072 -1791 -893 375 1477 1955 1942 1119 -125 -1187 -1878 -1792 -1046 -175
6344 -175 1093 1728 1826 1265 -140 -1055 -1549 -1893 -1312 -196 878 1696 1803 1333 355 -748 -1639 -1725 -1342
6363 -1342 -458 888 1745 1894 1451 426 -776 -1564 -2004 -1527 -544 518 1446 1852 1642 821 -469 -1623
6381 -1623 -2039 -1782 -710 529 1504 1948 1623 666 -310 -1293 -1827 -1695 -952 276 1369 2007 1793 1034
6399A034j211j024q23L05P40J020J118P07j17o17j086j089p05j48O41J090J345
6416A180N86M2l18j486q21q31j99N56R41R83R61L25m14j126j158r55k55M12J005
6435e72J301P13J31j89o51j335p27p31L62Q37J363J123L52l68p69j239j006m14
6453a819J96J022R28J062M84J0p21j560q02o64J04Q88J052J033P10m6r26j172
6471b21q56o12n4N84J039J231Q32o1q29q21j110j063K99N56Q53R44Q33K90m88
6490A346q61r72r99l23K69J278J039R14K7k36r82j039q41o36M32P72J343P54O72
6509A957l48r25j114j087m04K43J063J207Q93K80k55p71q95r31p41K38M85J316
6527B11R65Q30j06q34j149j063m65j86Q49P89J144Q46Qo16r89j303o09j52N18
$$ plain form
6399 1034 -177 -1201 -2024 -1719 -979 41 1159 1866 1749 1132 46 -1043 -1748 -1896 -1255 -165 1180
6416 1180 1766 1808 1490 4 -817 -1648 -1847 -1291 -350 633 1594 1919 1505 379 -779 -1734 -1989 -1577 -572
6435 -572 729 1442 1573 1384 733 -602 -1329 -2060 -1698 -861 502 1625 1977 1609 840 -399 -1405 -1819
6453 -1819 -1623 -601 327 1389 1873 1883 1162 -398 -1200 -1864 -1760 -872 180 1213 1923 1877 951 -221
6471 -221 -1077 -1689 -1743 -1159 -120 1111 1943 1882 1053 232 -878 -1941 -1642 -1086 -233 711 1544 1834 1346
6490 1346 485 -487 -1486 -1809 -1540 -262 777 1691 1718 1482 500 -539 -1380 -2016 -1584 -812 531 1285 1957
6509 1957 1609 684 -430 -1517 -1921 -1678 -615 592 1485 1765 1510 739 -156 -1087 -1828 -1590 -1105 211
6527 211 1176 2006 1900 1066 -83 -1146 -1611 -1797 -948 -159 985 1831 1839 1223 234 -1069 -1678 -1830 -1312
6546a312J100J221O51K21p73q10j035p93l54M28J008J251P62K50l48j123r31q55
6564a442l46M12Q81R82P31N14k9r14j145r73n53J56J007R67J066M33k65n32j386
6583d36q19l45k7N04J203J042Q13l07q08o67j098p77j53J043J001Q15N66jk73
6602A276j162r79q48l14P82J031J043R38m6n15j082j195l69k12N11P35J041J009
6620A644J12m84p82j032j009l66N17J173Q10R83J9l31p24j226n47l72J22R27R61
6639C95R17N28j15r64j097r13l43J42O64J069J061L78j82p14r43q91o01j00N58
6658a151J451O73O54j6p36j087n85r09J83N63O94J050R11K19q28j006j035p02
6676a657k58P31J062Q43Q31O4l86p64j051q98l32M99P83J076R11M73n52r60r87
$$ plain form
6546 -1312 -212 1009 1660 1881 1108 298 -737 -1530 -1884 -1456 -448 803 1565 1815 1467 344 -587 -1442
6564 -1442 -1788 -1376 -495 487 1218 1732 1703 789 -356 -1329 -1882 -1726 -719 248 1314 1747 1482 950 -436
6583 -436 -1255 -1600 -1627 -1123 80 1122 1935 1628 820 153 -945 -1722 -1875 -832 169 984 1550 1549 1276
6602 1276 114 -865 -1713 -2027 -1245 -214 829 1767 1721 1206 124 -1071 -1440 -1652 -1141 -406 635 1644
6620 1644 1756 1272 490 -542 -1551 -1917 -1400 -227 583 1566 1585 1254 530 -696 -1243 -1615 -1493 -566 395
6639 395 1312 1840 1725 761 -336 -1249 -1592 -1450 -786 283 1344 1722 1540 826 -117 -1008 -1609 -1709 -1151
6658 -1151 300 973 1627 1611 875 -212 -797 -1706 -1523 -960 -266 784 1695 1914 1086 80 -955 -1657
6676 -1657 -1915 -1184 -122 721 1552 1616 1230 466 -585 -1483 -1815 -1316 -533 543 1454 1927 1375 415 -572
6695e72r79k29L71Q29J086Q57M71k44q24j204p50p66M74P55J045R27K11P4p87
6714G45j094r06m48J72N57J072J003N96qo25j251q13q11L11L21J143R91M03J69
6733A527m35j149q29p38p0M56J020J089Q10j85m97p09j149p31m8M20Q85J043R15
6752A625Kl35p12j261p76n86M03J049J174O58M41l24q66o90j150l69L50K99J434
6771C66Q35M93j41q49r55q39o50L01P10O82J178L65R4p19q79r66o61p4O79J036
6791FJ142M57r8n91r48r00m92n9N38O11J497M12K03p19q77j164n27JK63R32J081
6812G68P76M9l39r72q18r62l63N69R75Q54Q38L21n49p05j064p40m56M97N74J178
6832D31Q06O07m53o63r88j088m08K72Q10J089O92N32k21p23r34q86m04p1Q00J166
$$ plain form
6695 -572 -1551 -1780 -1409 -580 506 1363 1834 1590 766 -438 -1188 -1954 -1480 -725 320 1247 1458 1532 745
6714 745 -349 -1255 -1703 -1531 -974 98 1101 1697 1689 1064 -187 -1000 -1811 -1500 -1179 -36 955 1358 1527
6733 1527 1092 -57 -886 -1624 -1694 -1238 -218 871 1681 1496 999 290 -859 -1590 -1638 -1218 -333 710 1625
6752 1625 1627 1292 580 -681 -1457 -2043 -1640 -591 583 1241 1682 1358 492 -198 -1348 -1717 -1367 -1068 366
6771 366 1201 1694 1553 704 -251 -1090 -1740 -1439 -729 -47 1131 1496 1590 871 -8 -974 -1635 -1709 -1030 6
6791 6 1148 1605 1507 916 -32 -932 -1424 -1483 -945 -334 1163 1575 1778 1059 182 -982 -1509 -1508 -1245 -313 768
6812 768 1544 1593 1254 282 -536 -1498 -1861 -1292 -317 537 1375 1696 1147 442 -622 -1362 -1818 -1321 -747 431
6832 431 1237 1844 1391 728 -260 -1348 -1756 -1484 -674 415 1107 1639 1418 695 -239 -1125 -1529 -1600 -800 366
6852C66P87N48j73q78o23j052n03k4N37R58O99Q24Q8m24r53r61p98j11M78R50
6872b65J120O80Nn17n43j177o59k46M48R63Q87P28K52l63r72q93q39l3L29P11
6892c84J037M57O19l94q66q05r02n36K61Q83J074Q62L38k58q26r28o62m33r4P08
6912h49Q62J310J61J43p53r68j145m73O8P54R69R84N38l37k34j160n65p62l00
6931a757O15P65J468M08J01n21q23r55o93j77M67O91J084O31J56k65p43j077r78
6950a603J3J90J051R87P11K75k97p33j035p86k79J36Q81Q30Q98L45k53o78j023
6969c70j237K5K87N04J072J037K3J74q58p35r16p32L29N20J121R75M76j43n79
6988I73j189o98l72k37N85Q79Q95M12L21m27j095r19p14O9N23R15R36N81O7l88
$$ plain form
6852 366 1153 1701 1528 650 27 -1025 -1528 -1552 -1015 -57 642 1466 1554 1130 177 -784 -1582 -1693 -1215 -265
6872 -265 855 1535 1540 1023 480 -697 -1356 -1602 -1154 -191 696 1424 1676 1313 341 -552 -1391 -1424 -1095 -384
6892 -384 653 1110 1729 1335 469 -336 -1238 -1774 -1513 -630 444 1306 1644 1386 560 -368 -1030 -1463 -1557 -849
6912 -849 13 1323 1484 1627 874 -94 -1239 -1712 -1644 -890 79 1063 1601 1264 1030 -130 -695 -1457 -1757
6931 -1757 -1142 -377 1091 1499 1600 1079 256 -699 -1392 -1569 -1102 -411 673 1304 1460 1195 452 -625 -1603
6950 -1603 -1590 -1400 -349 638 1349 1624 1327 594 -441 -1227 -1506 -1370 -489 341 1239 1584 1331 653 -370
6969 -370 -1607 -1582 -1295 -791 281 1318 1341 1515 657 -78 -994 -1726 -1397 -877 244 1219 1695 1552 973
6988 973 -216 -914 -1286 -1523 -938 -59 836 1248 1569 1142 47 -872 -1586 -1517 -994 -79 857 1438 1505 1117
7008A117q29j004n18l84L97Q56R93P08K23k92q27j027q48m5L63O95O55J201Rj40
7028A303o04j004j043n26M17Q33J010Q26M79k55j071m75j104m6j31N82R93Q04
7046I88O70k18o30r72p64n68K87M56Q54R14M69k1n32j019q57l92j48M05R23J171
7066A016M53M4m61q10r83o11Q7K11P21J049P76P2n49o09j130p69p8N14P40R13
7086E96O64M2j11n03j086r62l23L18P85J126O82L02k82q17p07j030l96M29O27
7105f46J085M72N85j39o28j203o78m20J51O51R55R36K72L4q54o62q08l77j97P17
7125g54O08J097N76M0n18j104o98p51k7M93J043N89P10R4k47q42j034n31l53L68
7145a241R79J074O54J38n38q37p65q53J24J87P93J034M11M26k62n42j123r68k96
$$ plain form
7008 1117 288 -716 -1234 -1618 -1221 -365 628 1336 1559 1267 440 -587 -1435 -1480 -1117 -422 233 1434 1443 1303
7028 1303 699 -305 -1348 -1874 -1457 -624 386 1212 1691 1436 365 -110 -1214 -1260 -1391 -809 184 988
7046 988 1658 1440 810 -162 -926 -1494 -1207 -751 103 1017 1486 1465 933 -86 -943 -1335 -1483 -1078 -155 1016
7066 1016 1469 1513 1052 242 -741 -1352 -1265 -1054 -333 716 1492 1564 1015 406 -724 -1493 -1571 -1057 -317 596
7086 596 1260 1302 1191 688 -398 -1360 -1683 -1365 -580 546 1228 1530 1248 431 -276 -1306 -1702 -1273 -646
7105 -646 439 911 1496 1357 729 -474 -1152 -1572 -1421 -770 185 1121 1393 1427 573 -89 -897 -1274 -1471 -754
7125 -754 -146 951 1527 1567 1049 -55 -753 -1504 -1531 -1038 5 594 1304 1398 1151 309 -725 -1256 -1609 -1241
7145 -1241 -262 812 1466 1604 1066 229 -536 -1389 -1265 -1078 -285 749 1160 1586 1324 782 -341 -1309 -1605
7164a605L22Q77Q79O05N05m21o72p31q22n79J79P57R63R61M06k16q56q32q94j47
7184a321r5M31J009P92N54j9m84j065o83n61j13O56R82O55Q04q7o33q54p23o24
7204a379m3M31P73R41O21K62m37p76j014p85j31N96O67P23P34J48j87o66q51q57
7224a230m94M44O35J085P12L14k66q07p46q86p9J37O87P42N68P86j77r82o18j064
7244a239l46J43Q13Q55Q19L29k06j90q95r48n49L8N10P88J147K64K11o02j074
7263a32o85n37q7O27P25P82N51J08Mj148j031o11j30P77N36R58Q42j08j76j023
7283B42q51q33l9L09P15Q61Q29M03l75q12q40r19k86K63R90R41N21M05l91n32
7303F01j045o08l36q4P45J013R63L42k58o84r86n77m02k10O36R16R52N95n3o52
$$ plain form
7164 -1605 -1283 -406 473 1078 1583 1162 490 -241 -1063 -1642 -1463 -706 257 1218 1624 1408 552 -280 -1174 -1321
7184 -1321 -1416 -985 24 816 1370 1351 867 -198 -881 -1442 -1555 -899 83 738 1542 1455 822 -32 -755 -1379
7204 -1379 -1422 -991 -218 723 1344 1606 1169 393 -621 -1406 -1537 -941 -274 449 1183 1331 1144 478 -373 -1230
7224 -1230 -1724 -1280 -645 440 1152 1466 1200 393 -353 -1239 -1318 -1181 -494 248 816 1602 1425 443 -175 -1239
7244 -1239 -1585 -1442 -629 226 1045 1374 1168 978 83 -865 -1414 -1376 -866 -78 1069 1333 1544 942 -132
7263 -132 -817 -1354 -1441 -814 -89 693 1244 1352 1356 208 -823 -1434 -1564 -787 -251 707 1549 1441 1265 242
7283 242 -609 -1442 -1481 -1172 -457 404 1233 1636 1261 449 -391 -1310 -1596 -1333 -343 598 1119 1524 1133 601
7303 601 -444 -1052 -1388 -1472 -727 286 1249 1591 1333 649 -337 -914 -1316 -1526 -890 26 978 1573 1520 868
7323H68r02p84p23Q3P02P13J059J42K72o61n98p43o73K9K04Q91R34O28J58n09
7343A090q87q61n95j62M93O64R03N07K34k60o57q42r53o7J41Q18Q55Q30J28j75
7363A204r15n91p11k80P8N92R44O46N00k1q45r42q15l56K47M99R41P45M79q1o93
7384F25p93p62m07r0P55R43O06P63j67n70j015p06m13LK88P41J086N12J02k55
7404A246j033r75n40l5L75Q50Q25L99K15l84n75j128n34k78L14Q30J004P26N0
7423A352j76p37r83n65l46L01Q41R01O50L01m20l22j042q62k01l3Q65R76Q04L17
7443A621m39o90p36o67m46N2O00O74R03M76p9n40r19p04m57R4M79R62N94O04J52
7464A534p85p64o88n58j51K13J156P55P25P8n63q13p60n31j98M28O07J026L43
$$ plain form
7323 868 -34 -818 -1541 -1458 -756 -43 1016 1158 1430 769 171 -572 -1245 -1216 -1012 -121 813 1441 1599 1090
7343 1090 203 -658 -1253 -1415 -922 -258 645 1152 1386 1126 469 -373 -1326 -1393 -1252 -434 421 1251 1379 1204
7363 1204 289 -302 -1013 -1293 -1215 -623 321 967 1467 1446 601 -341 -1156 -1512 -1265 -766 175 920 1399 1318 625
7384 625 -168 -930 -1337 -1427 -672 271 877 1640 1473 903 -112 -818 -1231 -1228 -940 -199 887 1399 1501 1246
7404 1246 213 -762 -1302 -1337 -962 -112 713 1112 1327 943 368 -760 -1294 -1572 -1258 -428 576 1302 1352
7423 1352 1176 439 -544 -1109 -1455 -1154 -313 588 1238 1539 1119 797 -245 -1107 -1308 -1341 -476 500 1304 1621
7443 1621 1182 492 -244 -911 -1357 -1305 -705 -31 872 1348 1269 729 -190 -894 -1351 -1257 -778 184 778 1382 1534
7464 1534 749 -15 -703 -1261 -1412 -1199 -43 712 1437 1515 952 139 -621 -1152 -1350 -922 -315 711 1054
7483A054K58lq79j020o97p0J93P14J152M79J95j96p31o15q91l77L52N48P12Q49
7503A027N69k26q89q88l69o81L26M60Q23P05N56k22m29r38p79p03L00P33O79R64
7523A018O03l20o37n82q62m65j74N48O61Q86O56K10n44q75r43o49J19L55Q83Q19
7543G07L73K25k17p71o69q60k16M02O97J042L94K88j88r76p60o77k75L50Q39O59
7563C67N81K88R6p77r82p82l45J83Q95Q55Q78K48l08m39r88n24o74J71N42O69
7583d6J100L34m4o10q01p54m93O5L67R70O22P52N6o51j072n28p11P3N12R04M99
7604E44P45J51m88r97q36m21R0K72P14P50P31L41m80r20q24p48q4L43P47Q77M52
7625I59L26k06m83q47n44p26R2J037Q01O13L94K2q12r07q20k96K51M75P56P45
$$ plain form
7483 1054 1312 1309 430 -590 -1287 -1357 -1164 -450 702 1181 1376 1180 449 -166 -1057 -1434 -1082 -534 178 1027
7503 1027 1596 1370 481 -407 -776 -1457 -1131 -671 152 857 1413 1191 762 -176 -955 -1658 -1358 -625 54 1018
7523 1018 1621 1301 664 82 -780 -1245 -1419 -871 -210 676 1332 1542 998 123 -820 -1469 -1350 -995 -112 707
7543 707 1080 1305 1088 317 -352 -1212 -1428 -1026 -329 713 1107 1395 1207 231 -529 -1206 -1481 -1131 -292 367
7563 367 948 1236 1332 555 -427 -1209 -1554 -1371 -476 379 1257 1505 1197 758 -230 -754 -1428 -1257 -715 -46
7583 -46 1054 1388 1344 734 -67 -821 -1314 -1249 -882 88 710 1462 1518 867 -205 -733 -1444 -1371 -859 45 544
7604 544 1289 1440 952 -45 -881 -1302 -1212 -940 -226 524 1255 1596 1116 196 -628 -1376 -1460 -1117 -370 507 959
7625 959 1285 1079 596 -251 -795 -1521 -1429 -392 409 1022 1416 1438 626 -281 -1101 -1397 -1146 -671 85 830
7645H30M23J67m99j088o79p58K31O47R51O79M85J00p43o84q21m82k3K69Q75Q78
7665G58P11Rm22r19j097l73L8M15O58P87O69K50o10n47r83q08o9N78Q40P91O02
7686A278K31n24p30o97n78l89J75O60R57P13L07k08n42r82p20l61J61O71P31R26
7706A079J59n0o75n62q97n69OO11J066Q50M21k22n40q46q42k01L6K03R37P42N20
7727A226K16m45p50r51o80Q1L32P95Q71N71Kl11q71p80m94k12L42O62J068Q14
7747A486j44k36q44q39n86k69K60O52J028O66L34k76n43j035q33r7J2P22Q79P42
7767A079L87j58o69j101m29l24m3L56J019R20M49p9q02n87j016k36j39M68J133
7786B28O37M30K8n16r58n11q16J43J98J069J032N84j45m49q91p69n21k33N28O47
$$ plain form
7645 830 1253 1420 921 -167 -846 -1604 -1373 -726 225 904 1389 1489 746 62 -759 -1241 -1264 -995 -120 758
7665 758 1469 1478 1056 137 -960 -1333 -1295 -880 -222 565 1234 1484 874 327 -656 -1464 -1533 -955 -115 676 1278
7686 1278 1509 985 255 -442 -1020 -1409 -1234 -574 383 1096 1403 1195 653 -329 -1049 -1410 -1249 -578 153 1079
7706 1079 1238 1188 513 -49 -946 -1515 -1509 -898 168 1018 1439 1217 677 -169 -1011 -1212 -1176 -973 -36 706 1226
7727 1226 1442 997 247 -704 -1384 -1303 -971 -176 695 1266 1268 957 86 -694 -1188 -1400 -1058 -396 672 1486
7747 1486 1342 1106 262 -577 -1163 -1432 -1172 -520 508 1174 1508 1232 689 -346 -1179 -1276 -1264 -542 337 1079
7767 1079 1466 1308 639 -462 -891 -1215 -1258 -902 117 1037 1486 1407 605 18 -998 -1234 -1373 -905 228
7786 228 865 1295 1323 807 -151 -662 -1478 -1335 -1137 -68 964 1548 1403 954 63 -706 -1227 -1460 -932 -285
7806b85P57P03J36j55r69q23q83J74J32R65R06N39J95l91n70p60r15j15J39P10
7826e10J022O34J11m8o13j038n89m39K43P63N78O27P12l08l09j056p93k86j3N62
7846g50R60Q38M21N5p24r34n48o89L1O32N41J079M80R3n81q82q33n90l8M25Q29
7867a85Q55N85J03m39p70n75q84k15M69P90R11O46J34j15r80p95o99l34M66N22
7887e10R56P61K86l82m75r32p17o32L08P97J074M01L58N6q41q13p41m08K53L62
7907h39J031P70L29j00l08q36q85l97lN38M78J141M18l8l56p46j027m24k7K78
7927a003R44Q15P12r5k75j026q73m68j92N87N53J011N14M32n69o81r47q41L6K93
7947a073P14Q25N17L79k87n27r53q69k18K06P98R07P61L14m86l48r26o55l34N6
$$ plain form
7806 -285 472 1175 1311 1156 187 -636 -1519 -1345 -1213 -248 658 1197 1392 1001 431 -329 -1244 -1359 -1220 -510
7826 -510 512 1146 1257 1209 596 -442 -1031 -1470 -1227 -464 114 741 1453 1145 836 -220 -1013 -1299 -1312 -750
7846 -750 210 1048 1469 1524 800 -134 -682 -1371 -1340 -708 -167 912 1392 1485 904 22 -811 -1401 -1439 -1014 -185
7867 -185 670 1255 1358 919 149 -426 -1310 -1525 -1056 -266 645 1291 1425 1310 330 -465 -1164 -1498 -1032 -510
7887 -510 446 1207 1493 1111 636 -296 -1013 -1645 -1337 -540 534 935 1293 1349 508 -305 -1046 -1454 -1201 -839
7907 -839 192 962 1291 1191 883 47 -838 -1235 -1238 -700 -222 919 1337 1299 943 197 -830 -1254 -1281 -1003
7927 -1003 -59 756 1468 1373 1098 72 -801 -1269 -1461 -874 -321 690 1204 1636 1067 386 -561 -1402 -1366 -1073
7947 -1073 -359 466 983 1362 1075 548 -405 -1274 -1492 -1286 -488 419 1180 1494 1008 660 -266 -921 -1255 -1199
7967a199N54P51J018K48N1p79p66q97j63k29P49O62Q51N18r3m07j032o56m71r2
7987a382N38P33O92P05m1l11q94p45m35j51L93P90O01M63K18j87q85m49j028J08
8007a267K81P36Q34N27L16l99p94n48q09k36K80O30P00O83P25m57n29j009o79
8026a015l42K95O27O74N99M76j89o13o94n59n44l7O10Q41Q29L47K6p23o97p75
8046h64l94k40O41O80P55O13J09l74q85o66p75R3M92O54R47N00Jl19r07n74p02
8067a215r1M80O13P84L65N53n34p08p30o02k62L32P46O63N55M88k62q32n43q73
8087a073m16L06O39R50N62M16j26p68q19n50m29j16P90P68R03M20j47n31q69q78
8107i68l89n0P00P11P87M08j9m76p61n76n38m05P03Q68P88O28j61k42q13j011
$$ plain form
7967 -1199 -645 106 1124 1372 1423 644 -122 -1019 -1182 -1411 -662 0 851 1369 1276 869 -163 -819 -1290 -1382
7987 -1382 -844 -111 581 1286 1245 934 40 -705 -1140 -1291 -898 -108 493 956 1174 987 102 -347 -1375 -1267
8007 -1267 -986 -250 584 1111 1427 1028 234 -314 -1123 -1359 -1079 -449 251 934 1659 1202 673 -336 -1015
8026 -1015 -1357 -1062 -435 239 838 1314 1125 512 -182 -741 -1285 -1322 -712 129 958 1305 1331 608 -89 -864
8046 -864 -1258 -1498 -857 -177 578 1191 1300 926 41 -625 -1400 -1307 -815 -161 786 1286 1287 968 61 -513 -1215
8067 -1215 -1306 -826 -213 571 936 1489 955 247 -483 -1085 -1347 -1015 -269 394 949 1437 1175 343 -200 -1073
8087 -1073 -1489 -1183 -544 406 968 1384 1258 490 -329 -879 -1308 -1424 -634 134 1037 1457 1310 779 -90 -968
8107 -968 -1357 -1407 -707 4 791 1199 1180 704 -57 -633 -1171 -1576 -873 -5 783 1411 1250 1008 195 -816
8127h16l05l38N31N93Q56O65J79k78o99p25r10rK59P33O91O63K24L4r41p37o29
8148i59k21j7O70R95N36N15j92p24j032n69k27P3M65J018N00M95j66o15l72r93
8168h20m79LO52P12Q31L77l6n06r08o22o37K17K87R30Q19N61ll06r34q44m61j96
8190a363K12
8191a151
$$ plain form
8127 -816 -1121 -1459 -928 -335 521 1186 1365 1087 388 -337 -1247 -1256 -997 -264 427 1090 1314 1348 407 -330 -959
8148 -959 -1180 -1197 -527 468 1004 1519 1327 603 -429 -998 -1225 -1152 -687 331 831 1326 1160 545 173 -820
8168 -820 -1299 -1296 -644 68 899 1276 1240 734 -174 -796 -1433 -1216 -929 1 820 1381 1378 1072 138 -706 -1167 -1363
8190 -1363 -1151
8191 -1151
$$ Imaginary data points
##PAGE= N=2
##DATA TABLE= (X++(I..I)), XYDATA
0@%%%%%%%%%qJ1j1J6j7K5l2M0m9N8p4R0j07J25j48J74k02K37k75L16l65M19m78
32b55N43o15O96p84Q83r90J106j236J376j531J699j882K086k303K543k807L093
49A622l409L754m136M561n032N557o144O813p582Q467r505J0744j2254J4137j6565
64h972J9834k4498L1757m4720P5071k84204j95951L76029K34199J76421k5358
75C29608p5946j61783j53034j65855p2755K7398J68063K09421J83160N7438n9135
86B86580j70622k10370j97402r0206M6439J72919K08249J76360Q9471n528j10740
97A95150j83218j94873j12363K1537J45635J88708J46653N2150l3941r5008j34367
108c937j55363j26904l3557R3170J81733J89418J27298L2088o8222j49698j82809
$$ plain form
0 0 0 0 0 0 0 0 0 0 0 -8 3 -8 8 -9 16 -16 24 -25 33 -41 49 -58 67 -81 93 -109 128 -147 169 -196 223 -255
32 -255 288 -327 369 -415 468 -522 584 -652 724 -807 892 -990 1096 -1207 1336 -1471 1622
49 1622 -1787 1967 -2169 2392 -2640 2917 -3227 3586 -3996 4471 -5034 5710 -6544 7593 -8972
64 -8972 10862 -13636 18121 -26599 48472 -235732 -431683 -55654 178545 354966 329608
75 329608 253662 91879 -61155 -227010 -299765 -272367 -104304 105117 288277 345715 286580
86 286580 115958 -94412 -291814 -382020 -335581 -162662 45587 221947 311418 305890 195150
97 195150 11932 -182941 -295304 -273767 -128132 60576 207229 259379 225438 130430 -3937
108 -3937 -159300 -286204 -319761 -226591 -44858 144560 271858 303946 235724 86026 -96783
119i6783j44068l9870Q3587J65183J67411R8796L843p5554j26117j47346j26559
130b37477n1155N9749J49063J71062J27669N0675l0972j05243j54336j53491q7338
141b61794K4040J27045J69340J32812M5351m5288j08449j38820j32565p7556K2506
152b43378J24735J71969J40443O0225k5149q8258j25057j31296r7355k2994P0357
163a65758J41875J52817R5004q24q9846j41703j43585r3901J90J02129J59675
174A6073J44502P4828o779p2129j14443j29583j06424m0325N2177J28848J48574
185I5319J00238J1821o9156j14372j19620r2226l1592N2098J26366J48466J05621
196B12963K2775o0508j15357j30896j03383m0002L9722J03451J24614R4378K9158
$$ plain form
119 -96783 -240851 -280721 -197134 -31951 135460 234256 238099 162545 36428 -110918 -237477
130 -237477 -288632 -228883 -79820 91242 218911 269586 238614 133371 -20965 -174456 -261794
141 -261794 -237754 -110709 58631 191443 236794 191506 83057 -55763 -188328 -265884 -243378
152 -243378 -118643 53326 193769 253994 228845 140587 15530 -115766 -213121 -236115 -165758
163 -165758 -23883 128934 223938 223114 133268 -8435 -152020 -245921 -245731 -143602 16073
174 16073 160575 235403 228624 156495 42052 -87531 -193955 -234280 -182103 -53255 95319
185 95319 195557 207378 138222 23850 -95770 -187996 -219588 -167490 -41124 107342 212963
196 212963 235738 175230 59873 -71023 -174406 -214408 -174686 -71235 53379 147757 176915
207A76915l6929p9459r6928r2101n9095Q573Q9801J38562J21783M9840l6142r6747
219H8073j17766j02119n7679M694O9259J11874J11453O4666n545o7462r9433r8267
231i8252o8258j0226O2384J16288J20434P0876l908o8816j04602j08091q0239
242a72410k5187M4383J04473J25680R3157J8737n8704j04182j05070p1563j7527
253a68213M4120R4094J09590Q1174K1656m2063q9169j08797r4057m4975K5911
264a70729R2414J24385J03123L7633l8317r0277j01618p9815l6757J8563P4298
275f7097J07056R6627M3372k6216q2418j06710r4315n0667J1537P2955J08817
286A2941J02844N5848j1582p0435r6209q8073n3901k632N5567R9922J04015O0265
$$ plain form
207 176915 139986 60527 -36401 -128502 -187597 -179024 -89223 49339 171122 220962 184820 88073
219 88073 -29693 -131812 -189491 -184797 -115538 -3664 107789 172455 166910 99448 15 -98252
231 -98252 -166510 -176736 -114352 1936 122370 193246 189338 120522 15920 -92171 -172410
242 -172410 -197597 -153214 -48741 76939 170096 188833 130129 25947 -79123 -150686 -168213
253 -168213 -124093 -29999 79591 160765 182421 140358 51189 -57608 -151665 -196640 -170729
264 -170729 -78315 46070 149193 186826 148509 58232 -43386 -123201 -159958 -141395 -67097
275 -67097 39959 136586 179958 153742 71324 -35386 -129701 -180368 -168831 -95876 12941
286 12941 115785 171633 160051 89616 -6593 -94666 -148567 -151199 -95632 4290 108305 168570
298A68570j0451p2603r9833q9601n1835r84M9625Q6894R6320P1615J6207m6706
310A17218q8974r4247o5965j6938L8180Q2548R6402O9705J2902m5996q2814q7939
322f5918o4521k1830K8181P2457R4620Q2934L7039k6586p7590r5272p5352l1204
334a43042K0027O4574Q7343P6871L5366j8391o4227q5893p9210m4293R209O3421
346g8245R6735R1545M8703j3478o7311q9095p6712m2332j17M3252P7215Q6831
358G6991N9381L709n4647q8929q6996n1756Q17N2101Q4957Q7289N7777O640m7126
371A00208q0717q4250n8650j5409L2313P3205Q9403O9094J6783m3057q1523q4662
383f7262n6132j0453L5848O9583Q0975O5798K6160k6133p1538q9092p1599k7783
$$ plain form
298 168570 158119 85516 -14317 -103918 -155753 -156737 -107112 -20218 76102 147717 163924 117218
310 117218 28244 -66003 -131968 -148906 -110726 -28178 68224 137929 150831 104835 22021 -65918
322 -65918 -130439 -152269 -124088 -51631 42989 125923 162962 136376 58786 -36486 -111838 -143042
334 -143042 -123015 -58441 28902 105773 141139 122748 58521 -27372 -106582 -150875 -141666 -78245
346 -78245 18490 110035 158738 145260 77949 -11146 -87858 -130190 -130307 -87055 -9840 76991
358 76991 136372 140081 85434 -3495 -90491 -142247 -141430 -89329 -4372 82917 140694 147334 100208
371 100208 19491 -64759 -123409 -138818 -106505 -33300 56103 125197 141980 98923 17400 -67262
383 -67262 -123394 -133847 -97999 -28416 52559 118357 144517 118384 46846 -42246 -113845 -141628
395a41628K4834O6993Q4550O9603K6175k5334o3374p5194o2151k9002J3515N4962
407e6051Q0056P5754M0256j3294o1967q5160p3790l6153J0349N0449P3332P1745
419G5526M3617j964m6454p2072p0959m4844l036M3032P5689P9293N0733J100m8603
432H1058p6857p4721m6084o090L2870O2627P4869O0906K0182l1917p1105p9656
444e3918n6085j2600L4293O6649P4559N5100J6853k8192o3502p6073o1612k4643
456a29171K0171O0014P9077O9039L0976k1173o3497p7073o0698k4023J8289N3241
468d4828O9870O2747L2599j1483n3109p6505p0243l7219J0694N3641P6196P0662
480H3022L8192q405m9619o8654o2774l7011r45L7352O5607P0413M7601J917m5532
$$ plain form
395 -141628 -116794 -49801 34749 104352 130527 105193 41819 -33375 -95526 -124528 -111013 -56051
407 -56051 24005 99759 140015 126721 64754 -20406 -94196 -130349 -120000 -69551 3781 75526
419 75526 119143 117179 70725 -1347 -72306 -117150 -120186 -77154 -1465 77828 128561 129661 81058
432 81058 4201 -70520 -116604 -122694 -89824 -27197 47672 108578 128760 96843 25738 -53918
444 -53918 -110003 -122603 -88310 -21661 52898 107998 124851 96659 33157 -42916 -104528 -129171
456 -129171 -109000 -48986 30091 99130 130106 108933 45436 -31637 -92335 -116358 -98069 -44828
468 -44828 25042 87789 120388 108905 55796 -20709 -90952 -128171 -117477 -63836 12360 83022
480 83022 121214 112809 63190 -5464 -68238 -105249 -106194 -68842 -3235 67178 114779 116696 71164
493G1164p4108p1858m1447J773M0493O3443O6722M8478J1825l0696o2572o9674
505d6457n1005j4217K7489N9990P0496N3117J3604l0698o2552o8500m9277j3936
517a11946K4061N2899O6397N8362K8549j5400n6035p3245o0286k5154J7694N1431
529d2673O5414N6492K5721j3196m7273o3943n8800l1504P169M5405O8245O6875
541G7932L9097n837m8678p0260o2452l3075M059L7190N8454O0530M0939M088l5825
554F6162o3172o5531m2200k487L8244O3622O5968M4281O082l4949o1728o3651
566d9359m3310j0629K4097N1864O4062N2470J7710k6263n9647o7226m6790r964
578a02985K7713N2739O0004M8146K0824j6444n0937o6772n5262k3553J5350M7771
$$ plain form
493 71164 -2944 -74802 -116249 -114476 -73983 -10540 56182 104660 116485 85789 23217 -46457
505 -46457 -97462 -111679 -84190 -24200 46296 99413 113017 82319 19767 -48733 -98010 -111946
517 -111946 -87885 -34986 31411 89773 118322 102922 46887 -26358 -86644 -111798 -94104 -42673
529 -42673 22741 79233 104954 91758 44485 -19458 -78258 -109762 -102593 -57188 11057 77932
541 77932 117029 111192 62514 -7746 -70198 -103273 -99214 -62024 -3570 56960 97899 101987 66162
554 66162 2990 -62541 -104741 -107228 -68984 -5362 60606 104887 110969 76020 14292 -49359
566 -49359 -92669 -103298 -79201 -27337 36725 89195 106905 80642 20995 -46231 -93021 -102985
578 -102985 -75272 -22533 37471 85617 106441 89997 39060 -27712 -82974 -106527 -91177 -43406
590d3406O3281N5470K5985j4020m7979o1568n1668k2704J2358M2555N6987N3735
602F9026L1700l872m0669o3293o0658l4052M127L9029N8725N7291L5011p64l5182
615E6419n4603n3597l4650l628K8720N3066N9297M3681Q598l2901o1360o3138
627e4096l8769l196K7821M8199N3648M3975J7563j8319m9362o1402m7981j4887
639i6806K3986N1620N9133M4407J4658k0964m8834n8859m6535j7665J4667M1120
651d0072N6037N3054K8625r898m6131o2326n1264j9409J6528M2297N1066M3703
663F2210K4193l782l4641n6527n6369l2528N746L9872N7616N3309L0546l510l4933
676E1202n2071m9584k9229R7K8278M7466N0355L5610O270k8740n4291n7380l6219
$$ plain form
590 -43406 19875 75345 101330 87310 39331 -22237 -73905 -96609 -84251 -41696 15291 69026
602 69026 100726 96854 56185 -7108 -67766 -101818 -97691 -58662 63 57354 92365 91601 56419
615 56419 1816 -51781 -86431 -90059 -61339 -8273 51024 94705 103303 70402 9042 -54096
627 -54096 -92865 -96061 -68240 -20041 33607 77582 95145 76826 27464 -33938 -81919 -96806
639 -96806 -72820 -21200 37933 82340 96998 76034 27200 -31659 -78194 -95859 -81192 -40072
651 -40072 15965 69019 97644 87746 41615 -20711 -71975 -91384 -74856 -32559 18507 62210
663 62210 86403 82621 47980 -8547 -64916 -97444 -91698 -51826 5790 59099 89645 86135 51202
676 51202 -869 -50453 -79682 -79585 -51307 -3841 46514 82124 88394 59654 5363 -52017 -88236
689h8236j657L0401M8533N0005L7095J1074k0392m5909n3520m0310j1286K0726
701f3476M4239N0860L9532J4234j7440m5145n6125m3029j2196K0385M2003M8380
713B2222M0741K1124p475l6493n3680m8437k3647J1495L9930N1562M2829K0243
725H0414q535l5203n0432m6336k4059P542L4067M7792M6554L0058J992l0109n2166
738A579n2868l0903L194L3222M7873M3754K5817J909k3423m3335m9689l5973o363
751h5206K7553M9802N2124L5334N452k6116m7485m9308l2318n496K0473L8048
763a7143M3403L5790J5494j3474m0989n4647m2853j1218K4962M6024M6670L2237
775F4256J1274j1747l3580m5765m2540k1154R787L7254M8722M0395J7613j0142
$$ plain form
689 -88236 -89893 -59492 -10959 39046 76141 87215 66823 20914 -32606 -72916 -84202 -63476
701 -63476 -19237 31623 71155 85389 67949 22804 -33321 -76350 -88546 -68161 -26158 22222
713 22222 62963 84087 76612 40119 -13561 -61998 -85645 -74150 -34220 17342 60171 80414
725 80414 71879 36676 -13756 -60092 -84151 -76609 -42542 5250 51804 81862 83854 53745 1579
738 1579 -51289 -82192 -78998 -45776 2097 45851 71668 73577 50154 6819 -42870 -78843 -85206
751 -85206 -57653 -7851 44273 79607 85059 58943 11458 -37850 -70168 -75664 -55191 -17143
763 -17143 26260 62050 77544 64070 23081 -31566 -74419 -85637 -60675 -14651 32019 64256
775 64256 75530 63783 30203 -15562 -58102 -79256 -69469 -32215 16507 56902 74515 64373
787F4373l3412m5653m1189j9742R410L3799M4107L9055K2772j194k7340m6044
799a058m7136k8667K284L1301M5964M1489K2662j013k3280l8456m2352l0030m029
812g2321K4962M3145M4068K9557N455k1186m1135m6771l4561p619K1647M1132
824a3627M3819L0289Q352j5507l4500m2364l6457j4074J5605L9899M6380L5244
836F3059J1828j5171l6096m5082l7448j4979J1615L3876M2903L6539J8295o271
848F3068k9815m3926m2216k1733R900L7183M6085L5258J4256p839k6740l8409
860d928l9446k5643l40K7753M4736M2977K3831l144k6885l9933l9224k4424M36
873f4234K5523L9887L8066K3223J373k0027l6360m0915l0933o814K1034M0459
$$ plain form
787 64373 30961 -14692 -55881 -75623 -66213 -32414 11693 50748 73520 72326 44986 -1058
799 -1058 -48194 -76861 -74577 -43276 2688 44177 66839 65826 42546 4090 -38262 -68292 -72321
812 -72321 -47359 -4214 39854 69411 74866 53680 12545 -34226 -68787 -76406 -54759 -13627
824 -13627 30192 60481 68833 53326 18826 -23538 -59995 -74069 -58464 -18565 27815 63059
836 63059 74887 59716 23620 -21462 -58910 -73889 -62274 -28398 14505 51044 69339 63068
848 63068 33253 -10673 -52889 -74622 -64722 -27539 18546 53804 68060 60221 33481 -4928
860 -4928 -44374 -70017 -70357 -42604 2132 45109 68940 65796 38911 -1022 -40246 -64670 -64234
873 -64234 -38711 1176 39242 62465 63838 43811 7451 -33464 -64397 -71211 -50177 -9718
885i718M2965K7825L495j8953l2994l6574k9063j1039J3426L4104M1058L1663
897E6195J0434j4129l3277m1427l3842j2854J3266L3874M0142L1780J2817q813
909E4166k6475l6105l5282k0670M189K9688M2636L6987J6311q824k8127l8094
921i600l4575j9586L053K5317L8640L7444K2109q65k3027l6678l8437k5401k309
934f3915K4282L9930L8563K1209j803k1089l3270l4951k6239p318J6998L7008
946a0595M2733K9987M487k1077l6469l7177k5702o792J4911L1823L7601K8602
958E2332Q552j3783l0857l7997l0981j2227J3115L3395M0351L1224J0352j3665
970D9811l0009l5001k8900j4277N827K5989L7445L3681J5902p734k7824l6482
$$ plain form
885 -9718 33247 61072 64567 45614 12620 -23954 -53017 -64056 -50630 -16526 24532 56195
897 56195 66629 52500 19223 -22204 -56046 -68900 -55634 -21760 18382 50162 62979 54166
909 54166 27691 -8414 -43696 -64366 -60177 -30489 12147 49134 65445 56621 28494 -9600
921 -9600 -44175 -63761 -60708 -35391 3249 40693 62802 61937 38910 2232 -36205 -61606 -63915
934 -63915 -39633 297 38860 60069 58266 37177 3907 -31044 -57283 -64601 -47603 -10595
946 -10595 32138 62125 66612 45535 9066 -28111 -53813 -60605 -45694 -13871 23730 52332
958 52332 60884 47101 16244 -21753 -52734 -64961 -51846 -18451 21900 53124 63476 49811
970 49811 19802 -15199 -44099 -58376 -52549 -26560 10885 44566 60468 52734 24910 -11572
982a1572l2193j5985O280K6129L5741L2381J6975l673k2491l2525l2612k1852
994e5397k178K0200L6196L6970K1367k363k2696l2341l0844k0207k941J6066L0700
1007g468L5366K5928N859j7155l2781l5459k5735p117J4539L1561L5835K6453
1019D9826O098j4698k8373l2434k5783j0604R142K7468L6987L1329J2582j2108
1031D9432l1356l6069k7520j0349Q845K4296L3245K9544J5278n644k4522l4107
1043h927l1549j6347M975K5763L5843L1927J5333o405k4472l2603k8884j6755
1055e2101N88J8396L1991L3941K1460j50k1525l3438l1966j9432P21J9967L0872
1068f76L1154J9544J687j7098k9219l1250k2166n883J3681K9907L4831K5243M594
$$ plain form
982 -11572 -43765 -59750 -53470 -27341 8400 40781 57756 54083 31592 -933 -33545 -55397
994 -55397 -57575 -37375 -1179 35791 57158 54795 32099 -242 -31086 -51293 -54234 -38168 -7468
1007 -7468 27898 53826 59685 42530 9749 -25710 -51445 -58562 -44023 -12462 23373 49826
1019 49826 55924 41226 12853 -19581 -45364 -55968 -46826 -19358 17629 48958 61540 49432
1031 49432 18076 -17993 -45513 -55862 -47017 -22721 10524 40068 55346 49702 25180 -8927
1043 -8927 -40476 -56823 -51848 -26085 9758 41685 57018 50613 26141 -6462 -35346 -52101
1055 -52101 -51513 -33117 -1126 32815 54275 54125 32600 -838 -32804 -52236 -51515 -31548 -676
1068 -676 30478 50022 51709 34611 5392 -25858 -48024 -53907 -40226 -10319 24512 49755 54349
1081E4349j6941l0041l0338k0342n341J1291K3980L0350K5632J0745j0249k7486
1093A5609l3537k6165q993J0438K5210L1224K5850J1036p598k2984k9739k5690
1105c5339j3560M277K0942L0750K8978J5555m248k3199l2241k8146j3588M009
1117d5810J9489K8588K8093J7709N19j7695k9317l0124j9836j142J8064L0454
1129a008L0525J8538Kj8023k8118k7973j9087l389J3319K6498L1288K4076O159
1142E2807j4930k9543l1552k1149m291J3312K5661K8796K1897P030j0672k4835
1154A2531l0104k3727q519R500K4667L0939K5926J0347j0090k5755k9989k3331
1166c7605q790P498K0377K7113K4498J3285l687k1200l0072k7402j2899O346K1959
$$ plain form
1081 54349 37408 7367 -22971 -43313 -48654 -37363 -13383 16967 42599 53344 43095 15609
1093 15609 -17928 -44093 -53086 -42648 -17438 13786 39636 50672 43074 20090 -9649 -35339
1105 -35339 -48899 -44622 -23680 7070 36048 51603 47355 24156 -8085 -36231 -49819 -45810
1117 -45810 -26321 2267 30360 48069 48588 30893 1576 -28548 -48384 -49526 -31462 -1008
1129 -1008 29517 48055 48057 30034 1916 -26057 -45144 -48533 -35214 -8716 22572 46648 52807
1142 52807 37877 8334 -23218 -44367 -48658 -35346 -9685 19111 41008 48038 37366 12531
1154 12531 -17573 -41300 -49819 -40319 -15652 15287 41213 51560 41470 15715 -14274 -37605
1166 -37605 -46395 -38897 -18520 8593 33091 46376 42689 21489 -8583 -35985 -48884 -42538 -20579
1179b0579K8360K5282J2921l483j8230k7001k5255j5603l10J6001K7006K8036
1191B7145J7218K87j7497k7458k6826j5566J59J4973K4362K5899J8522L930j2597
1204C2551k4906k7944k0639n313J1939K5103K8472K0282M847j1882k3454k6080
1216a7024j9412o517Q699K0827K6361K3920J0337p591k4088k9471k3282q271Q036
1229c7476K1418K6081K1964J0539m334j8463k6637k4599j2955M122J9832K7649
1241G141K5184J3291m329k0069k7273k4145j2549K240J6311K4925K4623J6127
1253D1477M51j5390k5655k6761j6900N61J6981K5897K5063J4983J57j4381k3472
1266C011k4453j7058m050J1343K3151K7052K0303M458j2428k4589k5824j7563
$$ plain form
1179 -20579 7781 33063 45984 42501 24271 -2730 -27985 -43588 -43898 -27897 -891 27145
1191 27145 44363 44650 27153 -305 -27131 -42697 -42538 -27565 -3203 22696 41218 45148 32551
1204 32551 7645 -20299 -40938 -46251 -34312 -9209 19263 39545 44392 32510 9056 -17024
1216 -17024 -36436 -42953 -34254 -13427 12934 36854 47191 39600 15512 -13959 -37241 -45512 -37476
1229 -37476 -16058 10023 31987 42526 38192 19729 -6908 -31507 -44462 -40340 -20508 7141
1241 7141 32325 45616 41287 21218 -6055 -30200 -42749 -40509 -24198 727 25350 41477
1253 41477 41928 26538 883 -25878 -42778 -42217 -25236 661 25724 40707 40864 26483 3011
1266 3011 -21442 -38500 -42550 -31207 -8056 18996 39299 43757 31329 6740 -19084 -36647
1278c6647l355J1005K0745K3584J8781P012p785k0931k6374k1194q051Q228K0888
1291a4094K5981K1144Q400o991j9702k3747k0377r324M787J6979K3136K1822J2170
1304D0184k270j7787k6129k3997j1930M340J7838K3826K1543J2305j190j3389
1316B3344k1754k3144j5649k061J3725K3975K4733J6041J91j4739k3905k3331
1328b2574j4611j069J1823K0607K3225J8090N192j0055k1821k5832j8795m575
1340d0395J1339K2153K3753J6732M232q879j9409k3345j8464p219O749J9191K5153
1353A1591K1733Q852p875k1063k5103j9197o892O950J7220K1517J8293J0521k587
1366C3960j5904k4115k2606j1364M421J7886K4107K0859J0685l075j5504k1821
$$ plain form
1278 -36647 -40002 -28997 -8252 15332 34113 41125 33340 12409 -13965 -35159 -43210 -34982 -14094
1291 -14094 11887 33031 41431 34440 14738 -9009 -29386 -38710 -33923 -16944 6192 28014 40184
1304 40184 37914 20127 -6002 -29999 -41929 -37589 -19751 4075 25618 37923 36733 23344
1316 23344 1590 -21554 -37203 -39264 -25539 -1564 23169 39210 39401 24662 757 -22574
1328 -22574 -37185 -38254 -26431 -5824 17401 35491 40683 30628 8807 -17025 -35820 -40395
1340 -40395 -29056 -6903 16850 33582 37814 28935 9526 -13819 -32283 -39502 -32753 -13562 11591
1353 11591 33324 42176 34301 13238 -11865 -31062 -37954 -31004 -13784 7733 26026 36547 33960
1366 33960 18056 -6059 -28665 -40029 -35608 -17722 6385 27244 37929 34854 19350 -2471
1378b471k0936j2351N01J3772K1856K1412J3514L08j3137k2160k2372j3589pJ3181
1392b2479K0745K1089J4388K507j0648j9877k1869j6418m436R412K0126K3221
1404A5761J6571M082r751k0149k1792j5853l812Q297J7429K0712J7438P984n613
1417C1304j7760k3562j9442q382O552J8154K2233J8495P459n117j5915k1041j8689
1430b5711r209L538J5141K1241K0405J1561k705j6007k2777k0703j0323K644J4844
1443a8061K0049J8595J1456M06j1015j9833k2078j4253m46J3751K1936K1414J2497
1456C4418o56j2516j9449j9558j3170k552Q873J8075K1178J5870M450r000j9131
1469F832k2348j5708k882R810J8458K0041J4702M812p262j6646k0509j7311o942
$$ plain form
1378 -2471 -23407 -35758 -35257 -21485 371 21783 35297 35605 22468 308 -22064 -35653 -35660 -22479
1392 -22479 -1734 19355 33743 36250 25602 5725 -16144 -32562 -36998 -27586 -7460 15761
1404 15761 32332 36414 26663 6514 -15278 -31131 -34943 -26646 -9217 11495 28933 36917 31304
1417 31304 13544 -10018 -29460 -37842 -31290 -13136 9097 27592 35051 29934 14019 -7022 -25711
1430 -25711 -34920 -31382 -16241 5000 25405 36966 34261 18254 -4523 -25226 -35549 -32905 -18061
1443 -18061 1988 20583 32039 32445 21430 1597 -20481 -34734 -35180 -21429 507 21921 34418
1456 34418 33762 21246 1797 -17761 -30931 -33483 -24610 -6535 14643 30513 34963 25963 6832
1469 6832 -15516 -31224 -34106 -24296 -5838 14203 28905 33717 26455 9809 -10700 -28011 -34953
1482c4953O102J6895K1567J7644O720n876j6357k0170j6448o963M612J4295J8646
1495E714J7130R805j764j4117k1582j9891j0008L616J5028K0161J7826Q829j547
1508B9200j1547j7816j8294j1825m40J1604J8610J9343J2400P23j1580j9185j9660
1521a8467j2870j081J1059J8295J8976J2558K937q594j6594j9338j5249m095Q761
1534b3702J8025J9917J4395L058q554j6648j8777j4241m859N963J5333J9187J6477
1547B5574P402n363j5977k0560j6954o355O669J5719J8411J4485O290l824j2665
1560A2852j8207j7019q819K401J3702J9553J7648R042k418j3164j8422j7310r416
1573b9577J834J1654J7401J6696J0074J10j0279j7339j8472j1847n21J1403J8441
$$ plain form
1482 -34953 -28851 -11956 9611 27255 33975 28099 11742 -8428 -24876 -31839 -27227 -12932 5714
1495 5714 22844 32649 30885 16768 -4814 -24705 -34713 -31097 -16069 4092 21918 30747 29200
1508 29200 17653 -163 -18457 -30282 -30722 -19118 -508 18835 31235 31958 20378 1193 -18467
1521 -18467 -31337 -32418 -21359 -3064 15912 28470 31407 22813 6219 -13119 -28368 -32463 -23702
1534 -23702 -5677 14240 28635 31693 23139 6491 -12286 -26527 -31386 -25423 -10090 9097 25574
1547 25574 32976 27613 11636 -8924 -25878 -32233 -25564 -9845 8566 23051 29341 25517 12852
1560 12852 -5355 -22374 -31193 -28792 -15090 4463 22111 31153 28735 15571 -2851 -20161 -29577
1573 -29577 -27743 -16089 1312 18008 28082 28192 17913 574 -17898 -29745 -30266 -18863 -422
1586d22J7981J0773L0r066j5615j6901j2569l623P636J6249J8493J3985L019q423
1600B1547j6568j8564j3185k652P988J5590J6970J3041M667n543j3600j7546j5312
1613b3167o946M761J5216J8986J4902N363n595j3902j6839j4235o746L603J2312
1626a2287J6955J6110Q561k122j2869j8083j6895q611K644J2986J7294J4573P896
1639B6152j350r441j5404j6030j1384r07J0697J7688J7985J0544r19j0913j6226
1652D92j5794r974j225P990J5148J6244J1696K691p876j4839j6919j2708k992
1665b8066P784J5687J7189J1739K746p011j3894j5517j2653m961M172J3243J7710
1678H168J4211N623n310j4335j6668j3421m710M687J2313J5849J3234O649k662
$$ plain form
1586 -422 17559 28332 28362 19296 3681 -13220 -25789 -29412 -21776 -5527 12966 26951 29970 21547
1600 21547 4979 -13585 -26770 -29422 -21434 -5844 11126 24167 28834 23291 9691 -7855 -23167
1613 -23167 -30113 -25352 -10136 8850 23752 29115 23520 9618 -7221 -21456 -28202 -24599 -12287
1626 -12287 4668 20778 29339 27217 14348 -3735 -20630 -29241 -26597 -13611 3683 18256 26152
1639 26152 24802 15361 -43 -16073 -27457 -28364 -17667 21 18006 28550 27631 16718 492
1652 492 -15302 -25276 -26501 -18511 -3363 12881 24577 27268 19392 4553 -12366 -25074 -28066
1665 -28066 -20282 -4595 12594 24333 27079 20068 6174 -9343 -21996 -26957 -22785 -9542 8168
1678 8168 22379 28002 22692 8357 -8311 -21732 -26442 -21755 -9442 6407 19641 26290 23628
1691B3628j1606j6056j5058q542K265J2147J7298J5333P082k866j1155j5088j4145
1704a6763q208P68R619J5020J5523R688K29j0009j5827j5634j0081l20R501J5515
1718i79J5697R438N11q248j3349j4769j1121l094O762J4934J6754J1737K034q074
1732A8233j4773j4972j0607k623N592J2491J5030J2796M715m957j3200j5625j3409
1745b1309m755N117J3171J5549J2668M385m306j1818j4550j2441o299K621J0304
1758a1663J5290J4480P588k362j1644j5794j3560o621K397J0250J4183J2784P538
1771B2866m72q716j3679j4631r256m57R272J5085J4922Q931n38r018j3535j3293
1785a2519q613j693O356J2905J4628J0878K365o658j4181j4934j0611j779O528
$$ plain form
1691 23628 12022 -4034 -19092 -27634 -25369 -13222 4076 19409 26491 23625 12470 -2618 -16763
1704 -16763 -24971 -24203 -14584 436 15959 25647 25876 15867 40 -15594 -25675 -25995 -16494 -979
1718 -979 14718 24156 24667 16419 3070 -11699 -22820 -25914 -19152 -4218 12536 24273 26307 18233
1732 18233 3460 -11512 -22119 -24742 -19150 -6659 8371 21167 25882 20925 7725 -7900 -21309
1745 -21309 -26064 -20947 -7776 7773 20441 24826 20520 8702 -5848 -18289 -24588 -21967 -11663
1758 -11663 3627 18107 25695 23333 11689 -4105 -17665 -24286 -21889 -11639 2544 15328 22866
1771 22866 22394 13678 -1 -14632 -23888 -24345 -15073 12 14934 23865 23327 14309 774 -12519
1785 -12519 -21132 -22825 -16469 -3564 11064 21942 24307 17649 3468 -11466 -22077 -23856 -17328
1798a7328J2819J4532J0652K868n326j2075j3878j1491m768M295J1772J5220J2753
1811B0045M580m899j2529j4988j1061m161L862J0509J3403J2103O887k311j0829
1824A0611j4486j3569o731K715J0934J4389J2477O174k057r173j3185j2523p429
1837b1853L7Q722J3453J3690Q790q3q983j4016j3504q104K36P763J2655J2774
1851A1577Q690J152o265j2169j3694r729k209O252J2811J4161J0313J886o788
1864A5988j2411j2992r137k646M240J0689J3176J0967M916m040j1577j4820j0856
1877a8503l727M897J0804J2727J0628M550l170r639j2830j1677o070K350R352
1890a0308J3635J2445O399k280r638j3357j1805n869J805Q525J1895J1666P151
$$ plain form
1798 -17328 -4509 10023 20675 23543 18217 6142 -7736 -19227 -23995 -19700 -7928 7292 20045
1811 20045 24625 19726 7197 -7791 -18852 -23013 -19151 -8642 4761 16864 23751 21440 10611
1824 10611 -3875 -17444 -24175 -21460 -10526 3863 16340 22514 20457 11284 -1901 -14424 -21853
1837 -21853 -21816 -13094 359 14049 22839 22756 13773 -243 -13747 -21851 -21615 -13852 -1197 11577
1851 11577 20267 21419 15154 2985 -10709 -20438 -22647 -16395 -3584 10577 20890 22776 15988
1864 15988 3577 -9415 -18552 -21198 -16958 -6269 6907 17874 22790 18750 7173 -7647 -18503
1877 -18503 -22230 -17333 -6529 6198 16826 21376 18206 8567 -4263 -15940 -22010 -19660 -10308
1890 -10308 3327 15772 22171 19891 10253 -3104 -14909 -20778 -18973 -10448 1447 13113 20264
1903B0264J59p653j2849j2924q430J07Q416J3238J2503P337p7p103j1334j2042
1917a0388q294j761N674J1501J3217R843K182o586j2553j3330q627j384N696J0770
1931d040J1888R390L234m045j0554j2391j0634m109M388J0416J3132J0720L666
1944B1061m112j0565j2363r794m169K980Q828J1468J0917N934j242r312j2858
1957c227j1713n628K520R294J1717J0387N570j258p217j1481j1033p348K7P408
1971a1982J2139J1998P540m00p552j1611j1271p007l36O506J0198J1240P842K169
1985A9473n488j0976j2297q761j867N659J1300J1838Q550J959n490r868j1043
1998g011q705l285L758R219J2120R870M118l930j0081j2610r603l243M002R054
$$ plain form
1903 20264 20423 12770 -79 -13003 -21433 -21326 -12910 328 12831 20168 20091 12988 1654 -10388
1917 -10388 -18682 -20443 -14769 -3268 9949 19792 21974 15388 2835 -10495 -19122 -20506 -14810 -4040
1931 -4040 7848 17238 20472 16427 5873 -6518 -17152 -21261 -16873 -6457 6675 17395 21061
1944 21061 16949 6384 -5979 -15773 -19942 -16962 -8134 3334 14251 20185 18943 9631 -3227
1957 -3227 -14940 -20568 -18048 -8754 2963 13350 18920 17662 10445 -1036 -12069 -19417 -19390 -11982
1971 -11982 157 12155 19695 19295 11743 132 -11139 -18146 -18482 -11976 -1778 9462 17304 19473
1985 19473 13985 3009 -9288 -18049 -19916 -14257 -2957 8881 17431 19390 13900 4032 -7011
1998 -7011 -15716 -19001 -15243 -6024 6096 15966 20084 16154 6073 -6537 -16140 -19383 -15381 -6327
2012f327J1100R395M346j939p976j1781j0603n894K080Q766J2259J0582M785j678
2026A7115q305j1200j0286n204J072O632J0790J0711O747K74o762j1447j1707
2039a1570o875K14P279J1175J0374O244L71n733r336j0527p798k071M999J0074
2053c180J2034Q369J556n968j0180j0784p555j827M346Q656J0560Q641L344l341
2067A4671r026j1482r294l470M075R221J0976Q687L288l141q186j0447q834m635
2081a7597K147P434J0861R865N388j893p892j1232r942m917K125P411J0225R142
2095A1125N462n76o197r937j0478o652M3O489J0944J0358O477n38o139r966r764
2110i349o045j251N520R050J0255P654J680n099r837j0844p564j705N042R492
$$ plain form
2012 -6327 4773 14168 18514 16575 8599 -3182 -13785 -19679 -17599 -8833 3426 14008 18793 17115
2026 17115 8810 -2390 -12676 -17880 -16808 -10176 614 11325 18072 18346 11584 137 -11570
2039 -11570 -18445 -18231 -10952 223 10597 16841 17212 11479 2143 -8384 -16182 -18253 -13254 -3180
2053 -3180 8854 17223 18779 12811 2631 -8153 -15708 -17535 -13189 -4533 6027 14668 18012 14671
2067 14671 5645 -5837 -15131 -18601 -14526 -5305 5671 14358 17646 14505 6319 -4128 -12962 -17597
2081 -17597 -15450 -8016 2845 12710 18098 16205 8313 -2919 -12861 -17778 -15653 -8242 1983 11125
2095 11125 16587 16011 9814 -123 -10601 -17253 -17210 -10721 223 10581 17058 16520 10381 415 -9349
2110 -9349 -15394 -16645 -11125 -2075 8180 15834 17514 12415 2578 -8266 -15830 -17535 -12493 -3001
2124c001J0576P154K017m097q577r856p975l284L143Q448J0844Q841L588l584
2138A4237r184j0405q115l091K953P480R590Q520M408j384p112j0623r677n118
2152a7521K265P736J0394Q736M685j645o662r238q777n394Q6N841R750R626N970
2167A5852k0o112r696r648o070M87N477R222R002N951Q57m413q813r502o991k202
2183a6619M633R281J0247P252J387m718q840r137o741j997L291P456R559Q018
2197A3072L450l226q054j0617q071k796L259P984R403P558L196k064o840q971
2211b717q627m120J207O903R854Q933M532j469p415r551q547m345J434O355Q493
2226I20Q726N093k93n228r010r421o126O9O067R494Q962N216l43m986q295q557
$$ plain form
2124 -3001 7575 14729 16746 12649 4072 -5784 -13759 -17043 -13900 -5452 5392 14233 17821 14237
2138 14237 5053 -5352 -13467 -16558 -13605 -6125 3465 11985 16393 15009 7897 -2726 -12403 -17521
2152 -17521 -15256 -7520 2874 11610 16295 14650 7988 -1250 -10027 -15421 -15335 -9494 256 9882 15852
2167 15852 15832 9720 24 -9624 -15694 -15207 -9730 -508 8494 14445 15302 10889 2076 -7426 -14417 -16619
2183 -16619 -11986 -2705 7542 14794 16181 11463 2623 -6514 -13255 -15252 -11961 -4505 5054 13072
2197 13072 16522 13296 5242 -5375 -13446 -16242 -12983 -4999 4404 11962 15158 13094 6254 -2717
2211 -2717 -11344 -15464 -14257 -7354 2500 11433 15965 14496 7081 -2470 -11017 -15362 -13928 -7573 920
2226 920 9646 14739 14446 9218 208 -9213 -15339 -15270 -9203 291 9253 14469 14126 9140 845 -7712
2242g712n802j380M107Q571R236P102J472m613q902r128o471j375M351P955Q406
2257E817O508K138l084p322q920p459k991K966P653R544P510L032l240p680q548
2272d076p190k975K237O035Q802P555M144j217o164r605q499m010J822O754Q847
2287B460P492L817q20n366p954q012n535j4N251Q905Q804N102j55n676q364q301
2303h366n039l22M873P789Q218N714J265l833p896q878o412j792M153Q196Q979
2318F649O026J258l800p322q097o178k335K752O774Q684P681K574k745p651q979
2333d709p067k337K670O941Q152O689L200j690n840q425p865l900J413O483Q774
2348B489P942L726j818o239p911p240m213R33N086P863P505M930K07n105q122
$$ plain form
2242 -7712 -13514 -14894 -10787 -2216 7020 14122 15594 10981 2079 -7049 -13520 -14895 -10544 -2589 5817
2257 5817 12325 14463 11379 4057 -4863 -12322 -15313 -12347 -4694 4850 12360 15392 12152 4472 -4076
2272 -4076 -11266 -14241 -12004 -5969 2833 10388 14532 13315 7151 -2454 -10953 -14963 -13141 -6387 2460
2287 2460 9952 13769 12949 7583 -371 -8383 -13918 -13932 -8681 224 9028 14130 13975 8299 -65 -8366
2303 -8366 -13405 -13727 -8854 -1065 7153 12867 14132 10299 2403 -6475 -12887 -14679 -10526 -2330 6649
2318 6649 12675 13933 10133 2811 -5286 -11464 -13799 -11047 -4273 4411 12092 14666 11921 4270 -4709
2333 -4709 -11776 -14113 -11443 -4502 3650 10339 13539 11849 6009 -2416 -10281 -14181 -12768 -6285 2489
2348 2489 10431 14157 12339 6100 -1811 -9051 -13264 -12331 -7245 618 8123 13053 13260 8155 33
2363C3q443m939j39N657P962P927M297J84m164p077p566n868j265L486P721Q711
2379F517O160R54m116p651p799n599j386L465O406P704O265K506k834o676q435
2394d519o701k608K736O919Q639O408K323k349o474p453o492k843J237N470P884
2409B177P382M040j611n739q456p333l702J337N830P785O566M048m31m730p168
2424ep696m935k08N080Q093P978M500m95m830p545o931m731m78L777O992P655
2440F221N602J226m019p140q222n337j092L663P357P547N231J344l325o347p553
2455d844n600k150K454O258Q264O549K266k958o625p725o141j982K503N607O885
2470B761O176L221j286n255p834p172l573J474O044P960O788K820j045n283o935
$$ plain form
2363 33 -8410 -13349 -13488 -7831 131 8058 12355 12539 8375 1298 -6268 -12136 -13401 -9915 -2194 6517
2379 6517 12677 13631 9515 1864 -5935 -11534 -12920 -9455 -3049 4655 10920 13426 10592 3916 -4519
2394 -4519 -11220 -13828 -11092 -4173 4466 10874 13197 10848 4374 -3079 -9571 -12414 -11177 -5707 2177
2409 2177 9559 13599 11988 6249 -2207 -9540 -13242 -11905 -6075 1710 8276 12324 11893 7163 -5
2424 -5 -7701 -12636 -12844 -7764 329 8307 12807 12312 7482 -63 -6994 -11725 -12203 -8426 -1434 6221
2440 6221 11823 13049 9030 1890 -6332 -11669 -12761 -9098 -1741 5806 11037 12381 9056 2709 -4844
2455 -4844 -10444 -12594 -10140 -3882 4382 10931 13197 10239 3614 -4111 -10252 -12234 -9731 -4124 2761
2470 2761 8937 12158 10872 5617 -2217 -9389 -12962 -11488 -5444 2516 9304 12124 11079 5796 -1139
2485a139o697l914M26M518O904P556M465j26m977p505p310m398N67M337P077P194
2501F978M276M71l842o400p365n094j534L585P232P794N414N81l754o774p025
2516e457m969j045K606N790P288N992K342k468o640p630o026k086K562O380P164
2531C803N655K063k024n144p016o009l245J510N133P507O652L540j270n962p388
2546b195o476k865J011N072O543O365L575j39m421o704p296m254L61M658P367
2561F02O815L904k64m426o617o328m227o79L292O425O847N321J162l630o919o891
2577e613n125k23L216O217O524M967J389k845n682p086n492k100K311O085P455
2592C998N726K010k636n938o771n303k074K069M877O478O052K794r90n152p452
$$ plain form
2485 -1139 -7836 -11750 -11324 -6806 98 7654 12119 11993 7016 -489 -7799 -12197 -11630 -7293 -216 6978
2501 6978 11254 11725 7883 1483 -5882 -10976 -12510 -8925 -1693 6101 11515 12096 8342 1568 -5457
2516 -5457 -10426 -11471 -8865 -3075 4213 10205 12547 10079 3439 -4191 -10217 -12303 -9741 -3361 3803
2531 3803 9458 11521 9497 4353 -2663 -8672 -11917 -10407 -5274 2233 8885 12425 11155 5193 -2195
2546 -2195 -8671 -11536 -10525 -5453 1090 7455 11030 10891 6470 -234 -7530 -11784 -11423 -6765 602
2561 602 7417 11321 11057 6631 14 -6314 -10541 -11220 -7928 -1503 5344 10665 11827 8197 1278 -5613
2577 -5613 -10738 -10961 -7745 -1528 4996 9963 11352 8507 2825 -4261 -9753 -11853 -9542 -3457 3998
2592 3998 9724 11734 9098 3160 -3611 -8914 -10988 -8919 -4042 2436 8488 11282 10292 5140 -2312
2607b312o517l028J735N515O682N851K844p08m524o369o406l772L80M314O899
2622E84O687M065m53m544o836o613l399O7M012N915O216M386P90l356o175o660
2638e314m863j076L540O547O802M474P32l353n915o049m616j559K183N518O712
2653C763N503K161k585n678p006n556j675K642N177O437M992K229j481m859o532
2668b468n652l114J317N415O497O076L105j556m751o526n899k695Q39M155N778
2683E21N987L830o8m085o396o668l867K57M506O279O128L427pl293n558o161m374
2700i542p55K688O139O802M570P74l360n941o757m123o44K702N495O110M708J828
2716A0694k450n169o675n228j935K333N560O268N355J663k333m902o062m821k234
$$ plain form
2607 -2312 -8829 -11857 -10122 -4607 2075 7926 10770 10062 5538 -831 -7237 -11009 -10629 -6315 584
2622 584 7271 11336 10883 6339 -497 -7110 -10509 -10442 -6430 -515 5701 10087 10877 7521 1346 -5314
2638 -5314 -10177 -11253 -7713 -1166 5636 10110 10842 7489 1574 -4475 -9091 -10650 -8467 -2949 3763
2653 3763 9266 11427 8842 3164 -3842 -9398 -11073 -8431 -3254 3183 8175 10404 8923 4064 -2468
2668 -2468 -8120 -11234 -9917 -4502 1995 8071 11176 9620 4869 -1657 -7556 -10251 -9412 -5257 521
2683 521 6508 10338 10270 6185 -211 -6879 -10746 -10489 -5983 296 6424 9851 9844 6551 993 -5168 -9542
2700 -9542 -10297 -7609 -1470 5332 9902 10676 7316 1375 -5382 -9505 -10149 -7447 -1952 4158 8866 10694
2716 10694 8244 3075 -3600 -8828 -10763 -8430 -2870 3398 8753 10416 8083 3181 -2881 -7702 -9936
2731i936J189M477O213N763K834r64m996o623n613k878J498M631O038M866L005
2746I504n52l780n660n823l641J09M029O510N996L344j17m216n655n700l729N5
2762i326K968N405N830M240P01k763n590o284m551p50L255N744N869M259P09k565
2778G151n272n600m705j476K018M923O339N148J885k107n596o178m572j671K029
2793g684M358N768M909K504j378m174o267n449k953J465M394O363N358K385j102
2808H497m052n547n227k708J60L781N559N804L204L3l991n564n991l559M35L509
2824e657N504N585L135N41k908n109n512m230q86K479N907N858M309N64k942n294
2840A344n623l698j182K125M779N453M570J950j751n019o080m860j846K343M589
$$ plain form
2731 -9936 -8747 -4270 1943 7706 10540 9576 4580 -2043 -7656 -10534 -9036 -4405 1633 6499 9504
2746 9504 8952 5172 -488 -6311 -9952 -9843 -5814 696 6692 10036 9919 5703 48 -5652 -9381 -9326
2762 -9326 -6358 -953 4877 9117 9818 7055 1465 -4819 -9370 -10120 -6865 -1121 4748 9007 9716 7151
2778 7151 1879 -3721 -8426 -9902 -7884 -2961 3378 8526 10411 8304 2708 -3470 -8042 -9713 -7684
2793 -7684 -3326 2442 7351 9855 8477 4303 -1964 -7413 -10366 -8901 -4507 1856 7214 9599 8497
2808 8497 4445 -1102 -6329 -9037 -8877 -5096 463 6267 9471 9504 5513 -51 -6042 -9601 -9166 -5657
2824 -5657 -153 5432 8567 9108 6200 1091 -4421 -8651 -9537 -7058 -1151 4707 9016 9580 6638 1344
2840 1344 -4279 -7977 -9159 -7034 -2255 3198 7768 9718 7967 2948 -3132 -7992 -9838 -7495 -2906
2855b906N998M483J812j829m281n434m819k495J059M140N842N233K889j089m258
2870D345n787n168k587J063L858N341M714K977k76l134n631n529l588K13L748
2885e441N840N320L250l60l212m996m851l537p53K721M707N660L981J074k934
2900F469n327n860l877m81K682N138N154L745J278k076m352n537m197k091J749
2915g583M701N774M806J585j844m944n471m210j637J443M100N257M560K528p72
2930H293l913n740n310k531J095M022N686M544K387n73l628n058m598l040j51
2945h515L523N092N442L353j5l592n266n381l144O3L058N068M688L376P17k401
2961F066m702n404l969j157K775N148N504L826M79k423m574m931l855j422J717
$$ plain form
2855 -2906 3092 7575 9387 7558 3277 -2157 -6976 -9471 -8412 -4272 1570 6803 9692 8603 4345
2870 4345 -1442 -6610 -9197 -8134 -4276 1065 5779 8756 8480 5346 -285 -5814 -9402 -9189 -5441
2885 -5441 399 5719 8969 8609 5397 401 -4450 -7987 -8740 -6019 -1312 4348 8329 9403 6469
2900 6469 1142 -4718 -8595 -9076 -6394 -1256 3898 7643 8921 6845 2493 -3044 -7241 -9332 -7583
2915 -7583 -2882 2892 7698 9283 7439 2495 -2976 -7186 -8823 -7380 -3280 1977 6537 9065 8293
2930 8293 4380 -1360 -6670 -9201 -8106 -4084 1602 6146 8533 7960 4332 -726 -5324 -8364 -8515
2945 -8515 -4992 100 5542 8895 8880 5288 22 -5359 -8503 -8440 -5382 -314 4374 7750 8467 6066
2961 6066 1364 -4040 -8009 -9166 -6391 -1243 4261 8087 8566 6143 1569 -3362 -7217 -8639 -6922
2976f922M141N460M555J795j638m604n739m388j298J587M332N058M164J905j245
2991G163l471n407m548k387P48L764N554M862K436r78l697n216m561k397N22L369
3007d244M704M664L067N1l067m897n479l344J5L366N103N044K884P7k797m306
3023H41m857l482j061K379M789N168L913J021k737m756n027l640p09K165M135
3038a858M958L585J544j451m213n075m104j902J757M089N338L882J641j375m035
3053B781m893m107j720P12L432N040M296K848q50l363n216m913k146R43L376M760
3069I80M375K296k83k978m505m819k976M0K814M999M885L134k5l026m559m739
3085d387k913l70K271M342M750L418Q69k314m175n137l705q96K254M478M837L492
$$ plain form
2976 -6922 -2781 2679 7234 9029 7391 2787 -2952 -7340 -8638 -7051 -2719 2339 6503 8408 7163
2991 7163 3692 -1715 -6263 -8650 -7902 -4138 1416 6278 8714 7736 4039 -1177 -5738 -8135 -7613 -4244
3007 -4244 460 5124 8191 8242 5175 278 -5201 -8545 -8530 -5164 -61 4983 7867 7944 5147 841
3023 841 -4016 -7498 -8559 -6180 -1391 3777 7690 8711 5974 1218 -3809 -7449 -8158 -5993 -1858
3038 -1858 3100 6685 8229 6778 2565 -2510 -6614 -8516 -6759 -2670 2668 6550 8191 6816 2781
3053 2781 -2112 -6219 -7939 -7227 -3795 1245 5541 8389 7539 4176 -1040 -5953 -8099 -7156 -3780 980
3069 980 5355 7651 7368 4390 -115 -4934 -7910 -7870 -5056 -57 4828 7962 7937 4911 352 -4387
3085 -4387 -7300 -7670 -5399 -1057 3693 7111 7980 5666 1491 -3646 -7351 -8247 -5993 -1515 3322 6814
3101F814J038k046l951m575l260j823J413L766N113L997J772j727m071m921l946
3116f407j416J607L283M558M074J927o64l272m669m497k325O48L541M962M239
3131E589J936m54l306m512m038k543L51K716M379M487K754J52k816m369m654l044
3147g372l9K807M171M584K670L09k097l826m247l709q24J800M203N165L392P43
3163G730k399l840m612l217q84J665L412M298L706J769j225l949m742l683j520
3178g491J280M034M326L671J581j237l364m220l718k143N96L058M829L969K500
3193G671o36l276m635m346j877O68K774M223L898K412m7k209m545m494k713l47
3209g479K873M592M393K561j49k292l813m282k776k58J515M108M173L218Q22j989
$$ plain form
3101 6814 7852 5806 1855 -2720 -5980 -7803 -6390 -2624 2489 6486 8258 6531 2460 -2461 -6407
3116 -6407 -7823 -6216 -2933 1625 5699 7626 6962 3690 -979 -5476 -7801 -7153 -3612 1350 5589
3131 5589 7525 7071 3765 -747 -4785 -7328 -6977 -4261 118 4605 7359 7511 4695 326 -4328 -7372
3147 -7372 -7411 -4604 -433 4151 6821 7130 5033 1207 -3040 -6749 -7573 -5773 -1570 3595 6987 7730
3163 7730 5331 1491 -3121 -6338 -7222 -5557 -2145 2153 5859 7628 6403 2454 -2288 -5971 -7491
3178 -7491 -6211 -2177 2149 5820 7401 6164 2800 -1420 -5138 -7281 -6685 -3627 1202 5171 7671
3193 7671 7035 3759 -876 -5222 -7099 -6431 -3657 566 4464 6876 6829 4620 75 -4419 -7132 -7479
3209 -7479 -4606 -14 4379 6940 6791 4499 686 -3596 -6372 -6630 -5115 -1007 3166 6384 7206 5217
3225E217m154m064l526m47J851L594M321L187R36j610l279m106l380j838J440
3240e858L371M620L755J464j469l647m358l537j120J039K946M001L540K318n05
3255F560l049m549l975k101Q91L000M274L517J990m04k716l574m027k213k22K364
3271d234M093M190K468N83k730m044m160k370l13K155L844L821K702N36j815l581
3287A145m074l142q68J808L787M354L097M86j738l408l929k651j362R77L311L940
3303A733L519J548j189l583m331l237j112J186L099L806L353J886j180k469l988
3318i59l581j960M92K726M296L574K047n70k871l816l695j832L55K228L811L525
3334C770K342J05j869m024m142k426j96K433L902L643K480Nj979l274l862k366
$$ plain form
3225 5217 1063 -3001 -6527 -6974 -5123 -1529 2792 5979 6915 5305 2026 -2080 -5460 -7298 -5858
3240 -5858 -2487 2133 5888 7352 5883 2236 -2122 -5659 -6779 -5740 -2794 1207 4747 7065 6560
3255 6560 3511 -1038 -5013 -7114 -6223 -3223 1051 4568 6558 6154 3438 -136 -4163 -6376 -6598 -4234
3271 -4234 -141 4049 6517 7100 4370 326 -3834 -6204 -6517 -4362 -518 3303 6005 6541 4726 1145
3287 1145 -2929 -6071 -6939 -5131 -1344 3010 6107 6593 4855 1447 -2482 -5133 -6495 -5518 -2207 1733
3303 1733 5252 6800 5611 2028 -2303 -5540 -6652 -5466 -2367 1439 4792 6678 5498 3029 -959
3318 -959 -4540 -6500 -6008 -3282 1014 4588 6635 6065 3194 -622 -4317 -6149 -5794 -3566 245 3770
3334 3770 6112 6217 4348 324 -3818 -6244 -6440 -4007 -105 3538 6018 6023 4044 770 -3092 -5458
3350e458p04J493L430M096K983O53j668l757l793k594p64J313L064L673L066J135
3366F168r56l133l885l071j507J055L022M006L392J273j139l041l502l190j341
3381e849O06K317L669L271K069k01k636l740l786j857N27K545L573L456J564j42
3397E386j643l677l381k556l35K317L491L864K311R0k010l460l692k286j40J619
3413d102L153L649K594P17j422l361l823k710p35J568L299L634K606Q41j357k835
3429A716l445k799j248Q35K981L473L302J392r78l072l868k799j302R41K476L403
3445A008L043J652m45k342l470l313j933M46K539L506L233J677m33j978l434l070
3461c314k057j27K137L104L291K512L6j741l339l529k354l09K080L165L339K213
$$ plain form
3350 -5458 -6162 -4669 -1239 2857 5840 6493 4825 1068 -2725 -5319 -6083 -4770 -1706 1967 5033 6168
3366 6168 5212 2079 -1806 -4877 -6384 -5329 -2307 1699 5091 6364 5225 2184 -1318 -4508 -5849
3381 -5849 -5243 -2926 743 4014 6083 5882 3246 -494 -4280 -6137 -5610 -3065 508 3964 5528 5386
3397 5386 3743 66 -3315 -5871 -6206 -3889 -398 3466 5777 5867 3857 397 -3295 -5581 -5721 -4102
3413 -4102 -949 2700 5294 6011 4589 1228 -2595 -5305 -6040 -4472 -1173 2461 5067 5908 4551 1716
3429 1716 -1729 -4528 -5776 -4941 -1960 1513 4815 6207 5229 2157 -1711 -4510 -5812 -4871 -2395 1008
3445 1008 4051 5703 5258 2916 -554 -3867 -5800 -5354 -2815 691 3924 5601 5168 3190 -244 -3314
3461 -3314 -5371 -5498 -3361 -257 3034 5546 5582 3841 502 -3027 -5381 -5690 -3610 -445 2894 5107
3477E107K15j185l093l192k728q85J228L107L876K538P67j513k774l630k274r80
3493e416J039K511L496K694J196n79k903l630k867j253Q69K479L694K938J233
3508E501r22k218l076k816j629r0K315L280L105K193m22k416l297l206j639L15
3524e022K072L173K856J785N8j354k923l344k331l85J634L143L362K335k28j468
3540C363k880k977k177k34Q21L046L177K413P52j136k786l482k364q36J276K652
3556a372K901K635P42p50k415l045k575j336M15K797L229K760J438r46k558k866
3572i46k908r61O44J963K640K801J731k07j833l226l152j821M17K056L163K726
3588C087J677l38j380k888k885j855l37J587L032K811K180K92j622k891l150k112
$$ plain form
3477 5107 5322 4137 1044 -2148 -4876 -5761 -4533 -1426 2450 4988 5755 4242 1468 -2162 -4436 -5416
3493 -5416 -4377 -1866 1630 4324 5520 4941 2038 -1592 -4459 -5712 -4843 -2364 1330 4268 5501
3508 5501 4579 2361 -715 -3531 -5160 -5250 -2935 345 3450 5643 5221 2805 -492 -3698 -5337 -5022
3524 -5022 -2950 223 3079 4864 4922 3568 645 -2699 -5030 -5415 -3781 -638 2724 5059 4831 3363
3540 3363 483 -2494 -4671 -4905 -4084 -1038 2139 4552 5304 4168 1382 -2100 -4464 -5300 -4024 -1372
3556 -1372 1529 4164 4906 4156 1741 -1304 -3879 -5215 -4800 -2003 1226 3986 5424 4478 1920 -946
3572 -946 -3854 -4815 -4171 -2208 432 3233 4964 4757 2924 -302 -3454 -5275 -4858 -2802 361 3087
3588 3087 4764 4426 3046 158 -2727 -4582 -4919 -3332 -300 2511 4691 4983 3361 470 -2680 -4792
3604d792o8J385K709L005J990O19j061k438l046k323j084J433K453L069K503O59
3620E013j422k382k725k001r44N22K045L023K600J298o97k345l248k500j049O64
3636d148K088K737K486J348l11k035k491k624j543J32J616K890K953J656l46j648
3652B760l007k676j375K9J423K514K777J576M48j241k659k942j997m01J599K905
3668b67K519J807K99j067k366k734j959r16J004K249L042K516N46p38k754k704
3684a523k236o79R23K236K575K031J111n59k142k665k511j063L30K126K976K322
3700C252J298n44j942k971k075j310N35J454K597K503J626K4j725k753k829j390
3716d250j14J655K612K773J203K78j581j990k698k060j74J318K377K787J887M71
$$ plain form
3604 -4792 -4860 -3475 -766 2239 4229 4848 3787 1349 -1697 -4020 -5104 -3671 -1218 1851 4354 5013
3620 5013 3591 1209 -1516 -3517 -4461 -3939 -1894 1129 3729 5027 4330 1985 -1263 -3763 -4812 -4148
3636 -4148 -2060 677 3163 4511 4200 2165 -326 -2950 -4493 -4361 -2745 145 3098 4754 4408 2760
3652 2760 -247 -2923 -4298 -4269 -2846 -332 2445 4021 4469 3228 569 -2373 -4370 -4771 -3172 -267
3668 -267 2252 4059 4358 3291 925 -1809 -3768 -4684 -3680 -1431 1611 4127 4673 3935 1181 -1523
3684 -1523 -3759 -4438 -3515 -1279 1296 3327 4438 3879 1737 -928 -3439 -4502 -4172 -2046 930 3252
3700 3252 4550 4006 2064 -907 -2982 -4292 -3757 -2303 294 2797 4423 4447 2722 -31 -2860 -4250
3716 -4250 -4364 -2709 -97 2676 3879 4157 2576 586 -2112 -4172 -4346 -3028 -651 2136 4023 4494
3732D494j318k540k638k000j69J102K034K631K240N93r35k287k564k537n96P91
3748c699K292K639K216P98q16j934k318k366j123N81J820K368K541J637o04k149
3764A883k524k374j163K66J841K313K302J373J96j713k516k442j649l4J795K533
3780H7K499J424R6j678k260k325j764JJ017K185K591J957L54r79k466k636j976
3797c873j54J053K143K588J858L90p97j975k496j888j016P01J852K889K161N97
3813D033p59j912k722j853q16O21J834K126K412J153k78j992k498k129j426N35
3829c671J789K353K321J148j66j730k266k174j400L3J158K132K815J686m5j319
3845B664k522k443j333j62J207K473K035J548L01r20k003k619j642o68J146K186
$$ plain form
3732 4494 3176 636 -2002 -4002 -4171 -3069 -1035 1596 3836 4429 3494 1207 -1357 -3894 -4490 -3699
3748 -3699 -1407 1232 3448 4246 3430 1496 -822 -3188 -4311 -3730 -1910 458 2999 4636 4032 1883
3764 1883 -641 -3015 -4178 -3912 -2071 242 2544 3917 4113 2400 -116 -2558 -4207 -4241 -2446 87
3780 87 2586 4010 4106 2428 168 -2157 -3921 -3920 -2903 -718 1873 3830 4184 3205 739 -1897 -3873
3797 -3873 -4027 -2974 -831 1757 3615 4005 3208 1233 -1263 -3151 -4167 -3466 -1614 1275 3436 4033
3813 4033 3274 1362 -1360 -3213 -4029 -3408 -1574 552 2964 4117 3839 1847 -651 -2780 -4206 -3671
3829 -3671 -1882 471 2792 3940 3774 2044 -222 -2396 -3796 -3763 -2605 -473 2342 4028 3983 2664
3845 2664 142 -2301 -3634 -3796 -2589 -116 1919 3467 3768 2848 845 -1774 -3416 -4084 -2938 -752
3861g52K476J953J78q54k197k031j997o87N24K144K407K078Q81q25j914k510j910
3878c036r49O68J874K255K264Q57m72j576k430j905j506J94J640K458K304J573
3894D213n03j635k347k166j236K90J305J854K291J520J64j254k395k299j548r9
3910c845J275K294K279J483J78j097j909k158j903j29N63K182K080K027N79j133
3926B766j767k562j702m08O93K042K205J613Q29n85j691k152k254q70N14J854
3942a475K434J978O31m02j922j868j962o72r4J270K362K411Q07J86j467k426k265
3959b474j136K41J185K301J981J250J2j132k131j991j505l53J322K005K438J587
3975C600K26j398k113k079j347m28R15K072J609J929O34o49j663k678k002m07
$$ plain form
3861 -752 1724 3677 3855 3001 804 -1227 -3224 -3911 -3387 -1243 1164 3242 4123 3298 1384 -1126 -3036
3878 -3036 -3985 -3317 -1443 812 3076 3933 3461 1885 -545 -2450 -3956 -3762 -2122 336 2640 4213
3894 4213 3710 2075 -272 -2438 -3674 -3384 -2079 -225 2066 3586 3750 2496 101 -2198 -3746 -3845
3910 -3845 -2570 -276 2003 3486 3664 2567 658 -1500 -3403 -3532 -2969 -787 1293 3320 3899 2766
3926 2766 999 -1563 -3265 -3673 -2980 -938 1267 2880 3709 3124 1433 -719 -2973 -3843 -3329 -1475
3942 -1475 959 2937 3568 3166 1244 -624 -2586 -3258 -3352 -2082 280 2691 3498 3684 2217 -209 -2474
3959 -2474 -3610 -3369 -2184 117 2098 3348 3360 2228 97 -1894 -3399 -3752 -2430 -425 2013 3600
3975 3600 3826 2428 315 -1764 -3111 -3539 -2624 -552 1057 2986 3620 2971 1308 -1370 -3372 -3779
3991c779R28J958K247J694O75q98j510k082j853j230O99J678K294J630J150m16
$$ plain form
3991 -3779 -2851 -893 1354 3048 3723 2825 1315 -767 -2620 -3850 -3151 -1473 821 2451 3601 3185
$$ [...]
8191I09
##END NTUPLES=NMR FID
##END=
