##TITLE=1H_Pr 59-3
 CDCl3
 32 sc, 
 16.11.2022
##JCAMPDX= 6.0         $$ Bruker NMR JCAMP-DX V2.0
##DATA TYPE= NMR FID
##DATA CLASS= NTUPLES
##ORIGIN= UXNMR, Bruker Analytische Messtechnik GmbH
##OWNER= root
$$ XWIN-NMR		Version 3.5
$$ Wed Nov 16 14:20:59 2022 Russian Standard Time (UT+4h)  she@DPX200
##.OBSERVE FREQUENCY= 200.1313499994
##.OBSERVE NUCLEUS= ^1H
##.DELAY= (6, 6)
##.ACQUISITION MODE= SIMULTANEOUS
##.ACQUISITION SCHEME= undefined
##.AVERAGES= 8
##.DIGITISER RES= 18
##SPECTROMETER/DATA SYSTEM= spect
##.PULSE SEQUENCE= zg30
##.SOLVENT NAME= Acetone
##.SHIFT REFERENCE= (INTERNAL, Acetone, 0, 15.7039)
##AUDIT TRAIL= $$ (NUMBER, WHEN, WHO, WHERE, WHAT)
$$ ##TITLE= Audit trail, XWIN-NMR		Version 3.5
$$ ##JCAMPDX= 5.01
$$ ##ORIGIN= Bruker BioSpin GmbH
$$ ##OWNER= she
$$ F:/spectra/data/she/nmr/H-F/1/audita.txt
$$ ##AUDIT TRAIL=  $$ (NUMBER, WHEN, WHO, WHERE, WHAT)
(   1,<2022-11-16 14:19:54.37 +0400>,<she>,<DPX200>,
      <created by zg, POWCHK disabled, PULCHK disabled
       configuration hash MD5:
       00 E9 B6 7A A2 85 ED C7 34 08 36 98 17 FE 4E 26
       data hash MD5: 16K
       BC A0 B4 24 60 B9 F2 72 03 7D FB 5F B9 29 A4 27>)
$$ ##END=
$$ 
$$ hash MD5
$$ 75 CE BB EA 5E 8B 4F 5A EA 7A 7B 00 64 D5 9A 61
##$RELAX= 
##$RELAX= 
##$RELAX= 
##$RELAX= 
##$RELAX= 
##$RELAX= 
$$ Bruker specific parameters
$$ --------------------------
##$DU= <F:/spectra>
##$EXPNO= 1
##$NAME= <H-F>
##$PROCNO= 1
##$TYPE= <nmr>
##$USER= <she>
##$AMP= (0..31)
100 100 100 100 100 100 100 100 100 100 100 100 100 100 100 100 100 100 
100 100 100 100 100 100 100 100 100 100 100 100 100 100 
##$AQSEQ= 0
##$AQ_mod= 1
##$AUNM= <au_zg>
##$AUTOPOS= <>
##$BF1= 200.13
##$BF2= 200.13
##$BF3= 200.13
##$BF4= 200.13
##$BF5= 200.13
##$BF6= 200.13
##$BF7= 200.13
##$BF8= 200.13
##$BYTORDA= 1
##$CFDGTYP= 0
##$CFRGTYP= 5
##$CHEMSTR= <none>
##$CNST= (0..31)
1 1 145 1 1 1 1 1 1 1 1 1 1 1 1 1 1 1 1 1 1 1 1 1 1 1 1 1 1 1 1 1 
##$CPDPRG= <>
##$CPDPRG1= <>
##$CPDPRG2= <>
##$CPDPRG3= <>
##$CPDPRG4= <mlev>
##$CPDPRG5= <mlev>
##$CPDPRG6= <mlev>
##$CPDPRG7= <mlev>
##$CPDPRG8= <mlev>
##$CPDPRGB= <>
##$CPDPRGT= <>
##$D= (0..31)
0 1.2 0 0 0 0 0 0 0 0.06 0 0.03 0 0 0 0 0.0002 0 0 0 0 0 0 0 0 0 0 0 0 
0 0 0 
##$DATE= 1668593993
##$DBL= (0..7)
120 120 120 120 120 120 120 120 
##$DBP= (0..7)
150 150 150 150 150 150 150 150 
##$DBP07= 0
##$DBPNAM0= <>
##$DBPNAM1= <>
##$DBPNAM2= <>
##$DBPNAM3= <>
##$DBPNAM4= <>
##$DBPNAM5= <>
##$DBPNAM6= <>
##$DBPNAM7= <>
##$DBPOAL= (0..7)
0.5 0.5 0.5 0.5 0.5 0.5 0.5 0.5 
##$DBPOFFS= (0..7)
0 0 0 0 0 0 0 0 
##$DE= 6
##$DECBNUC= <off>
##$DECIM= 32
##$DECNUC= <off>
##$DECSTAT= 4
##$DIGMOD= 1
##$DIGTYP= 9
##$DL= (0..7)
0 120 120 120 120 120 120 120 
##$DP= (0..7)
150 150 150 150 150 150 150 150 
##$DP07= 0
##$DPNAME0= <>
##$DPNAME1= <>
##$DPNAME2= <>
##$DPNAME3= <>
##$DPNAME4= <>
##$DPNAME5= <>
##$DPNAME6= <>
##$DPNAME7= <>
##$DPOAL= (0..7)
0.5 0.5 0.5 0.5 0.5 0.5 0.5 0.5 
##$DPOFFS= (0..7)
0 0 0 0 0 0 0 0 
##$DQDMODE= 0
##$DR= 18
##$DS= 0
$$ [...]
##$SUBNAM2= <"">
##$SUBNAM3= <"">
##$SUBNAM4= <"">
##$SUBNAM5= <"">
##$SUBNAM6= <"">
##$SUBNAM7= <"">
##$SUBNAM8= <"">
##$SUBNAM9= <"">
##$SW= 18.0517283424941
##$SWIBOX= (0..15)
0 0 2 0 0 0 0 0 0 0 0 0 0 0 0 0 
##$SW_h= 3612.71676300578
##$TD= 16384
##$TD0= 1
##$TE= 0
##$TE2= 300
##$TE3= 300
##$TEG= 300
##$TL= (0..7)
0 120 120 120 120 120 120 120 
##$TP= (0..7)
150 150 150 150 150 150 150 150 
##$TP07= 0
##$TPNAME0= <>
##$TPNAME1= <>
##$TPNAME2= <>
##$TPNAME3= <>
##$TPNAME4= <>
##$TPNAME5= <>
##$TPNAME6= <>
##$TPNAME7= <>
##$TPOAL= (0..7)
0.5 0.5 0.5 0.5 0.5 0.5 0.5 0.5 
##$TPOFFS= (0..7)
0 0 0 0 0 0 0 0 
##$TUNHIN= 0
##$TUNHOUT= 0
##$TUNXOUT= 0
##$USERA1= <user>
##$USERA2= <user>
##$USERA3= <user>
##$USERA4= <user>
##$USERA5= <user>
##$V9= 5
##$VALIST= <valist>
##$VCLIST= <CCCCCCCCCCCCCCC>
##$VD= 0
##$VDLIST= <DDDDDDDDDDDDDDD>
##$VPLIST= <PPPPPPPPPPPPPPP>
##$VTLIST= <TTTTTTTTTTTTTTT>
##$WBST= 1024
##$WBSW= 4
##$XGAIN= (0..3)
0 0 0 0 
##$XL= 0
##$YL= 0
##$YMAX_a= 134094
##$YMIN_a= -126019
##$ZGOPTNS= <>
##$ZL1= 120
##$ZL2= 120
##$ZL3= 120
##$ZL4= 120
##$ABSF1= 10
##$ABSF2= 0
##$ABSG= 5
##$ABSL= 3
##$ALPHA= 0
##$AQORDER= 0
##$ASSFAC= 0
##$ASSFACI= 0
##$ASSFACX= 0
##$ASSWID= 0
##$AUNMP= <proc_1d>
##$AZFE= 0.1
##$AZFW= 0.1
##$BCFW= 1
##$BC_mod= 2
##$BYTORDP= 1
##$COROFFS= 0
##$CY= 11.3945322036743
##$DATMOD= 1
##$DC= 2
##$DFILT= <>
##$DTYPP= 0
##$F1P= 2.36226072786647
##$F2P= -0.459571619588291
##$FCOR= 0.5
##$FTSIZE= 0
##$FT_mod= 4
##$GAMMA= 1
##$GB= 0.15
##$INTBC= 1
##$INTSCL= 1
##$ISEN= 128
##$LB= 0.24
##$LEV0= 0
##$LPBIN= 0
##$MAXI= 10000
##$MC2= 0
##$MEAN= 0
##$ME_mod= 0
##$MI= 1.114404
##$NCOEF= 0
##$NC_proc= 0
##$NLEV= 6
##$NOISF1= 3.799351
##$NOISF2= 2.8
##$NSP= 1
##$NTH_PI= 0
##$NZP= 0
##$OFFSET= 15.70392
##$PC= 1
##$PHC0= -18031.43
##$PHC1= 12.4007
##$PH_mod= 1
##$PKNL= yes
##$PPARMOD= 0
##$PSCAL= 0
##$PSIGN= 0
##$REVERSE= no
##$SF= 200.130013532006
##$SI= 16384
##$SIGF1= 3
##$SIGF2= 2
##$SINO= 400
##$SIOLD= 16384
##$SREGLST= <1H.CDCl3>
##$SSB= 0
##$STSI= 0
##$STSR= 0
##$SW_p= 3612.71676300578
##$SYMM= 0
##$S_DEV= 0
##$TDeff= 0
##$TDoff= 0
##$TI= <>
##$TILT= no
##$TM1= 0
##$TM2= 0
##$TOPLEV= 0
##$USERP1= <user>
##$USERP2= <user>
##$USERP3= <user>
##$USERP4= <user>
##$USERP5= <user>
##$WDW= 1
##$XDIM= 8192
##$YMAX_p= 0
##$YMIN_p= 0
$$ End of Bruker specific parameters
$$ ---------------------------------
##NTUPLES= NMR FID
##VAR_NAME=  TIME,          FID/REAL,        FID/IMAG
##SYMBOL=    X,             R,               I
##VAR_TYPE=  INDEPENDENT,   DEPENDENT,       DEPENDENT
##VAR_FORM=  AFFN,          ASDF,            ASDF
##VAR_DIM=   8192,          8192,            8192
##UNITS=     SECONDS,       ARBITRARY UNITS, ARBITRARY UNITS
##FACTOR=    0.0002768,     1,               1
##FIRST=     0,             0,               0
##LAST=      2.2672688,     0,               0
##MIN=       0,             -126019,         0
##MAX=       2.2672688,     134094,          0
$$ Real data points
##PAGE= N=1
##DATA TABLE= (X++(R..R)), XYDATA
0@%%%%%%%%%%%%%Qj6J6j6K4l2L2m0M8n6P1q0R0j06J25j48J69j93K22k52K86l21
35a69L61m08M56n11N74o38P09p89Q72r63J065j175J296j431J578j739J916k111
53a107K328k570K842l151L503l911M390m958N647o504P607r079J1160j4351J9925
68A1771l2452J15695l1532j55884J44654Q0698r9131j17966M0749L7272p675o343
80b0144K433m2734J7111Q5506J4247j05421k8386J00718N0273q6391n4996N3770
92a4014N5990j6610k8944p753J0716L0006K2400l3397l9964K4427M1793k3418
104B1232m4743j451J0853p822N384N871k7411q346N7333L7510m4958l4638M9640
117A8454M3313l9422m7494J5326K0550j5859l153J3793j6931j1150M8412K9840
$$ plain form
0 0 0 0 0 0 0 0 0 0 0 0 0 0 0 8 -8 8 -8 16 -16 16 -24 24 -32 39 -41 49 -57 68 -80 89 -104 118 -134 152 -169
35 -169 192 -216 240 -271 303 -335 374 -415 457 -506 559 -616 680 -751 827 -912 1004 -1107
53 -1107 1221 -1349 1493 -1658 1845 -2066 2324 -2634 3013 -3491 4116 -4963 6197 -8154 11771
68 11771 -20681 95014 63482 -92402 52252 132950 33819 -84147 -43398 -6126 -13801 -20144
80 -20144 -17711 -60445 -43334 42172 56419 -49002 -77388 23330 73603 -12788 -67784 -14014
92 -14014 41976 25366 -3578 -11331 -615 29391 51791 18394 -21570 2857 44650 21232
104 21232 -23511 -24962 -14109 -21931 -16547 -10676 -38087 -46433 10900 48410 3452 -31186 18454
117 18454 61767 22345 -25149 -9823 10727 -5132 -8285 5508 -11423 -22573 25839 55679
129E5679n8537m3528N3973M1986n9557n6794L4587M4956j5971k2471J3097J6084
141C504J0641J9397j857l3244j852M1993L931n4477k2809M0242J8590l8082k4289
154c8312K0396J6950m774k068j923m431J5773K0963j8592k9263J8341L0185j9841
167C404k8978K0948K8486j1481j1332J9523R208j6695k932R781j5453k3173O060
180a2634Q172k2222j2303K5278J2795k0778R39L4350O898k5443K597K7699n010
193B0338k5357L583J5435q838j1535Q751M038r871L771J2572p533j3226R364J0757
207A2249j4756j4772Q928Q891j1470o921J2042O272n021L663J0600k218n223Q009
221A0273K915j2744l395R645l938j4121M082J2650o149j0823R811J2435p627r474
$$ plain form
129 55679 -2858 -46386 7587 49573 -9984 -66778 -32191 12765 -3206 -25677 -12580 3504
141 3504 14145 33542 31685 -1559 -3411 38582 42513 -11964 -34773 5469 24059 -14023 -38312
154 -38312 -17916 -966 -5740 -7808 -9731 -14162 1611 22574 3982 -25281 -6940 23245 3404
167 3404 -25574 -4626 23860 12379 1047 20570 29778 13083 10151 19932 4479 -18694 -12634
180 -12634 -4462 -26684 -38987 -13709 -914 -21692 -20753 13597 20495 -4948 -2351 25348 20338
193 20338 -5019 -1436 13999 5161 -6374 2377 6415 -3456 315 12887 5354 -7872 1492 12249
207 12249 -2507 -17279 -8351 540 -10930 -17851 -5809 463 -4558 -895 9705 7487 2264 10273
221 10273 13188 444 -2951 6694 2756 -11365 -7283 5367 -782 -11605 -1794 10641 3014 -6460
235f460P875O672p896n356M220L64m186M045M776o396k301J2512N287j3537o274
250f655J3170M015j4770q123Q793K430o130j073L245j13L995P685j897p324N937
265C185J1295n044j2950K294J0559l619j0555L67P224j475l663J999p8l183K425
280a219L960o611n918O615N854p563m788Q333N266n025j403O456J625l352J475
295C705K846l726k278L430K96n441r03M242o58n484J462M569k916m242L688L392
311A982m145l013N024K016m844n86L936m38k663J701K266k500N14M350j6l685
327a01O79M598r96n334q6L666k20l155J23K457n5j131O65j261k447R01J626k546
345b617l079L108L569k707k164K968K028k118j277J714P15m39K086J487J20N19
$$ plain form
235 -6460 1415 8087 191 -5165 -945 -581 -4767 -722 4054 -2342 -4643 7869 13156 -381 -6655
250 -6655 6515 10530 -4240 -12363 -3570 -1140 -7270 -8343 -5098 -5211 -1216 6469 4572 -2752 3185
265 3185 14480 9436 -3514 -1220 9339 5720 -4835 -4468 2756 1281 -2382 -383 -461 -3644 -1219
280 -1219 2741 -3870 -9788 -3173 2681 -4882 -9670 -1337 3929 -1096 -2499 3957 5582 2230 3705
295 3705 6551 2825 547 3977 4273 -1168 -2071 2171 1513 -3971 -2509 2060 -856 -5098 -1410 1982
311 1982 -2163 -5176 -152 1864 -2980 -3566 370 -68 -2731 -1030 1236 -1264 -750 3600 3584 -101
327 -101 578 5176 4180 -1154 -1240 2426 2206 -949 -826 1631 1576 445 1110 -151 -2598 -1697 -71 -2617
345 -2617 -5696 -2588 981 -1726 -3890 -922 1106 -1012 -2289 -575 140 -299 1787 3274 3394 3913
361C913J429J63k943j515n3j611l152j32K586m9j076J691K645m85k204l1j67j816
379b807l99P83J06P4K748K338o94q33J103N61j132j983l04Q19N39J63k52l79K76
398G27K35m55j756j417R31J572l08k30J195O29N04K60k157k918L74K021q20k769
416d382J577M652J880j295r76l22m5q67j874k417j503K795M863J159k978J155
432A422O856K574o318n659J837K789l085o037j995K739L099o89k869j181K448
447d069M554P07l366j969M445P997r39p358j478P146L053o968p286K610O115O96
463C890m171k180K663L120N17k590n062l140M480M334m869p538M011J1483J775
478F723r475k564P789N202n724n982Q72M082J901K01j773k518J821O843P79r073
$$ plain form
361 3913 5342 5505 2562 1047 994 -617 -3769 -3901 -1315 -1364 -2440 -749 1896 1411 -793 -824 -991 -2807
379 -2807 -3206 -2423 -2317 -2243 505 2843 2149 1316 2419 2980 1848 -135 -439 380 919 1082 830 451 727
398 727 962 507 -1249 -2666 -1735 -163 -471 -701 494 1123 1627 1887 -270 -3188 -2814 -793 -1613 -4382
416 -4382 -2805 1847 3727 2432 1456 1134 1089 222 -1652 -4069 -5572 -2777 2086 3245 267 1422
432 1422 8278 10852 4534 -1125 712 3501 416 -5621 -7616 -4877 -1778 -2467 -5336 -6517 -4069
447 -4069 485 1192 -2174 -4143 302 8299 7360 2 -1476 5670 8723 1755 -5531 -2921 3194 3890
463 3890 -281 -2461 202 3322 3839 1249 -3813 -6953 -2473 1861 -3008 -10546 -6535 4948 6723
478 6723 -2752 -5316 2473 7675 1951 -4031 -3159 923 2824 3025 1252 -1266 555 7398 8177 -896
494h96o217P257P507o901j0922K127R806K347o786m559M258O127Q49l434k854
509b291K59M879L838l328q647r77R138M438r668q581O839J2226j044j1664j448
524f031R866N164o457o671J198L927J450j85l346m114L345R361j71j1506l435
539g605J1396O284j1022j0305N380Q663k771p734N3N275K778J434J044j615j013
554B42N946N585n339r514J592Q443r09j0841m451P046O171l797n840J080M955
569C69J488j974j925j416J119L769K241m410n259M320Q606j638r843j676R718
584C489M533p453n720N181O217j688m222m68K95j67K223r8o275k467P298N073
600E751p244p258N050Q429k720q421M07O577K820l243j085J763J797J480R2l186
$$ plain form
494 -896 -7113 144 7651 750 -10172 -8045 1761 4108 -2678 -7237 -2979 3148 3997 563 -2291
509 -2291 -2032 2847 6685 3357 -5290 -6267 2871 7309 -2359 -10940 -4101 8125 7081 -4583 -6031
524 -6031 3835 8999 2542 -4129 -2931 996 2446 2261 -1085 -5199 -1854 7507 7336 -4170 -7605
539 -7605 3791 10075 -947 -11252 -5872 2791 20 -7714 -7661 -2386 392 1826 2870 1255 242
554 242 6188 11773 6434 -3080 -1488 6955 6046 -4795 -9246 -2200 3971 174 -5666 -4586 369
569 369 1857 -117 -2042 -3458 -2339 1430 3671 -739 -5998 -1678 6928 5290 -4553 -6229 3489
584 3489 8022 569 -5151 30 6247 4559 337 -131 164 -3 2220 2122 -4153 -6620 678 5751
600 5751 -1493 -8751 -3701 4728 2008 -6413 -6006 571 3391 148 -937 826 2623 4103 4195 1009
616A009l668J374L789j664n112j90N328L348k252l442J143L621L24l580k552J354
632a170J488J3j279q45k28R81J889l50l460j124L741L246k866l567K919N074k50
649D212m441q63K652J329j524j428o62O30K446J195l175k435K096L071k291m875
665d063l14L778J370k677j847K228K566K96j499j009Q84J945P0j761j238J756
681D85K459r00k311J24J025Q84j191j278k06J212J294j255j101O15J519q81j263
698g69m60J19j46l59j89L14j0O69R83Q6o63L98J257l55q83M17M95l98j10N27p6
719H47l87R17O08p12m28J96K25m54j592p06L89l69o76n69K54P43O16n3N2M91J422
740H14M42n66m82J138P39q23n13j32R02j7k76o38K60J94M39j337o24K17J06j109
$$ plain form
616 1009 -2659 -1285 2504 840 -4272 -4462 866 4214 1962 -1480 -337 3284 3608 28 -2524 -1170
632 -1170 318 331 -948 -1793 -2021 -1040 849 499 -2961 -4085 -344 2902 36 -3531 -612 4462 4212
649 4212 -229 -1092 1560 2889 1365 -63 -725 -95 2351 3546 371 -2064 32 3103 812 -4063
665 -4063 -4377 -599 771 -1906 -3753 -1525 1041 1337 -162 -1171 -287 1658 1728 -33 -1271 485
681 485 2944 2044 -267 -143 882 1766 575 -703 -909 303 1597 342 -759 -144 1375 494 -769
698 -769 -1229 -1110 -1256 -1615 -1804 -1490 -1500 -831 152 238 -425 -27 1230 875 -8 409 904 506 396 923 847
719 847 460 1377 1985 1273 845 1041 1266 812 -780 -1486 -1097 -1466 -2142 -2711 -2457 -1714 -1098 -1151 -1099 -608 814
740 814 1256 690 208 1346 2085 1262 749 617 1519 1502 1226 588 848 1042 1481 144 -480 -263 -157 -1266
760a266j019l01N62L60n85K66J426J158O97l16OP26l00l12j040n76L33J11o7j74
780c11M51J099J24k85l20o2k94m53j085n3J62J15k4K3O76O27M14l01j04M50j39
801G10n48p28J71q74j70Q5J32j73O66M53O77M96M70R25N8l21l08n52m00l54n08
822i3l35m36J54O97L9j55N6k00j38o95n95l88j21J71R9J25Q07Q94J275J91L02
843A654R27P84n23n00q10j32q88n75m59r00MM72J84k06j96P22M55o46p52J46K15
864a024n61n5K81M0J106J158M39o4L48Q67k40n24q68L38j210m39J61l0o03k66
884a146R30l83l05j31J296J47j005J51M44n6l95l35K12o84M04J020J02r79R55
903B42J247M69j351q01P47j27r50p96J98N06Q18M73j1K42L37R46j8j559j103k12
$$ plain form
760 -1266 -2285 -2586 -2024 -1664 -2249 -1983 -557 601 1298 982 988 1714 1414 1102 62 -514 -181 -70 -137 -311
780 -311 140 1239 1363 1078 758 696 402 -51 -1136 -1189 -1027 -912 -936 -913 -237 390 804 503 399 849 710
801 710 162 -566 -395 -1269 -1439 -1354 -1222 -1395 -729 -276 401 897 1367 2292 2350 2029 1721 1169 769 415 -93
822 -93 -428 -864 -710 -13 26 -129 -73 -273 -411 -1106 -1701 -2089 -2210 -2039 -1940 -1815 -1008 -114 1161 1352 1654
843 1654 2581 3365 2842 2342 1532 1400 512 -63 -522 -1422 -1418 -946 -762 -968 -1164 -442 13 -633 -1385 -1239 -1024
864 -1024 -1585 -1640 -1359 -1319 -213 945 1384 1320 1668 2535 2295 1771 903 1241 31 -408 -247 -277 -880 -1146
884 -1146 -216 -599 -904 -1035 261 408 -597 -446 -2 -58 -453 -788 -576 -1260 -856 164 266 -713 242
903 242 1489 1958 607 -194 553 426 -524 -1320 -1122 -616 202 675 664 906 1243 2189 2171 612 -491 -703
923g03L54n09r77l40N55J240o8j274J61K016k70j234N57J475O50l11Q09k13j390
942E28j68J330m22k674o65K830P40k493o36K596J084j946j300J111j09j552J004
959g42N30j370m70J891J929k123j697J775J817j342k132J066K224M96p96m43Q65
976A478J83k88n73j109p31O45M77M4o61k06Q95J619r77k910l1K085J63k636m39
995b972K695J667j863p0J466k5j466R80M19j633j340L061K006k488j941L409K668
1012D573k811l104J658J762k086j784N98p3j390P08J295j315j548J941K417o28
1028B13k102J608K684L26j760l39J008Q30j319j070o33R10M84r1o58L21K96k45
1046D63K67q85k136n73J227P79k010j294L737K855j392j227K496J993j879j720
$$ plain form
923 -703 -349 -858 -1835 -2175 -1620 -380 -448 -1722 -1561 455 185 -1049 -492 983 1633 1322 2131 1918 528
942 528 360 1690 1268 -1406 -2071 759 1499 -994 -1630 966 2050 104 -1196 -85 -194 -1746 -742
959 -742 -212 -1582 -2052 -161 1768 -355 -2052 -277 1540 198 -1934 -868 1356 1852 1056 613 1478
976 1478 1661 1373 800 -309 -1040 -395 82 126 -535 -741 154 1773 796 -2114 -2145 -60 103 -2533 -2972
995 -2972 -277 1390 -473 -543 923 898 -568 412 831 -802 -2142 919 2925 437 -1504 1905 4573
1012 4573 1762 -1342 316 2078 -8 -1792 -1194 -1267 -2657 -1949 -654 -1969 -3517 -1576 841 213
1028 213 -1889 -281 2403 2729 969 630 1638 2468 1149 79 -554 356 840 749 91 412 708 463
1046 463 730 -155 -2291 -2864 -1637 -858 -2868 -4162 -425 2430 1038 -189 2307 4300 2421 701
1062G01R49m97k565m3J103r90k158J745K928j191k073K165L143j333k441J208
1078F51J463j697j054O95j66r36M06J905n68j143J056J396r67j686l28L27q49
1095a495j317j33j51O09J411J014k79J167K480M16j058K1Lp05j495J82o91j415
1113a436K21J557m10j631J080J847j391j934O07O38j394j327Q93J041q16N89L123
1130A257Q93m64J718J894q28j701N26m5j991k409m7k71j643k68J259J55j65J043
1148a087J629o17p44J202J25j212l94Q37l3l46Q69J546L05k21J302M13j408j059
1166A107J55j191k129j118O20r50n27J281J603J74O02J826J075l99k81R55o81
1183B122j787m04J16j014p79O10J250o47K35J134o8j050j14M63j066j618N98P76
$$ plain form
1062 701 1650 1153 -1412 -1455 -352 -1342 -3500 -1755 1173 -18 -2091 74 3217 1884 -557 651
1078 651 2114 417 -637 58 -108 -1044 -638 1267 699 -444 612 2008 1041 -645 -973 -646 -1495
1095 -1495 -2812 -2945 -3096 -2487 -1076 -62 -341 826 3306 3722 2664 2685 2688 1983 488 670 -21 -1436
1113 -1436 -1215 342 -68 -1699 -619 1228 -163 -2097 -1490 -852 -2246 -3573 -2680 -1639 -2455 -1866 1257
1130 1257 2150 1686 3404 5298 4470 2769 3295 3250 1259 -1150 -1197 -1468 -3111 -3379 -2120 -1965 -2130 -1087
1148 -1087 542 -75 -819 383 508 -704 -1098 -261 -294 -640 229 1775 2080 1859 3161 3574 2166 1107
1166 1107 1262 71 -2058 -3176 -2556 -3506 -4033 -2752 -1149 -975 -373 1453 2528 2129 1848 2803 2122
1183 2122 335 -69 47 -967 -1746 -1136 114 -533 -298 836 768 -282 -396 67 -999 -2617 -2019 -1243
1201a243q97j40K139J662j11J186J597J22j179n1k45j729k131m02p51j431n69
1218d173J315P47k42P74J751M36m46O90L97r53n47Q77Oo17L96J683P2n18Q66R76
1238C490r09j195k59n32k173r84r1j046p56P44J187K74N97J814J578J37KQ81j03
1257B656j253l41K00q82j157O28R75l22k30R94N47j134n77j5j161j030o96K81
1275b517j79j12J395J194L25O92J372Q06m88l00P1p70j677l39o2r13p78N63M98
1294a219J9L35R52P54n17M55L65m23q60J17J88r26P0Q13J57M04O78P92m11l73
1314A370n02m77j227q85m94k67q04N28N42R75N03J212J189P1M8M75K63j102o79
1333G39L44m44j058NP14j85l25M59j50k63o37J95k61q43j85J13j61j84P28O67
$$ plain form
1201 -1243 -2140 -2280 -141 1521 1410 2596 4193 4315 3136 3085 2840 1111 -1020 -1422 -2173 -3604 -4173
1218 -4173 -2858 -2111 -2353 -1579 172 608 162 852 1249 296 -251 626 632 15 411 2094 2166 1648 2514 3490
1238 3490 2581 1386 1127 595 -1578 -2562 -2653 -3699 -4455 -3711 -2524 -2250 -1653 161 1739 1876 1878 2759 2656
1257 2656 1403 1062 1262 380 -777 -149 826 504 274 1268 1815 681 104 89 -1072 -2102 -2798 -2517
1275 -2517 -2696 -2808 -1413 -219 106 798 2170 2976 2488 2188 2259 1489 -188 -527 -589 -1502 -2280 -1717 -1219
1294 -1219 -1200 -865 87 841 324 779 1144 721 -139 -22 166 -760 -690 123 280 684 1362 2154 1743 1370
1314 1370 868 391 -836 -1721 -2215 -2482 -3286 -2758 -2216 -1241 -738 474 1663 1734 1782 2257 2520 1418 739
1333 739 1083 639 -419 -414 300 115 -210 249 99 -164 -801 -606 -867 -1710 -1895 -1782 -1943 -2127 -1399 -732
1353g32N52N72R57O49J39L01p6l22n31p88n39r36k32k04J37k58M02Q83o3q0j02
1374b71K58n42k2l01j42J57k19K60J123L08M64L22ko5k66p4o66l52n04j12lN6
1396e93k46N19q6M16J75K53L2L64j86k28k98j62k95m0j93L5k83N21L81j10j39
1417a63J56L31l3k98j29k5K02m19K17M05q3J82M29pK14k09j58L92m88r77Q3p5
1439d53k18k32L38P9j42L3M1N62j67k40n3Q02k40l05K24N68k17m64O81O16n75
1460F38m80L80M50o23m49K17J93l68p47K98K27m84J53J25N58n49l43P18K52n14
1480c48k04N14L56l47j08M25J11j40k23L42L15o82M5L94N41p80l09P40J12p36
1500A8k53O89k12q37o40P25K6o12j35O45M36l29Q2M83J66m96N04L52k02n38L35
$$ plain form
1353 -732 -180 392 1349 1998 2137 2438 2362 2040 1509 721 182 -754 -986 -1190 -1053 -1311 -909 -26 -89 -169 -271
1374 -271 -13 -555 -577 -878 -1020 -863 -1082 -822 301 609 1073 1395 1393 1328 1062 988 322 -30 -534 -646 -649 -593
1396 -593 -839 -320 -406 10 185 438 470 834 648 420 122 -40 -335 -375 -568 -533 -816 -295 86 -24 -163
1417 -163 -7 324 291 -7 -136 -161 41 -378 -161 244 161 343 772 765 979 770 612 1004 516 -461 -378 -453
1439 -453 -671 -903 -565 -486 -628 -595 -554 8 -159 -399 -452 350 110 -195 29 597 380 -84 597 1213 638
1460 638 158 538 988 365 -84 133 326 -42 -789 -491 -264 -748 -595 -470 88 -461 -804 -86 166 -348
1480 -348 -552 -38 318 -29 -137 288 399 259 36 378 693 11 56 450 991 211 -98 642 754 18
1500 18 -235 454 242 -595 -1235 -510 -484 -1096 -1231 -586 -150 -479 -397 86 252 -244 260 612 410 -128 207
1521B07O58m87l79L95L32N9m80L3L94o96m64Jr4m00k98J93K87j29L2O02O92J11
1543E69n16M18L47l25p2k96k5J11n83J20N41k09j66K31M08p3m30K01K20l27q56
1564g12M07K86o53k86Q32N48m56PO09L2r9l91J05j08o64k74K44ko11N99P04O4
1586A81j55L21N47ol67j63L30o67O1J51m03J68n5L28q5J11R4m64p1K7n47q2k22
1609i68j15n0Q0L25O11J69K11O09N91k07j6J62k36n87k89J34l73l56j38L56k81
1630c68k46M13L3k54k34K17j64j50k54M72n8p7L00P63K84j90K99N46r2l39k18
1651F83l1m67n84O3l6k33J34j28O4L9M05L71m07J5L08k72m69K15o2j28L07j13
1673c26M67k26L27L12rk32k91M27m67k80J14K02l93N9K04R2J64L35K46R7n26Q4
$$ plain form
1521 207 865 378 -1 394 726 785 305 338 732 36 -428 -427 -521 -921 -1219 -1026 -739 -868 -836 -234 458 569
1543 569 53 471 818 493 421 125 100 211 -372 -252 289 80 -86 145 553 480 50 251 471 144 -712
1564 -712 -305 -19 -672 -958 -126 422 -34 -27 582 614 515 124 229 121 -543 -817 -573 -575 -1186 -587 117 181
1586 181 26 347 894 888 521 358 688 21 82 233 -170 -2 -57 271 186 297 391 -73 -144 -117 -664 -746 -968
1609 -968 -1083 -1133 -1053 -728 -117 52 263 872 1463 1256 1240 1402 1166 579 290 424 51 -305 -443 -87 -368
1630 -368 -614 -201 -168 -422 -656 -439 -603 -753 -1007 -535 -593 -670 -370 393 677 487 786 1332 1240 901 683
1651 683 652 185 -399 -336 -372 -605 -471 -599 -535 -496 -91 280 -127 -112 196 -76 -545 -330 -392 -520 -213 -326
1673 -326 141 -85 242 554 545 313 22 449 -18 -298 -184 18 -375 -316 -112 -20 144 479 725 822 296 380
1695C80K18m60p55L95J01m64j80M61K75m52J80L94O1k49l1M06j64j53R3m3R6K11
1717C20J8J54PK72K9N0l76M2J5n33l03R2k70l15J08Q3q0K51L6M10j32j32L67Q6
1741A99N9O2j74J71k25M6J95K18k51Q3m0l9k68Rr0l00J90j89J34m48P7K23j65
1764e23J88J26K60j27m2L22k67J17K03j01k07J38rpj33J52J41o8jj37J19k5qj0
1788A01j32L7l83K51J95j05j23n3j37O4k65L35k21l3K91j79N01l17J46r4J57K83
1810C19o6l2P7NJ71m3R6k77R6J1k97J53m55p8K37j91Q3l60L22j99j84L80J96p9
1834a15l5n4P30p92J64L06Ml00L18j36L29n81J54L59O5k98J25J9j88J07l99P8
1856a40lk35J68p2J48JJ3p4j4J57k25J37j55K76q1k08P0O43l64K34K25l8k93K62
$$ plain form
1695 380 598 138 -617 -222 -121 -585 -765 -304 -29 -481 -301 93 154 -95 -126 280 116 -37 56 13 109 320
1717 320 338 492 499 771 800 850 474 516 531 -2 -305 -213 -483 -798 -690 -607 -687 -436 -400 10 -122 -254 113 199
1741 199 258 320 146 317 92 138 333 551 300 383 343 304 36 45 -45 -345 -155 -344 -210 -658 -581 -358 -523
1764 -523 -335 -209 51 -76 -118 204 -63 54 257 156 -51 87 78 71 -62 90 231 163 162 25 144 119 111 101
1788 101 -31 6 -377 -126 69 -36 -159 -212 -349 -285 -550 -215 -436 -469 -178 -357 144 -173 -27 -121 36 319
1810 319 253 221 298 303 474 431 527 250 346 357 60 213 -242 -320 -83 -274 -191 -551 -229 -428 -612 -232 -36 -115
1834 -115 -150 -204 526 -266 -102 204 208 -92 226 90 419 -162 -8 351 416 118 243 262 74 181 -218 -140
1856 -140 -143 -378 -210 -282 -134 -133 -120 -194 -208 -51 -276 -139 -294 -18 -99 -307 -237 406 42 276 501 463 170 432
1880D32k08K00l48Q3j51P9l40p7N70m85K14k6q4n6k67K58J2k54r9k4K86J0J87
1903h8L38j09M03Qj40Q4N1j54J51m97J60J1l77J00R8j66k15K18J81k24m84L22
1925c29K30n30K25l1L10r6K05J52k30K30O4M47M4j74k58L69n46j91k9J18N0l75
1947c45N5J3M24l82J24K44J19m54Q9J56j28o4r7N6k0j23Q3J71J70j35K6K18M9
1970B49j86o0J41j04j63J41J67J06j94M5L11j21Q1j55J68k1o31Oq1K91l45j19
1992d74J70l9P8j07K88r6Q1Q2Jkl01l8K88K91j4P5K52P9k59j89N76k23o91J37
2016c5J33m55j33j03K30o5q5K80J52k07Q8L06O8j72Q8R7M6J43m29O1L83o6l36
2039a1K31j46J01J48k94j20J80m9p9k29l99J94L5N49j31k37K72J06j50j89P9L19
$$ plain form
1880 432 224 424 76 159 8 87 -253 -330 240 -245 -31 -57 -141 -197 -464 -206 -194 -448 -547 -571 -285 -275 -88
1903 -88 250 141 544 552 412 496 547 393 544 47 207 218 -159 -59 39 -127 -342 -124 57 -167 -651 -329
1925 -329 -99 -629 -404 -435 -125 -221 -16 136 -94 136 200 647 691 517 259 628 82 -109 -138 -20 30 -345
1947 -345 -290 -277 147 -235 -111 133 252 -202 -113 43 -85 -149 -246 -190 -210 -333 -250 -79 91 -44 -18 200 249
1970 249 63 3 144 40 -123 18 185 291 97 142 453 332 413 258 426 405 -226 -220 -301 -10 -355 -474
1992 -474 -304 -343 -265 -372 -84 -180 -99 -17 -16 -18 -319 -357 -69 222 208 283 535 614 355 166 742 519 -172 -35
2016 -35 98 -357 -490 -593 -363 -428 -513 -233 -81 -288 -200 106 174 2 90 187 233 376 -53 8 391 325 -11
2039 -11 220 74 175 323 29 -91 89 40 -39 -268 -667 -473 -438 111 -20 -257 15 121 -29 -218 -139 180
2061A80k11k66L41p5k08J35K98j6k64J22K44k3Q4q9k9Q3m89J27K78k22l31M59
2083A28K30m16M4l9Q9j27j93R1O8l30M48k31Q9N3M6K48O8j33J11M5k58M38j20
2106C49J63m97o0j7J7q0L79m95O4J22l8k50j6L21k58P8P5J86J90m35J82K97m09
2129a32j29K03K97k15K13k13K02q2N7J27J09l49j23L33l66j97K0Q2j9j32p5R4
2151b95J11J94J77k69j19K8J72k58J0R5K21m57K65L61j6k25M42j22r6J40j36o8
2173A55k91L01MK00l78k74K85k73J62J80m52j7J5K85m33k84N10L41l42K48L66
2194C08j85k7J57k2L51l58j37K53m7k86J20k29m6k55K90l13n1L66O8R2m71M73
2216E1l96J75k18M21q0k05J30J71J14LJ40J07k2j47J53k71m87j56K05K4k08O6
$$ plain form
2061 180 -31 -297 44 -31 -239 -104 194 178 -86 36 280 257 341 252 223 306 -183 -56 222 0 -331 128
2083 128 358 -58 -14 -53 36 -91 -284 -193 -125 -455 -7 -238 -149 -96 -50 198 266 133 244 289 31 469 349
2106 349 512 15 -45 -62 -45 -125 254 -241 -177 -55 -93 -343 -359 -38 -296 -218 -143 43 233 -202 -20 277 -132
2129 -132 -261 -58 239 24 237 24 226 144 201 328 437 88 -35 298 -68 -265 -245 -163 -182 -314 -389 -295
2151 -295 -184 10 187 -82 -201 -173 -1 -259 -249 -154 67 -390 -125 236 220 -5 437 315 219 359 223 155
2173 155 -136 165 169 369 -9 -283 2 -271 -109 71 -381 -398 -383 -98 -531 -815 -305 36 -306 -58 308
2194 308 123 96 253 231 582 224 87 340 293 7 127 -102 -148 -403 -113 -426 -477 -111 -43 49 -422 51
2216 51 -345 -170 -388 33 -47 -252 -122 49 163 166 306 413 391 244 397 126 -361 -517 -312 -288 -496 -430
2238d30J62L80J36L00J74m61J78q9K38l11m10j44J54m39L71OP8k31K38L09k54
2259d5K01m5J3L8l77J35l26J89M47qJ94j07J13M20j71k53j4k17m35j66N4k77l09
2282i46L41k83M68j66N32Q2l66O34J8Q6l73J3O0O8j4L62j90L83n1L7j29n5m94
2305A7K2m08m00NO9m01J21L19K19OM92L43K54k52L08p8j71m31M9l27L4L46k14
2328g8O3l5J05J94j66L2Q3j44m93J2r6k60J98O5O82n0R1J87J64Q4j55o6j45l07
2352c5p6k98J67j36k12K35J61L0M7J22qJ72nJ51j28n19O50l25j75K98J98k44M05
2375D75J19k3km54P9l45m62q5J20j26l85M63J00P22LL02m3L64K6k56j00J2j12
2398C92k17j41p1q3K2o7K66pl94J03J14o6l35l1k0k7j06k25O04P9K56P14n6P3
$$ plain form
2238 -430 -268 112 248 548 722 261 439 350 588 277 -133 -277 -123 -562 -191 -185 -107 -338 -100 209 -45
2259 -45 156 111 124 162 -215 -80 -406 -217 230 222 416 309 422 842 671 418 404 187 -248 -414 -360 -637 -946
2282 -946 -605 -888 -420 -586 -54 28 -338 296 314 400 27 40 100 168 154 516 326 709 658 695 566 511 17
2305 17 39 -369 -769 -764 -695 -1096 -975 -656 -437 -431 61 404 658 406 714 636 465 34 83 -244 -210 136 -78
2328 -78 -15 -50 55 249 83 115 198 54 -439 -427 -523 -783 -585 -520 162 112 203 390 554 638 483 417 272 -35
2352 -35 -111 -409 -242 -378 -590 -355 -194 -164 -117 5 -3 169 164 315 187 -332 318 -7 -182 116 314 70 475
2375 475 594 571 569 115 194 -151 -613 -698 -578 -704 -1089 -626 -526 196 199 501 458 822 848 592 492 504 392
2398 392 175 34 -37 -120 -98 -165 101 94 -300 -197 -83 -149 -484 -515 -535 -562 -668 -893 -289 -210 46 760 704 777
2422G77M5N0k90p1m81J21k37n35J05J05r5J68J84l18O47j76M0r6J64l97O8J97
2444b5l8Nj57N92l09r8M49o8l71L71j53k57k9k40O2o0j43L14j2R8O7L94k03J75
2468C64K06k63k73J1q4k01k2R2k09K45J11l9j06o7J75m9K84k21k13K55j13mn9
2491a80L14n2K61J23l6J70j80q5k94J14l15K4j96m5p6J01j13J27q8L58K00k09
2513g7KJ62k9p6Q8j74J09J57O5J96j07p8J93O3k5n90O7N2j53l3j59N1m0K63KR0
2539A9l5Kp3J19O6J1m7p7p0j80P4O3K28o4jK51q4L7k58K83K56n72R7k14R2j81
2565b58K26M7j39l3M1J54j39R9p3M6O3l16M65m00J10j9J35j3j56M34l11R1K9K3
2589A06m9L17Q8k75j0q6O6j69r2j92K74Pk53J76j10J66K66j21K05m56K72K1q2
$$ plain form
2422 777 822 872 582 511 30 151 -86 -621 -516 -411 -506 -338 -154 -472 175 -1 39 -57 107 -290 -222 -25
2444 -25 -63 -58 -215 377 68 -30 419 351 -20 351 198 -59 -88 -328 -266 -326 -469 -155 -167 -69 -2 392 189 364
2468 364 570 307 34 45 -39 -240 -262 -170 -379 -134 -23 -62 -168 -235 -60 -109 175 -46 -259 -4 -117 -121 -180
2491 -180 134 82 343 466 430 600 420 335 41 155 -160 -136 -332 -377 -453 -352 -465 -338 -426 -68 132 -77
2513 -77 -75 87 58 -18 70 -104 5 162 227 423 316 238 431 494 469 -121 -54 -2 -155 -188 -347 -296 -336 -73 -71 19
2539 19 -16 -14 -87 32 98 109 62 -15 -85 -265 -191 -128 100 36 35 286 202 239 -19 264 520 -52 45 -169 -77 -258
2565 -258 -32 15 -124 -157 -116 38 -101 -2 -75 -29 34 -282 183 -217 -107 -126 9 -4 -160 274 -37 54 83 106
2589 106 57 374 462 187 177 91 157 -12 -104 -296 -22 -15 -268 -92 -202 -36 230 109 314 -142 130 151 69
2612F9Q3k06k17J00J29j35J46L4R7LK79o4j33j49q4K44j51o6j12l8J0m5J86K3
2636Cj33L1k21J96J9M71l17p6j42K66l52K57J49l2j04Q3N8p8K22r8J01j45l5K03
2660C26m0j44K20j34j85k30M68l04k46K66l02j4j26P4M31k39j24N46j64j6J49
2681B12L5q1J33o7q6K98m76J65j11J07k83K48k9j21J36j15M4k16l6L22j33j16
2703a70J25l5l5k35L93J73l27K01J32k9J02K9j83j62P3m2q6j99K43J41j52J75
2725A32l0k08N38l72K62j05k22K88k3m65j23L85k38K10o7R7J93j77K23l18K44
2746B24m65k2K72M8k31K66pj82K10Q4k02J87k0R8l11J47n6k4K3m03J77m9n5P6
2770b15K96j35J36rl1J55l41J98Nj61K84k87K14O7J19K27j74K4K4j05j85k92L9
$$ plain form
2612 69 152 -54 -271 -171 -42 -177 -31 3 100 103 382 318 185 36 -48 196 45 -21 -133 -171 -161 -206 -20 3
2636 3 -130 -99 -320 -124 -105 366 49 -27 -169 97 -255 2 151 119 15 98 156 78 300 202 303 158 123 326
2660 326 286 142 362 228 43 -187 281 -23 -269 -3 -305 -319 -445 -371 60 -179 -303 243 79 63 212
2681 212 247 166 299 232 146 444 -32 133 22 129 -154 94 65 -56 80 -35 9 -207 -243 79 -54 -170
2703 -170 -45 -80 -115 -350 43 216 -111 90 222 193 295 324 141 -21 52 10 -76 -275 -32 109 -43 132
2725 132 102 -106 432 60 322 217 -5 283 260 -205 -328 57 -181 29 -38 59 252 75 298 -20 224
2746 224 -241 -263 9 57 -174 92 85 -97 113 197 -5 182 162 260 -51 96 40 16 39 -364 -187 -236 -291 -215
2770 -215 81 -54 82 73 42 197 -144 54 59 -102 182 -105 109 176 295 522 348 372 396 291 106 -186 -147
2793a47q6k59M06j92J16k6J12J35O8j15J0m8J85J41k2k70L8l7q7K74OK2p5j2k
2818A35o5j06Nq6p1K40m54J10J29k1Rj24M47j44k2J15P9k03J48j72J20m92O41
2841B18j01k50J20n7K06m6J72j11j87j14K53Q0l70K89n1K52r1k46J93j0k70J77
2863E6J64j81k31n7K64m6j86O2K04j55m9J92R3j60L49O9m74K41n6J42l54J50R0
2886A27k66J2K38k09J75K17N1j56j01j74j37L21l18N5J66j36K87n4M8M1k1j24
2908D2L68j42j67O2%k54K34l9k8O4j15l90L01O5k33Q8K07j5J09k87j8or3L45O4
2933A62k66K57k83Q1J63J41j51Q2j75J24j53p1K37k45R8q0K17k05P2K99m3l84
2955a23J5j93K39p0L48m49J76k04M88k96k6No3R2J81j47P3r2K37j87J25j47L4
$$ plain form
2793 -147 -233 -492 -86 -278 -162 -188 -76 59 127 12 22 -26 159 300 278 8 46 9 -78 196 202 224 149 137 135
2818 135 70 -36 -31 -117 -188 52 -402 -292 -163 -184 -175 -299 148 4 -18 97 176 -27 121 -51 69 -423 218
2841 218 117 -133 -13 -70 136 90 262 151 -36 -150 103 183 -187 102 51 303 212 -34 159 149 -121 56
2863 56 220 39 -192 -249 15 -31 -217 -155 49 -106 -155 37 130 -30 319 388 -86 155 99 241 -113 37 127
2886 127 -139 -127 111 -98 77 294 345 189 88 -86 -223 98 -220 -165 1 -135 152 98 146 187 166 42
2908 42 410 268 101 163 163 -91 143 104 76 140 25 -365 -64 1 -232 -144 63 48 157 -130 -148 -154 -247 98 162
2933 162 -104 153 -130 -49 114 255 104 186 11 135 -18 -89 148 -97 1 -79 138 -67 5 304 261 -123
2955 -123 -108 -301 -62 -132 216 -233 -57 -261 227 -69 -95 -90 -153 -61 120 -27 46 -46 191 4 129 -18 16
2978A6J96k65L56k17P2k08L9J96J7m39J16k5l5M7J87j53K32m00J7J81J52l06N9
3001a65K05k7K2J47j00r3l3L2P7N1Jn2k68O2j25M04P4l18p3J05j35n1J23L80l66
3026a23L58l93L72j50j40J06j37L2P0n4k18L20k41Mo3K37m1N6n9L80l13j20L47
3049B30j43k13J36j06K70k21J2P7P3k46K90l16Q8J02k28L6K9j51J87k3J36J66
3071A85n9J5K19J3l84L33j80j64L56l65j8l02O4L0O1K76k01n8L52j8k03k8Q0K2
3095B6jj48Q4J03j24L37k61J49j08Mm6J43k98K66kn7k4k7R0j35p5n1K59j76j62
3120b34L5P0J00l0R7k07K16Q9j54K96k59Q4k15J45r7K32M8n32J85J23M0j22q6
3143a76N4j64L38k3K5o7K46q1k17L41l67Q4M9k6j1r2l48L11K67J9k65R6j0J12
$$ plain form
2978 16 212 -53 303 86 158 -50 -11 185 202 -237 -121 -146 -181 -134 53 -100 132 -268 -251 -70 82 -224 -165
3001 -165 40 13 35 182 82 -11 -44 -12 65 116 117 65 -203 -141 -266 138 212 -106 -179 -74 -209 -260 -137 243 -123
3026 -123 235 -158 214 64 -76 30 -107 -75 -5 -59 -277 43 -198 -194 -257 -20 -61 -5 -64 316 3 -117 230
3049 230 87 -126 10 -96 174 -47 -35 42 115 -131 159 -157 -69 33 -195 -159 -130 -281 -94 -117 19 185
3071 185 126 141 360 373 -11 322 142 -22 334 -31 -49 -351 -287 -257 -196 80 -121 -179 173 155 -48 -76 4 26
3095 26 25 -123 -39 64 -60 277 16 165 57 61 15 158 -140 126 124 67 43 16 106 -29 -104 -155 104 -72 -234
3120 -234 -199 -129 -29 -59 38 -169 47 136 -18 278 19 103 -112 33 -64 168 216 -316 -131 -8 32 -90 -176
3143 -176 -122 -286 52 29 54 -13 233 152 -65 276 -91 -7 42 16 5 -87 -435 -124 143 162 -103 -7 -17 95
3167I5j22K52j39J04r7k57K94K4j33j31K26j72J28R9k02L8J08l5o6N0k10O6p4
3190a54j9J73j32L9J05R6N9l07L45j51M2j58K82k20k44K54j77K39Q7k25J59M1
3212A34j95pj0k55M76k61J84n18M73J24Mj46L3K37K7p7k71j07M4J94j9J83l18
3235g1m3Q9K18k40K11OO0r4rl73J54KJ81l21q4L36J76l89M16k13P0j37P7k0M3
3260D5m3J3m1q4O2L47j30j60R1j00K78k11J09p4l16K5J67o9J16J22l88K44k43
3283b40K23o7k8J3J30L6q2J40k83n5k9M29j30o4J06N7%K5n1j05j41J80j90J15
3307a1p5K12j14Mk5k9j21m7K81l11K34O9j08m7j39K76N5K1k07L4Q8j6k27J24l70
3332d49K65R1K44k39K95q6j05j33K35l09M7J02j32K05j55Oj16K08j24K64j54K26
$$ plain form
3167 95 -27 225 86 190 93 -164 130 154 21 -110 116 -56 72 171 -31 7 115 80 14 64 -146 -80 -154
3190 -154 -173 0 -132 -93 12 108 167 -140 205 54 96 -62 220 0 -244 10 -167 72 159 -66 93 134
3212 134 -61 -68 -78 -333 143 -118 66 -452 21 145 149 3 36 273 300 223 -48 -155 -111 83 64 247 -71
3235 -71 -114 -25 193 -47 164 170 230 136 127 -246 -92 -90 91 -230 -314 22 198 -191 225 12 82 -55 22 2 45
3260 45 2 15 -26 -110 -48 299 169 9 100 0 278 67 176 102 -214 -189 -22 -91 25 147 -241 3 -240
3283 -240 -17 -84 -112 -99 31 67 -15 125 -158 -213 -242 187 57 -7 99 156 156 181 130 25 -116 64 -126 -11
3307 -11 -86 126 12 16 -9 -38 -159 -206 75 -236 -2 67 -41 -88 -227 49 104 125 -82 -48 40 24 -203 -79 -449
3332 -449 -184 -93 151 -88 207 121 16 -117 118 -191 -144 -42 -174 31 -124 -118 -234 -26 -150 114 -40 186
3354A86k0R7k52j98K21j36R6n2n2P1j2L60j73O3l19J7q1L07j44j6j0j9j94K79
3378A9q3N3kK54k82M3j60R5K26Rj67j29j7RJ7K80o9o3M5p7R1m2J41j15k2j85m0
3405a71o0K7J01P2L47k05m8m6L9r0lL8L5k1mK0R5k95P0K32l50L70j8n2J89j77
3431I5k50R3J25k99M28l49K44j72K93l92L12m7k16J15J8J19l35J01P1j44O3N7
3453g0K77j77L24m59K92Q3j6n4k44J75P4j48k2L4R4k79L72m21K51O4J26j7m77
3476b18M46n38L4J90j7P5nj90L4L07j26L33p1j84p6j92L64j56j29K4J14o0M8k7
3500b0K6K43j56k01K30k02k3M1P4k6Q6k75K11L50l37R2m6j22R1K15k77j9j35K17
3524C7q6m5k12K59k0N0K99l08J07J50q2M0K3m3l16J49l86M37j95N2L66m90MM79
$$ plain form
3354 186 166 263 11 -187 34 -102 -6 -58 -110 -39 -51 309 136 199 -120 -103 -184 123 -21 -37 -47 -66 -260 19
3378 19 -64 -11 -13 241 -41 2 -158 -63 163 172 5 -124 -141 -132 -115 165 96 33 78 1 92 50 191 76 54 -131 -171
3405 -171 -231 -204 -103 -31 316 111 63 17 56 -34 -37 1 36 15 11 31 126 -169 -99 133 -217 153 135 83 272 95
3431 95 -155 -62 63 -236 192 -157 87 -85 208 -184 128 81 -135 -20 -2 117 -218 -117 -46 -190 -127 -70
3453 -70 207 30 354 -105 187 270 254 200 -44 131 205 57 35 69 163 -116 256 -165 86 150 276 259 -218
3476 -218 228 -310 -276 -86 -103 -28 -33 -223 -189 118 -8 325 254 70 -6 -198 166 10 -119 -95 19 -41 7 -20
3500 -20 6 249 93 -108 122 -80 -103 -62 12 -14 72 -203 8 358 21 113 67 -55 36 251 -26 -45 -180 37
3524 37 -49 -94 -306 -47 -67 -17 282 -26 81 231 149 189 212 169 -147 2 -384 53 -142 -90 276 -214 -210 269
3548B69l19J53r8J74l94K58M6K10j80R7k42o8K67J7j84J40l8k16M35l84J60l67
3570b64K20M9J75l30j52M68j54k10M3j5K09j05j97K01J9J74m24J55k2K87j44R9
3592H2J76Mr4o3pq2j33m2J04j12J33R3j34l3K3J6q2K21M7j20j02J58L4K23l10
3617@j01M72m52L69k50k61J77N8N4k62K38k35L43j62n1J92l74L19ln6j57K5N0
3640f7J62K1k94K09p6k69J82J35o2L4J5Q8L43l27Kj14L25m6m21K28j46j9j9p0
3664a86J05K35no6l38K96j09R9j56m8N0J32j10N5j13J97j76n9K15J02j47j46J51
3687b2P3J43N1k38J20j39Q3J04p4J29l40l8K96j75j39M9k32L31j27J08J4j13K74
3710A38k50J64mJ4J42l05j65J95QJ25Ml01K07n9ML5O1j52L43K2k46K21l43Q0O0
$$ plain form
3548 269 -50 103 5 179 -215 43 89 299 119 216 -26 -94 173 190 6 146 108 -108 327 -57 103 -264
3570 -264 -44 5 180 -150 -302 166 12 -198 -155 -170 39 -66 -263 -62 -43 131 -293 -138 -160 127 -17 82
3592 82 258 262 168 105 98 16 -117 -159 -55 -167 -34 59 -75 -108 -85 -69 -151 70 117 -3 -105 53 87 310 0
3617 0 -101 371 -81 288 38 -223 -46 12 66 -196 42 -193 150 -12 -63 129 -245 74 71 15 -142 -117 -67
3640 -67 95 116 -178 31 -45 -314 -132 3 -59 -25 -10 78 421 94 96 -18 307 261 -160 68 -78 -97 -116 -186
3664 -186 -81 154 149 83 -255 41 -68 31 -125 -173 -123 9 -101 -46 -159 38 -138 -197 18 120 -27 -173 -22
3687 -22 51 194 245 7 127 -12 71 175 101 230 -110 -148 148 -27 -166 -117 -349 -18 -145 -37 -23 -136 138
3710 138 -112 52 48 62 204 -101 -266 -71 -63 62 66 -235 -28 -87 -83 -48 13 -139 204 226 -20 201 -142 -62 -2
3735bj92M17k82OP0o6K11k34k0M1L8R9k02j4L99l07P5k30J30K71k51O4%n1J51
3760A21M2j87j53j3K75q0O9K8l3l6J23j12k78J2J91k72L48j32K43k77J32j93M15
3783B33k07J7R3k16L33l19J49j11J93l74K36J37m70K11L8R3k40Q9J72PM3l70K22
3806d1L8j58j68K75J31r1K0Q1p3m1Mj51L67j89P5k32K08J8J09r6p2Q6N6Pk41P0
3832hR8j48RRJ0J54l57K99j87O1L5j16L4J41J4j46k3J60k01M17m17K68l39K24
3856iR9j14j23J37JJ7r6K47k1K31k59p9m3p7K38l22N15m16J02j91L66j62j01j29
3880a89K19J78q9K43j15k65J7OJ01j10P2j28Q5K00k49J35N9k30J31l18K92J0j8
3903C7jk09K42j23j76M22L0l65J55k9N5j43K49J3j71Q8j57K08l5p2j01L06j65
$$ plain form
3735 -2 -194 223 -59 -53 17 -49 162 -72 -92 -51 -13 86 -116 -130 269 -38 37 -193 -63 208 -43 21 21 -30 121
3760 121 163 -24 -177 -190 85 5 74 102 69 33 156 44 -234 -222 -31 -303 45 -87 156 -121 11 -182 233
3783 233 26 43 136 -80 253 -66 83 -28 165 -209 27 164 -306 -95 -57 36 -204 -115 57 64 107 -263 -41
3806 -41 -3 -161 -329 -54 77 -14 6 87 14 -27 -23 -174 193 4 79 -153 55 73 182 86 14 100 156 163 -78 -8
3832 -8 90 -58 -49 -40 -30 124 -233 66 -121 -60 -25 -141 -107 34 48 -98 -121 39 -162 255 -162 106 -233 -9
3856 -9 90 -24 -147 -10 -9 8 -88 159 138 369 110 31 -12 -89 149 -173 342 -74 28 -163 203 41 -60 -189
3880 -189 30 208 119 362 247 -18 -1 5 106 -4 68 -60 25 225 -24 111 170 -60 71 -247 45 55 37
3903 37 36 -173 69 -54 -230 192 222 -143 12 -17 38 -105 144 157 -14 74 -83 125 90 18 -83 223 58
3926E8O4j10J76l2l39L87j0j50J22k19n2K27k03J79l1Q2j19n1n6L4p4R9K61o1
3950A82l9K04l53K31l00j87L55q0k06QN09k55j05J59k12jM6j26K5J90l5k2KJ66
3974A56n3K6k3l9P1k6j93nJ34j13M20j15M1l33J66r1j48K6j4J17k94M25pLj07
3999B4o6o9K4jj84K20p1L25j12p9P8p4L84l63Q0j74j55K93r9J26j55j31K46Q5
4023A52j28O3k89L69k58m8R9n6L20j87l8j10L07q2k34J15j12m3L26j98n9J21P6
4046A06kO7l1Lj55K27l82L71l43L1J32k3k87K45J53l08J72R9q8j34J28K6m0K34
4070B01q0r9k3rk3J93m3k72L39k00J74j63L00j21o6k88J01J10n3L68l92J9L54
4093C27l69r2J70l88M17J16r5L3k12M3o8J61L27l50l47J75L49l98K43K13l28J47
$$ plain form
3926 58 122 12 188 156 -183 204 194 44 166 -53 -105 122 -81 98 67 149 30 -21 -77 -43 -117 -18 243 182
3950 182 143 347 -6 225 -75 -262 93 13 -193 -185 324 69 -36 123 -89 -90 -44 -170 -145 45 10 -12 -10 156
3974 156 103 129 106 67 138 112 -81 -86 48 -65 355 240 281 -52 114 23 -125 -99 -113 4 -290 135 128 131 24
3999 24 -42 -111 -87 -88 -272 -52 -123 202 90 11 89 15 399 36 116 -58 -213 80 -19 107 -48 -179 67 152
4023 152 24 87 -202 167 -91 -139 -40 -96 224 37 -1 -111 196 114 -120 -5 -117 -160 166 -32 -91 30 106
4046 106 104 171 140 143 -12 215 -167 204 -139 -108 24 1 -286 -41 112 -196 -24 75 -13 -147 -19 7 -33 201
4070 201 121 22 -1 -10 -33 160 117 -155 184 -16 158 -5 295 174 108 -180 -79 31 -22 346 -46 -27 327
4093 327 -42 -134 36 -352 65 181 86 119 -93 -50 -118 43 370 20 -327 -152 197 -201 42 255 -73 74
4115G4k97J34K62k35L34j58j19K2j9j34J88k89L99k10k79J73P1j36K41k57J61
4136g4L33k56J66l21K19j93K10j87R5o7K22j76r2K69k96J14j04L58r8j86j59K38
4158A5j65Q9L4m0k9k7J58L8j18P8j06K62r0j77M63l76J43k15q0L98k84k2K7L1
4182Gr7%J79k16O5o0q9L59k26P0l8M2J01o3j77J2J82P8k9k42K25j11K9k04O3K53
4208A13j63l7K56j29r1rj16M58r2k62P6N8J08j98j02O6J52J55k51j8K5N1n2O8
4232F6k3l60M08J80q7l50J65J00p8Q8j31J91k2k66O9k93L57o4k0n7j7M03m25J27
4256c9j24K66k09K99o7k88K01P5m60J58L99m69M76j19j60j18L09J33k04j16J37
4277H0r2k04M51o3m17K19m4k5O4j78J41K08l2j70O0k9J90k73J52n5J44k68p7L60
$$ plain form
4115 74 -223 -89 173 -62 272 114 -5 17 -2 -136 52 -237 162 -48 -327 -154 -83 -219 22 -235 -74
4136 -74 259 3 169 -152 67 -126 84 -103 -8 -75 147 -29 -121 148 -148 -34 -138 220 122 -64 -223 15
4158 15 -150 -61 -27 -67 -96 -123 35 73 -45 33 -73 189 99 -78 385 9 152 -63 -143 255 -29 -51 -24 7
4182 7 -90 -90 89 -127 -62 -122 -211 148 -78 -8 -46 -4 97 34 -143 -131 51 129 100 -142 83 -28 1 -203 -140 113
4208 113 -50 -87 169 40 -51 -60 -176 282 190 -72 4 62 170 -28 -130 -64 88 243 -8 -26 -1 50 -2 66
4232 66 43 -317 91 271 184 -166 -1 99 21 109 -22 169 147 -119 -50 -343 14 -50 -70 -127 -144 259 -166 -39
4256 -39 -163 103 -106 193 126 -162 39 114 -346 -188 211 -258 218 99 -61 -179 130 263 59 -57 80
4277 80 -12 -216 235 172 -245 -26 -70 -95 -31 -209 -68 140 108 -62 -2 -31 159 -114 38 -17 127 -141 -218 142
4301A42k64K58j97M9J19p4J92l3k32J58J08j63l5l04L29q5K74p1k19OP1o3O6j92
4325a60J44Q3j75o0K83j04k30J84R8j75K33l55K89QK7J54j91J7L5l60J12K82j00
4348C9k97L98Rl84K97mJ52l92O5K33l91K10j37J19R2k67K38J06Pn2j84J97m05
4371c51L57lL49l90J45j62n0J51j55Q6j09P4q3K78k48Ojj09N1L8R6J61J4j75j37
4396a67K82j01R7O6J3k7J2k16J88J20k78k57J03J04J57j96M6J58k51O1K34j64
4418a6k1n2k00K16J70k55J42P2j52N6p2lJ02P9m3k3M7J63l97L50l58J06P1Q2K68
4443C32k70k1j25j20L37l1k24m5J60r1Q8j79j49J23K35j05j86L19l8q0J20j09
4465e9Q9Q0k38L23R4j42j30J1p8N7n6m4P6K9j31R4M21l17j50KL61k56k8j01M5
$$ plain form
4301 142 -122 136 -61 -12 107 33 225 192 -40 118 226 63 28 -276 53 -32 242 171 -48 -42 29 -34 32 -160
4325 -160 -16 67 -108 -168 115 11 -219 -35 63 -112 121 -234 55 63 90 244 53 70 105 -255 -143 139 39
4348 39 -258 140 149 -235 62 58 210 -182 -117 116 -275 -65 -202 -83 9 -258 -20 86 93 41 -143 54 -351
4371 -351 6 3 352 -38 107 -55 -105 46 -109 -23 -132 -58 -141 137 -111 -105 -106 -215 -164 -126 -30 131 145 -30 -167
4396 -167 115 14 111 177 190 163 175 -41 147 267 -11 -268 -165 -61 96 -100 -54 104 -147 -86 148 -16
4418 -16 -37 -89 -289 -73 97 -158 -16 56 -96 -40 -112 -115 -13 66 23 0 47 210 -187 163 -195 -89 -18 64 332
4443 332 62 41 -84 -204 133 102 -122 -167 -7 -98 -10 -189 -338 -215 20 -85 -271 48 10 -70 50 -59
4465 -59 30 110 -128 195 289 147 17 28 -50 7 -49 -93 -17 12 -119 -25 396 79 -71 -69 292 36 8 -93 -48
4490d8J0O5R7k60j50M23q5J1j83L10k31M9o0L9J19p8k7k01P2O6l0K86M7k01Q5
4515A25j62j39J61j69K3K00J15P5l57j01M9J62J40k25L65l56J64m4J72J09m42
4536a35K68lk78J06L01l32J81j48J01J51nl04j19L09qM0j08N8j52J27J37j29l28
4559b70K55j75J03j21lM28l44K98n32K04J72l28K98K66k50Q3m1q9K04l58K65j22
4581e7n9J85j10Q4N2P6k02l6R1J77j68J3P2j17K51L8m44K09r6K77j45q9J47l20
4605a71J52j65L67j35l57M75j16J60k77K8k63K68j38K00m9R5l38M97k43O9j69
4626a10K66j25l9K40P0k52k8p3J89k99M20j34j50j94K4k30L77Q5N4k29J60L7r
4649E0K3o0Jj78J22n9K50Rj94OO4J77l05R7L05l87K03j05lk52L19K12l74J44J02
$$ plain form
4490 -48 -38 27 124 -136 -286 137 52 63 -120 190 -41 8 -52 -13 106 28 1 -200 -128 -62 -92 194 241 40 125
4515 125 -37 -176 -15 -184 -161 39 154 229 -128 -229 -180 -18 122 -103 262 -94 70 26 198 307 -135
4536 -135 133 130 -148 -42 259 -73 108 -40 61 212 207 -97 -216 93 85 125 17 75 -77 50 187 58 -270
4559 -270 -15 -190 -87 -208 -211 217 -127 171 -361 -157 15 -313 -15 251 1 84 43 -46 158 -200 65 -57
4581 -57 -116 69 -41 43 95 171 -31 -67 24 201 33 46 118 1 252 290 -154 55 -41 236 91 2 149 -171
4605 -171 -19 -184 183 48 -309 166 50 210 -67 -39 -302 -34 -172 28 -21 74 -264 233 -10 59 -110
4626 -110 156 31 -8 232 302 50 22 -51 138 -161 259 125 -25 -219 -195 -425 -48 37 91 -138 22 59 50
4649 50 73 13 14 -164 -42 -101 149 158 -36 -30 34 211 -94 3 308 -79 124 19 16 -236 83 295 -79 65 167
4674A67K7j04l08M2N34n7j78r0j94M39l07o6N3L69k59P1J8R9k70p7R9j58J54N1
4698E5J10j5J80n75N95k17j09K3l25L23j38o5J61l04K03L1K00l5j9j63o1K39J
4721I5j82j09K81qj26o8R0J90M5k49J67P9l94K02q8K05l76J34n2K51k19J38j04
4744i8J87l32N19k64JJ42l03M1M5J97k05j21J47n5L28o6j68K1J97m8k37K79l29
4767a22J8K18J5k72J98j58o6Q1j68L14l15O4L11J11k28p4l5J43j54J14j61L8m3
4790a71l3K63J16j27p7%J27k27j0J48n2j41L26k29R8j78K70k1l54P0K46m9K6M1
4814F2k29J44pK44l21K14o7r5l6J76j46R6q8r0L54l21N1J38o9N4K9O3m15K02l0
4839h7j92L77j67l9K14l01J43J42j02j74J71Q3Jq2k03N23m76Q7J52k07j92O19
$$ plain form
4674 167 194 90 -218 -176 358 301 123 33 -161 278 -29 -95 -42 327 68 139 157 256 -14 -91 8 -150 4 55
4698 55 165 150 330 -245 350 133 24 47 -278 45 -93 -158 3 -301 -98 -67 133 98 79 -84 -145 94 95
4721 95 -87 -196 85 77 -49 -117 -27 163 208 -41 126 205 -189 13 -75 130 -246 -112 -164 87 -132 6 -98
4744 -98 89 -243 276 12 13 155 -148 -107 -62 135 -70 -191 -44 -99 229 163 -5 16 213 165 -72 207 -122
4767 -122 -104 114 129 -143 55 -103 -169 -88 -256 58 -257 -193 118 229 1 -73 -108 35 -119 -5 -166 -128 -171
4790 -171 -204 59 175 48 -29 -29 98 -129 -139 9 -43 -184 142 -87 11 -167 103 82 -272 -202 44 -5 21 62
4814 62 -167 -23 -30 214 -107 107 40 -55 -91 85 -61 35 -53 -143 211 -110 -59 79 10 64 93 156 -259 -57 -87
4839 -87 -279 98 -69 -108 106 -195 -52 90 -12 -186 -15 68 69 -13 -216 307 -169 -82 70 -137 -329 290
4861B90m42J54L9l61J40L00j69j4Q0P5j27j06K39j63L4R7O0j87J05l0pL2k42K20
4885A7j43OQ5J64k49K03k60J16J04%R6k10q6rO2J84J9o6j4r8j26M40m46O7K06
4910F2k19J68l4k9K15j17J1j63L8O1Q9j15j60J76J19k08q4L61m6m4L23l55J95
4933B44m24M88l66J21j33j01N5N1J84K1k83M8J3J12k1L0Mk73L87J61l65o8J62
4956D7j18M07n01P9k0M81k36m14O1K59K83m03j19j09J59j8L30k36l2j18r7j14
4978d29O45k39J54j12j39M77j03j35k20J69j5j6P3k3R1j29J49j56p1K13p0j42
5000b8j50L01l93K29O6J06k18j48K95m2O7j35j0J31p7K65j30L4j88M58k45p1K8
5023A45p9K18k21Q7p7q1N6j86Q2o3o4J73k3N6NLJ67j22P6l58N3j22J36O9R2P4
$$ plain form
4861 290 -152 2 41 -320 -180 120 -49 -63 17 92 -35 -141 98 -65 -31 66 126 -61 44 14 7 39 -203 17
4885 17 -126 -120 -35 129 -120 83 -177 -61 43 43 139 -71 -157 -166 -104 80 99 33 19 -79 -205 235 -211 -144 62
4910 62 -157 11 -23 -52 163 46 57 -106 -68 -7 82 -33 -193 -17 102 -106 -190 171 125 81 404 49 244
4933 244 -180 308 -58 63 -70 -171 -116 -65 119 140 -143 -95 -82 30 9 39 43 -230 157 318 -47 -115 47
4956 47 -71 336 -165 -86 -106 375 139 -275 -214 45 328 -75 -194 -303 -144 -162 168 -68 -100 -218 -315 -429
4978 -429 216 -23 131 19 -120 357 254 119 -101 68 53 37 110 87 178 49 198 42 -29 184 114 -28
5000 -28 -178 123 -270 -41 25 131 -87 -235 60 18 85 -50 -60 71 -6 259 129 163 -25 433 188 117 145
5023 145 66 284 63 150 73 -8 48 -138 -56 -119 -183 -10 -33 23 28 31 198 76 152 -206 -153 -275 -139 -70 22 96
5049I6k01l3K01k44J23K55j01k47J94K8q8N1j86J52J22J47l22q0Q6J43k15L68
5071B49l98K56k69J28j10l6RO8K73j70j4K52j34j88J28k0J80j93K18j67P9j34
5093GP3jj53R3k25K20l7q9RO1j39J04J59j87J2j01L02O4J52l55L3K60r2N2j94
5118B8Q7n9J73l29J77l12K20l9p8L68k66j80K25j86K26q7oPq2K38j55j50J99K6
5142D5K1J56k69K42j37L05l31n7M7k44L02j6r0J23j30Q1k02j07M14k35J40J74
5164B32l53PK07o5j30l8L35l8k95M27r9j17P4l77J04Q1j6l7K8J24k47n6M29j32
5188D8l7k1on2M5j2m6P1k82L62j39m1K65j70K40k44K58k91J20l6M4R7j96o0L41
5213B58k93M7R7m3J10Oo1j25q7K23M6l45L7K37l29L1L45m7k4j25j16J60o6l5J75
$$ plain form
5049 96 -105 -138 63 -181 -58 197 96 -151 43 71 -17 34 -152 0 122 269 -53 -133 -47 96 -119 249
5071 249 -149 107 -162 -34 -144 -180 -171 -103 170 0 -14 238 104 -84 44 24 204 11 229 62 141 7
5093 7 80 79 -74 19 -206 14 -23 -112 -103 -42 -181 -77 82 -105 -93 -194 108 172 324 -31 2 262 170 222 28
5118 28 115 56 229 -100 77 -235 -15 -54 -132 236 -30 -210 15 -171 55 -32 -38 -31 -113 125 -30 -180 19 45
5142 45 66 222 -47 195 58 363 32 -25 22 -222 80 64 -26 97 -33 48 -154 -261 153 -82 58 232
5164 232 -121 -114 93 28 -102 -140 195 157 -138 289 190 73 147 -230 -126 -45 -61 -98 -70 54 -193 -249 180 48
5188 48 11 -10 -16 -68 -23 -35 -81 -10 -292 70 -69 -110 155 -15 225 -19 239 -52 68 32 76 173 -23 -83 258
5213 258 -35 12 109 66 176 182 121 -4 -91 132 178 -167 -130 107 -222 -191 154 107 83 -42 -158 2 -64 -99 76
5238G6j68o4m8j1K66k28K87j49O2j56L40j27k8P0j20J0J8l30N22j86k17K16m3
5261hn0j18K13R4k50J1K27j54M0l5K18j21J1n18M63J23j35L9Q9j82K01k87K41
5284A12R2j34J3k66L65m83M36j82j7J02l00K19n1k93J24%Q4N5J40q1L3J87l49
5307a94L71q8k07L39k33N1q8k3J78L2n4j87o3J75l0P6j07j76K46l5J19r6Rk16
5331b01M52k30L9J62k77p0j73K88o7L18j40j86Q2K28k7m43M41j30j07J11l13R8
5353a45J73J24L3k46K15k70J80K2j42M7r4K2M2K14j61K31k14p3M3M6P2j48r8L40
5377B13l25K55j98oO9m9jr8O0J66j21j19J36l1k4o9q4J71r8lK24j22j01M91n25
5402a89J48K7j44M8K53k85J35M7k16L23j31m8m0J94m7j71L79n12J62M1J7j25O
$$ plain form
5238 76 -92 -156 -204 -215 51 -177 110 -39 23 -133 207 80 52 122 2 12 30 -300 222 36 -181 35 -8
5261 -8 -58 -176 37 131 -119 -108 119 -35 5 -30 188 67 78 -440 23 146 11 50 139 -43 158 -129 112
5284 112 204 70 83 -183 182 -301 135 -47 -64 38 -262 -43 -94 -387 -263 -263 -179 -124 16 -65 -32 155 -194
5307 -194 177 89 -118 221 -12 39 -49 -72 106 138 84 -103 -166 9 -21 55 -52 -228 18 -17 102 6 15 -201
5331 -201 251 21 60 222 -55 -125 -298 -10 -77 241 101 -85 -3 225 198 -245 196 66 -41 70 -243 -145
5353 -145 28 152 185 -61 154 -116 64 86 -56 -9 -103 -81 -39 175 14 245 31 -42 1 47 119 -29 -127 213
5377 213 -112 143 -55 -61 8 -41 -42 -140 -80 86 -35 -154 -18 -49 -73 -142 -226 -55 -153 -156 68 -54 -155 336 -189
5402 -189 -41 -14 -158 -110 143 -142 -7 40 -176 147 16 -32 -72 122 75 -96 283 -229 -67 -26 -9 -134 -128
5425a28J87Kj93P1L72l56k5J22L5J06r6k75J12K03j05j33k05K83J74m4J5k73O4
5448h7j95K40p8K2r4K62j58q5L38m88L5L94j13N2m7m9k4M09j98l89O05k42j39
5471b9KJ0J46j27K49m07M06k67O1J8l77O2K95j78J0J35Jj20J10J80k05Q9N4n6
5495F2k38L82j77J34j33Q1o2J94j53O2j40j2J16J55k16j4o5M6o9j11m6Q0J21m3
5519d6J47l24K43j79K30k3j26j04L31k18L9K36j95j89Q4L92m55L02j33MJ42J22
5541B80k99M3L0P4k29M6N1r5L46l29M81n91O3L07j05p4j1k8m9J02P2R2m6J40k63
5566HQ2J4jk59L04k49R4n8pL17q0j96J21k40J37N4j8j08P7J0j52p9K81j23j4p7
5592a62J88j85J10m3j46J84N4P1J86j57M5k40J73j01K42l28N4j81K20l8n8O4q0
$$ plain form
5425 -128 59 61 -132 -61 311 -45 -70 52 87 193 97 -178 -66 137 32 -101 -306 -23 151 107 122 -151 -87
5448 -87 -282 -42 -120 -98 -192 70 -88 -173 165 -323 -288 106 -7 45 -2 -51 -75 334 136 -253 352 110 -29
5471 -29 -27 -17 129 2 251 -156 250 -17 44 62 -315 -253 42 -136 -126 9 10 -110 0 180 -25 64 118 62
5495 62 -176 206 29 163 30 111 49 243 90 152 12 0 116 271 55 41 -24 22 -47 -158 -204 -124 -3 -46
5519 -46 101 -223 20 -159 71 48 -78 -182 149 -69 -30 206 11 -178 -94 298 -157 145 12 16 158 280
5541 280 -19 24 54 128 -101 -55 -4 -99 247 -82 399 -192 -129 178 73 -1 -12 -40 -89 13 85 177 131 271 8
5566 8 90 104 103 -156 148 -101 -7 -65 -72 245 165 -31 90 -150 -13 41 23 -85 -8 2 -150 -229 52 -71 -85 -162
5592 -162 26 -159 -49 -92 -238 -54 0 71 257 100 145 -95 78 -23 219 -109 -55 -236 -16 -54 -112 -48 -128
5615a28o9J99O9m2k3J61nR6o5m7j67Q8j20L00m8l53L60k91M32k32j15J24k25j29
5639b30L60l60P0J81kp1k25L23J43j22l35L05J86m10J41Q6J04j24r2o6K87k83
5661a34J05M10l87J8J71r6r6j82N14j32j44J30rk97Q5J65m72J53K00J28j1rq9
5684B1k41K98j39J71r3J33r3p9J91l39JK18O8j21O1p8J5lM0j12J48q4JK11k43
5709d8J75k07K80l09J45j55O6J78j2j65K79l08q0K14K22k18n3mJ35k94J12r2K49
5732A10j34r0N4j97J68p9M03k50j60J17M0L1N2l38L08k11K52k23K10j17Q1p0K35
5755A92k01Q8P8j58N8j73j83P1J08L6J54MM2k32Q2J47J31j76j35J01j00j05L19
5778A48m32M18j57P8k58k53N32L0m15M39lj14K16l51J19J62M6l3K7O4k65J79q6
$$ plain form
5615 -128 -197 2 71 29 6 167 162 258 193 146 -21 67 -53 247 199 -154 206 -85 347 115 0 124 -101 -230
5639 -230 130 -230 -160 21 19 -52 -277 46 189 67 -268 37 223 -187 -46 40 144 20 -72 -138 149 -134
5661 -134 -29 381 -6 12 183 87 -9 -191 323 191 47 177 168 -129 -44 121 -351 -198 2 130 119 110 21
5684 21 -220 78 -61 110 17 150 57 -22 169 -170 -169 49 117 -4 57 -21 -6 -9 31 -81 67 -17 -16 195 -48
5709 -48 127 -80 200 -109 36 -119 -53 125 113 -52 227 -81 -161 53 275 57 4 0 135 -159 -47 -139 110
5732 110 -24 -114 -60 -257 -89 -168 235 -15 -175 -58 -18 13 65 -273 35 -176 76 -147 63 -54 27 -43 192
5755 192 -9 79 157 -1 57 -116 -299 -228 -120 -84 70 74 116 -116 -34 113 244 68 -67 34 -66 -171 148
5778 148 -284 134 -23 55 -203 -456 76 106 -309 130 127 13 229 -122 -3 159 205 172 199 263 -2 177 91
5801I1r7J20M9k00k60l9L81j65J58j58K07Rj1n9Q5j84L47k32Q0j53K49l33J88
5824G3k95K23j56O8K78p5j47P3j57N5K62j70J00l15R5J36J1k37J14K59j58P3m6
5847F4Q7k56L15j09r8jq3J74k4M9l06L66j96p0J4M0j79K23p3O7j43L9L11j39k35
5872a63J11L4J52j05P5lj39j64N25m12j89L25K39m13J27K58j88j62K23lO1m06
5894b17K13l1j03K38p1j3r0K71j39l3jl5m6J7J79p2j87J52M8j78O5j5P7l6r7K49
5920A45k4jJ44k84R5n4Q1j50L8p8j30Q7M9m6K29l0k63Q1j0K79j09L5j48K4j18
5945a58K36J32k37P8lO6o4L0j63J85qJ72j80j18L6J15q5L9p7J65k9r1q1o3Q7m7
5971f3k26Q5K50m7k37J88j34M9J23j29K78k98J41J2n1q8M00l87K50K6j31J64l42
$$ plain form
5801 91 -6 114 163 -37 -297 -336 45 -120 38 -120 87 96 85 26 111 -73 274 42 122 -31 218 -115 73
5824 73 -222 1 -155 -87 191 116 -31 42 -115 -60 202 32 132 -183 -88 48 59 -178 -64 195 37 110 64
5847 64 151 -105 210 101 3 2 -81 93 69 118 -188 178 -18 -88 -74 -34 -213 10 -63 4 -139 -100 211 72 -163
5872 -163 -52 -18 134 29 104 101 -38 -202 323 -89 -278 47 286 -127 0 258 70 -92 131 128 189 -217
5894 -217 -4 -35 -138 100 29 16 -74 197 58 25 24 -11 -57 -40 139 67 -120 32 80 -98 -33 -48 29 -7 -104 145
5920 145 121 120 264 -20 75 21 102 -48 -10 -88 -218 -131 -82 -128 101 71 -192 -111 -121 158 49 84 -64 -40 -158
5945 -158 78 210 -27 51 48 114 50 80 -83 102 94 266 86 -32 4 119 34 73 -4 161 132 41 -40 -103 -16 -63
5971 -63 -289 -204 46 -1 -238 -50 -184 -135 -12 -141 137 -161 -20 -8 -59 -147 253 -134 116 142 11 175 -167
5994a67K35m31O29m85K30q6k53R9k6L6K28k05L25l9r7j02%Q7j20L35n3Kl93K25
6018b6J7J09n8O7L9o7j84K73j29k6K42m41J18L84l25k39K00K60l49O8o0k6k3P8
6042i8K70O3k80J25l6K3M6MP4m5K35j15j72j99K73j65M3k76J74R7l42L66j99P7
6066e7K45l68J05K75l11J56K2j03L1Rq7J20j26Q0J57j82PL5k86K00N1M4Pl2j9
6091b7Q6j30M0k3K71P4l56q0R8j0J38j57J80l40K20K6k1Lm5j71k9J12k65O76j89
6116H1J14j82Pj33K48k4K9l35L6P4Q4J7j52Q3K07j53l7J63J23k87K05j68m6M7
6140AJ48n26K83k87M03M9n5J08l68J63J27j70N09j82N8k87J3J92Nl54P6J6q1J56
6164cm8J41j85K44k79l6K03k13L21j66K6p1L49l99L33j12J54k78oL03l94m5J86
$$ plain form
5994 -167 68 -363 266 -219 11 -75 -328 -229 -255 -219 9 -196 129 90 -7 -109 -109 -22 -142 193 140 142 -251 -26
6018 -26 -9 100 42 109 148 81 -103 170 41 15 257 -184 -66 318 -7 -246 -46 214 -135 -67 -127 -153 -176 -98
6042 -98 172 235 -45 80 44 67 113 117 191 146 381 266 94 -105 168 3 46 -230 -56 41 -301 65 -134 -57
6066 -57 188 -180 -75 200 -111 45 67 -36 -5 4 -83 37 -89 -9 148 -34 -27 8 -278 -78 -27 17 24 -8 -27
6091 -27 59 -71 -31 -54 217 291 -65 -145 -47 -57 81 -76 104 -236 -16 10 -11 -8 -53 -224 -253 -141 -406 270 81
6116 81 195 13 20 -113 135 111 140 -195 -159 -85 -1 16 -136 -53 154 1 -36 127 250 -37 168 0 -46 1
6140 1 149 -377 -94 -381 22 71 16 124 -244 -81 46 -124 385 203 261 -26 -13 179 184 -170 -94 -78 -159 -3
6164 -3 -51 90 -95 149 -130 -166 37 -176 145 -21 5 -66 283 -116 217 105 259 -19 -25 278 -116 -161 25
6187B5M4k0o3J82r1M1k2l19M05k46j05n0K11j6K47j35N6k31J41j49j73K42J19
6210I3J93k76OOj62N86m55K17o5m18M90k79j59L0l2K3L38k43L45k56R9L7k59p2
6234b13K19J31r4k66Q1K15k98O7M13k91o5j05m2J25K94k57J65J48l16L4n0J23
6256A8j34R0j21J29J02k21K6J11R8k04K5M54l36k52M01K85m06J5k01L93k04j91
6278a23K04j20K70m19l4M36j95JJ05k10K63r9j15j06N5q6K15J78k49J24k65K34
6300F4K18l08j5j4J67j69o0J26M6K5k55K91q2l32J98K15J01j49r2L8L5j01k9J38
6324E6j15K47j5q2p1j39j3J15j41J08k6P4l4L55k70p7P0Q4J41n37L19j76N7J07
6348C7R5k1j79L5J08j07J6p3K3K96l15K5J66j51j90L7j11L70m9o4j1K8nK06J08
$$ plain form
6187 25 69 49 -14 168 77 118 96 -223 182 -64 -169 -219 -8 -24 223 88 144 -87 54 -95 -268 -26 93
6210 93 286 10 16 22 -140 446 -9 208 143 -275 215 -64 -223 -193 -225 -202 136 -107 238 -18 81 118 -141 -213
6234 -213 6 137 43 -223 -142 73 -225 -158 255 -36 -101 -206 -248 -123 171 -86 79 227 -89 -55 -105 18
6256 18 -116 -26 -147 -18 84 -137 -111 0 98 -106 -81 373 37 -215 186 471 65 80 -121 272 68 -123
6278 -123 81 -39 231 -188 -222 214 19 20 125 -85 178 79 -36 -142 -87 -173 42 220 -29 95 -170 64
6300 64 282 -26 -41 -55 112 -57 -117 9 55 80 -175 116 34 -298 -100 115 216 67 -25 13 48 -53 -82 56
6324 56 -59 188 173 91 20 -119 -132 -17 -158 -50 -76 -2 -36 319 49 -28 42 126 267 -270 49 -127 -70 37
6348 37 132 111 -68 -33 75 -32 -16 -89 -66 230 -85 -60 106 -45 -235 -198 -309 61 12 -52 -63 -35 -40 166 274
6373B74J00n34m4K06j07J53n7J83j70k20J57O9j43r4K27k40k14M21P8k34J94j56
6395a51L43k04j91K15P4l70J37J27J19K9k5l84M25K3j31J73ll02LlP3K59j90j53
6419a07JL44j55N6J45k47j44L6j16Q2R6j73%%L60m3j56P5j27K01j09j52J25M4
6443C6L8K4j47n0K78j77m3J55m2LJ66l81j14M24k70nL8j02l4J76K32k35N0q3J69
6468A06j05m6P7K3o0J16j21Q7J4j34kJ88j57j71J95j06J24q8O6J4M2j5k22L37
6492A62j40m6J10P4j90PK57k31L5J66k07J93l64M72l32J42l11O3K26n89O45l97
6514b55L21o1q2K33l50J92RM5o5O6L0j9j0j11J14R3r3k09M92l81L63l07j8Q2j96
6539a17K19m1j20K46k11L6pk36L64m0j88J01p8L0j03K74k22J73n6k50M87k10M0
$$ plain form
6373 274 374 -160 -204 2 -105 48 -9 174 4 -216 -59 10 -133 -227 0 -240 -454 -33 45 -189 5 -151
6395 -151 192 -12 -203 12 86 -284 -147 -20 99 128 103 -281 144 167 36 209 206 -96 -93 -96 -23 236 46 -107
6419 -107 -106 238 83 139 284 37 -107 -71 -187 -105 -9 -182 -182 -182 178 135 -21 54 -73 128 19 -133 -8 36
6443 36 74 98 -49 -99 179 2 -41 114 72 75 241 -140 -254 170 -100 -105 -67 -169 -203 -27 205 -30 20 -63 106
6468 106 1 -45 32 55 -5 111 -10 77 91 -43 -45 143 -14 -185 10 -96 28 -60 6 20 62 47 -175 162
6492 162 22 -24 86 160 -30 -23 234 3 38 204 -3 190 -174 298 -34 108 -203 -140 86 -503 142 -255
6514 -255 66 5 -77 156 -194 -2 7 52 -13 53 83 64 54 -57 57 150 57 -152 340 -41 322 15 -3 79 -117
6539 -117 102 61 -59 187 -24 12 5 -231 133 93 -95 6 -72 -42 -145 129 -93 80 24 -226 261 51 91
6562I1P0k05o5P4J29P9r2m3l1K32L6l00q7L56n2j93O9J20k34M7j30n0P5Q8j87
6587b03k57O02k00R1J21k1k1J01j95N6o0j27M42m04J23l90L10j91J13J77L7j71
6609f7J60l02O7j10J58N1J98m3o0j19J72k02k42L38mL1k8L0Mn3M5J77m04K97J78
6634B72j28l66K91P0j64K3n5j32P8n3J62j63J00J45k07K46p1q1P2j03N5k48K43
6657a4o9K3J76j62J73Kk19n5j2K70L6k5m26M4M48l18j48L52k38K32K25j31l13
6680a49L4R0m2K1j44J32q6q5K88L6J5k54K69j26N0P0n7j38N6l9j28L60l71J98
6704@J33k80P4L54l78L63o5N2j65J08n10L05j53K98p5J94R2k86J37M0k62j31J28
6727b7j17K85q9m2n2J58j01j13N7J61k74R7q2M5J58j30KJ3k44L39jJ40o7j38R0
$$ plain form
6562 91 161 -44 -109 -35 94 173 81 38 7 239 275 -25 -112 244 192 -1 68 188 -46 1 -129 -179 -104 -16 -203
6587 -203 -460 142 -58 33 154 133 112 213 18 74 14 -113 329 -75 48 -342 -32 -223 -110 67 104 -67
6609 -67 93 -209 -142 -252 -94 -43 155 112 52 -67 105 -97 -339 -1 -5 26 -2 28 32 -21 24 201 -203 94 272
6634 272 144 -222 69 139 -25 -2 -57 -189 -111 -164 -2 -165 -65 80 -127 119 48 -33 39 -64 -9 -257 -14
6657 -14 -83 -60 116 -46 127 129 -90 -145 -157 113 149 124 -302 -258 190 -128 -276 76 -162 70 295 164 -149
6680 -149 -115 -25 -67 -46 -190 -58 -144 -229 59 95 110 -144 125 -1 49 119 62 -76 -20 -59 -187 173 -198 0
6704 0 133 -147 -73 281 -97 266 201 253 88 196 -314 -9 -162 136 61 255 347 61 198 238 -24 -155 -27
6727 -27 -144 141 52 10 -42 116 15 -98 -41 120 -154 -57 -139 -94 64 -66 -64 -51 -295 44 43 183 116 -22 68
6752F8j75P2j60K90nj78J69j71R5M6M7J22k93k26L56k13M70l81K63l60J26m5J15
6775C2p7j3L8j3O0J8r6M6J7j91J71J33j32l1j90J64L4r4J16J61j99K05j98k59
6799b98K89r6nM5N9K34r1k45o0J04L34m60K10m3o9K63j42k12L20lj70J68J0Ml26
6824a80J8J98k5R0O0j8l35L27m9l74L82Kj98K24j44J16j08J64m18J71l32M70l1
6847A0n8R6J60Q4n65N29j05q0J26K7k45J1J26k7k45K06J28k19PO2J94m85K65k86
6871b84J60q6N90n31K1J32k27K77j82J80k56J62M0M9J0J20k02j34N10k22J8j89
6893d4l04O89j34j51kJ12Q9kk00p5j65P6R2R5k8J7j48O7m0j06o3J44L6K4p8K5
6919g4M9j04L5J61l3j58N9O6J5k19M16j14j46J96j72J69r6kJ03n6j26q1M8j10
$$ plain form
6752 68 -107 -35 -195 95 90 -88 81 -90 5 51 98 220 -73 -299 57 -156 314 -67 196 -164 -38 -83 32
6775 32 -45 -58 -20 -33 27 45 -51 -5 12 -179 -8 125 -7 -38 -228 -64 -30 -124 -8 153 -46 159 -39 -298
6799 -298 -9 -105 -110 -65 -6 228 137 -108 -168 -64 270 -190 20 -23 -92 171 29 -183 137 134 -36 132 142 146 -180
6824 -180 -162 36 11 101 161 143 -192 135 86 -288 94 96 -102 122 -22 94 -14 150 -268 -97 -429 41 10
6847 10 -48 48 208 292 -273 256 151 71 197 224 -21 -10 116 89 -156 50 178 -41 -34 28 222 -263 2 -284
6871 -284 -124 -210 380 -151 -130 2 -225 52 -130 50 -206 -44 -4 45 55 175 -27 -161 349 127 145 -44
6893 -44 -348 341 207 56 54 166 255 253 53 -22 -187 -111 -19 76 48 65 -83 -16 -56 -162 -225 -81 -45 -21 -99 -74
6919 -74 -25 -129 -94 67 34 -124 -65 1 16 -203 213 99 -47 149 -23 146 50 48 151 95 -31 -112 -64 -174
6943a74Q6J44q3k62N0J65J06n0k8j04L88j87J77l90L17k86J56j67m0R4J09n2J03
6966G2J09k84R7m90K29J42J24j36k7j52L42q1M9mN5q9J66j40J05J48k60J03P1
6989A49j54r1k1J22j2n1N45k68m3K6k38k3J64m33L67j50JL00m54J93J49o5j15
7012a02M09k13j64M7j72N6J70p4m4J22l07L92k88J57l2K29k10j48K59k8K5l24
7034b40N61l73K26k05j8J42m69M18K13j34j21l54L85l6k4l1J77r7J49M0l14K56
7056A51qk06R7L3j3j33j46J40L2J16k01K79j86m1p1o9k2K22K65j93k5J07l3J62
7080B57j45n5Q9k15L64l4l15L9R2k03J57o9R6q6K66k29K22j78Q7q3J47j87k9M7
7104C5o5J75k29o3L01j25J12l11J49o3L25p9J5J2j0j65j66J37J01N2k53J34j26
$$ plain form
6943 -174 -88 56 -27 -289 -239 -74 32 -18 -46 -150 238 51 228 -162 155 -131 25 -142 -182 -88 21 -31 72
6966 72 181 -103 -6 -496 -267 -125 -1 -137 -164 -316 26 -55 -6 -10 45 -44 122 -18 87 235 -25 78 149
6989 149 -5 -96 -117 5 -7 -58 487 219 176 202 -36 -59 105 -328 39 -111 -110 190 -264 -71 78 13 -102
7012 -102 307 94 -70 -23 -195 -139 31 -43 -87 35 -272 120 -168 -11 -43 186 -24 -172 87 59 84 -240
7034 -240 321 -52 174 -31 -49 93 -376 42 255 121 0 -354 31 -5 -29 -60 117 20 169 209 -105 151
7056 151 143 -63 34 67 54 -79 -225 -85 -53 63 -138 141 -45 -86 -157 -226 -248 -26 239 46 21 128 95 257
7080 257 112 57 146 -69 295 261 -54 -15 77 -126 31 -38 58 -28 238 9 231 53 140 57 204 17 -12 35
7104 35 -30 145 -84 -147 154 29 141 -170 -21 -84 241 162 177 189 179 14 -152 -15 86 138 -115 19 -107
7127a07J07l5J53m2m09J96L42j22K5j98j5k0O7O4j3p6j63K48j61J04j8J26M4j
7151I6k16K26j13k85N58l86J39J32k21kJ07o3q3J72L1k31r4K48J9m0mJ5J77K1
7175B03j74j11J31M2k03J36P3j46J82l36K23K1j10L7j23o4J73O8L1OM0k23J31
7198Gn2P8M8j83J53k18N46n98J33J29l8P5qj61J27j80K53J18k97L76k80J09Q6
7221B23l90M14l96J76j79K70J8k10lJ03l3P0q8nRMKj7r7R9O5N8n1j04K26j38l
7248B3l0k6j76K79L8k10K85l69N5K3j7K34j96K6M4j25K20n2j25J15J58p7lK2j47
7273c1J58j91O6J24r8J4P9k57LJ95Q1k79J73L7j99J26l01K77J64k58K08k21K46
7296A16k09K41j55m0k59M44n8k03J16M7K4k16L40m73O32l11N1j56J07J03j94l80
$$ plain form
7127 -107 0 -35 118 76 -333 -137 205 83 108 -90 -105 -125 -58 6 -7 -83 -246 2 -159 -55 -73 53 97 96
7151 96 -120 106 -7 -292 266 -120 19 151 -70 -72 35 -28 -111 61 92 -139 -233 15 34 -6 -10 5 182 203
7175 203 29 -82 49 91 -112 24 97 -49 133 -203 20 41 -69 -32 -155 -219 -46 22 53 59 99 -124 7
7198 7 -45 33 81 -102 51 -167 379 -219 -86 43 5 80 72 -89 38 -142 111 229 -68 308 28 137 223
7221 223 -167 247 -149 27 -152 118 136 -74 -77 26 -7 63 -25 -30 -21 -17 -15 -32 -129 -30 35 93 42 -62 164 26 23
7248 23 -7 -33 -209 70 108 -102 183 -186 -131 -108 -125 109 -87 -61 -17 -142 78 26 -99 16 174 97 94 116 -31
7273 -31 127 -64 2 126 28 42 121 -136 -133 62 143 -136 37 74 -125 1 -300 -23 141 -117 91 -130 116
7296 116 -93 148 -7 -47 -306 138 80 -123 -7 40 64 -152 188 -285 347 36 87 -69 38 141 -53 -433
7318d33L61K79l11K54p1k14j62M06j44j48Q4O6K0J15j06J44q2J62k00r8J60j28
7340d6n2K22J05k46K73k62Q3Q8k97l8l1L88m26qK66l4K12l70M37m85k9M54J90
7363C94k82k40p9J06N7Q5k64L00k32J97o8J26J25k74l0lqJ11K28k40L8p3l57K86
7387i7K52k50J99j06k16M21J1m61M02j97rN0K65l53j11K24l14N52j09J0j80K03
7409A86N0l66p7J37j27J11N1J71j54k17J06mJ23l6j23K12r2o2M7J51MR5m0j63
7433a7K33j20l58J84L2m5L4K25k6j61J60k32p5K71j13k26L26k09R2Pq8J48K1m7
7457A6r4R9M1o2P9j69J32K87l00R3J61j92k20K01J1K3N3l59J58K2o7J40K4j87
7481a10J66k59L9K97m4k59N5J98k16K36j36R4l42K35J66j45J52o4qK3j93Q4L1
$$ plain form
7318 -433 -72 207 -104 150 79 -135 -297 109 -35 -183 -99 -33 -13 102 -4 140 58 220 20 -78 82 -46
7340 -46 -98 124 229 -17 256 -6 77 165 -132 -170 -201 187 -239 -247 19 -15 197 -173 264 -221 -250 204 394
7363 394 112 -128 -207 -101 -44 41 -223 77 -155 42 -26 100 225 -49 -79 -82 -90 21 249 9 47 -26 -383 -97
7387 -97 155 -95 104 -2 -218 203 214 -247 155 -42 -51 -1 264 -89 -200 24 -290 262 153 163 -17 186
7409 186 236 -130 -207 -70 -197 -86 -35 136 -18 -235 -129 -133 -10 -46 -169 43 -49 -111 -64 87 91 186 146 -17
7433 -17 216 96 -262 -78 -46 -91 -57 168 142 -19 141 -91 -166 105 -8 -234 92 -117 -25 -18 -106 42 63 16
7457 16 -78 21 62 0 79 -90 42 329 29 122 283 91 -129 72 83 106 159 -200 -42 -20 -87 53 77 -110
7481 -110 56 -203 -164 133 89 -170 -115 83 -133 103 -33 61 -281 -46 120 -25 127 63 55 78 -115 -31 0
7504@J50k10o6K45Q3J4n3r0l6j65K22q2j51J78p0k4o6N1M8j87L17j36J81o9Q8
7529A72l95L47p3j17J43k11L10l11K76o2J04j6k93pJ46k42L62k6k8J40j57J24
7551A86K7j72j73K63k98P1J13Q1j82K18p0J70j38k3K37l18K00j07k81K84m4j87
7573a43K67N3m79K66n2J28j09lL2j36J26J69j36M7k6j95K84j31o9K6K14k40L3
7596g4Q4J18l05K81l4j42K24j74q4j46K63N1J05k78J25k42P4L11j67J3j10L5N9
7619a3j9k6L50m08Q8pJ53P2l71L71m07QJ94pJ48n1J18k57r4N3J37L2j27k8m2M04
7645B71j82K09n87J50J03J0Q7L9qj2l71J85pJ57m1Jl0J38j16N6j87K22l40J47
7669a06O6L1j44J19L2P3k64J28J74k06K01k24Q9j04l8K64j39j79L47n8j42k8L
$$ plain form
7504 0 150 -60 -126 119 202 216 163 73 37 -128 94 12 -139 39 -31 -55 -121 -70 -22 -209 108 -28 153 84 172
7529 172 -223 124 51 -66 77 -134 176 -135 141 79 183 167 -126 -133 13 -229 133 107 79 219 62 186
7551 186 213 41 -132 131 -167 -96 17 98 -84 134 64 234 96 73 310 -8 192 85 -196 88 44 -143
7573 -143 124 177 -302 -36 -88 40 -69 -72 -40 -176 -50 119 -17 30 4 -191 93 -38 -107 -81 133 -107 -74
7596 -74 10 128 -177 104 70 -72 152 -22 -106 -252 11 62 167 -111 14 -228 -154 157 -10 3 -107 -72 -13
7619 -13 -32 -58 292 -116 -28 -35 118 190 -181 190 -217 -209 -15 -22 126 75 193 -64 -158 -105 32 64 -63 -91 -133 271
7645 271 89 298 -289 -139 -36 -26 61 100 92 80 -291 -106 -113 44 3 4 -26 112 -4 52 -135 87 -253 -106
7669 -106 -40 -9 -153 -34 -2 71 -193 -65 109 -97 104 -120 -31 -135 -173 91 -48 -227 120 62 -80 -108 -105
7692a05J89L1L0Q3q3j00j11k9q1J79m2l5M2R7j26K77k11k42J49K57k44o7P5J95
7716A28j23J00J00l36J06K86k91J22J81r9j4k7j57K05k24N6L5q9J3J76j42p8K72
7739B00k10J22k05P7j40J21l9n8K00J11o1q7pM5j69J87k44J44M7K4oJJ0k38j12
7764b87K08O3kJ2j41qK6P8j18J43l16N29k03l41L35j46Q5j02Q8J97J78j46M7l48
7788a69L64l33K03j72J93j61j92L26j24J5Q8kR7j82K08M7j54J8Ok68M9K6j5L86
7812B54j83N0k35J02K9m5j52J95Q7m36L26p6O5q7m6J6J52l0o5L14m22J45P9j15
7836g8O4k61N18k43M7J68m06N9k38N52k67J0J85R7k43M8m9k07K63j11L06m12L5
7859a63K51M1J13p0k20K65k44J07m6K09j13j72j04N8J13K24l91Q9j29J79j99K25
$$ plain form
7692 -105 84 115 145 228 145 45 -66 -95 -176 3 -39 -74 -32 65 -61 216 5 -237 -88 169 -75 -142 -67 128
7716 128 5 105 205 -131 -25 261 -30 92 273 174 160 133 -24 181 -43 13 48 -41 -28 148 6 -72 200
7739 200 -10 112 -93 -16 -156 -35 -74 -132 68 179 118 31 24 69 -100 87 -157 -13 34 58 52 53 63 -175 -287
7764 -287 -79 -16 -18 -6 -147 -155 -129 -51 -169 -26 -342 187 -16 -357 -22 -168 -83 -185 -97 100 278 132 179 -169
7788 -169 195 -138 65 -107 86 -75 -267 59 -65 -50 38 36 133 -49 159 206 52 70 76 -192 -143 -117 -132 254
7812 254 71 121 -114 -12 17 -28 -180 15 102 -334 -8 -84 -19 -106 -152 -136 16 -14 -79 235 -187 -42 37 -78
7836 -78 -14 -275 243 0 47 215 -191 -132 -370 182 -85 -75 110 207 -36 12 -37 -244 19 -92 214 -198 -163
7859 -163 88 129 242 172 -48 217 -27 80 34 243 130 -42 -146 -88 25 249 -142 -53 -182 -3 -202 23
7881B3k2k25K32J07j62J99k27J91N4k75O8R4Nj30P0M5L0K24m28L18J33k39L5m9
7905G1K04j83p0N1K4k86K01K69k77p0J03k53K41m1k1rK30J76k14m7J2ll02K76
7929H2k1n4Q8JJ67l86m5J28N3r6J82j89l1K12l3Nk23J99P6k0r4K24j27P1j29j60
7955a20k94M58m2j57J4J75j20M92l58P0J72k56J8k73K60R1k85K14J27l1j45j5
7977eM5k45K02o2n3K92J9l6j27n9K2R6k73M51k05O3j13q2J87p2N9l35L82l96R4
8002a51M4j5K52q5j27J59j30N7J28p4j98K71Q7j5k72K7L8J6J75j40J1Kj59l3L7
8027i5K22k4p5m1J25l53O6R6j32K14p1J3K3J64j08L3j82K17L6j45K01l75O0o2
8051a93K45l6k6Q9J06m36M42k91O1m9K03r6j45J98J35m77L6P5l8L20k38J05J49
$$ plain form
7881 23 1 -224 8 115 -47 152 -75 116 170 -105 -37 57 62 -68 2 47 77 301 -127 191 324 85 120 71
7905 71 275 92 22 73 97 -189 12 281 4 -66 37 -216 25 -16 -37 -46 184 360 146 99 111 108 -194 82
7929 82 61 7 95 96 263 -123 -168 -40 13 -83 99 -90 -121 91 58 63 -160 39 115 95 1 225 98 169 40 -120
7955 -120 -414 44 2 -155 -141 34 -86 406 48 118 290 34 52 -221 39 130 -155 59 186 155 10 -5
7977 -5 40 -205 -3 -65 -118 174 193 157 30 -29 -7 89 -184 267 62 125 12 -70 117 45 104 -231 151 -245 -151
8002 -151 -107 -122 130 45 -82 77 -53 4 132 58 -140 131 218 203 -69 -42 -4 12 187 47 58 60 -99 -132 -95
8027 -95 127 103 28 -13 112 -241 -175 -79 -211 3 -68 -55 -32 132 24 57 -125 92 128 -17 184 -191 -131 -193
8051 -193 52 16 -10 79 185 -251 191 -100 -39 -88 115 19 -126 72 207 -270 -234 -159 -197 123 -115 -10 139
8074A39Q9k34R3j86J46q6k2J52k16R0pJ01q2K28k53j0J1q5J63J5k3j01K69l64
8098a73L27k33JL2r6%j96L55m6l0J52r5K14l12K62j51M6J6lj17K33o3k5j53J08
8123E3N4pk60j4L79k76q4J19k58L16M9j0j9l7N1l44M00k82K85j31Q5l4J70j49
8147E6nJ06k68J26J44l49K75P5k4j12J45m34J87P3j51K73j51K17l51O0j57L31
8169F6j06o5J05J13P3m08K94mj89K29k52mO5L4K87l42R9o8K76n9k54L00
$$ plain form
8074 139 228 -6 87 -99 47 -39 -61 91 -125 -35 -42 59 -23 205 -48 -58 -47 -132 31 46 23 -78 191 -173
8098 -173 154 -79 -78 -46 -142 -142 -338 17 -29 -59 93 -2 212 -100 162 11 57 73 70 -47 186 123 98 -55 53
8123 53 107 100 -160 -174 205 -71 -155 -36 -294 22 71 61 42 5 56 -288 112 -170 115 -16 69 35 205 56
8147 56 51 157 -111 15 159 -190 85 160 136 24 169 -265 -78 -5 -156 117 -34 183 -168 -108 -265 66
8169 66 -40 -105 0 113 186 -222 72 68 -121 108 -144 -148 -83 -49 238 -104 -5 -73 203 144 -110 190
8191A90
$$ Imaginary data points
##PAGE= N=2
##DATA TABLE= (X++(I..I)), XYDATA
0@%%%%%%%%%%%%%%%%Qj6J6j6J6j6K2l0L2l6M4m8N6o6P4q6R8j10J23j39J58j78
38i4J97k20K46k72L02l35L70m09M51m96N48o04O65p32Q06q92R86j090J212j350
58g11J509j700J929k208K560l022L656m578O051q774J5424n9874p6281J66356
72D0337R3757p7868p3141M5795L6301j1954k3068l7580m9551L2464P6123k4612
84B7003j02870J0912J12770J7262r9986l3662O5242L2521l3874k3633k334N585
96b5064L2213K6882l7384m0623M6064O0896k9807m9119K4434L5593j9124j7284
108G677N754k6204l0182L1855K8975n0504m0233N9266O2143l4448m7017L3427
120E09M1731k3797k7677Q786p629j9011K9666L0271m1995l2639O2106N3605n5192
$$ plain form
0 0 0 0 0 0 0 0 0 0 0 0 0 0 0 0 0 0 8 -8 8 -8 8 -8 14 -16 16 -20 24 -24 32 -34 40 -46 52 -58 65 -74 84 -94
38 -94 103 -117 129 -143 159 -176 194 -215 236 -260 288 -316 349 -383 423 -469 517 -573 639 -711
58 -711 798 -902 1027 -1181 1379 -1643 2013 -2565 3486 -5288 10136 -49738 -126019 40337
72 40337 134094 56226 -16915 28880 65181 53227 30159 -7421 -56972 -24508 51615 27003
84 27003 -75867 -64955 47815 65077 -34909 -68571 -3329 29192 -4682 -28315 -30649 -25064
96 -25064 7149 34031 -3353 -43976 2088 62984 33177 -15942 8492 44085 24961 7677
108 7677 13431 -12773 -42955 -11100 17875 -32629 -72862 -13596 48547 14099 -32918 509
120 509 42240 18443 -9234 -448 -8077 -27088 2578 32849 -9146 -41785 20321 73926 18734
133A8734n9481L7536M6400l5066m9884O723K1231O50K082N75j4278Q962M3547
146B7731J0928m1298j2999M6264K1069m1079k9291K1572J7489j6044j6841k539
158a5038N73J1177J3366j5298k0631K0489K8195k1576l1725J6081K3811j7892
170h468j8218J8459J5495q980M917K1368j18j2354J1628J0944k2416j9475J3876
183F658K216l1638r882K6612L182k6567M326L3175Q70k2690P794K1727p506j4637
197f360Q003N838j1089K44J2501n052j0907J1211J4882j1025j2617J1241R803
210A6673j4368j2532P808K786j2090k433Q546j152m797R484Q622o741j018J2862
224A1650l32j3863J703J0903p486j4457P394J1730q059r777R692R951o797n743
$$ plain form
133 18734 -40747 -3211 43189 8123 -41761 -35038 -13807 -13157 -11075 -10500 -24778 -15816 27731
146 27731 38659 -2639 -15638 30626 51695 10616 -18675 2897 20386 4342 -12499 -15038
158 -15038 -14465 -3288 10078 -5220 -25851 -5362 22833 1257 -30468 -14387 9424 -8468
170 -8468 -26686 -8227 7268 -1712 3205 24573 24455 12101 23729 34673 12257 -7218 6658
183 6658 8874 -22764 -32646 -6034 -2852 -29419 -25093 8082 8952 -13738 -5944 15783 8277 -6360
197 -6360 1643 7481 -3608 -3364 9137 4085 -6822 4389 19271 8246 -4371 6870 16673
210 16673 2305 -10227 -2419 367 -11723 -14156 -5610 -6762 -11559 -2075 6547 -194 -1212 11650
224 11650 11318 -2545 -842 10061 2575 -11882 -4488 7242 -817 -10594 -902 9049 2252 -3491
238c491N201K404n555J68L005o604l730R722M964j0768l569J5609P426j2484n658
253c360J0453L738r827n554J668k470j277L064k743o191N885J2190k988j0116
267g528N489J2677k153j0921R00Q366j519n639R99K231k452J634L865m435n584
282d070N969N200q721o973O640L972p934l295N955J835l165J235M766j143j396
297a125M110K311m302j047N002ln451N38M743j909n115K996L531m492l470M408
313G25K768n675j082M454j23m088R01J761k444j306L366j44k935J178N201j40
329B417l937Q99M147k61l807m14K794j04j471J493N39r64R91J768k403l461J808
346C4K466l646l193L103J970k350j409J196N76k050l6M09j28J60K373K098Q1J130
$$ plain form
238 -3491 1710 4114 -1441 -1273 1732 -4872 -8602 1120 6084 -4684 -8253 7356 14782 2298 -3360
253 -3360 7093 10831 1004 -4550 -2882 -5352 -6629 -3565 -6308 -12499 -6614 5576 2588 -7528
267 -7528 -2039 10638 8485 -2436 -1536 6830 5311 -328 671 2902 450 2084 5949 1514 -4070
282 -4070 1899 7099 -1622 -8595 -1955 2017 -5917 -9212 -3257 -1422 -4587 -3352 1414 271 -1125
297 -1125 2985 5296 994 -53 4949 4946 -505 33 4776 2867 -2248 748 4279 -213 -3683 725
313 725 3493 -2182 -3264 1190 1067 -3021 -2120 -359 -2803 -4109 -743 -887 -3822 -2644 2557 2417
329 2417 -1520 -621 3526 3265 -542 -956 1838 1734 263 1756 2295 1331 2322 4090 1687 -1774 34
346 34 2500 -1146 -4339 -1236 734 -1616 -3025 -1829 -1253 -3303 -3339 -2930 -3058 -2898 -525 1573 1654 2784
364B784K208M78k477j093Q66j616l041j11K523k1j122J733J463j132j087%j971
381a616k087M45J031j166j87K333K396k58r40M14P73k53r33n80N98J006O34O28
399B238q84j047R41M7j829j360K97J158Q16J520m10j041J409K105k830m631n26
416d027K491K42j891M06K527K878Q99o71k645j781L13K90k656m356R05O905L292
433C121l118j123O247N516k622n727q78K622Q74l419m343j099K433J775j661m605
449f007k216M009N010k291n663J559R259L866o142n007M049N795k100o567j376
464c822L615L846N56j402k392O53M178K204o844q676L181Q420j550j0482j007
479i522J0202N347n761n805K961M907k48l086k526q64K588N937R87o650k829R179
$$ plain form
364 2784 4992 5470 2993 1900 2766 1150 -1891 -2002 521 500 -622 1111 2574 1442 355 355 -1616
381 -1616 -3703 -3258 -2227 -3393 -3580 -1247 1149 891 -49 365 1138 885 -48 -628 -30 976 1610 2238
399 2238 1354 307 1248 1295 -534 -1894 -1597 -439 377 1897 1487 446 1855 3960 1130 -3501 -4027
416 -4027 -1536 -1294 -3185 -2779 -252 2626 3525 2854 209 -1572 -1259 -969 -3625 -7981 -7076 -171 3121
433 3121 3 -1120 5127 10643 8021 2294 1416 4038 4912 1493 -2850 -3949 -1516 259 -1402 -6007
449 -6007 -8223 -4214 796 -1495 -7158 -5599 3660 7526 1384 -3623 426 6221 4121 -2446 -3822
464 -3822 -207 3639 4195 2793 401 1054 5232 7436 592 -8084 -4903 3517 1967 -8515 -9522
479 -9522 680 6027 266 -5539 -2578 2329 2081 -1005 -3531 -4395 -1807 4130 5117 -1533 -4362 4817
495D817P395p590j0572L255R558q25r753m191N699N101j422n215j753K755M957
510B216K248l135o217J973R132K210j0457p480P189R781m433j1997L54J1524M506
525G414p155n472M106N177J25k927k994k796L573O754j758j0170n51J2862N985
540A2173j1097p921Q096Q992n661j0238k19N001j0l305j784j050k31N627N524
555C897l668n292N184J0648q78j0572k460P901L765o701p126K352N385N82l371
570c54j882n9J500K461J63m639l914M850O923l030q890J66R863L076q813n278
586g857O457O001k357m694J300L160R26R65n3m532k118O525L279p589o374O242
602g19P941m059r192P95O957N62n863k431K601K677J308M53j291o66L049L458
$$ plain form
495 4817 12212 4622 -5950 -2695 6863 6038 -3715 -7906 -2207 2894 1472 -3743 -5496 -2741 2216
510 2216 4464 1329 -4888 -2915 6217 8427 -2030 -9510 -2321 7460 3027 -8970 -8616 2908 7414
525 7414 259 -5213 -1107 4070 4195 1268 -1726 -4522 -949 5805 4047 -6123 -6674 6188 12173
540 12173 1076 -6845 1251 10243 4582 -5656 -5875 -874 -884 -4189 -5973 -7023 -7254 -1627 3897
555 3897 229 -5063 121 10769 9891 -681 -3141 4760 8525 1824 -5302 -2950 2435 3017 -354
570 -354 -2236 -2295 -795 1666 1829 -2810 -6724 -1874 5049 2019 -6871 -6705 3158 6234 -2579 -7857
586 -7857 -1400 4601 2244 -2450 -1150 2010 2936 3901 3848 -684 -2802 3723 7002 -587 -6961 -719
602 -719 7222 3163 -6029 -5234 1723 2285 -3578 -6009 -3408 -731 577 1030 -261 -927 2122 5580
618E580k484n468p81M215J132l921k609K424M858L14l160j378K540J862r57k219
634e2o76L28J068J245r77k751r86L460J465l921l852K616M464o43m034M08L946
651A108J782k595j422J2J082J330O76k575j076L335L538k161l947N72L736J92
667C587m873k198K076K119j103j928k41J396K093o26k110q50K165J469q23j728
683a575M70K451M60r82j314J47J413K81j336j208J290K137n67j281J26J120J13
700A745j127q66p4n10m0j18j61o58K01J321j76p22M22L58K9j59Q9K44l49L44P23
721E16j51l81R35J480k55o20O8O58p9r42j136k4k33l55j164l73J9M53O07j200
741b177J68J055J009n29n30O72Q60J71n70r4L16Q53M10m48j59P04P41n60j140
$$ plain form
618 5580 3096 -2372 -3153 1062 2194 -1727 -4336 -1912 2946 3260 100 -1278 1262 3124 2167 -52
634 -52 -728 -400 668 1913 936 -1815 -2801 659 2124 -1797 -5649 -3033 1431 788 -3246 -2838 1108
651 1108 2890 295 -1127 -1115 -33 1297 1973 -602 -1678 1657 5195 3034 -913 -341 3395 3587
667 3587 -1286 -3484 -1408 711 -392 -2320 -2561 -1165 928 302 -1808 -2658 -493 976 153 -1575
683 -1575 -1105 1346 1806 824 -490 -343 1070 1351 15 -1193 97 2234 1667 386 512 1632 1745
700 1745 618 -248 -322 -832 -872 -990 -1151 -1809 -1608 -287 -463 -1185 -763 -405 -376 -535 -446 -202 -551 -207 516
721 516 365 -16 919 2399 2144 1524 1592 2250 2171 1229 93 69 -164 -519 -1683 -2056 -2037 -1584 -977 -2177
741 -2177 -2009 -954 55 -474 -1004 -332 528 699 129 35 351 1204 1614 1166 1007 1711 2452 1892 752
760G52k6K97o41j517r91J71L28m23n6L60J158Q90J81j27j71P98Pj146p91M42L36
781a69J23m11L90Q74Q03k78n26k03L58l71r79l18Q6k76L19NJ4P10O08k19P0L72
803I82K00o57k45k45r29m23lo26l07O20L23K20N90R85O13L64j18L71n72j12n02
824E29L47m59l51L05O87J84K7m05K79m29r21o37q33r17K27k3n22o1R10J066O44
845c53O90Q35R09J85J05m44p6l43P2o86p22o77J162J67m53q76Q26J44o33n68n05
866a241k69o11j08O5k95Q14J128N55J75M50J015L2l11k9J80p70l29L34k90j020
886e25jJ132k04p74k71J054K39o79J71R0n62k0L28m91j184N0J819L51j287K57
906e07J440P13q19p06p7k65n26k85l39j12P45J399M32J6K6P01P71p74j162p59
$$ plain form
760 752 726 1023 382 -1135 -2126 -1955 -1627 -2050 -2106 -1746 -588 302 483 356 185 983 990 -156 -947 -505 -169
781 -169 -46 -457 -67 807 1610 1332 806 603 961 590 -389 -707 -621 -897 -578 -573 -559 151 759 540 610 982
803 982 1182 525 280 35 -894 -1317 -1320 -1946 -2253 -1633 -1310 -1090 -500 485 1098 1462 1344 1715 1143 1031 529
824 529 876 417 66 371 1058 1242 1269 864 1143 714 -207 -844 -1677 -2594 -2367 -2390 -2912 -2973 -2063 -997 -353
845 -353 337 1172 2081 2266 2371 1927 1851 1508 1580 894 172 -505 657 824 371 -505 321 465 -168 -736 -1241
866 -1241 -1510 -2121 -2229 -2164 -2459 -1645 -517 38 213 663 1678 1710 1399 1370 1550 780 451 785 495 -525
886 -525 -526 606 402 -372 -643 411 650 -29 142 232 -330 -350 -22 -513 -1697 -1647 172 523 -764 -507
906 -507 933 1646 827 121 44 -221 -747 -1032 -1371 -1483 -738 661 1093 1109 1135 1836 2607 1833 671 -88
926h8K92K00l24j871N09J223j74j563m84J208j6m82N98Q98l48O52J564K54k369
945c21M9K038J30l063j026K858J374j739q19J831M16j204r9M78j402j141J746
962A06O47j991j091K426J841k064k473R26J662m17j350O4J415R73L39j16p9k09
980F09N67K34j001j075m6J081J306q11j374L72K685n25l341q16K171K93k232p02
998b605K114L11p99R67J234j562j735K261J135l130j705L368K927k619j760K954
1014A356K774j708j775J181K76j436k06J184j707j888N31J822j615k706Q57K558
1030e02J39j982K65K371J020p14l64L75L47K50q43q61L84Q41O32L16J29n78k80
1049I45J077m33k873k350J987J076k581j549K789K697j044q8K131J130j379m6
$$ plain form
926 -88 204 404 80 -1791 -1282 -59 -233 -1796 -2280 -1072 -1088 -1570 -972 -74 -422 230 1794 2048 -321
945 -321 -272 1766 1896 -1167 -2193 665 2039 300 -519 1312 1728 524 425 903 -499 -1640 106
962 106 753 -1238 -2329 97 1938 -126 -2599 -1673 -11 -428 -1778 -1714 -299 674 1013 897 818 609
980 609 1176 1410 409 -666 -712 369 1675 864 -510 -138 2547 2022 -1319 -2135 36 329 -1903 -2605
998 -2605 -491 -180 -979 -12 1222 -340 -2075 186 1321 -1809 -3514 -146 2781 162 -1598 1356
1014 1356 4130 2422 647 1828 2104 668 462 1646 -61 -1949 -1418 404 -1211 -3917 -3060 -502
1030 -502 -363 -2345 -2080 291 1311 597 233 608 955 1205 362 -499 -115 726 1358 1674 1803 1225 945
1049 945 2022 1589 -1284 -3634 -1647 -571 -3152 -4701 -1912 785 -259 -347 1784 2914 1535 1489
1065A489J139j062k946P73K037k213l120J668L166j118k200J836K407r97j191
1080c32J088O34j561k81J019q80j287J000J914k06n85N71J446k39j207n22r68
1097c96p04r21n01j396L01J236M35k56J591J428Q06O5P26K52j303J95L75p07j506
1116b80L82J577m73j311J107J298j097j862L43L5k330q66K42j71j266J152K217
1133a303P66n09K176K504N6q12J005K67j706j098j78r84j901K55O49o75n27J315
1151g00J114p79o39R38l35j108n73P70n02n54J289J609J57N68J795N56n43k95
1169B768M90j639k065l53m94j617j006R92N05K07R36J995N49n64R57J151j028
1186A784j440J25J75j171n17P80M18n61Q69J069k97j278M74M08k055j421J35L56
$$ plain form
1065 1489 2628 1566 -1380 -607 1430 -783 -3903 -2235 931 -187 -2387 -551 1856 859 -332
1080 -332 756 1390 -171 -452 567 -313 -1600 -600 1314 1108 523 1094 2540 2301 1094 572 -396
1097 -396 -1100 -2021 -2522 -3918 -3617 -2381 -1946 -2202 -611 817 1623 1688 2414 2666 1363 1558 1933 1226 -280
1116 -280 102 1679 1206 -105 1002 2300 1203 -659 -316 -281 -2611 -3477 -3235 -3406 -4672 -3520 -1303
1133 -1303 -537 -1046 1130 3634 3690 2878 3883 4150 2444 1346 1168 184 -1717 -1462 -813 -1488 -2015 -700
1151 -700 414 -365 -1004 -66 -401 -1509 -2082 -1312 -1814 -2368 -1079 530 687 1255 3050 3606 3063 2768
1169 2768 3258 1619 -446 -799 -1293 -2910 -3916 -2924 -2419 -2212 -1276 719 1268 704 1661 2812 1784
1186 1784 344 469 644 -527 -1044 -264 154 -407 462 1531 1234 -44 430 838 -1217 -2638 -2503 -2147
1204b147j743O83J472R53K78J670K132N15l69Q52Lj636j844K08q16k247l98L89
1222b045k3l44Q23J027k83l04R78m9r36m44N90P2q81J133J550N3P45J259J151
1241D072l93m34L27j098j571j002k87j944j225k9P50o65M82J760J151l20P60J339
1259A673m10q69k34K83p45m15O76R67j82M25J026M79r60j15j89j033j827l01l27
1278b078j012l00P28O44O94P56J680P21j0P45K4p86r83L9l00j383k89J69j54k27
1298a322N63N91J83l08P03L84p46p19M01n23m43K30N49L85M67J077Q84K69n27
1317B098K51n30j462o25p21j005j161j23P88NK78J393J066j22J75J063p1l84j63
1336G50N7l79k72L30Q88n04r0L82K87n33m10J09m34j332o34L65p13l47N2N26L17
$$ plain form
1204 -2147 -3890 -3207 -1735 -782 -504 1166 3298 3813 3444 4296 4299 2663 819 1027 211 -2036 -2434 -2045
1222 -2045 -2068 -2412 -1589 -562 -845 -1149 -171 -220 -1156 -1600 -1010 -938 -1819 -686 864 917 1662 2921 4072
1241 4072 3679 3245 3572 2474 903 -99 -386 -2330 -3555 -3584 -2834 -3499 -3017 -1257 -106 -426 334 1673
1259 1673 1263 394 160 443 -302 -717 -41 926 744 1169 2195 2674 1714 1599 1410 377 -1450 -1751 -2078
1278 -2078 -3090 -3390 -2662 -2018 -1324 -568 1112 1833 1823 2568 2592 1806 823 862 562 -821 -1110 -941 -1095 -1322
1298 -1322 -759 -168 15 -293 410 794 48 -671 -270 -793 -1236 -1006 -457 -72 395 1472 2356 2625 2098
1317 2098 2349 1819 357 -268 -989 -1994 -3155 -3278 -2490 -2485 -2207 -814 252 130 305 1368 1297 913 750
1336 750 807 428 156 486 1374 870 780 1162 1449 916 506 615 181 -1151 -1785 -1420 -2133 -2480 -2428 -1902 -1585
1357a585K71J149P71L90N02M48l5l63N5m96p08m06l91jJ18K57L46nk70N20k59
1378C08m88n51m78J95m28K64J93N27j2N54P01J07K30j03o6m7m75m33k15P0m36
1399e83k5j3J19M48J39P6K45J86J94k40p8k53k94N8l90R6l42K08J95L07j81J34
1421FL87l15k96j20J31l48j5k44O15M7j72P88L96r2n2J20P3j46n14j20J70j83
1443A16n68L70O5l48m39L91Q2q3m64N05L78k34o24N00L88k64J9L22N91k09j71
1464C23M17R7l62k37K92N9k38k70R4J09o46k31M95m1k66k65M76J15j16l89K79
1485c05N64n25j88L30J53j22j87K53K16k16r7M85L17j97l78O02L65n66k03N06
1505H07K83r99m06M16k18n62j95P18l51k54Q5N21K4o41K18P76k53k96l5P40j1
$$ plain form
1357 -1585 -1314 -165 606 996 1498 1946 1911 1548 1603 1107 399 -7 -398 -399 -281 -24 322 317 47 567 308
1378 308 -180 -731 -1209 -1014 -1442 -1178 -985 -458 -470 84 785 892 1122 1019 953 906 431 -2 -217 -147 -583
1399 -583 -608 -621 -502 -54 85 161 406 592 786 546 468 215 -79 -21 -411 -315 -657 -449 -254 53 -128 6
1421 6 393 78 -218 -338 -207 -555 -570 -814 -199 -152 -324 464 860 768 716 836 909 763 249 129 299 116
1443 116 -452 -82 -17 -365 -804 -413 -331 -414 -878 -373 5 -229 -853 -353 35 -229 -210 112 703 494 323
1464 323 740 837 475 238 530 589 351 81 175 284 -362 -593 -98 -139 -405 -670 -194 -79 -195 -584 -305
1485 -305 259 -266 -454 -124 29 -93 -280 -27 189 -27 -124 361 678 481 103 705 1070 504 301 807
1505 807 1090 91 -315 101 -117 -679 -874 -156 -507 -761 -676 -155 -131 -772 -554 222 -31 -327 -362 378 367
1526C67m39O06K00J12k8J66K2k54n15l2k56l02m67pP52p81K0o9Q21K52l64J09
1548h7P16n0p44m5K27r1j22P6N46q9k94K99L84j36m17J09L99n21r69K81M90m22
1570d60k96M25M69j54J49N33K14m00j49L84j82j095K78r3k19k50J1L80L50k69
1590c74L63L24J21q0j14J94k33p8K66L5m50M00M1K00j41J43k04j20J40m70o79
1611g16J5n9n26q8Q9M60j46M47P73N34l66L59M35P8n87m18N32k91l23n7L84l65
1633A64l7K67Q3m30o8l30O6p56k72N02q9m60L84N43L33m4N26L09L26l53L02j36
1655H30n98K01p2o92k5LJ23p7j13P61k38k94M02K52m12k22q4Ok98M9J36J92K76
1678A06O5N42j70k55L31k34j68p80J00O9j29j1J75J75kK07N39q9O9K52L2n29j87
$$ plain form
1526 367 -72 534 734 846 818 984 1006 752 237 205 -51 -353 -820 -827 -75 -856 -836 -905 -84 168 -196 -87
1548 -87 629 579 -165 -210 17 -74 -196 -120 426 337 43 342 726 590 173 282 681 160 -809 -528 -38 -460
1570 -460 -756 -331 138 -16 133 666 880 480 331 715 533 -562 -284 -377 -596 -846 -835 -455 -105 -374
1590 -374 -11 313 434 354 240 434 201 123 389 424 -26 374 415 615 474 617 413 293 433 -37 -716
1611 -716 -701 -760 -1286 -1374 -1285 -825 -971 -524 249 783 417 776 1211 1289 702 284 816 525 202 145 529 164
1633 164 127 394 477 47 -21 -351 -285 -1041 -1313 -811 -900 -1360 -976 -433 -100 -144 382 691 1017 664 966 830
1655 830 232 433 361 -331 -356 -353 -230 -307 -420 341 103 -191 211 463 51 -171 -255 -249 -547 -498 -362 -170 106
1678 106 171 713 543 288 619 385 217 -563 -463 -394 -523 -534 -359 -184 -186 21 560 471 540 792 824 295 108
1701A08O8N6o33j33M76n4l28O9M98n32N5L27O1m02Q6j34j9l17L19P59j69k0L92
1724E33J33P3k4L77m20k83j72M2k81j83j60l06K98k57R0L77j01k08K93l0q1l4
1746c24M60k45m3K71J34O9j7L15p5L3k19K29k3k89k82r1o0O9k9q2Q9r3J74j71
1770b00l78M60L05l72J43J20q1n4k61L39N5k99K66R4J21O3k39N09j59k52n7L28
1792D51o54M10j19K41o13L40J80R5o36K28J0k63k2J84j2l79J34M0K95j25oL80
1814A59Pn2O15p48M12k3J14j92j27J79k03P7j32j49j57Q8K6MN3k84J60J05j32
1837b00j10O8L23j91k09K19M14n26M6L41P0m09J43K99O4L6K13j68r1j37k45j6
1859f6j61J75j4J70j15Q3j47m2k4k3K67m35LJ18k13P1L0J54O3j86L37qJ17j75
$$ plain form
1701 108 176 232 -401 -534 -58 -112 -440 -371 127 -405 -350 -23 38 -364 -278 -412 -431 -748 -429 330 161 141 533
1724 533 666 739 715 1092 672 389 217 259 -22 -205 -365 -671 -373 -630 -540 -163 -264 -472 -179 -209 -290 -324
1746 -324 136 -109 -152 119 253 322 305 620 545 578 359 588 565 276 -6 -97 -157 -88 -117 -199 -110 -203 -29 -200
1770 -200 -578 -118 187 -185 -42 78 -3 -57 -318 21 76 -223 43 137 258 321 82 591 432 180 123 451
1792 451 -203 207 88 329 -284 56 236 331 -305 -77 -67 -330 -352 -168 -180 -559 -425 -385 -90 -215 -221 159
1814 159 166 114 729 -19 393 370 484 292 165 344 141 218 86 -63 -220 -132 -106 -102 -49 -333 -173 -68 -200
1837 -200 -310 -242 81 -110 -319 -100 314 -212 -166 175 245 -164 -21 278 342 378 591 423 332 195 -50 -66
1859 -66 -227 -52 -66 104 -11 72 -75 -117 -141 -164 103 -332 -329 -211 -424 -353 -323 -169 -106 -292 45 37 154 -21
1883b1M82k11k39L16PRl09K45K45k97k05L15p0m43pK20m67j55J21o4p9j55M34
1906c28k04K82J26K74rP7K29P7r8L7Pl33N5k8L8K9j94J22J41k90l3m1J6j86j07
1931c41M3O4j79j33J79N3J09J12L50kKj43K24j34q4n2n6j02j60J04K37o9R3n6
1955E9J41J61l71M30p4K8o03L3M2n4k26K29J54m4p1jL34j82P0j44K3J08l12k98
1979e68O61r6J09j86L53J86j92Q3J84j90k84J37K53k26n15J9n4Q1j8J36J07j63
2001a83l32j03L47O6k01J16K19p5q8L95K55j36P7L27J55q5k38j66N8n24N2P7j35
2024a22j66k0K13j26k37K54j02K53k30j36L43J4k50J53j62L36k34M51p8J71j69
2045A56M7J00j49J03l75N9oR0m32K45k4J25j39L09J13k42k24O0K71j74m28L01
$$ plain form
1883 -21 461 250 11 327 334 343 34 279 524 227 22 337 267 -176 -183 37 -430 -585 -464 -528 -607 -762 -328
1906 -328 -532 -250 -124 150 141 218 447 524 426 463 470 137 192 164 202 231 37 159 300 10 -23 -64 -48 -234 -341
1931 -341 -298 -234 -413 -546 -367 -314 -205 -93 257 255 257 114 338 204 120 68 12 -90 -250 -146 91 22 115 59
1955 59 200 361 -10 420 346 374 -229 -196 -154 -208 -434 -205 -51 -95 -166 -167 167 -15 55 -89 -66 42 -270 -568
1979 -568 93 -3 106 -80 273 459 267 350 534 344 60 197 450 224 -291 -272 -326 -245 -263 -127 -20 -183
2001 -183 -515 -618 -271 -205 -406 -290 -71 -146 -234 161 416 280 357 684 839 754 516 350 408 -116 -64 13 -122
2024 -122 -288 -308 -95 -221 -458 -204 -306 -53 -283 -419 -76 -62 -312 -159 -321 15 -219 232 154 325 156
2045 156 203 303 154 257 -118 -59 -65 25 -407 -162 -186 -61 -200 109 222 -20 -244 -184 87 -87 -515 -214
2067b14p0P7P3K05J1k72J61L44j29j07J54J96m14J36k53R7L07l96K81J40k43n0
2089C4j34K72l49K62M6pl10k21j36O0P9K4K47r1K0K60J84R4P7r1j11J83J6k1k05
2114A82Qq0O3j45J48k89J33M4k78K0p2K41r9l8m1K16J94m34j44K86K3j55P6J43
2138BJ26m69L76L89j28k48K26J85k05n2j79P1k43P0J38j07j90K14K53j13j36j05
2160a25k33K6J07P5k58L8K76j07N3N2K02QQ5P7KK67n61K13J17j15N1j52Q0k04
2184b6QJ0j28k5QJ1j40k29K80q7m02J42K19K19P7J83K27p0k7K09j88R1j39m7n1
2209A25j00p9J15k16K1pL37k21j99R0O0l38j65J40K34j41K01J85o6N3K25J58O0
2232D72j17Qk7m83o8J2l57j91P8M97L39j96J68J72q3K87l7l3k94k58N7p1j58P1
$$ plain form
2067 -214 -284 -207 -134 71 82 -190 -29 315 186 79 233 429 15 151 -102 -5 302 -94 187 327 84 34
2089 34 -100 172 -177 85 131 124 -186 -407 -543 -483 -404 -380 -133 -224 -204 56 240 334 411 320 209 392 408 387 182
2114 182 190 110 173 28 176 -113 20 64 -214 -194 -266 -25 -124 -162 -203 13 207 -227 -371 -85 -62 -217 -141 2
2138 2 128 -341 35 424 296 48 274 459 254 202 23 94 -149 -79 59 -48 -238 -24 229 116 -20 -125
2160 -125 -358 -332 -225 -150 -408 -370 -94 -201 -148 -96 106 114 199 276 278 545 -16 197 314 199 250 98 178 -26
2184 -26 -18 -8 -136 -161 -153 -142 -282 -511 -231 -318 -720 -578 -359 -140 -63 120 347 277 250 459 271 362 223 176 125
2209 125 25 -54 61 -155 -134 -141 196 -25 -224 -134 -74 -412 -577 -437 -203 -344 -143 42 -24 29 254 412 472
2232 472 355 363 336 -147 -215 -203 -560 -751 -673 -176 163 -33 135 307 224 511 474 441 147 -111 -54 -125 -283 -212
2256b12J35k97J16M6K25K9j49J00k62k03L60r8j45l27O21J14L4J56L18K34k34
2277E61J29J97k94k34L1k36m69l43K36j21L5j4Q8M99n05K73J86j56r3K09k41J74
2299h8N2L0L93L3J57J25N2J90K0l82j95m61l58Rl20q5NJ19j49N70K09J67j4L32
2323D11j01k42m9K01m18n4M79J39l06J25K19p9J35j36R4l02j06o55K33P9l26J55
2345e04K34O2K44N23k49K00J5L76m10k00O8l14l72k33R8Q6l51O41l7J11l4L27
2367B81j7J90p41K21k22K87k76J8K73L27K7O58k39k10Qj2R2j037Q4n32j67P6j37
2390a048M3M03K86J31J41L59J68J05J01m55J74k08o5m4K08j95K45J05k82K56J33
2411E61m39j11l25k16j61j55N5K8K81j07L99J97L84Q8qK76q3Jk53l7j77k32k00
$$ plain form
2256 -212 -77 -374 -258 -212 13 42 -107 -7 -269 -472 -112 -210 -355 -682 -61 53 87 243 561 795 561
2277 561 690 887 593 359 390 154 -315 -658 -422 -543 -508 -522 -434 65 -440 -167 19 -137 -230 -21 -262 -88
2299 -88 -36 -6 387 420 577 702 754 944 964 582 387 -74 -432 -423 -743 -828 -823 -704 -853 -283 -74 93 79 411
2323 411 310 68 19 220 -198 -252 227 366 60 185 404 325 460 324 418 116 10 -645 -412 -333 -659 -504
2345 -504 -270 -208 36 559 310 510 525 901 491 291 359 45 -327 -560 -462 -376 -727 -86 -123 -12 -46 281
2367 281 264 454 -287 -66 -288 -1 -277 -259 14 341 368 1026 787 577 585 573 665 -372 -288 -820 -987 -911 -1048
2390 -1048 -1005 -602 -316 -185 -44 315 483 588 689 234 408 200 135 91 299 104 349 454 172 428 561
2411 561 122 11 -314 -530 -691 -846 -791 -763 -482 -589 -190 7 391 479 471 747 664 665 412 375 198 -34 -234
2434b34L3J93l32L12R6J52j71n9Q5l8j44k52L31m23N1J12L21O3N0K89P1r0j16
2457C00P1j85j04m80K11L6l43J17j05K25N06j98K0L75q5J7p9o1k82l5K74L3k71
2480d3k45K76K51j49L32l15p4j66k99J96o0K43j88L3L05k7p2K12J39L33j79Q9
2502E92j7j79k21o8j81k14r2K83N4j8r0M9J17o5j83j50K10J5k37K4J35L50l62
2525b48K58L23J21m7J29j62L1m1q6k48j18L51l41L0j22j45K51K00J21J14l18R7
2547A50l4k27J19J17j67j69k5J77K84j68K63l12K16J58k75K90l38k1j59L16j36
2568E9j31J17j18M49l94O8J59m78K17Q2j31K9n8K13j57j63J92j73J46m8J90p2
2590bK60j5J22k72n0Q6J8J4k2K8q8K6K9k15k1r7K92j25j16J43K48j13j78p3J91
$$ plain form
2434 -234 -201 -8 -340 -28 68 220 49 -10 75 37 -107 -359 -28 -451 -400 -288 33 96 146 435 506 416 300
2457 300 371 186 82 -398 -187 -151 -494 -377 -482 -257 249 51 71 446 361 378 299 238 -44 -79 195 228 -43
2480 -43 -288 -12 239 90 422 107 33 -133 -432 -236 -296 -53 -241 -208 97 70 -2 210 349 682 503 592
2502 592 575 396 175 107 -74 -288 -380 -97 -43 -61 -151 -102 15 -50 -233 -383 -173 -158 -395 -371 -236 114 -248
2525 -248 10 333 454 407 536 374 405 364 278 30 -88 263 -78 -48 -170 -315 -64 136 257 371 53 150
2547 150 116 -111 8 125 -42 -211 -236 -59 225 57 320 8 224 382 107 397 59 38 -121 195 59
2568 59 -72 45 -73 376 -18 50 209 -269 -52 30 -101 -72 -130 83 -74 -237 -45 -218 -72 -120 70 -2
2590 -2 258 243 365 93 43 129 147 161 139 167 79 105 134 -81 -102 -199 93 -32 -148 -5 243 130 -48 -121 70
2615G0k38k4L51j10k79K25q7J25p3K44KJ15k57R8Q7j05N0m51N32l87K8M0J35j2
2639G9Lp3R7k72J18Q8q3o1k0J43j56J2J4j29o6M42K0k1No9j70K08K2k80K15N5
2665A21J05J33n06L88p2o4j33M3J12k41j85J28j6j96J25P6J21P0M6L03j51J92
2687C99k62L73l29L9J0j31j78J13nk00L50l08Q1N3R2r8j63k62n1L62j13j89J39
2710b78L85m54L36J62M0r9L78j90J6k34Q6K05m42q5Q2M6J0j08M5M55j82p7Q8N7
2734B42l15k9l3M1r3K46R7k85J26K49j12n2j21J90k10Q5k24O6J34j30L85k58o3
2757f4j14K37K52l35J77j82J97JJ36j77q5j09R3n7l81J86J68l7j78K47Q9k03K8
2780a11Q0n0M0l3l2K41NN5J61l2Q1j61N6j26j52M0j27j19N0j58K13m8J05k48n4
$$ plain form
2615 70 -168 -192 159 49 -230 -5 -92 33 -40 204 206 321 64 162 249 144 194 -257 275 -112 -84 -44 91 79
2639 79 82 9 106 -166 -48 40 -43 -104 -124 19 -137 -125 -111 -240 -306 136 156 135 140 71 -99 109 131 -149 66 121
2665 121 226 359 -147 241 169 105 -28 15 127 -114 -299 -171 -187 -383 -258 -182 -61 9 55 358 207 399
2687 399 137 510 181 220 230 99 -79 34 29 -171 179 -129 -48 5 97 -1 -164 -426 -477 -115 -228 -417 -278
2710 -278 107 -347 -11 151 191 92 470 280 296 62 148 353 -89 -174 -92 -46 -36 -144 -99 356 174 97 185 242
2734 242 -73 -102 -135 -94 -187 59 156 -129 -3 246 134 82 -39 151 -59 26 -198 -132 2 -128 257 -1 -64
2757 -64 -178 59 311 -24 153 -29 168 169 305 128 43 -66 27 -30 -411 -225 -57 -94 -272 -25 64 -139 -111
2780 -111 -31 -81 -41 -74 -106 135 140 195 356 324 405 244 300 174 22 62 -65 -184 -134 -292 -79 -127 -22 -270 -324
2805c24l3J91k8K86m51P73m15k31J2K51M14n11K66k10LJ44O9p9Pj47R0k99j28
2828c50Q0J42j5nJ85j17K33K02p7m26R7K05k0m08M90l17J23N5o4K35PJ30l64L4
2852E5l9J92m58L82j46j12K66o2o6O0M8r0J24R4k1k23j38J69R1l62L19m7j33j23
2876b20L0J74j57j81N45j68J35k66M15J53m96M2J78q6p7k1K55o3n8j72J43m17
2898c12J35J16J5l69R5k27L08l46O13p3R0K37j55O9nj31j57K07K96l03j06j69
2920a72K72j4k51K55j79L37j14j73k7K25j69p4Q9K07m21L6J04M5j33j81J55J07
2942g6N3K90n7k88N2q2q9K52j3Pj05J08L4L08l03K05l26J76k97K55p1k55K54L5
2966F7L3m10L31J29j37k9j62M85k07p8L47o73M98J28j04k79N0l1K68j90R6J6k12
$$ plain form
2805 -324 -357 -166 -194 92 -359 414 -1 -232 -220 31 445 -66 200 -10 -7 137 206 127 134 -13 77 -222 -350
2828 -350 -270 -128 -143 -148 37 -80 153 355 278 -148 -51 154 134 -274 216 -101 22 77 13 248 255 385 21 55
2852 55 16 208 -250 132 -14 -126 140 78 12 72 120 30 154 248 227 4 -134 35 126 -236 83 36 -97 -220
2876 -220 -190 -16 -173 -354 191 23 158 -108 307 460 -36 6 184 98 21 0 255 192 134 -38 105 -312
2898 -312 -177 -61 -46 -415 -320 -547 -239 -585 28 -45 45 282 127 196 191 60 -97 110 406 103 -3 -172
2920 -172 100 86 -165 90 -89 248 134 -39 -66 159 -10 -84 5 212 -209 -173 -69 -24 -157 -338 -183 -76
2942 -76 -23 267 210 -78 -26 -108 -197 55 42 49 -56 52 86 394 91 296 -30 146 -151 104 33 -222 32 67
2966 67 100 -310 21 150 13 -16 -178 307 100 22 369 -304 194 322 218 -61 -11 -42 226 36 132 148 -64
2989f4k6K36q1m8p7j91N13k98k18J88j11N3k3J15r3L1j6J18o6J9R9j05N6n6J27
3014H2o5K54j69J1j36K1j6J08m1k02m8O2%R2M9q0O0k8N9j46L05Ok36Q9qj25m3
3041a45j18L38j67J31n0J15J34l7L0j77Q7n7P3j56L3J26j76K7j67MK30n7j10M0
3065d9J52j51o7n5p3N73l54j3P2N8K8J42M8n8J03k72k3J40m3j72j44M6jl22K96
3090a39N8J12j86J43R5l93L32k43J25M2N2K19k05K9k09M00k49J26o4O0j67J14
3112E2K44k83M5PO9lj16J0J63m22M31k90J13N8j50L2JJ40J3K1j21l18L10k51K89
3137D4j74Q0J72k39j1K28p7j11K08p3j36J00J79o4l2L09j71k66J02jj48j2j49
3160b42j3p2R6L24j42J92k93K24q5P3n3K74k69k31J86J54J17L2m10q5K58r4K40
$$ plain form
2989 -64 -90 146 65 17 -60 -251 262 -36 -254 -66 -177 -124 -147 -32 -125 -94 -110 8 -58 -39 60 -45 11 -45 82
3014 82 17 271 102 113 -23 -2 -18 90 49 -153 -201 -139 -139 -47 2 -78 -18 -46 13 -133 172 178 -58 31 23 -102 -145
3041 -145 -263 75 -92 39 -11 104 238 201 231 54 141 84 157 1 34 160 -16 11 -156 -152 78 21 -89 -49
3065 -49 103 -48 -115 -170 -243 330 -24 -37 35 93 121 263 311 253 356 84 61 201 158 -14 -158 -112 -113 -435 -139
3090 -139 -81 31 -155 -12 83 -310 22 -221 -96 -54 -2 217 12 41 -168 232 -17 109 45 105 -62 52
3112 52 296 13 58 65 134 131 15 25 188 -234 197 -93 20 78 -72 -40 -39 101 114 135 14 -304 6 -245 44
3137 44 -130 -50 122 -117 -128 100 23 -88 120 47 -89 11 190 126 94 403 232 -34 68 67 -81 -93 -242
3160 -242 -255 -327 -231 93 -49 143 -150 74 -11 62 9 283 14 -217 -31 123 240 272 -138 -223 35 -59 181
3183A81l09J10p0J50K51m63J65Ol00J57J18j02m9J34R0m56M52LJ70q6k21R5rJ97
3207B14k9p5j15J58J37l07K7j0K77j82n2Q5m37P2K23q5k8l0j57QK87m6k4K3J42
3232G6p3J56M6l27R9O5l72J59J00j18J18J68m1j14j79M88l47lJ88j11n4o5o2K04
3256AN2n9j23PJ77k83K72j98jJ65m7j54K48j60K69m0m8j08J49J07q7p4j07R0J14
3281A62j20j48ro7L3L6p7J7J51p2j61K02J41O7K6j76j23N3N7k2L71Jk91j39K92
3306B04j64J91l67n5J67M9J76r3m38L62NJ16k35K97L1k81j06j53L14p0k1j05O8
3329a08K73j49K51l42J66j35j49K93o1J82k74Q4o3L95k80j47R1J09j21r9J12j64
3351a36K09j66r1J27J5MJ61m01J97J47m1j58J40rP6o1LK68j94p8J07O1j90M0j38
$$ plain form
3183 181 -128 -18 -88 62 313 -150 15 21 -279 -122 -4 -106 -155 -21 69 -387 65 68 238 152 -69 26 17 214
3207 214 185 110 -5 153 290 -17 10 0 277 95 43 128 -309 -237 -14 -99 -127 -157 -314 -306 -19 -65 -89 -66 76
3232 76 3 159 205 -122 -23 42 -330 -171 -71 -189 -71 97 56 -58 -237 251 -96 -99 89 -22 -76 -141 -203 1
3256 1 53 -6 -129 -122 55 -228 44 -154 -155 10 -37 -191 57 -103 166 126 78 -30 119 226 139 65 -42 48 162
3281 162 42 -106 -115 -182 -149 -113 -190 -173 -22 -94 -255 -53 88 155 181 5 -118 -65 -8 -30 341 342 51 -88 204
3306 204 40 231 -136 -191 -24 25 201 108 -330 32 37 153 -82 215 246 -35 -141 -294 20 -50 -71 -176 -108
3329 -108 165 16 267 -75 91 -44 -193 100 39 221 -53 31 -32 363 83 -64 27 136 15 -84 28 -136
3351 -136 73 -93 -184 -57 -42 -38 123 -278 -81 66 25 -133 7 -2 74 13 16 284 90 12 119 180 -10 30 -108
3376a08J22l0k01M02j05j82o2L93j73j57J6L38l68l7L78l39J66J90k18J1o1J02
3398G7L7j53k78L61n8l3n3m3K40l07N2J70j13p2M67N3l26j30R5J15Q1pk5k21k
3423g3J39j38p2J37j08j46J67J74N9j23Q5Q9%j63l24M03l6J58k81J57N8J7k29
3446e0L46n1j5k93K22l16K17n12K33J06k08K68k0O9M9j5m1j89M18J00j36K83k64
3469B01J57j55l87M34j0k71m6j05K00q2J92j97R5m04o4K14J71M2m7J33o8Pk6m2
3493e8J40j0j29N1lQ2R5k18L14l83J32q8K70j24q2L0o7l5K9M5J08n0J99l19J50
3518G9jj27L04j93j27O3o6q6K1j16K51n3q2Q9n9M00k3j79j46J06o1l3J34J59k74
3543b0Mk1J28K3J11l08ll6L5k34K49P8l8k13Q1j72K87J07n3q2r8M9J81l9Q9L2
$$ plain form
3376 -108 14 -16 -217 185 80 -102 -164 229 56 -101 -85 253 -115 -152 226 -113 53 243 25 36 -25 77
3398 77 114 -39 -317 44 -14 -47 -100 -143 97 -210 -158 12 -101 -173 294 347 21 -109 -14 101 182 175 150 -71 -73
3423 -73 66 -72 -144 -7 -115 -261 -94 80 139 16 101 190 190 27 -297 106 70 228 -53 104 162 179 -50
3446 -50 296 245 230 -63 159 -157 60 -452 -219 -113 -321 -53 -73 -4 45 30 -11 -200 218 318 182 465 201
3469 201 358 203 -184 250 240 -31 -77 -182 18 -64 128 -69 26 -378 -442 -228 -57 -15 -62 71 3 10 -16 -58
3493 -58 82 72 -57 -6 -9 73 168 -50 264 -119 13 -75 195 71 -11 19 -48 -83 -54 -9 99 49 248 -71 79
3518 79 78 -49 255 62 -65 -2 -68 -154 -133 -249 2 -51 -133 -44 -103 297 274 95 -51 55 -6 -39 95 254 -20
3543 -20 -16 -37 91 114 225 -83 -86 -122 -87 -321 -72 6 -32 -245 -164 -336 -49 58 5 -77 -175 -126 55 16 105 137
3569A37j70K09J05n10J40K69l48k1J12k1J66Q2r7O2j83R8l47L25l16L90n2j08
3591g8K09j04n1J30M2n3N2n9q0K48m48K05J08p6J10q1j38J86j10O8k85J89K36
3614B20j68r4QM1j46K17j4p9L71j12k24j53J05L54k78j09Qk47J71J15K5L95l87
3637A9k19M13q9k17K24R8j07j85Q3J41k59K09k9m17K25j83J65K40l58N5J84k0
3659b7J23j09j63L2R7M0n9J44j78J61J61j80K1o0j46J11n2k81M26j88J53nj40
3682a19j56L35q9J00k01P4j57K18k70p1N45j3k92J0J99j3M0K40k66j64j27K43
3704F6j17l7K60m2j24j21K51l25J02J83n1j93L0J92k6j53M54l34J64k79qJ62L0
$$ plain form
3569 137 -33 176 281 -229 -89 180 -168 -189 -77 -98 68 150 53 115 -68 30 -317 8 -308 82 30 -78
3591 -78 131 27 -24 106 148 95 147 88 8 256 -192 13 121 45 155 74 -64 122 12 80 -205 -16 220
3614 220 52 -42 -34 7 -139 78 64 -15 356 244 20 -133 -28 326 48 -61 -53 -300 -129 -14 11 406 19
3637 19 -200 213 124 -93 131 229 122 -63 20 161 -98 111 82 -335 -110 -293 -128 112 -246 -191 -7 -27
3659 -27 96 -13 -176 -144 -47 -7 -66 78 -100 61 222 42 63 3 -143 -32 -84 -365 61 -127 26 21 -119
3682 -119 -275 60 -29 71 -130 -56 -213 5 -265 -336 209 196 -96 -86 113 100 140 380 114 -50 -177 66
3704 66 -51 -88 172 130 6 -115 136 -189 -87 96 45 -148 -118 74 48 -105 349 15 179 -100 -108 54 84
$$ [...]
8191E2
##END NTUPLES=NMR FID
##END=
