##TITLE=1H_Pr 58-d2
 CDCl3,8 sc, 
 29.9.2021
##JCAMPDX= 6.0         $$ Bruker NMR JCAMP-DX V2.0
##DATA TYPE= NMR FID
##DATA CLASS= NTUPLES
##ORIGIN= UXNMR, Bruker Analytische Messtechnik GmbH
##OWNER= root
$$ XWIN-NMR		Version 3.5
$$ Wed Sep 29 13:42:37 2021 Russian Standard Time (UT+4h)  she@DPX200
##.OBSERVE FREQUENCY= 200.1313468511
##.OBSERVE NUCLEUS= ^1H
##.DELAY= (6, 6)
##.ACQUISITION MODE= SIMULTANEOUS
##.ACQUISITION SCHEME= undefined
##.AVERAGES= 8
##.DIGITISER RES= 18
##SPECTROMETER/DATA SYSTEM= spect
##.PULSE SEQUENCE= zg30
##.SOLVENT NAME= DMSO
##.SHIFT REFERENCE= (INTERNAL, DMSO, 0, 15.7039)
##AUDIT TRAIL= $$ (NUMBER, WHEN, WHO, WHERE, WHAT)
$$ ##TITLE= Audit trail, XWIN-NMR		Version 3.5
$$ ##JCAMPDX= 5.01
$$ ##ORIGIN= Bruker BioSpin GmbH
$$ ##OWNER= she
$$ F:/spectra/data/she/nmr/H-F/1/audita.txt
$$ ##AUDIT TRAIL=  $$ (NUMBER, WHEN, WHO, WHERE, WHAT)
(   1,<2021-09-29 13:41:31.68 +0400>,<she>,<DPX200>,
      <created by zg, POWCHK disabled, PULCHK disabled
       configuration hash MD5:
       00 E9 B6 7A A2 85 ED C7 34 08 36 98 17 FE 4E 26
       data hash MD5: 16K
       B0 7A B6 27 29 CA 38 00 2B C9 7A 81 47 38 96 4E>)
$$ ##END=
$$ 
$$ hash MD5
$$ E5 D5 A9 A5 44 04 7D 58 33 9F 0B 02 01 0D FE C6
##$RELAX= 
##$RELAX= 
##$RELAX= 
##$RELAX= 
##$RELAX= 
##$RELAX= 
$$ Bruker specific parameters
$$ --------------------------
##$DU= <F:/spectra>
##$EXPNO= 1
##$NAME= <H-F>
##$PROCNO= 1
##$TYPE= <nmr>
##$USER= <she>
##$AMP= (0..31)
100 100 100 100 100 100 100 100 100 100 100 100 100 100 100 100 100 100 
100 100 100 100 100 100 100 100 100 100 100 100 100 100 
##$AQSEQ= 0
##$AQ_mod= 1
##$AUNM= <au_zg>
##$AUTOPOS= <>
##$BF1= 200.13
##$BF2= 200.13
##$BF3= 200.13
##$BF4= 200.13
##$BF5= 200.13
##$BF6= 200.13
##$BF7= 200.13
##$BF8= 200.13
##$BYTORDA= 1
##$CFDGTYP= 0
##$CFRGTYP= 5
##$CHEMSTR= <none>
##$CNST= (0..31)
1 1 145 1 1 1 1 1 1 1 1 1 1 1 1 1 1 1 1 1 1 1 1 1 1 1 1 1 1 1 1 1 
##$CPDPRG= <>
##$CPDPRG1= <>
##$CPDPRG2= <>
##$CPDPRG3= <>
##$CPDPRG4= <mlev>
##$CPDPRG5= <mlev>
##$CPDPRG6= <mlev>
##$CPDPRG7= <mlev>
##$CPDPRG8= <mlev>
##$CPDPRGB= <>
##$CPDPRGT= <>
##$D= (0..31)
0 1.2 0 0 0 0 0 0 0 0.06 0 0.03 0 0 0 0 0.0002 0 0 0 0 0 0 0 0 0 0 0 0 
0 0 0 
##$DATE= 1632908490
##$DBL= (0..7)
120 120 120 120 120 120 120 120 
##$DBP= (0..7)
150 150 150 150 150 150 150 150 
##$DBP07= 0
##$DBPNAM0= <>
##$DBPNAM1= <>
##$DBPNAM2= <>
##$DBPNAM3= <>
##$DBPNAM4= <>
##$DBPNAM5= <>
##$DBPNAM6= <>
##$DBPNAM7= <>
##$DBPOAL= (0..7)
0.5 0.5 0.5 0.5 0.5 0.5 0.5 0.5 
##$DBPOFFS= (0..7)
0 0 0 0 0 0 0 0 
##$DE= 6
##$DECBNUC= <off>
##$DECIM= 32
##$DECNUC= <off>
##$DECSTAT= 4
##$DIGMOD= 1
##$DIGTYP= 9
##$DL= (0..7)
0 120 120 120 120 120 120 120 
##$DP= (0..7)
150 150 150 150 150 150 150 150 
##$DP07= 0
##$DPNAME0= <>
##$DPNAME1= <>
##$DPNAME2= <>
##$DPNAME3= <>
##$DPNAME4= <>
##$DPNAME5= <>
##$DPNAME6= <>
##$DPNAME7= <>
##$DPOAL= (0..7)
0.5 0.5 0.5 0.5 0.5 0.5 0.5 0.5 
##$DPOFFS= (0..7)
0 0 0 0 0 0 0 0 
##$DQDMODE= 0
##$DR= 18
##$DS= 0
##$DSLIST= <SSSSSSSSSSSSSSS>
$$ [...]
##$SUBNAM2= <"">
##$SUBNAM3= <"">
##$SUBNAM4= <"">
##$SUBNAM5= <"">
##$SUBNAM6= <"">
##$SUBNAM7= <"">
##$SUBNAM8= <"">
##$SUBNAM9= <"">
##$SW= 18.0517286264689
##$SWIBOX= (0..15)
0 0 2 0 0 0 0 0 0 0 0 0 0 0 0 0 
##$SW_h= 3612.71676300578
##$TD= 16384
##$TD0= 1
##$TE= 0
##$TE2= 300
##$TE3= 300
##$TEG= 300
##$TL= (0..7)
0 120 120 120 120 120 120 120 
##$TP= (0..7)
150 150 150 150 150 150 150 150 
##$TP07= 0
##$TPNAME0= <>
##$TPNAME1= <>
##$TPNAME2= <>
##$TPNAME3= <>
##$TPNAME4= <>
##$TPNAME5= <>
##$TPNAME6= <>
##$TPNAME7= <>
##$TPOAL= (0..7)
0.5 0.5 0.5 0.5 0.5 0.5 0.5 0.5 
##$TPOFFS= (0..7)
0 0 0 0 0 0 0 0 
##$TUNHIN= 0
##$TUNHOUT= 0
##$TUNXOUT= 0
##$USERA1= <user>
##$USERA2= <user>
##$USERA3= <user>
##$USERA4= <user>
##$USERA5= <user>
##$V9= 5
##$VALIST= <valist>
##$VCLIST= <CCCCCCCCCCCCCCC>
##$VD= 0
##$VDLIST= <DDDDDDDDDDDDDDD>
##$VPLIST= <PPPPPPPPPPPPPPP>
##$VTLIST= <TTTTTTTTTTTTTTT>
##$WBST= 1024
##$WBSW= 4
##$XGAIN= (0..3)
0 0 0 0 
##$XL= 0
##$YL= 0
##$YMAX_a= 79073
##$YMIN_a= -113153
##$ZGOPTNS= <>
##$ZL1= 120
##$ZL2= 120
##$ZL3= 120
##$ZL4= 120
##$ABSF1= 10
##$ABSF2= 0
##$ABSG= 5
##$ABSL= 3
##$ALPHA= 0
##$AQORDER= 0
##$ASSFAC= 0
##$ASSFACI= 0
##$ASSFACX= 0
##$ASSWID= 0
##$AUNMP= <proc_1d>
##$AZFE= 0.1
##$AZFW= 0.1
##$BCFW= 1
##$BC_mod= 2
##$BYTORDP= 1
##$COROFFS= 0
##$CY= 11.3945322036743
##$DATMOD= 1
##$DC= 2
##$DFILT= <>
##$DTYPP= 0
##$F1P= 2.36226072786647
##$F2P= -0.459571619588291
##$FCOR= 0.5
##$FTSIZE= 0
##$FT_mod= 4
##$GAMMA= 1
##$GB= 0.15
##$INTBC= 1
##$INTSCL= 1
##$ISEN= 128
##$LB= 0.24
##$LEV0= 0
##$LPBIN= 0
##$MAXI= 10000
##$MC2= 0
##$MEAN= 0
##$ME_mod= 0
##$MI= 1.114404
##$NCOEF= 0
##$NC_proc= 0
##$NLEV= 6
##$NOISF1= 3.799351
##$NOISF2= 2.8
##$NSP= 1
##$NTH_PI= 0
##$NZP= 0
##$OFFSET= 15.70392
##$PC= 1
##$PHC0= -13711.47
##$PHC1= 4.200853
##$PH_mod= 1
##$PKNL= yes
##$PPARMOD= 0
##$PSCAL= 0
##$PSIGN= 0
##$REVERSE= no
##$SF= 200.130013532006
##$SI= 16384
##$SIGF1= 3
##$SIGF2= 2
##$SINO= 400
##$SIOLD= 16384
##$SREGLST= <1H.CDCl3>
##$SSB= 0
##$STSI= 0
##$STSR= 0
##$SW_p= 3612.71676300578
##$SYMM= 0
##$S_DEV= 0
##$TDeff= 0
##$TDoff= 0
##$TI= <>
##$TILT= no
##$TM1= 0
##$TM2= 0
##$TOPLEV= 0
##$USERP1= <user>
##$USERP2= <user>
##$USERP3= <user>
##$USERP4= <user>
##$USERP5= <user>
##$WDW= 1
##$XDIM= 8192
##$YMAX_p= 0
##$YMIN_p= 0
$$ End of Bruker specific parameters
$$ ---------------------------------
##NTUPLES= NMR FID
##VAR_NAME=  TIME,          FID/REAL,        FID/IMAG
##SYMBOL=    X,             R,               I
##VAR_TYPE=  INDEPENDENT,   DEPENDENT,       DEPENDENT
##VAR_FORM=  AFFN,          ASDF,            ASDF
##VAR_DIM=   8192,          8192,            8192
##UNITS=     SECONDS,       ARBITRARY UNITS, ARBITRARY UNITS
##FACTOR=    0.0002768,     1,               1
##FIRST=     0,             0,               0
##LAST=      2.2672688,     0,               0
##MIN=       0,             -113153,         0
##MAX=       2.2672688,     79073,           0
$$ Real data points
##PAGE= N=1
##DATA TABLE= (X++(R..R)), XYDATA
0 0 0 0 0 0 0 0 0 0 0 0 0 0 0 0 -8 8 -8 8 -8 16 -16 16 -24 24 -32 32 -40 48 -56 64 -72 80 -96 104 -120 136
36 136 -152 168 -189 209 -233 260 -288 320 -356 392 -432 476 -524 580 -636 702 -773 853 -945
55 -945 1043 -1159 1290 -1445 1623 -1841 2106 -2440 2873 -3464 4324 -5693 8221 -14506 69080
70 69080 59802 -29129 43739 67620 24950 -15011 20020 36124 26203 10062 -6319 -40567 -39220
83 -39220 -20911 -32671 -72315 -65620 -22547 -9281 -34478 -28968 -3074 1296 -6446 1875 6615
96 6615 3452 15284 42401 41530 26867 36370 50817 38281 18058 8027 3121 -1615 1675 1777
110 1777 -15609 -23423 -6442 -4746 -33236 -48957 -31022 -16422 -30181 -35579 -11625 3562 -578
123 -578 4183 14234 10366 4483 15517 24551 14980 13466 29112 31832 18746 14029 17121 11365
137 11365 -3410 -9867 -8498 -13727 -17730 -13531 -11001 -14994 -17022 -12871 -13435 -19825 -17398 -7337 -5212
152 -5212 -3512 4595 11694 13062 13080 14729 13695 10045 9563 10815 9105 9451 10248 8104 3303 -56
168 -56 -468 -3307 -11391 -13378 -9956 -9781 -11883 -10313 -6028 -4497 -5915 -4465 -3478 -5359 -2778 2163
184 2163 4073 4675 6761 10345 12099 9417 6925 5841 5042 4524 2213 896 1646 2126 1873 -1646 -6562
201 -6562 -5857 -5052 -7880 -10283 -8638 -4274 -2908 -3709 -2799 -834 899 2155 -415 -935 2098 4435
217 4435 5666 5475 5050 6378 6527 4977 2894 605 176 115 -1110 -1551 -2116 -2376 -755 -2086 -4769
234 -4769 -6277 -5358 -3937 -3958 -4539 -1955 293 1175 760 73 2056 3832 2812 2173 2500 4040 5100
251 5100 4229 2972 3073 2325 1539 -538 -1917 -1810 -2398 -3074 -2700 -3218 -2984 -2774 -2676 -2537 -3171 -3345 -1825
270 -1825 -898 387 1360 1897 3806 3715 2320 2571 2816 2915 2468 1518 1727 2536 1903 872 -908 -1363 -1056
289 -1056 -2989 -3885 -3318 -2751 -2000 -3038 -2519 -603 -745 -621 -657 -321 578 1145 594 2700 3038 3303 3253
308 3253 2284 2530 1844 952 704 759 496 105 -1378 -1263 -1059 -2378 -2838 -2723 -2441 -2492 -2693 -2160 -495 -572
328 -572 -416 184 551 1799 1663 1669 2168 2310 2164 2457 1595 2324 1992 1363 427 -500 -786 -642 -2097 -1128
348 -1128 -1519 -1976 -1971 -2649 -1814 -1756 -2148 -2073 -1126 -938 -34 303 1313 2004 1794 1335 1310 2432 2219 2040 1481
369 1481 1956 2521 934 663 453 575 -346 -1107 -1986 -2169 -1757 -2271 -2208 -1558 -1417 -1431 -735 -727 -75 1117 584
390 584 1276 1378 1633 1563 2137 2991 2243 1092 1722 1877 999 764 880 -515 -182 -1235 -2273 -1613 -1779
409 -1779 -1867 -2162 -2561 -2089 -1612 -1398 -1050 -1030 -106 329 574 972 1719 1654 1868 2541 2526 2436 1664 2219 1827 1069
431 1069 417 -580 -612 -290 -1398 -2159 -1838 -2468 -2393 -2418 -2375 -1544 -1456 -1200 -712 -759 471 585 736 1496 1647
452 1647 1778 2416 2056 2276 2263 1696 1662 1009 696 28 -306 -544 -1218 -2080 -2100 -2565 -2288 -1685 -2057 -2357 -1514
473 -1514 -1224 -895 -156 345 1039 890 1270 1911 1907 2142 2219 1324 1792 1755 787 718 741 -80 -620 -672 -745 -1361 -1797
496 -1797 -1280 -1814 -1588 -1255 -1764 -1400 -450 -283 -75 155 200 616 790 1478 1084 938 1542 1218 743 1266
516 1266 722 172 417 -38 -88 -334 -519 -613 -579 -505 -897 -1339 -648 -224 -783 -510 -142 -529 -281 225 335
537 335 621 533 410 202 563 751 -146 195 518 46 209 268 -519 -126 -262 -122 -382 -404 -47 -89 178 654
559 654 -131 -226 210 147 -41 391 18 -172 127 -228 3 -352 47 -350 -524 -78 -248 -353 247 -8 -428
580 -428 636 746 84 381 758 914 559 567 254 358 587 511 -324 -223 -265 -874 -269 -577 -1260 -1199 -930 -780
602 -780 -808 -848 -439 -287 177 456 -112 243 1077 579 950 1021 842 721 840 454 520 396 410 -204 -463 65
624 65 -607 -1139 -736 -1353 -1368 -703 -1030 -1044 -724 -213 -265 -116 162 328 326 1277 1077 677 1071 932 797 1179
646 1179 587 571 370 224 192 -64 -564 -536 -1126 -1520 -853 -1343 -1050 -702 -1053 -722 -302 -270 -121 202 572
667 572 672 898 967 903 922 1541 1107 815 881 174 135 51 -356 -318 -527 -641 -842 -786 -919 -770 -1140 -624 -775
690 -775 -674 -218 324 114 391 652 377 833 890 1096 740 1137 1035 228 308 357 109 213 55 -720 -525
711 -525 -773 -854 -934 -952 -768 -639 -871 -411 -560 -308 -38 -175 247 426 435 808 619 842 807 760 745 739 561 606
735 606 138 -63 141 -690 -727 -538 -832 -1048 -976 -1043 -1003 -704 -714 -204 -378 181 419 17 569 954 635 757
757 757 819 1099 857 465 697 485 574 116 -80 -309 -469 -813 -622 -800 -780 -823 -991 -1152 -542 -654 -649 -435
779 -435 -130 227 352 374 623 766 677 1122 765 1063 610 718 433 282 73 83 -146 -141 -637 -985 -706 -921
801 -921 -868 -637 -962 -857 -566 -789 -217 -48 -86 406 409 353 748 630 784 984 404 780 780 610 725 179 22
824 22 -130 -492 -471 -616 -872 -854 -1055 -1075 -1038 -933 -767 -296 -307 -218 -3 -10 485 543 886 724 924 881 869 1118
848 1118 1050 657 711 651 167 2 -242 -312 -508 -750 -759 -740 -1119 -750 -728 -996 -594 -610 -289 57 93 516 621
871 621 660 792 853 822 751 850 960 882 647 441 34 -115 -242 -216 -394 -771 -956 -1012 -768 -947 -657 -767 -788
894 -788 -251 -243 -69 87 -42 636 512 728 987 848 910 908 527 333 559 308 348 73 22 -273 -476 -327 -538
917 -538 -945 -540 -604 -830 -619 -622 -566 -119 -434 89 16 307 532 330 837 747 874 656 699 473 804 437 285
940 285 -43 -16 -237 -338 -515 -423 -677 -976 -682 -524 -586 -418 -484 -166 -278 -119 192 108 618 254 357 447
962 447 432 323 650 600 713 463 216 269 399 -162 -86 -434 -545 -361 -552 -454 -503 -281 -377 -330 -126 -234 -196
985 -196 46 287 109 636 597 225 455 533 415 446 376 121 587 324 -116 -125 -281 -232 -483 -295 -293 -643 -579 -411
1009 -411 -318 -200 -273 0 69 -243 349 34 280 457 161 254 188 298 213 98 93 112 -254 -305 -265 -17 -341 -265
1033 -265 -570 -470 -368 -286 29 -276 -527 -23 112 11 93 116 498 422 310 562 161 151 315 245 318 213
1055 213 -180 -148 -155 -271 -165 -202 -601 -326 -272 -306 -451 -494 27 -76 -426 17 -12 4 295 242 244 475 329 413
1079 413 322 500 185 63 102 -249 2 103 -472 -544 -140 -476 -435 -440 -324 -308 -390 174 -43 -299 174 316 120
1102 120 324 410 372 526 295 208 634 366 103 54 247 358 -454 -225 -264 -350 -226 -265 -501 -428 -414 -272 -222
1125 -222 -201 -93 -130 45 377 231 397 435 479 264 540 310 169 474 148 302 248 99 -195 -110 -195 -348
1147 -348 -455 -386 -627 -497 -194 -344 -378 -434 -34 -52 -185 287 -148 257 615 315 141 618 252 51 455
1168 455 301 74 91 213 55 25 -123 -160 -411 -316 -91 -141 -266 -63 -173 -187 163 88 -27 -75 -87 205 525
1191 525 163 -23 202 340 519 104 580 62 -41 -58 136 37 -334 -123 -171 -300 -332 -195 -570 -110 -214
1212 -214 -153 31 -104 -208 211 -73 -295 -124 190 400 142 443 445 246 147 207 263 0 76 -305 -88 62
1234 62 -131 -383 -380 -139 -384 -252 -194 -75 -216 -18 58 85 161 115 212 145 183 50 136 331 163 620 116 -53
1258 -53 126 227 -72 -103 -94 -329 -324 -211 -281 -56 -93 -120 -408 -203 -327 123 -164 131 27 -103 178 109 167 168
1282 168 290 116 269 158 184 -56 98 270 -230 -105 -58 -126 -145 -340 -186 -386 -316 -122 -202 -104 37 37 86
1305 86 67 -2 -8 249 11 318 155 -104 358 79 154 300 148 249 129 -56 65 -335 -40 13 -331 -319 129
1328 129 -111 -142 -264 -215 93 -265 -64 25 67 177 241 103 555 -117 -22 12 152 314 88 -85 -161 -52 -140
1351 -140 -15 101 -142 -57 -67 98 73 -88 -80 29 113 72 -195 208 223 -82 29 13 87 296 197 83 300 -168
1375 -168 -119 -186 -171 -184 -246 -19 185 -10 144 110 -199 71 -31 168 4 172 115 -112 -145 110 109 282 24
1398 24 69 221 9 35 106 -124 -72 -172 -237 -104 23 162 -73 -100 -146 -7 -176 -167 295 300 323 106 22 273 -143
1423 -143 280 255 -72 151 148 122 91 294 128 -30 -118 -133 12 -109 -45 -75 -141 -234 92 62 -32 -226 109 74 -53
1448 -53 155 281 52 145 -63 -30 377 14 -8 167 303 117 177 6 -120 -235 -19 -284 -39 -32 62 -109 32
1471 32 -35 215 125 -252 56 -166 74 475 -60 -93 356 -19 -103 75 338 147 -17 -29 15 -24 -200 -166 74
1494 74 -72 -252 -86 21 118 -238 -40 -222 96 -66 3 112 94 50 -79 202 -61 53 153 297 277 164
1516 164 190 -25 247 -153 -40 -289 -85 106 62 -208 36 114 -136 -35 49 -64 194 -20 14 30 207 -404
1538 -404 -168 -17 2 -118 -134 -23 183 105 81 -165 -254 58 -278 -36 -42 154 -435 -96 140 -32 -149 152
1560 152 -1 26 229 -205 144 -168 111 -140 12 87 150 6 54 76 -75 -42 -34 126 -28 38 -246 76 43
1583 43 151 -121 67 22 251 101 60 103 85 216 103 -128 12 236 -7 -142 -263 14 -228 -35 -114 35
1605 35 173 -86 -181 109 -119 91 96 127 95 -21 -23 -222 153 -45 -30 -250 -193 70 -205 6 128 -186 62
1628 62 194 55 187 155 -14 -64 113 -10 -157 296 100 -104 -68 0 -94 -27 77 231 203 -194 98 161 68
1651 68 194 193 25 -74 -49 7 -109 -163 299 -102 51 27 32 168 -80 -216 -107 86 -181 194 -65 145 526
1674 526 66 379 79 -46 184 294 132 -96 -218 -84 4 -437 -39 -400 -372 63 33 -178 -239 -139 93
1695 93 129 53 -96 -58 19 -56 9 195 286 48 204 46 -322 -101 -104 -317 172 68 227 -70 -66 -2 -202 -81
1719 -81 -71 -26 -9 -100 -312 -136 60 -141 -153 -180 -29 107 35 19 110 51 109 271 104 -84 10 -129 -171 152 -115
1744 -115 -5 198 22 -168 98 -124 229 -17 73 -195 161 -65 -220 102 -29 64 189 48 90 -57 98
1765 98 -6 -122 181 298 -152 4 107 130 -125 -35 113 209 -97 -93 -194 3 -97 -165 43 56 129 0 172
1788 172 205 -137 158 -96 81 107 -112 -252 50 294 -83 -289 -245 172 -181 18 37 74 -44 43 -214 -74
1810 -74 -165 31 -30 -49 8 -149 27 -112 -217 87 148 19 90 153 125 53 36 265 170 117 36 146 149 -105 -183 75
1836 75 -162 109 327 47 -376 114 -213 -125 157 -60 26 -218 6 123 32 220 -76 216 59 -114 -22 65
1858 65 -227 -80 -50 68 243 150 42 -274 -169 -73 51 -64 -155 87 9 -38 -54 34 -47 2 270 81 148 -125
1882 -125 -123 -90 48 -280 19 124 -268 -17 -2 272 196 -44 134 60 -159 -255 -39 -116 13 -133 -74 56 -80
1905 -80 -52 58 -64 38 -42 27 363 139 186 -18 -249 -45 -152 88 77 161 -147 107 -52 11 182 112 166
1928 166 -83 -161 -207 140 -14 14 134 11 -144 61 125 311 58 42 -71 184 -217 -200 338 30 -7 137
1950 137 -33 -184 -9 51 -21 82 75 188 -171 -35 70 68 -71 8 -24 250 134 191 183 380 131 95 -137 242
1974 242 104 -113 136 -120 -69 -13 -181 -100 -29 -132 198 298 191 73 244 -184 -22 -106 -25 -220 124 199
1996 199 -24 -48 -30 171 10 -186 -179 -70 -74 105 -148 75 -41 -42 -275 97 232 -25 186 43 -254 -163 123
2019 123 152 166 204 20 352 18 -58 -112 -22 -12 -139 74 -107 30 171 195 243 76 -118 27 -195 -149 -154 -130
2043 -130 -9 -187 -60 15 16 12 -2 -9 -89 -72 351 72 11 160 41 1 19 -92 -70 -86 11 -62 5 -249 -62 67
2069 67 -173 -112 -108 -238 194 131 -154 34 -199 -114 183 55 415 5 -87 80 -136 173 -219 10 69 93 -24
2092 -24 94 -44 201 10 -147 202 35 74 -161 40 45 -243 -24 -51 59 -120 158 -76 -94 149 11 46
2114 46 153 133 133 78 -57 -109 20 57 -43 -54 -93 -58 228 114 385 23 -86 -218 -277 -131 17 46 -71 194
2138 194 -30 11 108 18 104 -40 -274 125 -27 182 111 149 -25 54 -27 -307 -156 18 -46 62 159 81 84 79 -242
2163 -242 8 177 212 -86 186 12 12 18 103 190 -15 -9 -87 -45 7 -174 -448 174 -51 37 -59 -97 -24 -45 -7 -89
2189 -89 360 91 -789 -298 -353 -142 269 -274 -347 73 -589 -375 -63 -620 27 446 802 92 -94 25 -318
2210 -318 -1 95 -118 138 40 -279 -72 34 257 -90 9 11 113 -152 -177 81 -46 187 181 -102 -124 -153 188
2233 188 100 100 181 41 -88 -288 15 -208 -17 -1 35 339 -78 -113 97 267 -238 -123 -137 -264 -263 -195 -55 -29
2257 -29 132 -4 146 -118 91 220 128 138 -4 204 -77 -198 45 40 -132 261 -12 -148 81 217 -168 73
2279 73 35 -76 -2 95 185 90 30 117 -40 1 154 248 -241 151 81 -441 -125 -171 -62 264 -151 -125 -19 -290
2303 -290 55 559 -308 -155 430 -824 59 -365 -68 -225 132 819 -711 617 -958 -303 -162 285 -317
2322 -317 -876 51 182 264 268 -24 12 -138 -105 96 55 65 -219 -54 -137 -165 -97 -38 -10 -54 -51 66 -154 -9 158
2347 158 -1 37 133 -7 -82 115 -84 92 73 -81 -57 25 124 10 -46 -123 7 -165 14 119 -110 -69 -226
2370 -226 -229 113 47 -36 -99 -181 -165 -92 -252 93 127 -60 18 -108 193 114 -349 6 -17 -149 -122 165 -125 -35 205
2395 205 -52 61 -87 263 -187 198 71 153 36 79 -17 275 -188 -13 280 -201 111 74 -41 203 25
2416 25 66 -315 179 -17 -179 -195 -124 132 -61 -50 -144 272 156 45 102 -115 -90 135 260 1 -202 -53 184
2439 184 92 -255 -129 -107 -119 134 -38 44 12 45 46 70 172 145 -97 -14 88 22 -116 -107 -64 228 -404 -148 -113
2464 -113 76 -147 -115 76 102 19 -159 -156 -65 75 -106 69 -177 127 100 66 -17 -127 -45 -109 82 19 262 -126
2488 -126 -312 57 111 154 -117 -138 40 69 -82 -12 60 -34 -103 156 -25 183 -106 121 62 132 -76 15 96 -207
2512 -207 -72 -124 207 78 -89 71 84 92 -53 226 -107 285 251 38 -20 -140 -47 136 89 79 -120 -67 299
2535 299 -69 239 51 178 -8 -228 74 66 93 141 -197 -61 -104 128 -97 20 -75 -115 -274 -137 108 10 -29
2558 -29 -108 4 -138 -49 55 119 189 78 -137 34 38 78 46 117 72 244 -31 -59 83 149 -201 149 -128 122
2582 122 58 104 190 -237 -136 -141 87 218 11 -24 137 18 -135 403 66 145 -47 -113 -95 304 127 99 -136
2605 -136 -100 343 -21 36 128 -12 -250 -74 116 35 70 32 -232 -276 -37 55 -43 211 -36 -193 75 -170 77
2628 77 60 -44 -65 228 -18 -75 -45 192 -257 180 349 0 -78 60 -140 70 -9 -42 -11 -31 76 -75 -211
2651 -211 118 127 -227 110 -73 -136 -78 -90 -155 128 110 86 -161 -78 -70 5 81 -71 -248 209 -43 61 31 -192 -133
2676 -133 -114 -191 -109 311 148 29 132 105 -132 157 -103 -88 -3 6 149 -90 -7 -128 130 -92 44 -44 195
2699 195 -26 61 -7 7 -92 36 -55 118 -211 -67 120 -27 -95 -80 157 -173 -295 -44 -100 -222 -1 94 134
2722 134 -60 -5 -140 234 -141 85 108 -9 -147 39 410 -94 -39 -80 288 -61 -143 65 2 198 -80 187
2744 187 -2 -68 -349 -35 232 -115 184 25 -66 -134 30 -56 -19 32 125 -53 -79 -44 83 -90 116 24 -3 10
2768 10 -19 -140 -168 11 94 23 -43 -6 77 51 -17 -147 -57 238 61 -188 -16 59 46 10 -276 29 -80 49 362
2793 362 -64 -237 42 152 269 -27 37 36 -127 21 111 -149 -184 -266 -37 1 41 140 135 -4 19 36 56 -18 164
2818 164 -41 -51 -84 169 147 4 -97 126 -189 49 140 19 -220 140 -120 -72 -82 70 184 -196 -96 -165
2840 -165 -124 71 -54 -99 106 146 2 272 97 212 -84 51 -41 -60 127 -149 51 37 291 -329 192 -62
2862 -62 90 -156 79 75 89 179 -70 -139 87 -74 24 65 -135 -97 75 127 -19 63 46 17 107 50 -92 56 -148
2887 -148 -126 129 132 -111 -71 -203 104 -315 -82 -371 327 206 -16 -131 -42 54 -64 123 126 -293 -40 115 -232
2910 -232 -47 44 -186 -26 166 193 -42 26 63 46 79 355 42 -148 -15 -108 230 -120 -97 94 -54 38 35 -87
2934 -87 -52 79 -135 236 -5 -7 -77 -107 -136 -9 81 32 -98 154 45 149 166 275 -164 -140 4 -177 73 -37
2958 -37 20 -22 -46 -21 103 283 34 195 93 -103 -227 27 -63 146 -66 -47 8 -21 77 -44 11 32 -118 174
2982 174 103 -9 85 -92 146 -20 -157 -228 -12 213 71 182 -121 -80 165 56 65 -49 112 248 -235 26
3004 26 231 159 -200 -88 115 85 -115 155 44 81 127 -94 -34 -31 -229 -70 -13 -280 -35 -38 -15 -68 124 -113
3028 -113 161 85 -75 116 -147 95 126 -152 -198 -267 99 -306 -20 -11 -39 -29 61 261 -3 -111 20 15 -218 281
3052 281 -197 -125 10 -85 179 -5 9 -233 106 44 4 149 -28 161 7 87 -110 229 183 30 35 -47 -26 102
3076 102 -151 -178 231 100 -65 -61 80 -135 34 168 159 -217 73 528 18 -127 -30 9 -92 -82 -123 241 202
3099 202 260 156 66 -145 101 255 150 342 207 116 -172 91 53 -13 -109 -257 280 107 -105 48 -59 122
3121 122 -45 20 -38 30 196 305 136 234 34 -38 -181 160 174 -19 -49 174 32 -91 14 87 -85 -123 68
3144 68 110 38 -143 103 -68 -61 350 120 -52 114 160 -248 55 -185 -140 207 -59 0 181 -251 -102 28 -40
3167 -40 47 215 -16 -110 216 55 -149 112 13 -54 -60 -241 -154 -130 58 47 -4 -193 200 55 173 244 101 35
3191 35 126 -132 -18 107 195 64 29 78 -3 -276 93 -94 10 -69 -180 62 -61 194 -6 116 -206 -71
3213 -71 -84 -280 -57 -140 -10 -91 65 54 -34 -38 -68 -80 -148 93 -83 126 49 -152 57 113 -157 94 16 85 23
3238 23 173 -108 8 279 -62 -3 174 162 107 -8 111 -125 -8 80 -34 -35 -27 205 -162 -86 -86 -123 18 -91
3262 -91 -96 83 -149 -125 -181 298 134 -65 -161 -33 -182 268 195 -43 22 95 -13 -104 4 34 48 27 -159 -47
3286 -47 -113 -34 -187 -79 -88 98 192 128 122 18 24 175 252 -29 64 -72 -89 -33 44 -157 71 128 116 346 -92 -33
3312 -33 -301 -145 -66 -6 1 -37 -14 -91 69 142 336 24 -84 147 242 273 -85 17 -3 -61 -2 -131 30 13 -90
3337 -90 -69 15 19 132 -211 9 -304 140 314 -39 9 -166 -52 -63 126 43 -80 48 163 -207 -33 -245 10
3360 10 1 228 213 -70 -168 70 21 24 193 -99 -155 133 -138 -37 40 -1 78 -114 44 227 -73 65 81 138 -233
3385 -233 117 28 151 -4 -133 -101 -31 -101 -27 -216 -199 296 46 63 133 18 -218 -122 -81 165 107 -186 -33 -34
3409 -34 47 -58 -175 -64 -44 12 29 43 -135 -82 93 -121 76 110 -122 39 -156 -23 305 -84 141 127 16
3432 16 50 -157 -10 103 30 -74 -161 -3 28 -225 65 -19 30 37 -201 -49 9 -209 -92 136 78 -42 -69 239
3456 239 -41 13 71 302 -154 -1 -27 205 52 -73 -149 16 -194 -55 -42 120 -101 -111 -109 11 163 -109 -104
3479 -104 -18 192 63 -29 -105 112 100 168 -121 -91 9 76 50 -20 10 -130 -295 -227 -31 -51 30 129 -200 -143 167
3504 167 85 96 -239 35 -96 -245 140 -138 -164 23 -136 16 -217 67 -145 97 65 -89 -206 87 80 -99
3526 -99 -100 55 32 95 -108 -61 -53 -213 -37 -223 -160 -108 229 34 89 94 62 -250 -3 150 -206 -38 -86 -73 -193
3551 -193 59 -104 -55 -252 -1 132 102 -24 -134 -47 -48 122 -10 96 -194 87 -159 94 9 112 58 142 -200
3574 -200 71 -64 -268 51 -29 50 -33 148 192 -29 36 58 123 4 124 75 -114 169 -124 -44 -59 216 -32
3597 -32 -36 -176 -57 -152 59 28 -355 1 132 -156 -129 -12 -38 -78 69 -77 -26 161 -10 -104 -71 -78 -191 163
3621 163 163 40 -137 -43 -113 -34 -3 -97 -200 199 168 98 -210 -13 -109 24 -88 -48 212 -10 -108 -57 148 -198
3645 -198 122 173 -64 141 13 -215 -84 -167 -21 -74 19 -252 -77 -124 170 -169 151 -206 25 206 112 80
3667 80 -139 -194 103 -66 142 58 -175 -19 153 29 107 -94 197 0 152 141 -122 64 -156 119 41 281
3689 281 -2 -96 -92 -198 -86 158 -110 -156 4 -137 17 -102 117 -214 152 -170 52 192 19 -277 -168
3710 -168 104 -178 170 -69 -85 -38 18 -84 -307 101 -15 -10 231 99 -25 -168 -9 -117 -98 84 170 -30
3732 -30 -92 58 23 100 37 -144 -17 116 190 143 152 -145 30 130 1 -26 -31 -150 -314 -10 355 -70 -17 70 1
3757 1 -9 157 -93 224 -147 23 46 336 -196 23 44 -213 -89 -186 -145 27 -38 88 120 -26 95 -233 -123
3780 -123 205 -133 58 193 129 156 -6 18 -203 181 -79 -52 5 -52 68 138 -343 -77 78 -10 -118 96 -106
3803 -106 -79 107 -113 140 131 -85 2 48 -164 98 230 309 -136 197 -122 227 168 -87 218 -143 55 -122
3825 -122 -31 -21 -63 -368 -165 75 334 -110 -101 335 -66 135 -23 -70 -203 100 126 114 -97 -243 -129 113 232
3848 232 -87 -40 -62 7 -25 59 -95 403 -78 45 -195 -35 -52 -103 44 88 99 6 85 -37 274 -300 -107 -192
3872 -192 -96 52 -54 -284 -115 -74 6 -276 -46 149 -57 76 153 -36 -134 -48 279 62 72 65 -203 154 -64
3895 -64 176 7 35 414 100 384 6 -109 -30 183 50 -92 94 15 15 59 -13 219 236 -286 -14 73 -269
3918 -269 -271 -83 76 -107 87 -163 -34 21 -25 11 -230 49 206 122 -125 105 -199 90 144 9 164 111 47
3941 47 72 -54 10 -52 -104 -63 -530 89 99 -17 182 -37 -44 117 -57 175 137 81 -142 37 43 117 -19 -106 -189
3966 -189 10 -41 158 -3 201 208 -1 -206 17 373 -96 127 19 238 -78 -99 130 52 -129 -207 -57 5
3988 5 -141 124 -19 -35 95 115 104 -49 144 -18 98 -238 -21 -20 -37 105 -68 -108 189 -48 3 34 -5 65
4012 65 -71 -142 25 18 188 38 -17 231 -114 68 -37 -59 -25 -109 77 -17 -50 -324 22 133 -59 198 148 -96
4036 -96 67 0 69 16 -47 59 46 75 99 49 -89 -19 -80 31 -43 -28 -224 26 10 145 78 -84 23 -143 -123
4061 -123 25 113 -173 228 96 40 92 -206 -263 82 -40 92 -125 154 -21 2 -119 48 -62 176 -148 -56
4083 -56 -120 -166 26 222 -115 12 -114 99 -147 -53 -104 -52 113 -115 -4 -234 71 168 -165 -170 163 -64 -102
4106 -102 -32 36 22 -130 211 -139 175 5 82 -128 -33 208 9 19 -85 162 -132 -202 -19 -89 154 144 91
4129 91 124 -188 26 257 15 -87 -104 -104 -152 19 -49 -84 -282 76 -130 -150 226 -191 43 -113 5 -262 -33
4152 -33 23 -18 -34 278 111 -273 -308 -21 6 -107 54 189 -84 28 -72 -21 41 16 -6 53 50 -175 -32 85
4176 85 -51 -115 -201 61 -21 -79 42 97 -96 -145 86 -182 -78 65 74 -14 -37 -123 105 -235 -19 -154 -110 -49 -116
4201 -116 -37 -33 -11 227 -107 162 -88 185 33 -207 -151 -71 -280 192 83 92 -161 -27 239 -9 81 31 168
4224 168 -126 -98 132 22 -62 303 73 219 66 57 51 -153 -200 52 -92 72 -125 -47 69 -100 -64 131 201
4247 201 -199 186 164 39 10 -39 221 64 -48 272 -178 79 104 188 18 -4 -118 36 -180 -122 105 -144
4269 -144 136 -95 5 197 -48 -70 -119 36 -114 138 -37 69 1 -35 -47 111 231 -150 98 -22 -110 -149
4291 -149 -262 9 152 333 -167 -6 -151 -60 -118 168 18 -19 -188 175 645 113 -38 -12 596 -414 -185
4312 -185 -369 364 -214 -292 -123 1250 688 -214 -11 250 -147 -343 383 29 -52 -378 259 17 15 -63 67
4333 67 -119 -53 -396 173 141 -120 -117 115 -114 229 -189 -48 -44 160 102 3 188 26 21 98 -4 57 21 181 -136
4358 -136 -245 -55 128 -137 -251 4 -9 114 4 92 99 324 137 -109 108 -317 258 97 -69 70 193
4379 193 74 38 1 -215 -140 48 -27 16 240 113 202 277 51 41 92 -89 65 38 -42 -32 150 267 27 71
4403 71 2 -190 56 -128 87 -91 -234 73 12 -97 38 -57 -80 78 133 97 -91 3 189 -108 132 88 52
4426 52 -154 152 -28 9 9 -151 285 -82 9 -78 40 -18 13 88 -27 -364 171 -55 -57 -72 -96 -75 -159 89 -253
4451 -253 -88 116 263 87 119 -223 4 154 199 217 -177 -9 -47 81 91 94 14 68 169 355 -249 -148 41
4474 41 -4 172 166 -1 -105 221 107 25 -106 -13 87 -52 -49 -76 -77 -149 -195 77 149 -172 -12 -78 -65 -213 65
4499 65 257 -90 41 46 -59 177 7 76 -130 7 100 -82 -45 23 202 7 -119 73 65 -153 -112 -91 -48 0
4523 0 -58 -108 -112 90 333 -111 143 188 -119 72 -117 -32 73 37 -4 59 -27 127 241 -244 -107 38 -107 124
4547 124 20 -140 -86 208 20 -148 -162 -125 143 -29 72 -87 -116 93 -102 12 -43 -101 103 115 -165 86
4569 86 -114 111 -9 -43 -199 150 -169 69 -30 -39 -221 93 -29 -98 211 146 -32 -49 247 -77 -106 158 -120
4592 -120 45 74 -174 335 68 110 -74 -134 37 95 -114 -190 -32 -154 -86 -213 190 -9 -49 144 15 111 30
4615 30 121 109 -71 -86 -229 62 70 -75 -179 138 86 216 -22 279 62 -81 -101 -47 86 1 145 7 12 22
4639 22 -73 93 126 -280 234 -16 17 43 122 144 7 67 -50 -15 -91 109 -170 119 47 236 -238 -22 126 77
4663 77 -129 26 283 0 156 87 120 13 12 -246 -49 -81 14 -90 1 -135 -192 -18 -42 -308 -146 78 -151
4686 -151 -258 14 104 285 19 -214 -43 168 -3 152 115 44 169 219 -134 -324 -10 79 -50 -22 -171 -129
4708 -129 -66 -8 -230 -200 53 -120 39 -91 94 -39 147 -156 175 -178 -138 81 165 -281 73 -261 80 -48
4730 -48 -1 76 192 118 -166 -281 3 -206 40 -35 61 -197 68 -299 -41 172 -86 91 138 -100 -226 146
4752 146 2 30 -49 178 61 185 37 322 -151 24 -75 160 16 116 -217 99 8 51 -183 269 -29 144
4774 144 -292 -222 255 5 155 144 29 165 122 -26 -154 42 -170 36 -49 -122 -69 -62 113 -32 -117 356 -54
4797 -54 79 -24 32 -40 6 56 -174 -110 65 66 219 -118 188 129 127 223 -67 -29 -46 153 174 236 25 387 -67
4822 -67 -76 -194 -82 -19 128 -238 -71 356 -11 -80 -225 120 45 -89 3 83 -123 111 -101 -235 282 -51 -115
4845 -115 -93 -180 -165 -41 17 278 50 -18 128 -98 -152 92 -135 -59 93 -118 -124 -123 185 251 -36 -155 62 53 230
4870 230 -286 214 -71 -122 39 -101 16 117 -147 -12 162 -11 244 -43 -10 50 209 -43 67 -24 -81 149
4892 149 101 -208 25 -22 45 155 -2 -77 -137 -39 55 -31 -47 -21 -206 44 -19 -98 -161 48 124 -6 -54 285 2
4917 2 -109 -166 57 -12 -52 -182 -160 -165 272 -24 34 -206 -257 -116 -146 -51 -67 22 158 185 -94 186 -48 -51 -5 345
4943 345 -67 -127 114 5 192 150 -166 52 -40 -60 218 -147 -69 -222 268 65 -59 167 123 -35 -35 -21 -17 -78
4967 -78 94 -7 33 90 118 -193 -73 146 0 39 -127 -32 185 24 -244 -87 -49 -144 158 -272 -113 14 -55
4990 -55 -71 -179 -137 -369 -35 -252 -125 -107 64 -109 -230 -297 176 97 59 -48 -10 212 -31 234 153 66 14 -107
5014 -107 87 -178 -188 -54 120 -197 -108 44 15 -157 21 157 -65 157 -54 130 -91 -332 95 70 -187
5035 -187 52 -4 -45 -129 192 180 118 214 248 -122 -31 77 163 141 25 -42 -155 -1 129 -77 259 -197 -219 84
5059 84 -69 -184 16 -23 -188 45 118 -203 23 298 -116 86 100 178 16 163 194 -44 -62 -194 148 17
5081 17 -5 -186 -156 -106 160 -39 -97 -28 25 -29 74 37 60 45 -85 -182 -57 73 -1 -111 -119 -85 60 -146 -166 42
5107 42 -26 -116 -184 -13 305 73 144 14 -187 46 -41 -17 -20 28 -134 55 -45 -163 94 -131 -115 -78 -61 184
5131 184 -178 -309 -26 49 -88 -65 71 173 -29 -27 -114 162 -220 -134 160 -62 138 -179 -30 -24 107 -143 -136
5154 -136 -61 23 17 119 7 447 -138 -99 15 -81 -29 39 -121 -67 196 126 274 -128 -175 -84 30 30 108 -101 -135
5179 -135 -148 31 48 -44 121 -56 -484 62 143 193 -161 163 -68 -74 129 151 -131 47 -177 163 116 -291 34
5202 34 -305 56 44 84 -175 -54 187 217 -10 160 175 -97 73 -22 109 -171 19 -12 -54 -435 -22 -26 -16 159
5226 159 -290 37 275 -82 33 -191 -197 133 -194 60 161 111 -24 69 15 -190 169 -75 54 258 379 -78
5248 -78 -83 84 83 61 76 139 74 -97 -26 -69 -16 -70 139 -86 -45 64 -256 -121 -115 -22 65 -100 -15 -90 352 160 -20
5275 -20 210 191 -120 23 236 6 114 31 -87 -45 32 254 177 60 21 120 -46 138 -163 42 -35 -138 -98
5298 -98 -133 138 -57 213 -150 110 -7 -83 155 124 -72 72 174 323 -113 49 120 -6 -280 83 244 239
5320 239 10 67 -67 -293 -24 -242 98 -122 112 34 226 -65 -319 -112 51 -48 106 -203 -54 69 55
5341 55 -160 304 -176 -152 251 13 -53 -97 71 -54 174 98 -223 -86 -241 11 165 83 14 -78 -27 -12 97
5364 97 -46 -104 -8 -195 -142 -246 -93 -214 -46 -23 77 122 -93 143 -264 -35 -72 -171 -95 6 13 164 -41 172
5388 172 -52 -118 -36 -25 86 120 15 -93 -134 -27 224 61 76 33 -64 377 -98 -161 96 82 -53 75 95 112
5412 112 -116 -82 -10 6 -178 -6 156 51 99 -195 11 238 138 201 164 258 -212 147 -271 -6 105 -218
5434 -218 160 -27 -6 194 -98 48 166 60 132 -148 167 179 -94 148 4 -21 148 -9 254 -263 -210 -117
5456 -117 227 153 -40 171 -2 -29 -247 148 19 19 -216 -127 -51 104 57 158 -120 82 214 4 -22 -130 -233
5479 -233 -52 -72 -209 -160 -51 1 -228 -42 -48 -33 -40 11 -193 82 -39 72 56 205 -51 12 60 127 -339 -199
5503 -199 -48 -17 -241 65 -11 -183 83 39 -166 216 -51 66 -218 -88 72 -289 173 -243 -128 -225 172
5524 172 -172 35 62 207 104 209 -88 2 -106 -134 42 122 38 -1 96 -261 -171 -152 36 118 -58 36 -181 94
5548 94 -106 147 -106 137 19 -73 -95 111 158 -368 13 142 -141 -36 58 -193 -142 -47 -47 89 -219 -261 64
5571 64 -52 -29 81 -154 -161 84 49 66 -133 59 -46 -117 15 -8 -95 40 -279 274 198 -82 -122 -72 185 -41
5595 -41 -119 -230 -145 69 -95 -7 -116 133 63 -92 140 -133 -135 36 -89 86 162 -166 99 128 39 81 35 -132
5619 -132 227 193 32 -126 97 118 53 -3 -46 -75 118 -39 -65 38 -145 40 154 48 -129 134 -18 266
5641 266 -27 -201 -28 -168 2 55 -14 -24 100 31 3 -114 -27 65 196 62 -13 54 7 -142 82 32 16 31
5665 31 120 276 112 92 61 -87 -73 49 237 -70 -93 -122 152 -30 75 -147 -155 50 -69 -130 52 105 5 -22
5689 -22 -39 -107 -223 134 54 -19 118 40 -30 266 63 -56 14 -47 -124 -15 26 171 67 366 254 -72 -154 205
5713 205 18 -35 98 35 -90 41 195 -185 -76 -29 -39 -259 125 -104 -125 11 -205 -69 234 225 -94 -50 -64
5736 -64 52 224 -3 149 -226 -3 86 52 -153 -10 316 -104 36 279 41 40 35 52 -83 284 62 -31 -211
5759 -211 182 88 -101 5 -133 -56 -190 111 -54 -40 -5 57 -85 -95 -88 137 81 16 371 333 136 -64 42 -374
5783 -374 225 191 -204 220 152 67 93 97 -30 179 -28 3 79 -58 -226 187 65 -17 116 121 -23 -167 25 70
5807 70 -108 62 197 19 -14 30 -242 63 -77 2 58 216 78 -33 -62 70 273 140 262 40 -231 237
5829 237 32 -141 -26 -11 -113 -14 -42 -38 140 -209 -170 107 23 14 22 -41 188 -107 -65 -229 -26 72 -247 57 96
5854 96 108 121 -258 -15 -11 153 358 14 -103 -293 280 6 217 75 115 143 -3 58 -79 -60 41 216 207 118
5878 118 -39 -68 73 31 49 213 9 272 182 -70 -3 182 -35 74 -27 3 138 -29 -291 -133 64 -17
5900 -17 -104 7 83 139 58 -32 18 -70 79 -56 68 -56 -99 -40 83 -171 -261 34 39 -81 -26 143 80 164 194 -84
5926 -84 120 -38 97 -8 -25 13 -59 31 62 8 -51 -183 20 -36 157 252 -179 5 -186 -78 106 2 -38 76
5950 76 -10 55 62 -167 20 144 57 -115 12 217 -190 194 32 123 -102 -121 56 -200 -235 46 18 -2 -126 103
5974 103 -25 -39 -39 48 -220 41 -113 -82 228 112 12 79 123 332 25 -78 83 76 -57 121 5 62 12 -149
5998 -149 3 -286 23 -186 222 71 51 7 82 -109 145 -49 56 39 -90 388 -186 -281 31 125 -135 -173
6020 -173 92 -120 -140 -25 -38 229 270 -265 -184 3 -100 -84 73 201 108 258 -84 -120 163 -241 -281 60 -40
6043 -40 -142 104 -112 77 80 76 118 118 204 -47 -44 68 -142 -2 -144 97 -41 -182 -113 -64 -57 63 -99 -358 -128
6068 -128 -169 -33 -140 106 -139 54 124 131 -25 154 -98 -37 120 203 80 17 -270 152 267 133 180 24 -1
6091 -1 217 53 149 156 82 11 106 -346 -142 110 -160 -80 -190 -4 -50 37 163 69 -15 -155 130 -26 -208 -5
6115 -5 -154 34 -79 106 -71 120 183 134 362 28 125 76 32 62 -154 -131 28 -77 14 95 236 -67 -196 -93
6139 -93 118 -104 51 97 20 272 25 -42 189 9 -251 -249 97 -164 -207 18 -122 83 80 -41 -45 42 132 -140
6163 -140 26 203 64 222 -205 47 31 -62 19 -97 138 14 7 -66 -105 -50 -51 62 37 -1 8 -273 1 -62 157
6188 157 124 -21 87 58 -333 -37 -38 106 29 -73 -39 -286 16 222 67 -116 -317 -15 -156 -7 -55 208
6210 208 -235 67 -48 -110 140 -112 3 -54 253 -33 -13 44 -21 171 -15 -169 -60 41 32 189 -49 -192
6232 -192 -50 40 350 -47 -175 88 71 64 -36 177 97 18 -131 27 -32 -30 140 -62 180 0 120 -80 131
6255 131 369 166 -47 -83 -86 -93 -105 -1 -316 78 20 -118 -90 -41 137 87 257 -42 -31 -2 -145 143 56 -89
6279 -89 -130 51 -160 13 78 81 105 -6 160 -14 -134 6 -96 33 224 -158 258 180 18 55 -197 60 -44
6302 -44 -290 -179 19 205 8 -179 -68 140 -35 42 88 -30 -153 -265 -99 25 -45 116 85 -237 256 7
6324 7 -125 367 -98 16 -62 172 -322 84 16 -35 -260 228 -69 -109 94 74 162 -62 -40 -41 48 281 77 -122
6348 -122 116 -92 -92 261 -45 -112 166 13 -45 -178 50 66 -215 -34 -56 2 -47 -350 257 94 -123 -12 134
6371 134 -44 23 10 7 -18 -180 131 121 -79 120 307 153 45 -88 -106 159 -71 12 37 -152 -69 0 -218 -50
6395 -50 -130 34 -228 -192 86 -226 -91 -90 8 84 -21 22 -91 -157 116 215 -131 32 -220 202 33 73 101 -49
6419 -49 173 102 -44 -23 92 52 -164 -178 -12 -122 -149 -266 43 122 33 -204 244 169 -96 -64 7 0 -103 91
6443 91 115 90 -195 -118 -46 -90 131 260 -118 2 -6 -170 -89 3 -48 130 215 -14 -21 203 110 41 -61 71 -202
6468 -202 -69 42 -164 58 43 49 -132 154 -55 3 156 -234 -142 124 -156 -127 -91 10 5 -36 -364 28 106 178
6492 178 154 -15 -227 -245 97 -59 117 -13 29 -88 186 31 -35 58 84 -160 -98 148 -8 155 61 -45 -77
6515 -77 -24 -325 -291 257 -29 42 178 72 39 156 -22 230 -249 128 135 -62 194 -42 29 -57 187 -111 94
6538 94 -122 94 185 38 -14 63 -132 -173 228 -57 -25 -79 280 -71 -180 -95 -48 -116 -100 -133 -18 119 45 149
6562 149 -99 5 32 -143 -99 -4 -199 -144 198 -113 76 -123 -173 10 29 -246 -193 122 77 13 268 -28 57
6585 57 -128 -88 -151 -299 5 -126 -15 84 32 -1 53 -42 23 -102 83 3 77 -61 -20 81 0 59 192 182 20
6610 20 261 26 12 -71 -4 -234 29 106 17 145 -45 -195 23 32 80 1 -143 111 59 54 207 -80 22 -14 41
6635 41 311 108 -79 77 39 49 -197 47 13 -43 67 -122 210 191 81 -207 -344 -205 55 -161 -144 120
6657 120 -28 78 -140 166 405 -19 55 70 -25 19 134 -46 24 -227 217 330 189 125 89 -4 143 -23 58
6680 58 48 -157 30 -54 72 116 -183 -205 -111 -9 -13 -32 -92 -54 15 245 244 -169 265 58 -101 -144 -132 57 -143
6705 -143 86 -114 -148 -56 44 -152 68 -139 87 168 -103 208 -116 -263 -71 7 -285 117 40 -80 131 -82
6727 -82 204 150 210 -3 -195 -14 -104 -41 -75 89 -70 -90 -8 -26 -25 117 194 180 -289 64 43 202 -33 -133 -135
6752 -135 -232 212 -61 -93 -121 194 -278 232 19 170 -162 -318 -26 -279 35 -41 61 -31 -24 3 66 -239 -181
6775 -181 -367 -389 -206 -172 71 -172 11 111 44 96 -130 83 -164 -16 62 276 -59 265 -160 89 80 -102
6797 -102 69 -43 76 74 -115 -186 -310 33 -75 -181 66 84 26 -75 60 250 60 45 144 -197 -246 -54 7
6820 7 -17 -60 -177 138 50 105 -18 -39 -81 -151 77 -177 133 -1 187 -105 20 35 -108 203 47 96 -155 8
6844 8 168 -11 -212 78 119 248 155 83 -64 129 49 77 -157 -2 -70 -71 -16 192 256 -132 -133 10 -309 -310 -110
6869 -110 69 144 82 64 -98 91 5 137 -84 110 27 -46 197 -175 178 188 -106 -123 -150 75 -150 -101 -58 -92
6893 -92 -62 -32 78 -145 -259 -160 47 28 193 59 83 144 -20 10 18 -63 109 105 37 -276 228 95 1 -125 25
6918 25 184 10 -63 29 -155 158 21 -93 228 -265 170 -54 138 168 71 -61 -78 -132 -31 59 8 -184 141
6941 141 196 -7 -60 81 -14 -93 29 -74 100 42 -161 317 -73 11 -56 12 -224 22 -78 -41 117 116 -49 5
6965 5 82 -52 -264 286 124 -66 48 -8 -132 295 113 23 356 105 191 160 38 -339 -252 129 -113 182 -47
6988 -47 170 88 -116 119 368 -19 -159 -131 51 -165 4 -98 -40 182 -117 146 115 -488 33 -571 40 -244
7010 -244 -228 -76 47 -427 959 39 -772 26 -407 270 -59 118 -165 -220 -241 223 -50 -36 98 -100 -81
7031 -81 352 -98 -52 -190 52 -153 289 35 147 85 29 -262 147 93 225 -148 -135 -73 -85 82 82 -309 28
7054 28 -101 6 121 14 109 240 44 -25 59 106 151 -24 82 -236 -182 -166 -35 222 -128 -21 17 43 106 -201
7078 -201 133 66 -106 -51 -71 260 -217 114 95 -283 231 194 -193 68 66 -177 -45 139 49 1 57 -53 302
7101 302 -109 86 28 35 -49 143 77 -10 -215 50 97 -44 145 -93 58 -42 -31 -176 -160 -61 150 -107 -15 -205
7125 -205 249 -3 -57 16 75 -51 51 -167 169 -99 2 -15 -137 -30 -62 -86 262 -87 38 134 40 340 -65
7148 -65 -17 -1 -62 369 -69 -69 -68 175 150 66 -39 -71 -95 339 141 64 -205 -59 109 189 198 105 154 36 -171 31
7174 31 89 40 108 -116 -90 -57 46 -93 74 236 -211 -15 -162 -63 193 47 185 16 5 -105 33 -104 -92
7197 -92 -30 -50 -223 348 306 216 318 -386 13 -107 -46 -7 -227 -92 290 -29 -32 71 -54 93 -178 -69 38
7220 38 83 -81 -48 -85 -166 -28 -11 -8 167 103 -63 -14 60 82 171 89 -21 11 -205 53 -67 -176 78 -42 317
7245 317 96 -99 -110 30 11 79 107 186 197 51 249 -275 -4 46 11 154 141 -52 115 -169 -44 85 -3
7268 -3 -159 309 -52 41 18 75 364 182 43 254 -109 95 26 112 139 55 -136 -31 209 -143 -219 247 -8
7291 -8 191 -35 -111 -110 -38 103 -18 19 -268 58 75 -5 173 96 -60 87 -52 -95 -135 -104 30 27 205 -117 -31
7316 -31 91 44 34 -191 39 -118 -286 15 -200 -32 -124 183 -200 -121 77 76 106 -33 -63 -116 -257 -205 147 215
7340 215 172 -96 -73 117 253 181 -147 75 217 -63 -295 98 -109 81 -76 -137 112 -270 145 2 42 152
7362 152 -2 -232 -221 -100 270 1 -55 177 77 -108 115 -250 142 -311 88 146 5 -90 -101 238 190 -135
7384 -135 -49 -197 -153 -163 -12 92 -63 -6 -79 127 57 55 2 124 -70 81 -130 -69 -4 100 51 49 -180 8 -84
7409 -84 -77 -189 34 -147 34 210 -35 -15 -30 173 -1 -151 245 54 -40 100 259 -158 -27 -16 -79 -115 33
7432 33 -97 -52 7 -126 -120 -73 188 116 8 -22 17 111 -65 -66 -83 215 24 -301 -45 -198 58 -46 42 123 153
7457 153 120 -249 178 21 50 199 159 -121 -259 169 -17 134 -136 -85 -90 40 -95 183 157 71 5 37 23 -216
7481 -216 103 49 292 172 2 142 -45 188 233 7 -56 -119 -163 -5 283 -7 28 208 201 200 -41 -179 -66
7504 -66 49 43 -151 -62 61 151 -145 -337 -33 -44 -162 -178 56 126 -48 -59 180 109 -18 -41 59 -42 76 -86
7528 -86 -11 -169 219 39 -173 -312 69 -19 117 -66 -5 50 99 -66 -212 76 -49 158 107 -95 -49 -6 -323
7551 -323 202 6 253 187 173 313 131 224 -53 -32 58 -225 80 207 -212 -10 26 -202 -21 146 -196 -44
7573 -44 2 106 -12 -29 -52 -204 -22 -79 -70 -187 10 17 70 37 -130 -132 113 -256 49 10 -46 47 -71 23 -89 27
7599 27 -134 -27 -4 110 48 -60 -196 177 93 163 -155 77 -152 -41 149 -91 1 -122 -160 197 -190 42
7621 42 -170 49 -54 -190 211 149 74 54 251 -77 -285 295 -167 177 -81 -324 85 -83 -41 97 194 34
7643 34 24 30 -55 12 10 -49 -25 156 -9 -174 115 55 -21 -11 -46 86 85 64 -93 -99 -29 143 204 109 109 105 23 104 199 -36
7673 -36 292 -49 17 81 277 133 89 -82 -13 -144 109 140 45 -86 52 121 -11 -62 103 236 -67 136 21
7696 21 -298 -230 -35 -41 -8 45 76 40 9 104 -94 138 9 -43 175 159 40 6 147 -177 -162 -190 -109 210 -82
7721 -82 106 49 -37 -131 101 5 80 -57 261 -21 -14 -65 43 135 -160 95 -25 251 -95 218 111 99 73 -52
7745 -52 -180 -25 26 -38 81 66 -84 83 21 236 -83 178 -89 -61 -146 105 -68 112 46 -13 11 6 -26 101
7769 101 8 55 -88 188 -122 113 52 38 -34 47 -58 64 73 39 -28 -110 116 -110 102 -246 -29 56 -152 -155 -162
7794 -162 158 135 -152 -55 46 -56 -68 50 50 -157 -74 62 30 108 -84 204 -43 53 10 -255 -60 -177 -110 -219
7818 -219 161 106 54 64 302 315 -86 103 -132 21 -179 248 -88 123 -207 118 -104 -185 253 -28 -67 110
7840 110 14 18 95 208 236 245 126 181 54 -163 137 50 128 -221 136 -256 271 149 52 -115 87 156 -101 -64
7864 -64 -31 54 -228 -132 -103 41 8 6 219 -103 -141 -14 82 99 156 15 -132 4 -87 121 -258 42 205 -18
7888 -18 -127 199 36 -21 121 -87 -272 -31 64 -12 -53 -24 449 163 -131 155 -146 -21 89 -120 -17 -84
7910 -84 -278 130 121 160 -44 -64 -144 -20 87 90 -7 -175 -110 -87 -56 -100 138 -27 -109 49 -174 124 -418 -5 201
7935 201 62 1 120 43 -31 -54 78 42 206 -120 48 -100 36 34 -217 -173 -175 -13 -171 -98 200 3 224 199
7959 199 176 -32 87 195 -52 -27 -66 295 -124 -71 -153 41 154 43 -191 272 162 188 82 -69 233 -55
7981 -55 -203 -96 167 -56 -60 143 -5 -17 -25 197 5 -3 78 14 -294 -18 -222 158 -260 45 302 79 124 34
8005 34 140 -167 224 156 159 103 215 82 10 -76 29 235 86 39 204 198 237 -45 218 238 -207 -3 22 -57 201
8030 201 45 -88 10 157 58 42 310 235 -160 222 -138 -79 40 -188 -108 80 -13 -107 -148 -71 -158 75 292 -87
8054 -87 -40 -92 -7 325 -36 -77 5 9 -2 -33 4 7 118 51 96 -105 53 133 -155 77 -13 36 -32 -16 262 45 -47
8081 -47 188 163 -171 -65 188 139 -26 47 111 -61 -58 -35 52 -121 -108 186 83 -46 -136 -74 82 180 77 -95
8105 -95 89 -40 -60 139 -43 -126 -20 22 -195 -84 -329 -32 59 -8 111 97 -230 76 -305 -210 -12 -117 100
8128 100 52 -57 -89 -168 -153 106 -177 -12 -24 -9 108 121 47 -151 -304 206 219 20 79 -71 -135 107 -141 180
8152 180 -23 53 165 58 71 -45 -34 -55 -29 3 -117 160 -52 -165 119 -24 -135 -39 88 99 144 100 271
8175 271 -136 172 -29 -85 -143 -104 66 72 -49 -74 47 229 -13 114 233 -107
8191a07
$$ Imaginary data points
##PAGE= N=2
##DATA TABLE= (X++(I..I)), XYDATA
0 0 0 0 0 0 0 0 0 0 0 0 0 0 0 0 0 0 0 -8 8 -8 8 -8 8 -16 16 -16 22 -24 26 -32 35 -40 48 -51 59 -66 74 -83 94
39 94 -104 115 -128 144 -158 174 -192 211 -235 258 -282 313 -345 379 -418 463 -511 570 -635 710
59 710 -803 914 -1052 1226 -1458 1781 -2264 3066 -4623 8811 -44659 -113153 -6825 52753
73 52753 17323 -7158 46611 79073 63108 43927 37884 20003 24288 42097 27406 -11485 -8718
86 -8718 25488 21435 -23922 -37397 -20495 -27619 -49122 -48088 -41038 -41100 -30304 -6238 -5121 -18183
100 -18183 -6215 15757 10598 -52 7358 21498 30315 38411 42496 31131 23802 35139 31966
113 31966 384 -15992 866 10052 -11228 -25838 -10495 -4112 -21772 -29942 -24808 -28814 -34026
126 -34026 -22550 -9045 -12832 -11078 9117 17102 6882 6609 17392 19254 12070 12736 21198 21383
140 21383 17242 20008 18605 8401 297 -1927 -6165 -15704 -17406 -10612 -11886 -16583 -12656 -9771 -11948
155 -11948 -14123 -12337 -10005 -8813 -4346 2596 6140 9262 13299 13363 10972 10487 11836 11059 5839 5084
171 5084 9187 8013 3005 1424 1605 -981 -6961 -9567 -9586 -12327 -11413 -6840 -6222 -7282 -5635 -2839
187 -2839 -1702 -3468 -3660 -1092 1710 4050 5205 6323 9560 10743 9700 6485 2619 3437 4929 1775
203 1775 -1017 -167 1979 804 -3087 -5137 -4839 -5712 -6397 -8131 -8430 -4841 -1898 -1648 -1445 -1031 739
220 739 2040 727 1041 1673 3605 5034 5219 4979 5544 4849 5393 3174 -624 -1356 -730 90 -1266 -3112
238 -3112 -2246 -1514 -2709 -4267 -5785 -4515 -2559 -3663 -3964 -1967 132 1623 1613 1436 2487 3056 3048 2812
256 2812 2496 3823 3977 2712 2947 2128 1173 613 -697 -1783 -2657 -3717 -2968 -2383 -2857 -2732 -2526 -2097
274 -2097 -1957 -3411 -2341 -909 55 1043 968 2317 3903 3493 2850 2577 2523 3040 1998 890 1402 1642
292 1642 948 -627 -1146 -861 -998 -2354 -2952 -2825 -2893 -2491 -2631 -1476 -471 -643 -148 -241 51 878 876 2208
312 2208 3027 2680 2828 2431 2194 2852 1561 523 708 235 -114 -1195 -1721 -742 -2013 -2554 -2553 -2826 -1804
331 -1804 -2023 -2640 -1236 -322 -471 154 580 1427 1897 1629 1581 1594 1710 2830 2168 2260 2260 917 311 187 -454
352 -454 -590 -1909 -1573 -979 -1638 -2408 -1561 -1851 -1166 -1402 -2135 -1124 -410 72 752 435 1579 1828 1115
371 1115 1102 1899 1281 2123 818 2090 2383 1807 833 429 -149 445 -1703 -1967 -1410 -2601 -1696 -2272 -1746
390 -1746 -2124 -1657 -1141 -380 -247 227 -537 504 1849 1876 1883 2353 2178 2396 2406 1277 1572 1426 1062 506
410 506 -542 -783 -615 -1366 -1295 -1966 -2451 -1895 -2634 -2341 -1804 -1786 -1634 -922 -407 185 547 1060 1816 1455 1889
431 1889 2234 2536 3096 2316 1610 1706 1280 478 -312 -546 -472 -1093 -1896 -2346 -2580 -2245 -1711 -2460 -2007 -1863 -1613
452 -1613 -420 -346 -163 728 569 1055 1944 1889 2309 2418 2503 2426 1698 1598 1634 845 275 -61 -1346 -1386 -1649
473 -1649 -1857 -2119 -2127 -1609 -1953 -2204 -1320 -1071 -553 -263 -542 298 1265 1175 1431 1793 1711 1570 1487 1814 1849 1320
495 1320 977 569 -51 -85 -594 -1330 -474 -988 -1494 -1737 -1884 -1476 -1522 -816 -606 -823 -64 454 195 675 818
516 818 805 1135 996 1102 1108 976 763 404 631 303 -137 -164 727 -419 -935 -321 -1066 -868 -560 -444 -327
537 -327 -644 -830 -349 236 312 218 27 790 625 118 293 -201 123 434 152 -35 208 106 73 63 379 -341
559 -341 -525 84 154 -152 517 122 -168 256 381 88 161 342 175 -164 114 312 -631 -368 -300 -683 -448
580 -448 -236 -844 -769 -245 -1 -165 -124 307 338 977 1266 373 129 892 523 864 991 34 -28 126 -117 -116
602 -116 -700 -510 -631 -820 -775 -1065 -1147 -199 -558 -665 291 -95 -182 473 457 538 722 842 859 686 1396 1024
624 1024 571 329 613 177 314 -55 -347 -512 -757 -635 -999 -1158 -779 -1216 -640 -277 -872 -380 -148 48
644 48 595 749 384 850 923 1183 1118 1128 1091 385 397 718 261 -89 -262 -901 -723 -628 -959 -1321 -860 -967 -647
667 -647 -710 -707 -850 -494 290 453 -79 726 891 829 1063 1031 933 795 756 862 322 260 93 -633 -217 -238 -1036
690 -1036 -815 -722 -1227 -642 -1054 -977 -673 -164 -301 -219 -211 304 92 485 912 1029 890 973 621 874 870 608 443
713 443 32 179 -247 -338 -376 -861 -844 -757 -800 -1049 -712 -879 -590 -342 -324 -161 -91 423 862 655 770 869 581
736 581 845 753 607 890 604 402 436 -429 -213 -176 -550 -310 -703 -995 -704 -898 -862 -669 -622 -432 -215 -343
758 -343 89 402 659 332 490 499 750 907 856 682 364 772 137 249 352 -320 -220 -644 -895 -1039 -873
779 -873 -979 -653 -918 -652 -929 -665 -54 -277 153 292 203 299 735 904 1030 1062 1027 724 650 484 534 449 127
802 127 -155 -362 -476 -838 -724 -858 -612 -892 -662 -952 -595 -748 -493 230 -88 229 556 600 997 909 792
823 792 895 1007 921 934 561 457 306 61 291 -315 -460 -490 -745 -885 -770 -1043 -790 -715 -843 -307 -470 -164
845 -164 134 182 93 586 444 855 741 803 1006 815 934 516 665 501 86 143 -87 -491 -631 -890 -971 -627
867 -627 -1001 -998 -828 -792 -844 -659 -155 96 34 406 394 398 592 758 773 911 933 717 685 709 502 425 -15 -222 -93
892 -93 -477 -408 -815 -799 -918 -745 -776 -859 -481 -645 -340 -211 57 -100 378 292 558 744 611 601 752 587 876
915 876 618 544 464 107 -145 54 -284 -397 -327 -807 -509 -691 -724 -786 -602 -502 -486 -52 -146 184 445 574 445
938 445 373 619 709 647 744 275 641 351 108 454 -207 -219 -12 -207 -567 -327 -456 -666 -506 -853 -688 -387
960 -387 -703 268 -255 137 327 126 290 322 423 406 568 434 540 314 724 292 61 123 -153 -254 -154
981 -154 -613 -497 -560 -528 -394 -429 -637 -269 -186 -121 20 -14 -69 300 109 794 485 175 501 449 525 353 190
1004 190 198 105 -365 -96 -448 -185 -505 -596 -499 -303 -304 -606 -295 -1 -101 -237 75 49 -10 461 235 313 596
1027 596 269 130 448 361 434 211 120 -162 -380 -174 1 -521 -293 -33 -503 -122 -294 -99 10 -18 -5 -35
1049 -35 -144 283 297 438 541 148 174 686 29 299 197 140 144 16 -77 -391 -232 -129 -445 -457 -234 -457 -499
1072 -499 -264 -162 -434 -10 -265 85 -14 419 344 400 529 316 556 283 122 127 466 109 7 23 73 -142
1094 -142 -212 -281 -214 -543 -380 -266 -432 -9 -340 -380 24 63 -74 312 105 33 339 472 425 152 263 491
1116 491 148 367 501 263 -121 -46 106 -185 -228 -772 -514 -239 -520 -377 -304 -227 -264 -92 135 225 -144 186
1138 186 308 149 418 429 228 98 357 431 9 176 116 -250 -80 73 -395 -293 -129 -454 -629 -432 -399
1159 -399 -170 -4 -229 -99 -93 109 -141 267 162 -60 216 237 303 249 502 458 223 255 156 2 -131 30 -75
1182 -75 -377 -331 -475 -546 -404 -500 -97 -398 -107 -377 -137 96 -27 -113 247 57 413 229 329 203 308 194
1204 194 167 1 195 10 58 112 -56 -120 -111 -91 -342 -516 -364 -342 -429 -400 -91 -221 -117 92 -38 81 265
1227 265 168 219 85 105 134 171 283 373 -97 -104 131 -106 126 -28 -131 -116 -61 -496 -44 -424 -322 -40 -31 166
1251 166 45 137 42 -41 29 223 168 380 -21 374 349 198 271 165 126 20 124 -97 4 -97 66 -122 -204
1274 -204 -241 -146 -191 -59 43 -148 -166 19 -159 63 -174 190 -4 161 246 -148 213 83 23 113 166 59 57
1297 57 -97 -153 12 -234 -203 -234 -66 38 -197 -426 -87 100 -169 117 -44 -103 78 -41 42 74 17 53 169
1320 169 -31 188 10 199 156 -20 3 -80 -174 -46 -13 -10 -96 -154 -89 10 -48 30 78 204 -163 -181 9 242 315
1345 315 -10 117 -19 293 -162 -50 -89 -292 -34 -128 14 4 -119 -210 -158 -478 171 -98 -142 -11 -116 -32
1367 -32 -78 87 166 -95 96 129 -40 -43 359 71 70 403 56 119 -28 -57 -234 15 95 -36 -370 106 -191 -297
1391 -297 -199 -180 -143 -210 124 189 35 -90 88 -179 405 116 221 145 59 -21 297 174 -97 99 -185 -13 26
1414 26 82 -28 -52 -44 23 -196 -81 214 -74 26 37 178 98 221 198 -64 -16 255 84 127 143 61 172 103 97
1439 97 225 333 52 -164 -244 2 -50 -263 87 -55 -9 18 46 -33 69 187 72 -105 121 23 163 47 1
1462 1 75 152 47 373 207 195 -196 -3 111 -98 -77 194 -335 107 -233 -65 27 -4 -201 -102 -99 -21 -71 -99 204
1487 204 165 132 336 44 -156 103 96 177 0 64 -103 -408 2 86 -265 6 -129 -94 -123 -299 10 6 -87 -227
1511 -227 -149 108 -40 -84 -145 303 231 220 -39 166 -129 157 55 -21 215 25 80 104 -21 266 -297 -250 105
1534 105 -51 -44 -80 -6 -144 -32 -74 -231 226 247 90 263 243 -9 139 29 60 262 11 231 27 -96 188
1557 188 30 100 -158 -78 -259 33 -95 97 -160 -34 39 156 -155 51 161 110 342 -112 287 -85 16
1578 16 -21 -91 47 -75 -194 -154 98 -168 -96 185 -169 -143 -103 199 -23 -180 -30 100 33 123 267 90 90 163
1602 163 54 101 90 -93 240 -101 -89 -169 13 79 57 106 67 -106 169 -8 69 36 106 150 -95 120 -36 -39 174
1627 174 82 149 118 -9 -146 -58 -25 188 -97 -231 76 -171 129 144 -23 -51 327 -79 2 139 -37 126 49
1650 49 89 115 17 73 30 -25 -33 24 -254 32 -42 -363 -95 59 -70 -106 -210 44 -113 -75 -100 -172 158 185 63
1675 63 -33 318 -171 87 205 320 273 173 232 203 258 69 -103 126 159 -108 157 -87 -142 -234 -214 12 164
1698 164 -80 20 -5 -27 -172 -297 -131 252 -115 -137 231 -57 245 174 276 259 121 106 281 106 121 148 14
1721 14 -98 -232 -71 -275 -145 50 -186 -177 -452 -187 -20 -166 -212 -72 106 72 206 166 269 170 -181 88
1743 88 88 146 239 100 79 -5 -27 52 161 -101 -88 -55 13 -135 96 -13 -68 -209 165 102 287 -80 30 207 54
1768 54 85 -3 -110 -237 94 -53 164 168 -87 95 162 -9 -77 -12 29 -158 -9 -195 -24 91 -117 -135 -72 -50
1792 -50 46 226 7 -55 -37 65 231 -59 151 -165 13 6 -140 108 -104 209 -109 -196 -73 -97 77 -136 -48
1815 -48 -38 132 41 -196 -32 -63 -164 89 59 303 43 382 46 28 -59 6 -164 82 -115 166 144 127 274
1838 274 -53 111 52 30 -74 -209 -77 104 -146 -183 -13 -162 99 -185 117 75 264 -234 7 323 -3
1859 -3 119 -46 101 228 40 -140 -32 -161 -20 -203 -40 -230 -158 130 13 -268 42 43 -73 135 133 2
1881 2 88 20 254 69 122 43 -315 334 22 142 90 79 -192 -3 -221 32 23 -301 291 -107 -33 191 101 -86
1905 -86 -36 -149 -152 112 51 -72 -86 8 82 115 254 8 -55 -16 89 -6 -41 -1 132 112 -12 -5 -203 -164 -109 -121 -172
1932 -172 -107 -100 -25 -43 105 6 -137 58 0 82 -8 337 253 -6 121 -127 -56 277 -209 90 71 -35 84 22
1956 22 12 -121 78 -54 59 18 8 126 -242 -226 5 83 48 -103 -115 61 256 -97 -50 423 -43 85 181
1979 181 -154 -212 81 -76 40 -8 95 76 -276 -24 -68 158 276 -9 -153 21 -1 142 -308 -22 -228 -138
2001 -138 149 -25 147 40 144 -138 68 74 -174 149 -137 -15 -259 -214 -181 11 233 -93 -113 322 -65 18
2023 18 -185 -31 101 190 169 -17 -10 21 -85 120 8 89 -37 -22 123 -116 -90 -12 45 -9 -184 126 119 -86 155
2048 155 -172 -157 -116 -189 -79 73 -15 52 -73 -7 92 28 246 142 26 193 50 -151 -225 -101 -25 -141 242
2071 242 -115 -385 143 -164 -60 -70 -50 9 150 -370 165 -243 37 160 36 81 151 -165 25 -129 270 -7
2093 -7 120 114 51 34 90 -111 -94 55 22 163 81 100 -165 7 -30 -17 58 74 131 3 207 64 -110 167 -114
2118 -114 -11 244 -81 -152 135 65 36 -197 88 -249 146 115 -120 -63 -64 13 -107 161 208 -135 -48 -79 -132 12
2142 12 -115 116 160 -33 122 85 -77 19 115 92 -127 -60 -232 -113 -86 -78 63 -2 48 -80 23 -97 175 -15
2166 -15 -119 58 -62 16 -24 -377 159 93 -119 -69 -288 72 18 199 -233 85 48 -67 38 95 -595 122 -248
2189 -248 -101 232 758 516 114 542 -313 -84 -9 -142 -19 27 0 75 367 9 136 85 -416 -267 -393 -105
2211 -105 23 -269 -30 103 -366 166 43 -295 -59 -74 -26 -111 65 -38 0 -72 443 119 43 80 54 105 86
2234 86 -74 150 258 47 53 51 -100 -329 53 25 -116 12 -305 -345 32 43 60 -30 -49 -167 24 -36 -148 -185
2258 -185 189 22 12 64 26 152 47 71 -238 -102 123 71 -119 168 -54 -47 270 3 72 68 59 -16 -35 -79 112
2283 112 25 97 190 118 146 -120 187 146 -245 136 23 285 -595 202 -573 -105 166 -62 -149 145 -84 753
2305 753 -3 -99 268 330 -374 86 -569 -29 -298 -685 464 -224 -273 -102 122 330 36 -37 627 476 320
2326 320 -49 -50 -8 6 73 0 51 -8 39 239 -18 219 265 17 -314 -147 226 84 -36 14 -34 -2 203 -212
2350 -212 39 -143 -224 -113 42 -14 -160 -60 76 159 196 27 -56 97 -119 157 110 -316 129 92 179 -25 -358
2373 -358 60 70 232 -33 39 -180 -24 -124 71 64 -164 159 -86 -55 -101 9 102 192 79 180 -81 189 -35
2396 -35 -74 238 -10 -33 160 159 184 -194 178 -97 103 -43 78 -25 -126 125 -207 -55 76 0 169 -132
2418 -132 91 278 112 -31 -59 83 -175 166 -112 92 210 -100 -64 -107 -142 114 165 60 -22 -262 8 -16
2440 -16 -115 11 -53 20 5 -32 -27 -101 -193 81 51 -20 -172 129 33 -132 37 28 -115 -34 82 -52 25 100 -49 -33
2466 -33 -235 73 -125 -106 4 -65 -206 163 156 -161 -9 -13 -443 -100 -165 47 159 -60 53 71 335 65 7
2489 7 -131 -177 110 171 -140 411 -233 -198 65 219 209 -238 81 90 60 65 -78 -14 55 4 -64 292 98 -223 175
2514 175 -251 -70 57 -95 34 303 -71 -167 158 91 331 68 -54 88 92 -126 -135 -20 -51 62 15 11 173
2537 173 86 56 -221 64 -87 -227 178 145 97 76 41 140 150 98 -87 -53 -27 -11 87 115 15 -53 -110 204 223 113
2563 113 -212 76 112 23 177 -80 -45 -22 -39 -229 158 271 -269 153 64 2 134 -304 57 63 -115 106 160
2586 160 253 120 -20 -193 -7 -110 -11 252 19 -65 47 -57 199 13 15 -25 -76 123 -104 -50 -105 231 221
2609 221 -83 -135 -38 6 -132 155 39 -89 22 80 26 -92 -235 16 -143 -78 -116 -70 32 -102 -67 -79 -217
2632 -217 -155 78 -12 -95 63 41 -304 23 -73 -22 -171 32 -128 37 354 -163 -23 140 177 11 -69 120 193
2655 193 -190 66 -16 187 230 -112 429 378 19 162 244 77 -262 -274 238 -278 -9 -201 46 60 -27 -195
2677 -195 94 123 111 147 -38 -10 -146 -113 -335 24 161 125 172 -101 43 -268 -227 -108 82 88 -60 45 4 74
2701 74 -117 -45 68 262 261 10 -140 304 -80 -21 -48 -79 58 200 -58 15 23 358 199 -102 80 -112 -36 -257
2725 -257 -255 6 -12 31 85 88 247 59 -226 37 -137 160 221 -47 187 -83 -187 -17 -80 -25 518 -58 54
2748 54 144 102 -9 -37 -9 -214 241 32 -125 130 64 -138 -41 -90 -35 119 178 22 -151 -98 -13 -121 -165 -29
2772 -29 135 131 119 -223 10 -115 -222 67 -240 53 66 35 -50 -5 25 -53 93 157 -60 -9 162 -87 -77 -271
2796 -271 -160 -68 174 202 -137 85 325 -4 190 -26 30 61 -126 192 -234 -96 83 47 44 165 -80 -208
2818 -208 -170 8 -88 112 169 80 -136 179 -168 -93 25 -72 19 93 26 -134 177 41 -48 87 64 -194 242 -83
2842 -83 222 -51 238 -43 -40 -159 48 49 13 -51 42 -99 100 235 34 66 -16 -55 34 -39 4 -86 -70 -66 -287 10
2868 10 262 -171 -23 -218 -122 85 -10 100 -165 -35 22 -69 -262 101 -63 42 92 -193 -120 33 6 -240 57
2891 57 -17 36 66 57 74 110 202 64 -69 -147 148 -105 -27 29 204 101 -197 -195 -47 55 184 6 -26 -11 18 -15
2917 -15 -44 -17 -270 -26 0 151 71 94 88 -128 207 232 -39 154 24 -186 36 -217 230 100 -24 55 -83
2940 -83 82 -44 -133 -109 -252 11 186 142 -268 -133 -144 -173 64 -107 163 -31 154 -43 -85 49 8 -28 178
2963 178 109 -156 29 66 264 167 123 -51 242 17 -74 36 50 67 8 116 -111 90 -224 -113 26 -70 33
2986 33 53 102 174 -127 -173 3 49 -197 -203 170 -62 274 80 -96 -175 87 110 190 -80 119 -222 -80 -77 46
3010 46 22 -71 -32 -42 160 101 -87 -179 22 320 -51 182 34 -80 110 3 96 -114 -221 -179 192 -115 -80
3033 -80 23 95 -269 53 -99 108 -93 -33 103 -43 -18 44 72 68 61 48 -44 94 141 23 -7 -71 115 -210 -15
3058 -15 -41 -7 228 -64 -90 242 31 98 -38 142 88 160 92 80 -58 -34 220 -52 -78 -96 162 -35 -7 -41 -312
3083 -312 -5 -53 222 -274 51 -9 179 -25 176 242 -152 -56 -2 -36 77 97 98 124 -92 -4 -141 -23 8 232
3107 232 14 -25 5 -51 -43 -75 -194 -42 140 -109 126 89 -123 32 -181 -48 -185 171 41 42 193 -97 -74
3130 -74 -143 148 -111 -129 8 147 -98 110 -108 107 -56 3 121 135 -179 256 19 201 198 -39 -167 124
3152 124 -67 -212 271 109 -180 -89 -237 56 97 168 109 53 258 -49 34 182 -75 131 407 -17 145 39
3174 39 -144 -188 1 -21 32 -7 187 -478 -86 46 -25 -65 -171 320 115 274 114 31 -102 125 121 -35 86
3197 86 168 -175 80 -45 93 -31 35 144 115 -23 -6 88 111 171 50 53 -158 -291 -79 -205 -44 98 -50
3220 -50 9 -140 117 -476 -159 -12 -10 0 -198 15 70 192 191 95 -444 -69 -13 2 316 183 171 83 -118 105
3244 105 -163 92 -178 -172 60 -1 -200 192 79 -69 -50 106 -13 -171 75 -87 198 -54 -5 17 -190 -51
3266 -51 50 14 -213 -120 -43 -219 -124 17 -153 -67 39 0 62 -97 -86 150 -187 10 218 -96 -177 161 -81
3289 -81 -35 -261 -138 235 6 128 -312 -106 135 144 -93 -66 128 -75 79 298 290 171 -40 148 35 -112
3311 -112 -208 -70 113 -206 -127 143 -51 94 -151 130 -86 54 -60 -164 214 -82 18 -45 104 -82 60
3332 60 -63 -2 -113 143 -43 -32 58 313 -43 -218 -236 63 -280 73 -200 29 -66 -99 252 -123 52 75 -10
3355 -10 -149 -111 -53 -70 151 74 -33 -37 -57 -196 -84 85 -125 84 -14 -165 -405 -24 53 176 -44 126 -39
3378 -39 -93 54 346 326 87 33 -52 31 147 -30 -11 -76 45 -105 -217 202 46 114 54 -201 150 66 133 -35
3402 -35 67 57 6 -213 -1 250 -126 -164 65 119 -49 -98 249 226 -148 36 -164 62 -106 -212 182 -159
3424 -159 61 115 5 -155 -131 36 89 70 61 28 -55 -129 64 148 -212 -177 95 161 -98 -294 104 -74 206 133
3448 133 -109 -232 14 72 -17 292 229 268 78 -66 -158 -21 4 229 14 32 -84 -33 29 10 209 122 72 136
3472 136 -31 -251 66 195 47 30 0 -66 72 -130 -157 210 276 120 -27 53 43 -189 -66 -98 62 215 -119
3495 -119 179 -201 89 -184 36 -49 145 -47 -61 -230 249 45 -24 125 21 202 244 68 4 49 -126 297
3517 297 82 -135 -85 -87 -128 -207 189 -205 -24 26 8 54 134 -177 -42 -19 65 63 -16 44 -32 28 62 -169 -177 218 40
3544 40 148 -141 -227 -174 -9 214 -11 -111 -184 -104 -45 211 -132 -137 96 -119 -120 -75 105 85 -38 120 265 180
3568 180 29 8 -87 -29 46 -96 101 -116 -33 -149 -2 -47 -27 235 63 -174 41 20 -70 -128 7 -5 -208 -69
3592 -69 47 -130 -35 65 169 60 -52 337 -224 10 -117 165 -5 -247 19 89 -27 -135 -28 109 22
3613 22 132 -143 -115 9 -35 -152 -34 37 15 213 159 110 -19 37 -17 59 77 -118 -29 57 -125 18 -194 52
3637 52 49 48 106 229 185 199 109 153 -14 31 265 -30 -150 -27 -70 76 338 52 -53 29 -93 -33 -97 -174 21
3662 21 36 -301 -231 -181 27 98 125 -98 54 -1 -212 43 22 104 177 -23 12 44 149 -136 -35 25 91 24 -101
3687 -101 26 -12 73 -39 192 160 18 1 250 248 -210 -93 95 69 137 98 -129 118 -56 119 239 249 73
3710 73 189 -82 44 3 83 71 151 176 62 54 104 14 -8 84 -144 95 -193 -86 7 146 37 -113 -243 -84
3734 -84 159 47 -95 -304 103 -140 134 -105 26 -148 -36 233 -94 96 -20 69 62 -101 -54 190 -24 83
3756 83 189 -167 141 -110 -56 -100 178 -1 -173 -20 222 -150 -87 48 -149 106 -145 119 -19 84 -34
3777 -34 -118 240 -1 101 94 40 -27 -122 20 -51 138 -175 1 241 4 58 33 -131 -62 95 -101 101 27 -60
3801 -60 -144 -142 -315 180 -10 163 16 95 -166 55 -205 65 -32 -45 81 27 122 210 -256 -140 196 -270 172
3824 172 -211 -202 -147 -290 -50 -44 -93 21 74 191 75 299 -73 -21 149 107 -164 -87 154 152 206 -43 173 86 33
3849 33 289 -191 105 184 160 168 -289 -127 48 212 39 98 145 22 13 16 29 1 268 174 -147 108 104 293 111
3874 111 -165 -128 -9 75 61 86 71 64 -55 216 -129 -13 42 -39 216 -155 96 15 -272 -48 -14 -9 44 -244 -74
3899 -74 49 92 254 -205 -17 82 118 138 228 -67 60 240 167 -24 332 -88 95 -116 52 221 36 4 -131
3922 -131 147 -26 41 174 177 -97 -68 94 11 -100 -97 -67 -80 -15 255 -108 -20 -61 167 73 257 -38 -175 81
3946 81 241 46 324 -3 4 -175 249 58 -11 24 77 -165 87 -117 -119 -43 -121 129 160 -4 -204 217 29 127
3970 127 -163 82 75 198 81 -157 -200 -159 108 181 -38 -202 -127 -93 157 -209 -291 -178 -104 380 63 95 149 -166
3994 -166 -88 97 118 -110 -252 -86 -366 12 -45 10 26 221 -213 -123 26 27 -37 -230 -8 34 86 130 233 -187
4018 -187 174 -44 82 6 -44 -355 54 -95 -39 -167 -10 205 -158 178 269 -234 -140 33 -127 -19 -61 -3
4040 -3 198 67 -98 6 -161 105 165 21 -63 69 170 -134 -119 152 -214 9 -221 103 -122 93 2 173
4062 173 -76 44 217 21 -247 103 -9 -104 -259 121 -63 77 209 128 292 -115 -57 -90 121 -438 -152
4083 -152 -136 -314 -28 -262 -44 35 178 60 190 -179 45 -70 -192 -4 -109 -153 -29 33 -132 51 -256
4104 -256 144 -232 -101 -43 -140 257 0 93 -60 173 -161 78 114 -79 10 17 76 -28 81 -149 117 -80 10
4127 10 -62 -115 -88 -110 209 -68 -97 -113 -197 290 46 41 -62 46 -144 -54 134 159 -56 -169 218 -106 33 37 -24
4152 -24 81 30 -43 -69 -19 83 1 -183 223 108 -17 98 -245 -71 -110 -110 -99 48 -83 188 231 78 203 30
4176 30 -139 -44 -124 145 -65 232 74 -61 -39 63 318 94 28 41 64 253 -67 19 -77 225 -131 184 -5
4199 -5 -79 -35 47 -324 -104 -145 27 -39 -221 -72 -27 44 155 3 28 -193 122 240 85 74 185 77 -81 -79
4223 -79 -115 127 26 -151 15 21 76 186 76 18 268 116 9 150 -41 1 -56 -179 -161 -69 150 -123 74
4246 74 -116 -19 110 -131 -244 -132 -204 -27 49 -41 -41 -72 45 138 98 58 -196 13 217 63 205 -120 81 -228
4270 -228 199 293 -143 -165 189 10 141 122 -193 107 -19 34 -247 94 21 150 -126 -106 42 73 -279 202
4292 202 162 -119 123 -47 370 -399 36 48 331 169 8 341 -81 270 -481 88 -254 -173 -272 -658 -428
4313 -428 -638 -113 -888 367 -400 -755 -339 171 -677 70 -75 48 -203 203 340 10 140 -81 -55 16
4333 16 93 25 -149 -85 -81 40 71 67 -30 -70 85 80 17 -25 55 148 43 -122 -162 -127 -29 -187 -168 4 273 146 72
4360 72 5 101 62 195 139 -141 51 39 -30 25 -407 19 41 -84 -162 44 224 10 -61 54 52 -36 254 -113 -73
4385 -73 139 -154 -168 -161 -230 -28 -222 -170 -58 112 -14 46 50 156 -163 57 214 -82 -28 -92 33 -288 64 -19
4409 -19 -306 73 -174 -134 -19 39 18 129 -243 194 14 16 205 -138 -241 76 -112 10 -80 21 -19 64 249
4432 249 12 -94 150 -63 -336 354 -432 188 -77 163 -25 42 -195 105 151 -136 76 89 57 -122 -156 -72
4454 -72 -64 -80 109 26 -47 8 90 -108 -168 37 122 102 199 -35 33 74 -9 -124 96 -118 -197 5 -91 -222 218 73
4480 73 -143 218 -204 25 -138 44 -394 -12 33 18 203 260 45 -31 3 21 71 -40 20 -66 79 194 130 -285
4504 -285 34 171 -120 -51 98 85 33 -255 -19 26 8 -32 -137 162 63 11 -261 -161 76 128 -93 -88 -25 -136
4528 -136 -17 -20 105 83 -88 231 197 131 -109 -108 -94 -34 107 4 50 97 -100 -62 -15 -6 -227 -189 57 127 75 -174
4554 -174 140 -152 328 121 -168 130 -163 -170 -19 -88 42 58 -36 97 -178 192 141 -29 -39 -56 -118 -140 88
4577 88 47 -61 -36 128 -27 276 281 33 -21 50 -30 -88 117 70 -73 100 148 -223 -150 197 67 -113 -75 62
4601 62 93 159 -112 83 -31 -9 143 -84 -57 -115 -73 -211 42 296 -167 -106 114 -112 125 297 146 78 -3
4624 -3 10 266 131 40 -134 131 186 -5 174 -11 -14 87 121 117 18 147 -138 -91 143 100 -14 -54 -113 -3 -105
4649 -105 -132 -76 -15 -71 42 233 -69 110 32 114 31 -84 123 -21 121 28 -29 137 -298 -257 -172 96 106 -38
4673 -38 -224 111 113 42 53 -97 -53 85 149 -61 97 6 -47 220 -72 89 -41 -16 94 18 191 46 131 -35
4697 -35 278 120 183 -130 -112 81 7 89 110 -69 -113 -4 210 -240 24 44 52 -113 12 -130 111 -41 162
4720 162 56 12 83 86 101 -184 64 -4 160 67 20 -30 0 -117 -158 91 -170 -21 103 -47 -135 -125 24 -78
4744 -78 -263 -74 31 103 -135 -114 -35 204 -58 102 227 -54 167 -110 -52 -2 -41 1 46 -7 -40 -103 266 20
4768 20 20 97 -54 -36 124 79 -275 40 -275 48 267 -11 -11 -185 96 -12 106 38 28 -9 183 221 -52 7
4792 7 -32 242 -7 159 36 -72 -145 -135 64 -308 277 -100 -103 34 47 -127 -117 -40 139 -53 195 96 196 -66
4816 -66 197 -137 -39 -1 -236 26 -56 -112 76 12 -17 144 -136 -139 -38 -90 -98 54 11 86 -157 165 -24 -67 -154
4841 -154 23 -36 64 -81 29 -11 129 168 125 -16 98 93 187 222 143 -128 15 -105 -258 -15 225 93 103
4864 103 -25 142 201 129 -5 46 -31 -158 -64 -39 95 -23 -24 -79 -27 -147 56 -58 -47 -183 56 -43 -36 106 -247
4889 -247 25 62 -131 -260 289 14 -95 157 -24 -108 -34 -73 -98 -101 -141 97 48 -210 141 241 -105 -252 -173
4912 -173 -171 165 -99 52 -147 -32 -9 290 69 -144 -107 -133 155 166 -14 -39 -100 12 -24 -58 153 106 63 274
4936 274 -182 -102 236 24 127 4 179 53 4 -96 92 -52 -245 -28 -258 44 -100 36 70 135 98 -25
4958 -25 -122 63 -54 129 -144 55 -53 -217 -150 33 138 116 -17 19 45 157 57 -6 130 98 -158 79 -29
4981 -29 108 -136 61 -31 158 -2 -164 -61 246 12 162 -117 41 -30 32 133 -30 12 165 296 18 -50
5003 -50 -222 187 -61 -38 2 -36 -87 150 -27 -105 -166 12 72 156 11 -101 -143 -100 74 244 -40 -344 -105 28
5027 28 -142 56 161 4 68 223 -148 -121 51 -187 226 87 -179 87 19 1 195 -96 38 -14 -136 -190
5049 -190 -88 -197 -97 -17 60 -15 132 224 -232 79 -248 -274 39 278 -12 -80 146 66 53 22 65 113 73 206
5073 206 -58 -29 -97 45 -92 42 -104 26 18 271 104 -62 26 42 -112 -11 161 -5 -61 -133 -133 -89 -276 -102
5097 -102 -1 -20 -68 211 67 37 31 -89 187 61 89 -19 -43 113 44 43 -425 106 191 95 -242 -11 -95 -48 117
5122 117 -227 -31 -99 -89 30 133 -56 87 209 -47 237 -114 -41 77 129 -93 180 29 -44 118 -159 98
5144 98 -112 169 -13 -49 176 248 -307 210 186 181 -187 112 -15 -107 161 63 133 -21 127 27 -211 -249 -6
5167 -6 -254 244 -248 43 -59 -224 -262 -70 138 81 -78 -154 42 11 81 -177 -83 57 137 227 -3 -80 -216 169
5191 169 78 -164 45 55 -77 -119 -11 -83 -92 3 210 -56 -156 13 -136 145 -5 126 32 145 1 -269 -95
5214 -95 152 217 105 191 -283 -320 -27 124 94 -210 22 -21 23 -39 -44 -210 -78 187 -135 -72 40 109 21 135
5238 135 165 2 -259 203 -169 70 -180 -159 26 -24 585 -145 327 77 234 -49 35 95 -135 -183 -16 -15 -205
5261 -205 -143 -11 70 -31 106 93 119 -3 173 -22 -92 -188 161 -196 34 205 293 18 101 -175 -231 -63 40
5284 40 -169 5 -9 -161 132 -12 128 181 129 -57 129 -26 93 15 206 -126 -34 -48 93 33 -231 -138 93
5307 93 -105 -186 146 31 -40 122 173 -28 -126 53 50 219 -110 207 90 -111 151 -234 58 -65 -73 114 -98
5330 -98 -273 201 169 26 19 32 101 135 68 74 164 -25 265 -206 -47 104 96 -183 19 333 -75 -197 76 62 -60
5355 -60 -124 21 120 -150 24 -89 102 83 -79 -51 -119 -1 44 119 -274 181 205 89 -8 -185 140 -113 -24 81
5379 81 57 -215 -117 54 63 6 -142 -31 221 125 78 235 240 -27 27 -41 45 -44 -249 86 -6 -157 -206 85 -46
5404 -46 62 294 15 65 -318 151 -36 -39 245 -44 124 -84 161 127 -166 153 55 -162 -192 -14 171 11
5426 11 4 142 -126 124 -99 -226 -38 -48 -16 -144 67 -114 18 -18 70 -142 80 168 -50 -135 19 41 -220
5449 -220 -29 -35 -66 183 -15 13 61 87 -10 -200 -69 -2 -154 117 -129 2 237 149 -105 -99 15 242 -28 81
5473 81 -110 -155 -6 -61 -38 481 14 -225 -145 228 133 -47 33 -27 -232 -176 177 -35 72 -49 171 -12 242
5496 242 148 150 193 -14 64 183 -159 222 -111 24 276 49 -155 79 100 -113 227 55 -106 -80 -104 63 -32
5519 -32 -84 184 54 67 -74 221 42 -196 -10 116 26 -117 -84 91 -100 -10 -13 174 296 -92 -233 -88 43
5542 43 -202 353 -93 30 -86 -73 -68 -95 -9 48 -46 -287 1 122 60 -195 -19 -37 -193 259 154 -151 -34
5565 -34 47 22 134 199 -112 -92 -323 -21 6 322 -63 65 -249 -118 -226 8 136 69 28 56 -46 -21 -58 -165
5589 -165 -193 -125 166 -76 -27 219 78 -143 -288 161 -55 -45 321 183 -318 48 213 -98 35 43 72 132 -14
5612 -14 56 -39 119 85 100 -81 -233 68 134 151 64 -10 193 140 -219 -27 15 -105 195 399 52 -46 315 68
5636 68 199 -7 -89 56 -177 135 -103 -104 123 254 -34 45 81 -76 -124 -69 221 -5 68 -133 0 18 18 -59
5660 -59 -78 -99 103 -13 4 -54 -108 -38 -148 -122 -301 -26 116 177 74 -56 -5 -148 19 92 -1 3 195 61 219
5685 219 52 83 7 96 -69 -39 -43 -3 153 132 -12 32 64 -67 112 -170 -98 -6 -89 37 -178 -137 -49 -182 109
5710 109 -120 108 23 -114 10 79 -183 -118 302 38 100 -95 -209 13 106 0 29 -36 28 -104 168 75 -112
5733 -112 -1 185 22 -71 18 -116 -34 46 -16 -158 111 -58 159 231 -52 118 66 -127 382 169 -9 -13 438
5756 438 127 321 -66 107 105 -125 -139 89 -13 82 -67 -21 186 9 -33 6 32 94 57 47 289 -204 -149 -48
5780 -48 -15 -102 19 130 18 46 105 14 -10 -3 47 -187 -127 -21 144 -23 -97 58 -246 273 -55 49 -95 67
5804 67 -161 186 -218 -188 -104 -127 -65 116 222 -20 75 -72 217 177 -40 80 -182 -253 -3 48 101 34 -45 21
5828 21 -4 90 125 -21 -174 -75 200 -33 -34 1 -206 23 173 -86 -36 50 27 -62 -58 79 60 159 141 37 -41 -205
5854 -205 134 19 3 95 -44 -133 -401 -134 -192 -174 -38 -173 364 -49 -86 -25 -98 153 -33 -252 -82 9 187
5877 187 57 11 -96 -209 45 10 -51 -273 7 -219 8 139 -407 227 197 -250 -10 -120 193 -52 161
5898 161 -160 -176 -52 -25 -135 93 72 136 -24 -92 55 198 -73 -10 143 26 -247 -111 -214 162 135 169 -172
5921 -172 263 45 -92 120 -176 82 -61 -18 121 -109 10 7 34 99 -32 -15 40 -148 -97 -136 -2 -7 74 247
5945 247 -74 172 74 228 83 83 33 -149 157 56 131 158 -366 -140 12 -230 -172 -288 -35 23 36 12 70 -153
5969 -153 -114 9 188 150 -21 -131 115 183 207 16 21 -119 7 143 -188 -9 -184 29 -71 -220 292 43
5991 43 -73 36 -50 126 54 -65 -70 27 -77 -122 120 -192 -282 -142 236 63 -35 32 131 -204 -11 183 -120 94
6015 94 -127 -321 -18 112 -304 124 -191 -107 68 132 -138 -153 -184 -224 -14 22 303 182 286 -96 -177 88 -222
6038 -222 281 51 -83 132 80 38 109 169 62 -295 11 -55 -23 -108 -141 7 83 -215 -100 230 15 -2 100
6061 100 68 -25 -79 -199 -32 -248 16 -73 134 -223 16 22 -231 -163 198 180 -181 116 197 110 -188 -115 -73 -179
6085 -179 15 -202 -6 43 262 -123 237 146 -147 -110 -54 152 -98 -3 -112 -31 136 -94 -69 101 -145 -69 -26
6108 -26 -99 -2 147 -115 -207 60 -68 -225 61 -3 101 -85 -58 51 240 19 124 -67 98 -41 -114 125
6130 125 204 73 -25 -90 -135 202 34 -135 -132 101 -23 -83 -83 55 -30 159 -198 7 179 -112 35 -154 34
6153 34 -58 -153 212 142 -151 -80 142 -91 -126 -134 -215 16 -16 -67 -254 74 97 -156 -109 192 81 226 -137 71
6177 71 32 136 -139 -74 -193 35 159 78 84 87 82 -215 -70 126 86 49 -18 21 86 199 38 -30 -109 -226 -336 216
6203 216 -31 -34 -163 -134 50 213 4 -239 -168 22 275 172 28 311 -87 -35 -227 -162 -85 -159 199 -126 39
6226 39 -214 99 2 31 -98 33 24 9 41 202 94 -50 -57 30 92 -34 -102 22 -36 -84 30 31 203 129 56 71
6252 71 -25 254 299 -32 53 -71 104 2 -277 -49 -50 -178 4 134 55 -91 -50 67 -149 112 -184 -52 86
6275 86 -34 75 98 -39 55 239 10 105 78 -207 -134 -145 -78 -180 223 -323 33 -81 57 -229 159 -96 -148
6298 -148 5 193 4 -135 -15 -187 136 85 -141 109 195 -258 -148 -178 0 81 -116 63 -47 -201 -72
6319 -72 21 55 59 -41 -136 66 99 -201 -137 -14 -14 -43 -96 92 247 -95 245 136 -2 -233 6 72 256 -188
6343 -188 -51 -262 -31 -139 -78 -95 -79 -40 -41 141 -245 34 -4 -107 -35 -111 -117 31 156 143 66 194 -71 65
6367 65 142 -80 -42 145 -84 -150 -41 -120 248 -9 -126 65 203 87 73 183 -206 -106 -103 35 149 22 3
6390 3 60 56 -68 -93 196 0 30 -14 147 181 -84 149 -12 22 165 193 -86 123 -257 -24 102 42 -107 84
6414 84 81 -173 -300 -20 -60 33 -132 131 -200 -147 31 -41 0 229 42 -124 -62 -422 -47 -73 33 -44 -8 72
6438 72 291 -53 -114 -148 97 77 180 -70 -103 27 166 64 7 -265 225 130 41 183 -57 138 -157 -160 -123 207
6462 207 -39 116 239 44 50 82 -136 116 -1 51 -166 121 -13 -106 -84 -51 247 -46 -166 127 69 82 367
6485 367 20 156 -272 -40 -15 -5 97 164 44 -63 -41 263 34 182 -124 -74 -81 181 45 -135 -18 -59 87
6508 87 -69 -7 -42 -33 -53 -70 -255 158 -160 -152 88 12 -23 -81 -136 251 -139 174 -10 63 -172 -116 -34 130 17
6533 17 55 216 140 -58 -76 22 70 -68 -88 43 -190 87 -103 36 55 128 15 31 -138 -59 -85 -15 169 29
6557 29 22 -108 -4 294 89 240 28 -79 -41 32 259 79 18 77 -50 330 -22 -55 -48 -125 -30 -79 -54 192 201
6582 201 170 -87 146 -44 59 238 201 -192 74 29 32 -85 -195 188 4 -60 152 -273 -43 168 1 190
6604 190 81 9 -20 39 182 83 -82 -21 21 175 127 -11 -11 -65 84 -1 -310 205 101 82 -74 -297 162 -218
6628 -218 -166 -245 38 13 -71 83 -27 38 -190 -167 123 -185 -8 61 25 22 -68 -259 -295 43 -253 -26 242 136
6652 136 149 -28 41 101 -122 -23 -96 -39 -174 43 15 7 -41 -256 19 -115 119 -5 113 -81 -28 -119 -65 33 203
6677 203 16 -26 168 68 36 -21 -170 4 -27 10 64 40 15 -283 -171 138 36 -84 101 -154 33 221 132
6700 132 -193 -146 -212 89 171 -103 128 -150 -59 -207 -127 -98 12 -103 23 33 -121 -37 -177 129 35 -126 173
6723 173 30 -94 44 -64 205 -28 -89 18 -25 -8 158 -18 -90 -98 -60 116 27 -101 -221 -146 34 133 67 -209
6747 -209 -109 151 37 -10 -123 35 -39 51 81 -112 -145 -162 102 32 -74 184 94 9 -34 141 105 -254 -19 124
6771 124 -209 45 207 -105 -236 -200 -65 -114 -67 320 121 -213 26 -69 -114 -218 -52 127 -64 -193 174 183
6793 183 -50 1 -70 -157 185 -227 208 -20 74 115 -152 -153 169 28 -112 129 -84 139 72 -73 -64 24 -74 -75 -6
6818 -6 72 -29 191 -49 170 -124 174 160 -90 -195 -205 -138 146 134 169 -21 99 -92 71 73 94 -50 -111 -28
6842 -28 -182 -95 -171 34 -210 23 -191 -165 153 82 -22 216 -62 202 151 131 243 -82 39 40 -138 117 -46
6865 -46 -6 131 56 -265 158 17 92 56 36 -106 -37 58 3 -22 119 137 203 -56 -357 -21 -186 -77 19 -91
6889 -91 100 -385 -99 2 193 49 109 122 185 -187 47 -111 -27 61 -14 224 -303 -157 -20 -100 -73 -121 73
6912 73 66 -7 -34 14 -13 213 -162 33 89 -120 -170 73 113 275 154 -29 2 -47 130 -37 124 -106 232 -34
6936 -34 -100 -158 3 -228 -150 -53 22 -3 -66 -344 -38 -177 -194 -121 149 50 -153 81 -26 -106 142 -37 22 -61 94
6961 94 -194 -296 26 -65 74 74 -4 -195 -153 -207 -59 94 171 1047 -72 93 262 -128 46 -128 -6 -55 91
6984 91 -133 -14 -52 1 298 -146 -136 111 291 103 -23 -66 94 -60 -68 -202 65 -50 211 -70 168 372
7006 372 127 18 -100 -195 76 242 -525 303 33 449 -324 748 242 53 36 84 146 50 84 66 117 9
7028 9 -252 55 -257 -152 71 166 221 65 93 141 -34 72 -187 220 109 -108 -93 138 31 -47 69 -108 -35
7051 -35 119 -30 -248 -121 -217 59 124 -95 -119 -10 319 -64 12 31 131 -95 35 183 -5 58 91 -175 57
7074 57 -136 147 -84 -8 27 -119 -145 -214 -40 -181 64 -236 -65 75 4 -113 -79 38 -46 -12 29 29 -17 27 65
7099 65 -74 161 6 -136 -43 89 42 -82 -83 -143 -12 -142 75 77 -39 67 28 -85 158 -53 50 -170 -35
7122 -35 -53 -140 -19 40 -90 -86 -181 -19 -133 -213 -26 -28 -229 145 44 -149 -187 41 -59 210 -117 156 163 -27
7146 -27 -82 -227 120 -35 158 168 -86 -186 111 -191 -143 -24 8 -75 -77 -48 85 1 24 -3 253 241 -372 -294 256
7171 256 -246 -106 189 43 29 137 214 235 -289 -120 -12 85 -53 118 129 88 65 5 -9 67 91 84 61 114 217
7196 217 -29 225 114 86 -371 48 -38 -57 -74 84 5 102 -270 70 346 -12 123 -72 -128 306 -21 35 -248
7219 -248 -104 -58 100 107 53 61 -211 -169 -179 12 94 -121 117 304 -174 -9 -78 72 246 197 9 70 -160 -176
7243 -176 82 251 65 199 32 -92 -131 26 255 39 -1 -47 -226 75 4 80 2 -62 120 -64 87 143 -215
7266 -215 5 129 -55 25 -129 -147 234 -105 -97 180 -52 -49 139 -17 154 136 122 139 -98 68 -10 -95 68 204
7290 204 -68 106 -52 70 -192 86 -163 -94 255 154 98 -133 45 -26 -101 -18 -28 -95 -18 103 49 107 -148
7313 -148 -97 -126 80 -62 12 26 -22 -7 -198 -97 12 3 -172 38 287 -23 -107 87 -80 -94 167 144 188 -167
7337 -167 133 186 -179 40 -72 143 112 -31 55 -17 -237 126 226 -67 13 -153 -3 133 -76 -164 74 57
7359 57 216 41 2 173 243 353 -26 -84 -16 -4 37 124 109 24 -140 -65 65 195 62 27 92 -90 -31 139 28
7384 28 89 11 -91 50 -327 17 89 1 23 -116 -179 336 107 27 165 -69 -16 30 -70 -152 -71 52 -71 30
7408 30 -128 -25 245 -29 -69 -23 -106 -28 -101 119 -166 141 34 169 -192 -22 -11 180 110 -11 41 -291 26
7431 26 -183 171 46 288 -149 35 17 -184 -57 -276 -174 -106 93 -139 15 45 -80 93 -190 -27 -66 -164
7453 -164 36 -110 190 -80 -110 60 -10 106 -81 -63 -13 -98 188 -38 -203 146 -290 -237 -93 -181 40 15 90
7476 90 -124 130 -164 -205 -14 -71 -82 9 53 119 109 20 193 122 -255 -142 -105 302 197 -293 -139 98 -41 337
7500 337 168 8 -6 40 136 28 -260 76 210 -175 -84 -27 107 204 160 19 68 54 159 177 77 -182 -112 -260
7524 -260 -59 114 67 33 -156 100 226 23 -230 102 -128 -45 131 52 -50 128 231 97 141 -177 -78 -16
7546 -16 103 -198 94 -23 37 -164 244 199 177 198 121 169 71 15 -20 27 16 30 4 -79 -269 -166 -56 44 155
7571 155 -12 -129 -199 145 -145 -175 -89 113 -47 37 98 -54 -138 -103 187 -86 9 107 104 -62 -279 191 136 80
7595 80 -110 237 41 31 284 -71 106 189 -21 -123 -71 -50 -398 -201 -50 141 -207 -39 13 111 126 -135 357
7618 357 1 37 -172 146 58 -279 8 -149 25 -41 204 -96 102 113 -2 494 86 -236 127 69 -74 209
7640 209 169 -59 -36 109 -119 -91 -26 -76 -92 -106 175 -57 -6 -58 -73 -24 2 -89 -111 4 -127 -270 -63 54 -149
7665 -149 11 100 20 -113 -169 -21 38 40 -30 41 -277 -59 -189 71 149 67 -76 108 52 -74 103 -60 -163 -146
7689 -146 -15 -57 144 4 -71 -27 53 -198 19 89 -6 161 87 25 -169 -142 21 164 -266 80 -137 -15 0
7712 0 320 173 -74 -46 -188 135 136 -27 -306 103 112 -144 132 -96 -20 -202 -110 -107 -77 -27 -183 28 -55 2 123
7737 123 60 281 -213 84 -297 -160 -211 105 -335 -211 -181 195 129 36 86 -42 -77 145 117 -30 112 -164 111
7760 111 -201 515 158 267 -29 -13 -102 169 -104 -312 -67 3 -269 69 29 -21 -51 -43 80 30 117 67 -218 1
7784 1 -80 53 -42 -171 -150 188 60 -87 135 109 -27 164 69 -149 36 -37 -236 144 -59 19 -319 -351 78
7807 78 -235 130 26 72 10 131 65 133 67 -28 116 -256 89 140 -62 -6 -215 -15 168 -289 -5 6 -99
7830 -99 -103 -201 -61 67 -57 -410 295 -10 15 -116 -97 230 -169 -4 173 63 165 -6 -122 87 -283 -114
7852 -114 -162 38 92 -93 -229 -58 65 -47 175 -133 20 105 175 -151 15 130 24 125 9 -121 -87 -47
7874 -47 97 -150 -232 0 -15 -354 204 -21 -29 -11 49 -109 -206 -130 136 2 146 1 55 -32 142 79 9 -12 65
7899 65 -29 45 -47 236 54 -71 -35 61 221 -10 -201 -143 98 -291 -191 -179 -96 3 -25 -248 -280 57 -26 -94 1
7924 1 -50 -281 -166 8 -28 -115 -181 211 7 101 51 -2 -281 135 31 -56 414 -264 33 -113 -186 -12 71 -184
7948 -184 323 133 -155 39 -88 89 34 -93 109 135 -75 133 85 -67 138 -100 -12 6 18 189 138 51 -63
7971 -63 -46 -49 -15 -154 150 175 -6 21 -23 258 37 -114 131 -10 -20 -23 -130 176 89 -42 3 -78 71 -170 -157
7996 -157 110 -207 -217 -3 -34 -30 65 -260 94 -86 -63 69 16 -170 71 -31 -135 179 106 -81 175 -205 -129
8019 -129 -165 -82 36 117 -43 -61 -190 171 12 137 14 -20 29 -44 8 -55 157 -282 90 -21 54 -5 9 186
8043 186 -253 -56 -127 -111 107 -17 -304 -39 -207 273 -11 -109 138 175 -27 -40 -22 318 -181 7 -200 -37
8065 -37 -164 118 -98 152 50 68 99 72 18 -84 52 -39 -105 7 -333 48 -18 13 -85 132 122 7 74 33
8089 33 -102 58 -58 -113 -28 -201 154 19 -83 -44 -17 -175 -84 32 -114 -78 -105 68 -8 11 196 112 44 -81
8113 -81 -17 -20 368 -277 -103 140 6 53 80 67 -130 -205 -57 -308 -16 237 1 36 79 -19 51 155 76 -224
8137 -224 -87 -27 7 122 -169 21 -70 221 -181 -55 -90 -128 -103 22 78 -66 108 -102 141 -24 63 36 81
8160 81 1 -24 74 38 -156 5 -42 260 67 113 -58 -16 152 -277 -101 -112 97 -103 161 156 100 -13 17 -59 -87
8185 -87 72 -30 -253 24 -344 154
8191A54
##END NTUPLES=NMR FID
##END=
