##TITLE=1H_Pr 58-d
 DMSO,8 sc, 
 24.9.2021
##JCAMPDX= 6.0         $$ Bruker NMR JCAMP-DX V2.0
##DATA TYPE= NMR FID
##DATA CLASS= NTUPLES
##ORIGIN= UXNMR, Bruker Analytische Messtechnik GmbH
##OWNER= root
$$ XWIN-NMR		Version 3.5
$$ Fri Sep 24 13:29:23 2021 Russian Standard Time (UT+4h)  she@DPX200
##.OBSERVE FREQUENCY= 200.1314
##.OBSERVE NUCLEUS= ^1H
##.DELAY= (6, 6)
##.ACQUISITION MODE= SIMULTANEOUS
##.ACQUISITION SCHEME= undefined
##.AVERAGES= 8
##.DIGITISER RES= 18
##SPECTROMETER/DATA SYSTEM= spect
##.PULSE SEQUENCE= zg30
##.SOLVENT NAME= DMSO
##.SHIFT REFERENCE= (INTERNAL, DMSO, 0, 15.7039)
##AUDIT TRAIL= $$ (NUMBER, WHEN, WHO, WHERE, WHAT)
$$ ##TITLE= Audit trail, XWIN-NMR		Version 3.5
$$ ##JCAMPDX= 5.01
$$ ##ORIGIN= Bruker BioSpin GmbH
$$ ##OWNER= she
$$ F:/spectra/data/she/nmr/H-F/1/audita.txt
$$ ##AUDIT TRAIL=  $$ (NUMBER, WHEN, WHO, WHERE, WHAT)
(   1,<2021-09-24 13:27:48.01 +0400>,<she>,<DPX200>,
      <created by zg, POWCHK disabled, PULCHK disabled
       configuration hash MD5:
       00 E9 B6 7A A2 85 ED C7 34 08 36 98 17 FE 4E 26
       data hash MD5: 16K
       FE 42 32 9A F6 CC 94 29 AB C4 8A 53 B4 B2 9E 23>)
$$ ##END=
$$ 
$$ hash MD5
$$ ED 61 27 07 C5 86 C5 AA FA EE 63 78 6B 1F 51 BB
##$RELAX= 
##$RELAX= 
##$RELAX= 
##$RELAX= 
##$RELAX= 
##$RELAX= 
$$ Bruker specific parameters
$$ --------------------------
##$DU= <F:/spectra>
##$EXPNO= 1
##$NAME= <H-F>
##$PROCNO= 1
##$TYPE= <nmr>
##$USER= <she>
##$AMP= (0..31)
100 100 100 100 100 100 100 100 100 100 100 100 100 100 100 100 100 100 
100 100 100 100 100 100 100 100 100 100 100 100 100 100 
##$AQSEQ= 0
##$AQ_mod= 1
##$AUNM= <au_zg>
##$AUTOPOS= <>
##$BF1= 200.13
##$BF2= 200.13
##$BF3= 200.13
##$BF4= 200.13
##$BF5= 200.13
##$BF6= 200.13
##$BF7= 200.13
##$BF8= 200.13
##$BYTORDA= 1
##$CFDGTYP= 0
##$CFRGTYP= 5
##$CHEMSTR= <none>
##$CNST= (0..31)
1 1 145 1 1 1 1 1 1 1 1 1 1 1 1 1 1 1 1 1 1 1 1 1 1 1 1 1 1 1 1 1 
##$CPDPRG= <>
##$CPDPRG1= <>
##$CPDPRG2= <>
##$CPDPRG3= <>
##$CPDPRG4= <mlev>
##$CPDPRG5= <mlev>
##$CPDPRG6= <mlev>
##$CPDPRG7= <mlev>
##$CPDPRG8= <mlev>
##$CPDPRGB= <>
##$CPDPRGT= <>
##$D= (0..31)
0 1.2 0 0 0 0 0 0 0 0.06 0 0.03 0 0 0 0 0.0002 0 0 0 0 0 0 0 0 0 0 0 0 
0 0 0 
##$DATE= 1632475667
##$DBL= (0..7)
120 120 120 120 120 120 120 120 
##$DBP= (0..7)
150 150 150 150 150 150 150 150 
##$DBP07= 0
##$DBPNAM0= <>
##$DBPNAM1= <>
##$DBPNAM2= <>
##$DBPNAM3= <>
##$DBPNAM4= <>
##$DBPNAM5= <>
##$DBPNAM6= <>
##$DBPNAM7= <>
##$DBPOAL= (0..7)
0.5 0.5 0.5 0.5 0.5 0.5 0.5 0.5 
##$DBPOFFS= (0..7)
0 0 0 0 0 0 0 0 
##$DE= 6
##$DECBNUC= <off>
##$DECIM= 32
##$DECNUC= <off>
##$DECSTAT= 4
##$DIGMOD= 1
##$DIGTYP= 9
##$DL= (0..7)
0 120 120 120 120 120 120 120 
##$DP= (0..7)
150 150 150 150 150 150 150 150 
##$DP07= 0
##$DPNAME0= <>
##$DPNAME1= <>
##$DPNAME2= <>
##$DPNAME3= <>
##$DPNAME4= <>
##$DPNAME5= <>
##$DPNAME6= <>
##$DPNAME7= <>
##$DPOAL= (0..7)
0.5 0.5 0.5 0.5 0.5 0.5 0.5 0.5 
##$DPOFFS= (0..7)
0 0 0 0 0 0 0 0 
##$DQDMODE= 0
##$DR= 18
##$DS= 0
##$DSLIST= <SSSSSSSSSSSSSSS>
##$DSPFIRM= 0
$$ [...]
##$SUBNAM2= <"">
##$SUBNAM3= <"">
##$SUBNAM4= <"">
##$SUBNAM5= <"">
##$SUBNAM6= <"">
##$SUBNAM7= <"">
##$SUBNAM8= <"">
##$SUBNAM9= <"">
##$SW= 20.0188988654967
##$SWIBOX= (0..15)
0 0 2 0 0 0 0 0 0 0 0 0 0 0 0 0 
##$SW_h= 4006.41025641026
##$TD= 16384
##$TD0= 1
##$TE= 0
##$TE2= 300
##$TE3= 300
##$TEG= 300
##$TL= (0..7)
0 120 120 120 120 120 120 120 
##$TP= (0..7)
150 150 150 150 150 150 150 150 
##$TP07= 0
##$TPNAME0= <>
##$TPNAME1= <>
##$TPNAME2= <>
##$TPNAME3= <>
##$TPNAME4= <>
##$TPNAME5= <>
##$TPNAME6= <>
##$TPNAME7= <>
##$TPOAL= (0..7)
0.5 0.5 0.5 0.5 0.5 0.5 0.5 0.5 
##$TPOFFS= (0..7)
0 0 0 0 0 0 0 0 
##$TUNHIN= 0
##$TUNHOUT= 0
##$TUNXOUT= 0
##$USERA1= <user>
##$USERA2= <user>
##$USERA3= <user>
##$USERA4= <user>
##$USERA5= <user>
##$V9= 5
##$VALIST= <valist>
##$VCLIST= <CCCCCCCCCCCCCCC>
##$VD= 0
##$VDLIST= <DDDDDDDDDDDDDDD>
##$VPLIST= <PPPPPPPPPPPPPPP>
##$VTLIST= <TTTTTTTTTTTTTTT>
##$WBST= 1024
##$WBSW= 4
##$XGAIN= (0..3)
0 0 0 0 
##$XL= 0
##$YL= 0
##$YMAX_a= 81853
##$YMIN_a= -108544
##$ZGOPTNS= <>
##$ZL1= 120
##$ZL2= 120
##$ZL3= 120
##$ZL4= 120
##$ABSF1= 10
##$ABSF2= 0
##$ABSG= 5
##$ABSL= 3
##$ALPHA= 0
##$AQORDER= 0
##$ASSFAC= 0
##$ASSFACI= 0
##$ASSFACX= 0
##$ASSWID= 0
##$AUNMP= <proc_1d>
##$AZFE= 0.1
##$AZFW= 0.1
##$BCFW= 1
##$BC_mod= 2
##$BYTORDP= 1
##$COROFFS= 0
##$CY= 11.3945322036743
##$DATMOD= 1
##$DC= 2
##$DFILT= <>
##$DTYPP= 0
##$F1P= 2.36226072786647
##$F2P= -0.459571619588291
##$FCOR= 0.5
##$FTSIZE= 0
##$FT_mod= 4
##$GAMMA= 1
##$GB= 0.15
##$INTBC= 1
##$INTSCL= 1
##$ISEN= 128
##$LB= 0.24
##$LEV0= 0
##$LPBIN= 0
##$MAXI= 10000
##$MC2= 0
##$MEAN= 0
##$ME_mod= 0
##$MI= 1.114404
##$NCOEF= 0
##$NC_proc= 0
##$NLEV= 6
##$NOISF1= 3.799351
##$NOISF2= 2.8
##$NSP= 1
##$NTH_PI= 0
##$NZP= 0
##$OFFSET= 15.70392
##$PC= 1
##$PHC0= -14072.18
##$PHC1= 6.800891
##$PH_mod= 1
##$PKNL= yes
##$PPARMOD= 0
##$PSCAL= 0
##$PSIGN= 0
##$REVERSE= no
##$SF= 200.130013532006
##$SI= 16384
##$SIGF1= 3
##$SIGF2= 2
##$SINO= 400
##$SIOLD= 16384
##$SREGLST= <1H.CDCl3>
##$SSB= 0
##$STSI= 0
##$STSR= 0
##$SW_p= 3612.71676300578
##$SYMM= 0
##$S_DEV= 0
##$TDeff= 0
##$TDoff= 0
##$TI= <>
##$TILT= no
##$TM1= 0
##$TM2= 0
##$TOPLEV= 0
##$USERP1= <user>
##$USERP2= <user>
##$USERP3= <user>
##$USERP4= <user>
##$USERP5= <user>
##$WDW= 1
##$XDIM= 8192
##$YMAX_p= 0
##$YMIN_p= 0
$$ End of Bruker specific parameters
$$ ---------------------------------
##NTUPLES= NMR FID
##VAR_NAME=  TIME,          FID/REAL,        FID/IMAG
##SYMBOL=    X,             R,               I
##VAR_TYPE=  INDEPENDENT,   DEPENDENT,       DEPENDENT
##VAR_FORM=  AFFN,          ASDF,            ASDF
##VAR_DIM=   8192,          8192,            8192
##UNITS=     SECONDS,       ARBITRARY UNITS, ARBITRARY UNITS
##FACTOR=    0.0002496,     1,               1
##FIRST=     0,             0,               0
##LAST=      2.0444736,     0,               0
##MIN=       0,             -108544,         0
##MAX=       2.0444736,     81853,           0
$$ Real data points
##PAGE= N=1
##DATA TABLE= (X++(R..R)), XYDATA
0 0 0 0 0 0 0 0 0 0 0 0 0 0 0 0 -8 8 -8 8 -8 8 -16 16 -17 24 -25 32 -40 41 -48 56 -64 72 -85 96 -108 121
36 121 -136 153 -171 191 -213 237 -261 290 -322 354 -392 432 -477 524 -578 637 -702 775 -855
55 -855 946 -1050 1168 -1310 1472 -1668 1909 -2211 2606 -3144 3925 -5173 7475 -13219 62600
70 62600 56414 -27387 40302 79265 46360 -6755 21506 61312 68845 48926 42276 22473 7543
83 7543 14169 22918 -3833 -26627 -7416 29920 18804 -22770 -32265 -10259 -16667 -44254 -51073
96 -51073 -36290 -31160 -31582 -23804 -20302 -37649 -47204 -33506 -28345 -45685 -50180 -28515 -9260 -8399
110 -8399 -12733 -11017 -9868 -10672 -4769 -2367 -9995 -5761 19841 35663 23590 10502 21733 36652
124 36652 25092 5406 13235 32685 33450 26531 30937 36725 28797 19155 19116 17678 6186 4556 16619
139 16619 18917 8264 5006 10106 7132 -6614 -16000 -12985 -10642 -14849 -14693 -9494 -9447 -14369 -16256
154 -16256 -16638 -21430 -27323 -24662 -16826 -16114 -18038 -12085 -6108 -9165 -13584 -12718 -9629 -9174 -9809 -4764
170 -4764 2019 4679 5921 6851 5494 5178 6911 6690 5829 7159 11846 17592 16579 11541 12211 14976
186 14976 12257 6328 4583 8662 12234 9667 7647 9124 7959 5140 2254 -1385 -3041 -1792 -711
201 -711 -922 -2344 -2853 -1591 -3245 -7736 -9460 -9428 -9513 -7931 -7626 -6964 -6085 -5923 -6487 -6071 -7931 -9825
219 -9825 -8265 -5359 -3727 -3818 -3530 -369 1425 -232 -1935 -1885 -847 1614 3256 2507 3452 6130 7401
236 7401 5580 3400 3044 5586 5508 4089 4212 6188 7743 7157 4410 2938 3667 2891 1722 1543 1528 2211
254 2211 2498 1449 453 -895 -1791 -2154 -2669 -4307 -3195 -2858 -3324 -2505 -2781 -4133 -4548 -4787 -4699 -4712 -5309
273 -5309 -4232 -2439 -2233 -2788 -2632 -2576 -1633 -1350 -2924 -1726 9 1083 1542 1784 1510 2478 2505 1846 1975
292 1975 2322 3272 4273 3662 3575 4469 4455 3181 2705 2679 2549 2749 1960 2315 2756 1881 1382 426 -320 -184
312 -184 -824 -1328 -1375 -1107 -1638 -2125 -2428 -2886 -2527 -3197 -3839 -3469 -3323 -3102 -2851 -2916 -2451 -2059 -2696 -2812 -2017
333 -2017 -1652 -1175 -1011 -797 295 1005 344 519 855 985 1664 1427 1576 2758 2939 2681 2763 2643 2824 3265
353 3265 2405 2140 2821 2480 2354 2278 1728 1948 1769 905 667 478 223 -146 -379 -786 -268 -1223 -1958 -2028 -1884
374 -1884 -2015 -2276 -2646 -2678 -1713 -2295 -2702 -2314 -2530 -2479 -2162 -2514 -1823 -1260 -1499 -1280 -854 -778 -84 -291 -173
395 -173 498 947 878 1087 1265 1798 2187 2059 2132 2456 2616 2147 2384 2296 2378 2801 2258 1950 2095 1647 1569 1178
417 1178 751 1165 1044 142 127 369 -371 -1009 -1305 -1596 -1017 -1649 -2071 -2054 -2025 -2005 -2142 -3022 -2679 -2303 -2544
438 -2544 -2725 -2530 -2495 -1759 -1529 -2112 -1727 -1070 -1127 -793 -307 -94 416 488 611 1108 1522 1543 2000 1823 2239
459 2239 2735 2295 2533 2686 2875 2620 2512 2601 2688 2581 2173 2135 1988 1469 1536 806 166 638 724 -191 -676 -838
481 -838 -1365 -1138 -1807 -2086 -2173 -2573 -2695 -2516 -3173 -2824 -2452 -3074 -2842 -2173 -2412 -2373 -1839 -1816 -1576 -1206 -1141 -680
503 -680 -451 -131 511 164 735 1450 1271 1152 2120 2136 2114 2376 2586 2390 2610 2508 2333 2149 2255 2617 2105
524 2105 1318 1623 1406 941 1120 826 228 92 -96 -345 -455 -794 -1264 -1146 -1384 -1190 -1423 -2351 -1908 -1574
544 -1574 -1754 -1689 -1613 -2148 -1752 -1079 -1392 -1322 -1239 -1251 -898 -876 -548 17 -181 -344 559 144 256 1084 657 471
566 471 1159 1450 1087 1114 1253 1189 1253 1260 1204 964 567 1232 984 341 523 430 -473 407 344 -151 -298 -389 -343 -59
590 -59 -436 -502 -484 -792 -198 -115 -620 -407 -171 -424 -381 319 -159 -324 126 -65 112 290 231 496 28 646
612 646 750 36 51 279 155 209 558 528 -205 20 306 -47 -250 -155 -370 -600 -756 -196 -740 -1048 -396 -699
634 -699 -790 -405 -283 -1031 -463 -48 -321 -334 -6 62 -72 -10 328 456 50 261 512 545 458 890 691 601 1204
657 1204 1240 1014 997 922 960 807 1119 1204 220 57 835 541 202 392 -52 -667 46 -204 -550 -731 -1052 -691
679 -691 -722 -1161 -842 -1081 -1632 -1099 -871 -1535 -972 -1114 -1182 -925 -603 -1044 -557 -442 -175 -233 43 189 243 -34
701 -34 602 1007 613 795 1079 762 1000 1391 1181 1031 1069 1315 1187 1117 822 969 561 547 1094 700 280 535
723 535 122 -20 -40 -230 -579 -776 -645 -806 -904 -918 -1002 -858 -982 -971 -1044 -1535 -1283 -1168 -1044 -762 -728 -1084 -824
746 -824 -263 -311 -496 -499 247 268 228 558 906 476 516 1243 784 747 1012 928 1096 1139 1288 1040 802 933 895 556
770 556 899 1092 449 286 701 586 -41 -11 122 -396 -539 -267 -496 -426 -848 -993 -644 -973 -720 -777 -1106
791 -1106 -719 -1037 -1134 -831 -1044 -860 -842 -538 -735 -604 -468 -172 -19 -133 -58 403 -102 515 594 662 896 996
813 996 621 632 999 1127 954 1102 1009 847 940 640 1031 524 510 748 524 404 269 -29 309 220 -205 -238
835 -238 -239 -549 -356 -620 -827 -718 -956 -1169 -1083 -1015 -1369 -1069 -1100 -1157 -970 -954 -1025 -738 -923 -809 -672 -583 -329
858 -329 12 -374 161 243 235 507 730 363 695 1048 808 836 1410 1124 998 1482 1103 1202 1359 991 1012 897
880 897 778 792 941 674 675 441 131 250 -268 -323 -361 -340 -475 -654 -1071 -592 -706 -1010 -801 -1230 -1028 -1021 -1392
903 -1392 -1326 -1154 -1003 -1273 -1086 -963 -766 -953 -785 -664 -110 -563 -231 -160 -148 361 110 321 844 793 812 1027
925 1027 1162 837 1087 962 1083 1032 1489 966 1486 893 1157 1156 451 608 766 309 487 612 49 12 198
946 198 -301 -83 -363 -470 -283 -859 -923 -798 -882 -1354 -882 -1096 -1250 -1176 -847 -1140 -944 -1107 -544 -841 -1123
967 -1123 -653 -263 -292 -266 79 -104 214 122 527 393 875 905 956 823 833 958 1159 1068 1196 957 932 1195 811
990 811 808 860 795 728 764 404 547 503 138 112 8 -160 -148 -181 -566 -656 -415 -698 -661 -1037 -976 -746 -774 -789 -845 -813
1016 -813 -577 -759 -757 -664 -648 -462 -495 -59 -399 -222 -127 86 4 321 110 283 553 635 561 407 612 759 607
1039 607 694 601 695 739 890 638 622 561 390 502 479 274 249 447 -386 304 165 -368 -293 -533 -387 -243 -523
1062 -523 -466 -440 -695 -561 -636 -796 -889 -655 -416 -415 -531 -698 -555 -188 -383 -255 1 -152 104 7 275 86
1084 86 55 401 444 327 310 728 404 519 954 386 386 925 772 391 585 469 544 261 390 200 147 -14 102
1107 102 -83 -494 -24 -338 -709 -274 -225 -489 -555 -698 -450 -700 -717 -606 -477 -551 -400 -687 -512 -374 -62
1128 -62 -434 -176 -182 -161 95 71 270 355 269 338 464 449 705 608 454 523 870 792 700 607 746 999 747 486 199
1153 199 314 233 321 267 -4 280 -194 -257 222 -349 -547 -424 -381 -714 -435 -414 -910 -684 -953 -730 -900 -1082
1175 -1082 -635 -670 -803 -639 -469 -647 -562 -326 -438 -234 9 -326 -105 175 92 307 195 630 671 606 648 536
1197 536 601 664 1243 943 813 754 809 428 629 737 841 167 468 406 387 116 56 -59 -431 -280 -68 -396
1219 -396 -468 -543 -795 -825 -643 -811 -750 -1072 -737 -733 -946 -708 -676 -788 -401 -235 -290 -606 -374 -393 -308 -58 49
1242 49 -74 101 165 478 114 401 439 592 636 870 476 580 851 710 820 781 1069 658 590 831 738 295
1264 295 442 656 586 24 521 294 -165 -72 -154 -154 -261 -345 -399 -455 -540 -449 -503 -850 -683 -563 -806 -294 -530 -826
1288 -826 -315 -217 -610 -603 -601 -466 -245 -98 -321 -258 21 -196 24 -137 158 489 263 52 734 541 318 378
1310 378 575 867 669 950 749 432 770 673 427 459 580 391 -34 161 528 309 134 -13 -40 -95 -139 -215
1332 -215 -149 -586 -150 -271 -59 -219 -254 -487 -609 -494 -404 -454 -394 -406 -344 -343 -255 -200 -300 -254 -59 -483 4 195
1356 195 3 318 118 129 178 186 369 208 399 457 290 405 381 603 329 142 464 552 298 343 405 272 281 206
1380 206 -138 69 -167 -126 -256 -229 59 -293 -142 -239 -69 -320 -300 -59 -382 -251 -608 -457 -155 -197 -365 -260
1402 -260 -339 -313 -49 -66 -383 -266 59 118 -173 -34 -48 346 -15 215 142 266 191 34 199 384 328 -23 317
1425 317 307 171 332 286 79 437 298 260 -70 20 -158 -140 -129 -258 -110 -133 -22 -249 -302 -319 -188 -452 -251
1448 -251 -236 -250 -54 -215 -379 -199 -109 -210 -198 345 -101 -30 -52 -66 162 179 -81 261 -53 98 313 -73 216
1471 216 150 202 415 443 312 251 179 392 283 64 -145 337 281 528 134 125 30 -47 -153 139 -33 -217 63
1494 63 -71 -419 -421 -105 -283 -184 -437 -65 -92 -295 -379 -148 -387 -532 -195 -250 13 -37 -2 -205 283 -75 -153
1517 -153 253 181 183 79 318 263 119 175 62 82 467 333 353 273 142 106 96 421 60 155 308 127 105 10
1541 10 23 93 25 134 0 107 -298 -89 108 -83 51 -113 -200 -254 -421 -295 144 -16 -248 -334 18 -504
1563 -504 24 -189 -352 -180 -48 -60 54 -79 12 -34 172 -38 -35 71 199 154 114 191 140 95 279 30 329
1586 329 213 61 338 195 115 306 133 226 -110 -34 -247 318 113 124 111 -18 101 30 -154 -218 -98 -176 -17
1609 -17 -20 -78 -259 -14 -108 -28 14 -401 46 -236 -67 -312 -33 -85 47 220 -135 -193 210 59 -86 -41 -174
1632 -174 269 93 79 308 276 224 365 100 14 261 55 264 5 -75 279 122 94 14 -128 -135 124 237 34
1655 34 12 97 -164 -185 3 -180 -174 -330 -158 27 -108 72 -27 109 -142 10 73 -243 -138 -60 -42 272 133
1678 133 -126 -120 -13 134 -95 163 7 152 -344 128 116 -27 114 -149 136 -138 173 -122 -105 -15 249 -64
1700 -64 -273 141 192 172 -33 3 -118 -90 67 -112 -294 11 42 415 -81 -95 37 50 -341 133 -144 318 -120
1723 -120 266 209 168 165 -51 87 25 -16 175 224 266 -22 121 -36 -20 -122 -209 24 9 -29 -212 -136 23 98 -126
1748 -126 -110 199 -124 -375 -200 -89 210 -85 -123 -160 -333 -217 318 -103 -97 -27 -66 -179 48 113 -202 116 128
1771 128 178 -91 283 -23 -25 349 139 216 121 157 247 415 233 105 -52 -50 78 208 265 -113 183 70 107 304
1795 304 -150 -454 186 -30 101 -86 58 -430 -261 -108 -457 -265 -285 -91 -423 -217 -53 -210 -229 -171 -51
1816 -51 -251 -121 -262 -385 -295 57 256 -43 -147 -157 112 -349 99 55 50 278 163 155 315 268 7 227 389
1839 389 197 121 -19 283 286 117 215 397 144 155 192 41 69 -249 -236 -85 121 -102 126 99 -217 56 -258
1862 -258 -68 -246 -200 -283 71 -139 -79 -36 -166 -10 -73 172 -175 -43 -214 -103 109 -92 74 196 172 175 481
1885 481 1 48 -107 109 292 140 -161 23 163 265 259 80 136 -25 209 486 234 159 -82 -37 -130 -127 -66
1908 -66 65 -66 -357 -209 122 193 -103 -178 -120 -198 -152 -118 -219 -102 -198 6 65 239 -117 86 7 -1 1 -243 245
1933 245 -70 -67 105 54 90 -319 -22 -26 -34 94 -41 11 -99 0 293 -238 -2 309 178 104 180 -26 -6 -64 -118
1958 -118 149 -114 27 -77 7 -250 -109 -8 -162 -173 63 -147 34 100 -134 145 -220 -113 -305 -106 -228
1979 -228 101 149 -131 164 -97 141 12 -137 44 41 -54 102 -109 -173 62 183 179 10 127 32 -25 -110 129
2002 129 -28 92 139 119 4 216 161 133 167 15 101 -2 32 -2 32 -228 -38 -206 243 -93 -310 265 -104
2025 -104 39 -62 76 22 -113 -35 10 -199 -233 -155 -9 -53 -219 -77 218 120 -84 -86 8 13 -272 380 122 64
2049 64 -86 93 192 260 129 327 153 49 -90 -14 -65 151 8 -245 42 178 -150 161 103 110 339 -19 -113
2072 -113 -182 -137 180 79 -16 27 -107 -39 12 80 -202 -241 30 -287 -133 -178 -263 -148 126 -226 11 -46 9 98
2096 98 71 175 61 61 230 -64 -180 -70 112 -62 93 57 -305 230 177 -47 88 -211 -256 -65 -66 -7 217
2119 217 112 31 214 -63 -205 424 169 35 -17 -244 239 109 36 -62 69 -162 -87 -89 49 -74 5 -66 3
2142 3 -387 -150 -3 -258 -276 22 -247 -67 -145 -44 -191 -93 -51 75 -245 -176 179 44 152 -7 45 -113 -299
2165 -299 63 387 43 196 -84 282 275 218 302 69 8 -223 -202 32 -236 13 242 -118 69 386 114 130
2187 130 -191 118 127 39 17 41 104 -174 -212 44 -91 -156 105 -191 365 194 -118 83 -109 60 -58 -68 316
2210 316 -86 185 185 -79 -6 -163 67 -9 -13 -75 188 160 17 149 -51 -10 126 50 -207 -3 82 -186 -186 -113 94
2235 94 -131 -100 76 104 235 127 26 119 -260 65 -13 -362 -121 -27 -300 -169 170 63 158 165 -198 83 176
2258 176 -37 103 51 48 31 -310 -155 -83 -88 -160 -26 4 89 88 21 -9 2 45 218 -29 70 134 -79 56 -8 131
2284 131 65 83 -42 -205 -81 -70 19 63 76 112 -38 233 -190 120 -77 133 -241 -20 43 -93 -264 -94 138
2307 138 144 -6 -104 -355 -88 -43 -181 102 -178 -13 -73 -210 184 243 -65 -180 174 45 55 151 56 285 15
2330 15 246 211 136 -130 134 -165 255 -12 314 223 -35 -303 130 -279 -70 44 -92 -66 -10 -160 140 123
2352 123 -365 -43 -49 5 -212 -157 -24 -123 7 -13 -146 66 49 -111 55 -23 160 170 -61 123 58 -26 -242 312
2376 312 -205 -38 69 -85 -99 221 207 -54 164 -149 -39 -78 335 167 -134 289 102 -85 -78 -262 75 -156
2398 -156 154 -246 6 -34 -157 -92 -173 48 -93 -63 -132 2 50 -42 -166 158 -189 66 -52 -96 -224 15 -225
2421 -225 161 136 270 -92 -149 196 132 -221 333 32 71 -189 175 253 323 253 -62 238 -256 26 -230 -102
2443 -102 -125 -55 -46 -73 51 -144 -155 182 470 -126 10 -88 -14 60 11 -47 -29 -193 -58 -151 -5 -106 56 -145
2467 -145 -99 94 43 31 169 237 -155 43 -136 278 -384 116 67 -87 256 122 76 -83 103 155 201 46 -82
2490 -82 133 51 129 -69 -47 622 89 136 -210 -20 -102 -163 227 -4 -167 -209 16 169 -110 177 14 -273 -261
2513 -261 108 51 -37 145 2 124 203 210 135 -11 -14 -135 -54 -68 -166 38 -99 -224 -17 -18 -19 165 -92 -29 74
2538 74 5 -216 -187 35 57 -161 201 211 50 212 41 -133 -335 48 -215 -221 -134 -102 33 98 170 -16 3 -53
2562 -53 166 2 -119 7 -205 -17 -55 -310 90 -168 -48 68 188 -229 -80 251 163 157 -70 -117 -113 68 -296
2585 -296 -123 305 -118 228 96 87 46 -216 -224 -75 173 -42 26 -58 -84 -18 -184 -109 -210 -46 -9 110 121 -45
2609 -45 73 -224 -62 28 114 223 -239 -204 -20 90 247 92 -243 -157 -80 28 -304 -110 -67 14 139 152 -61
2632 -61 103 98 297 192 -118 -143 200 22 -27 -5 -117 78 -95 -23 -35 -26 -347 7 -201 119 -253 331 21
2655 21 -65 -187 -46 48 -58 213 -288 -19 -2 -85 -157 105 191 -128 26 -68 -205 -205 146 -86 -47 -59 -98 71
2679 71 -49 54 221 -89 -124 45 -143 26 313 -179 166 205 -228 -36 44 -193 -29 -5 -1 -62 -31 -6 -210
2702 -210 -9 246 95 -312 -177 13 169 91 115 -251 255 327 -184 -28 24 -23 -125 -227 -128 115 -245 11
2724 11 309 193 109 -31 192 -128 -36 395 -316 -447 7 -89 -223 136 -90 -115 345 189 -91 -200 69 72
2746 72 -44 71 7 57 81 147 149 179 -244 42 -270 260 -150 -124 -110 -219 21 -107 36 11 -107 -89 -10 42 -100
2771 -100 83 111 26 275 -117 -184 155 174 -174 89 -246 -182 259 -103 -118 103 87 214 46 88 -137 50 -130
2794 -130 134 2 169 78 -5 -232 -127 217 67 -133 -127 -60 49 112 60 -52 -212 77 -127 -162 239 -136 100
2817 100 28 -44 -72 182 -58 125 -18 20 65 2 -15 10 -56 -71 295 -172 -124 -36 425 -53 27 136 -206 -134 -66
2842 -66 21 -159 -40 227 91 255 183 -137 128 29 33 106 -109 97 64 -187 37 204 70 -158 -296 68 -73
2865 -73 234 355 -119 -255 118 165 -226 -148 25 264 -240 1 187 315 -100 -154 48 51 116 21 -36 -241 -112
2888 -112 -232 -37 -94 52 28 -198 -106 -32 -32 -72 -41 121 -99 58 -154 94 46 19 -20 119 231 -129 70 -133
2912 -133 130 -129 127 276 73 -272 203 -178 25 -30 10 -121 -380 117 63 146 78 -72 126 -289 48 -298
2934 -298 -177 25 -79 -48 96 74 -112 153 56 -22 -180 36 3 -12 96 122 -152 48 10 280 -183 -61 58
2957 58 -259 7 160 158 -146 385 150 183 88 129 122 -70 -7 79 41 66 58 -114 -134 224 -120 -133 180 156 145 -127
2983 -127 3 -162 -266 129 226 255 -129 -20 32 -278 58 206 -124 89 -64 -97 116 -133 -54 88 134 -24
3005 -24 217 32 156 40 -153 49 96 17 -32 -100 -7 -24 -110 69 70 -135 133 -52 -220 -224 81 3 10 175 268
3030 268 124 56 233 -237 -7 -53 1 -177 -4 -92 52 -63 -86 10 43 -239 -361 -96 -2 -101 154 -36 -144
3053 -144 206 -67 -62 112 -16 -100 22 308 -103 -206 177 -12 -128 194 110 19 205 270 -52 -88 -79 124 540
3076 540 114 175 -263 91 294 -347 -58 111 -69 -33 103 343 44 97 -87 73 -69 -150 27 -73 112
3097 112 311 -20 -159 242 90 226 249 74 -119 245 46 3 -274 -38 -59 21 -55 121 -125 -256 112 267
3119 267 -321 -37 182 67 78 -71 169 -26 -227 -4 -126 162 189 13 -225 88 115 -13 -93 -58 63 -41
3141 -41 -94 -151 136 -73 102 -144 -121 44 -80 -37 153 61 -135 -35 52 81 -229 129 43 -61 -66 -114 39 -123
3165 -123 -81 -28 -41 -9 -47 -59 -54 -37 24 9 -11 89 109 148 -170 44 -22 -321 32 463 -151 100 -187 -269 23
3190 23 175 269 198 -145 -135 -381 21 -214 48 44 -271 330 9 133 24 34 -57 80 14 0 -101 179 -162
3213 -162 59 -71 -176 103 -62 -127 -141 187 -117 -28 -204 -12 -74 53 -140 168 -154 192 -197 122 -46
3234 -46 43 97 -184 118 -124 -345 -110 81 28 20 8 -92 20 81 -30 -63 -175 28 11 -69 -12 103 -90 52
3258 52 72 148 174 -88 -127 -47 145 -258 -87 -186 -132 76 -46 279 83 -80 14 -74 53 151 246 -120 69 -77
3282 -77 16 -22 236 92 64 -234 -21 -82 85 178 68 24 -159 277 -7 -117 -309 -157 -30 -190 35 23 71
3305 71 222 35 -141 22 -234 14 104 44 86 96 74 -175 -215 183 -17 -28 302 17 319 -66 122 -136 -302
3328 -302 -304 344 63 -34 370 8 269 90 -146 220 -280 126 226 275 104 193 287 -117 99 -8 104 210
3350 210 -92 37 10 -67 11 -45 72 -69 -80 -70 -69 -241 88 28 -120 129 279 121 -222 -66 -9 -123 -21
3373 -21 226 127 9 126 -54 -74 189 29 -29 247 -221 -239 -189 128 39 -248 -24 -105 119 -75 95 -94 119
3396 119 -191 -82 -103 69 -22 -192 229 -165 43 4 376 -184 235 3 -57 72 43 141 -449 63 121 20
3418 20 74 -180 -106 -360 121 83 -402 32 -253 -15 -122 -185 -2 85 98 -7 233 38 98 -95 228 -121 86
3441 86 -151 32 -53 -211 -53 190 116 -129 -87 235 -33 -116 229 45 53 -41 66 -149 -74 175 15 -43 -118 -155
3465 -155 -10 -14 6 83 -82 -229 217 110 -86 -87 -31 106 3 -234 205 -36 12 -268 54 -84 446 -2 39
3488 39 90 65 -53 55 162 126 -38 222 -141 -29 71 250 -126 81 109 -13 -81 239 23 -30 -157 115
3510 115 -39 148 24 120 68 7 -153 -123 23 221 -183 243 123 6 -86 -23 181 193 -371 136 180 268 153
3533 153 -197 6 30 71 -201 -3 151 205 244 -156 248 -220 4 -180 -14 -48 163 26 -153 94 -121 128
3555 128 25 -148 -84 165 -250 156 -14 171 163 -196 -122 80 -197 -219 282 51 69 -30 -19 -249 208 -63 220
3578 220 -5 111 -62 -125 92 -326 -56 74 193 -7 236 100 -13 -140 32 -156 -73 38 37 181 81
3599 81 136 27 -137 -26 34 91 -129 -41 37 163 184 38 150 282 45 279 0 134 -47 49 -134 -272 119
3622 119 -273 -130 31 -32 7 -68 -24 -147 -190 106 69 2 -228 160 73 -141 154 -64 -129 -51 -104 246 -99 189
3646 189 143 49 -138 -76 33 -101 -133 235 -39 -45 18 9 62 -89 -16 -259 -100 102 79 128 -270 -142 -20 -198
3670 -198 -66 187 142 -77 380 -192 63 62 19 106 -172 65 70 127 34 -93 34 148 213 213 175 77 187 80 122
3695 122 38 -146 1 220 -14 47 120 -135 -204 -52 -129 33 1 84 -144 230 -28 -185 -157 233 -143 63 44
3718 44 110 -36 -82 107 -91 -119 133 113 -134 -133 -283 190 35 -16 -54 -76 167 86 156 4 -80 -55 -188 -77 31
3743 31 211 -122 51 74 -30 -58 -301 154 -77 171 -65 -273 83 -286 -24 -7 -139 -222 -178 196 61 -202
3765 -202 84 -28 134 215 47 -321 -175 -206 -41 77 -144 -98 258 7 -1 -112 -17 8 -152 -189 -14 -130 -10
3788 -10 138 -154 14 17 -155 114 183 8 -94 -88 103 -310 292 -62 194 352 -80 -100 -313 -9 81 1 27
3811 27 41 -188 462 -19 156 68 153 -90 -25 56 255 99 48 -67 58 -154 -58 165 29 221 44 219 142
3834 142 -35 44 -57 -54 123 -226 271 -13 -74 -207 86 203 -148 14 -130 224 -93 -95 14 -19 6 112 60
3857 60 56 -206 -118 -35 -139 317 232 9 -80 -72 6 -44 -95 -45 167 65 -146 8 2 226 -151 141 235 -108 84
3882 84 -56 -3 451 34 400 47 255 81 13 218 -33 -241 -200 197 5 -30 73 -3 29 283 -31 -175
3904 -175 5 -72 -286 124 73 357 200 17 24 -105 179 140 99 83 -170 23 122 -140 230 -127 243 15 -42
3927 -42 77 7 20 117 173 36 31 -101 -176 137 -67 303 -89 77 43 32 71 -202 46 -32 -23 -8 103 -104 48
3952 48 -35 -9 505 108 -105 142 -125 90 18 -110 37 -6 402 74 304 145 -153 102 -275 285 -166 261
3974 261 -135 104 -202 -144 -370 36 -202 -103 221 178 22 111 68 -19 124 177 -298 -116 34 -157 -45 38 -141
3997 -141 -28 147 -82 10 -42 -9 265 -79 -177 114 -46 47 -153 178 -222 -193 193 -72 166 75 134 -198 -160
4020 -160 57 -243 7 -48 -220 -255 109 -10 415 157 -289 105 159 -62 210 113 -205 -6 168 104 161 -133
4042 -133 58 29 -242 262 -121 116 115 82 -188 106 -56 124 -171 -77 66 58 -129 213 348 -190 190 -41
4064 -41 31 107 -199 51 223 -106 -35 331 169 118 -32 -59 4 269 -132 -125 -216 -14 -136 -38 142 -120 147 -141
4088 -141 -204 165 -109 -160 89 117 -327 -291 25 -125 92 102 83 -36 87 -58 161 -26 -18 108 23 -96 -137
4111 -137 179 62 179 12 278 137 -76 -106 70 121 -130 -337 -64 -79 435 7 -34 -113 -201 26 57 -6 101
4134 101 243 130 162 184 155 -33 -48 53 55 -24 -30 -130 -32 89 -58 111 -63 -121 63 6 -303 74 78 49 -178
4159 -178 72 -63 -70 -322 -148 220 -123 3 -51 92 23 248 84 47 72 -6 -110 268 -151 -45 114 -51
4181 -51 150 -5 251 257 202 47 239 -56 -9 -341 0 -134 -162 55 142 32 -201 122 85 -75 -285 -163 -199
4204 -199 7 48 146 31 -89 115 -270 205 242 -284 -14 78 -299 -211 -176 -28 353 208 228 268 -259 -245 -29
4227 -29 -28 -144 121 83 -331 -87 261 -44 -233 -68 -32 -74 183 -28 85 -67 -3 -129 -233 -79 -116 131 227
4250 227 -45 -77 29 -154 -107 -225 75 233 -56 -13 -112 -268 -114 -45 -157 112 263 -103 -86 -122 221 25
4272 25 -100 -70 14 49 72 29 -47 93 176 -69 -75 218 91 23 -161 -17 -7 -2 31 142 -128 296 43 192 -106
4297 -106 20 69 -148 30 -107 -132 186 115 226 -175 37 51 136 28 99 172 -49 -76 39 -24 48 -65 -254
4320 -254 -188 29 35 214 131 213 -233 225 89 79 184 203 73 -183 -30 48 -261 -126 -65 -187 -82 -46 334
4343 334 242 -74 34 -5 70 217 221 -104 -2 75 27 182 -68 -30 230 215 89 -82 97 150 -196 66 -241
4366 -241 41 41 -28 252 -19 103 204 19 -208 -87 -87 -43 154 -157 -109 -445 327 -42 166 173 217 -90 31
4389 31 -140 -178 -32 -151 -155 18 -5 -128 -59 375 133 24 -225 -184 -20 212 134 -71 169 -215 152 168 117
4412 117 119 155 -5 -200 -109 167 51 -286 16 -99 -110 -167 -25 -89 -77 -150 -38 -242 98 91 98 -46 5 34 -180
4437 -180 296 -151 -198 -95 -29 -191 -83 56 167 278 -90 -7 175 -136 61 63 214 -256 -106 18 148 44
4459 44 -8 -360 -14 13 -17 -146 41 182 -77 -10 -14 46 75 8 132 187 83 -39 451 10 -76 50 84 -28
4483 -28 -44 332 -74 -276 96 32 -51 -28 -78 83 147 -110 -79 -198 3 -85 -89 -150 221 48 -176 -26 -62 205
4507 205 88 144 -12 3 131 -114 -161 50 -152 157 -305 -243 -79 -213 102 30 49 -34 44 77 -164 -17 26
4530 26 -169 36 18 97 -9 -48 55 -42 -92 -67 58 101 -217 113 121 -128 -4 1 -174 -104 -46 146 80 181 21
4555 21 89 -212 -53 192 49 -99 94 -210 -53 210 143 -190 -2 -105 -126 -50 -43 -40 101 -5 157 -292 -134
4578 -134 73 -198 -146 16 42 -194 64 -247 76 -321 132 -148 166 71 -18 178 -114 147 -55 -65 -43 -164
4600 -164 34 34 105 5 -29 -4 72 -31 59 177 -138 -35 97 -84 -107 213 -104 139 39 -36 1 -137 65
4623 65 -212 213 -24 49 274 -139 342 -75 -95 -342 -170 5 -109 188 145 141 52 -18 -160 -141 84 118 250
4646 250 -67 66 213 -137 261 195 -50 97 182 83 42 -34 -60 140 -203 121 -222 -189 -49 421 -165 58
4668 58 65 43 57 11 20 4 126 27 -105 -34 85 81 225 -65 -20 -16 11 247 309 58 -140 129 -3 320 -58 157
4694 157 93 78 161 -47 -94 178 21 -21 210 -123 260 -82 14 -338 -43 -17 83 80 -9 -81 -104 -99 77 356 452
4719 452 -76 -49 184 -273 -226 146 144 -105 111 215 51 0 293 -196 -76 75 68 14 122 -62 -145 -54 10 167
4743 167 127 -112 119 -167 -128 63 98 102 354 -155 95 -191 140 36 -472 361 29 -253 -64 231 143 -175
4765 -175 -158 228 -143 195 -113 -100 162 -55 16 -355 50 -94 -25 352 109 14 -31 4 -53 -161 -169 60 -211
4788 -211 -37 19 303 -157 -199 -190 93 -19 -169 137 27 192 -68 131 114 -64 163 29 20 88 -139 72 29
4811 29 39 157 70 -35 -26 -306 77 16 -50 -151 -214 -69 193 -149 -7 -64 17 426 -65 -82 97 -238 -95 216
4835 216 -104 255 -81 -9 -14 -109 137 -108 12 -164 141 75 194 -87 -63 250 86 -12 -83 -68 23 -98 173
4858 173 150 342 -13 -55 86 -46 20 1 -66 -7 -292 -109 244 -135 155 -288 -69 -39 28 -49 -71 223 17
4881 17 85 -190 -45 20 -32 148 125 -117 -249 -188 14 -123 -136 -10 -36 94 355 38 225 -19 15 34 -81
4904 -81 -149 111 161 -56 143 211 -54 158 -77 237 142 90 195 135 -62 47 -134 -41 58 56 37 -59 -55 -195 -28
4929 -28 89 210 -89 54 48 52 -104 5 118 23 -142 -108 108 -2 135 -84 -80 -92 7 -125 -108 -237 -127 -106
4953 -106 58 -26 -136 -234 34 -24 156 194 65 191 39 -92 -31 -179 -55 -29 -8 -78 76 132 10 -93 -354
4976 -354 -39 -97 227 84 -50 122 -98 239 137 3 166 48 88 -32 -23 -4 -5 -130 -146 -86 46 16 -78 185
5000 185 0 -20 194 213 132 -86 266 146 -116 0 80 110 -5 29 -50 -188 -239 -185 303 105 -14 -89 -8 -19
5024 -19 196 285 -16 -66 184 -63 -77 -41 -46 -205 3 15 362 -99 59 -22 45 23 146 72 -78 -14 127 59 52
5049 52 -188 -41 163 -69 92 -14 -54 8 -86 -118 51 -39 334 219 35 -6 -88 104 -276 -195 -48 -69 143
5072 143 10 -66 -93 -2 214 -152 -10 -117 -138 114 -218 -127 -375 -10 37 98 102 19 -26 -42 -203 39 -69 0
5096 0 58 63 120 22 -63 247 -212 36 36 105 -112 225 -49 -130 76 -133 396 -59 72 238 19 62 190 -50
5120 -50 -114 -29 -56 90 -24 -162 10 175 14 329 -112 52 -41 -200 23 72 -111 -153 -153 308 -88 -82 -88 132
5144 132 215 172 50 -147 -99 21 149 -91 60 150 49 78 127 79 58 -205 200 45 56 42 -61 200 -52
5167 -52 11 -35 -222 -59 -142 -179 -106 82 11 -379 -175 154 117 -44 -261 -135 158 -35 -12 30 70 -25 107 -72
5191 -72 -29 -15 -11 -129 -30 125 -125 229 -52 105 -176 118 -205 77 -41 52 -106 -228 107 95 -23 -282 234
5214 234 255 64 -213 37 -208 75 -66 -333 -33 296 79 -120 -59 259 154 -58 5 -321 -135 -1 121
5235 121 -176 51 -301 182 78 -216 24 21 81 204 276 -17 272 23 -19 -25 35 16 343 18 375 30 153
5258 153 221 262 168 321 -63 160 249 -144 164 53 -31 -14 145 25 -29 97 -50 60 92 83 155 -71 -49 15
5282 15 -56 108 17 -22 211 217 211 -133 -229 26 -60 -109 -95 154 -368 7 184 261 239 109 -128 -90 218 -77 -324
5307 -324 365 -4 -238 438 -1 157 76 -183 224 104 -174 -91 -82 -111 -184 156 -54 -108 38 98 -17 32 130
5330 130 -60 39 -67 -25 0 65 -315 -29 141 -131 161 238 62 -2 24 -134 -177 33 94 -189 -141 14 169
5353 169 -66 -99 -30 -14 -128 -45 -18 -114 -293 130 37 29 12 29 -35 -99 -46 -170 123 98 36 -241 87 -42 222
5378 222 -39 105 -231 80 -62 -126 -117 -31 -131 -169 -179 -72 -47 74 -13 -19 105 41 -185 -22 -383 132 39 -20
5402 -20 -40 -135 41 3 -34 59 -69 115 190 3 159 99 41 -161 -122 -67 49 6 -41 88 -104 119 -2 -454
5426 -454 152 -24 -207 88 103 133 55 151 -94 16 -148 61 -99 -91 238 -15 167 -124 -129 227 17 -60 169
5449 169 -60 24 -55 -241 -106 188 141 -283 223 91 -115 -72 -39 -92 127 71 158 271 -220 57 -52 362 218
5472 218 -53 94 202 -139 -121 -74 58 -168 152 -40 33 -29 81 -9 -212 128 124 -32 50 76 135 -3 -35 -20
5496 -20 -180 -9 307 316 32 32 102 -48 161 196 111 21 49 3 93 34 -117 4 -170 131 35 60 137 -128 93
5521 93 364 4 -16 -138 -78 25 238 -50 -95 -70 -38 -22 -159 151 -43 -323 189 63 -52 90 -138 -222 -27
5544 -27 -151 59 -53 37 3 181 -85 -85 210 -19 48 46 390 -29 211 143 94 -63 -323 -152 -119 -240 41 -21
5568 -21 84 492 101 113 -160 -12 151 19 153 216 -170 233 307 83 -313 -112 -59 105 -158 118 125 83 -25
5591 -25 60 144 -131 -233 22 44 27 157 -56 68 173 -73 27 142 -123 121 17 -462 -59 -105 -92 -76 236
5614 236 40 16 -25 18 15 -77 217 -158 -155 -142 42 -159 -106 93 -180 -62 -2 438 112 19 41 153 -171 -118 193
5639 193 152 -66 -96 -243 -127 54 -237 213 -126 -145 90 33 -238 -178 -42 193 98 182 -107 -85 -283 -60 176
5662 176 96 -141 60 -44 -75 6 -135 45 314 -313 84 -148 -114 -93 56 -91 245 106 -131 263 148 238
5684 238 -96 -103 212 272 -121 42 59 308 119 -67 98 -35 -6 -176 179 -136 165 82 130 107 200 -67 28
5707 28 -130 140 -193 293 222 -237 354 186 299 26 -36 -251 371 -184 106 179 165 40 -199 82 -222 57
5729 57 88 -192 75 -371 197 -82 -222 67 -134 -44 99 124 -20 -179 116 -336 -297 41 226 19 -59 36
5751 36 143 -55 -176 -141 120 75 -53 75 0 169 76 130 148 -59 -13 134 -50 7 236 -108 -53 -276 165
5774 165 91 124 15 -34 -276 -134 -40 -269 54 29 176 -18 -46 190 35 -21 -94 -227 -194 34 -159 -103 -295
5797 -295 -71 -106 -50 347 119 -6 40 172 126 174 88 11 115 -67 -102 19 -379 -104 -59 -249 226 42 -120
5820 -120 138 -250 -229 -135 23 158 87 214 -80 -92 -184 16 -159 -125 -17 302 233 -7 -71 -43 72 -44 -68
5843 -68 30 -155 -19 132 -21 -108 -50 55 164 -25 25 79 -53 -20 -112 8 15 -153 82 -155 88 -49 -47 37
5867 37 117 36 -60 360 33 177 59 7 -124 52 30 136 -216 -77 333 -9 148 -29 72 199 -153 59
5889 59 8 29 -151 -8 -34 255 -22 161 95 189 -146 81 183 191 243 64 -266 34 -198 -221 -86 17 -187
5912 -187 320 61 -40 53 -52 30 -24 -193 -164 283 -111 -146 -115 -94 160 59 -66 -177 103 37 172 76 92
5935 92 32 -205 -253 7 -95 101 35 15 27 -100 -39 72 41 -312 16 -107 165 23 13 -333 85 -156 239
5958 239 -210 2 8 -239 79 206 166 -2 140 164 321 -226 25 -173 493 -77 -319 -175 -170 -33 187 71
5980 71 264 -36 -41 4 39 25 40 -133 42 -92 -24 27 -72 -22 101 -122 -192 -54 195 193 -23 185 -57 -80 33
6005 33 10 152 -23 -165 -98 -24 -128 -42 -95 -71 52 60 37 60 -34 176 -131 234 191 176 38 155 50 -139 -7
6030 -7 -95 -139 -74 119 -43 -48 -37 -166 148 50 191 -75 13 -129 185 -43 -254 112 -226 159 -280 39 -65
6053 -65 68 -138 53 73 5 -38 48 -173 -14 361 112 -83 -65 19 -45 26 18 -141 -282 21 145 35 -55 -86
6077 -86 -104 41 -99 159 98 -242 -192 -13 -83 265 25 -102 19 -76 -190 111 -66 -288 -157 78 -128 -30
6099 -30 128 -44 -5 -173 -209 -227 -106 -23 -74 -4 -45 -115 -114 -41 31 -47 -28 -85 -118 -8 -35 -144 -127 -264 128 195 128
6126 128 131 -39 -153 -81 -146 105 105 89 93 -185 -203 -65 161 -138 162 -38 67 103 -40 -208 -16 131 -48 65
6150 65 104 57 162 66 191 130 -158 -124 -149 -101 72 183 -10 -4 -178 -27 45 -30 152 101 -80 10 45 72 -149
6175 -149 16 -374 37 -245 -17 -99 166 -88 123 127 -82 -3 77 -34 -10 179 58 -47 -106 -112 -210 -10 94
6198 94 -75 -59 -45 -2 -72 -238 -45 -61 -19 -58 -2 -23 1 -25 -7 186 115 -40 -25 -22 217 -33 -47 203 92 6
6224 6 63 37 -147 291 -66 -136 -123 -97 125 10 -146 -98 -35 42 -264 -4 138 -44 -86 28 82 102 66 -109 126
6249 126 -175 -48 -128 56 293 -14 -212 273 -78 -96 158 -197 46 77 -172 -170 -95 -104 -1 342 133 -49 -17
6272 -17 271 129 162 7 -48 75 15 -92 -352 -17 121 132 -75 339 -96 235 -5 -6 150 -53 -128 -219 47
6295 47 -3 -200 140 97 -33 -2 173 -46 140 -17 -210 167 62 105 72 6 239 238 -51 31 -49 -7 -164 84
6319 84 123 266 -54 133 -49 -4 -168 -41 -1 -27 134 280 135 211 111 32 28 242 158 264 29 86 81 -199
6343 -199 242 -99 -56 -15 194 -374 -198 117 -174 178 249 14 53 -113 43 -50 -77 51 -242 88 -8 -133
6365 -133 -69 -224 -20 -179 -251 32 -81 24 103 -57 181 241 110 151 37 -283 232 -89 -246 83 86 177 17
6388 17 -259 -109 152 -124 187 -108 57 -49 157 -124 56 166 105 65 175 -146 -287 -68 98 53 131 -240
6410 -240 -97 190 -211 320 41 87 -36 150 81 -222 -194 52 -323 15 268 -178 -78 222 10 -159 -57
6431 -57 123 -329 98 -69 -78 31 80 55 161 -58 52 -10 220 -2 169 318 -37 245 -290 -25 -34 -315 62
6454 62 55 16 -122 98 -291 324 139 -312 -107 -19 213 -231 -165 128 -52 48 -240 -25 -66 -64 20 -30 162 -161
6478 -161 61 158 -25 75 -82 -313 92 30 -49 -96 -281 -301 -125 21 -94 46 -197 -1 180 40 -281 -61
6500 -61 75 -3 -48 212 195 -119 74 11 -163 45 97 79 94 180 -23 -53 211 52 -73 -44 159 28 -229 -108
6524 -108 149 162 -20 28 -338 -59 -3 -152 -140 -2 56 -143 73 -146 27 -87 -77 -39 206 114 95 -130 109
6547 109 -115 73 6 97 -358 168 -13 79 37 -277 113 -51 -230 -199 -267 80 -113 -297 -219 254 97 -6
6569 -6 -264 -23 129 110 46 -129 -30 10 -117 -82 81 247 141 -122 -46 182 2 -133 -170 -4 65 -52 99
6592 99 -57 -91 235 -211 -54 82 71 -112 -145 -12 294 99 305 68 -177 -127 199 130 93 -71 146 -150
6614 -150 -223 42 -113 -16 -136 91 175 42 -43 -156 19 -104 -235 -98 -36 -27 325 -34 54 281 -60 -97 39
6637 39 -103 -86 68 225 268 -128 61 30 22 225 96 194 -33 -164 -309 217 111 175 5 126 113 40 -21 -81
6661 -81 -141 -305 -146 -207 125 -11 70 -31 65 -17 -348 -62 -26 207 14 -132 -4 -257 39 -250 117 -82
6683 -82 -168 34 19 42 -142 42 13 -97 -150 26 -65 -77 -77 -206 -320 317 -213 -61 -302 100 -26 -279 -124
6706 -124 -255 136 -184 -39 96 -16 -70 -38 -125 -25 86 -56 -143 -34 -415 20 -39 -10 -83 -102 -136 14 93
6729 93 -104 260 -1 71 213 226 154 167 60 170 124 -264 -126 -6 184 -98 -22 -8 -289 163 108 -52 -162
6752 -162 -81 56 169 1 126 -25 -105 -55 132 -254 71 -157 20 -108 -76 -59 -60 255 21 -16 -148 192 -3
6775 -3 -96 -9 -2 51 -6 -213 -14 -44 28 188 -21 139 -35 -163 176 -135 30 -248 -181 -117 37 280 -173 29
6799 29 -83 71 191 -263 -6 54 -154 -140 20 -23 -95 15 -30 66 -41 8 -7 184 91 131 16 15 305 47
6823 47 -102 -29 104 71 -67 -210 56 110 -19 -131 88 206 115 89 -252 -185 94 -40 287 122 -95 18
6845 18 87 -283 111 -21 -111 -33 135 -53 116 366 -104 133 -47 172 95 -97 -262 72 -20 61 11 -113 -24
6868 -24 469 30 -112 -144 159 94 -28 46 108 134 -262 39 328 81 95 -172 -52 176 -65 -127 57 35 -213
6891 -213 54 -101 209 -50 -138 117 -54 -145 243 175 80 -52 163 -5 5 15 279 77 34 73 -12 18 -48 -9
6915 -9 116 9 -84 -2 -51 92 -193 -79 28 -55 -19 20 -191 -104 -70 221 -165 286 -135 -51 94 161 51 144
6939 144 -52 -52 69 -104 8 103 -81 66 228 -43 143 113 78 104 -3 62 48 -47 -122 -130 340 118 79 -38
6963 -38 -74 21 -87 -197 -214 -131 -65 154 148 39 6 58 -45 36 -139 -322 -127 -76 10 -229 282 30 230 -78
6987 -78 -143 127 11 155 37 -37 219 -14 25 51 17 0 82 -104 -105 180 -162 -73 129 -4 60 -74 -170 -196 246
7012 246 200 59 62 60 117 6 -179 -132 360 -212 151 184 22 105 83 -6 -145 -1 -209 -17 4 -132 77 -134
7036 -134 14 109 170 -35 220 210 125 121 218 14 33 -47 -24 6 -22 -194 -162 -346 21 187 358 -20 -1 -200 -85
7061 -85 -107 -178 -143 -130 -293 243 6 137 -147 18 -83 -125 -49 -101 -45 30 222 -61 294 40 169 160 -225 72
7085 72 -160 -249 51 -200 -93 -139 -247 -66 -121 324 165 -31 20 -136 29 -43 -64 -226 -30 239 261 -21 -113
7108 -113 57 -133 -183 182 16 1 -13 148 -46 131 -150 -133 5 -153 -110 -31 -197 -93 -205 -147 20 -271
7130 -271 -142 -3 -36 121 -58 -67 99 -321 18 300 -33 -20 128 8 -49 -136 -191 -41 71 54 -77 373 -204
7153 -204 -120 23 -30 -182 137 169 135 -41 -45 -46 169 -40 -18 -82 14 116 14 -33 48 150 -171 54 50 179 -192
7178 -192 -34 118 31 -122 -234 236 -194 105 -44 148 186 39 136 -29 -10 -33 -37 203 -57 180 -143 -243
7200 -243 -153 296 -123 270 217 128 5 -58 -198 -379 171 163 -161 -75 -70 90 18 -54 118 -26 229 37 -152 -134
7224 -134 -88 -232 79 241 60 162 -68 -5 355 -290 42 101 12 -180 84 152 37 -7 158 145 2 -256
7246 -256 -72 308 -32 -11 78 -105 353 8 41 -25 -13 43 -99 -45 7 159 275 88 60 -141 178 -151 -189
7269 -189 55 32 331 239 261 -112 -14 39 -25 -18 -178 104 26 -83 68 -102 299 -69 -99 -35 151 -48 69 25
7293 25 115 3 -298 -4 -127 88 -49 122 139 -12 -115 91 155 -24 20 -7 -153 -41 75 -37 -189 -51
7315 -51 191 114 -58 45 -68 -118 -39 282 104 168 124 -46 -176 -237 -164 182 -53 17 -37 -253 -62 321 57
7338 57 -87 -3 164 -399 -141 64 -197 -64 -34 -135 240 -149 -42 -237 14 -301 42 91 -26 -3 -83 -24
7360 -24 -255 -25 -55 13 209 86 -269 196 -43 -7 160 137 -14 -76 -43 86 -115 39 -153 -332 -133 -25
7382 -25 -4 -91 -176 149 51 -111 97 -74 -30 -11 -209 60 11 165 126 87 -294 -137 108 -30 15 -149 -67 204
7406 204 101 -70 34 -12 -35 -23 -241 196 -72 58 -61 -145 67 -168 -76 31 281 159 23 -6 -325 -80
7428 -80 -78 -76 -285 -213 91 110 148 69 123 158 37 -64 -4 -17 47 131 4 72 -53 -262 53 82 -113 -28 96 96 3
7455 3 -114 -194 -28 98 -69 60 -70 -112 228 142 -8 -36 131 -137 -331 -94 -88 -50 12 -89 -203 -154 234 -297
7479 -297 -140 -3 -32 68 -151 37 -76 90 -400 -104 -258 -108 43 100 12 10 -118 -118 -84 29 -28 165 121
7502 121 -110 -163 -216 107 1 2 -81 -7 -8 -361 136 72 -42 195 -175 117 86 77 -82 31 -100 2 85 -11 -183
7527 -183 164 -144 158 5 -89 197 -226 106 -82 366 76 34 134 106 -87 313 22 140 -59 42 218
7548 218 49 115 128 -95 -57 -143 -170 121 137 -54 42 266 -125 -42 189 -12 -135 44 -41 75 -312 42 21
7571 21 -228 61 146 281 -120 -40 182 51 101 18 32 -74 -49 -33 28 198 -70 133 45 123 80 -12 28 -241 -101
7596 -101 -53 171 24 34 192 -74 111 -515 -312 45 -329 -68 -300 445 -26 216 33 -188 -8 48 132
7617 132 -124 214 -132 -53 -79 -67 -144 226 -15 92 -28 -15 134 -47 -32 0 -260 46 6 -205 100 -73 -14
7640 -14 -107 -257 7 -12 -23 -525 37 203 -836 -2 468 64 54 48 -359 61 -120 62 -112 -192 -81 97
7662 97 -166 -102 68 160 -7 -157 91 91 -259 -58 -83 -123 -131 -146 -28 184 134 -70 83 39 66 -50 -22 92 -69
7687 -69 180 -82 24 -321 7 42 69 -131 124 19 135 -82 -135 15 -89 283 -131 -127 -176 -73 96 136 197
7710 197 40 18 -128 -14 -74 143 -65 143 229 22 24 -37 -19 -69 159 -197 267 42 155 -190 227 32 -41
7733 -41 58 140 -116 246 -160 -265 -301 -168 -176 26 172 -70 -18 16 -66 214 152 164 16 130 91 -53 -102 -150 17
7758 17 -37 27 -117 146 -124 -60 188 201 -288 -25 137 18 -49 -77 -30 -20 -5 137 136 -63 87 -69 -33 -21 -260
7783 -260 174 10 -55 -338 181 53 51 21 -166 -79 -15 1 -242 -16 188 -7 -140 104 172 30 -121 -235 31
7806 31 -407 192 -33 -58 -97 -8 -250 373 -197 122 -106 -240 62 -75 24 -166 125 -189 48 92 144 93 199
7829 199 62 157 -202 -62 0 38 -176 21 -80 -59 -122 -214 -66 93 -18 -86 -101 -231 -265 -91 80 -64 -29
7852 -29 130 -245 -162 44 -54 -106 -172 -64 114 89 -70 26 183 102 -164 195 158 -302 -19 -14 -271 -23 -296 -163
7876 -163 -47 70 150 10 41 -216 100 77 48 -308 -232 68 -317 242 102 24 7 362 -154 9 144 -56
7898 -56 -87 -104 179 147 -228 90 -228 -167 168 -57 -63 -89 -109 -40 -188 61 101 256 194 202 -147 -143 221 -94 203
7923 203 -50 85 164 138 -193 53 -5 118 133 108 -44 -212 -24 218 120 10 265 -65 101 142 -60 -12 -185
7946 -185 -43 201 155 -118 -54 32 272 29 127 214 1 -177 130 38 -44 -2 80 -21 -115 205 214 231 48 -146
7970 -146 -30 270 116 39 106 106 228 -93 29 218 20 -156 -113 -57 -121 97 -214 280 -93 -272 7 52 -116
7993 -116 107 -180 -7 -100 46 67 -23 129 273 -138 104 47 -77 110 -89 118 50 -278 -170 91 -220 19
8015 19 -3 -98 -247 196 115 -51 27 224 6 -97 -52 192 36 -291 -110 -124 -127 -160 110 7 -291 -156 38
8038 38 -209 -64 86 -14 -37 80 50 -135 231 -363 40 -83 71 -25 -154 -125 -18 85 30 -35 161 30
8060 30 233 -189 -53 -253 -63 61 -76 -143 -190 105 46 -170 -15 -80 -30 -81 90 37 -82 37 -2 -160 -207
8083 -207 -24 19 42 132 119 50 -47 -92 -4 -77 -64 -146 16 -171 -157 169 -137 -7 -44 -47 124 -17 -239 -92 -68
8108 -68 -184 196 -148 32 -24 54 -182 -41 -211 13 51 -203 162 -100 -49 286 27 191 -40 -131 252 143
8130 143 103 35 152 -129 -91 34 36 33 -210 -44 194 -29 -218 12 -83 -178 -108 -44 92 148 166 -114 84 144 -199
8155 -199 137 -61 -153 -28 -69 74 -30 -7 -133 -72 19 113 -93 -86 -50 -111 -63 -19 29 33 -298 65 38 -198 -128 -226
8181 -226 -260 19 -156 -11 -127 306 -135 -191 6 -179
8191a79
$$ Imaginary data points
##PAGE= N=2
##DATA TABLE= (X++(I..I)), XYDATA
0 0 0 0 0 0 0 0 0 0 0 0 0 0 0 0 0 0 0 -7 8 -8 8 -8 8 -14 16 -16 16 -24 24 -31 32 -39 42 -48 55 -62 70 -78 86
39 86 -97 107 -120 132 -146 160 -176 198 -215 238 -262 290 -318 351 -388 430 -474 528 -589 662
59 662 -746 849 -976 1138 -1353 1653 -2101 2843 -4289 8190 -42336 -108544 -16351 43414
73 43414 10195 -32752 7247 56194 51213 18800 13250 12344 14286 32917 51965 39030 28104
86 28104 52242 81853 61317 15312 9883 38842 38241 13214 12239 33369 37797 27185 21855 15340
100 15340 -6331 -19664 -9196 -4841 -22701 -28064 -8725 1035 -12405 -29224 -34374 -35816 -39405
113 -39405 -37961 -35312 -39350 -35168 -14636 -7040 -25775 -39690 -27885 -12607 -21135 -34927 -20258
126 -20258 5459 7340 -2018 2938 10558 5897 -192 5366 12236 10004 13640 28844 33066 22216
140 22216 19282 26267 25017 14345 10395 18604 24991 21551 19215 22322 19537 11240 6879 5404 1263
155 1263 -3019 -1262 4807 2537 -4642 -4316 -2935 -10212 -17775 -17595 -14957 -15328 -16533 -13563 -9368 -10738
171 -10738 -14046 -15212 -16900 -16893 -14419 -13074 -11995 -8894 -3884 -525 -2037 -6451 -4951 -258 -427 -3007
187 -3007 -708 6342 11034 9065 6878 9121 9473 7360 6212 6586 7471 10950 12897 11848 10174 9469
203 9469 9797 7650 3238 2577 4302 4566 4966 4847 3299 2560 822 -1545 -2419 -4491 -5948 -4284 -2354
220 -2354 -2401 -4746 -5823 -4931 -4890 -7985 -9888 -8627 -7043 -5152 -3953 -5442 -5170 -2923 -2811 -4717 -6589
237 -6589 -5329 -1780 -655 -1669 -339 2170 3012 2399 590 79 2599 3378 3140 3813 4982 5562 6133
254 6133 5154 4213 3593 3514 4094 4178 3231 4267 4804 4043 3518 2624 679 117 192 -39 -149 -959 -768 265
274 265 -662 -2815 -3354 -3653 -3762 -3654 -4917 -4638 -2537 -2634 -3543 -3765 -4261 -3534 -3524 -4312 -3743 -2306 -1313 -347
294 -347 -1095 -1220 303 384 -465 158 966 1413 2421 2578 3005 3418 3315 2746 2967 2884 3049 3584 2861 3521
314 3521 3794 3102 2828 2394 1759 1770 1252 287 603 1101 172 -104 -748 -1166 -1036 -2203 -2878 -2275 -2163 -2446
334 -2446 -2593 -2635 -2627 -2358 -3471 -3103 -2853 -3155 -2413 -2182 -2662 -1390 -1178 -1617 -1323 -1083 -696 -115 -196 -177 1328
355 1328 1382 1228 1725 1603 1847 2415 1630 1850 2699 2631 2525 3001 2365 2919 2773 1819 1981 1908 1346 1552 1101
376 1101 877 1304 592 -107 -203 -365 -669 -1082 -1623 -1318 -858 -1808 -2240 -2114 -2325 -2597 -2423 -2688 -2354 -1798
396 -1798 -2397 -2565 -2003 -2055 -1462 -1624 -2071 -1172 -787 -904 -311 -67 181 835 493 589 1372 1525 1510 1858 1917
417 1917 2250 2901 2037 2652 2716 2280 2810 2283 2292 2603 2380 1677 1675 1623 1383 1163 343 240 281 -185 -822 -581
439 -581 -1139 -1321 -1239 -2103 -2170 -1950 -2292 -2686 -2542 -2567 -2437 -2660 -2893 -2445 -2193 -2427 -2241 -1911 -2022 -1431 -1006
460 -1006 -1307 -640 -246 -207 52 442 972 1435 956 1487 2017 2188 2298 2433 2367 2785 3100 2604 2681 2798 2444
481 2444 2812 2340 2318 2183 2014 1631 1485 831 563 423 -365 -563 -186 -861 -1493 -1400 -1570 -1901 -2070 -2459 -2433
502 -2433 -1971 -2635 -2609 -2643 -2954 -2216 -2168 -2522 -1833 -1899 -1808 -1325 -1507 -1049 -547 -312 -317 157 809 1162 1150 999 1467
525 1467 1980 1761 1831 2593 1989 2171 2443 2184 2015 2083 1762 1831 1662 1657 1158 635 993 1336 308 114 -150
546 -150 -539 -671 9 -555 -1049 -790 -1111 -1282 -1396 -1251 -1371 -1612 -1985 -1517 -1313 -2059 -1166 -1380 -1690 -875
566 -875 -598 -810 -686 -138 -231 -270 11 370 456 113 651 939 352 746 943 406 831 1235 344 103 739
587 739 752 631 440 237 402 139 179 471 -295 -326 362 122 -353 -239 -231 -172 -241 -382 3 -205 -266 -446 -570
610 -570 -116 446 150 -448 157 327 -65 694 611 -30 451 688 606 629 590 186 297 382 423 387 -354 146 491
633 491 -4 -118 -281 -347 -439 -85 -496 -811 -652 -687 -624 -971 -777 -782 -1019 -1126 -584 -737 -594 -436 -868 -718
655 -718 -64 177 -503 295 200 563 319 290 770 596 617 1030 859 928 1289 1127 865 1288 1441 628 918 1180
677 1180 1063 553 743 166 433 -88 116 554 -520 -509 -444 -866 -795 -657 -1008 -1022 -961 -1233 -991 -1370 -1379 -1121
699 -1121 -1616 -1307 -496 -1112 -1052 -619 -567 -567 -460 -505 -582 9 261 324 237 251 630 805 747 1409 1241 785 1270
722 1270 970 1253 1182 1429 799 956 861 959 874 687 537 610 395 524 367 -492 -50 -166 -589 -665 -309 -991
744 -991 -1120 -902 -819 -1271 -1156 -1119 -887 -1071 -1055 -716 -1161 -928 -611 -868 -495 -295 -647 -546 -167 151 23
765 23 56 209 408 715 565 868 592 602 980 1070 792 1255 899 1048 1258 1176 850 960 592 910 784 758
787 758 328 238 44 189 102 -391 -427 -308 -622 -303 -693 -897 -1034 -824 -996 -863 -1004 -1252 -589 -973 -1256
808 -1256 -897 -905 -788 -493 -340 -758 -379 -375 -380 -199 93 416 107 77 586 425 333 1047 940 1043 1205 978 687
831 687 1149 1037 1147 1097 974 1124 1277 933 911 977 423 796 604 139 188 388 -342 -262 -175 -510 -327 -697
853 -697 -961 -830 -866 -897 -954 -1309 -1196 -1085 -1209 -1215 -986 -1232 -1125 -1061 -846 -692 -420 -545 -256 -319 -155 -97 76
876 76 294 386 368 476 984 681 886 1019 1194 1067 1270 1119 1174 1173 749 1206 1306 805 814 758 484 591 809
899 809 283 436 214 -55 20 17 -436 -156 -351 -733 -978 -1055 -1098 -831 -1146 -1394 -1224 -869 -1160 -1045 -1068 -1321
921 -1321 -1054 -1014 -707 -872 -997 -378 -106 -457 -110 -59 -60 459 670 387 794 651 720 1086 787 883 1243 1288
943 1288 894 1163 977 1396 1068 1021 1067 1078 629 682 496 418 221 346 -75 0 -65 -447 -392 -510 -643 -483 -668
966 -668 -919 -857 -1092 -1085 -1098 -1096 -1082 -809 -1019 -953 -611 -1129 -516 -835 -965 -341 -361 -318 -103 -23 67 237 234 401 632
991 632 638 760 748 824 877 1008 912 820 954 882 859 1043 900 727 572 531 633 437 413 495 387 50 -75 -264
1015 -264 -158 -295 -352 -549 -466 -739 -837 -612 -1004 -453 -840 -533 -736 -870 -1000 -658 -698 -914 -392 -558 -341
1036 -341 -383 -405 -349 -154 33 23 43 140 365 322 455 531 765 511 639 836 842 923 555 529 725 814 910 656 567
1061 567 481 454 247 66 19 -157 108 148 -203 -190 -261 -422 -601 -424 -580 -292 -438 -909 -577 -531 -584 -589 -546 -624
1085 -624 -267 -371 -485 -406 -146 -419 102 -52 -230 100 187 249 141 451 659 567 507 757 819 354 739 484
1107 484 451 721 747 130 642 424 213 462 501 240 254 -152 -54 138 -97 -264 -208 -598 -622 -383 -420 -585 -362
1130 -362 -477 -1009 -959 -576 -1083 -859 -474 -484 -462 -530 -386 -509 -311 -28 -233 -183 -18 284 375 432 353 423 546
1153 546 626 723 823 742 711 880 759 727 534 652 645 1020 653 879 433 328 327 297 127 -93 -84 61 -15 -10 -417
1178 -417 -352 -774 -723 -451 -612 -916 -966 -557 -860 -798 -926 -553 -992 -598 -495 -241 -703 -446 -332 -517 99
1199 99 -87 -25 47 378 439 612 181 344 628 182 623 867 609 760 1009 534 791 1000 593 596 1075 630
1221 630 386 523 341 220 145 285 389 82 -101 -324 -366 -497 -178 -669 -900 -717 -631 -792 -894 -936 -762
1242 -762 -861 -835 -284 -715 -834 -433 -341 -462 -221 -179 -581 -398 -101 -163 32 205 160 105 334 586 527 620 335
1265 335 546 517 888 765 365 850 920 944 519 697 504 530 549 679 571 230 182 231 171 309 -307 -11 -387
1288 -387 -54 7 -315 -41 -209 -621 -557 -538 -431 -382 -853 -467 -552 -882 -409 -508 -712 -20 -423 -502 -384 -165
1310 -165 -77 -64 -22 -3 -87 -249 165 185 327 414 334 399 448 567 488 242 392 400 573 358 598 332 473 298
1334 298 535 2 285 553 126 222 547 -4 -210 147 -47 -55 -108 -409 -306 -458 -314 -222 -507 -484 -381 -338
1356 -338 -585 -314 -474 -500 -219 -222 -314 -408 -204 -58 -100 -87 -50 368 -85 54 344 211 290 194 202 322 390 308 71
1381 71 316 391 519 256 133 347 232 93 471 123 -72 294 358 40 76 167 -287 -96 -195 127 -201 95
1403 95 135 -76 -248 -340 -309 -317 -102 -625 -336 -292 -171 -242 -217 -250 -198 -105 -111 -76 -42 -305 2 176 178 45 226 114
1429 114 295 267 167 150 345 192 349 307 197 563 210 78 442 150 60 67 -89 191 56 -61 -50 -221
1451 -221 97 -80 99 -246 -230 -96 -333 -187 -217 -101 -642 -363 -242 -299 -300 -160 -209 -241 -311 -360 -214 -431 21
1474 21 -218 150 -44 90 190 195 -141 92 246 200 198 310 137 155 409 148 213 183 253 176 -2 29 179 19
1498 19 115 51 20 -130 -26 182 -3 21 -113 -244 -111 -289 -289 -473 -201 -409 -161 -452 -68 -352 -573 -382
1520 -382 -17 -232 -230 -260 -24 -30 -9 -238 56 -35 103 134 -117 -46 324 200 194 248 207 138 365 287 170 395 48
1545 48 395 285 448 150 356 211 111 19 4 39 -17 -184 25 20 -63 -132 -151 -163 -64 -312 89 -218 -347 -219
1569 -219 -404 -307 -237 -198 -65 -184 -444 -206 -94 20 -390 -37 -85 -52 -142 -14 -23 -39 -78 250 324 -12 -144 50
1593 50 -12 234 214 344 158 208 -89 161 -1 381 83 -139 178 -134 71 143 298 -342 -314 -70 -124 -89 173
1616 173 -201 -262 -71 66 -95 -107 95 -25 14 -49 3 -90 -95 -33 120 -175 -315 -175 153 -38 -198 -70 369
1639 369 -370 5 113 39 163 18 133 363 -9 149 83 84 278 69 144 -224 210 76 302 67 -74 59
1661 59 -123 87 34 106 6 -199 82 -60 253 -218 99 -175 -214 -162 -180 -18 121 169 -127 15 -37 81 -52
1684 -52 -163 -54 163 166 -12 322 -155 -165 -85 45 -92 40 92 3 163 39 74 220 276 95 27 94 92 -54
1708 -54 -97 -171 52 -40 -433 -199 -299 162 -12 -89 2 -232 -178 -101 -241 8 60 41 287 145 -42 145 -225
1731 -225 -96 61 -66 -42 153 -90 -2 347 158 43 35 307 -152 71 78 -285 149 29 -218 6 -196 126
1753 126 141 -34 99 4 -189 -131 81 -245 -63 -266 -267 -251 -10 -94 -174 -147 -79 -39 -288 40 -23 -71 -90 -65 -212
1778 -212 -434 -27 -152 -37 116 280 -134 44 191 78 51 112 186 87 32 196 211 98 192 346 173 -76
1800 -76 110 -38 51 -36 228 -246 -72 29 -16 -95 228 37 -136 -222 -131 -83 31 106 -198 -378 -44 -415 -355
1823 -355 -319 -202 -80 -226 -204 64 -286 -195 -326 -153 -151 32 104 -213 31 -1 221 71 249 123 71 72 268
1846 268 -39 273 288 362 -30 -173 143 -24 198 242 -28 19 66 241 52 409 83 -7 73 197 289 95 102
1869 102 -108 -8 -240 -57 -35 34 -274 -322 -341 -252 -255 -68 -480 167 -40 -194 -26 -237 63 -143 4 -154
1891 -154 -310 -117 161 261 108 137 -85 73 -98 81 137 246 74 240 251 49 372 -125 512 86 107
1912 107 175 98 -26 53 26 83 -250 -84 107 -36 -158 197 -159 49 -342 -48 -17 -9 -90 -278 174 -27 -39
1935 -39 17 -37 106 -130 -289 -142 -288 -135 52 -122 -92 130 1 -89 20 38 -124 -20 -39 38 182 -216 -90
1958 -90 269 63 -107 -4 18 43 -39 -49 19 169 52 564 116 -125 195 -202 -193 100 131 186 -126 -317 -149
1981 -149 -103 -107 -40 35 77 -123 27 -127 -92 -21 50 138 166 -107 44 53 -136 49 51 -73 -67 32 -91 30 -215 17
2007 17 281 -10 65 167 209 135 187 -81 -28 -52 48 -183 -34 148 270 54 41 161 -42 124 87 189 11
2030 11 -30 0 -191 51 -4 -17 -170 -19 21 2 -6 125 207 -130 27 35 16 -127 -69 -115 30 -204 -52 -62 -168
2055 -168 -176 -12 -11 278 -144 -294 141 5 -25 -84 44 -4 -287 -3 48 49 173 233 -44 75 138 -12 92 180
2079 180 73 80 67 4 -141 -177 229 25 347 201 78 -53 -2 24 50 -6 148 -20 76 166 44 -100 41 -336
2103 -336 -143 60 -180 17 19 61 -186 -30 -101 -24 -54 88 -45 364 32 84 64 -33 133 62 99 77 177 -30
2127 -30 276 -71 88 -234 116 65 -208 346 -7 -159 207 -61 238 53 -51 -172 -241 74 -122 -44 -129 -188
2149 -188 45 -57 -45 -16 -250 -70 -120 -93 54 156 92 -369 176 -109 -94 -168 -144 17 42 -101 87 -197 -68
2172 -68 -207 -37 -14 -95 -8 -13 154 -11 -31 -23 -97 -241 170 -101 275 -134 161 145 -87 -206 35 -189 199 -33
2196 -33 -78 29 -83 51 -57 -166 -280 93 -9 -172 208 -41 -245 -285 135 137 -8 -296 146 -100 64 56
2218 56 135 -18 165 -203 -184 232 157 -129 -23 -28 64 -38 -81 -234 98 222 -117 -298 -62 84 293 -72 95
2241 95 284 234 6 74 58 216 6 -10 -110 340 -159 239 -113 55 147 -11 126 -387 110 145 -71 -68 -79
2264 -79 204 -94 -101 290 -41 26 -130 -158 19 -416 55 -64 30 64 -9 -56 -158 -227 141 -67 48 198 -74
2287 -74 59 126 -34 47 414 50 -197 94 -111 236 99 217 101 136 1 423 -182 -101 -4 115 10 268
2309 268 -16 -10 75 262 -335 103 -160 24 113 -218 143 -30 55 -27 267 -211 149 -172 -177 -375 -19 113 -13
2332 -13 242 -14 -7 -88 -51 -11 -62 -84 228 114 171 18 27 -69 42 -93 -27 208 11 106 93 -13 -96 -38 189 191
2358 191 -52 156 10 0 -64 -34 -37 -61 -353 0 -37 64 178 -18 -27 15 -51 118 -299 47 -121 144 141 189 100
2383 100 -92 78 253 -56 126 91 60 20 6 -10 -140 64 147 -21 84 215 -54 112 16 60 -72 -138 1
2406 1 376 74 68 86 10 -95 -301 -350 -86 -182 69 48 -122 -219 -86 164 -241 -93 -84 -108 -45 -32 -4 -136 172
2431 172 -36 105 65 -72 21 -89 83 96 -75 19 -34 -65 54 -17 108 297 248 -159 353 -25 -164 257 -198
2454 -198 114 76 -82 -31 105 46 128 9 51 -63 62 122 -223 -239 -179 -217 -36 34 -120 -159 -157 -188 -21 67 18
2479 18 -150 123 -149 25 -125 57 -199 58 54 44 -215 -149 329 -275 170 146 -7 -43 -300 -9 94 -190
2501 -190 69 50 -77 8 -82 121 92 17 168 157 78 -77 50 154 -278 27 69 29 184 -31 33 26 -49 -13 30
2526 30 9 -89 16 142 202 -203 4 22 143 -153 -109 125 -141 59 -203 -44 19 335 171 -96 -183 212 -14
2549 -14 -18 -13 -110 -353 100 -47 217 65 -140 141 -106 246 -39 -5 -32 -54 -280 36 78 80 220 -8 -136 8
2573 8 -37 -163 -80 -90 -102 36 12 -285 -24 150 115 164 -27 -79 -145 17 161 8 123 119 -145 -19 28 85 -10
2598 -10 50 65 192 -20 55 -33 -57 3 76 22 256 79 -89 195 -41 -75 160 -128 14 50 -40 -153 -260 -4
2622 -4 -143 33 -149 -193 -145 -206 156 -29 -158 14 -116 -7 -211 21 -163 -187 140 342 -258 -99 -333 0
2644 0 -132 24 168 215 -73 196 4 -16 89 67 -11 150 -62 157 -100 177 56 517 71 -59 -118 -90 -12
2667 -12 64 -188 16 47 -29 -100 -67 87 -417 -35 -55 206 21 105 142 -239 93 -173 -113 -15 106 -18 -33 163
2691 163 19 -73 -184 -30 4 -91 -59 72 -111 -139 19 -178 81 167 -20 95 89 -52 -293 10 25 60 -381
2714 -381 122 140 4 139 -218 -129 9 170 -115 6 -123 -159 11 -6 -26 110 -70 -118 -121 -124 -6 6 228 128
2738 128 195 -244 55 -65 146 83 -61 14 -79 27 219 -97 178 124 -9 -94 -6 -287 109 253 -88 71
2760 71 57 -66 -119 124 198 126 169 -54 -142 219 -112 7 163 176 -223 -123 -33 -167 22 144 115 -155 -183 -31
2784 -31 -206 -135 -155 258 -188 -220 12 117 2 -45 49 1 112 395 -10 142 99 53 -45 13 33 -152 -223 1
2808 1 30 -14 -76 -207 174 -17 -322 238 24 5 141 -106 -175 -149 3 31 61 -221 0 75 78 -49 -255 82
2832 82 -72 -109 107 -78 -51 -140 -104 206 16 -187 -121 -72 94 134 112 55 108 68 293 76 -127 53 197 -98
2856 -98 -29 55 -21 215 61 31 -196 401 -2 -163 174 -81 -82 56 -85 -82 -36 27 45 -6 -141 52 -145 -186 -14
2881 -14 -141 9 -15 44 -171 -181 -55 -14 222 -209 -131 -9 -136 22 -222 -146 -138 41 -205 -83 176 228 -104
2904 -104 -285 -113 78 3 -32 56 -253 -402 18 -60 72 145 -174 -119 299 69 99 77 4 -19 -42 283 41 -114
2928 -114 -7 225 -104 -5 109 130 -13 24 -130 -160 -53 -150 -6 129 99 172 145 -112 -168 188 264 18 -109
2951 -109 -169 -56 -17 113 156 133 101 -74 150 -34 45 -71 168 -275 -181 -22 59 -32 -248 -160 106 -143 178
2974 178 -77 -204 -201 -52 -76 -97 179 -91 -50 27 -42 35 139 -234 -64 -70 28 -21 -164 39 64 -100 -106 -157 -252 -33
3000 -33 -81 67 -118 9 -50 76 -132 -49 -5 -191 99 85 -135 -69 -62 -185 123 146 -130 14 -16 -29 45 164
3024 164 -41 7 -223 -6 101 56 170 328 101 187 -147 -26 27 27 -100 -84 -69 -80 225 38 -58 175 102 -67
3048 -67 40 31 -120 7 -46 -62 254 22 -56 95 102 52 78 -39 -180 84 75 5 -97 152 95 -41 -40 168 201 216
3074 216 -143 88 -1 45 -117 272 82 -4 52 -28 -76 126 -13 -129 68 -154 -239 124 -310 97 87 -92 227
3097 227 -197 101 -78 225 157 161 13 -231 100 308 -189 33 -121 -294 9 25 -11 -13 -100 -31 -79 -120 40 222
3121 222 -139 104 -90 77 -169 189 96 315 -23 261 -1 123 -265 141 -14 -298 -102 107 -26 -63 -203
3142 -203 58 -152 229 189 -142 130 -122 -66 211 -64 39 207 -20 167 127 -139 -84 -84 42 -93 -204 60
3164 60 -359 256 -105 -20 -65 141 121 -172 -228 -8 33 -139 -217 48 -186 25 -154 -79 -40 -100 206 -138 242
3187 242 58 323 -376 -24 -165 71 -135 68 134 -138 329 74 -53 -13 -212 -150 11 26 21 118 -127 265
3209 265 -35 -10 -279 322 89 245 140 224 74 -40 85 105 -132 -107 -212 -65 -53 -116 66 -268 208 127
3231 127 36 80 22 -98 -20 -235 -53 -105 44 -244 -46 161 306 -123 -87 -135 102 -61 -189 -28 149 -17
3253 -17 -14 -95 -40 -291 122 -193 -65 -238 -416 142 -130 152 -27 55 -174 69 98 -117 31 174 -3 149
3275 149 5 153 -229 43 106 8 212 -47 -9 47 34 22 126 178 -227 -77 -69 -129 -23 42 190 -71 -157 136
3299 136 224 98 -131 151 14 70 -74 -85 11 27 -26 -112 -82 -68 -243 -229 -17 171 -20 139 254 -101 -97 -26
3323 -26 -146 -91 16 23 -109 11 -13 -253 -299 131 49 -37 -92 57 -89 -297 38 61 -82 -142 65 -249 -193 24
3347 24 -8 97 -58 -157 183 -75 -171 -76 480 134 2 -150 -65 41 79 -245 -19 -37 -130 -148 -126 11 -176 96
3371 96 160 190 -253 -7 115 109 29 199 -53 -159 -13 -75 176 -35 10 42 230 -122 -268 33 111 -285 -106
3394 -106 -146 -212 102 -292 35 120 48 351 -186 -157 -140 56 -162 155 49 -139 157 -136 334 -149 42 3
3416 3 -190 -107 42 161 -4 333 -17 201 194 24 32 -300 154 17 -155 112 -119 45 -125 63 -53 114
3438 114 266 -58 -108 11 50 12 67 -28 -62 -45 159 66 31 -219 129 125 -251 44 112 -16 -203 29 84 14 63
3463 63 -167 195 -128 -13 -99 -240 -220 83 -19 394 -255 -264 91 13 110 -13 147 167 -30 -13 120 -132 49
3486 49 12 -35 -35 203 -7 -232 -73 34 286 -38 111 -178 -146 -153 -109 290 120 2 263 216 42 289 4
3509 4 3 -119 54 131 65 -223 -63 -9 276 98 322 123 -217 53 101 251 -202 -61 -262 72 -133 -226 68
3532 68 -164 -198 96 -350 -110 10 -23 44 138 -67 152 -178 -240 164 -320 57 -102 116 -34 -183 522 44
3554 44 -53 307 129 -88 -159 -24 89 -76 38 -152 -229 171 -337 36 -55 -127 -72 35 122 31 84 258 46
3577 46 117 145 -108 -19 55 -91 -78 7 -37 19 -125 54 85 -20 -255 -143 264 -64 48 83 16 24 42 -133 128
3602 128 46 18 -230 30 -42 -140 -117 -71 6 -29 13 167 247 -217 -63 -49 104 23 -57 -188 239 -242 -115 44
3626 44 -31 25 75 80 31 -160 245 -30 125 147 -25 31 41 41 47 3 403 -279 -61 255 26 265 -13 217 -2
3651 -2 60 2 136 -102 -199 70 -162 98 3 -73 260 104 -117 97 216 170 -21 -75 -75 -47 -156 155 96 -2 43
3676 43 -59 -91 169 75 -58 -281 0 27 -56 222 200 289 -278 143 109 223 141 115 312 162 -110 -188 -258 -222
3700 -222 28 37 37 -82 -49 55 3 -60 -40 -132 31 52 -45 114 283 293 -102 -34 83 -112 195 -182 -122 -123 360
3725 360 41 199 120 -127 232 -10 -48 -7 -249 -148 -249 -56 5 -40 -261 -100 -51 -221 -55 -300 -213 182
3747 182 207 31 127 -160 -34 183 -140 -86 -144 67 -123 0 -98 217 138 -347 -96 -80 -81 143 242 81 125 85
3771 85 184 -112 -24 -248 -193 138 -105 101 -24 74 -186 43 -107 56 -76 -284 51 15 113 32 35 146 128 -208
3795 -208 -149 65 -122 59 37 -60 3 -156 103 -71 -15 -301 -28 134 17 -99 93 84 -20 179 103 -187 -257
3818 -257 229 93 -53 142 64 -16 21 -41 16 -59 321 96 -25 177 32 -13 3 80 82 131 80 37 154 1 -223
3843 -223 155 -105 376 -36 -175 202 -77 -97 -103 137 -26 -192 184 -152 120 97 -15 35 -139 83 -94 -212
3865 -212 -3 -52 217 151 -20 -154 -33 -166 -162 128 -36 425 -228 -125 -108 -75 86 -137 -48 -43 192 -141 -215
3888 -215 15 -220 -151 -134 -48 116 -28 228 11 -184 -19 -12 26 30 55 380 -61 -356 94 189 -104 -57 172 111
3912 111 82 -24 -224 147 3 64 35 -1 -104 -112 260 -10 55 -288 -159 -79 -46 204 145 102 37 83 117 163 42
3937 42 96 127 -117 -127 -58 -84 18 -60 -149 46 1 -21 -127 -127 5 -9 164 137 20 55 -55 253 -87 44 170
3962 170 -45 -163 -7 115 -46 0 290 136 -257 67 -117 189 50 -37 -32 175 59 25 57 72 -2 -262 16
3985 16 -94 -320 63 -94 155 98 -44 -93 -212 13 -96 27 319 97 -87 88 -330 -75 37 -57 -182
4006 -182 96 40 7 -122 90 -32 -83 -215 -101 -184 -71 -92 -113 -8 -82 17 -88 -95 -135 163 72 109 58 52 8 -5
4032 -5 -1 -142 -46 -252 34 -54 13 51 20 67 -159 -176 133 218 194 160 165 -261 51 -29 -54 155 -216 -52 -116 73
4058 73 274 24 72 124 -114 164 -144 195 258 33 -60 -271 116 43 -178 229 34 -155 -165 -16 81 -21 214
4081 214 -104 122 120 112 -102 -213 216 -5 -117 -172 43 171 50 48 -33 -87 116 76 -126 102 45 -23 30 73 -134
4106 -134 19 -276 -2 -64 40 120 109 -147 -37 26 -32 205 -76 131 -109 -56 -143 18 -301 -238 40 128 117
4129 117 32 -134 169 -48 -16 117 -275 -166 -229 41 13 3 -238 -37 95 -149 2 -194 122 198 -81 -41
4151 -41 70 52 -112 -155 43 -151 -129 -34 222 -74 127 -164 -25 130 309 -104 81 117 -16 -137 -223 19
4173 19 -14 -107 238 210 31 -187 -141 292 141 132 196 -2 -205 70 33 137 17 136 35 -84 31 33 -150 -177
4197 -177 -145 -140 -59 74 -31 190 -29 -110 179 10 53 -23 -269 -68 -166 -254 -137 113 -111 -205 75 -101 22
4220 22 203 -208 -39 -81 -106 106 -1 -163 -163 51 14 -88 62 -2 -99 93 98 -85 -94 118 91 -45 -74 97 -48
4245 -48 170 -38 206 -39 358 155 9 -112 34 11 -53 69 -167 -86 -231 -71 227 92 248 -133 106
4266 106 103 -132 158 87 -108 -194 244 -424 204 46 -194 -226 -250 27 -31 -12 128 177 -76 -21 33 209 -96 -339
4290 -339 14 82 198 -1 -100 112 -108 21 -185 -191 -154 -189 119 -28 -59 -64 -106 137 -55 -99 -38 -87 -25 -118 40
4315 40 -124 -115 17 -92 -87 111 242 -190 -32 -51 110 -136 72 217 352 4 60 -160 -63 57 5 154 -90
4338 -90 272 -279 172 -51 -157 -165 -12 105 -151 -171 -40 402 -27 -229 28 152 -60 -97 -42 125 -69 -197
4360 -197 151 -11 -106 0 -47 -199 -108 -2 93 155 -65 20 -136 -188 -168 -80 -181 -1 74 4 61 108 -278 -14
4384 -14 -33 109 -240 -18 -50 -91 105 -75 246 219 113 -177 85 224 4 -246 103 8 -49 130 131 127 154 -78
4408 -78 38 163 -206 184 -34 44 -17 -121 89 -1 67 224 80 -97 -92 136 -245 -101 -226 34 -123 -35 55
4431 55 143 51 -56 70 -76 -209 63 -298 -164 -96 -214 -86 -5 56 -220 -195 254 185 -203 -36 -105 66 -43
4454 -43 145 98 242 -2 352 5 -66 -112 -256 153 -28 99 -270 61 -199 -64 239 -151 -50 -191 -63
4475 -63 -61 -59 -116 -114 -80 -63 15 -37 -101 -180 -213 -34 -243 65 293 152 23 -198 66 -121 -36 -132 -143 -102 14 -25 73
4502 73 -20 -2 -202 99 -3 180 138 -65 -12 128 17 121 28 21 -182 76 -5 26 44 164 -1 -68 12 144
4526 144 194 117 0 132 -88 -374 167 64 117 -8 -175 -120 -53 -120 122 127 225 -38 292 -144 -180 76 39 -103
4550 -103 -2 -91 140 347 256 -117 -65 -73 187 -51 -5 90 -3 -288 206 -123 68 283 22 -38 -111 183 -239
4573 -239 66 -17 153 389 -21 42 40 -86 26 -214 84 -229 203 -120 149 5 -11 335 -157 -16 66 59 37
4596 37 -179 115 124 129 135 5 197 -191 23 -126 88 -250 -20 43 36 70 -95 115 -286 229 43 -135 40 -54
4620 -54 100 -77 -59 145 -37 -44 326 170 185 36 138 145 -56 57 172 -247 121 -81 -340 -117 128 19
4642 19 157 157 -331 13 238 48 -9 81 131 7 176 -2 170 204 17 127 282 -57 -155 131 -262 52 -334
4665 -334 -127 -24 -82 -108 136 21 -117 -110 143 28 251 154 76 -1 -193 95 96 -117 74 261 41 157 26
4688 26 112 -72 42 -32 82 -51 54 -118 -49 167 -55 -13 -40 -183 -59 -156 -83 -37 -318 150 -49 -256 47
4711 47 49 5 120 -122 231 32 -216 101 -9 -22 49 -92 17 -46 17 172 73 173 -91 35 338 50 297
4734 297 47 -169 12 97 -92 -64 -35 -89 -35 -12 -127 91 -26 -81 -26 -19 -12 -20 184 -283 -73 167 -23 282 -117
4759 -117 -219 -217 -66 128 137 -86 18 25 -238 -96 58 283 37 101 -103 -44 43 12 -38 -149 140 -212 -77 69
4783 69 -14 125 95 -47 112 -23 -155 -151 26 -168 -16 121 -192 8 -39 92 160 -18 -67 -109 -118 -6 -147 16
4807 16 117 -10 62 87 -209 -101 60 54 21 -134 -137 -184 54 -163 -84 50 316 18 -86 -80 -31 -165 16 -21 -9
4832 -9 -150 222 138 -180 -72 -89 -106 -1 -258 -235 151 9 190 -43 119 -144 49 -2 -136 73 -30 161
4854 161 95 -114 -212 10 91 78 -234 -97 -255 -195 139 6 -52 -82 268 -34 153 381 -158 -78 45 32 -301
4877 -301 -256 63 -109 219 -105 33 -208 -5 98 25 43 133 0 2 183 -4 -102 157 -153 247 351 25
4899 25 152 -120 -89 -72 -340 10 -107 225 -19 71 180 -87 293 24 35 65 161 -164 -104 140 59 18 108 194
4923 194 165 20 329 130 50 2 53 340 -53 -89 236 -5 -105 51 167 89 -159 -77 217 92 -12 -105 -83
4946 -83 -274 86 -100 -224 180 45 263 117 -215 213 87 116 62 -141 5 195 -167 -87 48 204 162 -39
4968 -39 -104 220 161 -106 -81 -164 90 -107 -5 -14 -24 -249 -222 -117 25 208 -34 -138 135 132 -24 -47 -56 62 -29
4993 -29 -194 66 72 40 -135 -50 91 -119 -231 -108 14 4 68 18 202 -200 134 15 273 176 -73 143 -33
5016 -33 82 109 176 -109 25 -66 57 -122 -56 -3 -410 -262 175 154 47 98 191 314 -151 -41 79 -19 98
5039 98 78 -97 98 14 -20 112 240 20 -119 -51 174 41 -28 52 246 -200 73 192 -46 -14 -118 -88 -281
5062 -281 37 -22 -24 -119 115 221 121 -106 47 -417 -192 105 39 100 -145 88 -20 -15 50 -154 -30 -123 170
5085 170 38 -6 431 -198 198 94 -52 111 -106 185 53 -170 -248 -77 58 -158 -5 -123 213 -10 -191
5106 -191 38 91 -117 101 -100 52 249 -75 120 -42 181 -24 87 39 -119 105 126 -140 -2 -100 154
5127 154 -84 17 -191 41 160 -130 -280 143 171 -131 70 -33 -87 37 182 246 -37 137 -325 128 -85
5148 -85 49 10 -179 134 -187 89 -44 132 206 94 -242 107 30 -204 -116 -150 -127 15 -83 -120 -318 83 -57
5171 -57 70 -305 -32 2 -48 -17 -45 62 187 25 61 -115 44 -65 129 148 121 -325 76 -62 168 89 91 -21
5195 -21 -250 -179 -20 99 10 -128 -195 188 124 138 108 -78 18 -291 -79 -141 113 228 44 27 110 -144 -417 94
5219 94 2 -20 92 -147 -194 127 120 46 -53 120 -56 -192 205 -91 -41 -94 95 13 -89 336 -31 14 -209 63
5243 63 134 152 7 -62 159 59 -47 43 74 -172 -78 -172 18 5 229 -37 -194 51 3 82 -65 -143 -84 -85 -34
5268 -34 16 35 70 18 -85 -66 82 221 -246 91 8 -252 127 -200 88 -12 -182 181 19 -12 89 -72 188
5291 188 -185 247 122 -145 -112 -128 64 78 257 -113 36 -70 75 -12 14 91 36 -227 -123 -241 180 -98
5313 -98 37 -259 56 19 -153 2 65 173 -16 176 -40 88 1 -12 -49 -86 -154 -25 36 54 -184 42 81 77
5337 77 -47 -144 -226 252 250 -30 24 130 326 146 -14 -135 -114 53 -128 137 -192 -333 -81 -4 -157 -6 163
5360 163 82 -33 -206 125 76 -154 -112 52 -74 225 174 68 178 189 -192 88 56 128 -230 -48 112 -37
5382 -37 120 288 63 303 214 -66 -61 -217 60 29 -260 -99 131 -122 -116 112 57 -189 49 -31 1 105 307
5405 307 -77 -118 -55 -152 59 59 67 -73 102 -130 -79 -91 -11 -84 4 -30 5 86 -20 156 -96 -141 -5 -52 -284 15
5431 15 171 99 72 121 136 -31 -77 -17 271 12 -279 164 105 -19 66 -145 67 188 -72 20 125 26 35 136
5455 136 162 121 73 -7 186 29 -74 -89 -231 220 218 201 -57 174 231 11 -175 -77 -41 516 -162 163 -106 148
5479 148 114 -117 236 -41 139 43 66 -179 -181 -83 64 -24 -230 -196 49 -18 -71 142 94 9 60 78 -12 158 370
5504 370 214 7 46 -222 -170 24 39 -141 -101 107 13 -41 -176 55 -146 -134 157 -138 -123 -42 -167 -127 -38 122
5528 122 -27 -67 -140 97 -83 -70 -166 85 49 -47 175 120 -132 -74 -107 16 -9 157 -246 -160 94 -213 81 -50
5552 -50 59 239 -122 52 -16 100 -64 66 35 -197 -36 -221 94 250 100 124 -46 174 -258 32 325
5573 325 80 13 36 -119 220 33 -116 83 96 78 -231 -64 87 -169 -26 -35 104 133 81 -82 29 -153 265
5596 265 -377 -45 -37 -38 -160 114 -99 66 -137 -133 11 202 -53 -253 105 -107 153 -25 -91 -54 130 58 156
5619 156 -2 95 76 44 156 -249 146 169 -179 69 -29 -38 -23 -121 206 40 -7 134 228 211 -83 142 239 108
5643 108 -74 -137 -33 107 48 -19 -262 -190 -71 -192 103 -178 -225 202 -172 -42 -150 -81 91 -51 -39 -117 85
5666 85 65 -54 -116 -58 148 -123 155 194 -11 62 302 106 175 -53 -208 109 -41 -16 259 74 276 -97 107
5689 107 -3 7 26 -172 -59 78 165 -22 -216 -36 104 -86 -167 -14 -56 14 67 -91 -146 -68 -189 116 -37
5712 -37 187 6 -71 127 -25 7 14 -91 -48 -8 -102 -31 -28 -187 214 -217 41 -63 -204 301 109 131 19 175
5736 175 161 -319 77 -149 -200 1 72 18 -111 -125 203 -135 -69 65 95 -51 151 52 46 344 -292 -96 49
5759 49 -25 -39 -182 74 27 271 -98 -51 143 -62 -65 44 -282 216 7 38 73 91 37 -6 -107 -39 -380 -184
5783 -184 273 -160 -97 -68 -33 -130 127 22 -93 -66 310 -11 115 40 163 97 -162 -209 11 -40 362 -52 -174
5806 -174 48 -11 112 18 34 -53 159 7 -175 -111 -146 110 135 32 37 127 -231 -247 64 21 72 31 179 106 -147
5831 -147 -34 151 182 -50 160 -186 109 14 -72 -139 -173 -99 -82 5 371 -74 -149 55 116 11 -121 1 -189
5854 -189 76 31 -83 -76 -113 -5 -130 -75 229 -81 93 -55 -99 -189 -159 294 177 -68 102 -63 -17 -294 355
5877 355 193 -108 -2 139 150 -17 96 63 -12 -71 -84 -5 -326 -65 -79 161 14 258 32 -214 -274 -177 -88
5900 -88 -348 268 -202 157 199 137 -171 -14 40 70 -43 113 206 -167 -30 -59 11 148 -54 -107 -277 148 -91
5923 -91 120 -285 64 118 235 -115 16 40 -134 -73 -89 181 -22 67 -147 -54 179 177 131 -113 -172 84 -164 -50
5947 -50 182 -125 -199 99 -281 -73 112 -114 163 -114 242 149 99 296 168 -22 -131 83 50 -164 163 -292
5969 -292 -18 4 -124 138 -95 169 96 -230 64 6 -61 -98 43 -73 -65 100 -372 142 203 42 -72 -94 -217
5992 -217 -126 102 25 363 137 114 -65 37 -111 -102 36 -295 77 36 0 -46 -84 -44 -32 95 -95 68 -26 193
6016 193 -128 239 96 -158 36 39 -118 -188 -21 -153 -113 95 140 29 -76 -118 53 -50 -132 193 193 174 -110
6039 -110 -80 193 62 33 65 -64 218 -266 83 -96 -140 -40 176 46 -174 -352 33 -46 17 -169 -508 -29
6061 -29 -80 68 -110 145 13 -56 173 29 105 -116 136 29 -71 283 161 107 255 372 41 87 21 -132
6083 -132 -3 153 -50 217 -25 -213 7 -32 88 -65 -66 -88 2 79 132 -27 222 48 -226 8 -122 -39 124
6106 124 114 14 28 -58 162 241 -230 90 145 222 -47 67 -1 152 -279 -233 -107 232 137 -124 30 109 -49
6129 -49 -56 -363 -261 -308 89 -94 -21 -13 -40 -15 19 154 84 -187 41 4 -35 -42 -56 -56 -94 -70 -41 79 91 -89 164
6156 164 -96 -235 209 69 -70 -53 41 -100 122 102 -2 -106 154 8 -18 210 -11 -3 -63 -22 -77 14 6 -142
6180 -142 152 -83 241 -146 -36 144 -30 149 164 42 -119 76 -158 -273 43 190 -306 -114 211 -108
6200 -108 6 104 186 65 -45 167 77 -47 -61 -236 -65 -57 -80 49 -142 90 -178 379 -87 2 145 -63 82
6223 82 -86 124 323 -152 -56 155 -172 -133 60 153 -123 102 91 -7 63 125 186 194 -13 -156 -67 132 118 -126
6247 -126 105 -116 -168 -139 -66 -94 -77 210 104 -137 -132 62 -33 87 14 -151 -74 146 224 27 -152 -46 97 -170
6271 -170 235 289 -41 -158 324 -226 -131 121 -188 -24 130 266 67 -7 -229 -99 146 -163 105 109 85 -181
6293 -181 -64 -206 171 -149 -65 -50 28 219 -197 154 93 -44 -78 -129 97 201 82 -144 216 66 -83 -116
6315 -116 -42 -27 167 -188 152 115 44 41 -158 -150 26 -15 -54 45 -204 -342 -108 135 32 -229 97 108 160 -63
6339 -63 -1 88 141 -10 -116 7 -79 -223 -71 4 27 -149 30 69 -272 18 -169 -106 29 275 -35 -168 187
6362 187 -33 -204 -203 -15 148 116 -10 -126 -13 80 -155 -20 296 92 63 -66 85 139 -87 17 -16 52 194
6385 194 -66 39 100 -89 137 193 15 -41 76 -226 0 -89 205 -155 104 -140 240 66 198 -101 13
6406 13 5 121 -23 -153 -114 15 -138 -31 215 13 244 20 -46 -285 148 43 42 -237 2 -10 20 -213 -97
6429 -97 310 18 -247 -215 -4 137 -73 -165 -168 -6 175 54 -60 159 135 -6 140 -165 -16 -71 -88 1 -38
6452 -38 -96 -197 192 203 -106 -33 -35 -93 -30 -26 -122 98 82 -72 122 -58 44 26 -20 -86 115 84 42 -115 100 108
6478 108 8 -123 -93 -119 -105 -145 -68 100 108 -199 116 274 -192 -164 -20 207 -82 197 58 -89 145 -60 -91
6501 -91 148 -24 -195 43 202 -160 -28 93 117 137 64 -114 256 -80 -55 -3 195 -27 146 -365 -217 210
6523 210 8 -136 179 -49 123 3 -332 159 407 119 84 87 121 -95 249 76 28 343 -104 -107 107 -89
6545 -89 21 88 -37 -68 -72 167 -274 203 -141 156 141 140 -93 124 269 169 97 58 -119 72 -269 378 -13
6568 -13 -240 -49 413 22 -62 -167 166 -244 211 60 151 28 -112 261 5 -72 -141 197 109 -248 -14 -15 -91
6591 -91 102 7 114 -58 211 145 109 83 -76 -58 -225 49 47 52 -141 -11 -91 12 81 -46 -279 -52 -240 -115
6615 -115 278 -176 150 28 -125 -190 91 -15 -76 -38 11 18 -271 -57 243 -23 281 -108 124 -207 16 -190
6637 -190 37 156 -14 23 53 104 -216 -234 -393 87 76 -228 38 -180 -91 65 18 -135 12 -78 -109 92 -123
6660 -123 -47 -253 -35 -99 -227 30 68 -113 -95 -13 64 188 78 92 154 -110 133 -10 -127 -65 38 -152 -204
6683 -204 42 184 -145 187 121 -179 -192 260 -42 -13 62 -79 130 40 -34 165 -62 52 90 197 206 -70 233
6706 233 -237 -47 -12 -171 46 33 41 51 233 -1 -24 156 -156 -285 55 17 111 153 -63 -163 -49 124 -344
6729 -344 -158 -220 31 1 -33 -59 164 63 60 -134 -70 11 -13 -189 -115 40 162 180 -102 -104 -105 91 -111 -138 37
6754 37 155 98 -20 20 -69 69 -100 -379 66 -132 146 160 103 -46 -58 63 183 -158 -9 -168 113 -86
6776 -86 10 33 -99 280 83 -98 -193 123 68 -127 -104 -193 80 73 -27 -96 -104 160 11 8 42 135 -32 192 -133
6801 -133 105 -202 62 -144 -26 -6 169 -58 -269 68 154 -218 141 -310 -435 2 32 -68 -26 178 -74
6822 -74 -348 -46 -165 -73 -64 49 34 -160 -166 -77 -180 -172 132 -63 192 -195 -23 9 57 88 8 -84 -181 30 -11 116
6848 116 -55 -85 -224 217 33 156 158 12 -63 50 -196 64 171 -180 39 -36 135 53 -22 83 75 -90 72
6871 72 -47 -103 204 135 -101 92 192 -134 -79 141 -105 10 8 -112 107 35 246 220 -398 118 -16 68 186
6894 186 16 23 -5 -58 61 -135 -97 31 -288 -64 -57 78 62 291 195 62 -71 87 132 94 -143 62 42 -57
6918 -57 28 -47 -210 -174 -76 88 53 -114 -35 208 1 -183 -221 -67 -119 129 240 -86 -19 143 14 210 141 -308
6942 -308 -2 269 -91 -108 -45 63 68 41 194 320 209 79 10 -214 -128 63 -253 -135 -238 -330 -118 198 49
6965 49 132 98 117 -433 -59 -6 114 41 -26 -73 -36 -75 303 -94 251 -121 216 -101 -82 35 -219 10 -44 -15
6989 -15 29 122 -87 38 101 -131 -26 -374 -181 -61 -229 39 -39 -80 66 -36 -227 -175 -87 61 -243 -13 -91
7012 -91 -194 -155 29 -52 272 -200 -61 2 7 -31 81 42 120 -84 35 -3 -15 -184 -144 -72 -258 235 -84 114
7036 114 -2 -31 -197 -201 160 107 179 13 28 202 180 -90 -100 200 161 -87 -64 -149 103 -64 6 234 -78 -124
7060 -124 162 -86 150 141 53 117 47 19 -162 -79 -194 -58 100 -4 144 185 125 -155 338 43 21 -66 66 131
7084 131 -73 -47 136 -41 -10 52 -193 -58 -50 204 270 25 -119 -297 -62 -386 123 75 172 13 -125 244 92
7107 92 -20 -47 -23 -153 -26 -156 165 -34 85 125 -161 -83 170 59 -52 47 -113 -65 37 -77 78 -181
7129 -181 148 51 8 -83 131 -48 -191 16 -139 104 -205 106 43 47 -139 -226 -110 -44 22 41 -178 -51 -195
7152 -195 -81 -46 230 60 -183 46 -155 -94 -84 -267 -138 89 -154 96 -27 -30 -202 -233 -5 237 70 -107
7174 -107 74 -222 85 50 -65 -281 -79 -186 -122 45 -146 -169 117 -73 99 187 -24 -162 -95 62 -38 -159
7196 -159 -29 123 -53 94 -35 144 98 -237 210 -40 76 -158 58 -125 -85 134 -195 -55 -88 -182 -79
7217 -79 -210 95 -23 -54 140 -32 29 169 9 103 -187 64 -222 43 -137 -107 -26 -1 -58 -61 63 132 -130 -161
7241 -161 -1 -284 145 244 -169 51 -226 -131 -68 -221 -55 80 -12 -120 119 -14 11 101 181 -150 -52 -84 -27
7264 -27 -140 59 93 89 -321 -115 160 -172 -113 -307 249 -78 64 161 179 2 124 -43 153 -55 36 45 16 -119
7288 -119 143 26 154 103 176 -217 -22 -53 201 -202 39 252 -131 -27 -65 -406 14 138 -258 24 -5 -51
7310 -51 -44 -73 31 -248 -125 -60 -94 76 90 145 -262 -8 132 -55 118 -249 110 -121 52 261 -101 -104 -106 -264
7334 -264 -3 123 -15 86 -117 148 268 166 -216 -270 145 111 -70 25 -128 -151 37 130 133 26 -122 -134 -341
7357 -341 -81 77 -305 -59 -218 -104 -377 -81 -82 -215 166 -33 243 236 -8 101 -187 -164 -96 97 -343 -36
7379 -36 -132 312 79 1 -42 53 167 -4 -1 -36 -4 -312 -41 -68 80 -1 20 59 -16 -31 24 238 17 158 143 123
7405 123 172 -228 135 -17 51 -125 -161 -136 175 -76 -119 65 -48 -121 37 138 42 12 -251 -18 -276 76 137
7428 137 175 -49 -24 63 17 -9 -106 34 149 -57 113 15 -149 -56 -4 -2 -124 113 -345 -136 61 151 189 27
7452 27 149 -59 -4 16 28 432 31 174 -53 -121 51 49 84 -48 213 94 -130 -16 228 63 -55 23 -356
7475 -356 -45 -116 -36 -38 216 70 28 -82 153 17 -42 105 -118 198 -160 100 28 -195 314 161 -150 15
7497 15 73 15 82 -62 -117 108 -354 4 243 194 43 204 238 -286 -83 -68 -1 -82 -81 -213 -111 -47 -34 -7 62
7522 62 223 264 -266 -312 169 -209 -39 -148 58 74 -90 114 87 -135 119 298 24 -47 85 201 -24 68
7544 68 -18 14 103 -64 -154 -33 -76 -30 125 215 81 15 -231 129 26 89 39 -256 182 29 -176 -88 116 -21
7568 -21 35 -74 64 39 -198 -228 -191 -43 24 -30 100 116 -243 -19 -144 171 -50 201 69 240 -47 -265 78
7591 78 47 -133 -96 -266 -24 -22 -106 -36 93 -237 150 -170 361 693 -656 26 -70 189 85 -89 92 -176
7613 -176 79 51 108 -65 -160 -111 -288 85 58 2 122 4 139 -12 -18 -113 115 177 105 -55 129 -30 137 -161
7637 -161 -169 -203 -35 -128 318 379 110 -104 -188 43 629 -597 360 672 340 -467 -395 -297 -235 -42 -191 168 156
7660 156 79 158 -13 -221 97 -481 -90 -151 12 131 -21 -99 52 -64 49 126 153 18 -25 -65 -1 25 -144
7683 -144 -171 -189 -69 -136 18 -1 -104 246 195 89 62 231 115 0 73 -118 43 93 -270 153 -71 270 -92
7706 -92 -336 185 -8 -47 22 3 100 -104 58 -264 -65 146 -135 184 -210 -57 62 -94 -7 -171 -114 167
7728 167 -246 44 -227 228 131 73 -158 -200 -53 -291 96 171 -72 -20 -25 79 -256 -94 89 24 -215 -209 -49
7751 -49 -44 -293 -43 157 104 8 -43 65 -179 -195 -13 74 214 163 289 181 -323 117 217 -15 90 195 -3
7774 -3 -75 -81 123 92 -148 -160 -107 9 -119 -112 60 49 -33 73 -172 59 92 -123 -125 28 -185 -61 -102 -302 -154
7799 -154 -100 -37 188 175 -82 34 -128 -177 -18 5 364 170 -62 3 -305 20 37 13 189 50 -25 -92 56
7822 56 -9 -387 -55 64 -7 -166 340 -237 -65 -62 137 -110 -112 116 -82 139 -89 445 -135 101 175 95 306
7845 306 -71 -218 259 9 -5 110 -54 -313 113 -113 192 48 293 162 163 13 -45 376 189 38 -140
7866 -140 52 -19 -164 78 -106 96 224 -176 -111 74 71 137 71 -151 260 -199 -212 159 -256 292 -240 59
7888 59 125 -70 -105 -179 -131 -339 -209 186 139 -108 -121 -178 96 253 -228 -43 144 37 418 64 -407 -58 -3
7911 -3 -54 33 12 307 -12 -161 -65 115 88 -103 -62 -146 151 -79 65 78 -110 -285 -146 -95 -110 5 37 -177
7935 -177 -170 95 -36 46 -131 -59 63 80 154 -13 281 -123 -182 113 19 -129 165 -43 140 326 -42 204 160
7958 160 196 189 -237 327 152 -254 61 -256 -77 -36 -117 74 -75 124 -336 -10 -136 -5 -71 8 -66 273 -114
7981 -114 110 -127 -36 -111 -151 135 4 87 -35 32 85 143 -260 -68 -185 -41 -58 10 -30 -208 -99 -86 3 298
8005 298 -103 -68 -152 -144 -97 -35 -2 -31 118 -132 47 -36 167 -30 118 47 -90 194 -315 -35 -126 31 217 0
8029 0 118 -45 -209 114 -266 -124 -191 136 -38 -363 -168 -73 -127 -117 108 -352 -99 -182 243 -143 7 35 55
8052 55 -80 -80 -82 -118 -69 192 -59 -49 -3 111 -222 -213 118 -110 -26 -28 76 357 33 -4 249 47 112 46 318 -159
8078 -159 -163 47 -153 67 93 122 18 59 214 -136 -321 20 94 -62 7 -328 90 -8 182 13 146 -290 -246
8101 -246 100 317 120 186 136 64 19 -64 -16 -90 231 -68 162 60 48 60 50 -20 128 -146 -47 130 -97 158
8125 158 -184 219 -17 205 77 -178 -38 219 -30 81 62 -104 -66 -283 -102 239 205 -3 -19 103 104 -16
8147 -16 -113 -37 -82 122 -2 10 85 -242 71 88 -96 -159 99 44 -141 -166 -172 -90 -222 -84 94 131 -320 -44 4
8172 4 -302 -2 -47 57 -99 29 28 -150 2 6 96 168 -37 -2 -55 -110 -103 40 112
8191A12
##END NTUPLES=NMR FID
##END=
