##TITLE=1H_Pr 58-C2
 CDCl3,8 sc, 
 29.9.2021
##JCAMPDX= 6.0         $$ Bruker NMR JCAMP-DX V2.0
##DATA TYPE= NMR FID
##DATA CLASS= NTUPLES
##ORIGIN= UXNMR, Bruker Analytische Messtechnik GmbH
##OWNER= root
$$ XWIN-NMR		Version 3.5
$$ Wed Sep 29 13:36:01 2021 Russian Standard Time (UT+4h)  she@DPX200
##.OBSERVE FREQUENCY= 200.1313468511
##.OBSERVE NUCLEUS= ^1H
##.DELAY= (6, 6)
##.ACQUISITION MODE= SIMULTANEOUS
##.ACQUISITION SCHEME= undefined
##.AVERAGES= 8
##.DIGITISER RES= 18
##SPECTROMETER/DATA SYSTEM= spect
##.PULSE SEQUENCE= zg30
##.SOLVENT NAME= CDCl3
##.SHIFT REFERENCE= (INTERNAL, CDCl3, 0, 15.7039)
##AUDIT TRAIL= $$ (NUMBER, WHEN, WHO, WHERE, WHAT)
$$ ##TITLE= Audit trail, XWIN-NMR		Version 3.5
$$ ##JCAMPDX= 5.01
$$ ##ORIGIN= Bruker BioSpin GmbH
$$ ##OWNER= she
$$ F:/spectra/data/she/nmr/H-F/1/audita.txt
$$ ##AUDIT TRAIL=  $$ (NUMBER, WHEN, WHO, WHERE, WHAT)
(   1,<2021-09-29 13:34:23.67 +0400>,<she>,<DPX200>,
      <created by zg, POWCHK disabled, PULCHK disabled
       configuration hash MD5:
       00 E9 B6 7A A2 85 ED C7 34 08 36 98 17 FE 4E 26
       data hash MD5: 16K
       88 C5 B4 42 E5 0F 50 1C 89 A7 C2 B8 A7 E4 4E E5>)
$$ ##END=
$$ 
$$ hash MD5
$$ 34 5E FA A6 07 E8 11 0E E9 60 42 CF 53 D8 D0 2B
##$RELAX= 
##$RELAX= 
##$RELAX= 
##$RELAX= 
##$RELAX= 
##$RELAX= 
$$ Bruker specific parameters
$$ --------------------------
##$DU= <F:/spectra>
##$EXPNO= 1
##$NAME= <H-F>
##$PROCNO= 1
##$TYPE= <nmr>
##$USER= <she>
##$AMP= (0..31)
100 100 100 100 100 100 100 100 100 100 100 100 100 100 100 100 100 100 
100 100 100 100 100 100 100 100 100 100 100 100 100 100 
##$AQSEQ= 0
##$AQ_mod= 1
##$AUNM= <au_zg>
##$AUTOPOS= <>
##$BF1= 200.13
##$BF2= 200.13
##$BF3= 200.13
##$BF4= 200.13
##$BF5= 200.13
##$BF6= 200.13
##$BF7= 200.13
##$BF8= 200.13
##$BYTORDA= 1
##$CFDGTYP= 0
##$CFRGTYP= 5
##$CHEMSTR= <none>
##$CNST= (0..31)
1 1 145 1 1 1 1 1 1 1 1 1 1 1 1 1 1 1 1 1 1 1 1 1 1 1 1 1 1 1 1 1 
##$CPDPRG= <>
##$CPDPRG1= <>
##$CPDPRG2= <>
##$CPDPRG3= <>
##$CPDPRG4= <mlev>
##$CPDPRG5= <mlev>
##$CPDPRG6= <mlev>
##$CPDPRG7= <mlev>
##$CPDPRG8= <mlev>
##$CPDPRGB= <>
##$CPDPRGT= <>
##$D= (0..31)
0 1.2 0 0 0 0 0 0 0 0.06 0 0.03 0 0 0 0 0.0002 0 0 0 0 0 0 0 0 0 0 0 0 
0 0 0 
##$DATE= 1632908063
##$DBL= (0..7)
120 120 120 120 120 120 120 120 
##$DBP= (0..7)
150 150 150 150 150 150 150 150 
##$DBP07= 0
##$DBPNAM0= <>
##$DBPNAM1= <>
##$DBPNAM2= <>
##$DBPNAM3= <>
##$DBPNAM4= <>
##$DBPNAM5= <>
##$DBPNAM6= <>
##$DBPNAM7= <>
##$DBPOAL= (0..7)
0.5 0.5 0.5 0.5 0.5 0.5 0.5 0.5 
##$DBPOFFS= (0..7)
0 0 0 0 0 0 0 0 
##$DE= 6
##$DECBNUC= <off>
##$DECIM= 32
##$DECNUC= <off>
##$DECSTAT= 4
##$DIGMOD= 1
##$DIGTYP= 9
##$DL= (0..7)
0 120 120 120 120 120 120 120 
##$DP= (0..7)
150 150 150 150 150 150 150 150 
##$DP07= 0
##$DPNAME0= <>
##$DPNAME1= <>
##$DPNAME2= <>
##$DPNAME3= <>
##$DPNAME4= <>
##$DPNAME5= <>
##$DPNAME6= <>
##$DPNAME7= <>
##$DPOAL= (0..7)
0.5 0.5 0.5 0.5 0.5 0.5 0.5 0.5 
##$DPOFFS= (0..7)
0 0 0 0 0 0 0 0 
##$DQDMODE= 0
##$DR= 18
##$DS= 0
##$DSLIST= <SSSSSSSSSSSSSSS>
$$ [...]
##$SUBNAM2= <"">
##$SUBNAM3= <"">
##$SUBNAM4= <"">
##$SUBNAM5= <"">
##$SUBNAM6= <"">
##$SUBNAM7= <"">
##$SUBNAM8= <"">
##$SUBNAM9= <"">
##$SW= 18.0517286264689
##$SWIBOX= (0..15)
0 0 2 0 0 0 0 0 0 0 0 0 0 0 0 0 
##$SW_h= 3612.71676300578
##$TD= 16384
##$TD0= 1
##$TE= 0
##$TE2= 300
##$TE3= 300
##$TEG= 300
##$TL= (0..7)
0 120 120 120 120 120 120 120 
##$TP= (0..7)
150 150 150 150 150 150 150 150 
##$TP07= 0
##$TPNAME0= <>
##$TPNAME1= <>
##$TPNAME2= <>
##$TPNAME3= <>
##$TPNAME4= <>
##$TPNAME5= <>
##$TPNAME6= <>
##$TPNAME7= <>
##$TPOAL= (0..7)
0.5 0.5 0.5 0.5 0.5 0.5 0.5 0.5 
##$TPOFFS= (0..7)
0 0 0 0 0 0 0 0 
##$TUNHIN= 0
##$TUNHOUT= 0
##$TUNXOUT= 0
##$USERA1= <user>
##$USERA2= <user>
##$USERA3= <user>
##$USERA4= <user>
##$USERA5= <user>
##$V9= 5
##$VALIST= <valist>
##$VCLIST= <CCCCCCCCCCCCCCC>
##$VD= 0
##$VDLIST= <DDDDDDDDDDDDDDD>
##$VPLIST= <PPPPPPPPPPPPPPP>
##$VTLIST= <TTTTTTTTTTTTTTT>
##$WBST= 1024
##$WBSW= 4
##$XGAIN= (0..3)
0 0 0 0 
##$XL= 0
##$YL= 0
##$YMAX_a= 160810
##$YMIN_a= -205156
##$ZGOPTNS= <>
##$ZL1= 120
##$ZL2= 120
##$ZL3= 120
##$ZL4= 120
##$ABSF1= 10
##$ABSF2= 0
##$ABSG= 5
##$ABSL= 3
##$ALPHA= 0
##$AQORDER= 0
##$ASSFAC= 0
##$ASSFACI= 0
##$ASSFACX= 0
##$ASSWID= 0
##$AUNMP= <proc_1d>
##$AZFE= 0.1
##$AZFW= 0.1
##$BCFW= 1
##$BC_mod= 2
##$BYTORDP= 1
##$COROFFS= 0
##$CY= 11.3945322036743
##$DATMOD= 1
##$DC= 2
##$DFILT= <>
##$DTYPP= 0
##$F1P= 2.36226072786647
##$F2P= -0.459571619588291
##$FCOR= 0.5
##$FTSIZE= 0
##$FT_mod= 4
##$GAMMA= 1
##$GB= 0.15
##$INTBC= 1
##$INTSCL= 1
##$ISEN= 128
##$LB= 0.24
##$LEV0= 0
##$LPBIN= 0
##$MAXI= 10000
##$MC2= 0
##$MEAN= 0
##$ME_mod= 0
##$MI= 1.114404
##$NCOEF= 0
##$NC_proc= 0
##$NLEV= 6
##$NOISF1= 3.799351
##$NOISF2= 2.8
##$NSP= 1
##$NTH_PI= 0
##$NZP= 0
##$OFFSET= 15.70392
##$PC= 1
##$PHC0= -13718.78
##$PHC1= 17.00085
##$PH_mod= 1
##$PKNL= yes
##$PPARMOD= 0
##$PSCAL= 0
##$PSIGN= 0
##$REVERSE= no
##$SF= 200.130013532006
##$SI= 16384
##$SIGF1= 3
##$SIGF2= 2
##$SINO= 400
##$SIOLD= 16384
##$SREGLST= <1H.CDCl3>
##$SSB= 0
##$STSI= 0
##$STSR= 0
##$SW_p= 3612.71676300578
##$SYMM= 0
##$S_DEV= 0
##$TDeff= 0
##$TDoff= 0
##$TI= <>
##$TILT= no
##$TM1= 0
##$TM2= 0
##$TOPLEV= 0
##$USERP1= <user>
##$USERP2= <user>
##$USERP3= <user>
##$USERP4= <user>
##$USERP5= <user>
##$WDW= 1
##$XDIM= 8192
##$YMAX_p= 0
##$YMIN_p= 0
$$ End of Bruker specific parameters
$$ ---------------------------------
##NTUPLES= NMR FID
##VAR_NAME=  TIME,          FID/REAL,        FID/IMAG
##SYMBOL=    X,             R,               I
##VAR_TYPE=  INDEPENDENT,   DEPENDENT,       DEPENDENT
##VAR_FORM=  AFFN,          ASDF,            ASDF
##VAR_DIM=   8192,          8192,            8192
##UNITS=     SECONDS,       ARBITRARY UNITS, ARBITRARY UNITS
##FACTOR=    0.0002768,     1,               1
##FIRST=     0,             0,               0
##LAST=      2.2672688,     0,               0
##MIN=       0,             -205156,         0
##MAX=       2.2672688,     160810,          0
$$ Real data points
##PAGE= N=1
##DATA TABLE= (X++(R..R)), XYDATA
$$ [...]
1885c51K94l6J46m0j83J94m51J74K97l04L34K71j02J49Mm14M21q1MN9l88J90P7
1908B64l17O1j07j99J9j24L50m41l5L25k43J25P3L66j80K06R3j16M98l46L39k47
1930C64L6k27J31j01R2l28K37l31r2K13m42MQ9q1J25j98O8K18O6M27l26K21J53
1953C18L31l67K27J68k07p6mk07j36k9M7o8m57K98o0jr0J7J24J5j14L22j51K6
1977g4K96j87P6J29J0q2k6k9K76m13N8J06Jk26J30K8l64M7J05K56l61J91N7m4
2001d0L75m9k39J81j13KP1J33j9m51OQ5k8J18j71k79M03j14j97K61j37J77K23
2024A98j87K15Ml4J79j90j41K80k26o3J9k67K53r1l9K14l36R9l15L8K68j75j19
2047d16K19J53j77L00o5J22L29n28N10m79M61jk58J41j42j15J1k24N2N2m04J76
$$ plain form
1885 -351 -57 -93 53 13 -170 24 -427 -253 44 -260 74 345 243 392 396 -18 403 322 326 385 -3 187 264
1908 264 -53 8 -99 -298 -279 -403 -53 -494 -529 -204 -447 -322 -249 117 -63 143 236 120 618 272 611 364
1930 364 400 173 304 203 295 -33 204 -127 -219 -6 -448 -444 -355 -436 -311 -509 -441 -223 -157 270 -56 165 318
1953 318 649 282 509 677 470 394 390 183 47 18 65 -3 -460 -162 -222 -223 -313 -296 -172 -157 -271 51 -100 -74
1977 -74 222 35 111 240 250 168 142 113 389 -24 34 140 141 -85 45 73 -291 -244 -139 117 -244 -53 4 -40
2001 -40 335 286 47 228 115 117 188 321 302 -149 -143 -58 -86 32 -139 -418 -15 -129 -326 -65 -202 -25 198
2024 198 11 226 230 196 375 185 44 324 98 35 54 -213 40 -51 -90 124 -212 -113 -428 -390 -122 -297 -416
2047 -416 -197 -44 -221 79 14 136 465 -63 447 -32 429 428 170 311 169 54 65 -159 -107 -55 -459 -283
2069b83k41nK74j51R0k3L96j48k42N04M7k43N66j80Q6j30R5k58J09J22m25J52
2091A12j7O1l22L4q5K9j61J61N6k04L97k98J97R2j41r0K89l9K65k51K72l19r6
2114e8L13j89k0Q3j65J8K65K0m46K22n2j80J94J53Om05M54k90j51M98l36K1R9
2137E4k34M71J0j94k10O6K8j66O9J31l18J58M12k49j04K08k6j03L01k05M0l13
2159a74M64M6l49j57L14k27j39K50ol17J96K46m38QJ85M7J2K04o7J05n6J80m4
2182B83l12L05R0l77K96m00R1J01j26l51K94j01j85N9J91j24R5j65K60j95k49
2203e20O97l8k18L73l19k5M86k84L6J51j99j1K97k55Q6l18J69j44J22k11m6J59
2225a2j25Rj76L84k64m9K11O3p9n4J27J91l31L54j35n9J68rl25K08Rj29J90l43
$$ plain form
2069 -283 -524 -529 -255 -406 -316 -339 57 -91 -333 171 218 -25 541 361 447 317 412 154 263 385 -40 112
2091 112 95 156 -166 -132 -217 -188 -349 -188 -132 -336 61 -237 -40 52 -89 -179 110 71 336 85 357 38 -58
2114 -58 255 66 46 129 -36 -18 247 267 -179 43 -9 -189 5 158 164 -241 213 -77 -228 270 -66 -45 54
2137 54 -180 291 301 107 -103 -37 -9 -175 -106 25 -293 -135 277 28 -76 132 106 3 304 99 139 -174
2159 -174 290 336 -13 -170 144 -83 -222 28 22 -295 -99 147 -291 -283 -98 -51 -39 165 98 203 147 327 283
2182 283 -29 276 366 -11 285 -115 -24 77 -49 -400 -106 -207 -392 -333 -142 -266 -171 -336 -76 -271 -520
2203 -520 177 139 -79 294 -25 -50 436 152 188 339 140 129 426 171 257 -61 108 -36 86 -125 -171 -12
2225 -12 -137 -128 -304 80 -184 -233 -22 41 -38 -92 35 226 -105 249 114 55 223 214 -111 97 106 -23 167 -176
2249a76K18k4j75L42k39j08L08p4k15rj09L14l9j79M93l59M4O7j34j1N9j23L08
2272A79k05o9K6n1J80r6L91j77O4j54O6l59J14N2L30j65k25J66k72j98K84j44
2294b63j08L40nj18K50j81R6q2N3K19j10j91N2K43J86k03k65K05N5q4L0oK7j31
2318Ip3j34m3J2l8J72k87M90k20j15J60j11J15R5j11L08m3K08k5k54J76j78J28
2341B41K10l58JL3l3m0q6l10k6K46k99L18j16j2J93k30J20Q9k51M01r4J7J60m35
2365b61M84k13L6K62Oj84q1j21R7l2M7l09K03j26J46L8Q2l24J74K39k73NK57j43
2389Io7j18P4J87j99J30R9l47N06l70M26k68j05p1J81k44J32JL8o8P3o1K0m4J52
2414F6j02j03Q1o2L0K1J69k38K7J27Qk8n4l0J00k55L80L5J43j3k99J20j43j31
$$ plain form
2249 -176 42 18 -157 185 -54 -162 146 72 -143 -152 -261 53 14 -165 328 -31 13 80 -54 -65 -6 -129 179
2272 179 -26 -95 -69 -120 60 -36 355 178 242 88 154 -205 -91 -39 291 126 -99 67 -205 -403 -119 -263
2294 -263 -371 -31 -36 -154 96 -85 11 -71 -18 201 91 -100 -48 195 381 178 -87 118 173 89 119 113 140 9
2318 9 -64 -198 -241 -229 -267 -95 -382 108 -112 -227 -67 -178 -63 32 -79 229 186 394 369 115 291 113 241
2341 241 451 93 94 127 94 54 -32 -342 -368 -122 -421 -103 -219 -231 -38 -268 -148 -59 -310 91 -3 14 174 -261
2365 -261 223 10 46 308 314 130 49 -72 25 -7 40 -269 -66 -192 -46 -8 74 -250 -76 163 -110 -105 152 9
2389 9 -58 -176 -102 85 -114 16 115 -232 274 -96 330 62 -43 -114 67 -177 -45 -44 -6 -74 -1 -62 -42 -86 66
2414 66 -36 -139 -58 -120 -90 -69 100 -138 -111 16 24 -4 -58 -88 12 -243 137 172 315 302 3 123 -20 -151
2438a51J37PK71k20nN9l3j66K49k39mK59j87j55P7j47K41k6o1J13j90n0K40q3
2462f4K26kj41m1L08rJ5k65K23p8J24r0K3k22j8R9k43j5k05J78j4J42l74N06p9
2487a6K7j60P7r8P9K80M3k12L84l39L98k59r7R0k12O1j24j6j78M3r9L17j94r5
2511c00J34kk27J73J71J97k05J13P1p0J32J30j03O6j1j46K44k36o0j67J51N8m78
2534c65J72K61k09l41L89R1m60L18l2J2J59k03J05J53J68l36J01K65K01n81K29
2555I7L2m5j02j40P3J95rJ1j27k58N65m20J77r1O6k75J30k3J71N0q5J49%jJ95
2580C35m43N9k9j37K27K7n7j1O0K0K78l71K40j16Q4P2j05j06K41j63j05J78j17
2603F1k02q9J27j67J79m2J79k06K83j55j10j14K74J16Q4j50k0K03m6Lpr7M5j51
$$ plain form
2438 -151 -14 -7 264 44 39 98 65 -101 148 -91 -95 164 -23 -178 -101 -248 -7 -33 -94 19 -171 -221 19 -64
2462 -64 162 160 19 -22 286 277 292 27 250 172 296 206 229 7 -11 88 -155 -170 -375 -197 -211 -69 -443 63 -16
2487 -16 11 -149 -72 -170 -91 189 232 20 404 65 463 204 107 197 -15 46 -78 -94 -272 -229 -328 -11 -205 -300
2511 -300 -166 -168 -395 -222 -51 146 -59 54 125 55 187 317 214 280 269 123 367 131 71 -96 55 113 -365
2534 -365 -193 68 -141 -482 -93 -2 -462 -144 -176 -164 -5 -208 -103 50 218 -118 -17 248 449 -132 97
2555 97 129 84 -18 -158 -85 110 101 112 -15 -273 292 -128 49 -42 24 -251 -121 -144 27 77 -8 141 141 140 335
2580 335 -108 -49 -78 -215 12 39 -18 -29 31 51 329 -42 198 82 166 238 133 27 268 105 0 178 61
2603 61 -141 -230 -103 -270 -91 -133 46 -160 123 -32 -142 -256 18 134 218 68 48 251 205 208 201 104 149 -2
2627bQ1rq3J74l16J04l1L6l5j35J16q7J91k12K17q1j67J31j74N08j21J15j16R3
2651A97J07p7q1O2r8o7jJ42j29l9K05j67k30J53j42j75K68j90o2M18k32N1q3M4
2675a26oM67l55J54K0q0J11l5p6O1k7L9l41J48j06n1O4o8J22M8k15J51K35j32
2699Bk59K29j89K8K62RJ48k77r8M19k72K02Oq1J8k14rK38l66L31k64pP9M6o1J11
2725C1M5j88J45K09l72j3J99r5jk11J53P9M8r1J39k5KK0P2k66K45J24j40J02l48
2750a37R6K20j73m16J98J51J63j79J31l4j88J10j20R8j86Q4J71l27j3K56J05k12
2772b02J81N0n9m8N78m80N6j93J27M14l76p4J55j1k04K1R7j62O7j80J77j18K16
2795C2q3M7p5l9K7n0Q8J43k27K52R4k1l20L63l5J99j96m27M56Kl47J93r1j00L26
$$ plain form
2627 -2 79 70 -13 161 -155 -51 -82 -46 -81 -216 -100 -187 4 -208 9 -72 -239 -108 -282 226 105 220 104 197
2651 197 304 227 146 208 110 43 42 184 55 16 221 54 -176 -23 -165 -340 -72 -262 -324 94 -138 -87 -170 -126
2675 -126 -132 335 -20 134 154 74 185 150 74 135 108 147 -194 -46 -152 -203 -139 -207 -85 -37 -252 -101 134 2
2699 2 -257 -28 -217 -189 73 82 230 -47 -145 274 2 204 210 129 147 -67 -76 162 -204 127 -137 -144 -65 -19 -80 31
2725 31 76 -112 33 242 -130 -143 56 -39 -40 -251 -98 -19 29 -62 77 52 54 74 146 -120 125 249 109 211 -137
2750 -137 -41 179 6 -410 -212 -61 102 -77 54 20 -168 -58 -178 -80 -266 -182 -11 -338 -351 -95 10 -202
2772 -202 -21 29 -30 -78 500 20 76 -117 10 424 48 -26 129 118 -86 -65 32 -130 -63 -243 -66 -184 32
2795 32 -51 -4 -79 -118 -91 -141 -53 90 -137 115 209 188 -132 231 196 395 199 -228 228 230 -117 76 -15 -115 211
2820B11m00J54j34k38M74n7J2j46l4N5J18j35L84o5k85K30k38J71l9N7j31m7q7
2843a70K47j6M2LJ16p8l15L63j74J45j97p9n6J18M3j83J05j18K56K55m68kR6J11
2867D4n7k8J17q4J06k57N02l4l27L44k80j07R0m3o1n4Qn4O6J63k53L8K80n45L63
2892f3j50n5N1M42m75K90j1J29J17k46jM9j41N2J96j64L0R0k4j57J78k48L92k41
2916D0L1k1m49L95j59P9j15K65k33M48l33Q1k03J11J2J19L4k20L00j0m17M37K2
2939B14l34LM6K00j41J9r7j11NK37k10J75l0j34K10k76J94l4M5N2l5J90N4j05
2963A37j95N41m08K6O1j74k7L1M3m9O6k47K02K4j88K43l34J12l6m9L26j19J40
2986A26k60L6J24N3ln0J28J55l06J10l8J4j7j00J10l49N15j82n1kJ35k37J83j53
$$ plain form
2820 211 -189 -35 -169 -407 67 10 22 -124 -158 -103 15 -120 264 199 -86 144 -94 77 38 95 -36 -83 -170
2843 -170 77 61 103 106 222 144 -171 192 18 163 -34 -113 -169 -51 -8 -191 -86 -204 52 307 -161 -163 -67 44
2867 44 -13 -41 76 -8 98 -159 343 309 -18 326 46 -61 29 -14 -75 -129 -121 -175 -109 54 -199 -161 119 -426 -63
2892 -63 -213 -268 -217 225 -250 40 29 158 275 29 28 77 -64 -12 184 20 50 140 116 -41 137 -111 281 40
2916 40 71 50 -399 -4 -163 -84 -199 66 -167 281 -52 29 -174 -63 -51 68 102 -118 182 172 -245 192 214
2939 214 -120 -117 -71 129 -12 7 -90 -201 -196 41 -169 6 -24 -158 52 -224 -30 -64 -19 33 -2 188 242 137
2963 137 -58 483 75 101 162 -12 -39 -8 35 -14 52 -195 7 31 -157 86 -248 -136 -172 -221 105 -14 126
2986 126 -134 -98 26 79 76 26 154 309 3 113 75 89 72 -28 82 -267 248 66 15 13 148 -89 94 -59
3010e9J41l65K99K7k4l17K72O5M3Pj6J84l55L82k89K08j67o2O2OMJ10j44m7J44
3035A09J03l03L95n88M50k19Q8L3k2O6l46l6J45J93l51N23q5l97K06j52J96K02
3057B10o5k45M75k51j09J72j39N9q3L0J30j44Q9R6l13R1p8j51K71j35Ok44N6M04
3081A32j84r5J08p4R3J42K3m08L28J01M5l0l44K96k18Q7N1j80O6J28k6J41j84
3104bj87K20q3j31K82j28n3M8M11n71K05J53k11P2n4m2K31k37J89o5K40k28l9
3127B0L2O5l8m87L02N8n7J6J41j57K58n48M08j17l3m3K52J7k17K80qK46l54j16
3151h0J84j57N6J50lk5k9J06q3k53K30L7k77K32p8m6l67L13K43j41j49M9J12k14
3175a90n9J22J22j09J32J77j36M3j30J84l5k50J49K44R7k76O5r9kJ54k78J29k02
$$ plain form
3010 -59 82 -283 16 43 19 -298 -26 39 82 89 73 257 -98 284 -5 203 36 -26 36 42 46 156 12 -35 109
3035 109 212 -91 304 -284 166 -53 35 68 46 112 -234 -270 -125 68 -283 240 155 -242 -36 -188 8 210
3057 210 145 -100 375 124 15 187 48 107 24 54 184 40 129 225 -88 3 -75 -226 45 -90 -84 -328 -272 132
3081 132 -52 -147 -39 -113 -20 122 145 -263 65 166 211 181 -163 133 -85 2 53 -127 -61 67 41 182 -2
3104 -2 -189 31 -52 -183 99 -29 -82 -34 377 -194 11 164 -47 25 -29 -71 160 -77 112 47 287 59 20
3127 20 52 117 79 -408 -106 -48 -105 -89 52 -105 153 -395 13 -104 -137 -180 72 89 -128 152 144 390 36 -80
3151 -80 104 -53 3 153 150 125 96 202 119 -134 96 133 -144 88 10 -36 -403 -90 153 12 -137 -88 24 -190
3175 -190 -249 -127 -5 -114 18 195 59 102 -28 156 121 -129 20 264 361 85 150 51 49 203 -75 54 -148
3198a48R7J82j87J2R1k32J14J50Ok54J50n5j99L89N5j23R7l8n8k29L47J04k61
3221A0O7K5M3j23j05R9L3j5p3j69J70q3M3m9J00Q4n9j30J41R8N1j52m2j05k9N36
3247C66l20Pj83L5R8J13j76J27k24K86k82K71n2j20K07k44l1J70k27L8K3N8p9
3270a39O9l5L6l2K24j28QP3n4J16Kl8j71p5K25j69J05J06m47N69l24J97p1j01
3294e4o3K19r3r9n3K00j27J2j49K53k0Q0l8K7N0k97K84p8J64r4j92K93k23NK48
3319B55m08J22j35L56j31k62K33j5o1J10k3k58L75j62J81j12J02j35j51p3K51
3340E9N8nr5p6J36p8K75m7j86r4K38k65O1k2j90J54J62k66L05j48j64m8K63R2
3364A19R8l26K02j95r0K68j54J94r0j69K39M8p4nk68L56q3j1J7p2j02K9J13J58
$$ plain form
3198 -148 -51 131 -56 -44 47 -185 -71 79 85 -169 -19 -74 -273 116 171 48 145 107 49 -180 167 271 10
3221 10 77 102 145 22 -83 16 49 34 -39 -208 -38 -121 -78 -127 -27 57 -2 -132 9 107 158 6 -36 -141 -170 366
3247 366 46 53 -130 -95 3 116 -60 67 -157 129 -153 118 66 -54 153 -91 -122 48 -179 -141 -118 -60 -139
3270 -139 -70 -105 -69 -101 123 -5 3 76 22 138 140 102 -69 -144 81 -88 17 123 -324 245 -79 118 47 -54
3294 -54 -117 102 9 -90 -143 57 -70 -58 -207 46 26 106 68 95 145 -152 132 54 218 124 -68 225 2 7 255
3319 255 -153 -31 -166 190 59 -203 30 15 -46 64 41 -217 158 -4 177 65 167 32 -119 -192 59
3340 59 117 112 17 -59 77 -1 274 227 41 -53 185 -80 -19 -41 -231 -77 85 -181 124 -24 -188 -236 27 119
3364 119 217 -109 93 -102 -192 76 -78 116 26 -143 96 144 70 65 -203 153 70 59 76 4 -98 -69 44 202
3388B02j62j11j63K05q0L2J87m7r7j8J37o4l31L16J97j34j20N0N1n2N1O1K40l06
3412D4J18j55q3K7Lj60L10j43j2M86m09j66p0Q2J31r2J26q8n8j84L88k54J30l5
3436f4L42k21p7j84J82J5J05J99k22L5k23K02j30J31k8q4R2j23O5j82j52K41J36
3459E5m8j98J82K88k89J31L6j83J02Jj28K44j39j43q0K83J20l95J92j43N2n8J74
3482E6o9O1k13O3L03m75k1J70L14K2k04j40K41nj45P0j25K11K24R9l46j76J55
3505G0O0q1j08JJ40j20K68j62o7K03m30J92K35j31P7k38N0o2k2K4O6j99M39m29
3529b24L76m32K04K28j35JR3l3j16m3K98R6m08J34J09r7j81J52j05K4o2j64K80
3552ek6J06k14J79K32k96o9J00K6j11K49q2K6ok05J84L7k71J62J7L3j06K34r7
$$ plain form
3388 202 40 -71 -234 -29 -109 -77 110 63 -34 -52 85 21 -310 6 203 69 -51 -1 50 -2 49 110 350 44
3412 44 162 7 -76 -49 -46 -206 104 -39 -51 435 26 -140 -210 -128 3 -89 37 -51 -109 -293 95 -159 -29 -64
3436 -64 278 57 -20 -204 -22 -7 98 297 75 110 -113 89 -41 90 62 -22 70 -53 12 -170 -322 -81 55
3459 55 7 -191 -9 279 -10 121 157 -26 76 77 -51 193 54 -89 -169 114 234 -161 31 -112 -60 -118 56
3482 56 -13 48 -165 -102 201 -274 -295 -125 189 211 7 -133 108 103 -42 28 -97 114 338 437 91 -85 70
3505 70 130 49 -59 -58 82 -38 230 68 1 204 -226 -34 201 70 147 -91 -41 -103 -125 -101 -35 -234 205 -224
3529 -224 152 -280 -76 152 17 18 111 78 -38 -81 217 313 -95 39 148 51 -130 22 -83 -59 -121 -285 -5
3552 -5 -31 75 -139 40 272 -24 -93 7 33 -78 171 89 115 109 -96 88 125 -146 16 33 66 -40 194 97
3576I7k19K28j90L4p0N8o0K50l1j63K55k25j00J42j9k0J53j35K27p0j54R1J32
3599B11J1j02K9l87L18J13l84K91n5k14J56j00j60L45k88M16r8j08l4O8k10J59
3621b3%j20J99l6r2K24l00j61N59k19l4k1k42K58R4k0M4p8N5k69J43l6K46k49
3645g8j10L71m29J26O3j30L3L21M2k49J20J48n29N98r1k40J34j89K79j01l18L11
3667H2J27JK7l85K9J71l7n5j37K35j66m7L5P5K49l58L08j39j06J01P4k00R2J25
3691A01k64K11j93J15O0K16k00j52K72Rk04j7j24M49k20k34K35j02L4P5k61N7
3713a37N9l0l9q1J02j0K22k10L20k0l51L96j69oJ60Nq6nkj60L1N8l55M11L6j17
3739B2k8p0J1N7K25k78J97J46j20m45K58p5L56m32K76j1J15j0j11p5k31K28N2
$$ plain form
3576 97 -122 106 -84 -50 -120 -62 -122 128 97 -66 189 -36 -136 6 -13 -33 120 -15 212 142 -12 79 211
3599 211 222 120 149 -238 80 193 -191 100 45 -169 -13 -113 -273 72 -216 200 102 -6 -40 28 -182 -23
3621 -23 -23 -143 56 20 -72 152 -148 -309 250 31 -3 -24 -266 -8 86 66 110 32 87 -182 -39 -75 171 -78
3645 -78 -188 183 -246 -120 -57 -187 -154 167 209 -40 80 228 -301 297 206 -34 100 -89 190 89 -229 82
3667 82 209 210 237 -148 -119 52 15 -40 -177 58 -108 -155 -120 -45 204 -154 154 15 -91 10 84 -116 -24 101
3691 101 -163 48 -145 -30 30 246 46 -106 166 175 -29 -46 -170 279 59 -175 60 -42 -8 67 -194 -137
3713 -137 -78 -108 -147 -228 -126 -136 86 -124 196 176 -175 221 52 46 206 211 125 120 118 -42 -11 47 -308 103 139 22
3739 22 -6 -76 -65 -8 217 -61 136 282 162 -283 -25 -100 256 -176 100 89 204 194 83 8 -223 5 57
3762E7j99J16p9P0J0m8Q1j4J09p1k54O2K55m96L52K36L4k75K37q3j34L25l43J33
3786H1k57K82J29k59K14n1l39M16k44k19K62r4M8K6q8J00J02k02L18n38J96K67
3808A50m06K72K86k69k0r7P9j65N5K64q5k41L38l01J26q0L3R9k6k21K41Q9o1k01
3832a41J37r2K63k39K25nl38K70j20q7L03k66K96m3j48j52l7OJ45K7q2j60L44
3855A06k99R2r7J73NJ31l18K1J26J77j77j03P2O6J0N6p7j65J32N8k6L1J50k07
3879f3L05k91K39l1o7k7K45l53N9Q2m0r3j61K2K67j62J53j25J01k14J59j95J17
3902g3k09J40K23p5K32k58Q1j04l0k2r3OK74r4m3J97k40j04L26mj6j69J25j10
3926d0j22L06j95kJ32k25j6M72on91K16L9J03q1J34j88k8J84j08P1q5J51l52M17
$$ plain form
3762 57 -142 -26 -105 -35 -25 -73 8 -6 103 32 -222 -160 95 -401 -49 187 221 -54 183 100 -34 291 -52 81
3786 81 -176 106 235 -24 190 139 -200 216 -28 -247 15 -79 -31 -5 -93 7 109 -93 225 -313 -117 150
3808 150 -256 16 302 33 13 -84 -5 -170 -115 149 64 -177 161 -140 -14 -94 -61 38 12 -209 32 121 60 -141
3832 -141 -4 -96 167 -72 153 148 -190 80 -40 -127 176 -90 206 163 15 -137 -174 -168 -23 4 -78 -238 106
3855 106 -193 -101 -198 -25 -20 111 -207 -186 -60 117 -60 -163 -91 -25 -15 41 -36 -201 -69 -11 -37 -6 144 -63
3879 -63 242 -49 190 159 92 65 310 -43 16 98 58 -35 -196 -174 93 -69 84 -41 60 -154 5 -190 -73
3902 -73 -282 -142 81 6 238 -20 61 -43 -73 -95 -188 -182 92 -2 -45 152 -88 -192 134 130 114 -55 70 -40
3926 -40 -162 144 -51 -53 79 -146 -162 310 304 -287 -71 -32 71 -10 124 -64 -92 92 -16 55 -30 121 -231 186
3950A86k01J55l19K08O6R3j47j66j33Q5K20J55k25K7M2j9K19l95L00m51K06J07
3972A3j22R0q6K30m4K36k80L4k53L7J80O0K39k04j32n3L24m74J38J78k74kP3J12
3996B0o7K9J37l18K15j4K7k53K63q5J30K95m34m4o5K47L10m47K61k17L6K82l39
4019c1q0J44j42K56m68K03J75l4J11k66J11j40l4K17n3M8K7j22K59j59j44K15
4041I3j50j05K76j84J80j87R4k90L04R6j11l0j59J47ln3K90N5l38k02M07k47K39
4064A22n2j71R2K5o8N2o5K9J45P5m9q3o3Q3j41Q2j21J3Q3O9J1j90M0j02M17k54
4090b1j76K09l23L08O3l05K04l47M26m3K03k6k29K47j67K49l15q4J77r1P5PJ67
4113B08j11k63L3K01J12m56K35j67O6L07j64j5q2N9J9J86kj17j41P8K88j33K7
$$ plain form
3950 186 -15 140 -179 29 95 188 41 -125 -258 -173 47 202 -23 4 46 27 246 -149 151 -300 -94 13
3972 13 -109 -19 -105 125 81 317 37 71 -182 -145 35 95 334 130 -2 -55 269 -205 -67 111 -163 -165 -92 20
3996 20 -47 -18 119 -199 16 2 29 -224 39 -46 84 379 -55 -99 -164 83 393 -54 207 -10 26 308 -31
4019 -31 -111 33 -109 147 -321 -118 57 23 134 -132 -21 -161 -195 22 -31 17 44 -78 181 22 -122 93
4041 93 -57 -162 114 -70 110 -77 17 -273 31 127 16 -14 -173 -26 -29 -82 208 263 -75 -277 130 -117 122
4064 122 70 -101 -9 16 -52 0 -65 -36 109 184 135 52 -11 72 -69 13 -108 -95 -12 57 68 -122 -82 -184 233 -21
4090 -21 -197 12 -311 -3 60 -245 -41 -388 38 -5 198 172 -57 190 23 272 -43 -127 50 -41 34 41 208
4113 208 97 -166 -133 68 180 -276 -41 -208 -142 165 1 -14 -96 -37 -18 168 166 49 -92 -14 274 141 168
4136A68K2m17J28J58l1m4J03k9r6O1J28j49q1j80R7L97m47J78o3K63k23K30l58
4159a85N3J8R1N0k43K00M1j9j16L1Ln7K56q3l1j94K20J90n03J25P6J96k26j07
4183b14J04J97o2Q9j16m7k3K13Q5m36K87j87K43j45Q6o0q8J06j77P1l4J29j90
4206a69M15l42J81j86m8K01o1j12q7M07k02j41J14J20Q9l87K7J49J5j08K08k30
4228a47Q2K3k6n8M04q3J1l54K48J3Q8n5J5lk96K87k15n2j10N80m08K35j36J6R7
4253A56k88K80n5j8N3l9k14O86n41J3pk08K87N8k11J20K2J5k47M3J9J27J94m11
4277a66J37j2Q5k68R1J58J0L0Nk5j28jo9K69J96j8p7rj49J89l06P4L7k0q5J29
4303G7N3k05J81n2N4j20P1J64k64Nl9J69j5p6j2J92l55j52L97j04O9J43l8k1l24
$$ plain form
4136 168 190 -227 -99 59 28 -16 87 58 -38 23 151 2 -79 -259 -162 235 -212 -34 -97 166 -57 173 -185
4159 -185 -132 -114 -23 27 -216 -16 25 6 -110 -79 -76 -133 123 40 9 -185 35 225 -278 -153 -77 119 -107 -214
4183 -214 -110 87 25 114 -2 -49 -72 141 226 -210 77 -110 133 -12 74 14 -74 32 -145 -74 -108 21 -169
4206 -169 246 -96 85 -101 -149 52 -9 -121 -208 199 -3 -144 -30 90 179 -208 -181 -32 -17 -125 83 -147
4228 -147 -65 -42 -68 -126 278 195 206 -148 100 113 201 146 161 158 -138 149 -66 -118 -228 352 -56 179 43 59 156
4253 156 -132 148 93 75 128 89 -125 561 20 33 26 -182 105 163 -48 72 94 109 -138 -95 -76 51 245 -166
4277 -166 -29 -41 44 -224 -133 25 35 65 70 45 -83 -84 -153 116 312 294 217 208 59 248 -58 16 53 33 -52 77
4303 77 130 -75 106 54 108 -12 59 223 -41 -36 -75 94 79 3 -9 183 -172 -324 73 -31 38 181 143 122 -202
4328b02J71J14j48J29j76K7R3J23j1l12J35r6J90pM0J41j75M3k22N13k00p0N2
4351A52m56M99rj90J09P4p0j86K28J1j80K5o4K4k7L34n16M47P7j68k23K19j43
4374c3J31k82K06j66LQ6J3J54j14j44P7j02J02J76r7l5N2Q5k31q8K06k22K11K60
4398B48k26j67K55N2k00L48m53Q6J46j21n7K49k75M19j89k34R0N4Q3j09J78k57
4420h0Q5p2Q5j6j59K66j52PLJ81q3j40k32R7L41N9l65O0l1K10J2k16J63o5J1J35
4446A04m0o0k3j49J43J7jM6J03J10l21K25j64mj69K20Q3Pk96L51m60P1K64q9j57
4471a89K14J23j22p6J71j34N8j82K93M6l12K81k69k3q9K98j00L9p3R8O6k84N9
4494a07J85M9k26Oj24K12j20Q0M8J79j71j86J15J01J75k40J21R8N9j27J7j46k8
$$ plain form
4328 -202 -31 83 -65 64 -112 -85 8 131 120 -192 -57 -153 37 30 70 211 36 79 -143 370 170 100 152
4351 152 -304 195 186 -4 105 179 109 -77 151 162 -18 7 -57 -33 -60 274 -242 205 282 114 -109 110 -33
4374 -33 98 -184 22 -144 -141 -55 -42 112 -2 -146 -69 -171 -69 107 10 -25 27 112 -119 -207 -1 -223 -12 248
4398 248 22 -145 110 162 -38 310 -143 -57 89 -32 -89 160 -115 304 115 -119 -29 25 108 -1 177 -80
4420 -80 5 -67 18 2 -157 109 -43 -36 -33 148 65 -75 -307 -210 131 190 -175 -115 -146 64 76 -140 23 -42 -31 104
4446 104 64 4 -19 -168 -25 -8 -9 37 140 250 -71 154 -10 -14 -183 37 120 127 -169 182 -278 -207 57 -32 -189
4471 -189 25 148 26 -50 121 -13 45 -137 156 202 -110 171 -98 -121 -210 88 -12 27 -46 52 118 -166 -107
4494 -107 78 127 -99 -93 -217 -5 -125 -45 3 182 11 -175 -60 41 216 -24 97 195 254 127 144 -2 -30
4517c0K04k06J27R9j64j38K10J09j56K53k42k6j11J29k66K13J08j79n6j23Q9R0
4539f6M76k84j13j00L8Jj15Q9nO2K12j88rN9j56OJ21l6J39k04N0Q6j91q0K05r4
4565i7q9L90j18l8k17P1p7K23Jj04j95M92q3k06n5M3o6K79l87K95j07r0o8J87
4589a6L69k30m4l41J15K49J06K7m03N3L8m6Q4O9R1k42j07K18k42Q2O2R5J37j22
4613Bk19L21M3j21n9p4O0K36k28O0K8j33J24r5J13j37Ql02K57J37O9L9o7j78p
4638a23K66P6j12J31m64P5kMRK8K15k58J16k00J81Q2M4k83R2K11j58Q1R5m7j64
4663a05J07M2j9J28q2J4j94j87K94K8N6o3K36k45J02L1j35j32K77j23M2j12o7
4686a07J70j75J85k88K74M9j71o9N2K5J30j45J8K01j91J81o9k51L17j78q0l1Q1
$$ plain form
4517 -30 174 -32 95 194 30 -108 102 211 55 308 66 40 -71 58 -208 5 113 -66 -122 -245 -156 -66
4539 -66 410 126 13 -87 -49 -48 -163 -74 -79 -17 195 7 -2 57 -99 -93 28 -8 131 -73 -23 63 -128 -208 -3 -97
4565 -97 -186 204 86 48 -169 -98 -175 48 49 -55 -250 242 159 -47 -102 -59 -125 154 -233 62 -45 -135 -203 -16
4589 -16 353 123 79 -262 -147 102 208 235 -168 -115 -77 -123 -39 30 121 -121 -228 -10 -252 -170 -108 -13 124 2
4613 2 -217 104 147 26 -33 -107 -47 189 -39 21 49 -84 40 -55 58 -79 -71 -373 -116 21 90 129 62 -116 -123
4638 -123 143 219 107 238 -226 -151 -153 -149 -140 -112 103 -155 -39 -239 -58 24 68 -215 -123 88 -70 11 106 59 -105
4663 -105 2 44 25 153 71 85 -109 -296 -2 26 82 19 255 10 112 143 8 -124 153 30 72 -40 -107
4686 -107 63 -112 73 -215 59 108 -63 -132 -80 -55 75 -70 -52 149 -42 139 70 -181 136 -42 -122 -153 -72
4709g2J07j03l5JJ71r2K16k71J02k68P0K14m6N3j22j28LM25k50K11m13K06K3O0
4733F2l5N2j01P5k59K20q4K6j44O1o4N1K85k96L91k13J79l43J99j03J14l2j72
4756a31P4K68j83j41l5N3l3J29l25M32o8o4J70M7l08R4n3J34%Rj39P1j32K03l03
4781b31K04p4J13ok14L34q6Ok1pK91m27J6J00k34K48J24k01L55k36l7j45K88j02
4805E8k41J56Q4L1nj5j62L70m80K84q8j12kqR3j69L64k10J62l16n4J88N3P4j9
4830C6k33K64J38l90K75k67J60k5j01P6j07J99r2j00J13J75k18L28Lk01L6J4J9
4853A02k24J32R5l1j45n5M5K18k72L34j06k40K19j7n8M1J63k1l7j57pJ43k73K14
4877F3M5K15q8o4r1J28l22L12l63J98O3j07K30k42K19l73Q3J2l0j0J63l05L06
$$ plain form
4709 -72 35 -68 -103 -102 69 -23 193 -78 24 -244 -174 40 -6 47 -75 -203 -200 225 -25 186 -227 -21 2 62
4733 62 27 79 -22 53 -206 14 -70 -44 -188 -127 -191 -140 145 -151 240 27 206 -137 62 -41 73 41 -131
4756 -131 -57 211 28 -113 -148 -95 -128 1 -324 108 40 -24 146 193 -115 -21 -74 60 60 69 -70 1 -131 72 -231
4781 -231 -27 -101 12 6 -208 126 40 46 25 18 309 -118 -102 -2 -236 12 136 -65 290 54 17 -128 160 58
4805 58 -183 -27 57 88 83 68 -94 276 -204 80 -8 -120 -122 -130 -37 -206 158 -52 110 -206 -260 -72 -19 55 36
4830 36 -197 67 205 -185 90 -177 -17 -42 -143 -67 -174 25 -67 -167 -54 121 -97 231 234 33 69 83 102
4853 102 -122 10 105 74 -71 -126 -81 137 -135 199 93 -147 72 55 -3 38 201 180 143 -14 -21 122 -151 63
4877 63 108 323 235 171 80 208 -114 198 -165 33 96 -11 219 -23 196 -177 -94 -82 -112 -122 41 -264 42
4900D2O2l98L21K06l50L56l74K97m46J62N8L29l2k24J13Mk06K54l65l3K29jj75
4923a71J07R0J51j28l01J50J64j67R8l0P9k18L00r4J53k48j81K58lK85k82L25
4945C37k95k12P7L75l37l34J00J81O8O3K6k43M73k14J51m8m02K71jR9j80J1J64
4968A30j1j47J21J26K6j30j67N0J16O8l11J34k8k51M87j15k71l8K93L4k97J47
4990c4l7k1J2j34J10l7K40%q4J83k15l6K23l43K07J97n27L76lM9J12k62K43j50
5014F9j61J34k43K82o7K73n33K99o4L8N5J64J15k29j18K11n8r2k06n2M06m76N01
5037B48j32m0k42L9J37j35Q7J1J75j70l6Q3L0k37L4j61L05K05k64K30p2J54k41
5060HK04lj48p0J36k21O7r3P2J03J91l00j69K3Q4k2N80l16j35K26j53m24O79l67
$$ plain form
4900 42 104 -294 27 233 -117 239 -135 162 -284 -122 -64 265 233 9 122 126 -80 174 -191 -224 5 4 -171
4923 -171 -64 26 177 49 -252 -102 62 -105 -7 -37 42 -176 124 30 183 -65 -246 12 9 294 12 337
4945 337 42 -170 -93 282 -55 -389 -289 -108 -40 23 49 -194 279 65 216 168 -234 37 36 135 -45 -34 130
4968 130 119 -28 93 219 245 115 -52 -2 114 182 -129 5 -23 -274 213 98 -173 -211 82 116 -181 -34
4990 -34 -71 -92 -80 -214 -104 -141 99 99 15 198 -17 -53 170 -173 34 231 -296 80 77 126 238 -24 219 69
5014 69 -92 42 -201 81 14 287 -246 53 -11 27 82 246 361 132 14 225 167 75 -131 -183 223 -253 248
5037 248 116 76 -166 -127 10 -125 -38 -27 148 -22 -58 25 55 -182 -148 -309 -4 201 -63 167 95 249 8
5060 8 212 209 61 -9 127 -94 -27 -120 -48 55 246 -54 -223 -200 -116 -138 442 126 -9 217 64 -360 319 -48
5084d8p8K87k06J65J11j95j87K51j14j39J42RM6j01m1n3l09N44l52L52R9j0j45
5107B8J9o8O1l6m0q8K39n9n5K31j11k08NJ09j50Q1N5N8p6k77K30J88j29j75K13
5132D5n1J54k21j26J36J53o6j31J62m3L7p9K02j02l50L52J34k15j70R2n3L18k02
5155b4k9K13k10J17n6j46q5K47k4J59j83J12k23J57k52O1J41m0J37J18j65J98
5177B23q4M1j0k72j1K4K01j95K1j28K39p8j64J66K29o9j90k36K50K01m22L85j31
5200a0J99k35J0J80q4K17j76j62j66M23l8o7L5j92k2M3J49r8k37K19m2%JK59k79
5225g3j4l8p0q3L79n8j26J54P9k27k38K39J33K13k98ML1n9K6P3k00J87l7K09k72
5250f6Q0K04l66J65J46j48r5M5K29k47j16Q2l8J83l8L21j32j82k5k6MJ52j24j32
$$ plain form
5084 -48 -126 161 -45 120 231 36 -151 100 -14 -153 -11 -2 44 -57 -98 -151 -460 84 -268 84 183 173 28
5107 28 47 -21 40 4 -36 -124 115 56 1 232 121 -87 -82 27 -123 -42 13 71 -5 -282 -52 136 7 -168 45
5132 45 -6 148 -73 -199 -63 90 24 -107 55 12 49 -30 172 70 -280 72 206 -9 -179 -87 -140 178 -24
5155 -24 -53 160 -50 67 11 -135 -220 27 3 162 -21 91 -132 25 -227 -166 -25 -65 72 190 25 223
5177 223 139 180 170 -102 -113 -89 112 -83 -62 -190 49 -29 -193 -27 202 133 -57 -293 -43 158 -264 121 -10
5200 -10 189 -46 -36 144 60 277 101 -61 -227 196 158 91 126 -66 -88 -45 104 6 -231 -12 -54 -54 -53 206 -73
5225 -73 -87 -125 -195 -278 101 43 -83 71 150 -77 -315 -76 57 270 -28 -24 7 -52 -26 47 -153 34 -3 206 -66
5250 -66 14 218 -148 17 163 15 -80 -35 194 -53 -169 -87 -125 58 20 341 209 27 2 -24 -20 132 8 -124
5274a24PQ5k16N0L99j61m0j61L41j88J23k98P4R3J94l58N23l38J45j26j29M04
5296B99k04n9j0o0O4l16L06j78P1j79M24l32K23j94P1K90k07K6J21k04J39q8j49
5319a46PJ50p9K07k33K26j92j0o0J25L5J67p1j07K5p6J37k7J1k80M09k72K0j21
5343a55K78j09J09J37k55MO0j95j44L09k2Q7L22m22k2O7j1j28J51k33L67O7m90
5366b28J31m3J46J0n7J43L3k76L50m64qJ18J15j06Q1r0K16m5M3j02J1R1j02J42
5390A09j41J15k55J93j14O0J18J93k09j1j5j37N7j04K75j33QK0K35j57j38M0k49
5413b40K34R7j35J3M6q5j0K55j10%m8j63K24j96L5J76j78K20j37Pj66L32j60j93
5437a82K40j46J87m9o6k16K39p3K15nj58n2J8J21k03LJ49j55l8MJ08K83k76m8
$$ plain form
5274 -124 -117 -32 -248 -198 201 40 0 -161 180 -8 115 -183 -109 -16 178 -180 343 5 150 24 -105 299
5296 299 95 36 26 -34 30 -286 20 -158 -87 -266 158 -174 49 -145 -74 216 9 35 156 -48 91 3 -146
5319 -146 -139 11 -68 139 -94 132 -60 -70 -130 -5 30 197 126 19 44 -32 105 78 89 -191 218 -54 -34 -155
5343 -155 123 14 123 260 5 9 69 -126 -270 39 17 104 426 4 -18 49 38 -90 61 -172 195 262 -228
5366 -228 -97 -140 6 16 -41 102 135 -141 209 -255 -263 -145 -30 -136 -55 -145 71 26 69 -33 -22 69 -33 109
5390 109 -32 83 -172 21 -93 -33 85 278 69 58 43 -94 -37 -141 134 1 9 29 264 107 -31 9 -240
5413 -240 -6 91 -44 -31 15 -70 -80 175 65 65 17 -146 78 -118 -83 93 -85 135 -2 5 -161 171 11 -182
5437 -182 58 -88 99 50 -16 -232 7 -66 149 144 -14 -66 -48 73 -130 -127 22 -133 -171 -167 -59 224 -52 -100
5461a00J6J34o7K53k60J86Q8n4k66Q9R8k90L69j91K11k77K45o76N10K0k16P8J90
5484I0j37K81M5O3l66p6J9L79l17k45N06l65K28n8l1k75L46j41Q1K71l28L04j93
5507H1k10L07k73J76j06o3J51M0K29k99L8k88K56j4Lj72O5K17j70j2J22m27K24
5530a25K89l00J20L1j43K52j89k4j82J51J1P9N5P3r5k1J92q1k3k52R8j00K27l8
5554EP9k10R0j39l74N18j30P0N1j61J92K2n9R7N8J33j87J17m5j38p2M58k72o9
5578C4j72J77J8m1o0j48M04j46l02K29J44k15J90k69M8K58k38J36L7j93L31k49
5600b7J04j21rK78j37J8p1r7N1J9J3L5rK36l38K90l04n2K53K01l41K25l99q9K62
5625im9L0O4j96K40J66o9k15j8O2j87J53L6j21K32l40J74K4j19p1J79L90l96j15
$$ plain form
5461 -100 -84 50 -17 236 -24 162 250 196 -70 19 117 -173 196 5 216 -61 184 -492 18 38 -178 -100 90
5484 90 -47 234 279 342 -24 -100 -81 298 -19 -264 242 -123 105 47 16 -259 87 -54 27 298 -30 274 81
5507 81 -129 178 -95 81 -25 -88 63 103 332 33 71 -217 39 25 28 -144 -79 138 -32 -44 78 -349 -125
5530 -125 164 -136 -16 15 -128 124 -65 -89 -271 -120 -109 -30 25 98 3 -18 174 93 70 -182 -84 -184 43 5
5554 5 84 -126 -36 -175 -549 -31 -161 -91 -40 -201 -9 13 -46 51 109 242 55 172 127 -11 -83 375 103 34
5578 34 -138 39 57 16 -44 -192 212 66 -236 -7 137 -78 112 -157 -109 149 -89 47 84 -109 222 -27
5600 -27 77 -44 -53 225 88 106 35 -62 -11 8 21 56 47 283 -55 235 -69 -121 132 333 -8 217 -182 -271 -9
5625 -9 -58 -28 36 -160 80 246 177 -38 -56 6 -181 -28 8 -113 119 -221 -47 -23 -142 -213 -34 356 -40 -155
5649a55J03J83j74Q6Q9k39o6K54j20q7j35M60l94J77P2k38M22k19j8K01j78k6
5671bj07J09N0n5K46p4j06k62K13r9J72l47N28m91J27O8q8Q7J21k23K01k16j08
5694b56M81j77j06J87j81M1j45J55q7J23l0Rnq2k06M38l70M38k65l02L99q5O9
5717D3R8k41j40M06m24J08J1Rj20P9J20j71J85K7o4j69K10k35J35j9O0j91K33
5740e0k9j0J25L00m77R0l9NJ42K0J25l00J09J91k06j20K8J94J25l35j4J19L9P7
5764A09p9J38n2p1j63K34j00Q4J7K72n52O0J6N3K16k61L87l07p8J25j72J3R7J1
5788ck48Q0K14K16j69Ml3n4M5L6j15j64J74J51l33K81M0j84N6o0J36j91J67qo2
5813b4J35o2N7k90M21m56J12K9K51j40j04O4J07J7q7p6LK53j93K0p0J5J49K1k3
$$ plain form
5649 -155 -52 131 -43 43 132 -107 -173 81 -39 -126 -261 199 -195 -18 54 -184 238 19 1 202 24 -2
5671 -2 -109 0 50 -5 241 167 61 -201 12 -87 85 -262 266 -225 -98 -30 -118 -31 90 -133 68 -148 -256
5694 -256 225 48 -58 129 -52 -11 -156 -1 -88 35 5 14 9 -73 -279 159 -211 227 -38 -340 59 -26 43
5717 43 141 -100 -240 166 -258 -150 -139 -130 -250 -171 -51 -222 -37 -10 -74 -243 -33 -268 -133 -152 -92 -283 -50
5740 -50 -79 -89 36 336 -141 -51 -90 -85 57 77 202 -98 11 202 -4 -124 -96 98 223 -112 -126 -7 32 109
5764 109 30 168 116 45 -118 116 16 100 117 389 -163 -103 -87 -34 182 -79 308 1 -77 48 -124 -111 -14 -3
5788 -3 -251 -171 43 259 90 94 61 7 52 88 -27 -191 -17 134 -199 82 122 -62 -6 -66 70 -121 46 38 -24
5813 -24 111 49 106 -184 237 -219 -107 -78 173 33 -71 -7 100 117 30 -46 -43 210 17 37 -33 -18 131 152 129
5838A29j44K89n72M29K1j52k35K5L50l99P8K80M7Rj43J39j82J46k1l3j69J85k3
5861E4r1j14J96J78l99K47j68J25K04k35k4M1J74k06k61L52n1J11j52j2L5R8K1
5884A23J12k74Q4K02k21j27j70L70m50N69k07L5k05K61J39k70j65K06j79K12R6
5905A41j60J43l48L86j85k00p5L73k3J70j64l2M2M5M2J17k84j32K31j35j00J3
5927a35J25r7K72j19M2m7Q7j93J68j26N7P2k05L95j65q5P1k66q2L25r9m2R2j96
5951a51K98l31K91k7N3R5k87Q2J47j03J55j40j86L23j07j08RJ88m32J85r5J40
5973am6J51k83K82J6j58k1J68k31L8J36j78m8J39k28J27J21K1j14K43j55p1N2
5996d0K9J25q6k7R0p6r3N7j0J29l70M9O5k0N3K76k06O3m8j9O6n1n5M27m28L18
$$ plain form
5838 129 -15 274 -298 131 152 0 -235 -210 140 -259 -181 99 146 155 12 151 -31 115 94 61 -108 77 54
5861 54 -37 -151 45 223 -176 71 -97 28 232 -3 -27 14 188 -18 -279 73 22 133 -19 -31 4 102 123
5884 123 235 -39 45 247 26 -101 -271 99 -351 218 11 46 -159 102 241 -29 -194 12 -167 45 141
5905 141 -19 124 -224 162 -23 -223 -298 75 52 222 58 26 68 113 155 272 -12 -144 87 -48 -148 -135
5927 -135 -10 -107 165 46 88 41 128 -65 103 -23 34 106 -99 296 131 46 117 -149 -231 94 -5 -47 45 -151
5951 -151 147 -184 107 80 133 228 -59 23 170 67 222 82 -104 219 112 4 13 201 -231 -46 -141 -1
5973 -1 -47 104 -179 103 119 -39 -60 108 -123 -85 51 -127 -175 -36 -264 -137 -16 5 -109 134 -21 -92 -40
5996 -40 -11 114 28 1 91 15 -78 -21 -31 98 -272 -223 -158 -178 -125 151 -55 8 -40 -59 7 -44 -99 328 -100 218
6022B18k42L43l64J54k11J25j33K88j44J49m29J91J77k08K50j74P1R0J3j83Q2
6043F3k21M42j87M0l29O3P3j05J90j17J79L4k12L54j80k70J64m5J92j9o8j25J47
6066F3J74j61k98J55J17J54m71L34r6J62j01K4K10k54M4j73K28l42K7J40kR3k4
6089CO3j80P3j10J0J35l2L16k16o7m6P9O9j13j87L03j62l8MK46N1l36J53lQ5j64
6115f4J62k91M57j71K94n02r1L70p0q9M7jQ9p0j8O2k0j63J56M0j5j92n6K03j81
6140a14L03l12j8K61j57k39K72J29m5o8j00J62j96L18j41o1LP6j20J10j03N4m0
6163b6J2K16k64J9J46j98J67J1N8j08k28M23k39k6n9J10R2k67J21k6j10K29P3
6186A26K0k39j3Q5j04K38j20M2K66m22K29j22q6Q8j56K09r3k41L37RN8k10j66
$$ plain form
6022 218 -24 319 -45 109 -102 23 -110 178 34 183 -246 -55 122 -86 164 -10 61 151 164 -19 63
6043 63 -158 284 97 137 -192 -129 -56 -161 29 -88 91 125 -87 267 87 -183 -19 -64 128 109 41 -84 63
6066 63 237 76 -222 -67 50 204 -267 67 -29 133 32 56 266 12 56 -117 111 -231 -204 -64 -66 27 3
6089 3 66 -114 -41 -151 -141 -6 -38 278 62 -5 -51 28 97 -16 -203 100 -62 -100 -96 150 201 -135 18 15 100 -64
6115 -64 98 -193 264 93 387 -115 -206 164 94 5 52 51 140 70 52 114 94 -69 87 127 112 -80 -136 67 -114
6140 -114 189 -123 -141 120 -37 -276 -4 125 80 12 -88 74 -122 196 55 -6 -3 73 -47 63 -40 14 -26
6163 -26 -14 202 -62 -43 103 -95 72 83 141 33 -195 228 -11 -37 -96 14 106 -161 -40 -66 -176 53 126
6186 126 146 -93 -106 -21 -125 113 -7 35 301 -121 108 -14 -100 -12 -168 41 -52 -293 44 53 111 -99 -265
6209b65M68r2q9m5j46oK05p7J99j55j82J28j05J23n1M9j01N6N3J23n9JLL32m24
6234e7J6M5j81j61N39j80j33Q7j23L38j20r8j01P5J59P3k72J21J1j83M5J63j3
6257E0j63K0P8J63j44O4j53K19k35J94n2J7k17R8R4O5j0k23L36k23J02j57K94
6280B17j64j74O7J31l8p0J1M20l41J1j51j22K44o1n5M4J00j24o9L1n6K08J23k58
6304g6K2N7j45l6N1J45j75L31l85M13l47j22J69J28o5m4Q4O5n4L2l5p3j35J36
6328e9J02k63K41M5K64k48p7k4j27J13J80m07K80j26Q2K31k58J01Q0k0j74j33
6350a97K97q0kQ4j7Pl4J67m07p8J81R4jJ54M0l14J36J13l80K51j9m0L23l07j88
6375b17K46j68J00p7K73j75q1L46k20J55l18K20LK8pj92O1j99K89K5%m9N5j79
$$ plain form
6209 -265 203 111 22 -23 -169 -175 30 -47 152 -3 -185 -57 -162 -39 -90 -41 -142 -86 -33 90 31 32 35 367 -57
6234 -57 -41 4 -177 -338 201 21 -112 -25 -148 190 70 -28 -129 -54 105 178 -94 27 38 -145 -100 63 50
6257 50 -113 -93 -15 148 4 68 -85 134 -101 93 41 58 -159 -61 33 98 88 -135 201 -22 80 -77 217
6280 217 53 -121 -54 77 39 -31 -20 400 59 70 -81 -203 41 -20 -75 -31 69 -55 -124 -93 -149 59 182 -76
6304 -76 -54 3 -142 -178 -127 18 -157 174 -211 202 -145 -267 -98 30 -35 -79 5 70 16 48 13 -60 -195 -59
6328 -59 43 -220 21 66 330 82 5 -19 -146 -33 147 -260 20 -106 -24 207 -51 50 130 110 -64 -197
6350 -197 100 20 18 102 85 92 58 225 -182 -260 -79 15 14 168 208 -106 30 143 -237 14 -5 -45 278 -29 -217
6375 -217 29 -139 -39 -116 157 -18 -99 247 27 182 -136 84 87 115 108 -84 -23 -222 67 92 92 43 98 -81
6399h1J27r9M6J9j06J6l2J06J19o2K33m13J00J30k46L38k22mM0o2J79j81O1J36
6423A42k4M9q1j15m7j34K03k17K80O8j65J5l9K30O9m8oj36m9j88J01N1L93m13
6447f1J00N4k10l4O4K37l36K64Ok24Q9j35K74J1M2j10L2j07o0L29k57K4O4l34
6471b78L12j76K71q7pm9J7m3J0jK6J73k93K68p0l3J16O0j77M5m3K47n02L68k01
6496d7o3O0J22j14Q4J32N1p9j06J90j52j05j70L02kj03O2J08j55k23k2K48j02
6519h4J1J33p1m3J06q7J46j72qK48j39L1j77l7M6M15l92k24K58K67k07q1K8J00
6543F7k41K66j17J32Q2j88j72K48j89J3J62p1P5M2j75o5J48m8j60L15o6J21j89
6566a0k3k92M49k06k5J1k6K88N4j16j20lq9K6R7j03J53n5J48n2j5J8l19J91J90
$$ plain form
6399 -81 46 -53 -7 12 -94 -78 -110 -4 115 53 286 -127 -27 103 -143 195 -27 -31 9 -53 126 -55 6 142
6423 142 118 167 86 -29 -76 -210 -7 -224 56 124 -41 -26 -65 165 234 186 180 44 -5 -193 -92 -41 352 -61
6447 -61 39 93 -117 -151 -87 150 -186 78 84 -140 -51 -186 88 99 141 31 63 -44 -104 225 -32 -8 56 -278
6471 -278 34 -142 129 42 35 -14 3 -40 -30 -31 -5 168 -125 143 73 40 156 216 39 84 41 288 -214 154 -47
6496 -47 -110 -50 72 -42 42 174 225 146 40 230 78 -27 -197 105 103 0 62 170 15 -208 -230 18 -84
6519 -84 -73 60 -11 -54 52 -35 111 -61 -69 179 40 71 -106 -143 -97 318 -74 -298 -40 227 20 -61 -33 67
6543 67 -174 92 -25 107 189 1 -171 77 -112 -99 63 -8 67 109 -66 -131 17 -31 -191 124 58 179 -10
6566 -10 -33 -325 124 -82 -107 -96 -122 166 220 104 -16 -19 -108 -82 15 -88 65 10 158 106 91 109 -210 -19 171
6591A71r9j62l9M44k65K0k67J57j26O3J01J41l77J27p6L33j39j93K94j53R6K02
6613B53k53J10k79O9R9K83l52J35q7j28MJ35N9j72K38k3k49l1K88k41K04j01n
6636d4o4M6o6p3J35M6Oo3k0qK53j62L24j29k35J10J6L5k76o2J06J06l7L4j34M20
6662B64l89J62n6j50M27j40J24q8O7k45R7q5o8P4l7Rl4J50j69K2m1n5L61j64L3
6687F9J33j3r6l52M25k33K91o8M5l70L15k44K28l18K30j43J51O6j61p1K25j27
6709a8j93L02k31JJ77J40r8k04M2J67m5k16K7J63k6Q1k64K14K22l29J59P9j81
6732c1J2J05q9q3J08J1K09k57P6k39K88m2m1j43K42M1p3j32J13K12k02OP8j32
6756C7q9J05p2J96l37K90k77J11O3j01l41O29l15J14P3m04L50q4q8R9P8k2n9j13
$$ plain form
6591 171 72 -90 -129 315 50 70 -197 -40 -166 -103 -2 139 -238 -111 -187 146 7 -186 108 -45 51 253
6613 253 0 110 -169 -100 -1 282 -70 65 -22 -150 -146 -11 48 -124 114 91 -158 -189 99 -142 62 -39 -44
6636 -44 -108 -62 -128 -201 -66 -20 -14 -77 -97 -105 148 -14 310 181 -54 56 72 107 -169 -231 -125 -19 -56 -22 -156 264
6662 264 -125 37 -19 -169 258 118 242 154 221 -24 73 -12 -80 -6 -43 -34 -68 82 -87 -65 -106 -161 200 36 69
6687 69 202 189 93 -259 166 -67 224 156 201 -169 146 -98 130 -188 42 -101 50 116 -45 -116 109 -18
6709 -18 -211 91 -140 -139 38 178 80 -124 -82 85 40 -176 -149 14 -12 69 -195 19 241 -88 71 150 -31
6732 -31 -19 86 -3 -86 22 33 242 -15 61 -178 110 68 27 -116 126 167 94 -38 75 287 85 91 169 37
6756 37 -52 53 -19 177 -160 130 -147 -36 27 -74 -415 214 -101 13 86 -318 32 -52 -140 -41 37 15 -44 -157
6780a57K33j03M3Ml4J29K5l02J87p6N7n6O6k29J13l4R3N8mJ78q9J5l66M19P7m63
6806b16L01k39J18j6j3r4K08Q4k83J05J24P2n6r5J37l80J74K29j3j27o6j73P3
6829a46j3J44K2K0n4K7N6Q7j44o0j28M62j65j24j34J55q7J45J06j8m2N0j43q2
6853f6O2O4j27K80m03L03n9qK3k39J68K04j44K16l48J97r8j65K45j08p4K5N7j60
6877a55R7J37n2J1J07p1J36j48l0J97j79q9J00j8k02lK5J15J83m01K97l12M91
6900B36j83k56K61p4K16j28k17J91J42j34J24lK4k05m05M16K1N9P4l08P7J37j56
6923i1j3M6J31O2k63K32k70J61Mp3Q8j31j31L04l4J40pj04N9j71j42K29L6n4J54
6948A62l85L00j86O4L5l66L74J44k67M27k99j26Q8j02J20j5N4K09k51K09m02N67
$$ plain form
6780 -157 76 -27 16 20 -14 115 140 -162 25 -51 6 -50 16 -213 -100 -134 -41 17 13 191 102 117 -249 170 247 -216
6806 -216 85 -154 -36 -52 -65 -159 49 133 -150 -45 79 151 95 0 137 -243 -69 160 147 20 -46 -219 -146
6829 -146 -159 -15 7 27 -27 0 56 143 -1 -61 -189 273 108 -16 -150 5 -82 63 169 151 109 159 16 -66
6853 -66 -4 60 -67 213 -190 113 54 46 69 -170 -2 202 58 274 -74 123 25 -140 105 -3 -77 -52 5 -155
6877 -155 -58 79 27 38 145 74 210 62 32 229 50 -39 61 43 -159 -162 -137 -22 161 -240 57 -255 236
6900 236 53 -203 58 -16 200 72 -145 46 188 54 178 175 199 -6 -411 5 26 85 159 -149 -72 65 -91
6923 -91 -104 -58 73 135 -128 104 -166 -5 -1 -74 14 -117 -248 56 22 162 155 51 110 -61 -203 26 62 8 162
6948 162 -223 77 -109 -45 -10 -376 -2 142 -125 302 3 -123 -35 -137 -17 -32 22 231 -20 189 -213 354
6970C54m00r7Q8o8L62l54K8P9m4J13K41k22o9j00J78L7n3m08K67K15k33K78k17
6993b5J05n2o8K26k98R6k09K33P3J1j26J13l64J99K35j98K84J5o14K52o8K0N6
7016a04K27j65K30j33p9J88o5j56J76j60J8n1l5K38l40J43k02K71k3o5P3%j24
7039a38K17l3j99J60k14K91j97K22q1k2q4k6p4J93k91L36oj36R2l76L58K3j49
7062a34P8l1P1m4j52O8J21M2j62L0O2K8J6k4N8j44j22L54r8J15l23J52M7o8J21
7087F1r4J23j86k9L17k40J37k36L97p6k05m0N0N2l01L97j34j04J35J31j96K31
7109A90l02M4j8J3J65q7p7q7j6K33k17O1K39k9k68J87J76l72K41m7J18n0o1M0
7133G6j3j36k6P8j93P1L21l3k45J06r1K08p6j05J13j73L65o0k63L55p9r6j41J4
$$ plain form
6970 354 -46 -143 -55 -123 239 -115 -87 -8 -52 61 302 80 11 -89 89 126 73 -335 -68 147 -86 192 -25
6993 -25 80 28 -40 186 -112 -16 -225 8 81 92 -34 79 -285 -86 149 -49 235 250 -364 -112 -180 -160 -104
7016 -104 123 -42 188 55 -24 164 99 -57 119 -41 -23 -74 -109 129 -211 -68 -270 1 -22 -87 -14 -14 -138
7039 -138 79 46 -153 7 -207 84 -113 109 28 6 -78 -104 -178 15 -276 60 54 -82 10 -366 -8 15 -134
7062 -134 -56 -87 -16 -60 -212 -144 -23 19 -143 -113 -51 -23 -7 -31 27 -117 -239 115 17 132 -191 -39 8 -60 61
7087 61 -33 90 -96 -125 192 -48 89 -147 250 174 -31 -71 -21 31 -270 127 -7 -111 24 155 -41 190
7109 190 -112 -68 -86 -73 92 5 -72 -159 -175 58 -159 -98 141 112 -156 31 207 -165 76 29 147 97 36 76
7133 76 63 -73 -99 -21 -214 -143 178 145 -100 6 -85 123 47 -58 55 -118 247 187 -76 279 200 104 -37 -23
7157b3l6j5r3K82K8J3j49J72o1L6q3P9k55J70m4l03J93L86l47k40M0J47N2k15
7181b66L33k82J40J88j02j3P4l38M43n9r8Ol7J71L7k9k34k16M03j01J53j13J72
7204B32m67J3J93M1k8J12j40J07J2L9l90J99J00k0k16K10M3j92L60j67q2j8O6
7227GJ9P3r6j3j09J92J16p5J1q8n1p3n5J76J12k09K30j65j85J62n0K9P4N7k07
7252a18J08qp6N0K0J69k56K14r2O8j41J29j69R1Q3J94j48l06K71l12M7K01k17
7275a98M55k09m31K98J32j97N9j52L01n6q3J06Q7n8o0J7k39K01J07j78K08N4M2
7298B06k85k8P1p0M6j18L9J68J13k87K04m1n4K6Q8J60k90J05J24p1J72k88K06
7321A96j36k34L80n70M79L1J87j53l29J54p9RM9L9j00j24K36N7n8m5k7r3K12j42
$$ plain form
7157 -23 -59 -74 -167 115 143 156 7 179 118 154 71 150 -105 65 21 -282 -89 297 -50 -290 -250 -103 -51 -266
7181 -266 67 -215 -75 113 11 -2 72 -266 177 118 20 26 -11 160 197 168 -66 -282 121 20 173 60 232
7204 232 -235 -222 -29 12 -16 96 -44 63 75 114 -276 -77 23 3 -213 -3 40 -152 208 41 -41 -59 7
7227 7 26 99 3 -10 -119 73 189 114 125 37 -14 -87 -142 34 146 -63 167 2 -183 -21 -71 -42 32 89 -118
7252 -118 -10 -18 -94 -44 -24 145 -111 103 11 79 -62 67 -102 -11 72 266 118 -188 83 -229 -182 19 -198
7275 -198 257 48 -383 -85 47 -150 -91 -243 58 2 -81 25 112 54 -6 11 -228 -27 80 -98 110 164 206
7298 206 -79 -107 -36 -106 -60 -178 -139 29 142 -145 59 18 -36 -10 78 238 -52 53 177 106 278 -10 196
7321 196 60 -174 206 -364 115 146 333 180 -149 5 -74 -65 -16 23 -77 -201 35 92 34 -11 -38 -131 81 -61
7345f1L05m34K09J51l54K79J4k63J70J00j59l9K72k60L6j45J67n7m5j7O9R8k05
7368a69K81o4j92M1J64M7j17k7j66K01J95k30J53k85K40M4j9nl80L46l06K42J4
7391HK08l52K63l02K16q0J59k00M7n0m5J93j57K09k83L64k35R5P4J1p9m3J08J21
7415B50m5j59J19k14P7k20R8p6J05J9q4J20J8k06J76J28k69K60k90K99K05j19
7437A92j81p1J10n4k03J93P0J07p8p5jj12kJ06J82L0k15k0J18k83O4J05R4j36
7461f0j64K63N2q2Ll6p6p0K41J54k89P6q6k21L76R8k9q6J50k07L6n1K17k17n0
7486e8L7j5N4l20N76j25j10m3K05l65K92k48J10%J30j33j32K68M7k39J31l0j94
7509a62O7K71Nk50mJ17M1k19J8j12N15k77J32j60k6LJ97Q6j56l66L63ok66m8R8
$$ plain form
7345 -61 244 -190 19 170 -184 95 109 -154 16 116 -43 -82 190 -70 -34 -179 -12 -69 -114 -131 -62 36 -169
7368 -169 112 48 -144 -103 61 108 -9 -36 -202 -1 194 -36 117 -168 72 116 97 92 -288 58 -248 -6 8
7391 8 216 -136 127 -175 41 -39 120 -80 -33 -83 -128 65 -92 117 -166 198 -37 58 132 143 64 21 129 250
7415 250 205 46 165 -49 28 -192 -94 -170 -65 -46 -130 -10 8 -198 -22 106 -163 97 -193 106 311 192
7437 192 11 -60 50 -4 -207 -14 56 163 85 10 9 -103 -105 1 183 213 -2 -22 96 -187 -123 -18 76 -60
7461 -60 -224 39 91 9 12 -24 -100 -170 71 225 -64 12 -74 -295 81 179 150 64 214 7 43 -8 209 -8 -58
7486 -58 -21 -36 18 -302 274 149 39 -4 201 -164 128 -120 -10 -10 120 -13 -145 123 170 -69 62 32 -162
7509 -162 -95 176 181 -69 -73 44 85 -134 -116 -228 287 10 142 -18 -44 -41 156 242 86 -280 83 77 -189 -237 -139
7534a39KL34l23K36p4j22p9K06O2k28O7r2L2K05k35Q0K58k43L9j51N6K29l28K26
7558A8O6j90J49l82M27k2l46L64n9M9o1j16Q2J30q2O8M7m5j18j74R3J35J05o1
7582G7k34O3J61n7j64J62O7j8k67O7K47K6k72N1J10r3J64j33j22K81k70J4J50
7605A0%K15m79J36K2L22k27Kk20K95O1m0J3j89J21j69K74j58K14k45J02q5R7o
7629F6j71K17J27l68J68m9p9l8m8J47R8k73M18k50P4j51N1J48q7k6R9j65J89j6
7653H1k23J95O0l42l3L09j72J39N3oJ15j40o1j08J32J8k10O28n37j64J28m7j9
7676b04J60q4O5N8R4k86K32K96l87mJ50j96j5L16k88L16n5k10j65J98m3LlJ29
7700G7Lj16M3J22p9J38k39K34l99LK88k88J08k9N13m44M1J17J4j48J28l9j12J72
$$ plain form
7534 -139 -137 197 -126 110 36 -86 -165 41 103 -125 -58 -150 -118 87 -148 -68 190 -53 -14 -165 -109 120 -208 18
7558 18 84 -106 43 -339 88 66 -280 84 25 74 13 -103 -21 109 27 95 142 97 -21 -195 -102 33 138 77
7582 77 -157 -94 67 10 -154 8 75 57 -210 -143 104 130 -142 -91 19 -74 90 -43 -165 116 -154 -140 10
7605 10 10 225 -254 -118 -96 226 -1 1 -219 76 137 97 110 -79 42 -127 147 -11 203 -42 60 -25 72 66
7629 66 -105 112 239 -129 39 -10 -89 -127 -175 -28 70 -203 215 -35 39 -112 -61 87 0 -26 73 -92 97 81
7653 81 -142 53 113 -229 -262 47 -125 14 67 61 176 36 -25 -133 -1 17 -193 435 -102 -266 -138 -185 -204
7676 -204 -44 -128 -63 -5 89 -197 35 331 -56 -60 90 -106 -121 195 -93 223 168 -42 -207 -9 -52 -49 -52 77
7700 77 80 -36 7 129 50 188 -51 183 -216 -213 75 -213 -105 -134 379 -65 -24 93 107 -41 87 48 -64 108
7724A08j02L7j24J22RJ15l19J40J42p6j31o3K56r7j3j04K88l37N1J22k75K35J5
7747aJ06l00K92r4j08K7L9J73k7r8j49J16L7k76L08J5k44M35k36m6j03L9k01M44
7771A48j58J44M7L8q8L7j79o9K84j06k13R4J82k49j74J19J64J32m82J41M67m27
7793a48K27q8m1jK57r4l31K86j09o0lM8L7j59L42j54K7R7k60Q2K18o6lK05m62
7818a53r2J8K20j87P7K67j59q6K19j88J20rK35k92n2J30jq3k7k2o3K15J6k83J05
7843g5r2j6K97j88j61K84j8Pj43P8J2L43l84Pj3oK06k12L7l7j98PK9K55k46J81
7869d6n0R4j46k35K35N5j18K60r3j07L32p0j22K4p4n1K8K05P7l02K39k36K96l99
7893b04K69k41%M00j36K04q8k37j34J41J25j81K25j68o6J43j68J28j38J26K13
$$ plain form
7724 108 6 43 -81 41 50 165 -154 -14 128 52 -79 -142 114 17 4 -100 188 -149 -98 24 -251 -16 -1
7747 -1 105 -195 97 3 -105 -78 -39 134 107 9 -140 -24 13 -263 45 60 -184 251 15 -31 -134 -95 -296 148
7771 148 -10 134 181 219 131 168 -11 -80 204 98 -115 -21 161 -88 -262 -143 21 153 -329 -188 279 -148
7793 -148 79 -9 -50 -51 206 112 -219 67 -42 -102 -105 -57 -20 -179 163 9 36 133 -127 -45 173 107 104 309 -153
7818 -153 -245 -227 -7 -194 -117 150 -9 -95 124 -64 56 47 282 -10 -62 68 67 -16 -43 -65 -128 87 103 -180 -75
7843 -75 -167 -183 114 -74 -235 49 31 38 -105 -27 -15 328 -56 -49 -62 -68 138 -74 -37 -74 -272 -265 -236 19 -227 -46
7869 -46 -96 -2 -148 -383 -148 -93 -211 49 -44 -151 181 111 -11 13 -61 -112 -84 121 198 -104 135 -101 195 -204
7893 -204 65 -176 -176 224 88 292 204 -33 -167 -26 99 -82 143 -25 -91 52 -116 12 -126 0 213
7914B13j25q1k59mL1J86o9K43k04l4J11j79J52n6J88Kj73O8k1J52j42n9q0J13
7938b7j95L64k70J61J02k38j04K73j97j58L34n1K15j9m6k63l1J10J13l10L06o3
7960Fj8K02l62Q2J07p8P3j13K87l53L32j10r8j83R5K0N0K20j19L9j80L41m27K28
7984D1j85K23l01J79n5q9N1J35J55j25J89j61P2k54K58j80J44J4K07m66j5m5Q0
8007a28M0n2L17n43L27J80r5j1k1k1pj83K07q8J11k8k13J75j5K8p6L4R0m0o8m2
8033a22R2j0k12R6K26k30J8k3M7J27k74K60N8q5l3J26K3k31P5L5P0R1n6r9J8N5
8059D2m6l22K96K35n8j74K36l41K99k95R6J45j66k2J26rL5N0r5Q7j70j36K51l9
8083B5r2k5k14M68o13P08P1l78j06K97N3l34K01L11m92j61J37J73r2M3k53K59
$$ plain form
7914 213 88 7 -252 -256 -225 -39 -108 135 -69 -103 8 -171 -19 -75 113 115 -58 10 -11 141 -1 -60 -140 -27
7938 -27 -222 142 -128 33 135 -103 -207 66 -131 -289 45 -6 209 190 144 -119 -150 -40 73 -237 69 6
7960 6 -12 190 -172 -90 17 -61 12 -101 186 -167 165 55 -43 -226 -131 -111 -61 159 40 79 -101 240 -187 41
7984 41 -144 79 -222 -43 -98 -187 -136 -1 154 29 218 57 129 -125 133 -47 97 111 318 -148 -163 -208 -128
8007 -128 -88 -140 177 -366 -39 141 46 35 14 -7 -14 -197 10 -78 33 5 -208 -33 -48 -20 -96 -62 28 -12 -80 -122
8033 -122 -30 -40 -252 -156 70 -160 -142 -165 -118 9 -265 -5 53 -32 -65 61 84 -147 -72 -37 33 124 68 -31 -13 42
8059 42 -4 -326 -30 205 147 -27 209 -132 167 -128 -32 113 -53 -75 51 42 77 127 32 119 -51 -187 64 25
8083 25 -67 -92 -306 162 -451 257 328 -50 -156 141 194 -140 61 372 -120 -281 -144 29 -63 -20 -273 -14
8105a4J3jL4J52k24k2J99j20j50j6P1m5K42j11k81N61k27k67K89k32M10J0N8l97
8129f8N7p2j9K97k80J7o8m3J52R1j17J0L77k95j75J56j01P8K11l91J98m9PP7K1
8154G1k39L02k49J43J8q3O7j62K9O4j07J34n2J93r9qNN5k09J17j7l0J75m9J05
8179A74m61M45j53M6J19j51r5K19k28K02p0M1
$$ plain form
8105 -14 -1 -2 32 184 -40 -62 137 17 -133 -149 -78 -123 119 8 -273 288 61 -206 83 -149 261 271 329 -68
8129 -68 -11 -83 -102 195 -85 -68 -136 -179 -27 64 -53 -43 334 39 -136 20 -81 -3 208 -183 15 -34 -27 50 71
8154 71 -168 134 -115 28 46 -37 30 -132 -103 -39 -146 -12 -64 129 30 22 27 82 -127 -10 -27 -57 118 69 174
8179 174 -287 158 5 51 170 19 -76 143 -85 117 47 88
8191H8
$$ Imaginary data points
##PAGE= N=2
##DATA TABLE= (X++(I..I)), XYDATA
0@%%%%%%%%%%%%%%Mj2J6j6J6k1K9l2L7m5N0n8P2q0Q8j04J20j36J55j76J98k22
36a17K50k82L14l50L90m34M83n35N92o54P22p95Q76r65J061j170J291j423J573
55H27j742J933k154K411k714L079l525M086m821N825p289R622j3926K4437r7727
70h1678j23478K11218R4587r6130l1318J32228N5381m4226j5605J076o1903j8348
82B1804L0917l4696q3181J0325P0596q832q0818j8992L0301j129k5660j8309k324
95a09998M1089O3321K1480k1429K3480O9789P397m9893n060J9765q117n347R702
108E6179j9503k8599K3407J9238o7045o2133K7497J8600n0158k8178M0371L5116
120c5208p972P891L2360L363k817K4184J0347j9807N7L9698K0796k7155j1015
$$ plain form
0 0 0 0 0 0 0 0 0 0 0 0 0 0 0 0 4 -8 8 -8 8 -13 16 -16 21 -24 26 -32 40 -40 48 -56 64 -72 83 -93 105 -117
36 -117 133 -149 165 -185 205 -229 254 -281 311 -343 379 -416 460 -505 556 -614 677 -746 827
55 827 -915 1018 -1136 1275 -1439 1640 -1885 2201 -2620 3205 -4084 5538 -8388 16049 -81678
70 -81678 -205156 6062 100649 4519 -26799 105429 160810 116584 100979 102055 40152 21804
82 21804 52721 18025 -65156 -54831 15765 6933 -73885 -92877 -62576 -63705 -89365 -107674 -109998
95 -109998 -68909 -5588 15892 -5537 17943 87732 95129 45236 40176 59941 51824 46477 56179
108 56179 36676 8077 31484 50722 -16323 -78456 -50959 -32359 -82517 -110695 -70324 -35208
120 -35208 -43180 -35289 -2929 434 -2383 21801 32148 12341 12398 52096 72892 45737 34722
133C4722K4004j412l3501k5124q784r605j5290o858j050j543Q467O653l717K765
147c0273N264K240O866Q890Q221J1233J6145J3451p69J67P466r264j8562o236
161A4839k036r012j3326l994M784m763j0047l022j926j766k542j964O576J0128
175a8071J1610J1607L194N789J2355M607k759p757l440N166J760p044r684k112
189E221P501p110j9578o311K545l958p123k805M197O952Q658P925l176N49J4430
204G917P579o245l748Q124J1948j213p153J024K291q89o783j2997p785m18M34
219g914m635j0340N3J0522J655n292j366M248O710J794n56L374O024J0828L781
234A8886n666J103O837j81o625q885j313K105l553m105m749k586K917k212o585
$$ plain form
133 34722 58726 57314 23813 -1311 -10095 -19700 -34990 -41848 -42898 -44441 -35974 -29321 -33038 -30273
147 -30273 -25009 -22769 -15903 -7013 1208 12441 28586 42037 41268 41435 48901 39637 21075 14839
161 14839 12803 3791 -9535 -13529 -8745 -13508 -23555 -26577 -28503 -30269 -32811 -34775 -28199 -18071
175 -18071 -6461 5146 8340 14129 26484 31091 28332 20575 17135 22301 24061 17017 7333 5221
189 5221 12722 5612 -13966 -20277 -17732 -21690 -28813 -31618 -27421 -20469 -11811 -3886 -7062 -6513 7917
204 7917 15496 9251 5503 13627 25575 24362 17209 18233 20524 19635 12852 -145 -7930 -8348 -7914
219 -7914 -12549 -22889 -22836 -12314 -10659 -15951 -17317 -13069 -6359 -4565 -5121 -1747 4277 15105 18886
234 18886 13220 14323 21160 20979 14354 5469 4156 6261 2708 -1397 -6146 -8732 -5815 -8027 -14612
249a4612k808J434N052J07k812M859P883M719J748k75K290M088K27q32k727l50
265G991L344k026m169j702j310r69m660n727o90o1r2M15j557K555M500J305J328
282a525K73J303M100m3L05K156J221J789j064k587J05j572j465k830m229o16M76
299d203j717J0o91R20J623r54P26J499O94K564N25O47L201J128J140j36k396P15
317E295o57k508p53k101q60m26k102L06l84r37M12p44l93K042N76J995J713L67
335H41K431J298N42J615j417N2p1j775J25o23j824n71k255j310j31k032n44q49
353f498n72J465LJ115K360L22J806J520J67K286Q89N36O02q77Q40O82j650q05
371D191j240k176k01k392j383q79j483M9l62j207J456Q03P62R11m23J931K721
$$ plain form
249 -14612 -17420 -15986 -10934 -10827 -13639 -8780 -897 3822 5570 5295 7585 11673 11900 11068 8341 7991
265 7991 11335 9309 5140 3438 2128 1159 -3501 -9228 -9918 -9979 -10071 -9656 -11213 -8658 -4158 -2853 -1525
282 -1525 -1252 51 4151 4108 4413 6569 7790 9579 8515 5928 6033 4461 2996 166 -4063 -4679 -4203
299 -4203 -5920 -5910 -6601 -5681 -4058 -5012 -4286 -2787 -2093 471 996 1643 4844 5972 7112 6976 4580 5295
317 5295 4638 2130 1377 -724 -1584 -2010 -4112 -3806 -4190 -5127 -4715 -5459 -5852 -3810 -3234 -1239 474 841
335 841 3272 4570 5112 6727 5310 5362 5291 3516 3641 3018 1194 623 -1632 -2942 -3073 -5105 -5649 -6498
353 -6498 -7070 -5605 -5602 -4487 -2127 -1805 1 1521 1688 3974 4863 5399 6001 5124 5964 6646 4996 4191
371 4191 2951 775 574 -1818 -3201 -4080 -5563 -5514 -5876 -7083 -5627 -4824 -4062 -3151 -3574 -1643 1078
388A078M98J480N37J037J970l94j29m18j217N37j632k606m84p37o49j228k882
405e239l81J108P0n95j573R41K808J48J121R94Q40K501R03o50Q68N65J577n17
423E489k733K09J212o71j307l513p36J465j387j454j336j60J577m4n19K3R47L029
441I1N54k247J583K063J534N48k006k54K081K38j279k235lJ170j673j373n87o79
459b474J236m8k084l57J479J562J49j733L90J746K020K85k289K96L049q71j115
476A241J97j072N79K23j151o35o73R15J64j974M4N80Q96P52j403p0K350m3m43
495D77M11M14L83p50M28L05k098J231J063k309m25k49J99Q11q85p51J42q1J311
514c73R7n67R62j036P23K280j173p58R51N89O8r10j75M74k58L9j601k51J964q77
$$ plain form
388 1078 1576 3056 3593 4630 6600 6206 6077 5659 4442 4979 3347 741 257 -480 -1129 -2357 -5239
405 -5239 -5620 -4512 -4442 -5037 -6610 -5669 -2861 -2713 -1592 -598 242 2743 3646 2996 3864 4429 6006 5489
423 5489 2756 2965 4177 3506 2199 -1314 -2050 -585 -1972 -3426 -4762 -4922 -3345 -3389 -3908 -3885 -2938 91
441 91 645 -1602 -19 2044 3578 4126 2120 1866 3947 4185 2906 671 668 1838 165 -1208 -1795 -2474
459 -2474 -1238 -1286 -3370 -3727 -2248 -686 -537 -2270 -1880 -134 1886 2171 -118 178 3227 2356 1241
476 1241 1438 366 945 1168 17 -618 -1291 -376 -212 -2186 -2142 -1562 -666 86 -1317 -1387 963 920 477
495 477 888 1302 1685 935 1363 1668 -430 801 1864 -445 -870 -1119 -920 -109 -994 -1745 -1603 -1684 -373
514 -373 -276 -843 119 -917 -194 2086 913 155 1106 1695 1763 853 678 1152 894 933 -668 -919 1045 168
534A68j699O77m32J07J452m36j697k27K440R60k832o12K327O85k7j094j334K428
552H54J119j015o67o79J139R51m34n05j010J242J840k594j692J980L99p26j784
569a582j182J887R31o16k854o67L286R73j255m95n8Q38K962p18j325O61K338J076
587D200j968j054J155Q01k84j804k133K083K64k727j070l04J23L10p43j156o5
604d372J955K239k183o52L279J974K14l56k01J556J776m45j213j205J127N0k223
621A320m51j448q39J65k033j454J020O16r69o58J11J797J407P42j72J85K848J868
639D055j290L65J010P99l41p44j083o97k58j9k586j579J131j183j344k33n54P67
657c784L41k86N91J217J698N32k78J812J040L04Q13p23m14J352o27j125j027n86
$$ plain form
534 168 -1531 -854 -1286 -1179 273 -163 -1860 -2087 353 1313 -1519 -2131 196 881 854 -240 -1574 854
552 854 1973 958 291 -388 751 1702 1268 763 -247 995 2835 241 -1451 529 928 202 -1582
569 -1582 -2764 -877 54 -562 -3416 -4083 -797 176 -1079 -1574 -1632 -794 2168 1450 125 786 3124 4200
587 4200 2232 1178 2333 3134 2850 1046 -1087 996 1260 -1467 -2537 -2841 -2718 -2408 -3151 -4307 -4372
604 -4372 -2417 -178 -2361 -3013 266 2240 2454 2098 1897 3453 5229 4784 3571 2366 3493 3543 1320
621 1320 869 -579 -1418 -1253 -3286 -4740 -3720 -3104 -4073 -4731 -4620 -2823 -1416 -674 -846 -661 2187 4055
639 4055 2765 3130 4140 4939 4598 3854 2771 2074 1816 1797 -789 -2368 -1237 -2420 -3764 -3997 -4551 -3784
657 -3784 -3443 -3729 -3138 -1921 -223 309 31 1843 2883 3187 4000 3277 2863 4215 3588 2463 1436 850
675H50r50p97r09l06j198K07J30j375Q48J369k63P84K95J283J525L81L03K82L31
694B790J244p87j053J54m62l61j018j593l88J31j125p00m85K33P98j79P32M73
712a596N99J716J15J77J422P24K53k75j32M76n70n56r44j600q3j34j828o72p11
731c619j12J67m93M40Q94L98J308M24M94J903M00Q15M32j34Q90L26j032l14n00
750B687r07j002j318o15o97j153m46o36o31J055RJ06Q97L82J461R42O76J371L58
769B539R35Q74m32M92j50l56p16j364q73l72j108j206q86j092K35n72n0L84j25
788c843R72R83J84J005J517M34Q98M16N81R95n57J39m17q08j07p98j357k86j306
807a355k32j003r46M86l8j02K78L09P08J078J86Q92O18M98J115Q7R6J37l57o3
$$ plain form
675 850 -100 -897 -1806 -2112 -3310 -3103 -2973 -4348 -3500 -2131 -2394 -1610 -1315 -32 1493 1874 2177 2459 2790
694 2790 4034 3247 2194 2348 1886 1525 507 -1086 -1474 -1343 -2468 -3168 -3653 -3420 -2622 -2801 -2069 -1596
712 -1596 -997 719 834 1011 2433 3157 3410 3135 3003 3479 2909 2353 1409 -191 -274 -408 -2236 -2908 -3619
731 -3619 -3731 -3564 -4057 -3617 -2723 -2325 -1017 -593 -99 1804 2204 3019 3451 3317 4207 4533 3501 3187 2687
750 2687 1780 778 -540 -1155 -1852 -3005 -3451 -4087 -4718 -3663 -3654 -3548 -2651 -2269 -808 134 810 2181 2539
769 2539 3474 4348 3916 4408 4258 3902 3186 1822 949 577 -531 -1737 -2623 -3715 -3480 -4052 -4102 -3718 -3843
788 -3843 -2871 -1888 -1704 -699 818 1252 2150 2566 3147 4142 3585 3724 3307 2499 2392 1594 237 -49 -1355
807 -1355 -1587 -2590 -3536 -3050 -3088 -3190 -2912 -2603 -1895 -817 -631 261 879 1377 2492 2579 2675 2812 2455 2392
827B392l63p02k81o86j238J0j442J38j44n73N04m59K84J419m2O47Q22K93Q62J04
847A545N39M24k06j72K22r26R2n38j169m58n19p59Q7p15O6Q7j34M81L20O01R56
868a76K64Q24N64J38J070L8J3J16m16o25K02j128o25r51m39n33o48j13j30o31
888c186L1J66N20Q90M96O20Q08L52J103O22J08O27n8J7q6p48r8n50r74o92r81
909a013o57p7q85k70k21m33N63L85M6Q32O31N54J015M10Q72N67J60L26N3R5J71
930C124o43o15o30j073l98l48j001j07n14l31l7j86Q8O85L72N10M8O89R95L17
950I45P11K48k16M39L24l36k41l78k09k94p83q3n94m24k96p82j3O25l30J72L13
971a202j6R68k0M03K38k9N00N71l11M49j72m43K48m41m42J21o31j94k51l83L28
$$ plain form
827 2392 2029 1327 1046 360 -878 -868 -2310 -2172 -2316 -2889 -2385 -2844 -2560 -1141 -1183 -536 286 579 1441 1545
847 1545 2084 2508 2302 2130 2352 1426 1518 980 -189 -647 -1166 -1925 -1838 -2553 -2487 -2400 -2534 -2053 -1733 -1132 -176
868 -176 88 912 1476 1614 2684 2722 2735 2851 2435 1810 2012 884 259 -692 -1131 -1664 -2312 -2425 -2555 -3186
888 -3186 -3155 -2989 -2469 -1579 -1083 -463 345 697 1800 2422 2530 3157 3099 3116 3030 2282 2184 1634 660 -32 -1013
909 -1013 -1670 -1747 -2632 -2902 -3123 -3556 -2993 -2608 -2562 -1730 -1099 -545 470 880 1752 2319 2479 2805 2858 2953 3124
930 3124 2481 1866 1236 163 -235 -583 -1584 -1691 -2205 -2536 -2573 -2759 -2671 -1986 -1614 -1104 -1056 -367 628 945
950 945 1656 1904 1688 2127 2451 2115 1874 1496 1287 993 210 127 -467 -891 -1187 -1969 -1982 -1357 -1687 -1515 -1202
971 -1202 -1218 -250 -270 133 371 342 842 1413 1102 1551 1379 936 1184 743 301 422 -209 -403 -654 -1037 -709
992g09n17K11M01m67N42M67k46N63K77qL54q5k01k5K23J94p79l65N31n41q2P5
1014a87r06J36L33l92L02l42N00R1j9N84L88m28Q91j07k58O33l31Ll04n8j49m19
1036c9O5K8p42j25R0p97M65L91n66N41L0j6J58K49N30K28P6L82j70j61Q60n86
1058H91m42O99p05j12K25m14m86l99K30k54l95N37j05p58Q93j98L87K99k25J69
1078a63L00L90L11m90J79N64p05O17k19l76k06J96m13K00l11j10l20J10L81p48
1098h13J92N30o16K06O92m57R2MP7K78J76p6n91L57N06J2l00J19m76o5L35k4m78
1121c20J29O1P4J25rK1o00L55O59n58K33R8o70J58J38j03j28j0J7l30J82M88n94
1144e84J6O53j9m47Q46l27k21O82N7j9j56J92R6n33L37l76m50L93k47k01k77k98
$$ plain form
992 -709 -1226 -1015 -614 -1081 -539 -72 -318 245 522 514 868 783 582 557 780 974 195 -170 361 -180 -262 -187
1014 -187 -1093 -957 -624 -1016 -714 -1056 -556 -465 -484 100 488 60 951 844 586 1219 888 891 587 529 380 -39
1036 -39 26 54 -688 -813 -723 -1520 -1055 -664 -1230 -689 -659 -675 -517 -268 262 490 566 948 778 617 1477 891
1058 891 449 1148 443 331 556 142 -344 -743 -513 -767 -1162 -625 -730 -1488 -595 -793 -406 -107 -332 -163
1078 -163 137 527 838 348 527 1091 386 1003 784 408 202 398 -15 185 -126 -236 -556 -446 -65 -813
1098 -813 -621 -91 -707 -501 191 -266 -174 -170 -93 185 361 285 -306 51 557 569 269 388 -88 -153 182 158 -320
1121 -320 -191 -130 -56 69 60 81 -519 -164 495 -63 170 268 -402 -244 -106 -209 -337 -347 -330 -660 -478 10 -584
1144 -584 -568 85 66 -381 465 138 -83 599 656 637 481 673 769 236 573 197 -253 140 -107 -308 -585 -883
1166h83j08J8K4M11l48O7N11n05Q08N81m15L91K61J6L71J03j65k42P3k25l13j43
1188B88K55q15n03L32o05q7J58l82J83J20L12J90k13O55J79k50J098q4J25L88
1208A344j27k13J62n38J19l01j47j37o32p3Q7n83L90j38l87K95K60J04J85m4J83
1229a91K45K20M82j29J41P7l64O4M96o17Qj45l55R7l40k61j5K23nj56j65K76J31
1252b83NN26l98M53R4K26m2j01N5o1m58K20R7o75K72l26n7K54m19j40L49k47L65
1275b91j40K12L33j45L73M28k84J62K00k59m0j66J40j13l10j27j60l1nm99j5R2
1297f45j40L4o7J17L50J15j14N16J60P3K09K95m6ooJ51l94j1P9m94O1l3o79k4
1321d99j60m66K93k06KL48j18J88J95L9K28J22L30L22j33M42Q6n7K32k88j07L
$$ plain form
1166 -883 -991 -973 -949 -538 -886 -819 -308 -813 -5 576 161 552 813 829 1200 1303 1138 896 969 744 431 288
1188 288 543 -272 -775 -443 -1048 -1135 -977 -1359 -1176 -1056 -744 -554 -767 -112 67 -183 915 831 956 1344
1208 1344 1217 1004 1166 628 747 446 299 162 -470 -543 -456 -1039 -649 -787 -1174 -879 -619 -515 -330 -374 -191
1229 -191 54 274 756 627 768 845 481 545 1041 424 432 287 -68 29 -311 -572 -587 -364 -369 -525 -690 -414 -283
1252 -283 -278 248 -150 303 397 623 581 480 535 474 16 236 333 -342 -70 -396 -453 -199 -618 -758 -409 -656 -291
1275 -291 -431 -219 114 -31 342 770 486 648 848 589 549 383 523 410 100 -27 -187 -218 -223 -722 -737 -645
1297 -645 -785 -751 -818 -701 -351 -236 -350 166 326 399 608 903 857 851 845 996 602 591 670 176 237 204 -475 -499
1321 -499 -659 -1125 -832 -1038 -1036 -688 -806 -618 -423 -384 -156 -34 296 618 485 927 1013 956 1188 900 793 796
1343G96m23J27j66n22J0m09k76K86o17K92qj43J44K37J52K14k2M70J22J68L19
1364G51J10L8M02m75o8K75m19j26n4o05j44J32n44L76o12j69K43n6J59K36l9M00
1386a89j39L59K81j98N64l44K66J17J0J30j19k85J17m83k22L7j93l49J87k17K58
1407d12l1O1o9mK79P8K66m0M06j84M43k68l7K96k63m53L60o95L2P6k27j20k37
1430g43j21K79Q4q8K97p6L82J10J52K35O5J89J25j08P6l20k09M2j87n76J21k44
1452e15j68N2k31L9k30O1L53J16J01N26k84O47J40J42K83j25j0K09k49k5j8n70
1474B44m5m44j36K6n37j84l3j06P1K2J05R8K98L19L75m3M59L58j3M28j26K7r8
1497A065J41l55k51l45J53r24O4K66o55l11L39m43J71K22N5K61M0M40l8M40K59
$$ plain form
1343 796 373 500 334 -188 -178 -587 -863 -577 -1194 -902 -910 -1053 -909 -672 -520 -306 -328 142 264 432 751
1364 751 861 899 1301 826 758 1033 614 488 434 -171 -315 -183 -727 -351 -963 -1132 -889 -945 -786 -550 -589 -189
1386 -189 -328 31 312 114 678 334 600 717 727 857 738 453 570 87 -135 -98 -291 -640 -453 -670 -412
1407 -412 -443 -382 -451 -455 -176 -98 168 128 534 350 793 525 488 784 521 68 428 -267 -235 -159 -386 -506 -743
1430 -743 -864 -585 -501 -589 -292 -368 14 124 276 511 576 765 890 782 858 538 329 371 184 -392 -271 -515
1452 -515 -683 -631 -862 -823 -1053 -992 -639 -523 -422 104 -180 467 607 749 1032 907 897 1106 857 832 814 244
1474 244 199 -245 -381 -355 -892 -1076 -1109 -1215 -1144 -1122 -1017 -919 -621 -302 73 30 489 847 834 1262 1136 1163 1065
1497 1065 1206 851 600 255 408 -516 -452 -186 -841 -1152 -813 -1256 -1085 -863 -808 -547 -507 -67 -105 335 594
1518E94k26J93L62J03l60L10k09k82K80m57j43l20l54j68J30j78K16m34K08K28
1538e07L5K12mJ57M31j13L91k69J95K84o11L98l23l43J71M1k20j83L1k60J78O7
1560b42J1j60n9N02j97Q7M56k51j34L81K68j55n5j40j05p8J60q3o93mO5j43j44
1583g13J88J7J24j50L56j30K81R0J7M34l3p3K51J55m49K01j32k86K19m89K20j37
1605c9k66J28l97j52L75j73j07J20r5J54N60j26L36l46L71K36l22M80n2r1J77
1626G71k68l93M46o03J48l3m52J0l06j68P2J24o8N09n80J05N80j32K15L58l2J57
1648D60j4L29l22n8M47l31l54N05n22l12L25m77K20l3l59J79K5j51K24j68K22
1669a65k1o6L4L03K04j22R5O7k41M34r4j52Qj25k25L9J23j51J90k41j66j07L87
$$ plain form
1518 594 368 561 923 1026 666 976 767 485 765 308 165 -155 -509 -677 -547 -725 -509 -943 -735 -507
1538 -507 -472 -260 -264 -107 324 211 602 333 528 812 201 599 276 -67 104 145 -75 -258 -227 -487 -309 -242
1560 -242 -231 -391 -450 52 -145 -58 398 147 13 394 662 507 452 312 207 129 289 206 -487 -491 -426 -569 -713
1583 -713 -525 -508 -384 -534 -178 -308 -27 63 80 514 481 408 659 814 365 566 434 148 367 -122 98 -39
1605 -39 -305 -177 -574 -726 -351 -524 -631 -511 -606 -452 108 -18 318 -28 343 579 257 737 685 594 771
1626 771 503 110 556 -47 101 68 -384 -374 -680 -848 -776 -652 -720 -211 -791 -686 -106 -238 -23 335 303 460
1648 460 446 775 453 395 842 511 157 662 140 -172 153 -324 -104 -137 -496 -317 -292 -443 -219 -387 -165
1669 -165 -186 -252 -218 85 289 167 262 329 88 522 428 276 284 159 -66 -27 96 -55 135 -106 -272 -379 8
1692Hj0n01K38K91k60J42J68p8R1L4J3j83J29k24L92k01J01k99q3pM25m87K86
1715a5O5j16K30J34q2j92NJ85n8k10L2l52N38l50K89k54J29m42L72o5J00j52k50
1738d59K77m8j58O56p9l45K79%Q1R5k3j61RMK84k30J56k23k44Q4j06j87K86m4
1762i6k97K99m60l4P4M20J03k03K71j07j36L56K96l74M4J38j61R8K85l48R9j78
1784H9j07K16p3k5l87P4J25j65K81l62J13j47J63j71J27j15L40K10j26N0O4m7
1806A27K66k41J86J47n38P2Q7J2j9J87k05K33k84j21j57RM6J12k26J8n4n7L22
1829g8o0M10l89J59l0J2J48J9k93L73j35k74L45k48L03O2j09k67O5j14R7j39j47
1852b90M02j52o9Lk69J99P3o2K06j60J9J32J10L8k83Q9R3j80O2K08l96K77J85
$$ plain form
1692 8 -2 -503 -265 26 -234 -92 76 -2 89 123 136 -47 82 -142 250 49 150 -149 -232 -239 186 -301 -15
1715 -15 50 -66 164 298 216 24 29 214 156 -54 -22 -374 164 -186 103 -151 -22 -464 -92 -157 -57 -209 -459
1738 -459 -182 -230 -388 268 189 -156 123 123 204 299 276 115 124 128 412 182 338 115 -129 -45 -151 -338 -52 -96
1762 -96 -393 -94 -554 -588 -514 -94 9 -194 77 -30 -166 190 486 112 156 294 133 231 516 168 267 89
1784 89 -18 198 125 100 -287 -213 -88 -253 28 -334 -221 -368 -205 -376 -249 -364 -24 186 60 110 174 127
1806 127 393 152 338 485 -53 19 106 118 99 286 81 314 30 -91 -248 -239 -193 -81 -307 -289 -343 -400 -78
1829 -78 -138 272 -117 42 12 24 172 191 -102 271 136 -138 207 -41 262 324 215 -52 13 -101 -4 -143 -290
1852 -290 112 -40 -109 -106 -375 -176 -103 -165 41 -119 -100 32 142 180 -103 -14 79 -101 -39 169 -227 50 235
1875B35l80J87J9K12j01J35j09R1k60j01J98k8p7k71M8L90n27J27J41j03J32n65
1897f07M08OK16r8J87j32M63j95K30j79M5L2J07K8j52j11m8j12k54Q8K15m68j9
1920c50j9k32J93k6k66L15k04J65K71j43N85j17O8l0K12k97M22k79k1L65n40J55
1942B27m20K10M2j47n7l08k67J18l4q0L75j05K69J06j36K95J36J5J52k31M93j36
1964E17k57O1m6k13Qk99M31l47l38K82k1o2O5j82j78L45M5J53K9k66N38j04q6
1987G5Q8j06KL4Q2p6n9LJ41q6j83K6j56J75q0L12j32j67J75k8P7J26l81JL87r6
2013A54k96O08m22p1J6q2J71n18L60q6l5R4j39q8M88k13j43L99j07MK71o1K05
2036E09n7k79K47m05K34O6N8n40J58m06K25j50K4j30j3J36j62K96K51o0k01N28
$$ plain form
1875 235 -145 42 61 273 172 307 198 289 29 -72 126 98 21 -250 -202 188 -339 -212 -71 -174 -42 -607
1897 -607 -199 -193 23 -75 112 -20 443 248 478 299 344 376 483 511 359 248 200 88 -166 -78 137 -331 -350
1920 -350 -369 -601 -408 -434 -700 -385 -589 -424 -153 -296 289 172 240 210 422 125 547 268 247 612 72 227
1942 227 -193 17 59 -88 -145 -453 -720 -602 -636 -716 -341 -446 -177 -71 -207 88 224 239 391 160 653 517
1964 517 260 321 275 62 70 -229 202 -145 -483 -201 -222 -284 -219 -401 -579 -234 -189 -36 -7 -273 265 161 75
1987 75 163 57 59 93 175 99 40 43 184 98 -85 -59 -215 -40 -120 192 60 -107 68 40 117 243 -138 -137 250 154
2013 154 -142 466 44 -27 -11 -93 78 -440 -80 -166 -201 -107 -246 -334 154 -59 -202 197 90 94 365 304 509
2036 509 452 173 420 15 249 315 373 -167 -9 -415 -190 -340 -316 -446 -459 -323 -485 -189 62 2 -199 329
2058C29l47O2K79j83K00o8K47k46q5K18m22K41l8j91k87J8j7J21r7q5L1J5kJ57
2082a50J72j81L03k1Pm2J6K56mj77L18n48K19j83J07O2k16o4N7l25R3j12k8L01
2106a40j74K80q3J02k82J12P0L15j04M7p5K83k02k82J00p5K44l29L38R1k13L00
2128C23l20k99O14n70J24P1J79j98K79k52pk20L36l3j28p8J05R7j68J62m5Q4k58
2151b02q1M12j96J03j80K84j80q7N15o9l59J37J39j01J18j93J89n94O08l31j18
2172a86j7J24k46K60j2oN5L9j19m5K72o5L48n16O24j58r0J29l28K55m5k42j17
2195h6K09l3o2j94K02k91j47J12R7J13j84K81l62P36n11P1r7M6J41J93J07j43
2217A98p0J21m2j08q7L06k95M6j9j89J09j68K76l06p5J21j69M07j47o8J9Q3K5
$$ plain form
2058 329 -18 44 323 140 340 272 519 273 188 406 -16 225 187 -4 -291 -273 -290 -169 -266 -351 -320 -305 -307 -150
2082 -150 22 -159 144 123 130 88 104 360 356 179 497 -51 168 -15 92 154 -62 -126 -69 -394 -301 -413 -441 -140
2106 -140 -314 -34 -117 -15 -297 -185 -115 200 96 143 68 351 149 -133 -33 -108 136 -193 145 236 23 323
2128 323 3 -296 318 -252 -128 -57 122 -76 203 -49 -56 -276 60 27 -101 -179 -74 23 -145 17 -28 56 -202
2151 -202 -283 129 -67 36 -144 140 -40 -127 388 319 -40 97 236 135 253 60 249 -345 263 -68 -186
2172 -186 -203 -79 -325 -65 -77 -83 -28 11 -108 -153 119 54 402 -114 510 352 262 391 63 318 273 31 -86
2195 -86 123 90 28 -166 36 -255 -402 -290 -193 -80 -264 17 -345 391 -120 -49 -146 -100 41 234 341 198
2217 198 128 249 207 99 12 318 23 69 50 -139 -30 -198 78 -228 -303 -182 -351 56 -91 -159 -140 -57 -32
2240c2JJ56R6j91k55M27m68Q5L02m22J57J70J22j09j2J03m15K16L3m6q9J02K30
2263A61k80L0K51k44j79L40j01K6j06j31K82k76J41P6N7q9J5P0j27o1M33k02L1
2286A17n9j83J59Q2N3K52m67J11l1k86J53q2N8p1Q3q7M2j04j81K93M8mJ42j26
2310h8J22L39q6K4j55o2K40l12J75K8O3j48j00k62P1j61K48Jn07N72o8m41K79
2333b28o9j74N42l11L3J39K35Q0k49J86L79m65J95j60J68j13J08l06P6J12j70
2354Hp3j09J32k9l18R8L46m62K27j02J69K40l20J87J14L6M9LQ9k81R8k0R1M9k55
2379c3l2j49K85q2R6k92L9J10r4NO0q2j85N20k64Q9j76M0K68p6R1j02P4K7q3j29
2405g5K21k51J32K3j81K66L8k16kP6m08N15M1j9k17j93K34m5j55J64j33M26m02
$$ plain form
2240 -32 -31 125 221 30 -225 202 -266 -181 121 -301 -144 26 148 39 27 130 -285 -69 -36 -82 -171 -69 161
2263 161 -119 -89 162 -82 -261 79 -22 4 -102 -233 49 -227 -86 -10 47 -42 -27 43 -84 -145 288 86 117
2286 117 58 -125 34 116 169 421 -46 65 34 -252 -99 -181 -123 -194 -111 -198 -156 -260 -441 -148 -100 -104 38 -88
2310 -88 34 373 287 311 156 94 334 22 197 225 288 140 40 -222 -151 -312 -64 -63 -570 2 -66 -507 -228
2333 -228 -297 -471 71 -240 -207 -68 167 247 -2 184 563 98 293 133 301 188 296 -10 66 178 8
2354 8 -65 -174 -42 -71 -389 -291 55 -407 -180 -282 -113 127 -193 -6 108 144 193 196 285 4 102 82 173 222 -33
2379 -33 -65 -214 71 -11 85 -207 -168 -58 -152 -147 -87 -169 -354 166 -98 -9 -185 -145 123 47 138 36 110 137 54 -75
2405 -75 146 -105 27 50 -131 135 173 -43 -45 31 -377 138 179 160 -57 -250 -16 -61 -216 -52 -185 241 -161
2428a61M7K09J9j54j56n7J37nJ44o7L3%K3r9J56J63k14J57Nj97R5K36m85J89L8
2453E6j19J00q8J02Nk78J81j91J88l9J11j28J03j53L57q4k08J58M7J46j33l74
2475b41K54j27J74J39k44J69L5j97J8k51K29J5j94M8j9L8j04J9j43M39q2M9R1
2498A15l0j75K34j16K43k4J84j14l37Q5J6k54L75k70j43K9o9m9J26l5j33K43m4
2521a43j99L97r1j4J75o5Q3k05M81l00r7K59o8p1j97K3Q3m0j20J56O4k06N5r1
2545a31L0j0j19J76pN2J93l21MJ51p7n4L11k81J74M0k9j64k32L42K8k43K13o6
2569b0j92L09l28L32k2j99l4J95Nn8j89L18K3j15J28k75O8o4J50J7j08J59M2n22
2593c80L98J29k66J74j69J0J09N4k60J80JQ5K55j69k16K00r0J24j07k01j5K2k22
$$ plain form
2428 -161 -114 95 114 -40 -196 -253 -116 -121 23 -44 -11 -11 12 -87 69 232 18 175 180 -17 78 314 -171 18 56
2453 56 -63 37 -51 51 56 -222 -41 -232 -44 -83 28 -100 3 -150 207 123 -85 73 120 266 133 -241
2475 -241 13 -114 60 199 -45 124 159 -38 -20 -271 -42 -27 -221 -173 -192 -154 -258 -239 -382 57 -25 24 115
2498 115 85 -90 144 28 271 247 431 317 -20 65 81 -173 202 -68 -211 -182 -251 -300 -174 -209 -342 -99 -143
2521 -143 -342 55 -36 -50 125 60 143 -62 419 119 22 281 213 142 -55 -32 51 11 -109 47 111 -95 -40 -131
2545 -131 -101 -111 -230 -54 -61 -9 184 -137 -133 18 -59 -113 198 -83 91 131 102 -62 -294 48 76 -167 46 -20
2569 -20 -212 97 -231 101 79 -120 -154 41 46 -12 -201 117 140 25 153 -122 -54 -118 32 49 -59 100 142 -380
2593 -380 18 147 -119 55 -114 -104 5 59 -201 -21 -20 65 320 151 -65 135 45 169 62 -139 -154 -132 -354
2616c54K16J70k86o8K39j09M7P1J17R7L5k76O5J68Q0l36J73R0Q5j00k8p3Q6Pk22
2641a06j5j48J55j8j25q7K36k01J04M1J20j28N14o29N30j32J01%K5J05l7q4j2
2664B09O2j70n7J38l24j62M23l16k2J26j10J8jp7K12J23jQr8R7j79L26o9l90K19
2689a5J13k07K53J53k37J30J21l23M9j60R2j07j90J17J09m8lk08L63k15J93R0
2711G0j90K49J78j20R7k41j63K11m2j51J53q2J70k08J27J08m9J32k5J00l07J49
2733A66j67N2r5O7M6r7M2j1j52J30n8o0J52Kqk94J32l4J67K2N4J63q4J09k05O4
2759A03j3J00k7j81k1J40m70K97L51j90k13n3K54j82k51Q4K94k62R3MJ86j08L61
2782B96m8N0k8L6kl57J67J2p3N6J79l43K50j31o2q0l04L69o9l43L46j14K17k21
$$ plain form
2616 -354 -138 32 -254 -322 -83 -192 -145 -74 43 140 175 -101 -36 132 212 -124 49 139 224 124 96 23 109 116 -106
2641 -106 -121 -269 -114 -132 -257 -344 -108 -309 -205 -164 -44 -172 342 -287 243 111 212 212 237 342 305 221 209
2664 209 271 101 44 182 -142 -304 119 -197 -219 -93 -203 -185 -186 -263 -51 72 71 79 -19 78 -101 225 156 -234 -15
2689 -15 98 -109 144 297 60 190 311 -12 37 -123 -31 -138 -328 -211 -102 -150 -153 -361 2 -213 -20 70
2711 70 -120 129 307 187 284 43 -120 91 49 -102 51 -31 139 -69 58 166 117 249 224 324 17 166
2733 166 -1 51 -44 23 69 -28 14 3 -149 -19 -77 -137 15 17 9 -285 -153 -187 -20 2 56 219 135 244 39 103
2759 103 90 190 163 -18 -39 101 -369 -72 279 89 -124 -177 77 -105 -356 -272 22 -240 -147 -143 43 -65 296
2782 296 248 298 270 306 304 -53 114 126 53 109 288 -55 195 64 2 -78 -382 -13 -82 -425 -79 -193 24 -197
2806a97Q9J20L8M7N9m20M28J6j98M40m13J33j50L8J29R5k51q3j79J55K57Kl77
2829b22L60J6k1n1Nj95%J27J61N7l76K6K0K27m7J56k12k6q9L51k18MJ51k17K1
2854Hk2R1r1rK26l27k00M13k12K59J05m84N93n27k21L91j45Q3K0J09k55M38m9
2877A94m8k30R0P2J88j06R4k79j80N65m45J76k11n8R9k55K39m0P3q9K5j26L12
2900F0j78l7J0O2mJ15k81L27n1k58N15j89l48J71Q4L08k85L2n9lo2J36j08o7N0
2925f0j95Q1K8o1R5M2N6j55K4K49k32M9K21k87Q4P1K26J0k24M8J82k30P9L2l17
2950a84M13N8k57J10l09J02l56N56k69K36k88j92O11j76M2j04R0l6J35Q3k75K63
2972B53l21J07P2N3l35J04L29r6m1r5j66j73J93r8Q3k79K39o4K58q2O5q1LL7m8
$$ plain form
2806 -197 -108 12 50 97 156 -264 164 180 -18 422 9 142 -8 30 159 254 3 -80 -259 -104 153 155 -222
2829 -222 138 154 133 82 87 -108 -108 19 180 237 -139 -113 -93 134 87 243 31 5 -84 267 49 53 204 -13 8
2854 8 -14 77 -14 -23 203 -124 -324 89 -123 136 241 -243 350 -177 -398 -7 -152 -69 -49 60 -195 243 194
2877 194 146 -84 6 78 266 160 254 -25 -205 360 -85 91 -120 -178 -79 -334 -95 -135 -62 -151 -126 -252 60
2900 60 -118 -155 -145 -83 -87 28 -253 74 23 -235 280 91 -257 -86 -2 306 21 53 -6 -9 -71 65 -43 -110 -60
2925 -60 -255 -174 -146 -207 -112 -70 -14 -169 -145 104 -128 -79 142 -145 -61 10 236 246 22 70 252 22 101 133 -184
2950 -184 229 287 30 140 -169 -67 -423 133 -136 100 -188 -380 231 55 97 -7 83 47 182 265 -10 253
2972 253 -68 39 111 164 -171 -67 262 166 125 30 -136 -309 -116 -214 -131 -410 -171 -235 23 -59 6 -75 -72 -35 -83
2997h3J7J25r4J45j24j9L0j17K77j11J46j05k8j57O0j76L81l44L55k25J60N0k63
3020a00j60J20Q4J67K2j66Oj72L09k06K02n2l39M32k2q6J6j43K02n1K3j67r9O3
3044a17J06oJ5p8M69m18J2O5j93J46m83K69M3m0K17j16r7L89j12k56K24J34j1
3067A62j68R2K10j38j33K84j46j48j3Q6O7p5j21K37k98Lj19K51j64n2J11j35J54
3090e3J35Q2j40j24j23J91K12k1lk29R0N0k6k30M37j18j25J63o8m7r3p2O2J72
3114A22l9J02m28K76M0n8q3m8l0N12m01n5noJ84N2Ko6K27l01P9j46l1L89l96J35
3140B7m9J51l6p7Q6j37l7j3q1J1J65k13K8L5J15j38N4J72j07l2J55j6j36J75p8
3165B4R4J86j55m20K38J09m7k65L37j77J1j16M8j00K65k32K9L43k48j20o3M72
$$ plain form
2997 -83 -66 59 -35 110 -14 -33 -3 -120 157 46 192 87 59 -98 -38 -214 167 -177 178 -47 113 163 -100
3020 -100 -260 -140 -56 111 133 -33 -27 -199 110 -96 106 54 -285 147 125 39 55 -88 114 63 86 -81 -180 -117
3044 -117 -11 -17 -2 -80 389 -29 -17 48 -145 1 -482 -213 -170 -210 7 -109 -206 183 71 -185 39 173 162
3067 162 -6 86 296 158 25 309 163 15 2 88 155 80 -41 196 -102 -99 -218 33 -131 -183 -72 -207 -53
3090 -53 82 164 24 -100 -223 -32 180 159 156 -73 17 67 41 -189 248 130 5 168 100 53 -40 -112 -50 122
3114 122 83 185 -243 33 73 15 -68 -116 -146 366 -35 -90 -95 -101 83 135 137 71 298 -3 76 -70 -101 288 -108 27
3140 27 -22 129 93 16 102 -35 -72 -85 -166 -155 10 -203 -175 -140 -25 -163 -109 63 -44 -76 79 63 -73 102 24
3165 24 118 304 149 -271 -33 76 29 -236 101 -76 -65 -181 -133 -233 32 -200 -171 172 -76 -196 -259 213
3187B13R6O4l45N8l9j18L25j38l3j28J64k63K42j09k7J9K81m38m8J49N8Nj87L32
3211A33K0l13p5J33J43r8L22l74rq0L89k17K16k01P1k2o1J77m3j73q7K48j43p3
3235a17q3N02m07J83J49m23J70K4J05j90L34n05K34k36L81p4J65K0k97J77Rm4
3257G7K90l74q6K81j35O6j42m5NJ66j05o1K63j99j04O3K4k19K03J20j93mL70k53
3281Hk69N12j09K01k21Nj9m6j20P1K90k72Jj07J42j72j9N6J43j18J48j34Po2q
3306i2K76k94j46M76q1l21R4j69m2L1L28j05J80j21J96k20J18p4k11J58ll1K62
3329B09k43J39k09o3OK3L42l05K04o9k02J74K81l36J46K56m72J20Np1J55j20q
3352c8R3j23L6O7j28M15k41q4O9L1q9J00n9k99K13j88P5j2k2Q0J11O4J3j23KJ65
$$ plain form
3187 213 309 373 28 86 47 -71 254 116 83 -45 119 -144 98 -11 -38 -19 262 -176 -224 -75 -17 -12 -199 133
3211 133 153 -160 -235 -102 41 -57 265 -109 -118 -198 191 -26 190 -11 60 38 -23 154 111 -62 -149 99 -44 -117
3235 -117 -200 302 -105 78 227 -196 -26 -2 103 -87 247 -258 -24 -260 121 47 212 232 -65 112 121 77
3257 77 367 -7 -93 188 53 119 -23 -68 -63 103 -2 -63 200 1 -103 -40 -16 -235 -32 88 -105 -109 261 8
3281 8 -261 251 142 343 122 127 108 62 -58 13 303 31 32 -75 67 -105 -124 -68 75 -43 105 -29 -22 -84 -92
3306 -92 184 -110 -256 220 139 -182 -88 -257 -299 -268 60 -45 135 14 210 -10 108 34 -177 -19 -22 -53 209
3329 209 -34 105 -104 -167 -161 -138 204 -101 103 34 -168 6 287 -49 97 353 -119 1 6 -65 90 -30 -38
3352 -38 55 -68 -32 35 -93 322 81 -3 66 97 8 108 49 -250 -37 -225 -150 -162 -184 -104 7 71 84 -39 -37 128
3378A28k45N4L42k75J61o6p3J5P3n0Q0j86m5r0M5R1k52J15J23p6jJ53k06J6K11
3403D2k79L40k22o8J55o9J5r0L32O7p4Qj92N8Q7o3j0j63J92P2j12k6m2R8N6l01
3429a89L42k3j04j34J22k04j66L79j57N3K98j76k66K84m2p7L06k41P0R6r2o0k24
3452b05P1N9L0r5j25L53k39L6K40l54K70j84J53j56J46j78k0J67J08J17j82m1
3474b9o5Q9q5L48n00K27J74j06R6J5q9L05n56N7J46q2J15q5j36K71j47r8j01J82
3498e4J1L1n0%K39j06m6m14K83K00k2P2j8j38pm4J14n2L7m7j50J86j00M3K5j40
3524a47j53R5rK48M2j09J52l36L36k8k30J98p4R6j33K44m41K08J04j01L22m10
3546a26o0K60k00p0J32k37M71k63K22q6L2j5k9Rr8R1o4j4J3%K61k45m2Q2J56k5
$$ plain form
3378 128 -117 -63 279 4 165 99 26 41 114 64 144 -42 -87 -177 -132 -41 -293 -178 -55 -131 -132 21 -185 -169 42
3403 42 -237 103 -119 -187 -32 -101 -86 -176 156 223 149 157 -35 23 110 47 37 -126 66 138 26 0 -42 56 112 -189
3429 -189 153 130 26 -108 14 -190 -356 23 -134 -81 217 41 -225 59 17 -60 246 5 75 171 79 19 -205
3452 -205 -134 -75 -45 -140 -265 88 -151 -115 125 -229 41 -143 10 -146 0 -178 -198 -31 77 194 12 -29
3474 -29 -94 -5 -90 258 -242 -15 159 53 149 164 75 380 -176 -119 27 -55 60 -25 -161 110 -37 -135 -236 -54
3498 -54 -43 -12 -62 -62 177 71 25 -389 -106 94 72 144 126 -12 -19 -63 51 -1 36 -11 -161 25 -75 -32 -7 -147
3524 -147 -300 -205 -214 34 76 -33 119 -217 119 91 -139 59 -15 81 -52 192 -249 -41 63 -38 284 -126
3546 -126 -186 74 -126 -196 -64 -301 170 -93 129 43 75 60 31 40 -58 33 -31 -45 -32 -32 229 -16 -58 24 180 155
3572A55j05J21l54K44j03K57j02j7m26M10j80K68j93J8O5k49j9L37j76M2J20j69
3594e6p2j83K28K93k36K10k91J34M1l%K34L0m62L4j0R4j01K67j86P9K8r7j35k
3619a62K97k61J44j33N9j4L52l53K56N9l30M04m32L43k68m2K13k9j10J14r2R1
3641A06J38r0p9p9K50j52k13J57q4J9k5j6l3J80q4Q6k2j60K6K00k75J19K2P5J36
3666B02j54N6k27QQL17m1k00Ln9K69k33j24K1j22J07J70j88J55j16n0M53j86O1
3690A30j10L1p8K2j68R5j3J38M0l50L53K7j9P7j39L0j95R5k13J21R6k4L8p5Q7
3715dk0j19J93k63N4J21K26n25N96m27N7K20J6j84L26k41LK42l96O5K5M1O6k3
3739D9j20p2K21m7J56k11j34K16j25r2m2M6K65K1k97K54m29L94J07L3m60L37L2
$$ plain form
3572 155 50 171 -183 61 -42 215 113 96 -330 80 -100 168 -25 -7 58 -191 -210 127 -49 -7 113 -56
3594 -56 -128 -311 -83 210 -26 184 -107 27 68 65 65 299 329 -133 -99 -109 -15 -116 151 -35 44 72 -25 -160 -162
3619 -162 135 -126 18 -115 -56 -70 282 -71 185 244 -86 318 -114 229 -39 -81 132 103 -7 107 15 106
3641 106 244 154 75 -4 246 94 -119 38 -46 -27 -52 -68 -101 79 -5 81 59 -101 -75 125 -150 -31 -9 66 202
3666 202 48 104 -123 -115 -107 210 169 -31 -28 -87 182 -51 -175 -154 -276 -169 1 -187 -32 -148 -198 255 69 130
3690 130 20 51 -27 -5 -173 -78 -91 47 87 -263 90 117 98 175 36 66 -129 -34 -247 -126 -30 -54 -16 -91 -4
3715 -4 -24 -143 50 -213 -159 -38 188 -337 259 -168 -111 109 125 -59 267 26 29 271 -125 -60 -35 6 72 49
3739 49 -71 -143 78 31 187 -24 -158 58 -67 -159 -201 -155 110 131 -166 88 -341 53 160 193 -267 70 102
3762A02J54j24J15P3rk02R7k18J66k49j38R9J57l36K73j00K71j40J9k2k09L7J87
3785Cn1j12P3J23j16m9J20L23l89J78L4j64J02m6n2j98K83M3j60J05p4j18K5J60
3809D3j39l5j51L28J3l18L58k85K17PJ64m44L80j30j11R4J27l9k9K69j57k96L
3832a31J80Q9j32j07N3q1l7K17m5j51j09M63r1l33M56j87P7j54m4J14p2J92j38
3855B9J07Kj75n8K97k25L2P4o9N6j21l1K4J73R8l49K43J1NP6m03n5M7lJ66j18
3881a67J71Q7K7l2k81P8K04k59J14J16N0r1q1K42j57o1k53L23J21k38J10k31n8
3904b66J33k3L64l93J44k53L73k65P7M05l92J75j70m7J3P1J32K5N6R0k35J46o2
3927I8m11L42j53J07J16j44J53p9q9j7Q5mL9Kj29O7Q9j18Q7J13j5k82J30J8J23
$$ plain form
3762 102 256 132 247 320 311 109 206 -12 154 -95 -233 -134 23 -313 -40 -140 131 -9 10 -12 -221 -184 3
3785 3 -48 -160 -87 36 -80 -129 -9 314 -75 103 137 -27 75 29 -23 -221 62 105 -55 50 -24 -142 -117 43
3809 43 -96 -131 -282 46 59 -259 99 -186 31 38 202 -242 138 8 -103 -9 118 79 50 319 162 -134 -131
3832 -131 49 138 6 -101 -48 -129 -166 51 6 -145 -254 209 118 -215 241 54 131 -23 -67 47 -25 167 29
3855 29 136 138 -37 -95 202 -23 9 83 14 70 -51 -82 -58 115 213 -136 107 118 123 199 -204 -259 -212 -215 -49 -167
3881 -167 4 91 118 86 -195 -117 87 -172 -58 58 108 17 -64 178 21 -40 -293 30 151 -87 23 -208 -266
3904 -266 -133 -156 208 -185 -41 -294 79 -186 -109 296 -96 79 -91 -138 -125 -54 78 103 159 249 14 160 98
3927 98 -313 29 -124 -17 99 -45 108 29 -60 -77 8 4 43 45 -84 -17 72 -46 41 154 139 -143 -13 5 128
3952A28J7j03j38m1K25o3m1k23Q2K46j58j34L61l46L27j55Q3k51L17J77j49j8
3974A43q5k04K63m7j60M8j7J74p4O6k94K54N8M2J5j64j29L2K5J29O4j56qJ19l64
3999b70K07J13K1j63O2m0J5j23Q5P4J14r2N4j08K42l72R5k20O3M0J47J08J01n2
4023A01o6o8J10K50m16j0O8j07l71M72Q2J81k44P7M6n4j39J33j0k48J42Q6j31
4046a16L5r5J22K28k66N0j05l3K20o5Q4J48l01LnK73j32p5l8n7J27J44q3l9j63
4071a39J32K07l36J93n3O4k40J38O7r3L57j77l3j04R3k47k8J55m9Q1R3q9J2k01
4095a97K19k03J11J89l68L48k41K86j23k37M57k80m4J23J04q3O4M3M7Jl55J31
4117hJ75l15J54ok24J35q3K51j74N7j73Q8P2R1m4r1p5K34n9M0L4Q7j13j04l8K9
$$ plain form
3952 128 145 42 -96 -137 88 25 -16 -239 -157 89 -69 -203 158 -188 139 -16 67 -184 133 310 161 143
3974 143 58 -146 117 70 -90 -42 -59 115 41 107 -187 67 125 167 182 18 -111 -79 -54 75 139 -17 -25 94 -270
3999 -270 -63 50 71 -92 -30 -70 -55 -178 -93 -19 95 3 57 -51 191 -181 -86 -306 -243 -203 -56 52 153 101
4023 101 35 -33 77 327 -89 -99 -31 -138 -509 -37 45 226 -18 59 105 51 -88 45 35 -213 -71 15 -116
4046 -116 -81 -176 -54 174 -92 -42 -147 -180 40 -25 59 207 -94 -91 -96 177 45 -30 -68 -125 2 146 63 24 -139
4071 -139 -7 200 -136 57 4 68 -172 -34 33 -60 297 120 87 -17 76 -171 -199 -44 -93 -12 81 -8 4 -197
4095 -197 22 -181 -70 119 -249 99 -142 144 21 -216 241 -39 -83 40 144 61 125 168 215 216 -139 -8
4117 -8 167 -148 6 0 -224 -89 -172 79 -95 -38 -211 -123 -51 40 -4 -95 -170 64 5 45 79 166 53 -51 -89 -60
4143f0o0L4J29Q5J33k03k29J20P4nP6n5k4J0pj56J82k38P3K97k32K5K3p9pL4j56
4170b16K61n11N42N7k07J74q3l02K24k0Q4j7j21O6J23o1J27K0k09j8n1j5K41j25
4194c7O7J2J6J54l12J55J72oj42k05J07ml0K89j97R3k65M3Q9LO9j57q0J88k19
4219a97K37N2NJ9k04Q3Q0nk32J39M2J04j81N1L6j38J3j89K52j0J48k29L72j80
4243F8j83N3j73Q0K22k09J73P6O3Ql16J54Jj37K28k02L6J21J2j81N7P6o3N0J72
4268A86j15r7K59l02R4k4Q6k76L6K9K73j68k27%K82K24l95j47K14pJ25m7L52l48
4292GO6j13n7M15l89K51j75N0j31N5J70k63j9J55P0P0j42r4j0j15K2L34k03J04
4316E8m0nJ28J91n27L57j83J03k1j82J68p0j36J90K0l37K25j56M26l48K61p9J65
$$ plain form
4143 -60 -120 -86 43 128 261 58 -171 -51 23 18 94 39 15 25 18 -138 44 -194 -121 176 -56 -31 -8 -87 -94 -60 -216
4170 -216 45 -466 76 133 -74 100 17 -285 -61 -81 3 -14 -135 -69 54 -7 120 140 -69 -87 -138 -153 88 -37
4194 -37 30 42 58 212 -100 55 227 221 79 -126 -19 -23 -53 236 39 132 -133 -90 -1 2 71 -86 -166 22 -197
4219 -197 40 92 97 116 -88 -5 75 70 -162 -23 19 123 -58 -7 29 -109 -96 -285 -33 -43 105 -124 248 68
4243 68 -115 -62 -235 -155 67 -142 31 107 170 178 -138 16 17 -120 108 -94 -58 63 75 -106 -49 27 -36 14 186
4268 186 71 -26 233 -69 25 1 87 -189 -153 -124 149 -19 -246 -246 36 260 -135 -282 -68 -75 50 3 355 7
4292 7 73 -40 -97 318 -71 180 5 55 -76 -21 149 -114 -133 22 92 162 20 -74 -84 -199 -177 157 -46 58
4316 58 18 13 141 332 -195 162 -21 82 61 -121 47 -23 -159 31 51 -286 -61 -217 209 -139 122 43 208
4339B08r6lj52L03j37l90L73j51j59l2J61j46J9K51j5J48l66M14k17j14K25k86
4361a62L07j19O7j26Q2LM4K4J34l23K73k15P9o9K7P5j0k71J33k7k3J63P9p1j37
4386f3K84n85J16K31oJ83m5k27K90l87L71k73q7L22j10m7o5J13j54J11R5n1j33
4409a17n1J76j31o2OK90l17O5J80K35n12N06l13K9p9J05j98J45j19K0K27k32L19
4432A72n9l11J19J89j61p4k4J94l3N8p8L7J80p4k73O8J98j11k17N6J94l8OlN9
4457G4l48J66q0L27o5j40J63j79J05o4Q4N7P0nk25j04J46j97J81M3m7n2N2r3J46
4482A5j0r6P2J69l59M61k56r4p5M9J80j75k9M6j27K06R5j94R0R5rk23R0J62k00
4507a17n5L13j6j52J5O4l1j4k7k18L77R3k16k86J53q5L29l6k47K69l96J67J74
$$ plain form
4339 208 112 109 -43 260 123 -267 106 -45 -204 -236 -75 -221 -202 49 34 182 -184 230 13 -101 124 -162
4361 -162 145 26 93 -33 49 52 96 120 254 -69 204 -11 68 -1 26 101 91 -180 -47 -74 -97 66 145 74 -63
4386 -63 221 -364 -248 -17 -23 160 115 -112 178 -209 162 -111 -198 124 14 -33 -98 15 -139 -28 67 16 -117
4409 -117 -168 8 -123 -185 -179 111 -206 -141 39 274 -238 268 -45 -16 -95 10 -188 -43 -162 -142 85 -147 172
4432 172 113 -198 -79 110 -51 -125 -149 45 12 70 -8 29 209 135 -138 -70 128 17 -200 -144 50 12 18 15 74
4457 74 -274 -108 -188 139 74 -66 97 -82 23 -41 43 100 170 165 -60 -164 -18 -215 -34 9 -38 -90 -38 -131 15
4482 15 5 -91 -19 150 -209 252 -4 -98 -173 -124 56 -119 -148 -102 -229 -23 72 -122 -32 63 54 -169 -79 83 -117
4507 -117 -172 141 125 -27 -12 52 21 7 -20 -238 139 232 16 -270 -117 -202 127 91 -156 113 -283 -116 58
4530E8j13o5N8J05l7jOj48J79n3L0Mm6j22K03j11J14r6j58P1K30K9j78O5J46k91
4556a21J88q8JJ45k24K36K8l96Q3o8n2J53R8n0J09mlp2J43j36j13K28j41n8L8
4581g6P0k1o6J01m0J15k0j82K47m08N04l11Q4q2l0L0K80m44M51k94o9K50j30Q2
4605D1J85m60Q4K39p3J72j56J00o2J16r9k07R9K28j28Q3j11j50R5K05j18l1j97
4628a45L2L42K2j84n2J69j77K03j07qk94M12m33R7K41k41K35j52P6j06MNk9j18
4652b08L26r9P3j65K31k70l0J86l3K7j23j40Q3Nl1J95k20j2J34P6Q0K6r2J35o3
4677I1j53J08k72R1L20k45q0L41j85J07j84J38J63j89k8j19J72j07p0K8J33j57
4699i7J49J1j18R2j04K10m6rn0k10o6M28j12M1j70J22k84L52j17J20m72J86L19
$$ plain form
4530 58 -55 -120 -62 43 6 5 11 -137 42 -11 19 23 -23 -145 58 -53 61 -35 -193 -122 108 137 -41 24 170 -121
4556 -121 67 -21 -20 125 -99 137 165 -231 -148 -216 -268 -115 -17 -67 42 38 35 -37 106 -30 -143 85 -56 -114 -76
4581 -76 -6 -27 -93 8 -32 83 63 -119 128 -280 224 -87 -3 -85 -115 -85 195 -249 202 -92 -161 89 -41 41
4605 41 226 -234 -150 89 16 188 32 132 70 186 87 -120 -21 207 79 162 51 -99 -4 201 83 52 -145
4628 -145 -113 229 251 67 15 184 7 210 103 95 -199 213 -220 -123 118 -123 112 -40 36 -70 -66 -61 -90 -208
4652 -208 118 19 92 -73 158 -112 -142 44 11 38 -85 -225 -142 -137 -168 27 -193 -205 -71 5 85 111 19 154 91
4677 91 -62 46 -226 -135 185 -60 -140 201 16 123 -61 77 240 51 23 -96 76 -31 -101 -73 60 -97
4699 -97 52 63 -55 37 -67 143 97 88 38 -172 -238 190 78 119 -51 71 -213 139 22 142 -330 -144 175
4722A75j34J05j98N8j43K05jj70J75j20J38M9k08J27K0j70J42J92l09J22J18j49
4744B4k46M7K54k01J74j46L17k66R1q4R6l42N39l35j1m5L64j62J48k13L9j13k3
4767i4J6K9mn1J24j79K36Q8j61m2P3p3j23j33M34l46J25J93j89n4J95K7k88K83
4791H6k22R2L41m47J73L6k61P5L36l6p9j39L9j75J17J31k42K06J23K9k46K81l65
4814a47qL65l6k43m2M50k69m1l49K58J91k26R1j75J64Q9J09J47m11l9j13K22l1
4837d4J82l1q4o6k48J39L03k95Q3O5J25q4j2J74k24K2j19m3K28k5P5k96L69j01
4861I3rk01L00j25l22K63m6J77k02o0K51L1k82L73j10KJ60l24J10L7MJ22j51m9
4885D2kp5J77j57J89k26J42k45M46k94j15L0J46l80J81J44O3k61K6M32k08j92
$$ plain form
4722 175 41 146 -52 6 -137 68 67 -103 72 -48 90 139 -69 58 78 -92 50 242 -67 55 173 24
4744 24 -222 -175 79 -122 52 -94 223 -43 48 -36 60 -282 257 -78 -89 -134 230 68 216 3 42 -71 -94
4767 -94 -78 -49 -53 -104 20 -159 77 165 4 -38 35 -38 -161 -294 140 -206 -81 112 -77 -131 64 91 -197 86
4791 86 -136 -44 297 -150 23 59 -202 -127 209 173 94 -45 -6 -181 -64 67 -175 31 154 183 -63 218 -147
4814 -147 -155 210 174 -69 -111 339 70 29 -320 -62 129 -97 -6 -181 -17 72 181 328 -83 -122 -235 -13 -44
4837 -44 138 107 23 -43 -291 -152 151 -144 -61 4 129 45 33 207 -17 5 -114 -157 71 46 121 -175 194 93
4861 93 84 -117 183 58 -264 -1 -47 130 -72 -132 119 150 -132 241 131 133 293 -31 79 116 120 242 91 42
4885 42 40 -35 142 -15 174 -52 90 -155 291 -3 -118 -88 58 -322 -141 3 66 -195 -169 263 55 -137
4907a37k5J81n0M5R3j95K15j20J33k77J52K02m29O19m77R1J6m8p1ll2J64j32J0
4931g5o3M31l03J24j03M1J67j61M4l41K92j03J18K1j24R9j06J51j31J83k22J03
4953D2j02j34j15L01K59k25J11j54KJ01k5l07N15m52n0J37O0%K91k86P3J19k35
4976g4j07J38N5K6J9o7O1M8j02p8J00k3n5K67j28j84O3j7M60l93J0j18J33J5K03
5001B52l59o8l1J37J23P7j69J08j01m4J51R2j54N3k6K11k93J62k25K29K17l08
5023C4L19k93K5j64j16Q9K9n1J75Jr8P2L18j99r5k8K6l5j89R8p1J61J55l13J00
5048e0k21L04j10J18Q4k68Q1J37J1l37o2O2N8K72j28l11K00J23J05j09j70KK29
5071B0J59l19j9J93O8j19q0N4j8K76m2j15N2j10J79p2m2r7o7L2K77rk92J7J31
$$ plain form
4907 -137 -162 19 -31 14 107 -88 127 7 140 -137 15 217 -212 407 -70 21 37 -11 -82 -85 -117 47 -85 -75
4931 -75 -138 293 -10 114 11 52 219 58 102 -239 53 -50 68 89 -35 64 -42 109 -22 161 -61 42
4953 42 -60 -194 -309 -8 251 26 137 -17 -15 86 61 -246 269 -183 -233 -96 -36 -36 255 -31 42 161 -74
4976 -74 -181 -43 12 38 57 -10 51 99 -3 -81 19 -4 -59 208 80 -104 -41 -58 402 9 19 -99 34 49 252
5001 252 -107 -175 -206 -69 54 131 -38 70 -31 -75 76 168 14 67 41 252 -41 121 -104 125 342 34
5023 34 353 60 85 -79 -195 -106 -77 -128 47 48 -50 22 340 141 46 18 44 9 -180 -82 -153 8 163 -150 -50
5048 -50 -271 33 -77 41 125 -143 -62 75 86 -251 -313 -251 -193 79 -49 -360 -160 -37 68 -41 -211 -209 20
5071 20 179 -140 -159 34 102 -17 -97 -43 -61 215 173 58 110 0 179 107 65 -32 -99 -67 210 201 -91 -74 57
5096E7k54K28M4k10O8N2r5R1K2j86q4J44M4o8j5R4j63K95J44l34J87r7K55k83
5120f4J75k71J01l8K08N6j52j52P0q9K12j3n3l07L03%P5O2p4q6Mp0M8M0r0K70
5146A65l73J82l7N6R8k0j27K5J02k68n2L18J1j5k20L84l19MM2k06J16P6k8L35
5170B49j70r8o0J74j23J58k31J03PJ43j18q0O4J17l71N6oL23j57N1j52Q4K4j98
5194b11J80J45M2k16J65j60j61m1L59l53L47Qm2k13J01M6J6j16LK47p5J70n53
5217c12L44j28r2Q0M6m5M7J29j07k1J63j63L24m73J50K74m08m3L3J83J6l03L92
5240H6jL53l44J0j37j17O4K0N1k7J72l40K19K04k72J79k28j4K86l55K88j86k2
5263a11R3P0p3L7j18L35n14K97j89L27k13J46k53M50k86m5Q3j86JK12K43j68j67
$$ plain form
5096 57 -197 31 75 -135 -67 -15 -110 -19 3 -183 -267 -123 -79 -147 -162 -68 -231 64 208 -126 61 -36 219 -64
5120 -64 111 -160 -59 -97 111 167 15 -137 -67 -156 56 43 -10 -317 -14 -14 61 123 49 -37 -33 -103 -55 -15 -105 165
5146 165 -208 -26 -63 -7 91 71 -56 -31 71 -197 -249 69 80 65 -155 229 -90 -86 -44 -250 -134 -58 -86 249
5170 249 79 -19 -79 95 -28 130 -101 2 9 152 34 -46 18 135 -236 -180 -186 137 -20 31 -121 -37 -13 -211
5194 -211 -31 114 156 -60 105 -55 -216 -257 102 -251 96 104 62 -151 -50 -4 12 -104 -101 146 71 241 -312
5217 -312 32 -96 -188 -108 -62 -107 -60 69 -38 -59 104 -59 265 -208 -58 216 -192 -235 -202 -19 -3 -306 86
5240 86 85 438 94 104 -33 -150 -86 -66 -15 -42 130 -210 9 213 -59 120 -108 -122 164 -191 97 -89 -111
5263 -111 -18 52 -21 16 -102 233 -281 16 -173 154 -59 87 -166 284 -2 -47 36 -150 -149 63 306 138 -29
5286b9j28J77O7m4Q4J4j80K13l02j39J46J35R4k29J15K56l41K04J65J6o83M73
5308H4j26J2j43L9L91j73J43o3k26K65k77R4q4J37k0L0k1k33j31M28k13p6Q4j53
5332b32K00Opk30K40k76J44O8j48J62Q4j6o6J15K8r2J04q5J19j22J02l7L0j84
5356i3K7J95j82j37K46k24J63M2k63L40m02J80J99k14j0N3J14k7M5j73M9l4Q9
5379a7M4k43J83l0J07k24M29n2j91Nj33K45r3k09J17K66m6k82M9J05K7j86J8k3
5403a34J16k7O9l0k7J41j12q4r3J88j82J46p8J19j59K88k12K6K72j22k36O2O2
5426gl7j32J19m0J33J01J24l90J45K17l24O0M3J48j76L87j77M2l90J86Mr2R5N2
5450I1k88K44Q2k2o3J58k09k31J66K8J86l73N53k98M8j32K71m42L00P9j01j71
$$ plain form
5286 -29 -157 20 87 43 127 141 -39 174 -128 -267 -121 14 108 -121 -6 250 -91 113 278 294 -389 84
5308 84 -42 -30 -173 -134 257 84 227 164 -62 203 -74 20 -64 73 53 83 62 -171 -302 126 -87 -163 -79 -232
5332 -232 -32 -26 -33 -263 -23 -299 -155 -87 -235 -73 11 -5 -71 44 72 -20 84 -1 118 -4 98 61 91 -93
5356 -93 -66 129 -53 -190 56 -168 -5 37 -226 114 -288 -108 91 -123 -133 -80 34 7 52 -121 -72 -106 -17
5379 -17 27 -216 -33 -63 44 -180 249 197 6 11 -122 123 30 -179 -62 204 158 -124 -75 30 57 -129 -111 -134
5403 -134 -18 -45 24 -6 -33 108 -4 -88 -181 7 -175 -29 -107 12 -147 141 -71 -45 227 105 -131 -69 -7
5426 -7 -44 -176 -57 -97 36 137 261 -129 16 233 -91 -31 12 160 -16 371 194 236 -154 32 36 -56 39 91
5450 91 -197 47 129 107 44 202 -7 -238 -72 -44 142 -231 322 24 72 -60 211 -231 69 148 47 -124
5472a24p9J01J45q1j61L33j26K11l31J21k47K63l95L85J06m29J48r5J20J85J62
5493B12m03K20M8op9K00k82L10q4k47P6J79k86j6J38ml9q8k2j84L20N3J98j71
5517D3K4j93N5k45L99k28P2J18jj11L6j06L1j8J99O1r1j65J69lj4P8k29J55o4
5542b8L8j89L21q2p1L5j77L1J40n0J43n4j08j14L20k42n4Q8RJ18J00j04M9l3m1
5567D5J23l33J00J84j74N8P7j70J34p7K74k92m9j39K3K21r3R3j60M38l46K38m8
5590A27j28r6j6K57r9n7k0J13J11l85K83N2r6k23Q2J80j26K10j83o4j13J04o2
5613a49J2J88Rn7k34J04O0N7J84Kk07K7R5Qj99K37j60O0k06M03k93K01j83j30
5637a71K05P2j04k8j72K34l54K35P7k65L77O3l54J82O4q2q5J42j63j05K04M6R8
$$ plain form
5472 -124 -203 -102 43 -38 -199 134 8 219 -112 9 -238 25 -370 15 121 -308 -160 -255 -135 50 212
5493 212 -191 29 77 71 -8 192 -90 220 136 -111 -35 144 -142 -158 -20 -24 -63 -151 -173 -357 -37 16 214 43
5517 43 67 -126 -71 -316 83 -145 -73 45 44 -67 -31 -137 -106 -124 75 136 45 -120 49 46 32 110 -119 36 -28
5542 -28 10 -179 142 60 -11 24 -153 -122 18 -32 111 57 -51 -165 155 -87 -141 -53 -44 74 174 70 119 86 45
5567 45 168 -165 -65 119 -55 3 80 -90 44 -33 241 -51 -100 -239 -216 5 -88 5 -155 283 -63 175 127
5590 127 -1 -97 -113 144 45 -12 -32 81 192 -193 90 142 46 -177 -95 85 -41 169 -14 -78 -191 -87 -149
5613 -149 -137 51 60 3 -231 -127 -67 -10 174 176 -31 -4 91 99 -100 137 -23 37 -169 234 -59 142 -41 -171
5637 -171 34 106 2 -26 -198 36 -318 -83 -6 -271 106 169 -185 -3 61 -21 -106 36 -127 -232 -28 18 116
5660A16j65Q3j64J61J08j77L3j55Q7k08J94O9J59k19L6J1O8K2Q7k03j77K78j68
5683a24K05j18j0Q7k4J01j20J98j14J44k12m3j63M29j67k79N9P4j02L30k21j60
5705b30N0J42m9K05l86L84j57l41K70K87l66J76j67N5K57J2j34k8J01j14M7j27
5727a13K66j28l2Nq1j00J95R0kj24J8m8J13k06J94p2k05K70j4k14J93J22l18J28
5751f3J24J39r6l01J63J02k10P0J72r7k41M22k15N0J6l8p2J19Kj79K58k06K55
5774A74k64L66j8n35K34J79l8j68K19k56J63l35K45M8q1m0J90l49L94j76O1J3
5796B6r1J81j56Q6k05o6J97p2K44q2n8j67J73j11r0j0k4K80k0N2j18J22l18K46
5820A9J11J79k72J87l81J31k50J3L54k01L4p0N9kq6L99l98j4M51m23Q4j59L64
$$ plain form
5660 116 -49 34 -130 31 139 -38 -5 -160 -73 -281 -87 -18 141 -78 -42 -31 37 59 146 -57 -234 44 -124
5683 -124 81 -37 -47 40 16 117 -3 195 81 225 13 -30 -193 236 69 -210 -151 -77 -179 151 -70 -230
5705 -230 -180 -38 -87 118 -268 116 -41 -382 -112 175 -191 -15 -182 -127 130 142 8 -20 81 -33 14 -113
5727 -113 153 25 -7 -2 -83 -183 12 102 100 -24 -6 -54 59 -147 47 -25 -230 40 26 -188 5 127 -191 -63
5751 -63 61 200 104 -197 -34 68 -142 -72 100 3 -238 184 -31 19 35 -3 -75 44 46 -133 125 -81 174
5774 174 -90 276 258 -277 -43 136 98 -70 149 -107 56 -279 -34 14 -67 -107 83 -266 128 -48 13 26
5796 26 -65 116 -40 46 -159 -225 -28 -100 144 62 4 -163 10 -101 -191 -201 -225 55 35 87 -31 91 -227 19
5820 19 130 309 37 224 -157 -26 -276 -263 91 -110 -76 -146 -87 -89 -175 224 -174 -188 263 -160 -76 -235 129
5843A29j63J8J72l86N2K24o9J65k44J40Ork08QK6k6J28q5J78l9k29L00l52K92
5867B8Qq9l8O2l4j85J64J67K16m64Nl5M62l0o9l34MJ35j71K93n8J1j77LJ64Q9
5893A27k72pR3j20J68m3J79j22J23j70r3K09k69K18j37R9j86L60k38K29j78K95
5915B65j97j22j4o4J8M2j86J87l0J25Q0j65J44q0j02j29K41j23J3J6J22k76P7
5938a58K24J08r4j96O4j9N5j7l4K91k18Oq9k8m8J8l4M01l79J24L6M5k37L27k88
5963a40L51l49M8J92K5l0j21P8J04k17N3rL3j64N2J82j75J8K5L46o9m81K55P0
5987G7L4j21l8j3K42r1J9j38j27OK46q5m42Q30o44L23o2J0l1k44M21k10p5J70
6011E7K8RL3l61K18Q5N3j78q7K18mK5j65k08L55j01k23K79j45p7J23M9J49m14
$$ plain form
5843 129 -34 -16 156 -230 -178 46 -23 142 -102 38 44 35 -173 -165 -139 -165 -37 -122 56 17 -212 88 -264 28
5867 28 36 -53 -91 -29 -63 -248 -84 83 299 -165 -160 -195 267 237 168 -166 -162 -27 -198 95 37 48 -129 -126 38 127
5893 127 -145 -152 -59 -179 -11 -54 125 3 126 -44 -137 72 -197 21 -116 -17 -203 157 -81 148 -30 265
5915 265 68 -54 -68 -132 -114 -72 -258 -71 -101 24 104 -61 83 3 -99 -228 13 -110 -97 -81 41 -235 -158
5938 -158 66 174 80 -116 -52 -71 -16 -33 -67 224 6 12 -77 -105 -153 -135 -169 232 -147 -23 13 58 -179 148 -140
5963 -140 211 -138 -90 102 127 97 -24 54 158 -59 -6 -15 18 -146 -94 88 -87 -69 -44 302 233 -248 7 77
5987 77 111 -10 -48 -61 181 90 109 -29 -156 -150 96 11 -431 399 -245 78 16 26 -5 -249 172 -38 -113 57
6011 57 85 94 127 -234 -16 69 122 -56 -143 75 71 96 -69 -277 78 -23 -246 33 -112 -189 -66 -17 132 -282
6035b82L53M3k26J15J06L1j94p0J99j9QK8j64j01K42k1r3J73K5L4l39J17l8J63
6059I0k91K44op8K4j70J26O3j06J71k60M2K10L7p1l75M92n8J20J05n11L42p9j46
6083h5K3J96k85J44K83k33j72J80k59o5Q3L64l11K89l43J22J33k22J25j47r7K42
6105c5j30J45k8J25J15l05L40k16Nn9J86j64k9K55j57j24K6N6J24k26o0K47j15
6128b4p9J82j61Q8r6J85p4J17j27P1j60N30m22l5m0K32k65N8k3mP9k1L0r3K79
6153B27k42j79m6L15J64k43J21k16R3J74r9l93K49Q2m4k8K5L0L2j41J09j03P5
6176c8O0L62n06P1P8N4k02J43k16K42P9k50J00j06K6RK06k34N3R0j9J96k77n2
6200a31J6K80m1j58K61k86J68r5N1J04k00j68J34R6l11MJ91P5J73k14J81l8l7
$$ plain form
6035 -282 71 114 -112 3 109 140 -54 -124 75 56 64 92 -72 -173 69 48 -45 128 153 187 -152 -35 -73 90
6059 90 -201 43 37 -41 -17 -187 -61 2 -104 67 -193 -151 59 96 25 -350 142 84 204 309 -202 140 61 -85
6083 -85 -62 134 -151 -7 276 43 -129 51 -208 -273 -190 174 -137 152 -191 -69 64 -158 -33 -180 -277 -35
6105 -35 -165 -20 -48 77 192 -113 227 11 16 -43 143 -21 -50 205 48 -76 -50 6 130 -96 -156 91 -24
6128 -24 -103 79 -82 6 -90 95 21 138 11 82 -78 452 30 -5 -45 187 -78 -20 -43 -47 32 11 41 -52 227
6153 227 -15 -194 -240 75 239 -4 117 -99 -6 168 69 -324 -75 7 -37 -65 -40 -10 22 -119 -10 -113 -38
6176 -38 22 384 -122 -51 27 81 -121 22 -194 48 127 -123 -23 -129 -103 -94 112 -122 -69 21 2 198 -79 -131
6200 -131 -115 165 124 -34 227 -59 109 14 65 169 -31 -199 -65 31 -280 -276 -85 -10 163 -51 130 92 55
6223E5j42QK18K6Kr7P0j02P3j93j13O9K09j03N4p7j0K56l78J80mJ83k01J06Pj90
6249i4K30j67m3l3k7P8N8q1l1l3n8L0L98k20J91j07k0K9Oj12R8j81m5K08l6j89
6275a51K43m4O1k11J19J5j76L31k23j45K62r4p3l9P1L62k53K26o03M14k05J64
$$ plain form
6223 55 -87 -79 139 165 167 70 140 38 111 -82 -195 -126 83 -20 34 -43 -53 203 -175 5 1 184 -17 89 96 -94
6249 -94 136 -31 -74 -107 -134 -56 2 -79 -110 -143 -201 -171 227 7 198 91 71 100 106 -6 92 -89 -134 74 38 -151
6275 -151 92 48 109 -102 17 32 -144 187 -36 -181 81 -13 -86 -125 -54 308 55 281 -322 92 -113 51
$$ [...]
8191a43
##END NTUPLES=NMR FID
##END=
