##TITLE=1H_Pr 58-C
 CDCl3,8 sc, 
 24.9.2021
##JCAMPDX= 6.0         $$ Bruker NMR JCAMP-DX V2.0
##DATA TYPE= NMR FID
##DATA CLASS= NTUPLES
##ORIGIN= UXNMR, Bruker Analytische Messtechnik GmbH
##OWNER= root
$$ XWIN-NMR		Version 3.5
$$ Fri Sep 24 13:21:46 2021 Russian Standard Time (UT+4h)  she@DPX200
##.OBSERVE FREQUENCY= 200.1314
##.OBSERVE NUCLEUS= ^1H
##.DELAY= (6, 6)
##.ACQUISITION MODE= SIMULTANEOUS
##.ACQUISITION SCHEME= undefined
##.AVERAGES= 8
##.DIGITISER RES= 18
##SPECTROMETER/DATA SYSTEM= spect
##.PULSE SEQUENCE= zg30
##.SOLVENT NAME= CDCl3
##.SHIFT REFERENCE= (INTERNAL, CDCl3, 0, 15.7039)
##AUDIT TRAIL= $$ (NUMBER, WHEN, WHO, WHERE, WHAT)
$$ ##TITLE= Audit trail, XWIN-NMR		Version 3.5
$$ ##JCAMPDX= 5.01
$$ ##ORIGIN= Bruker BioSpin GmbH
$$ ##OWNER= she
$$ F:/spectra/data/she/nmr/H-F/1/audita.txt
$$ ##AUDIT TRAIL=  $$ (NUMBER, WHEN, WHO, WHERE, WHAT)
(   1,<2021-09-24 13:20:40.45 +0400>,<she>,<DPX200>,
      <created by zg, POWCHK disabled, PULCHK disabled
       configuration hash MD5:
       00 E9 B6 7A A2 85 ED C7 34 08 36 98 17 FE 4E 26
       data hash MD5: 16K
       68 7C 78 D7 7C DB BB A1 E1 D5 FA C4 DC A1 0D 6A>)
$$ ##END=
$$ 
$$ hash MD5
$$ F8 63 62 1E 0C 92 63 55 0D 80 D8 C3 3A 41 3E 61
##$RELAX= 
##$RELAX= 
##$RELAX= 
##$RELAX= 
##$RELAX= 
##$RELAX= 
$$ Bruker specific parameters
$$ --------------------------
##$DU= <F:/spectra>
##$EXPNO= 1
##$NAME= <H-F>
##$PROCNO= 1
##$TYPE= <nmr>
##$USER= <she>
##$AMP= (0..31)
100 100 100 100 100 100 100 100 100 100 100 100 100 100 100 100 100 100 
100 100 100 100 100 100 100 100 100 100 100 100 100 100 
##$AQSEQ= 0
##$AQ_mod= 1
##$AUNM= <au_zg>
##$AUTOPOS= <>
##$BF1= 200.13
##$BF2= 200.13
##$BF3= 200.13
##$BF4= 200.13
##$BF5= 200.13
##$BF6= 200.13
##$BF7= 200.13
##$BF8= 200.13
##$BYTORDA= 1
##$CFDGTYP= 0
##$CFRGTYP= 5
##$CHEMSTR= <none>
##$CNST= (0..31)
1 1 145 1 1 1 1 1 1 1 1 1 1 1 1 1 1 1 1 1 1 1 1 1 1 1 1 1 1 1 1 1 
##$CPDPRG= <>
##$CPDPRG1= <>
##$CPDPRG2= <>
##$CPDPRG3= <>
##$CPDPRG4= <mlev>
##$CPDPRG5= <mlev>
##$CPDPRG6= <mlev>
##$CPDPRG7= <mlev>
##$CPDPRG8= <mlev>
##$CPDPRGB= <>
##$CPDPRGT= <>
##$D= (0..31)
0 1.2 0 0 0 0 0 0 0 0.06 0 0.03 0 0 0 0 0.0002 0 0 0 0 0 0 0 0 0 0 0 0 
0 0 0 
##$DATE= 1632475239
##$DBL= (0..7)
120 120 120 120 120 120 120 120 
##$DBP= (0..7)
150 150 150 150 150 150 150 150 
##$DBP07= 0
##$DBPNAM0= <>
##$DBPNAM1= <>
##$DBPNAM2= <>
##$DBPNAM3= <>
##$DBPNAM4= <>
##$DBPNAM5= <>
##$DBPNAM6= <>
##$DBPNAM7= <>
##$DBPOAL= (0..7)
0.5 0.5 0.5 0.5 0.5 0.5 0.5 0.5 
##$DBPOFFS= (0..7)
0 0 0 0 0 0 0 0 
##$DE= 6
##$DECBNUC= <off>
##$DECIM= 32
##$DECNUC= <off>
##$DECSTAT= 4
##$DIGMOD= 1
##$DIGTYP= 9
##$DL= (0..7)
0 120 120 120 120 120 120 120 
##$DP= (0..7)
150 150 150 150 150 150 150 150 
##$DP07= 0
##$DPNAME0= <>
##$DPNAME1= <>
##$DPNAME2= <>
##$DPNAME3= <>
##$DPNAME4= <>
##$DPNAME5= <>
##$DPNAME6= <>
##$DPNAME7= <>
##$DPOAL= (0..7)
0.5 0.5 0.5 0.5 0.5 0.5 0.5 0.5 
##$DPOFFS= (0..7)
0 0 0 0 0 0 0 0 
##$DQDMODE= 0
##$DR= 18
##$DS= 0
##$DSLIST= <SSSSSSSSSSSSSSS>
$$ [...]
##$SUBNAM2= <"">
##$SUBNAM3= <"">
##$SUBNAM4= <"">
##$SUBNAM5= <"">
##$SUBNAM6= <"">
##$SUBNAM7= <"">
##$SUBNAM8= <"">
##$SUBNAM9= <"">
##$SW= 20.0188988654967
##$SWIBOX= (0..15)
0 0 2 0 0 0 0 0 0 0 0 0 0 0 0 0 
##$SW_h= 4006.41025641026
##$TD= 16384
##$TD0= 1
##$TE= 0
##$TE2= 300
##$TE3= 300
##$TEG= 300
##$TL= (0..7)
0 120 120 120 120 120 120 120 
##$TP= (0..7)
150 150 150 150 150 150 150 150 
##$TP07= 0
##$TPNAME0= <>
##$TPNAME1= <>
##$TPNAME2= <>
##$TPNAME3= <>
##$TPNAME4= <>
##$TPNAME5= <>
##$TPNAME6= <>
##$TPNAME7= <>
##$TPOAL= (0..7)
0.5 0.5 0.5 0.5 0.5 0.5 0.5 0.5 
##$TPOFFS= (0..7)
0 0 0 0 0 0 0 0 
##$TUNHIN= 0
##$TUNHOUT= 0
##$TUNXOUT= 0
##$USERA1= <user>
##$USERA2= <user>
##$USERA3= <user>
##$USERA4= <user>
##$USERA5= <user>
##$V9= 5
##$VALIST= <valist>
##$VCLIST= <CCCCCCCCCCCCCCC>
##$VD= 0
##$VDLIST= <DDDDDDDDDDDDDDD>
##$VPLIST= <PPPPPPPPPPPPPPP>
##$VTLIST= <TTTTTTTTTTTTTTT>
##$WBST= 1024
##$WBSW= 4
##$XGAIN= (0..3)
0 0 0 0 
##$XL= 0
##$YL= 0
##$YMAX_a= 163014
##$YMIN_a= -208763
##$ZGOPTNS= <>
##$ZL1= 120
##$ZL2= 120
##$ZL3= 120
##$ZL4= 120
##$ABSF1= 10
##$ABSF2= 0
##$ABSG= 5
##$ABSL= 3
##$ALPHA= 0
##$AQORDER= 0
##$ASSFAC= 0
##$ASSFACI= 0
##$ASSFACX= 0
##$ASSWID= 0
##$AUNMP= <proc_1d>
##$AZFE= 0.1
##$AZFW= 0.1
##$BCFW= 1
##$BC_mod= 2
##$BYTORDP= 1
##$COROFFS= 0
##$CY= 11.3945322036743
##$DATMOD= 1
##$DC= 2
##$DFILT= <>
##$DTYPP= 0
##$F1P= 2.36226072786647
##$F2P= -0.459571619588291
##$FCOR= 0.5
##$FTSIZE= 0
##$FT_mod= 4
##$GAMMA= 1
##$GB= 0.15
##$INTBC= 1
##$INTSCL= 1
##$ISEN= 128
##$LB= 0.24
##$LEV0= 0
##$LPBIN= 0
##$MAXI= 10000
##$MC2= 0
##$MEAN= 0
##$ME_mod= 0
##$MI= 1.114404
##$NCOEF= 0
##$NC_proc= 0
##$NLEV= 6
##$NOISF1= 3.799351
##$NOISF2= 2.8
##$NSP= 1
##$NTH_PI= 0
##$NZP= 0
##$OFFSET= 15.70392
##$PC= 1
##$PHC0= -14076.96
##$PHC1= 14.60089
##$PH_mod= 1
##$PKNL= yes
##$PPARMOD= 0
##$PSCAL= 0
##$PSIGN= 0
##$REVERSE= no
##$SF= 200.130013532006
##$SI= 16384
##$SIGF1= 3
##$SIGF2= 2
##$SINO= 400
##$SIOLD= 16384
##$SREGLST= <1H.CDCl3>
##$SSB= 0
##$STSI= 0
##$STSR= 0
##$SW_p= 3612.71676300578
##$SYMM= 0
##$S_DEV= 0
##$TDeff= 0
##$TDoff= 0
##$TI= <>
##$TILT= no
##$TM1= 0
##$TM2= 0
##$TOPLEV= 0
##$USERP1= <user>
##$USERP2= <user>
##$USERP3= <user>
##$USERP4= <user>
##$USERP5= <user>
##$WDW= 1
##$XDIM= 8192
##$YMAX_p= 0
##$YMIN_p= 0
$$ End of Bruker specific parameters
$$ ---------------------------------
##NTUPLES= NMR FID
##VAR_NAME=  TIME,          FID/REAL,        FID/IMAG
##SYMBOL=    X,             R,               I
##VAR_TYPE=  INDEPENDENT,   DEPENDENT,       DEPENDENT
##VAR_FORM=  AFFN,          ASDF,            ASDF
##VAR_DIM=   8192,          8192,            8192
##UNITS=     SECONDS,       ARBITRARY UNITS, ARBITRARY UNITS
##FACTOR=    0.0002496,     1,               1
##FIRST=     0,             0,               0
##LAST=      2.0444736,     0,               0
##MIN=       0,             -208763,         0
##MAX=       2.0444736,     163014,          0
$$ Real data points
##PAGE= N=1
##DATA TABLE= (X++(R..R)), XYDATA
$$ [...]
1906F1K85l24L28l15J93J74k87J60q2j0j46L6%J10k30l2j60J39J65O6j75k09K99
$$ 61 346 22 350 35 228 402 115 275 193 183 37 73 73 183 -47 -79 -239 -100 65 131 -44 -253 46
1929D6n14M46M0j97J6k50K22K3r0N5P2Q4ml7N1o1n2k04N86k62k2K68l03M41m95
$$ 46 -468 -22 18 -179 -163 -413 -191 -168 -258 -203 -131 -47 -51 -88 -37 -98 -150 -354 232 -30 -52 216 -87 354 -141
1954a41Q2K56m1J06O6r9o8q6j8j72K99J59O9l56L48n9j96j05J07L2joQ4k07K7
$$ -141 -59 197 156 262 328 229 161 75 57 -115 184 343 412 56 404 345 149 44 151 183 182 176 260 53 80
1979H0J13r8k43K31r5J25o3qJ8m6J96j25j82Q8o8l44J11P0nj44M84l78J75o8N2
$$ 80 193 95 -148 83 -12 113 50 42 60 14 210 85 -97 -9 -77 -421 -310 -240 -245 -389 95 -283 -108 -176 -124
2004a24L86j34n1l18L28j98J72r6O5L6l20R3O9L42l09K71k20M07m6l02K96k34
$$ -124 262 128 77 -241 87 -111 61 -35 30 66 -254 -161 -92 250 -59 212 -8 399 353 51 347 113
2026A13N5j61J47j84l7J33O4j62J68j2j54o3K55k19lK3p6J09j26J3j2r4L17J9
$$ 113 168 7 154 -30 -67 66 130 -32 136 124 -30 -93 162 -57 -60 -37 -113 -4 -130 -117 -129 -223 94 113
2050A13j96O6N1J43J0L0l32k5j48J90K18L6j51K13l67j4J06j34J85J41j37j45
$$ 113 -83 -17 34 177 187 217 -115 -140 -288 -98 120 156 5 218 -149 -163 -57 -191 -6 135 -2 -147
2072a47K41Om6j90N6J24r8pl9j28j00J08J91J18j13R4k93K35n4k1OL9J01J07J7
$$ -147 94 100 54 -136 -80 44 -54 -61 -100 -228 -328 -220 -29 89 -24 70 -223 12 -42 -63 -57 -18 83 190 207
2097B07J31n5j93K79j59Q5j94K30k87KL33j35l40J49K94m39L16k17j02K66j13
$$ 207 338 283 90 369 210 295 101 331 44 46 379 244 -96 53 347 -92 224 7 -95 171 58
2118E8N3K3j89P1m1j52j2o5K93j80P0k52M7J10J66j70J27M8j57r4j20M48j8j21
$$ 58 111 134 -55 16 -25 -177 -189 -254 39 -141 -71 -323 -276 -166 0 -170 -43 5 -152 -246 -366 82 64 -57
2142e7J42k38J80K32j57J8M0N9J2k9l0j17O9L6J06l49L30J59l88k67L17o7J42
$$ -57 85 -153 27 259 102 120 160 219 231 202 172 55 124 160 266 -83 247 406 18 -249 68 1 143
2165A43k42R5k9J76j19J99m25J37n7L68l05rj43k8J79p8J45J75j71k35j20N38
$$ 143 -99 -4 -33 143 24 223 -202 -65 -122 246 -59 -68 -211 -239 -60 -138 7 182 11 -224 -344 194
2187A94j75J25P8l28N7q6O0P3O0l2J05j10k20J32n2J32K94l76M16j56k57j64J64
$$ 194 19 144 222 -106 -49 -135 -75 -2 58 26 131 21 -199 -67 -119 13 307 -69 347 191 -66 -230 -66
2210f6j29J39M9p7J37L44m64J01J92j84J54j43L0j18l18K37K45p8K89k99j08N0
$$ -66 -195 -56 -7 -84 53 397 -67 34 226 42 196 53 83 -35 -353 -116 129 51 340 41 -67 -17
2232a7Q4j04J03n7J63K10j99m31N36j87j93K68J0j77N0j59q0K64q7M1m8j89P8
$$ -17 67 -37 66 9 172 382 183 -248 288 101 -92 176 186 9 59 -100 -180 84 -3 38 -10 -199 -121
2255a21P5o8j07J93l2nk46K59R4j66P3J77j87P2k44J65K77l44k54M88j76o4K80
$$ -121 -46 -114 -221 -28 -60 -65 -311 -52 42 -124 -51 126 -61 11 -233 -68 209 -135 -389 99 -77 -141 139
2278A39j51J11k19R3l48M76K7m7j08L42k29j6Lj20K0P4K85m61L00j43J15O2q8
$$ 139 -12 99 -120 -27 -375 101 128 81 -27 315 86 70 73 -47 -27 47 332 -129 171 28 143 205 117
2301A17j17K53j30k11k71K01K36PM6j17j58J82k6M8k39k2N3J61k72L92m02K49
$$ 117 0 253 123 -88 -359 -158 78 85 131 14 -144 38 12 60 -179 -201 -148 13 -259 133 -269 -20
2323b0k47L47n8%J65j93K14m09L21j28k15L29n8q3o4QK56k60J71k26J35j98J24
$$ -20 -267 80 22 22 187 -6 208 -201 120 -8 -223 106 48 -35 -99 -91 165 -95 76 -150 -15 -213 -89
2346h9J74n8k7K44k07J21n4p1L0p0J42k64J9j27M05l00K52k13k7K28Oj15L10k06
$$ -89 85 27 0 244 37 158 104 33 63 -7 135 -129 -110 -237 168 -132 120 -93 -120 108 114 -1 309 103
2370A03m0OJ85j36j54k3Q8J42ok60J58J61k20J8j01K16k9j48L36k85J07m3k37
$$ 103 63 69 254 118 -36 -59 29 171 165 -95 63 224 4 22 -79 137 108 -40 296 11 118 75 -162
2393a62O9NJ26k97M14k96m7J34J47j35q1J23Nq7j25M6L10Q9k13k03J05k32P2L49
$$ -162 -93 -88 38 -259 155 -141 -188 -54 93 -42 -123 0 5 -82 -207 -161 149 238 25 -178 -73 -305 -233 116
2417A16r5k0L10l27R3j17K40j35J40k20k7P9M6p1j25K52k09J75m17L10Jj38J08
$$ 116 21 1 311 -16 77 -40 200 65 205 -15 -42 37 83 12 -113 139 -70 105 -312 -2 -1 -139 -31
2440c1m15L18N4j9k70J05L08K2n3l50K99J63j30l73K33K2J06J09j66R6J88n60
$$ -31 -446 -128 -74 -93 -363 -258 50 72 19 -331 -32 131 1 -372 -139 -117 -11 98 -68 28 216 -344
2462c44K47J5r9P3j32K28k1j32M5J87L5Q7k86J64R7N8j85k55L33k90O3k3r2Q7
$$ -344 -97 -82 -181 -108 -240 -12 -33 -165 -120 67 102 189 -97 67 164 222 37 -218 115 -175 -112 -135 -227 -140
2486a40Q7j33L06k60L11j62m2J0L58l34L0L1k24j0m5K89j19K05p5j21K36k89K29
$$ -140 -53 -186 120 -140 171 9 -33 -23 335 1 31 62 -162 -172 -217 72 -47 158 83 -38 198 -91 138
2509A38j93N7R3L2j40N6M3j75L70k37J87k25m09M68pN8j60K63k02K5k33J36Q3
$$ 138 -55 2 95 127 -13 43 86 -89 281 44 231 6 -403 65 58 116 -44 219 17 42 -191 -55 28
2532B8j90J32J03k08J49K8j73J79l00J49J23l5J1l3K31k59N4j95J08P0K29k92
$$ 28 -162 -30 73 -135 14 42 -131 48 -252 -103 20 -15 -4 -37 194 -65 -11 -206 -98 -28 201 -91
2554i1K31j8k08K58k17J82Nm8r8Q7K1k61R0PJ52n0j14Mn2N8m9j39M18jk64J48
$$ -91 140 122 -86 172 -45 137 142 94 -4 83 104 -157 -67 -60 92 42 -72 -68 -120 -62 -111 -250 168 167 -97 51
2580E1k43k9J17j15M17j22J20m2j23kL0l71K16J94p3lp3%O3j3j0k92L34N6J76
$$ 51 -192 -221 -104 -219 198 76 196 154 31 29 59 -312 -96 98 25 22 -51 -51 12 -1 -11 -303 31 87 263
2605B63l34j84K23K79m00J57P1M5O5n47M46k14J40K53Nm83RR1K11k18P8L5P7j55
$$ 263 -71 -255 -32 247 -153 4 75 120 185 -362 84 -130 10 263 268 -215 -206 -115 96 -122 -44 -9 68 -87
2629h7J64k51J41k66L36l9P0k03J35J42q9j19J61J4k81j52K71J55l13L20NJ9k51
$$ -87 77 -174 -33 -299 37 -2 68 -135 0 142 53 -66 95 109 -172 -324 -53 102 -211 109 114 133 -118
2652a18Q5J4k56N8k21L20Q6J94l29j5K21q9n9P0J13rN2j95L0o3J10N3j24J97l61
$$ -118 -33 -19 -275 -217 -438 -118 -32 162 -167 -182 39 -50 -109 -39 74 65 117 -78 -48 -111 -1 52 -72 125 -236
2677b36J56j91L9K37Po7L3j16R7N8m9l4K41j55r6K99k00o4J41j22J01J92m41M96
$$ -236 -80 -271 -232 5 12 -55 -22 -138 -41 17 -32 -66 175 20 -76 223 23 -41 100 -22 79 271 -170 326
2701C26m41L00j83lj10j94K50mJ57j15k81N33K0l23M8p4Q4K23l62J84j30J4K09
$$ 326 -115 185 2 -1 -111 -305 -55 -59 98 -17 -298 235 255 -68 -20 -94 -10 213 -149 35 -95 -81 128
2724A28k31J1r8O6L4rK17k52q2J64j50K16M6j72K21k52M41n38J87o1j59L21N8
$$ 128 -103 -92 -190 -124 -90 -99 118 -134 -216 -52 -202 14 60 -112 109 -143 298 -240 -53 -114 -273 48 106
2747A06l0j47L18j94K44j38j87m4J2K46o3j42L25k01j17q5J78K0J3k04ML10l48
$$ 106 76 -71 247 53 297 159 -28 -72 -60 186 123 -19 306 105 -12 -97 81 101 114 -90 -86 224 -124
2770a24K13q6j06J37j33M42l81l7L3k45J41n9K31K06k83j67M78l71j34K00K04
$$ -124 89 3 -103 34 -99 343 -38 -75 -42 -287 -146 -205 26 232 -51 -218 260 -111 -245 -45 159
2791A59j51J39k87L33k03J01j93K10j94j61K16o4J90k9k21J92j6j2J28m2j28J00
$$ 159 8 147 -140 193 -10 91 -102 108 -86 -247 -31 -95 95 66 -155 37 21 9 137 95 -33 67
2813F7m28M19j20j15K6k81N75q3O6j46n4K09k62j86J54n4L16k69N73m86r2J74
$$ 67 -361 58 -62 -177 -151 -432 143 60 126 -20 -74 135 -127 -313 -159 -213 103 -166 407 -79 -171 3
2835Ck06L04j80M41l80K27m1J81m74J62k07J42k00M36j3k81k4J80J62m09K57l69
$$ 3 -203 101 -79 362 -18 209 168 349 -125 37 -170 -28 -228 208 195 -86 -110 70 232 -177 80 -289
2857b89L21p8j0J43O5l13J07J23j98L11k38k40J10K92j14p5M9K27l82J11j56J22
$$ -289 32 -46 -56 87 152 -161 -54 69 -129 182 -56 -296 -186 106 -8 -83 -34 193 -189 -78 -234 -112
2879a12J8K93k5j02o7O8Ok27K13K21k84j73J03K20l72K62N3l4j35L6j44J55oM5
$$ -112 -94 199 174 72 5 73 79 -148 65 286 2 -171 -68 152 -220 42 95 61 -74 -38 -182 -27 -33 12
2903A2J6N7J65k27M1j14M8M0j58P4mP1j66k1O6m7L97m21K84l17J56J9L3m7J20
$$ 12 28 85 250 23 64 -50 -2 38 -120 -46 -50 21 -145 -166 -100 -147 250 -171 113 -204 -48 -29 4 -43 77
2928G7j52j1K09j3o1J29j14j31J69J15n00J77J05j23J65K01j64J32k54K86l2R3
$$ 77 -75 -86 123 110 49 178 64 -67 102 217 -283 -106 -1 -124 41 242 78 210 -44 242 210 303
2950C03k42l5o8J0j31J75RO8L3k43L35m21q9N41j78k52j56N60k96J17o6oJ55j91
$$ 303 61 26 -42 -32 -163 12 21 89 122 -121 214 -207 -296 245 67 -185 -341 219 -77 40 -26 -32 123 -68
2974f8L68m64J58j01R6j68L81k85J5j40o3J12k9Q4R0P4j26L36m95pJ7K14j70J19
$$ -68 300 -164 -6 -107 -11 -179 202 -83 -68 -208 -271 -159 -188 -104 -14 60 -66 270 -225 -232 -215 -1 -171 -52
2998e2L6J20k55K58m98N19l18J48K71N4l12K78j35k50N3p0K40N9l30J7M04j99
$$ -52 -16 104 -151 107 -391 128 -190 -42 229 283 -29 249 114 -136 -83 -153 87 146 -184 -167 237 38
3020C8l8r8K36M6j12k30L64k43J09k22Q7J59j38J03O6M3k52L34l27QP1r7j29N2
$$ 38 0 -98 138 184 72 -158 206 -37 72 -150 -63 96 -42 61 127 170 -82 252 -75 -67 4 -93 -222 -170
3044a70N6R1J15k28J87J61m08K36j72L44j99p2J93l35J98j40L4j36L15k78K22
$$ -170 -114 -23 92 -136 51 212 -196 40 -132 212 13 -59 134 -201 -3 -143 -109 -245 70 -208 14
3065A4Q2k4K9r8mn6J48J77l45J21j04k7j6K94r0L6n7M6K2l48K97Q0k99R9l9l40
$$ 14 96 72 101 3 -1 -57 91 268 -77 44 -60 -87 -103 191 101 137 80 126 148 -200 97 177 -122 -23 -62 -402
3091d02N24l48K27L00j48j59J86k00R6j44o4m7J22l4n2jr6J6R4O6j73M33j96N7
$$ -402 122 -226 1 301 153 -6 180 -20 76 -68 -132 -179 -57 -91 -143 -144 -240 -224 -130 -64 -237 196 0 57
3115E7j32J9k1M8K07k4l54J75J88q6j04K26j42j09kN9o5j53L02j77J03P8k69q8
$$ 57 -75 -56 -77 -29 178 154 -200 -25 163 77 -27 199 57 -52 -54 5 -60 -213 89 -88 15 93 -176 -264
3139b64M89j21m2lq8N2j08k34L63j1j27L49j85j32j02K36j04J90k29J91k3J02
$$ -264 225 104 62 59 -29 23 -85 -319 44 33 -94 255 70 -62 -164 72 -32 158 -71 120 97 199
3161A99l47p8L61M0j63Oj28R6J45l33K94J56o5l03p9L61j41q5Q0j45Q2J74j95
$$ 199 -148 -226 135 175 12 18 -110 -14 131 -202 92 248 183 -120 -199 162 21 -64 16 -129 -47 127 -68
3184f8M6J77O7l03R9O7J19m53J19k14K98P1q1J99k06Q8K7L6j27p5K31r2j77k99
$$ -68 -22 155 222 -81 18 85 204 -249 -130 -344 -46 25 -56 143 -63 25 52 88 -39 -114 117 25 -152 -451
3208d51L41K65J87p7l43p9J27P1N4j70K2K81l92J36O4J0K92k84j71o2K76j07Q8
$$ -451 -110 155 342 265 -78 -157 -30 41 95 -75 -53 228 -164 -28 36 46 338 54 -117 -179 97 -10 78
3231G8j0k38N8L08k26P7j46o3K17L5l89P1K43K64k92J21J07l34R8l0K31k29J02
$$ 78 68 -170 -112 196 -30 47 -99 -162 55 90 -299 -228 15 279 -13 108 215 -119 -21 -51 180 -49 53
3254E3j57J65j52L00k80q4N9J65j27K12m04K63m1p8m0q0k7K56J63k39N5j84L94
$$ 53 -104 61 -91 209 -71 -155 -96 69 -58 154 -250 13 -28 -106 -146 -226 -253 3 166 -73 -18 -202 192
3277A92k02J40j87k57M29k37J94j1j32J24Q0k7k02L26k00LL0k72K40k41O25l20
$$ 192 -10 130 -57 -314 115 -122 72 61 -71 53 133 106 -96 230 30 33 63 -209 31 -210 415 95
3299I5K9j39O4p0j36J97j34K7o6J13J99k79J6K41k05O6r5K29j21m2J09n1j87J01
$$ 95 124 -15 49 -21 -157 40 -94 -67 -133 -20 179 -100 -84 157 -48 18 -77 152 31 -11 98 47 -140 -39
3323c9Q9j24K43k10j3L40j15m8k63J51P6p2j05k3K32k8l38J10l2K08j50K5M6r1
$$ -39 50 -74 169 -41 -54 286 171 123 -140 11 87 15 -90 -113 119 91 -247 -137 -169 39 -111 -86 -40 -131
3347a31N44m86n2J04j06L20J5k83K25j30q6K04N1j48j34L42j89j20m4J91m5j17
$$ -131 413 -73 -125 -21 -127 193 208 -75 150 20 -66 138 189 41 -93 249 60 -60 -104 87 42 -75
3369g5J01k03M45m84m9l4L32o3o8K4j28O03l44Op5n3K79j37j45n7J17k65K40J53
$$ -75 26 -177 268 -216 -265 -299 33 -30 -98 -74 -202 401 57 63 -12 -65 214 77 -68 -125 -8 -273 -33 120
3393A20l77L86k07J06rk1k18J50q6J45J97l70J46J27Q5P6n9l32J44m3N1j34K78
$$ 120 -257 129 -78 28 19 -2 -220 -70 -156 -11 186 -184 -38 89 174 250 191 -141 3 -40 11 -123 155
3416A55j17j19J06n2K12lm9j13j81J86J9O7m2j72k3K76o7J95p4kl52J05N4j51
$$ 155 38 -81 25 -27 185 182 133 20 -161 25 44 111 69 -103 -126 150 83 278 204 202 -150 -45 9 -142
3440a42M1M03l45j02J67k21L23k33J81j10P1k62M46p9k46m0K32l22K90k4l32M08
$$ -142 -101 302 -43 -145 22 -199 124 -109 72 -38 33 -229 217 138 -108 -148 84 -238 52 28 -304 104
3462A04l34K17P0l7k12K61n7J45N4j40j1M6q1j18M7j84K10j89K39L60k89j25n8
$$ 104 -230 -13 57 20 -192 69 12 157 211 71 60 106 25 -93 -46 -230 -20 -209 30 390 101 -24 -82
3485h2K14n0R6j43q0K66r0k2l08M21k54Q6j22p8K66r4j76J80K4p3L64k25j91J96
$$ -82 132 82 178 35 -45 221 131 109 -199 222 -32 54 -68 -146 120 26 -150 30 54 -19 345 120 -71 125
3509A25K0J46j76k66K32j38J31q4J64K32n49K03k30Q0J40Q1%J4j80J00j87J98
$$ 125 145 291 115 -151 81 -57 74 -10 154 386 -163 40 -190 -110 30 111 111 125 -55 45 -142 56
3531E6j00k35M76j14o0k9k79M6%p0J04Q4K22k91m9M69k09j88J70q6L1j3R0o6J62
$$ 56 -44 -279 197 83 23 -6 -285 -239 -239 -309 -205 -121 101 -190 -239 230 21 -167 3 -83 -52 -65 25 -41 121
3556A21J75k04j91K8j62L78k87N58m27L5J11j09l1R7o9K10l23J32J2j95K00J27
$$ 121 296 92 -99 -71 -233 145 -142 416 -11 24 135 26 -5 92 23 233 -90 42 54 -141 59 186
3578A86j66m8k43J97J13JM9O5k03R7M3P7l52J95r5K23Rk55j4R0J91k31O5N7j85
$$ 186 20 -28 -271 -74 39 40 89 154 -49 48 91 168 -184 11 -84 139 148 -107 -121 -31 160 -71 -6 51 -134
3603a34K73j26R1j82O6Qk92L47l53L24l43K32j54L24K82n44O1K84P4J36m11m6
$$ -134 139 13 104 -78 -12 -4 -296 51 -302 22 -321 -89 -243 81 363 -181 -120 164 238 374 -37 -83
3625h3m4K06q9J20l19J27k9J49k70K37K08k52LM13l67j47P1q9J43Q2j20M8L1m6
$$ -83 -127 79 -10 110 -209 -82 -111 38 -232 5 213 -39 -36 377 10 -137 -66 -155 -12 70 -50 -2 29 -17
3649a7K56j71j10l25L82N0j10o0J37M9j74L04l7j70P9N7r5R5m8J04l75L53n1k5
$$ -17 239 68 -42 -367 15 65 -45 -105 32 81 -93 211 174 4 83 140 45 140 92 196 -179 174 123 98
3673I8L29m66J03K1j97o6L79l07Q3J53k5k42J40J33m76M99n81M56Q5l55L15r4
$$ 98 427 -39 64 85 -112 -178 201 -106 -23 130 105 -137 3 136 -340 159 -422 34 119 -236 79 -15
3695a5J43k36j31M6J78K3R7k03k29K35N1L02k71o8L25p6l96K49R8j49K86l01j56
$$ -15 128 -108 -239 -193 -15 8 105 -98 -327 -92 -41 261 -10 -78 247 171 -225 24 122 -27 259 -42 -198
3718a98O7K29r3k50K71p8J00k26K73K8j10k08K38l0j01K33k17K56l55K29j27l2
$$ -198 -131 98 5 -245 26 -52 48 -178 95 123 13 -195 43 13 -88 145 -72 184 -171 58 -69 -101
3740a01o4J12J15p0J79m5K3j52J56j61K70n84j10L64p2J50j71J31K19l78J80j92
$$ -101 -165 -53 62 -8 171 126 149 -3 153 -8 262 -322 -432 -68 -140 10 -161 -30 189 -189 -9 -201
3762b01L26K1o6J05l00L57k50k54N50k13m0Jk71K01r2j08j58K35J29p4j1l6K34
$$ -201 125 146 80 185 -115 242 -8 -262 288 75 35 36 -235 -34 -126 -234 -392 -157 -28 -102 -113 -149 85
3785H5k47J72j41J95k33J07J7JL9N4k2k76J67J69o6j28O0j27J70J39k6k91N6J29
$$ 85 -162 10 -131 64 -169 -62 -45 -44 -5 49 27 -249 -82 87 21 -107 -47 -174 -4 135 109 -182 -126 3
3809CKM6J61pk36j14J12M2J10j39K04m87L03q1J19r7l6J39j35J4P4P1l68J72J11
$$ 3 5 51 212 205 -31 -145 -33 9 119 -20 184 -303 0 -81 38 -59 -95 44 -91 -77 -3 68 -300 -128 -17
3834a7O3j67N2K6R0K9qL4Pm42M16k06lJ50o6K54k71RR9q6o4L8M03k02j7p6Qm9
$$ -17 46 -121 -69 -43 47 76 68 102 109 -333 83 -123 -126 24 -42 212 -59 -50 49 -37 -101 -63 340 138 121 45 53 4
3862Dj6j10J93j7o2J94k6m4k04m0J47m5j81J03J05j59J37J79j7j63n4J81j1l22
$$ 4 -12 -122 71 54 -8 186 160 116 -88 -128 19 -26 -207 -104 1 -158 -21 158 141 -22 -76 105 94 -228
3886b28M14j18KL5j66n1o0K11n23O17j72P2N8r5k3J4Ll21P24n79K22j20mJ66N3
$$ -228 186 68 70 105 -61 -112 -172 39 -484 133 -39 33 91 -4 -27 -13 -10 -331 393 -186 36 -84 -88 78 131
3911A31j36n2J8kL1n0j79J41L09m00K5kL02j48Q1j11j43K88l23Q0L44l8l25L10
$$ 131 -5 -57 -39 -41 -10 -60 -239 -98 211 -189 -164 -166 136 -12 69 -42 -185 103 -220 -140 204 166 -159 151
3935A51kl28kK03l15J33j20L40o5J94k5l76K16Q8M6l1m7j36p1J74l53J67L3J96
$$ 151 149 -179 -181 22 -293 -160 -280 60 -5 189 164 -212 4 92 138 107 60 -76 -147 27 -326 -159 -126 70
3959G0l0RJl30J93m3nm9oK24J28l19J84k17M36k98r2J05L33l49k5J52m3j8k15
$$ 70 40 49 50 -280 -87 -130 -135 -184 -190 34 162 -157 27 -190 246 -52 -144 -39 294 -55 -80 72 29 11 -204
3984b04R6R9R7J3j50K5R0j1j02O4J97l52P7M95l73M6j40J46j51LJ12j25m3Q7m1
$$ -204 -108 -9 88 101 -49 -24 66 55 -47 17 214 -138 -61 434 61 107 -33 113 -38 -35 77 -48 -91 -4 -45
4009d5J17K13l63J58l5j01R7N5j63O1J29k49K57J32q7j60N3N2m62K24j4kj00L41
$$ -45 72 285 -78 80 45 -56 41 96 -67 -6 123 -126 131 263 176 16 69 121 -341 -117 -131 -133 -233 108
4033A08Jl98K78K65k62j54q9L69q0l24J64M9K34k61j12j4j00N85m41L38k14P4
$$ 108 109 -289 -11 254 -8 -162 -251 118 38 -286 -122 -73 161 -100 -212 -226 -326 259 -182 156 -58 16
4055A6L3l00J43K65lr6j76M68m69o3K16k65N54k72k14K60j28J64j08k6N5K37l91
$$ 16 49 -251 -108 157 154 58 -118 350 -119 -182 34 -231 323 51 -163 97 -31 133 25 -1 54 291 -100
4078a00l9j7J05o2J60j65NMJ97j39N8M6m70N06j68K29j23K61l89o6J49j63n6M08
$$ -100 -139 -156 -51 -113 47 -118 -113 -109 88 -51 7 53 -417 89 -79 150 27 288 -101 -167 -18 -181 -237 171
4102A71k88L99k71j5j53P1O8j07lK01j35o3K39k80J99j75K93r7J27J57n82K46
$$ 171 -117 282 11 -4 -157 -86 -18 -125 -128 73 -62 -125 114 -166 33 -142 151 54 181 338 -244 2
4124BP1l43K63j31m7M78l59J94j96j76M18j75J54o6K0j23J54M0l51K7kO4J03r
$$ 2 73 -270 -7 -138 -185 293 -66 128 -68 -244 174 -1 153 87 107 -16 138 178 -173 -146 -148 -84 19 10
4148A0j3j74K42J00j36j49K16j51K2L0J24j43j44J62j82J07K07j21k11K63K27
$$ 10 -3 -177 65 165 29 -120 96 -55 -33 -3 121 -22 -166 -4 -186 -79 128 7 -204 59 286
4169B86j69R8k55PP2M9J7k91K39k9J14k49J77o7J6o5l7l68P75m60J18j45J75j18
$$ 286 117 215 -40 -33 39 88 105 -186 53 24 138 -111 66 -1 15 -50 -87 -455 320 -140 -22 -167 8 -110
4193a10J72l01L88J64q5R8l33rj15j07O9Q1L53k03m1Q3j78J42j8m91N60k35J3
$$ -110 62 -239 149 313 228 326 -7 -16 -131 -238 -169 -88 265 62 21 104 -74 68 50 -441 119 -116 -103
4216a03K04j54p5K09q9k34L85p6k13k6M67j86L5j29P9k97J81j9Q5K26k51k59M81
$$ -103 101 -53 -128 81 -8 -242 143 67 -146 -172 295 109 144 15 94 -203 -22 -41 44 270 19 -240 241
4239B41k96N4r4N3J04J00p0O9j97M9Mj35J30LqP8k49J43K11k41N7K9p7kL15m77
$$ 241 -55 -1 -95 -42 62 162 92 161 -36 13 17 -118 12 15 7 85 -164 -21 190 -51 6 35 -42 -44 271 -206
4265b06L78L9k84P1R9m7N3l30M45k67M2J54k24J38mK3j56K20l90J29J06J99k61
$$ -206 172 211 -73 -2 97 50 103 -227 218 -49 -7 147 -77 61 57 80 -76 144 -246 -117 -11 188 -73
4288g3K13k22K73j65R3p9r1J11j00q5P3J02O2K6k73J68k08l9J6K11k20J20R9L
$$ -73 140 -82 191 26 119 40 -51 60 -40 -125 -52 50 112 138 -135 33 -175 -214 -198 13 -207 -87 12 15
4312A5J35j41j29L20k07j09K25N2l43k1K40J91k49j53L96k58j6L9L19l64O5J40
$$ 15 150 9 -120 200 -7 -116 109 161 -182 -203 37 228 -21 -174 222 -36 -52 -13 306 -58 7 147
4334A47j36J43j49n4j62L25l39J80n3K34J86l46J02m26N23l41K45qj20N4J38j85
$$ 147 11 154 5 -49 -211 114 -225 -45 -98 136 322 -24 78 -348 175 -166 79 71 -49 5 143 -42
4356d2j60J35J80k00J41q7K05k69KJ34J54j75j93J52K64l72L48k29j34K24p0j5
$$ -42 -202 -67 113 -87 54 -33 172 -97 -95 39 193 18 -175 -23 241 -131 217 -12 -146 78 8 -7
4378gk19M6L55k6j74k4j3R6l48N63j51k70L08l5r5K25k38m2J78N5p3J95l32j70
$$ -7 -226 -180 175 149 -25 -49 -62 34 -314 249 98 -172 136 101 6 231 -7 -49 129 184 111 306 -26 -196
4402a96K11j11K53j94J00J57q9k71K43o3j46J08o3J55K4q3n7l8k9K87j61J18j51
$$ -196 15 -96 157 -37 63 220 131 -140 103 40 -106 2 -61 94 118 35 -22 -60 -89 198 37 155 4
4425Dj0l9J22k08K12P8k45k0J56j17l4L5L38k03k61K49O9j29j53K5R4J1j4K22
$$ 4 -6 -45 77 -131 81 159 -86 -106 50 -67 -101 -66 272 69 -192 57 126 -3 -156 -131 -37 -26 -40 182
4449A82j71K61j90k43L65l39m9N11l00K28m0rk75J42Q6kj69j42J62P3o9n4k49
$$ 182 11 272 82 -161 204 -135 -184 327 27 255 215 206 -69 73 159 157 -12 -154 8 81 12 -42 -291
4472b91K57K3K7p4P1J65j40J15N7k16L2p5N7l39O3K86M2k45J30J18J21k16K95
$$ -291 -34 -11 16 -58 13 178 38 153 210 -6 26 -49 8 -331 -268 18 60 -185 -55 63 184 -32 263
4495B63k79J6j14L4o9M4J29J29k78K58j71n7K78l17j4Q9j76J29L1J03O3k28J82
$$ 263 -16 0 -114 -80 -149 -105 24 153 -125 133 -38 -95 183 -134 -148 -59 -235 -106 -75 28 91 -137 45
4518D5o1L7O1k55O0k34M89P4l03K36k07k16K42P6o5J08q3R2o6J64j53j63J50J36
$$ 45 -16 21 82 -173 -113 -347 142 216 -87 149 -58 -274 -32 44 -21 87 4 96 30 194 41 -122 28 164
4542A64l12K15j96PL85r7p7j72N6P1j7J35l02J67j30J52p0r4K19j07lKo0O3K1
$$ 164 -148 67 -129 -122 263 166 89 -83 -27 44 27 162 -140 27 -103 49 -21 -115 104 -3 -6 -4 -64 -1 20
4567B0J24m87M34k79J60JJ8L07l08j27M94m54N3j21K9K16k9L5j54j4Q4p6J40k38
$$ 20 144 -343 91 -188 -28 -27 -9 298 -10 -137 357 -97 -44 -165 -136 80 51 86 -68 -82 2 -74 66 -172
4591a72J28K78k25K2j60j08L35k02J40K2J7o0j2J49k41J26j72O7J87K72j64k00
$$ -172 -44 234 9 31 -129 -237 98 -104 36 58 75 15 3 152 -89 37 -135 -68 119 391 227 27
4613B7n0m6N9j80J37J85q0r1R5n2j19K13J01k49l5K02k79K16n2l6Q8N2k20K72
$$ 27 -23 -69 -10 -190 -53 132 52 -39 56 4 -115 98 199 -50 -85 117 -162 54 2 -34 54 106 -114 158
4637A58n07L40J48l16N9P6o6K97l58J82J0p3j08J53L63m29J96nj60J16%k52J23
$$ 158 -349 -9 139 -177 -118 -42 -108 189 -169 13 23 -50 -158 -5 358 -71 125 120 -40 76 76 -176 -53
4660e3L31l49K28k33J84j30r3J50P7k53J41J4q5NJ44k49J68l57N89m34J04K96
$$ -53 278 -71 157 -76 108 -22 -115 35 112 -141 0 14 -71 -66 78 -171 -3 -360 229 -205 -101 195
4682A95l00K29l14J00OR8L91k37j61P2k27J1j6K82m8k80J93J33j57mK52m19L8
$$ 195 -105 124 -190 -90 -84 14 405 168 7 79 -148 -137 -153 129 81 -199 -6 127 -30 -34 218 -201 -163
4705a63M2J65J69l15J41j19LK47k16O6j81K23p4J10j98J17Q5k33J40k49K97J70
$$ -163 -121 44 213 -102 39 -80 -77 170 -46 20 -161 62 -12 98 -100 17 102 -131 9 -240 57 227
4727B27j75p5o7J01J34j67k7L41m8k77M7j08P6o1L00k93j84J70J54K30m68J01
$$ 227 52 -23 -90 11 145 -22 -49 292 244 -33 14 -94 -18 -79 221 -72 -256 -86 68 298 -170 -69
4749f9QQ4M6m14K97P3o3p3K91o6j89j22N13l68K10j28k5L7j6j43qJ45l2N5l78
$$ -69 -61 23 69 -345 -48 25 -38 -111 180 114 -75 -197 316 -52 158 30 5 42 26 -117 -125 20 -12 43 -335
4774c35N61k12K88o14M33k32J48j74M42l42j92J46K23j77r8M9J16K4n1Q7n8J88
$$ -335 226 14 302 -312 121 -111 37 -137 305 -37 -229 -83 140 -37 -135 -86 30 54 3 90 32 220
4796B20N4r6m24K59m0k02J73j18J03k5L47k24k89M61k25J65k54k0J80J31j56n7
$$ 220 274 178 -246 13 -27 -229 -56 -174 -71 -96 251 27 -262 199 -26 139 -115 -135 45 176 20 -37
4818c7J45j88K23l54K42K28m64O8L0L01l11O1M3j69R5M2jO9R5l71K58L09k36k11
$$ -37 108 -80 143 -211 31 259 -205 -137 -107 194 -117 -56 -13 -182 -87 -45 -46 23 118 -253 5 314 78 -133
4842a33q7M26j76q6M3R9j80J71l2j57j3l4K44k42J23l1m0K24m5J15l34Q7J27j28
$$ -133 -220 206 30 -56 -13 86 -94 77 45 -112 -125 -159 85 -157 -34 -65 -105 119 74 189 -145 -58 69 -59
4866e9O4J13j68K31j27j48K21j1Q9o4j85M4J90m69L28j18J5J17j12J79r3jl93
$$ -59 5 118 -50 181 54 -94 127 116 205 141 -44 0 190 -279 49 -69 -54 63 -49 130 37 36 -357
4889c57L93K22j03j47M2rNo6j19J08j36J5K50J1j91r3J84J0j62K05o1j02M64n29
$$ -357 36 258 155 8 50 41 46 -20 -139 -31 -167 -152 98 109 -82 -175 9 19 -143 62 1 -101 363 -166
4913a66L48l65K71j63J40j74j25K38j47J90k31M10J48j1l11j42K66r9l94J67J14
$$ -166 182 -183 88 -75 65 -109 -234 4 -143 47 -184 226 374 363 52 -90 176 77 -317 -150 -36
4934c6K48j03L3k30l5Q4Q7l35K11J91j15j41J94m2K7j01k8k6L04j20N7m1p6k47
$$ -36 212 109 142 -88 -123 -39 48 -287 -76 115 0 -141 53 11 38 -63 -91 -117 187 67 124 83 7 -240
4958b40K10K96j61k65K81K5j78K32k51j35n3K76P6J80o1j71k28j01K89j12J9J28
$$ -240 -30 266 105 -160 121 146 -32 200 -51 -186 -239 37 113 293 232 61 -167 -268 21 -91 -72 56
4980E6m6j33L00j38k15O2J30j95J65j29J10J07P1k59M51j20l07k2L41l66K63k26
$$ 56 10 -123 177 39 -176 -114 16 -179 -14 -143 -33 74 145 -114 337 217 -90 -112 229 -137 126 -100
5002a00k9J48j30NJ65j15J4J36J06m1l21J92J27p5l16R9L91k18Q2r3n5j10J38
$$ -100 -129 19 -111 -106 59 -56 -42 94 200 159 -162 30 157 82 -234 -135 256 38 120 27 -28 -138 0
5025@K8j02K01j06nj31K40J63l52j56K50o3o0M8j4J4J07j31p5Q7K53j48Q5m02
$$ 0 28 -74 127 21 16 -115 125 288 -64 -220 30 -33 -93 -45 -59 -45 62 -69 -144 -57 196 48 133 -269
5049b69K91J51P3m33J89K78n09J17L91k10l81L98K6O6M8k29P0j63k04L27J30m2
$$ -269 22 173 246 -187 2 280 -229 -112 279 69 -312 86 112 178 226 -3 67 -96 -300 27 157 115
5071A15k94J21q8J76k87L30l0K2k49J17K66j87J61k5m02L16j03m4N5L39m18J57
$$ 115 -179 -58 -146 30 -257 73 43 65 -184 -67 199 12 173 148 -254 62 -41 -85 -30 309 -109 48
5093D8j33M3J49j51j22O2L3N8l4L8L3j94J89J01j55j81K38J05j52k7J15r9J10
$$ 48 -85 -42 107 -44 -166 -104 -71 -13 -47 -9 24 -170 19 120 -35 -216 22 127 -25 -52 63 -36 74
5116G4j2k14qK36K74m50p8K83m67L70p1j60N1K60k03J35OJ8j04k28K56n7l7r7
$$ 74 62 -152 -160 76 350 -100 -178 105 -362 8 -63 -223 -172 88 -115 20 26 44 -60 -288 -32 -89 -126 -223
5140b23K38J77l02K67j01N7q1q4J38J49Kk77J87l78J32l9J9R2nJ08j86L14p5o6
$$ -223 15 192 -110 157 56 113 32 -52 86 235 237 -40 147 -231 -99 -138 -119 -27 -32 76 -110 204 129 63
5164F3N5k46m4J61N6Q0l59K97N0J7j71O9NJ36J39m46J37j39JJ00k5K19j57J75
$$ 63 118 -128 -172 -11 45 125 -234 63 113 130 -41 28 33 169 308 -138 -1 -140 -139 -39 -64 155 -2 173
5188A73j27qr3j54L23k15L16k99K50j85mP4j25K21j69R5l5K06l79L58j60j64j56
$$ 173 46 38 -55 -209 114 -101 215 -84 166 -19 -23 51 -74 147 -22 73 38 244 -135 223 63 -101 -257
5211b57L54J6j15k99M25K4k76L21l90K46k48L72j53j07k8J61J5r3NP6J85m11J39
$$ -257 97 113 -2 -301 124 148 -128 193 -197 49 -199 173 20 -87 -115 46 61 -32 -27 49 234 -177 -38
5234c8J78nk11J37j31J15j06j57L65k36J6K2K9L2j49L63Q2k35k4j49J57J28k41
$$ -38 140 135 -76 61 -70 45 -61 -218 147 -89 -73 -51 -22 10 -139 224 306 71 47 -102 55 183 -58
5257e8L7r9Q5O1J1m0L8J55k44N2j77j00M05j87R2N5p8Mj82J56Jn7O2k88L50o1
$$ -58 -21 -120 -35 26 37 -3 35 190 -54 -2 -179 -279 126 -61 31 86 8 12 -170 -14 -13 -70 -8 -296 54 -7
5283gL8m9j60K78r2j75j1Q1J95J86m14J72J39m17L04j68n1r3M33K36l83J25N9
$$ -7 31 -18 -178 100 8 -167 -178 -97 98 284 -130 42 181 -236 68 -100 -151 -244 189 425 42 167 226
5306B26j42l64L28K18p5j03k21j8K67k41K48k52L22k09j01j9K32l7j17K32k88
$$ 226 84 -280 48 266 191 88 -133 -151 116 -125 123 -129 193 -16 -117 -136 96 59 -58 174 -114
5327a14L43l42J12j81J61K32k08j84N5L27j51J19r5N0L8k91m2L86k26j76J15J0
$$ -114 229 -113 -1 -182 -21 211 3 -181 -126 201 50 169 74 124 162 -129 -171 215 -11 -187 -72 -62
5349f2%MK66j90P9r6l93K53L4L71j86k79J55o2J93n4j52R5J30j56J03k37K08O8
$$ -62 -62 -58 208 18 97 1 -392 -139 -105 266 80 -199 -44 -106 87 33 -119 -24 106 -50 53 -184 24 92
5373I2L5k39J24j17K75k27N4Oj3J10Kk42L99r4j98L2j23K39JO3k81m6J94l5O4
$$ 92 127 -112 12 -105 170 -57 -3 3 -10 100 102 -140 259 165 -33 -1 -124 115 116 179 -102 -148 46 11 75
5398G5J37k61j5j0K05k25L6J6J8L1l6k2r0K20l43L18l0j9k6r0P0j84J65L8K0k85
$$ 75 212 -49 -64 -74 131 -94 -58 -42 -24 7 -29 -51 -141 79 -264 54 24 5 -21 -111 -41 -225 -60 -22 -2 -287
5424b87P0K39n8r9P3R7j36p1J60l7Q7j3J70j48K15k08j47j32L58j62j64K58j49
$$ -287 -217 22 -36 -135 -62 35 -101 -172 -12 -49 38 25 195 47 262 54 -93 -225 133 -29 -193 65 -84
5447h4l3q1K77k75N5K23j52j2O8l6L01o5l07K12R7q4J41m28R8O0L0o6M4J77j83
$$ -84 -117 -198 79 -196 -141 82 -70 -82 -14 -50 251 186 -121 91 188 104 245 -183 -85 -25 5 -61 -17 160 -23
5472b3j18J97O2k53J99j41J2j23J93L01j47j71j05Q2J26nK7p0r0R3N0p0j09J56
$$ -23 -141 56 118 -135 64 -77 -65 -188 5 306 159 -12 -117 -35 91 86 113 43 -47 46 96 26 -83 73
5496G3L9L6j38j29K91l09M81l84M79n72J24K7m3j28l9J23J18M3n32M74k99K62
$$ 73 112 148 10 -119 172 -137 344 -40 439 -133 -9 18 -25 -153 -192 -69 49 92 -440 34 -265 -3
5518cLK70j48k45K63p6k1l8l68L68n8j25J23n4J2p9L40k61J40k90K49j64L26j57
$$ -3 0 270 122 -123 140 64 43 5 -363 5 -53 -178 -55 -109 -97 -176 164 -97 43 -247 2 -162 164 7
5542Gj87L1J89K6k41J86J6K20j56l86L00L23m82L77o88L10k38N99j95k7m8k4J18
$$ 7 -180 -149 40 66 -175 11 27 247 91 -295 5 328 -154 223 -465 -155 -393 206 11 -16 -64 -88 30
5565C0l6j27p2K12J38J65k18o8r5J42j31k03L24R9j24J38l61L06k15Q5k00j0L29
$$ 30 -6 -133 -205 7 145 310 92 24 -71 71 -60 -263 61 160 36 174 -187 119 -96 -11 -211 -221 108
5588A08k84M32l09K32o5j35K71k51R4r4j68Q8M7M4J78r5k71L14l09L73l10n5N69
$$ 108 -176 256 -53 179 114 -21 250 -1 93 -1 -169 -81 -34 10 188 93 -178 136 -173 200 -110 -165 404
5611D04m42K35q9N4l11J57R2j17k23L38jl18L69j82J1k8J91j81J13J0j54j7j18
$$ 404 -38 197 108 162 -149 8 100 -17 -240 98 97 -221 148 -34 -23 -51 140 -41 72 82 -72 -89 -207
5634b07N73p05L80J05k03O8K41k56j40M59l78J26m3K40m61J00K80Q2k48R4m13
$$ -207 366 -339 41 146 -57 11 252 -4 -144 315 -63 63 20 260 -201 -101 179 261 13 107 -306
5655c06K45J64l92M64j65k68L33j34j13K64M7k20O5J1k74L25p7PJ87P4o8j28M7
$$ -306 -61 103 -289 175 10 -258 75 -59 -172 92 139 -81 -16 -5 -279 46 -31 -24 163 237 169 41 88
5678H8k12r1J07J7p7J40J50p0K6J47j79N7l31J58J05j60L82k16J38l0j32m6J69
$$ 88 -124 -215 -108 -91 -168 -28 122 52 78 225 46 103 -228 -70 35 -125 257 41 179 149 17 -29 140
5701A40k85K52P9k14j15O1K34j82K19j84J55k87OJ3Q5j13r3J66L4P4K91k68J3
$$ 140 -145 107 186 -28 -143 -82 152 -30 189 5 160 -127 -121 -108 -23 -136 -229 -63 -29 45 336 68 81
5724H1j73r8nK51Qj06J61j67L72l13j49O4j24K03R8l35L70P1l01j46M30l24R7
$$ 81 -92 -190 -195 56 64 -42 119 -48 324 11 -138 -74 -198 5 103 -232 138 209 -92 -238 192 -132 -35
5747c5J56o7j29j71K35p5PQ8Q8l36L40j05p3j35O4K14k31L41j98rLM25m24l07
$$ -35 121 54 -75 -246 -11 -86 -79 9 97 -239 101 -4 -77 -212 -148 66 -165 176 -22 -31 -28 397 -27 -334
5771c34J25L82l28J76r6J8Q6j37J56j99K8P9K09k18nQ5j7RK36O2k93j05J25j5
$$ -334 -209 173 -155 21 -75 -57 29 -108 48 -151 -123 -44 165 -53 -58 27 10 19 255 317 24 -81 44 29
5795B9l46K32rJ55L9M8P6k51R6L25j28l27K2j46R0M7P6J39l68K8J0n6J72K99l37
$$ 29 -317 -85 -94 61 100 148 224 -27 69 394 266 -61 -39 -185 -95 -48 28 167 -201 -173 -163 -219 -47 252 -85
5820h5J03l22M69j67j63J17M5K01l98K2J77J83l55K11m2l17M23j70k18M86m17
$$ -85 18 -304 165 -2 -165 -48 -3 198 -200 -178 -1 182 -173 38 -4 -321 102 -68 -286 200 -217
5841b17O4l3K83r6J12K4k65J99J45l72P8K43o2l47N69m74N5j66K00K1L31k01p8
$$ -217 -153 -186 97 1 113 137 -128 71 216 -156 -78 165 103 -244 325 -149 -94 -260 -60 -39 292 91 13
5864A3qk41J47J14j66K48Q2j75m9j96P6J6n6K58N7k13J51J7k40P0k6J6K87l4l6
$$ 13 5 -236 -89 25 -141 107 189 14 -35 -231 -155 -139 -195 63 120 -93 58 75 -165 -95 -121 -105 182 148 112
5889A12j6j32R2j2k92J91R6q4M05o35M11J4j12j19j82K41K07k12j3L8M8q9r1R4
$$ 112 96 -36 56 44 -248 -57 39 -45 360 -275 136 150 38 -81 -263 -22 185 -27 -40 -2 46 -43 -134 -40
5913d0J57j62R2q6L61m14J08J28l14L3K08j30N2J63q4J72m00J97l04j38L44J15
$$ -40 117 -45 47 -39 322 -92 16 144 -170 -137 71 -59 -7 156 72 244 -156 41 -263 -401 -57 58
5935E8o4J0J43k01L03l01j35N2J51J39k58M2j09J47j89J60J31j42K01J63m03K24
$$ 58 -6 4 147 -54 249 -52 -187 -135 16 155 -103 -61 -170 -23 -212 -52 79 -63 138 301 -102 122
5957A22Rj21J0J97k16n7j9J08p2J41j94Q4L4j94L72k3j57p5J04n1j24m9J29k07
$$ 122 131 10 20 217 1 -56 -75 33 -39 102 -92 -8 26 -168 204 181 24 -51 53 2 -122 -171 -42 -249
5981b49R7J96j16q2M2rL94k83q8J73k16J0K87j05P5J1n1j94J09K59l97K51M3r5
$$ -249 -152 44 -72 -154 -112 -121 273 -10 -98 75 -141 -131 156 51 126 137 86 -108 1 260 -137 114 157 62
6005F2q5J81J16O2m74K76o5J02Rl78L38j30K9l8k02J52qk29K72o5J87k15J35j26
$$ 62 -23 158 274 336 -138 138 73 175 184 -194 144 14 43 5 -197 -45 -53 -282 -10 -75 112 -103 32 -94
6029i4J30j62J71j42J93l35K39K8j6K6o6J42k60J18j69K53L1N2k15q9L31j47r5
$$ -94 36 -126 45 -97 96 -239 0 28 12 38 -28 114 -146 -28 -197 56 87 139 -76 -165 166 19 -76
6052g6J04j39j1J59Q1l57J18K05o0J82J54k50j65K56l79M00m08J85K20j93J6J84
$$ -76 28 -111 -122 37 118 -239 -121 84 24 206 360 110 -55 201 -178 222 -186 -1 219 26 42 226
6074B26j62j7p4qK18l51K09J44l04K33k63K32j64m8L85m71R0K40q5K29j64K9j47
$$ 226 64 47 -27 -35 183 -168 41 185 -119 114 -149 83 -81 -129 256 -215 -125 115 30 259 95 124 -23
6097b3j18Q2J08K51j37o5j59O8J89l40P1p0l4L37j23J24j12P6n0p6K04l23N7J36
$$ -23 -141 -59 49 300 163 98 -61 7 196 -144 -73 -143 -177 160 37 161 49 125 75 -1 203 -120 -63 73
6121G3J7j19M7K12j79j52j5J21j57K70J1J75l88K99k40J83j21qn2k52L15j04J62
$$ 73 90 -29 18 230 51 -101 -116 5 -152 118 129 304 -84 215 -25 158 37 29 -23 -275 40 -64 98
6144I8j69J99n6jk05J28l4J11j52J85k00J34M1k54R1L9j0j89J39j14J39j40K69
$$ 98 -71 128 72 71 -134 -6 -40 71 -81 104 -96 38 79 -175 -84 -45 -55 -244 -105 -219 -80 -220 49
6167D9Q1L9n1l9n1k41Q7j73P3J73O5K03k43N1j46L6M2r4Q3O0k48N9K34K89k46
$$ 49 130 169 118 79 28 -213 -126 -299 -226 -53 12 215 -28 23 -123 -87 -45 -139 -56 4 -244 -185 49 338 92
6192I2k09J57j66J1j30J95j04r3M07k7J8k34K36j18K08j11K1j70K60m91nO3J94
$$ 92 -117 40 -126 -115 -245 -50 -154 -247 160 133 151 -83 153 35 243 132 153 -17 243 -248 -253 -190 4
6215Dm8kl2J31k19Q9J29J06nq7j5N5k25kK78j62J51j14M4k65K21R8j76L08m43
$$ 4 -44 -46 -78 53 -166 -77 52 158 153 66 51 106 -119 -121 157 -5 146 32 76 -189 32 130 -46 262 -181
6240a81O9J75K5p4k00K56l28M66j16j72K18k78j69RJ33J92m84P62m34J0J74R3
$$ -181 -112 63 88 14 -186 70 -258 208 92 -80 138 -140 -309 -300 -167 25 -459 303 -131 -121 53 146
6262A46k07j40J81R2l6l22K08L9P2j75j48L28j5R0k40K51k26o0K97k41J27j62
$$ 146 -61 -201 -20 72 36 -286 -78 -39 33 -142 -290 38 23 113 -127 124 -102 -162 135 -106 21 -141
6284a41R0M9K65j94n3j75P54n77k0O7k83M04j32L7j01J02j85M1l3K06N3k90rO1
$$ -141 -51 -2 263 69 16 -159 595 18 -2 65 -218 186 54 91 -10 92 -93 -52 -85 121 174 -116 -125 -64
6308f4K06k5k45K70q6J07k27R5m4o8O7R7k0k71J65K10j61Q1Rj44N9p9Q7j54K96
$$ -64 142 117 -128 142 56 163 -64 31 -13 -81 -14 83 63 -208 -43 167 6 87 96 -48 11 -68 19 -135 161
6333A61k46M5N6J6K21n9l29L54k18p7%M0k4K03k43L63l22L36k97j84J22k10K51
$$ 161 -85 -40 16 32 253 194 -135 219 1 -76 -76 -36 -60 143 -100 263 -59 277 -20 -204 -82 -292 -41
6356d1K3q4J93k22K9K09k0o2oM7j01r0J16J8q7N6K29j71J3r3J03L2r2K50k78M2
$$ -41 -18 -102 91 -131 -102 107 87 25 19 66 -35 -125 -9 9 -78 -22 207 36 49 -44 59 91 -1 249 -29 13
6382A3k4k24L96j84j52L85K0j12k25J63j46Ol4R9j5Mk7J0J88k15J65p7k75M30
$$ 13 -11 -235 161 -23 -175 210 230 118 -107 56 -90 -84 -118 -19 -34 -30 -57 -47 141 -74 91 14 -261 169
6406A69j75nj78j42M64q6k11L06k36J2K27k51K09k72J41L9J15r3j9k15K98j40
$$ 169 -6 -11 -189 -331 133 47 -164 142 -94 -82 145 -106 103 -169 -28 11 126 33 14 -201 97 -43
6428d3O8J73k32n9K45l03L26j23q7M1o5M00l82L5j87L50l23J47p5K58k49M50k89
$$ -43 25 198 -34 -93 152 -151 175 52 -35 6 -59 341 -41 -6 -193 157 -166 -19 -94 164 -85 365 76
6451G6k37K76o5l24N56k33k38P8j16K37j9j26L38j52r9J00j03j06OJ50p5K92n02
$$ 76 -161 115 50 -274 282 49 -189 -111 -227 10 -9 -135 203 51 -48 52 -51 -157 -151 -1 -76 216 -286
6474b86J28J81k10M01k31j1L9j54L8K15JJ10j81J47l43R9J71j28l74M53j21K57
$$ -286 -158 23 -187 214 -17 -28 11 -143 -105 110 111 221 40 187 -156 -57 114 -14 -388 65 -56 201
6496B01q9k77L76k22k7J92j34K95l66k8M90n68K59m9j54J38R1k72j0R8j30L33
$$ 201 112 -165 211 -11 -38 154 20 315 -51 -79 411 -157 102 53 -101 37 128 -144 -154 -56 -186 147
6518A47j22p5K58j56k8P3j33J77k41K09j24O0Q4r0K19j28j78Q9l6J1n7L7j20R7
$$ 147 25 -50 208 52 24 97 -36 141 -100 109 -15 45 129 39 258 130 -48 41 5 16 -41 -4 -124 -27
6542b7M4k9l6J20M6j99j38O9J09K28k39J32r1Q1o7K6K08l88L85o0j91j71m2M72
$$ -27 17 -12 -48 72 118 -81 -219 -150 -41 187 -52 80 -11 70 3 29 237 -151 234 174 -17 -188 -230 242
6566B42j87k3J79j76J1j52J71K6j45K59q4j73J53j86J31J83P1l72l0R2K38l23
$$ 242 55 32 211 35 46 -106 65 91 -54 205 121 -52 101 -85 46 229 300 -72 -102 -10 228 -95
6588i5K15k59r0K07j8R7j14k27R1J14R5J8J03L7n06K82J41L11m45L80k30j86J48
$$ -95 120 -139 -229 -22 -40 57 -57 -284 -193 -79 16 34 137 174 -332 -50 91 402 -43 337 107 -79 69
6611F9j16rrK3L38l26j18L97m57L36k07J59k02J61J8p3jj18M08l73N7L0J15k87
$$ 69 -47 -56 -65 -42 296 -30 -148 249 -208 128 -79 80 -122 39 57 -16 -17 -135 273 -100 -43 -13 102 -185
6635a85K04j06K0n6L18k18j44O8j00J95K43j04j95J61l57L67m7j92K01k12K62
$$ -185 19 -87 -67 -123 195 -23 -167 -99 -199 -4 239 135 -60 101 -256 111 64 -128 73 -139 123
6656A23j0k93J32NpK3j42K41k61L89r2q6q1k60L89l29j7M53j58R1k66K60p9k46
$$ 123 113 -180 -48 -43 -50 -27 -169 72 -189 200 108 22 -59 -319 70 -259 -276 177 19 110 -156 104 25 -221
6680b21L19j37j27J55K88l61J65j20L2N8j58l6K06K59k33j24k32J57m2J09J81
$$ -221 98 -39 -166 -11 277 -84 81 -39 -7 51 -107 -143 63 322 89 -35 -267 -110 -152 -43 138
6701A38R8j25J35k56J12M0k74K64l90N02l72J20K42j13R9k31KK3K6j16J7K47j29
$$ 138 236 111 246 -10 102 142 -132 132 -258 244 -128 -8 234 121 220 -11 -9 14 40 -76 -59 188 59
6724E9r4M9M7N1l24J07J12%J99l69l9J62k49N07l26J46J12oj20j82K45Pk84J16
$$ 59 -35 14 61 112 -212 -105 7 7 206 -163 -202 -40 -289 218 -108 38 150 144 24 -158 87 94 -190 -74
6748g4p6O2K40j08m7J6j11j31K53k6n2K25k19J29Mm5m4Q1J34j73L5j44Q3lK33
$$ -74 -150 -88 152 44 -3 13 -98 -229 24 -2 -54 171 -48 81 85 40 -4 77 211 38 73 -71 12 9 242
6773B42m07J91j74J83K36n93L24J77l92K27Q6l2P6l12J53J6j22j31K57j47J70
$$ 242 -165 26 -148 35 271 -322 2 179 -213 14 100 68 144 -168 -15 1 -121 -252 5 -142 28
6794B8j75L49n50M05Q7j24J30l43J55j90K05q3Q6Q6p4K7k27L44j44J56l28L71
$$ 28 -147 202 -348 57 144 20 150 -193 -38 -228 -23 -106 -20 66 -8 19 -208 136 -8 148 -180 191
6816A91L5k34K38k65O6l28M7L14P4l99P1j07L07Q1m0k19J75K38j28j39j4m2JJ17
$$ 191 226 -8 230 -35 31 -297 -250 64 138 -261 -190 -297 10 91 51 -168 7 245 117 -22 -36 -78 -77 40
6840D0q2P7k44J26J10K36l52K2J13P6r7o8rJ93p4j71J85O9O8j55K24k44J21k24
$$ 40 -42 35 -209 -83 27 263 -89 -67 46 122 25 -43 -52 141 67 -104 81 150 218 63 287 43 164 -60
6864f0K40m17K40M8q9J03l1j13P7O6j24J96l46P2J27MJ00p5j0J11m5j04L1K40
$$ -60 180 -237 3 51 -38 65 34 -79 -2 64 -60 136 -210 -138 -11 -7 93 18 8 119 74 -30 1 241
6888B41k52P2J55m4l37J87J36p6j89j54J55J37k02N9P8j37J29J48j23J95k00r
$$ 241 -11 61 216 172 -165 22 158 82 -107 -261 -106 31 -171 -112 -34 -171 -42 106 -17 178 -22 -31
6910c1j08J83r4J80j04R6m8j26P2k61K61k0K1R9r6j48Q6j18J57K48j44Q8o1j20
$$ -31 -139 44 -50 130 26 122 74 -52 20 -241 20 0 21 120 24 -124 -38 -156 1 249 105 193 132 12
6934A2J54k13J88j15J06k88K01R2l14K27K92k9j85p8P3j85J02j06J73k01K00j21
$$ 12 166 -47 141 26 132 -156 45 137 -177 50 342 313 128 50 123 -62 40 -66 107 -94 106 -15
6956a5K34k42K07j81j61M47j44l5N0j38j54o3P3J76L9o0J6K64n2k43J9M5J12n53
$$ -15 219 -23 184 3 -158 289 145 110 160 22 -132 -195 -122 54 93 33 49 313 261 18 37 82 194 -359
6980c59M82l02q5J86N1j28J83j48Q8k1J25J79m03L87l20L28k93jo4R2k02J45L98
$$ -359 123 -179 -264 -78 -27 -155 28 -120 -32 -53 72 251 -152 235 -85 243 -50 -51 -115 -23 -225 -80 318
7003C18l14o4NJ05L84l74J4J51n38O5K13n6K16l18K09n4J68k38L16L8m18mJ80
$$ 318 4 -60 -55 50 434 60 74 225 -313 -248 -35 -91 125 -193 16 -38 130 -108 208 246 -172 -176 4
7026Dp2K3j0J79P8k77J75k53K01K06j30Q0j1j68K4k12K19q4J96p0j90N4J54j13
$$ 4 -68 -45 -55 124 202 -75 100 -153 48 254 124 204 193 25 49 -163 56 -28 168 98 -92 -38 116 3
7050Ck84J98K70k48J58k41J12j89L49k48q4K61Rj68M6O4j98J46n1P0O4j34O6J52
$$ 3 -281 -83 187 -61 97 -144 -32 -221 128 -120 -204 57 66 -102 -56 8 -190 -44 -95 -25 39 -95 -29 123
7074A23oM7k47n6j14J69O5K24k37q8k26N23j12oj0L1p7M7j38Q1J86j37l41M89
$$ 123 117 164 -83 -139 -253 -84 -19 205 -32 -120 -346 177 65 59 49 80 3 50 -88 -7 179 42 -299 190
7098A90k09Nq8O2K76k01J54j54N0L6k70J12q9L1O9J24l52J97K64k40P5k43N22
$$ 190 -19 -14 -102 -40 236 35 189 35 85 121 -149 -37 -126 -95 -26 98 -254 -57 207 -33 42 -201 321
7121C21m80J71K76m03L3jJ2J92m6j78o3L43k3j26J23o1k16K5J58j19J21k03K2
$$ 321 -159 12 288 -115 -82 -83 -71 121 75 -103 -166 177 154 28 151 90 -126 -101 57 -62 59 -144 -122
7144a22J06P4k23N3j46J01K75j43l8M2j85J56Q4LN9r2M3j46j67L25K9J5n7j78
$$ -122 -16 58 -165 -112 -258 -157 118 -25 -63 -21 -206 -50 34 37 96 4 47 -99 -266 59 88 103 46 -132
7168a32L34J2m03L49k68K00j90k01L17k8k59K56OO2j14k30J61J07L02n05L26j52
$$ -132 202 214 -189 160 -108 92 -98 -299 18 -10 -269 -13 -7 55 -59 -289 -128 -21 281 -224 102 -50
7190e0j43R7K26k13N6J74p3j81J50Q7j17k62J74p1K59j03j43j45J76Q8J07j13
$$ -50 -193 -96 130 -83 -27 147 74 -107 43 130 13 -249 -75 -146 113 10 -133 -278 -102 -14 93 -20
7212b0k40R6P9j41K60l36K59J41j21R8k59L93p3j04k48J45j88Q5K47j37O0J07
$$ -20 -260 -164 -85 -226 34 -302 -43 98 -23 75 -184 209 136 32 -216 -71 -259 -174 73 -64 -4 103
7234A03J09j25K9k66K80K1j45K18J20m80J3J45j7j52K72Q8q6J44n26J76o9K33
$$ 103 212 87 116 -150 130 151 6 224 344 -136 -123 22 5 -147 125 213 127 271 -255 -79 -148 85
7256H5k05K71j38MJ41k03K3j05J90P3j99L46p4k70J09j35J48l5L04m21r6J73k13
$$ 85 -120 151 13 17 158 -45 -22 -127 63 136 -63 283 209 -61 48 -87 61 26 330 -91 -187 -14 -227
7279b27J69J4j1r0P7J1P6q2K2k9n0J4K33k27n9K77k03K9J89j72K07J1j37K3j67
$$ -227 -58 -44 -55 -145 -68 -57 19 -63 -41 -70 -120 -106 127 -100 -159 118 -85 -56 133 -39 168 179 42 65 -102
7304a02J37j00R9l8M7l75L75l3N2q4J4l1m5K33k57K69k18J1j63K85p4J79M9l64
$$ -102 35 -65 34 -4 43 -332 43 10 62 -22 -8 -39 -84 149 -108 161 -57 -46 -209 76 2 181 230 -134
7328a34K36L0j97J10o8l3K34k23J52%l45L87l59K84k23J17K55k91L42l83j81J76
$$ -134 102 132 -65 45 -23 -56 178 -45 107 107 -238 149 -210 74 -149 -32 223 -68 274 -109 -290 -114
7350a14J61J2K57l05j19P4j31J27Q2LJ01%j49k00L00p2K20k66J47n7J3j02j45
$$ -114 47 59 316 11 -108 -34 -165 -38 44 47 148 148 -1 -201 99 27 247 -19 128 71 84 -18 -163
7373a63K09j09qK94k56J22n1j90K97O9k10j09J59n2m7n8j1K58k67J89jpQ6j51
$$ -163 46 -63 -71 223 -33 89 38 -152 145 214 4 -105 54 2 -45 -103 -114 144 -123 66 65 58 144 -7
7397gL7KJ06l07P0O4J74j82J49j17M9J60j76j96K43j10n4j7K12M2j69n5L9j92
$$ -7 30 32 138 -169 -99 -35 139 -43 106 -11 38 198 22 -174 69 -41 -95 -112 100 142 -27 -82 -43 -235
7421b35m5L93n3j58J18k48J84O9l1k30K14J9K68j64k51J60k46L32J47k20J4N5
$$ -235 -280 113 60 -98 20 -228 -44 25 -6 -236 -22 -3 265 101 -150 10 -236 96 243 23 37 92
7443I2j02jq1l8J25j57M18j72p4O7k60K93k86K13M22k67j88J25M7q9k23J9k7J53
$$ 92 -10 -11 -92 -130 -5 -162 256 84 10 77 -183 110 -176 37 459 192 4 129 176 87 -136 -117 -144 9
7467IK0k60L28k11K77j07j9j20J71p8J13j5j3q0nO6j03n9j9n5K51j30P0j34k74
$$ 9 29 -231 97 -114 163 56 37 -83 88 10 123 108 95 15 10 76 -27 -86 -105 -160 91 -39 31 -103 -377
7492c77K61J18k11J97J01k61l12N44m1k40J92K09k64Q8j0J1j39P2k4K24k37J26
$$ -377 -116 2 -209 -12 89 -172 -484 60 19 -221 -29 180 -84 4 -6 5 -134 -62 -86 138 -99 27
7514B7J92k5q7l3k05K36n32L86j02J23J27k5J79k74J75j70k49K62L59n39J05K7
$$ 27 219 194 107 74 -131 105 -427 -41 -143 -20 107 82 261 -13 162 -8 -257 5 364 -175 -70 -43
7536d3j49J39J81l18L46j10j08M0J15l57K56l37L46j11J75O1pj23j23O5O7K24
$$ -43 -192 -53 128 -190 156 46 -62 -22 93 -264 -8 -345 1 -110 65 126 119 -4 -127 -62 5 229
7558B29j37l46L62O6k48k5K42j84K91j61j38k18J78N5p8L08j39OL9k08K43L7q2
$$ 229 92 -254 108 174 -74 -99 143 -41 250 89 -49 -267 -89 -34 -112 196 57 63 102 -106 137 174 92
7581I2k60L48j40N8J66J9k71J62n4l66J82J59J32m6k78N3o7P0J86K73n53J19R5
$$ 92 -168 180 40 98 264 283 12 174 120 -246 -64 95 227 181 -97 -44 -111 -41 145 418 -135 -16 79
7604G9r1J73k45K97j43l3J67n8r0l33M19l47J01K24J47j66l1j26K00j18p1K9J11
$$ 79 -12 161 -84 213 70 37 204 146 56 -277 142 -205 -104 120 267 101 70 -56 144 26 -45 -16 95
7627I5q1r5J23o5J35j33M3j59L19k35J28l85M32L9m77M44l9k27L4M07q1l94K55
$$ 95 14 -81 42 -23 112 -21 22 -137 182 -53 75 -310 122 161 -316 128 89 -138 -104 303 222 -172 83
7650H3r0j29J9J16nJ27L2l21L0J15K27J2j4L6l74J20j0j57L20l22qK46n3j17L50
$$ 83 -7 -136 -117 -1 -6 121 153 -168 -138 -23 204 216 202 238 -136 -16 -26 -183 137 -185 -193 53 0 -117 233
7675B33o7n9j67J88n2K08k17J58m1p0J08l76L8J80J23K43k32k37N4j15l3L32j76
$$ 233 166 107 -60 128 76 284 67 225 184 114 222 -154 -116 64 187 430 198 -39 15 -100 -133 199 23
7698B3Nj26J99P5k28L15k24k16L07j0m01K18K15k48J67K1K5j59j19K02Q3n2j23
$$ 23 28 -98 101 176 -52 263 39 -177 130 120 -281 -63 152 -96 71 92 117 -42 -161 41 124 72 -51
7721e1j10Q7J10lr1K60m14L93p4q5n3j37J51J47J8k32r9p5K64r4M8O0J0N5l2l5
$$ -51 -161 -74 36 33 -58 202 -212 181 107 22 -31 -168 -17 130 148 -84 -183 -258 6 -88 -40 20 30 85 53 18
7747A8k38L94q4l0k00K32j77J7J64j92J72r0K24j14k70N16j5m27K91k25q4pp2
$$ 18 -220 174 90 60 -140 92 -85 -68 96 -96 76 -14 210 96 -174 342 327 -100 191 -34 -118 -125 -197
7770a97R7M6J16j61p3M8K82j69j98L19J14K0m80L16j08Rm4J88r4j64K57j80l4
$$ -197 -100 -54 62 -99 -172 -124 158 -11 -209 110 224 244 -236 80 -28 -19 -63 125 31 -133 124 -56 -90
7793i0K66j78J44o6J31J21k68l88L84kJ5K7n4K12k80j20J39P8p3J2n9PO7r7L13
$$ -90 176 -2 142 76 207 328 60 -328 56 54 69 96 42 254 -26 -146 -7 71 -2 10 -49 -42 25 -72 241
7818B41j23l7k1k01o4K34j39RJ07Qj76J16l76N75n0j40M6j64p7K06J40Q9r5j98
$$ 241 118 81 60 -141 -205 29 -110 -101 6 14 -162 -46 -422 153 103 -37 9 -155 -232 -26 114 203 108 -90
7842i0K4N6J34q5k55M5K6M7K87j37m18J69K63K3r5l11J34J16K21k52K28r4R9l4
$$ -90 -66 -10 124 39 -216 -171 -145 -98 189 52 -366 -197 66 89 -6 -317 -183 -67 154 -98 130 36 135 101
7866A01k24L50J39k20k57K54l5j28J8k26N38k42k86K78M4qk06R5j73m9j0K67l00
$$ 101 -123 227 366 146 -111 143 108 -20 -2 -228 310 68 -218 60 104 96 -110 -15 -188 -237 -247 20 -280
7889b80K06K18l42K43k22j02Q9L05J09j2k77K44k3j59R0R9k9q6j0n6m6k30P1K05
$$ -280 -74 144 -198 45 -177 -279 -190 115 224 212 -65 179 156 -3 87 186 157 71 61 5 -41 -271 -200 5
7913EK73n94J77J37J47j89K1P6j7q7J23oj77K63j51J43k87J91O2l81K18K48mk26
$$ 5 278 -316 -139 -2 145 -44 -23 53 36 -51 72 66 -111 152 1 144 -143 48 110 -271 -53 195 191 -35
7937c5J1K88j31k42M3q3MK53o8j08J48k44M78k91j0R9j22j92L66j90J7Q0o8M9
$$ -35 -24 264 133 -109 -66 -149 -145 108 40 -68 80 -164 314 23 13 112 -10 -202 164 -26 -9 71 3 52
7961E2j95qK33k68K85q1k6j81M56k81N3kj16O0l2J80m5j60J61L7o9JQl22O4K52
$$ 52 -143 -151 82 -186 99 18 -8 -189 267 -14 39 37 -79 -19 -51 129 84 -76 85 122 53 54 62 -260 -196 56
7987E6k80K78k6j60J81j24K90m27P8R4J96nP3m41J88J23K03m48L06m54M01j34
$$ 56 -224 54 28 -132 49 -75 215 -212 -134 -40 156 151 224 -217 -29 94 297 -151 155 -299 102 -32
8009c2J5Q4qo0o9J56m2K7M3o55M92O2n7Q3k95J22L11l42J46P8j51K25k62K56j03
$$ -32 -17 67 59 -1 -70 86 44 71 114 -541 -49 13 -44 39 -256 -134 177 -165 -19 59 -92 133 -129 127 24
8034B4m0j19R9Q2R3j30K9p4K18j06l49P7L8N4P3j7K29l02K81k23K31m12P3J02
$$ 24 -16 -135 -36 46 139 9 38 -36 182 76 -273 -196 -158 -104 -31 -48 181 -121 160 -63 168 -244 -171 -69
8058f9L00l08p5K19j41J76k02J05j62L6j39M02rj55p3P6j24LJ5R5p9N03k85j34
$$ -69 231 -77 -152 67 -74 102 -100 5 -157 -121 -260 142 133 -22 -95 -19 -143 -140 -125 -30 -109 394 109 -25
8082b5J7K97l59M5o5J09J93k24J97l25o0M2R9L81l54m05M03N1k55J08J71m0J43
$$ -25 -8 289 -70 -25 -90 19 212 -12 185 -140 -200 -158 -59 322 -32 -437 -34 17 -238 -130 41 1 144
8105A44J42n49L62j91M58n23J74O3p2m5k82K34k6K60j02q2J08l15K15l9J33l56
$$ 144 286 -263 99 -92 366 -157 17 80 8 -37 -319 -85 -111 149 47 -35 73 -242 -27 -66 67 -289
8127b89J47P4Q3K8N7j78r1K06j23L2L2rk63M76m54N17j49q1j44J1M13l25L6J60
$$ -289 -142 -68 15 43 100 -78 -169 37 -86 -54 -22 -31 -294 182 -272 245 96 15 -129 -118 295 -30 6 166
8151A66J8l61K30J71l15J17j31J00j12RK13k35J91K20k15Q7j73O5p6Q1j3j45K14
$$ 166 184 -177 53 224 -91 26 -105 -5 -117 -108 105 -130 61 281 66 153 -20 45 -31 50 37 -108 106
8174A06O2l84K27N2q8j83J57J81k95K9p7M64k66J24j27Rk24
$$ 106 168 -216 11 63 -25 -208 -51 130 -165 -136 -213 251 -15 109 -18 -9 -233
8191b33
$$ Imaginary data points
##PAGE= N=2
##DATA TABLE= (X++(I..I)), XYDATA
0@%%%%%%%%%%%%%%%qJ6j6J6j6K4l2L2m0M8n6O4p2Q8j02J15j31J49j67J88k11K37
$$ 0 0 0 0 0 0 0 0 0 0 0 0 0 0 0 0 -8 8 -8 8 -8 16 -16 16 -24 24 -32 32 -40 48 -54 61 -70 79 -88 100 -111 126
37A26k66K97l32L69m09M55n04N57o16O80p49Q24r09J002j102J216j343J483j642
$$ 126 -140 157 -175 194 -215 240 -264 293 -323 357 -392 432 -477 525 -577 639 -704 779 -863
56h63J822k030K271k555K897l317L846m534N478o852R037j3071K2959r2546j31305
$$ -863 959 -1071 1200 -1355 1542 -1775 2071 -2463 3015 -3837 5200 -7871 15088 -77458 -208763
71b08763J74789J06160p6950o8841J02685Q6613k5525m1888J1803j5733k2211
$$ -208763 -33974 72186 -4764 -73605 29080 115693 90168 48280 60083 44350 22139
82B2139L3973M5143l1585l1217N5900O5985m1604q2885j1989L5507q718m0816
$$ 22139 56112 101255 69670 38453 94353 160338 118734 35849 23860 59367 50649 9833
94I833j7729J0855J8232J8533r039n1017l8161K0110J5257m6136m2829K8851M5404
$$ 9833 -7896 2959 21191 39724 30685 -20332 -58493 -38383 -23126 -69262 -112091 -83240 -37836
107c7836l394j6134O854l803j6739J1021J6493k8196k1745N2117O1728j5871l6836
$$ -37836 -41230 -57364 -50510 -54313 -71052 -60031 -43538 -71734 -93479 -41362 20366 4495 -32341
120c2341L0572M8119j7447m0243J0288L4224L861m395K0897J6362j0666l322J5352
$$ -32341 -1769 46350 28903 -11340 -1052 33172 37033 32638 53535 69897 59231 55909 71261
133G1261p685l7690j2580K8430J3074k5872j5984K0639J2309k2722k6867o289
$$ 71261 63576 25886 13306 41736 54810 28938 12954 33593 45902 23180 -3687 -9976
145i976k912j0243o153L70n71J663M775k706j0630o222k116l488j099N390N912
$$ -9976 -12888 -23131 -29284 -28914 -29485 -27822 -23047 -25753 -36383 -42605 -44721 -48209 -49308 -43918 -38006
160c8006N643J1523R251j510l054O637M708n417K40J5276J4019J329R40R221P236
$$ -38006 -32363 -20840 -11589 -13099 -16153 -9516 -4808 -10225 -9985 5291 19310 20639 21579 30800 38036
175C8036m121q156j417L839M97j498Q27L821K654k577o093r034q051k248j170
$$ 38036 33915 25759 24342 28181 28678 27180 28007 31828 34482 31905 25812 16778 8727 6479 5309
190E309n464p250p36N576J522o699j0205o617J005K529o423q758L661J4223L742
$$ 5309 -155 -7405 -8141 -2565 -1043 -7742 -17947 -24564 -23559 -21030 -27453 -36211 -32550 -18327 -14585
205a4585q307k745P158L978l859j472K405M023Q086R866J267n049L498J0948K307
$$ -14585 -22892 -25637 -18479 -14501 -18360 -19832 -17427 -13404 -5318 4548 5815 766 4264 15212 17519
220A7519r523l918R791R832l73n066J268N263K336m211p180n098O86M562L03p744
$$ 17519 7996 4078 13869 23701 23328 18262 19530 24793 27129 22918 15738 10640 11326 15888 16191 8447
236H447m915M606M097o990j1111l714K545J87m117l195q88K830K772j872p188
$$ 8447 3532 8138 12235 5245 -5866 -9580 -7035 -6848 -10965 -14160 -15048 -12218 -9446 -11318 -18506
251a8506l250M901M002l788m251M308Q030L343k141j404J680L382K754l43j093
$$ -18506 -21756 -16855 -12853 -16641 -20892 -16584 -8554 -5211 -7352 -8756 -7076 -3694 -940 -1283 -2376
266b376K364O501M566p16k618J853M286p0l777k210K710L713l18k369j202j30
$$ -2376 -12 6489 11055 10339 7721 9574 13860 13790 10013 7803 10513 14226 13908 11539 10337 10207
282A0207L83j021m329m029l3J569j034l094j492R90R3k927l662j082J33J340q04
$$ 10207 10590 9569 5240 1211 1178 2747 1713 -1381 -2873 -1883 -1790 -4717 -8379 -9461 -9328 -7988 -8792
299h792j266J64K003K329o54j716l75J958J230M69M11J970L077J270J00J2O44
$$ -8792 -10058 -9894 -7891 -5562 -6216 -7932 -8307 -6349 -5119 -4650 -4239 -2269 808 2078 2178 2190 2834
316B834J411M32l03l68J208J602R99o12q82l00M3j035j360j130J39J6q26j126
$$ 2834 4245 4677 4374 4006 5214 6816 7815 7203 6321 6021 6064 5029 3669 2539 2678 2694 1868 742
334G42q34l16n46j407j826j017J57O94l07q63L71L84K90n07j23j83O50R21Q14
$$ 742 -92 -408 -954 -2361 -4187 -5204 -5047 -4353 -4660 -5523 -5152 -4768 -4478 -4985 -5108 -5291 -4641 -3720 -2906
353b906M75J491J213N56mK19O22J674Q7O58j9J084M61J676l31q10l58l83k95j123
$$ -2906 -2431 -940 273 829 825 1044 1666 3340 3427 4085 4066 5150 5611 7287 6956 6146 5788 5405 5110 3987
373C987O0l00q6j044k29j268l19j447r55r29n99m53k15p03m3m88l14p38m06K42
$$ 3987 4047 3747 3661 2617 2388 1120 801 -646 -1601 -2530 -3129 -3582 -3797 -4500 -4543 -5031 -5345 -6083 -6489 -6247
393f247M5N43o0J45Q82J250O10J66n1L93J087J081P59M52P78R18J064L48R3L70
$$ -6247 -6202 -5659 -5719 -5574 -4692 -3442 -2832 -2666 -2717 -2324 -1237 -156 603 1055 1833 2751 3815 4163 4256 4626
413D626O66K27j16k74P49P38M2p26j000l84L12r7j492q20r02N1k07q27j328p24
$$ 4626 5292 5519 5403 5129 5878 6616 6658 5932 4932 4548 4860 4763 3271 2451 1549 1600 1393 566 -762 -1486
433a486j60n48j100j048K5K54J74j019j096n1J300J046j294p72M11J629M32j67
$$ -1486 -1646 -2194 -3294 -4342 -4317 -4063 -3889 -4908 -6004 -6055 -4755 -3709 -5003 -5775 -5364 -3735 -3303 -3470
451c470K15M44J223J249k48k78M23K140Q42n82k96P81J734O09j022j117P64J837
$$ -3470 -3255 -2811 -1588 -339 -587 -865 -442 1698 2540 1958 1662 2443 4177 4786 3764 2647 3411 5248
469E248J92j833q51O23R62p48q65j179l88R82j88j674j967J056R49l81j625j389
$$ 5248 5440 3607 2756 3379 4341 3593 2728 1549 1161 2143 1955 281 -1686 -630 319 -62 -1687 -3076
487c076L81J387K4j815j413J512J609q54q25j23Q02J017o6J59r85J099J734L22
$$ -3076 -2695 -1308 -1284 -3099 -4512 -3000 -1391 -2245 -3070 -3193 -2391 -1374 -1440 -1281 -2266 -1167 567 889
505H89j805MJ359J892n26j106r07J216K074j14k207m56J708N49j202n14R6m16
$$ 889 -916 -912 447 2339 1813 707 -200 1016 3090 2976 769 313 2021 2570 1368 854 950 534
523E34L31K12p27j370Q00N25o41j253k54P28N25j05r23r89J472Q73j183n88J322
$$ 534 865 1077 350 -1020 -220 305 -336 -1589 -1843 -1115 -590 -695 -1618 -2607 -1135 -262 -1445 -2033 -711
542g11O91o40o1P76l60m35J424R81j463k06Q69R00l58k82J7l35R55L87p78p11
$$ -711 -20 -660 -721 55 -305 -740 684 1665 202 -4 865 1765 1407 1125 1142 807 1762 2149 1371 660
562F60K32M45j91J76L9j036p87J065L93j262n85O17ol26k39l56k46J001j37j570
$$ 660 892 1337 1146 1322 1361 325 -462 603 996 -266 -851 -234 -240 -566 -805 -1161 -1407 -406 -543 -2113
582b113r7J904j91q89k24O19n57P25J403j001k224J158K436k49k301j95J849J016
$$ -2113 -2210 -306 -497 -1386 -1610 -991 -1548 -823 580 -421 -2645 -1487 949 700 -1601 -1796 53 1069
600A069m90q71j019J014J414j77j573k01J168N07J70k09r23k15K026O90k222o58
$$ 1069 579 -292 -1311 -297 1117 940 -633 -834 334 841 1011 802 -121 -336 1690 2380 158 -500
618e00K146Q85j238r00M07R78Q15l92j970p36K374J632j900j830J14J435J77k21
$$ -500 1646 2531 1293 393 800 1778 2593 2201 231 -505 1869 3501 1601 -229 -115 1320 1497 1276
636A276j479j474J021J775o99k506l65J226K88o89j315l20R07J145j348j823Q76
$$ 1276 -203 -1677 -656 1119 420 -2086 -2451 -1225 -937 -1626 -2941 -3261 -2354 -1209 -2557 -4380 -3504
653c504J817j99j308M21M06O96Q06L3j251Q6K879J041j550r80J880J676J01r73
$$ -3504 -1687 -1886 -3194 -2773 -2367 -1671 -865 -832 -2083 -1997 882 1923 373 -607 1273 2949 3050 2077
671B077n33N79J703Q50j449q56Q03Q54j39q40k83l42O8p6p90j471P37P03j475
$$ 2077 1544 2123 3826 4676 3227 2371 3174 4028 3889 3049 2766 2424 2492 2416 1626 155 892 1595 120
690A20j531n2N27m57n03j219r00O81J076n91j889K15J543J02p19Q9M89J22J051
$$ 120 -1411 -1463 -936 -1393 -1896 -3115 -4015 -3334 -2258 -2849 -4738 -4523 -2980 -2878 -3597 -3508 -3019 -2897 -1846
709a846J23k01O2J291R68n29M2J327L02M75N2O7K33J317k57o79J32N42L39r08
$$ -1846 -1723 -1924 -1862 -571 397 -132 -90 1237 1539 2014 2066 2133 2366 3683 3426 2747 2879 3421 3760 2852
729B852k92l63J35j6k56j073q16M28J85p68j130l36k14l37n1P8n69m2k3l75J8
$$ 2852 2560 2197 2332 2316 2060 987 171 599 784 16 -1114 -1450 -1664 -2001 -2052 -1974 -2543 -2585 -2608 -2983 -2965
750b965K10J046p05j56L85P84K74L98J24R8N38Q57M45o96P45Q00J37P0K47k94
$$ -2965 -2755 -1709 -2414 -2570 -2185 -1401 -1127 -729 -605 -507 31 888 1333 637 1382 2182 2319 2389 2636 2342
770B342K52N01j9j252M25J58l22l66l45m35m33Q2n47r47k46J05o31p93l81J88
$$ 2342 2594 3095 3076 1824 2249 2407 2085 1719 1374 939 506 588 41 -906 -1152 -1047 -1678 -2471 -2852 -2664
790b664L26o78j02j38J65L95L34n38K6K85J106K12K63M5N94O48N20K95K55M31
$$ -2664 -2338 -3016 -3118 -3256 -3091 -2696 -2362 -2900 -2874 -2589 -1483 -1271 -1008 -963 -369 279 799 1094 1349 1780
810A780O67K6lN29M91K24k49j17o5J45K13o48n65n15J67l29o38l46l74q52m0n78
$$ 1780 2447 2473 2470 2999 3490 3714 3465 3348 3283 3428 3641 2993 2428 1913 2080 1751 1113 767 393 -459 -499 -1077
832a077o55k80j0n28o75k96K17j6l04j37J2Q1O51J6K05K76K93P16J96M05N22N05
$$ -1077 -1732 -2012 -2022 -2550 -3225 -3521 -3304 -3320 -3624 -3761 -3749 -3668 -3017 -3001 -2796 -2520 -2227 -1511 -1315 -910 -388 117
854A17J73O02L5O36M92O72k9O5L43J5J97r3j50Qq3j38l97l60Pl96n24n30l55l72
$$ 117 290 892 927 1563 2055 2727 2698 2763 3106 3121 3318 3225 3075 3083 3000 2862 2465 2105 2112 1716 1192 662 307 -65
878f5k58n57o53k24k53m8l0m51l9k84M44J68l93K93L87p3L04P2M10L79L84L06
$$ -65 -323 -880 -1533 -1757 -2010 -2058 -2088 -2539 -2578 -2862 -2418 -2250 -2643 -2350 -1963 -2036 -1732 -1660 -1250 -871 -487 -181
900a81L34K04J78Q70r2K63J8J90K14k63K80j09L01k49k97J36m69M8m45k68j85
$$ -181 153 357 535 1405 1313 1576 1594 1784 1998 1735 2015 1906 2207 1958 1661 1797 1328 1376 931 663 478
921D78n46N9l91l67l26k55l15J22k41l09J92j68J04N1j71K06J94P8M34J57N65
$$ 478 -68 -9 -400 -767 -1093 -1348 -1663 -1541 -1782 -2091 -1899 -2067 -1963 -1912 -2083 -1877 -1683 -1605 -1171 -1014 -449
942d49L30O7R3N86J68M16J71M50j50L73j1K82Q2p6K77l90q6j63O6m60J00n24m10
$$ -449 -119 -52 41 627 795 1211 1382 1832 1682 2055 2044 2326 2408 2332 2609 2219 2133 1970 2036 1576 1676 1152 742
965G42p8m67r3m51m78l81Ml87p30J97o1j28k75J28j68L06j85OM64J46l4M63L84
$$ 742 664 197 104 -347 -825 -1206 -1202 -1589 -2319 -2122 -2183 -2311 -2586 -2458 -2626 -2320 -2505 -2499 -2035 -1889 -1923 -1460 -1076
988a076J57J34O84O8O20K49J85M12J40L61k44O15P4K87j16Qn8l7k56j28j35j05
$$ -1076 -919 -785 -101 -33 587 836 1021 1433 1573 1934 1690 2305 2379 2666 2550 2558 2500 2463 2207 2079 1944 1839
1010A839k75p1l57m84m39N7j83o96k73j93j71p92K08j85J22j08j0j81J6m3O53
$$ 1839 1564 1493 1136 652 213 270 87 -609 -882 -1075 -1246 -2038 -1830 -2015 -1893 -2001 -2011 -2192 -2176 -2219 -1566
1031a566l20J9M03O0J33L90r4N76J81L15k61M80N30j31M33N8M7J29o3M33m5l49
$$ -1566 -1886 -1867 -1464 -1404 -1271 -881 -975 -399 -218 97 -164 316 846 715 1148 1206 1253 1382 1319 1752 1707 1358
1053A358r4J63l80L10j40l82l0k17l09rl69N8p3k97l84Q7k43J05r7k89P2N2J48
$$ 1358 1264 1427 1047 1357 1217 835 805 588 279 270 -99 -41 -114 -411 -795 -708 -951 -846 -943 -1232 -1160 -1108 -960
1076i60j69L25p0Q3j53M13J80kJ2L43m2M05J8L41l41K81J64j04k65M42J8l57J41
$$ -960 -1129 -804 -874 -791 -944 -531 -351 -353 -341 2 -40 365 383 724 383 664 828 724 459 901 919 562 703
1099G03K25l49m17L88k03n0j80nq1j16j40J37m88j31l9oj8J83o39P2K58M60j12
$$ 703 928 579 162 550 347 297 117 112 31 -85 -225 -88 -576 -707 -746 -752 -770 -587 -1226 -1154 -896 -436 -548
1122e48m8nK04l7P2M59j03j90K54J30O8J28K88r2j97O07k01J08L0j16R7m04K98
$$ -548 -596 -601 -397 -434 -362 97 -6 -196 58 188 256 384 672 580 383 990 789 897 927 811 908 504 802
1145H02K36m16k12J57o6j28j45k6k96O9K60n20j5N5n12j87M61j40k23j94K20K76
$$ 802 1038 622 410 567 501 373 228 202 -94 -25 235 -285 -300 -245 -757 -944 -483 -623 -846 -1040 -820 -544
1167e44j64O0J56l51K97K11L11m53j84M27J75j97M24k37j46K86L20j33L20j05
$$ -544 -708 -648 -492 -843 -546 -335 -24 -477 -661 -234 -59 -256 168 -69 -215 71 391 258 578 473
1187D73O2l99M61J98k18j65L44l23L8L97k54o56J88L13k45lL2J75p66K87K57k45
$$ 473 535 136 597 795 577 412 756 433 471 868 614 -42 146 459 214 211 243 418 -348 -61 196 -49
1209d9l75M96j19j65J28J07n16L2L90k01L7J92k0k09J00K93k08j06J02L11k47
$$ -49 -424 72 -47 -212 -84 23 -493 -461 -71 -272 -235 -43 -63 -272 -172 121 -87 -193 -91 220 -27
1230b7j85J72J64n41K64K56l29j40L83q0m1J99j64j06j40J34j12j85M35P2j41
$$ -27 -212 -40 124 -417 -153 103 -226 -366 17 -63 -104 95 -69 -175 -315 -181 -293 -478 -43 29 -112
1251a12k21J22M3r3K03O8l00K82M0L50k72Jo4K82r1K79j59RM75k18k60Q9L86k70
$$ -112 -333 -211 -168 -261 -58 10 -290 -8 32 382 110 111 47 329 238 517 358 367 842 624 364 453 839 569
1275E69o0J37m5j0l48J78j70r8K25l56n33J11R2m7k55L02r2m14O3R3j09k23J60
$$ 569 509 646 601 591 243 421 251 153 378 22 -511 -400 -308 -355 -610 -308 -400 -814 -751 -658 -767 -990 -830
1298h30J7J15j65L41j20J02N5J54l42J39K09K70J10oJ95k8Q1K12o0OK03j00l9
$$ -830 -813 -698 -863 -522 -642 -540 -485 -331 -673 -534 -325 -55 55 49 244 216 297 509 449 455 658 558 519
1321E19J17K61k12p6K30k75L2k17K91m22L9p6k31m1J21k00j79j97M06l51k50M89
$$ 519 636 897 685 609 839 564 596 379 670 248 287 211 -20 -61 60 -140 -319 -516 -110 -461 -711 -222
1343b22pj29M4k4p8j95J91j25L01j00M03l24r8K56J22N5k1L0J08J21J60lj01k45
$$ -222 -229 -358 -314 -338 -416 -611 -420 -545 -244 -344 59 -265 -363 -107 15 70 49 79 187 308 468 465 364 119
1367A19J43jO8J0J16m28J42J33p9k70l7j34j80L59q7l56L21m7o6o8j42O4O3K50
$$ 119 262 261 329 339 455 27 169 302 223 -47 -84 -218 -398 -39 -126 -482 -161 -208 -274 -342 -484 -420 -357 -107
1391a07l87M34k82K43j1j47J47L34l7mQ2r1j2J41J32k46J77K95j7R1l55l9M1K00
$$ -107 -494 -60 -342 -99 -110 -257 -110 224 187 183 265 174 162 303 435 189 366 661 644 735 380 341 382 582
1415E82P8k50j36j17K52k92k06k02P4m3jm7Qk97J82k82J91m64N13j9p4N0N3q4
$$ 582 660 410 274 157 409 117 -89 -291 -217 -260 -261 -308 -300 -597 -415 -697 -506 -970 -457 -476 -550 -500 -447 -531
1439e31Q6Q9k62Q8kK34R9P7o0K46l3Q5N4L18j19J22k04M81l71J64%K2O8K01o2
$$ -531 -445 -356 -618 -530 -532 -298 -199 -122 -182 64 31 116 170 488 369 491 287 768 397 561 561 583 651 852 790
1464G90l43Q2lJ46k55k22J23j62P7n4j68j92L03k54l02K36l20j23L11j62m8k41
$$ 790 447 529 526 672 417 195 318 156 233 179 11 -181 122 -132 -434 -198 -518 -641 -330 -492 -540 -781
1486g81L38J31m99J44p8L64j82m1J93j27J82m99O72l2Q5J20Q4Q6J71k86K32L48
$$ -781 -443 -312 -811 -667 -745 -381 -563 -604 -411 -538 -356 -855 -183 -215 -130 -10 74 160 331 45 277 625
1508F25q2k3l03J49n2j92L52J66L7o8k81j41O1J44j2l57J6K2o0k77K79j33k86
$$ 625 543 520 217 366 314 122 474 640 677 609 328 187 248 392 380 23 39 61 1 -276 3 -130 -416
1531d16K26Kk5j9j59lk0Q3R5k82L36K16l11j8K23O3l0jJ31J11L6K16k3j49k69
$$ -416 -190 -188 -213 -232 -391 -394 -414 -331 -236 -518 -182 34 -277 -295 -72 -9 -39 -40 91 202 238 454 431 282 13
1556A3L97j8j90L4K35k65J47k99J05j56P9J55k62j42R8k00j15K83j91l2j16r3
$$ 13 410 392 202 236 471 206 353 54 159 3 82 237 -25 -167 -69 -269 -384 -101 -292 -324 -440 -533
1578e33j76K65%o6R8j26J66J40r5J34Q3Q1J44P2J6K30p6j77M31j46J83J12l93
$$ -533 -709 -444 -444 -510 -412 -538 -372 -232 -327 -193 -110 -29 115 187 203 433 357 180 611 465 648 760 367
1601C67J97J18j17J67J8j16K2p6k71p8J43j7l3l37O1n63K49K30l78J28j96k19
$$ 367 564 682 565 732 750 634 656 580 309 231 374 357 324 -13 48 -515 -266 -36 -414 -286 -482 -701
1623g01j55K42R1k76K22l83J83K60J19k24K45P5q3L5J89K14j37N19l49J72L12
$$ -701 -856 -614 -523 -799 -577 -960 -777 -517 -398 -622 -377 -302 -385 -350 -161 53 -84 435 86 258 570
1644E70j83J21N9J90Q5k96M3j53J64J9j60j40Lq9K08%j88m11K86l0j71r7j25o4
$$ 570 387 508 567 757 842 546 589 436 600 619 459 319 322 233 441 441 253 -158 128 98 -73 -170 -295 -359
1668c59j00R5L8m9k35K32J25k06J26O9j47r8K11J28L5J20j22P5k9P0J16o3N0J82
$$ -359 -459 -364 -326 -375 -610 -378 -253 -459 -333 -264 -411 -509 -298 -170 -135 -15 -137 -62 -91 -21 95 32 82 264
1692B64j10n2L86j11k51q8O05m36M6l7L1k45N5j53L5oK69l90j40rN3K7j24K26
$$ 264 154 102 488 377 126 38 643 207 253 216 247 2 57 -96 -61 -67 202 -188 -328 -337 -284 -257 -381 -155
1716a55q1J05j88K93j46k3L29Q2o34N18k13K85O3k3o8K1M6N8o3K83l08L58l10
$$ -155 -236 -131 -319 -26 -172 -195 134 216 -418 100 -113 172 235 212 144 165 211 269 206 489 181 539 229
1739B29J75P7k45K49j93j35k1K48o9k06L5j8P6l62N6P1m08J18Q0R7j75J6P3l48
$$ 229 404 481 236 485 292 157 136 384 315 109 144 126 202 -160 -104 -33 -441 -323 -243 -146 -321 -305 -232 -580
1763e80J62K43j42j69K72j14J65m5j26LL14rJ02j86K51k48P1K90J17p2j2j20L24
$$ -580 -418 -175 -317 -486 -214 -328 -163 -208 -334 -331 -17 -26 76 -110 141 -107 -36 254 371 299 287 167 491
1786D91n0k30J68l7R9l26L98j32k66J13j77p0L50j27k02k40R7P9l49K39K46m22
$$ 491 441 211 379 342 441 115 513 381 115 228 51 -19 331 204 2 -238 -141 -62 -411 -172 74 -348
1808c48PK02l08J96l43M06Q0j21q9PN2J16P2j35O4N9j18K80l08K65k25P3K38J14
$$ -348 -341 -139 -447 -251 -594 -188 -108 -229 -318 -311 -259 -143 -71 -206 -142 -83 -201 79 -229 36 -189 -116 122 236
1832B36o8k06K16K8l32L30Q9j46j62L05j58J3k11J75J39k40J4L0j0m2q2O0j19
$$ 236 168 -38 178 206 -126 204 293 147 -15 290 132 145 -66 109 248 8 22 52 42 0 -82 -22 -141
1855a41P6K43k40o1R8j98R5M02l17r7K38l52L30J37j21O5L1j20L5j5p7K03k63
$$ -141 -65 178 -62 -123 -25 -223 -128 274 -43 -140 98 -254 76 213 92 157 188 68 103 88 11 214 -49
1878d9J89n1k8R7M9k64J79k75p6m2J96J36J08m59K53j14LJ96M1r4p4J47j20O8
$$ -49 140 89 61 158 207 -57 122 -153 -229 -271 -75 61 169 -290 -37 -151 -148 48 89 -5 -79 68 -52 16
1902A6k76J53k6K0L05j43j85M1R3K46k74n9K05k3j03L5M1N6KJ08j58JJ98k97J92
$$ 16 -260 -107 -133 -113 192 49 -136 -95 -2 244 -30 -89 116 93 -10 25 66 122 124 232 74 75 273 -24 168
1927A68j24L4Pk44O7L86m10M2K01k21L6k8l3K4kJ17j92j5N6P4j41j04J51j87L57
$$ 168 44 78 85 -159 -92 294 -116 -74 127 -94 -58 -86 -119 -95 -97 20 -172 -187 -131 -57 -198 -302 -151 -338 19
1952A9p36O64n6J82r8l35QJ97J74k89K91Pk59o6L6K63R4j5K1j8q4K95m3j89o1
$$ 19 -717 -53 -109 73 -25 -360 -352 -155 19 -270 21 28 -231 -297 -261 2 96 81 102 84 0 295 252 63 2
1977Bl2JK86j52j39K64Kj03l0M5K30j51K3P6k94pL36l89K29j53Jl8J98n18L50
$$ 2 -30 -29 257 105 -34 230 232 129 99 144 374 223 246 322 28 21 357 -32 197 44 45 7 205 -313 37
2002C7l2M0k9qj74k29L79k1r6J78J48m61L28j73J01j27J30J94j33r9M3M5j02j6
$$ 37 5 45 16 8 -166 -395 -16 -37 -133 45 193 -268 60 -113 -12 -139 -9 185 52 -47 -4 41 -61 -77
2026g7K57q9k62P5L10k05rj46N16k26j92J00J07m65K52J03Rj63P9J3j57K5J08
$$ -77 180 91 -171 -96 214 9 0 -146 370 144 -48 52 159 -306 -54 49 58 -105 -26 -13 -170 -145 -37
2049c7Oj09K48j41R6j8k59J31K1M7M8j88K00k99K09J57r8J45j89K8r9J59k59L06
$$ -37 -31 -140 108 -33 63 45 -214 -83 -62 -15 33 -155 45 -254 -45 112 14 159 -30 -2 -101 58 -201 105
2073A05j74k2m3J68l56K92m7j29J95l6j23N0L03k74j64p8J47o4N0l0lq2oK43L7
$$ 105 -69 -91 -134 34 -322 -30 -77 -206 -11 -47 -170 -120 183 -91 -255 -333 -186 -250 -200 -230 -233 -315 -321 -78 -41
2098d1j77L73k05q1K61p1p6J20r5O7K97k61K6k4N6J19j34n6R7j56J80q2k0r0K48
$$ -41 -218 155 -50 -131 130 59 -17 103 8 75 372 111 137 113 169 288 154 98 195 39 219 137 117 27 275
2123B75k44j9J39k67J43L23l09m7n45K06L96l4l8J02j94j12L45o46M46j66J77
$$ 275 31 12 151 -116 27 350 41 -6 -551 -345 51 17 -21 81 -113 -225 120 -526 -80 -246 -69
2144f9j84R7j77K10J4j61r1J84P9J02j36L41k31K57j67N7P4jk63j6j1L93l83K28
$$ -69 -253 -156 -333 -123 -109 -270 -361 -177 -98 4 -132 209 -22 235 68 125 199 198 -65 -81 -92 301 -82 146
2168A46L94m19n1m4K26l1j92k7l5J34%l5j26j83L12O4N7m44J85J20j10p5M2J12
$$ 146 540 121 70 26 252 221 29 2 -33 101 101 66 -60 -243 69 133 190 -254 -69 51 -59 -134 -92 20
2192B0j2P4j38K7K58k6j52q5O6m7N2j49P4K92q5r0P4o5j16o0L8J00R2j30l8L9
$$ 20 8 82 -56 -29 229 203 51 -34 32 -15 37 -112 -38 254 169 79 153 88 -28 -88 -50 50 142 12 -26 13
2218A3K49r4k32p5m8Q3n2M7J37l43K36R4k06L82k12KL7j31L6J57K03k60J9j87
$$ 13 262 168 -64 -139 -187 -104 -156 -109 28 -315 -79 15 -191 191 -21 -19 18 -113 -77 80 283 23 42 -145
2242a45K85op5J97n8j69J04o8K41o9k64K66j97J11p0J38n3R7k33rp6J55j54Q0
$$ -145 140 134 59 256 198 29 133 65 306 237 -27 239 42 153 83 221 168 265 32 23 -53 102 -52 28
2266B8K38k99Q9j64K57k16R8k04J95k95N20n04k8K18k78L52j51M9J41j79j02R4
$$ 28 266 -33 56 -108 149 -67 31 -173 22 -273 247 -257 -285 -67 -345 7 -144 -95 46 -133 -235 -141
2288a41o8J35J76o2p5Q3j32J38o4L60k21j64J55m5L2KK7K2k21K23J23k46k3l06
$$ -141 -209 -74 102 40 -35 48 -84 54 -10 350 129 -35 120 75 107 109 136 158 -63 160 283 37 14 -292
2312b92L43R4L3k07j49J48M3m2K3J88r3l9J16m9J4P4l26J76J02lk25K83l52M3
$$ -292 51 145 178 -29 -178 -30 13 -29 -6 182 89 50 166 117 131 205 -121 55 157 154 -71 212 -140 -97
2336i7K18O4k18j73M87j86K9j0m2k34L58l16J42N0k49J03j00Q2J22K18k37L3n1
$$ -97 121 185 -33 -206 281 95 124 114 72 -162 196 -120 22 72 -177 -74 -174 -92 30 248 11 44 -7
2359gK7k58J54o8L44j16m39J28M2J69j47M88k82l87L56L1o3R1k63K38J3L10k38
$$ -7 20 -238 -84 -152 192 76 -363 -235 -193 -24 -171 317 35 -352 4 35 -28 63 -200 38 51 361 123
2382A23j69L8oQ7l0rJ82j85N0j00J16j30K16l4o4k20J90m2kK8M5q2N7K03j60k97
$$ 123 -46 -8 -14 73 43 34 216 31 81 -19 97 -33 183 149 85 -135 55 13 11 39 84 2 59 262 102 -195
2408a95J68K9j30q0L20j24j44J04L3J4j90K42l1L0k41L64k84J01q3K48j91J74
$$ -195 -27 2 -128 -208 112 -12 -156 -52 -19 -5 -195 47 16 46 -195 169 -115 -14 -97 151 -40 134
2430A34ok28L0L8M2m4o8K54k1j09N3m3j06k4K16J20J51m10k0O4k5J58k31j57L79
$$ 134 128 -100 -70 -32 10 -34 -102 152 131 22 75 32 -74 -98 118 238 389 -21 -41 23 -2 156 -75 -232 147
2455A47p6J8K7k24L01j57%m4l8P4j79R0J93j08J6p5q9L6M5Q9o2Q4j73j78L05l6
$$ 147 71 89 116 -108 193 36 36 -8 -46 28 -151 -61 132 24 40 -35 -124 -88 -43 46 -16 68 -105 -283 22 -14
2481a4J7j76K73l48L49q8K7r9J69k66K4L04k72r6K04J15k79J39N2j57K84j78l34
$$ -14 3 -173 100 -248 101 13 40 -59 110 -156 -132 172 -100 -196 8 123 -156 -17 35 -122 162 -16 -350
2504c50N07l01M59n3j49j42KL07q9J1k08J5J72k09M9m1m3K60j96M8k31K35j4j25
$$ -350 157 -144 315 262 113 -29 -27 280 191 202 -6 9 181 -28 21 -20 -63 197 1 49 -182 53 39 -86
2528h6K04J49j94Rj19J67l10M9K38l46M17j89j15n4l2NJ80K7k11m3K69n1k04J73
$$ -86 118 267 73 82 -37 130 -180 -131 107 -239 178 -11 -126 -180 -212 -207 -27 0 -211 -254 15 -36 -240 -67
2552f7N4k90L7n1J48j13N34k46l08K78l7J45k8p9l2L6J5L27j00k79J51L0q8q4
$$ -67 -13 -303 -266 -317 -169 -282 252 6 -302 -24 -61 84 56 -23 -55 -19 -4 323 223 -56 95 125 37 -47
2576d7P7R9p0j5p6M6j60m7L27P7j28J07N2k58Q4J26l36J66Q2l7j3j92J25j19L35
$$ -47 30 129 59 44 -32 14 -146 -193 134 211 83 190 242 -16 68 194 -142 24 106 69 56 -136 -11 -130 205
2601B05l41p2L6l1K42k36K59j8L4m8M6j2k08L3J63N5q0K92l77K81j57l6k89L66
$$ 205 -136 -208 -172 -203 39 -197 62 44 78 30 76 64 -144 -111 52 107 27 319 -58 223 66 30 -259 107
2625A07j62OK14Rj45r0j00K14J07j93J12j22k1P6OO1Q1K9j93K5j36J1J93k83J92
$$ 107 -55 -49 165 174 29 -61 -161 53 160 -33 79 -43 -64 12 18 79 160 189 -4 21 -115 -104 89 -194 -2
2650bl3K6o0O6k48M86l19J01j21m1j63L45j33K60k04K3K44m54L48k8pO9k9k30
$$ -2 -35 -9 -69 -3 -251 235 -84 17 -104 -145 -308 37 -96 164 -40 -17 227 -227 121 93 86 155 126 -104
2674a04J64m0k0j60L71j69L2j97K19j4j62J3r0K74j31J58j58r4JN0J40r4j19K72
$$ -104 60 20 0 -160 211 42 74 -123 96 82 -80 -67 -157 117 -14 144 -14 -108 -107 -57 83 -11 -130 142
2698A42j37R4K00j79j23j02L9K63k18q8l9m7K24l5r9K9K07nj2k6m8O9m52J87L4
$$ 142 5 99 299 120 -3 -105 -66 197 -21 -109 -148 -195 29 -6 -105 -76 131 126 114 88 40 109 -343 -156 -122
2723a22J69j10K24j63j65n0p9K51n0J73k09Q3J65j18O9k55J2J53n4n1J65L20j16
$$ -122 47 -63 161 -2 -167 -217 -296 -45 -95 78 -131 -48 117 -1 68 -187 -175 -22 -76 -127 38 358 242
2746B42j24m71K10l6J6P7k6j10J31m8j0p6RM86l63j8J53J36m86J32L83k30J89
$$ 242 118 -353 -143 -179 -163 -86 -112 -222 -91 -139 -149 -225 -216 270 -93 -111 42 178 -308 -176 207 -23 166
2769A66j55LL4K10l88J41J24J3m2j80R6J46k12J19k30M80k36r9J59k02R3k94J38
$$ 166 11 14 48 258 -130 11 135 148 106 -74 22 168 -44 75 -155 325 89 -10 149 -53 40 -254 -116
2792a16K66l0l16J65l8J03j72Q3J9k00qqL43k11R7Q8Ko8K31l28J90r3M2m2J9R4
$$ -116 150 120 -196 -31 -69 34 -138 -55 -36 -236 -244 -252 91 -120 -23 65 67 -1 230 -98 92 -1 41 -1 18 112
2818A12M3k48K17O3j23J88n9j54Jj14k27K13j78K28K5Kj27k41L37K27k63j41K49
$$ 112 155 -93 124 187 64 252 193 39 40 -74 -301 -88 -266 -38 -13 -11 -138 -379 -42 185 -78 -219 30
2841C0j7L1J77k46l9j07J55R6r1J36Q6p6j77K67J26k22M5k30j8Q6P7J12l09J08
$$ 30 13 44 221 -25 -64 -171 -16 80 -11 125 211 135 -42 225 351 129 174 -56 -74 12 89 201 -108 0
2865@K51k45l5J35j6j4K1k36K35j21P0k72j49K81N4O0K7j17R1l3R5k05J90j87
$$ 0 251 6 -29 106 90 76 97 -139 96 -25 45 -227 -376 -95 -41 19 46 -71 20 -13 82 -123 67 -120
2889a20K16J11q1J52j80q1k40K31j35P2K58k13J19j14q7p8K45l8nM2MJ39m26L26
$$ -120 96 207 126 278 98 17 -223 8 -127 -55 203 -10 109 -5 -92 -170 75 37 32 74 78 217 -209 117
2913A17j55O8J5J00n6N7l79R4O2j26M05j30j08k29M3J10J96J4o4J47k03J18j6
$$ 117 -38 30 45 145 89 146 -233 -139 -77 -203 202 72 -36 -265 -222 -112 84 98 34 181 -22 96 80
2936H0Ol08K88k30J52J11k10K75k85K17k2P3J5j06J27L4l6k07N7QN0o1j5k3K31
$$ 80 86 -222 66 -164 -12 99 -111 164 -121 96 74 147 162 56 183 217 181 -26 31 39 89 28 13 -10 221
2961B21m33K46k22J09K6q5J1J41n6J72j96M1j68m0L47j39K38k41l9N6j76K11j24
$$ 221 -212 34 -188 -79 -53 -138 -127 14 -42 130 -66 -25 -193 -233 114 -25 213 -28 -67 -11 -187 24 -100
2984a00J24j30Q8jk11K48J0P2n0k44K42J4j18J63RK0k02k7p3J17j08K23k67J46
$$ -100 24 -106 -18 -19 -230 18 28 100 50 -194 48 62 -56 107 116 136 -66 -93 -166 -49 -157 66 -201 -55
3008e5K70k97J23K04m5j82k37K17J27j42J63k5R9j83j2p1j4j21K68N0n48N88l03
$$ -55 215 -82 41 245 200 18 -219 -2 125 -17 146 121 220 37 25 -46 -60 -181 87 137 -411 177 -126
3031a26L35j41j57K15r1J7j62K02j67m2L05j05m17L63q7p4K00oL56l39k81M3j70
$$ -126 209 68 -89 126 35 52 -110 92 -75 -117 188 83 -334 29 -58 -132 68 62 418 79 -202 -159 -329
3054c29M08j58l2J32k1k5J41j11j09J02k74M27R4l88J00K96l26J07j00J63n7m
$$ -329 79 -79 -111 21 0 -25 116 5 -104 -2 -276 151 245 -143 -43 253 -73 34 -66 97 40 36
3076C6q9r6L04k27j17L14j20J94l60K41n5L2l32L77l9j59Q0J12l45K70J10j36
$$ 36 -53 -149 155 -72 -189 125 5 199 -161 80 25 57 -275 102 63 -96 -16 96 -249 21 131 -5
3098eK8k6L0l9j8o8J87j2J54l41J47l1J39m47M84j41l30O26o4k82Q1N4j36n4K54
$$ -5 23 -3 27 -12 -30 -98 89 77 231 -110 37 6 145 -302 182 41 -289 337 273 -9 72 126 -10 -64 190
3123A90j75p9j58K71j61O7k77N84k38j80J16k5N2P5R4j49N2j61j8L5K01k95K60
$$ 190 15 -64 -222 49 -112 -45 -322 262 24 -156 -40 -65 -13 62 156 7 59 -102 -120 -85 116 -179 81
3146H1l05m9L32l62J85Q9%L2J8j55N5K68r2k77L68j52J8K21l63Q4pr4J01q9q9
$$ 81 -224 -273 59 -303 -118 -29 -29 3 21 -134 -79 189 97 -180 188 36 54 275 -88 -4 -11 -105 -4 -93 -182
3171a82J43O5j66O6K76l95J84J99k90O9oL37n45J87O8K7r9k88J59K74K6j79O3
$$ -182 -39 26 -140 -74 202 -193 -9 190 -100 -31 -37 300 -245 -58 10 37 -62 -350 -191 83 109 -70 -7
3194gr4J24j65M30n06J17L7K04l54J36j22j13Q8K84q6J3j09J95q0k08J38M06o46
$$ -7 -101 23 -142 288 -218 -101 -64 140 -214 -78 -200 -313 -225 59 -27 -14 -123 72 -8 -216 -78 328 -318
3217c18J50J11q1J59j94J89L60m46Pj03O5L71k82J78r3K4j39R0n8J5K21j79K0
$$ -318 -168 -57 -138 21 -173 16 376 -70 -63 -166 -101 270 -12 166 73 97 -42 48 -10 5 226 47 67
3240F7L2l21L51l7k95L20q0P6j70J27j35n0K97k19K33k79J89j69L0J64K0k27Q9
$$ 67 99 -222 129 92 -203 117 37 113 -57 70 -65 -115 182 -37 196 -83 106 -63 -33 131 151 -76 13
3263A3NN5J18l60N40l12k05P7k6Q5jJ97l22J35J98j55R1k6M5R7l66n4M20l07k7
$$ 13 18 73 191 -169 371 59 -146 -69 -95 -10 -11 186 -136 -1 197 42 133 107 152 249 -117 -171 249 -58 -85
3288h5L37k00l6Q4M5k15OM7qr6n3J22n1R0l2K42l61O5J59J58O0k40P7j1m6J29
$$ -85 252 52 16 100 145 -70 -64 -17 -25 -121 -174 -52 -103 -13 -45 197 -164 -99 60 218 278 38 115 104 58 187
3314A87r8j19k2j75K88j33j12L7Q8k22M03j28nm0J68j1o8r7J41k26K11q8r7J12
$$ 187 89 -30 -52 -227 61 -72 -184 -147 -59 -281 122 -6 -11 -51 117 106 38 -59 82 -144 67 -21 -118 -6
3338fJ29o0J6j02l40N00k41L30j23j31j36P9j12J62%O8l1L07l65Q1k56R9K31Q8
$$ -6 123 63 79 -23 -363 137 -104 226 103 -28 -164 -85 -197 -35 -35 33 2 309 -56 25 -231 -132 99 187
3362A87k34m7K25L1j93N2k09K63q5L53k76q2p3K4L69m25L52m05J12J64k13K3k3
$$ 187 -47 -94 131 162 -31 21 -188 75 -10 343 67 -15 -88 -64 305 -120 232 -173 -61 103 -110 -87 -110
3385a10K7J11j07J70l42P1J91q9J93o5J18k43K04K69o18J87oQ5n3j59J10j7k90
$$ -110 -83 28 -79 91 -251 -180 11 -78 115 50 168 -75 129 398 -220 -33 -39 46 -7 -166 -56 -73 -363
3408c63M37n2j65M23m13P8o3l8K23j15K40l36L5J25j69M43P1n16K04k23O9K4L2
$$ -363 74 22 -143 280 -133 -55 -118 -156 67 -48 192 -144 -109 16 -153 290 361 -155 49 -174 -105 -81 -49
3431d9j85M94k81N0r5j09P7n0K29J4l47P5J77J50j85j02j00K80r5J41lk45J49
$$ -49 -234 260 -21 29 -66 -175 -98 -148 81 95 -252 -177 0 150 -35 -137 -237 43 -52 89 86 -159 -10
3454a0k23J22R0J16K5k49J94L1R2k11K9r4j67L31j68K97k48n8R6j46M9r7J14J01
$$ -10 -233 -111 -21 95 120 -129 65 96 188 -23 6 -88 -255 76 -92 205 -43 -101 -5 -151 -102 -199 -85 16
3478A6j68K17O7o5q4j45K17K26l04J02m8n9J83k65m1J70k74L34P2n1j19M94j72
$$ 16 -152 65 132 67 -17 -162 55 281 -23 79 31 -28 155 -110 -151 19 -255 79 151 100 -19 475 303
3501C03l22J1J47l85RL76m0N2r7M1k97M50k11K93n08J81J2J13j91k6j59L14J46
$$ 303 -19 -8 139 -246 -237 139 99 151 54 95 -202 248 37 330 -178 3 15 128 -63 -89 -248 66 212
3524B12k77o2M2K63j81j31J86j06k05K81O8l01K33p1P0K4p3j33L22n8q1M2j66
$$ 212 -65 -127 -85 178 -3 -134 52 -54 -259 22 90 -211 22 -49 21 45 -28 -161 161 103 22 64 -102
3547a02L39j3k26k5k98K26K61j65Q5Mnq2O2k11J10j3M4R1j01L6L0q0n7K61J69
$$ -102 237 224 -2 -27 -325 -99 162 -3 82 86 81 -1 61 -150 -40 -53 -9 82 -19 17 47 -33 -90 171 340
3572C40n92M76k71J97k75O1q8J82J51L8l9j92N1K07l12K30k26L2R0l8j95J51J77
$$ 340 -252 224 -47 150 -125 -64 -152 30 181 219 180 -12 39 246 -66 164 -62 -30 60 22 -173 -22 155
3595A55j6j20M07m21j87K30oR2k34K1K9m1J77J32l06JJ35j06P7l6k31O6M7K89
$$ 155 139 19 426 5 -182 48 42 134 -100 -79 -50 -91 86 218 -88 -87 48 -58 19 -17 -248 -182 -135 154
3619A54k08J47J15l61j19L48j42j36K97l0o4M48l21r4R1j6j08j92K6J42l8K6M32
$$ 154 -54 93 208 -153 -272 76 -66 -202 95 65 1 449 128 34 125 109 1 -191 -165 -23 -61 -35 397
3642C97m28J33k67K38l52K46K8n1Q7j89Q2K6M97k19l67J52k02J14J38j13K83l18
$$ 397 -31 102 -165 73 -279 -33 -5 -56 31 -158 -76 -50 447 228 -139 13 -189 -75 63 -50 233 -85
3664h5J70J73k93l1qo4J73J8j23j48K14j44J31Q3k52j03K50k7J19p2O8R3Rj41
$$ -85 85 258 -35 -66 -74 -138 35 53 -70 -218 -4 -148 -17 66 -186 -289 -39 -66 53 -19 49 142 151 10
3688A0L6q3Q1j69M32j06J6k00p0J44j69N1j85K11N0k9k12L43r4n3j95J54l44M54
$$ 10 46 -37 44 -125 307 201 217 17 -53 91 -78 -27 -212 -1 49 20 -192 151 57 4 -191 -37 -381 73
3712G3L9l26M16j31QK3l0j84L03m12K04m7k0K30j58j72K61M4j34L37k89q5L8l6
$$ 73 112 -214 202 71 79 102 72 -112 191 -221 -17 -64 -84 146 -12 -184 77 121 -13 324 35 -50 -12 -48
3736d8Q2M8j32R1K18m70J82J98l6l09J68J39pnL1j15J73l22l03N11j24o2j09K25
$$ -48 34 82 -50 41 259 -211 -29 169 133 -176 -8 131 124 119 150 35 208 -114 -417 94 -30 -92 -201 24
3760B4K7J26M1K0l2j97r8J1K0K81l26J22k24K8L93k57K62l98J76k05L06n9J00
$$ 24 51 177 218 238 206 9 -89 -78 -58 223 -103 19 -205 -177 216 -41 221 -177 -1 -206 100 41 141
3783A41j10K37k52QJ59l16L00k28J7j23K51K14o19K84J76J0k29O8J3j55J63M5
$$ 141 31 268 16 24 183 -133 167 -61 -44 -167 84 298 -321 -37 139 149 -80 -12 1 -154 9 54
3805E4j35J35n5r4p2R3k8k0K08j41O2l7J01k0j08o9J84k25N6J96j02J05j29J75
$$ 54 -81 54 -1 -95 -167 -74 -102 -122 86 -55 7 -30 71 51 -57 -126 58 -167 -111 85 -17 88 -41 134
3829A34k38J19P7k40L44j91q5P8O7J07l79L35j26K65j75P9J0j46L3N5N0m11M53
$$ 134 -104 15 92 -148 196 5 -80 -2 65 172 -207 128 2 267 92 171 181 35 68 123 173 -238 215
3852B15j13j19qmn1m1J33J60K4j14r5N2k90K27M9q3K75j66J5p2J06Mqj92M14k28
$$ 215 102 -17 -25 -29 -80 -121 12 172 196 82 -13 39 -251 -24 25 -58 217 51 66 -6 100 104 96 -96 318 90
3878I0j04R2k05J60p7J55J5l24K40k31K8L35k77k0J11J63j03l04M95l42K11j12
$$ 90 -14 78 -127 33 -44 111 126 -198 42 -189 -161 174 -103 -123 -12 151 48 -256 239 -103 108 -4
3900dk09J13K17l0m56M41k3j93K26m7Q8r9J50l39K19l8n1k83N49m30o2M68l02
$$ -4 -213 -100 117 87 -369 72 49 -144 82 35 123 24 174 -165 54 16 -35 -318 231 -199 -261 207 -95
3923i5J1J40J23lj72m2J11j26P3j2N5k80K48k07L20k64p1M03m19M43m28O7K14
$$ -95 -84 56 179 176 4 -38 73 -53 20 8 63 -217 31 -176 144 -120 -191 212 -207 236 -192 -125 89
3946H9k1p2J06k95J26j8j09K10m8j70J64l3j22jJ34J10K2k25j6K32M3j52j91K68
$$ 89 68 -4 102 -193 -67 -85 -194 16 -32 -202 -38 -71 -193 -194 -60 50 72 -153 -169 63 106 -46 -237 31
3970C1k31J64J02m43K23J17O5N1j35r6J01J0J60m3p5k5J0j51R2Q3J3l05J22o5
$$ 31 -200 -36 66 -377 -154 -37 28 79 -56 -152 -51 -41 119 76 1 -24 -14 -165 -73 10 23 -282 -160 -225
3994b25J97m3J24l78M22l09J23PR3Pj30K49k72Q5M3J41k39M0K15k03M6J58j60
$$ -225 -28 -71 53 -325 97 -212 -89 -82 11 18 -112 137 -135 -50 -7 134 -105 -65 150 -53 -7 151 -9
4017ik3Q1No9J26K67l74J57j71o8j84J98Q8J41j9k41J35J18r3n1Q5j62p3J04k26
$$ -9 -32 49 54 -15 111 378 4 161 -10 -78 -262 -64 24 165 146 -95 40 158 65 14 99 -63 -136 -32 -258
4042b58K18P9k96K73l6J34k27k9J44J16j02K09k34j13O7J13L40n44L91n62N05
$$ -258 -40 39 -257 16 -20 114 -113 -142 2 118 16 225 -9 -122 -55 58 398 -146 245 -317 188
4063A88Jj70L3j53m1j77M47n6j89K51k1r0l60N25j46k15j24L56k56J24j41J89
$$ 188 189 19 52 -101 -142 -319 128 72 -117 134 113 23 -337 188 42 -173 -297 59 -197 -73 -214 -25
4085b5j30L39j19k48K60J76j77K63k50J7rN1k13m6J20J22m12M36j2p6j03l96N18
$$ -25 -155 184 65 -183 77 253 76 339 89 106 97 148 -65 -111 9 131 -281 155 143 67 -36 -432 86
4108H6J38n3l24J0J70K33l74J53j35K88q7j75J00j51L31K1m20K96M9k36lr7K48
$$ 86 224 171 -153 -143 27 260 -114 39 -96 192 105 -70 30 -121 210 231 -189 107 156 -80 -83 -180 68
4131F8oJ62k35m7M4k85J48K73j34J91k09J78q1oj64L35k04k8J51o7m8K55m21J36
$$ 68 62 224 -11 -58 -14 -299 -151 122 -12 179 -30 148 67 61 -103 232 28 0 151 84 36 291 -130 6
4155FK18l10kJ30K08j71k17J71j3J60k34p4L7J61j29j45J29j0K69j67K50m8m82
$$ 6 224 -86 -88 42 250 79 -138 33 20 180 -54 -128 -91 70 -59 -204 -75 -85 184 17 267 219 -263
4178b63K89Mp4J20j56L11j67q1l8k9k08L70k46M47k16j65n7K16o5K90K4m45J45
$$ -263 26 30 -44 76 -80 231 64 -17 -55 -84 -292 78 -168 279 63 -102 -159 57 -8 282 306 -139 6
4201FO5j35j06K38l64K95j19l27L77Q8J17q4j13OqK93l07j1Q5J04l85L52Rk70
$$ 6 71 -64 -170 68 -296 -1 -120 -447 -70 18 135 51 -62 -56 -64 229 -78 -89 -4 100 -285 67 76 -194
4225a94p7J57j47L39j04J56k52J98k62Q1O1OJ02j26J53J03j26Qo2J33j61O6Nn2
$$ -194 -271 -114 -261 78 -26 130 -122 76 -186 -105 -44 -38 64 -62 91 194 68 76 14 147 -14 52 57 5
4249EO8k45J48jP7n4j01k65M94m7j31j72K12j52O5J87M3l7k95J28n4M75j68j45
$$ 5 73 -172 -24 -25 52 -2 -103 -368 126 79 -52 -224 -12 -164 -99 88 131 94 -201 -73 -127 348 180 35
4273C5J9K3Q0J20l52O3m2j28J91k3qJ87m2k21j98J41L27k73j79J76J83j3L5N1
$$ 35 54 77 157 277 -75 -12 -54 -182 9 -14 -22 165 123 -98 -296 -155 172 -101 -280 -104 79 66 101 152
4297A52k23K62m63N24j10k40p6J58K19l30J57p2K53R4l35j04r6L06l60K97L1j10
$$ 152 -71 191 -272 252 142 -98 -174 -16 203 -127 30 -42 211 305 -30 -134 -230 76 -284 13 44 -66
4319f6J30m4M5l39L59n09J81L03M5k34p0n4J51N7l8K98o7k48K78k77K49j98R2
$$ -66 64 20 65 -274 85 -424 -243 60 105 -129 -199 -253 -102 -45 -83 215 148 -100 178 -99 150 -48 44
4342D4PM4k55J42j38J55p5j57J71k0K69n5j80Q5J58k44QK67j01j76J06qj64Q7
$$ 44 51 95 -160 -18 -156 -1 -76 -233 -62 -82 187 132 -48 37 195 -49 -41 226 125 -51 55 47 -117 -30
4366c0N8k76K73J06j10j00PQ8q1j19J78K07n11J37L60k29J5p6K03NR9j97Q0n4
$$ -30 28 -248 25 131 21 -79 -72 16 -65 -184 -6 201 -310 -173 187 -42 -27 -103 100 105 204 7 87 33
4390C3j08k5m1j20M45k54J50j43JM03l24OK1R7k41M10k71l36L07R2k5j20j7QK57
$$ 33 -75 -100 -141 -261 184 -70 80 -63 -62 341 17 23 44 141 -100 310 39 -297 10 102 77 -43 -60 -52 205
4415B05j38j07J37m20J54L40l47K33j23R1P0k28L37k27j18j98O9L27J56k76J38
$$ 205 67 -40 97 -323 -169 171 -176 57 -66 25 95 -133 204 -23 -141 -339 -270 57 213 -63 75
4436G5P5q9m36L60j42N6O8K12l08P5N6J00M6j99oJ63%oj01K0Q4p9k94J86N0K5
$$ 75 150 61 -375 -15 -157 -101 -33 179 -129 -54 2 102 148 -51 -57 106 106 100 -1 19 103 24 -270 -84 -34 -9
4462ir1k32N48j29k10K43l07J81J44l45J65j37K18J1P6j8k13l2J91p9J46Pj72
$$ -9 -100 -332 216 87 -123 120 -187 -6 138 -207 -42 -179 39 50 126 108 -105 -137 54 -25 121 128 -44
4485d4q6J09r4J75J40j09j59K45k95J16j98J80J82o3j72J48J44l03N0J54j74n7
$$ -44 -130 -21 -115 60 200 91 -68 177 -118 -2 -200 -20 162 99 -73 75 219 -84 -34 120 -54 -111
4507a11J13N3j09Rj62J4M39l01O7j28K11j99O0N5j67o3L86n9o6K02l51J01j77
$$ -111 2 55 -54 -45 -207 -193 246 -55 12 -116 95 -104 -44 11 -156 -219 167 108 42 244 -107 -6 -183
4530a83J4K75L7j42K35J14j82j57K30j70l7j01j16j84L93k15J07R7j53L34l20
$$ -183 -169 106 143 1 236 350 168 11 241 71 34 -67 -183 -367 26 -189 -82 15 -138 196 -124
4551a24L72k59Q6l5k53K70k01l8n8M97k03j58Q5j14K57l90M21j7n4k00J66j01
$$ -124 248 -11 75 40 -213 57 -144 -182 -240 257 54 -104 -19 -133 124 -266 155 138 84 -116 50 -51
4573e1k4J49j29m8J11J38k11J6q4J92j12K08k51K8J91j31R9j5j22j08J43J16k66
$$ -51 -75 74 -55 -103 8 146 -65 -49 -133 59 -53 155 -96 -68 123 -8 91 76 -46 -154 -11 105 -161
4596a61KR5Q1l%O4k28R4J00j15j18Q9Q8l4K62k81J52K08k96n2qj32P4J86l52L50
$$ -161 -159 -64 17 14 14 78 -150 -56 44 -71 -189 -100 -12 -46 216 -65 87 295 -1 -53 -61 -193 -119 67 -285 65
4622F5j53L40K3k00q9j80L37j73j13J39l4J20n2j22j7p9J42R2N2j82m6J00k9J69
$$ 65 -88 252 275 75 -14 -194 143 -30 -143 -4 -38 82 30 -92 -109 -188 -46 46 98 -84 -130 -30 -59 110
4646A10k55R6K81k15O0j88J99j69Q9m1L7O1k08L63l63%J22n4K20k4l09J63P3p1
$$ 110 -145 -49 232 17 77 -111 88 -81 8 -33 4 65 -143 220 -143 -143 -21 -75 145 121 -188 -25 48 -23
4670b3j43K68J29k10K10j77j63R3Q8J27j14j07J14k4k36J20j19J22N9J00j04M2
$$ -23 -166 102 231 21 231 54 -109 -16 72 199 85 -22 92 68 -168 -48 -167 -45 14 114 10 52
4692E2n1LJ99j0Lj68j91M1J22lp8Q0q1OQ6j48P0J20r0j3J02k34R4j87M33l82L17
$$ 52 1 4 203 193 196 28 -163 -122 0 -3 -81 -1 -82 -76 10 -138 -68 52 -38 -51 51 -183 -89 -276 157 -225 92
4719I2o1k94K04j54K34j41j50K56j68J79j08R2J09r3P6l22M00l28L8RL8r1Q3J97
$$ 92 31 -263 -59 -213 21 -120 -270 -14 -182 -3 -111 -19 90 -3 73 -249 151 -177 -139 -130 -92 -183 -100 97
4743I7Q9k08q6J79j58K23k70Q3jK62n27J46N0K22j47J15J94j00k33O4J86k31J46
$$ 97 186 -22 -108 71 -87 136 -134 -51 -52 210 -317 -171 -121 101 -46 69 263 163 -70 -6 180 -51 95
4766I5j62L1J68k86L00l16L17j59J22j44R4k43K6J06K17j17J1j39n8J50j24Q8
$$ 95 -67 -36 132 -154 146 -170 147 -12 110 -34 60 -183 -157 -51 166 49 60 -79 -137 13 -111 -23
4788b3m4J4j0J69j85k8K89k15r4K28K23m48K18j7J4k79L4J05N3P8P5J5j74K71
$$ -23 -67 -53 -63 106 -79 -107 182 -33 -127 101 324 -124 94 77 91 -188 -154 -49 4 82 157 172 -2 269
4812B69k49J48j22j97M46J3k54M1J4k3O6k08L81n93J91J40k10L00m6k68n6L59
$$ 269 20 168 46 -151 295 308 54 95 109 86 152 -56 325 -268 -77 63 -147 153 107 -161 -217 142
4834A42j19r6p6K83j69q0mK25J41mk51K02k10J63j46m5J52k39J79j65J19j48J08
$$ 142 23 -73 -149 134 -35 -115 -119 106 247 243 -8 194 -16 147 1 -44 108 -131 48 -117 2 -146 -38
4857c8J34k64K7K82J36k03j78lLK0j42J02r7K92PJ30l96L74m0O7j69r5K34j61
$$ -38 96 -168 -141 141 277 74 -104 -107 -104 -84 -226 -124 -221 71 78 208 -188 186 146 213 44 -51 183 22
4881B2j76o1J27j6J63J63k31o0J58N3p5O1j19N7j48J14P5Q7k60M4p1O6j88L56
$$ 22 -154 -215 -88 -104 59 222 -9 -69 89 142 67 128 9 66 -82 32 107 194 -66 -22 -93 -27 -215 141
4905A41r4O2p6r9R1l11K45Q4q1r3K49j88j24J42l69N12j67nR4N2R9m36P2M08m27
$$ 141 47 109 33 -66 25 -286 -41 43 -38 -131 118 -70 -194 -52 -421 91 -76 -81 13 65 164 -272 -200 208 -219
4930b19K8R0l8J53j56J65j63J17K51j48K0k23J90J04k1j72p7L42q9O4O0j62n1
$$ -219 -191 -101 -139 14 -142 23 -140 -23 228 80 100 -123 67 171 150 -22 -99 243 154 218 278 116 65
4953F5r7K3j21K29m0k40j0J46J10J00lk93J4l0J42j70J36J66j00J7K11l3l64O3
$$ 65 -32 -9 -130 99 59 -181 -191 -45 65 165 162 -131 -117 -147 -5 -175 -39 127 27 44 255 222 -142 -79
4977g9K39j84j50M38j95J0j65N5q2MM5j64Q3O6K4K03j86J71p4k4j19J10j43R0
$$ -79 160 -24 -174 264 69 79 -86 -31 -113 -109 -64 -228 -145 -79 -55 148 -38 133 59 35 -84 26 -117 -27
5001b7J41j48n1m0L00j70o0M00k81k78l6J14J53m7K00N3l6k91kJ61O6j46l6J42
$$ -27 114 -34 -85 -125 175 5 -55 345 64 -214 -250 -136 17 -30 170 223 187 -104 -106 55 121 -25 -61 81
5025H1r3L0J30m36K86l14L38j26L19k35J35j9P6l6K0l12J52M6l2K17l49M13j82
$$ 81 -12 18 148 -288 -2 -316 22 -104 215 -20 115 96 172 136 156 -156 -4 42 10 227 -122 291 109
5048A09J04j26Q1k7l05J49N8mK1k20QJ38J03R1m2j86J30j35Q9N5k59J23K25k55
$$ 109 213 87 168 141 -164 -15 43 39 60 -160 -152 -14 89 180 138 -48 82 -53 36 91 -168 -45 180 -75
5072g5J23n3OJ77m13N3N7J68K96m91K95j48K49n88M31k76L74r6j92L55j61k83
$$ -75 48 -5 1 178 -235 -182 -125 43 339 -152 143 -5 244 -344 87 -189 185 89 -103 252 91 -192
5094a92L02j26k92K61Q2o0M6N9j61J57nR2j15j35j2J73m9p4q8Q6j42J9q2K72Q8
$$ -192 110 -16 -308 -47 35 -25 21 80 -81 76 71 163 48 -87 -99 74 25 -49 -137 -51 -193 -174 -256 16 104
5119A04M1K27l40n4k70K89k01L93l09j13J70J97m62J99J79J39o4N1k28m1L66j14
$$ 104 145 372 32 -22 -292 -3 -204 189 -120 -233 -63 134 -328 -129 50 189 125 176 -52 -93 273 159
5141A59m13M26o6M8r4j58K63J4J6l10J07K3J04k59J12J00K14L5l37qqJ55j47K27
$$ 159 -254 172 106 154 60 -98 165 179 195 -115 -8 15 119 -140 -28 72 286 321 -16 -24 -32 123 -24 203
5165B03k92L9L4O0nJ38j46k3j62J55j3j44K20k06J32J50R2m37K16L7r3K05l47
$$ 203 -89 -50 -16 44 39 177 31 8 -154 1 -12 -156 64 -142 -10 140 232 -205 11 48 -45 160 -187
5188a87J54j26R1J14j18J25j55O3N3j31N4L78j07k32J52q1Qj54K5K0j0L6J26M2
$$ -187 -33 -159 -68 46 -72 53 -102 -39 14 -117 -63 315 208 -24 128 47 55 -99 -74 -54 -64 -28 98 140
5212A40j73J29j09k15K44j09J64q9J64j00j34k3R5p2NO8m13O47l49q6L37q0k57
$$ 140 -33 96 -13 -228 16 -93 71 -18 146 46 -88 -111 -16 -88 -83 -15 -428 219 -130 -216 121 41 -216
5235b16K72j39LK99k20M0N0j21K24k99J75NM1J47j59k23r0K83j08K51K1l1k90
$$ -216 56 -83 -80 219 -1 39 89 -32 192 -107 68 73 114 261 102 -121 -211 72 -36 215 236 205 -85
5258h5k49K14l0J39j9p2K20K0j01K49j01l07J39m4m4J0Q7j23P7Q4kj00K96k16
$$ -85 -334 -120 -150 -11 -30 -102 118 138 37 286 185 -122 17 -27 -71 -61 26 -97 -20 64 62 -38 258 42
5282D2m9M9m5Ol3R5j11L77j57m76L27l3l2k37M27m4l07M03j68L52j04k72ON0J39
$$ 42 -7 42 -3 3 -30 65 -46 331 174 -302 25 -8 -40 -277 150 106 -201 202 34 386 282 10 16 66 205
5307B05l76K31n0l5j2K29l39K73k87K17r1k4J69m84M17r6J76j51m6j4l6L41l06
$$ 205 -171 60 10 -25 -37 192 -147 126 -161 56 -35 -59 110 -374 43 -53 123 -28 -74 -88 -124 217 -89
5330h9J5P7k1r8K83j54k50M53k77P5j8K1J1j53L66k58M5l01L82k83J31q0o4J89
$$ -89 -74 3 -18 -116 167 13 -237 216 -61 14 -4 17 28 -125 241 -17 28 -273 109 -174 -43 -123 -187 2
5354BJ78l52J30O4m4J65l06K65k69k0k8J84J12l39L12J2K0J0k26K10j78L46k16
$$ 2 180 -172 -42 22 -22 143 -163 102 -167 -187 -215 -31 81 -258 54 66 86 96 -130 80 -98 248 32
5377C2J74k73K58j87Pk65L37J3k46K51k83L96j94M02m74J28k0j42K06q4o1r3j3
$$ 32 206 -67 191 4 11 -254 83 96 -150 101 -182 214 20 422 -52 76 56 -86 120 36 -25 -118 -131
5400a31J93J08l04OK02j55K23k96L60O4j87j66m3L14k37J10J06P6l75M21l84J00
$$ -131 62 170 -134 -128 74 -81 142 -154 206 270 83 -83 -126 188 -49 61 167 243 -132 289 -95 5
5422El6l9m1K87o8k59K47l21K00L51k78j83J18K26j55l19L53k89K59K4j87J57
$$ 5 -31 -70 -111 176 108 -151 96 -225 -25 326 48 -135 -17 209 54 -265 88 -201 58 82 -105 52
5444E2p6k7J28j38rK43p1j32l5k3L77m08J09M2j55M12l59L3J7Q1j2L3j53K05k51
$$ 52 -24 -51 77 -61 -70 173 102 -30 -65 -88 289 -119 -10 32 -123 289 -70 -37 -20 61 49 82 -71 134 -117
5469a17K62j51N8j07M0J19m69N07N5k35O7j31J38M5j6J09j7k36j03J02j07J45
$$ -117 145 -6 52 -55 -15 104 -365 142 197 -38 29 -102 36 81 65 174 157 -79 -182 -80 -187 -42
5491d2L6m7j5o2K89k60R0J03j18K43l05P3m0q9K39k59J03K72q5j02l73L42k9Q6
$$ -42 -6 -53 -68 -130 159 -101 -11 92 -26 217 -88 -15 -55 -144 95 -164 -61 211 126 24 -349 -7 -36 50
5515E0k14K00q0l6J03l5K8L1j3M1k24K56j64J42o7k07L19k48L29l85J46J99l02
$$ 50 -164 36 -44 -80 23 -12 16 47 34 75 -149 107 -57 85 18 -189 130 -118 211 -174 -28 171 -131
5538a31j10J04L63j55o2j30q0J59J13k68J21M21k94k13K8l3J54K12l11K03j81
$$ -131 -241 -137 226 71 9 -121 -201 -42 71 -197 -76 345 51 -162 -134 -167 -13 199 -112 91 -90
5559i0M4L70N2k97K07M0k88J69k46K42k04J21j56K15m47K34K84k71L78l16r6K59
$$ -90 -46 324 376 79 286 326 38 207 -39 203 -1 120 -36 179 -268 -34 250 -21 357 41 -55 204
5581B04k13o5j51O8K18n1K37j07rm88K92p0J92l11L59L5m39L01j37j84K30J53
$$ 204 -9 -74 -225 -157 61 10 247 140 131 -357 -65 -135 57 -254 105 140 -299 2 -135 -319 -89 64
5603F4J48k52l0J16k35K75O1j85p1P1k7l5R7J6j59J21N9m4j2k63M96m04R1J54
$$ 64 212 -40 -70 46 -189 86 147 -38 -109 -38 -65 -100 -3 13 -146 -25 34 -10 -22 -285 211 -193 -102 52
5627E2p6J04j03j31j8K49J30j02k05O9j95J97q7J99k96Q6L16j3P5k13p6O3J29
$$ 52 -24 80 -23 -154 -172 77 207 105 -100 -31 -226 -29 -116 83 -213 -127 189 176 251 38 -38 25 154
5650A54j72j84L59l7J51k7k22m0j35J46j7k4jJ36o9L4l99L28J47J74j09n3ol17
$$ 154 -18 -202 157 120 271 244 22 -18 -153 -7 -24 -48 -49 87 18 52 -347 -19 128 302 193 140 134 -183
5674a83J52n3K75L1m64K98o6k31J38P6O6j37oJ16l12J72J28J68j23P5l08J97o
$$ -183 -31 -84 191 222 -242 56 -10 -241 -103 -27 39 -98 -104 12 -300 -128 0 168 45 120 -188 9 3
5697C%K72m92N7q4J61J84q4P8j88O1Pk6J10qL8Kn9J2J09j07j57M64p22K99R5J35
$$ 3 3 275 -217 -160 -244 -83 101 17 95 -93 -32 -25 -51 59 51 89 91 32 44 153 46 -111 353 -369 -70 25 160
5724A60k70O6n0K8j23m3K86j42K23k97K14J62o16L54J88m05K55q0j42M08j81K02
$$ 160 -110 -44 -94 -66 -189 -232 54 -88 135 -162 52 214 -402 -48 140 -265 -10 -90 -232 176 -5 197
5746A97k99L3R9J05M4j92J7O2M0l84L56L6j96j36L8K9J16j90J3K57o6J84l38J68
$$ 197 -102 -69 30 135 179 -13 4 66 106 -278 78 114 -82 -218 -180 -151 -35 -225 -212 45 -21 163 -175 -7
5770gl1J72j47K31k69J7M2K94l63J43j29o6o4K78j45k4L11m13J98K8K34j15k48
$$ -7 -38 134 -13 218 -51 -34 8 302 -61 82 -47 -113 -177 101 -44 -68 243 -170 28 56 290 175 -73
5793g3j37J75R6k11m9L26l15m5J86o5k12J76K8K97p2k87J74K9j18l1N18n55J94
$$ -73 -210 -35 61 -150 -199 127 -188 -233 -47 -112 -324 -148 -120 177 105 -182 -8 21 -97 -128 390 -165 29
5816B9P2K2L0k06K2P6k65K11m4Ql4m8r4Q8J2J17J26k25K42j55J53J03J27m04R6
$$ 29 101 123 153 -53 -31 45 -220 -9 -53 -45 -79 -127 -221 -133 -121 -4 122 -103 139 -16 137 240 367 -37 59
5841E9J07l88L30r7J43k7j19j49L83k27%N3j73P2J48J40k38J62l05R7j89M47j20
$$ 59 166 -222 108 11 154 127 8 -141 242 15 15 68 -105 -33 115 255 17 179 -126 -29 -218 229 109
5864A09j3o3J65J75m53J68M1k46L64k39l6J31Jj08j16L56m35l9J91M16k60J13
$$ 109 96 33 198 373 -80 88 129 -117 247 8 -28 103 104 -4 -120 236 -199 -238 -47 369 109 222
5886B22l35K7J6J64k46O7J01k46N8l5K77J58Rl75L72m56K2K87r6n8J81j63M4n4
$$ 222 -113 -86 -70 94 -152 -85 16 -230 -172 -207 70 228 237 -138 234 -222 -200 87 -9 -67 114 -49 -5 -59
5910e9K23O7k19m5J3J17j83Lj3O7J94o6J45l25J64O3k67J98k19K03l52M97k39
$$ -59 164 231 12 -33 -20 97 -86 -83 -96 -29 165 99 244 -81 83 146 -121 77 -142 61 -291 206 -33
5933c3K36o5Qj88J22N7J75n88J85K89l04J53k07K02K13j03r1Q3l90K67lr6J38
$$ -33 203 138 146 -42 80 137 312 -276 -91 198 -106 47 -160 42 255 152 61 144 -246 21 18 -78 60
5956F0l70J81K91R0k77J77m0l22J14k0m0P4J29r9K42j92K4L2j63J56k73L68p2
$$ 60 -310 -129 162 252 -25 152 112 -210 -96 -116 -156 -82 47 -52 190 -2 22 54 -109 47 -226 142 70
5979G0j46J84K9l29M38k60K94l46K30j95j32J81j22J42k20K93j17k01K40j99L6
$$ 70 -76 108 137 -192 246 -14 280 -66 164 -31 -163 18 -104 38 -182 111 -6 -207 33 -166 -130
6000a30J00J59J35l98O9k8%j87L5M60o6j76k11L39K07l27K84k72o0l2J14L05n49
$$ -130 -30 129 264 -134 -65 -93 -93 -280 -245 215 149 -27 -238 101 308 -19 265 -7 -67 -99 15 320 -229
6023b29J98J55K3j24n1%k07J54J70J96j91l43K84j07j12J24R3J28n4k17n8O8J55
$$ -229 -31 124 147 23 -28 -28 -235 -81 89 285 94 -249 35 -72 -184 -60 33 161 107 -110 -168 -100 55
6046E5q2R7k59J30N2km0P5k16K41K4j64K7j29M55r7k62l0J13j09j27J59K37k13
$$ 55 -27 70 -189 -59 -7 -9 -49 26 -190 51 75 -89 -62 -191 264 167 -95 -125 -12 -121 -248 -89 148 -65
6070f5J28l54L79j57J87l0n8o8k4J48j25j0M5k39l1N0J35j64j61N37k%j93J39
$$ -65 63 -291 88 -69 118 88 30 -38 -62 86 -39 -49 -4 -243 -274 -224 -89 -253 -414 123 121 121 -72 67
6094F7j06J9L3j0J13j43j54J58J18R2K7j7n5oN5P4k5q1l74K97j53K99m6j66N1
$$ 67 -39 -20 13 3 116 -27 -181 -23 95 187 214 197 142 136 191 265 240 159 -215 82 -71 228 182 16 67
6119F7j19J06J05n0K39l35J4k1J83j36l01L17K25k19jn6l42M52k87J82j07L00
$$ 67 -52 54 159 109 348 13 27 6 189 53 -248 69 294 75 74 18 -324 128 -159 23 -84 216
6141B16j64O7j42j44K18q2J20J50k73J32j24j9k46L31k7k0k10j9J23P4K88n4m5
$$ 216 52 119 -23 -167 51 -31 89 239 -34 98 -26 -45 -291 40 13 -7 -217 -236 -113 -39 249 195 150
6164A50r4j78J24P8p8K22j39j92j13J77k74K86K5K66k40K01m44O8K01k21J09M6
$$ 150 56 -122 2 80 2 224 85 -107 -220 -43 -317 -31 -6 260 20 221 -223 -155 46 -175 -66 -20
6186b0P4l1j84J20J76J84l29q4J89k80M38k64J14j73L51m8k77L5J40k2j42p3N0
$$ -20 54 23 -161 -41 135 319 -10 -94 95 -185 253 -11 103 -70 281 233 -44 -9 131 109 -33 -106 -56
6209e6j27J97J06j24j51K63j43L58l94R6J2J15j03j66K62L2L7q0j64J31n4N6l07
$$ -56 -183 14 120 -4 -155 108 -35 323 -71 25 37 152 49 -117 145 177 214 134 -30 101 47 103 -204
6232b04K54J95l73k4R7j45K79r6L78k05k55K71q8o1N8j76l2K18P1j66R3j26J20
$$ -204 50 245 -128 -152 -55 -200 79 -17 361 156 -99 172 84 23 81 -95 -127 91 162 -4 89 -37 83
6255H3%Nk48J42J12k0j66j48L54k05l4L04q2R1j92j02L44j95K79n96M27nl85K62
$$ 83 83 88 -160 -18 94 74 -92 -240 114 -91 -125 179 97 188 -4 -106 238 43 322 -274 153 148 -237 25
6279B5j73M71k41J65l11J8j75L35k08r6J41r6j48O76k79k05J62m1j76J57n2p2
$$ 25 -148 323 82 247 -64 -46 -221 114 -94 -190 -49 -145 -293 383 104 -101 61 20 -156 1 -51 -123
6301a23K02p5j47K82j75l9O2J48l05N7K08l1J56o2j30k7n6j5J10j14Rn8K80k46
$$ -123 79 4 -143 139 -36 -75 -13 135 -170 -113 95 64 220 158 28 1 -55 -70 40 -74 -65 -123 157 -89
$$ [...]
8191B7
##END NTUPLES=NMR FID
##END=
