##TITLE=1H_Pr 58-3
 CDCl3
 8 sc, 
 28.10.2022
##JCAMPDX= 6.0         $$ Bruker NMR JCAMP-DX V2.0
##DATA TYPE= NMR FID
##DATA CLASS= NTUPLES
##ORIGIN= UXNMR, Bruker Analytische Messtechnik GmbH
##OWNER= root
$$ XWIN-NMR		Version 3.5
$$ Fri Oct 28 13:45:04 2022 Russian Standard Time (UT+4h)  she@DPX200
##.OBSERVE FREQUENCY= 200.1313499994
##.OBSERVE NUCLEUS= ^1H
##.DELAY= (6, 6)
##.ACQUISITION MODE= SIMULTANEOUS
##.ACQUISITION SCHEME= undefined
##.AVERAGES= 8
##.DIGITISER RES= 18
##SPECTROMETER/DATA SYSTEM= spect
##.PULSE SEQUENCE= zg30
##.SOLVENT NAME= CDCl3
##.SHIFT REFERENCE= (INTERNAL, CDCl3, 0, 15.7039)
##AUDIT TRAIL= $$ (NUMBER, WHEN, WHO, WHERE, WHAT)
$$ ##TITLE= Audit trail, XWIN-NMR		Version 3.5
$$ ##JCAMPDX= 5.01
$$ ##ORIGIN= Bruker BioSpin GmbH
$$ ##OWNER= she
$$ F:/spectra/data/she/nmr/H-F/1/audita.txt
$$ ##AUDIT TRAIL=  $$ (NUMBER, WHEN, WHO, WHERE, WHAT)
(   1,<2022-10-28 13:44:04.53 +0400>,<she>,<DPX200>,
      <created by zg, POWCHK disabled, PULCHK disabled
       configuration hash MD5:
       00 E9 B6 7A A2 85 ED C7 34 08 36 98 17 FE 4E 26
       data hash MD5: 16K
       64 85 E1 AA 13 25 E7 44 23 83 45 7E 73 6E 8E 3B>)
$$ ##END=
$$ 
$$ hash MD5
$$ 07 DC 25 6B 23 F9 A6 1F 1E F3 4C F7 71 63 10 5A
##$RELAX= 
##$RELAX= 
##$RELAX= 
##$RELAX= 
##$RELAX= 
##$RELAX= 
$$ Bruker specific parameters
$$ --------------------------
##$DU= <F:/spectra>
##$EXPNO= 1
##$NAME= <H-F>
##$PROCNO= 1
##$TYPE= <nmr>
##$USER= <she>
##$AMP= (0..31)
100 100 100 100 100 100 100 100 100 100 100 100 100 100 100 100 100 100 
100 100 100 100 100 100 100 100 100 100 100 100 100 100 
##$AQSEQ= 0
##$AQ_mod= 1
##$AUNM= <au_zg>
##$AUTOPOS= <>
##$BF1= 200.13
##$BF2= 200.13
##$BF3= 200.13
##$BF4= 200.13
##$BF5= 200.13
##$BF6= 200.13
##$BF7= 200.13
##$BF8= 200.13
##$BYTORDA= 1
##$CFDGTYP= 0
##$CFRGTYP= 5
##$CHEMSTR= <none>
##$CNST= (0..31)
1 1 145 1 1 1 1 1 1 1 1 1 1 1 1 1 1 1 1 1 1 1 1 1 1 1 1 1 1 1 1 1 
##$CPDPRG= <>
##$CPDPRG1= <>
##$CPDPRG2= <>
##$CPDPRG3= <>
##$CPDPRG4= <mlev>
##$CPDPRG5= <mlev>
##$CPDPRG6= <mlev>
##$CPDPRG7= <mlev>
##$CPDPRG8= <mlev>
##$CPDPRGB= <>
##$CPDPRGT= <>
##$D= (0..31)
0 1.2 0 0 0 0 0 0 0 0.06 0 0.03 0 0 0 0 0.0002 0 0 0 0 0 0 0 0 0 0 0 0 
0 0 0 
##$DATE= 1666950244
##$DBL= (0..7)
120 120 120 120 120 120 120 120 
##$DBP= (0..7)
150 150 150 150 150 150 150 150 
##$DBP07= 0
##$DBPNAM0= <>
##$DBPNAM1= <>
##$DBPNAM2= <>
##$DBPNAM3= <>
##$DBPNAM4= <>
##$DBPNAM5= <>
##$DBPNAM6= <>
##$DBPNAM7= <>
##$DBPOAL= (0..7)
0.5 0.5 0.5 0.5 0.5 0.5 0.5 0.5 
##$DBPOFFS= (0..7)
0 0 0 0 0 0 0 0 
##$DE= 6
##$DECBNUC= <off>
##$DECIM= 32
##$DECNUC= <off>
##$DECSTAT= 4
##$DIGMOD= 1
##$DIGTYP= 9
##$DL= (0..7)
0 120 120 120 120 120 120 120 
##$DP= (0..7)
150 150 150 150 150 150 150 150 
##$DP07= 0
##$DPNAME0= <>
##$DPNAME1= <>
##$DPNAME2= <>
##$DPNAME3= <>
##$DPNAME4= <>
##$DPNAME5= <>
##$DPNAME6= <>
##$DPNAME7= <>
##$DPOAL= (0..7)
0.5 0.5 0.5 0.5 0.5 0.5 0.5 0.5 
##$DPOFFS= (0..7)
0 0 0 0 0 0 0 0 
##$DQDMODE= 0
##$DR= 18
##$DS= 0
##$DSLIST= <SSSSSSSSSSSSSSS>
$$ [...]
##$SUBNAM2= <"">
##$SUBNAM3= <"">
##$SUBNAM4= <"">
##$SUBNAM5= <"">
##$SUBNAM6= <"">
##$SUBNAM7= <"">
##$SUBNAM8= <"">
##$SUBNAM9= <"">
##$SW= 18.0517283424941
##$SWIBOX= (0..15)
0 0 2 0 0 0 0 0 0 0 0 0 0 0 0 0 
##$SW_h= 3612.71676300578
##$TD= 16384
##$TD0= 1
##$TE= 0
##$TE2= 300
##$TE3= 300
##$TEG= 300
##$TL= (0..7)
0 120 120 120 120 120 120 120 
##$TP= (0..7)
150 150 150 150 150 150 150 150 
##$TP07= 0
##$TPNAME0= <>
##$TPNAME1= <>
##$TPNAME2= <>
##$TPNAME3= <>
##$TPNAME4= <>
##$TPNAME5= <>
##$TPNAME6= <>
##$TPNAME7= <>
##$TPOAL= (0..7)
0.5 0.5 0.5 0.5 0.5 0.5 0.5 0.5 
##$TPOFFS= (0..7)
0 0 0 0 0 0 0 0 
##$TUNHIN= 0
##$TUNHOUT= 0
##$TUNXOUT= 0
##$USERA1= <user>
##$USERA2= <user>
##$USERA3= <user>
##$USERA4= <user>
##$USERA5= <user>
##$V9= 5
##$VALIST= <valist>
##$VCLIST= <CCCCCCCCCCCCCCC>
##$VD= 0
##$VDLIST= <DDDDDDDDDDDDDDD>
##$VPLIST= <PPPPPPPPPPPPPPP>
##$VTLIST= <TTTTTTTTTTTTTTT>
##$WBST= 1024
##$WBSW= 4
##$XGAIN= (0..3)
0 0 0 0 
##$XL= 0
##$YL= 0
##$YMAX_a= 420644
##$YMIN_a= -726715
##$ZGOPTNS= <>
##$ZL1= 120
##$ZL2= 120
##$ZL3= 120
##$ZL4= 120
##$ABSF1= 10
##$ABSF2= 0
##$ABSG= 5
##$ABSL= 3
##$ALPHA= 0
##$AQORDER= 0
##$ASSFAC= 0
##$ASSFACI= 0
##$ASSFACX= 0
##$ASSWID= 0
##$AUNMP= <proc_1d>
##$AZFE= 0.1
##$AZFW= 0.1
##$BCFW= 1
##$BC_mod= 2
##$BYTORDP= 1
##$COROFFS= 0
##$CY= 11.3945322036743
##$DATMOD= 1
##$DC= 2
##$DFILT= <>
##$DTYPP= 0
##$F1P= 2.36226072786647
##$F2P= -0.459571619588291
##$FCOR= 0.5
##$FTSIZE= 0
##$FT_mod= 4
##$GAMMA= 1
##$GB= 0.15
##$INTBC= 1
##$INTSCL= 1
##$ISEN= 128
##$LB= 0.24
##$LEV0= 0
##$LPBIN= 0
##$MAXI= 10000
##$MC2= 0
##$MEAN= 0
##$ME_mod= 0
##$MI= 1.114404
##$NCOEF= 0
##$NC_proc= 0
##$NLEV= 6
##$NOISF1= 3.799351
##$NOISF2= 2.8
##$NSP= 1
##$NTH_PI= 0
##$NZP= 0
##$OFFSET= 15.70392
##$PC= 1
##$PHC0= -18396.17
##$PHC1= 12.2007
##$PH_mod= 1
##$PKNL= yes
##$PPARMOD= 0
##$PSCAL= 0
##$PSIGN= 0
##$REVERSE= no
##$SF= 200.130013532006
##$SI= 16384
##$SIGF1= 3
##$SIGF2= 2
##$SINO= 400
##$SIOLD= 16384
##$SREGLST= <1H.CDCl3>
##$SSB= 0
##$STSI= 0
##$STSR= 0
##$SW_p= 3612.71676300578
##$SYMM= 0
##$S_DEV= 0
##$TDeff= 0
##$TDoff= 0
##$TI= <>
##$TILT= no
##$TM1= 0
##$TM2= 0
##$TOPLEV= 0
##$USERP1= <user>
##$USERP2= <user>
##$USERP3= <user>
##$USERP4= <user>
##$USERP5= <user>
##$WDW= 1
##$XDIM= 8192
##$YMAX_p= 0
##$YMIN_p= 0
$$ End of Bruker specific parameters
$$ ---------------------------------
##NTUPLES= NMR FID
##VAR_NAME=  TIME,          FID/REAL,        FID/IMAG
##SYMBOL=    X,             R,               I
##VAR_TYPE=  INDEPENDENT,   DEPENDENT,       DEPENDENT
##VAR_FORM=  AFFN,          ASDF,            ASDF
##VAR_DIM=   8192,          8192,            8192
##UNITS=     SECONDS,       ARBITRARY UNITS, ARBITRARY UNITS
##FACTOR=    0.0002768,     1,               1
##FIRST=     0,             0,               0
##LAST=      2.2672688,     0,               0
##MIN=       0,             -726715,         0
##MAX=       2.2672688,     420644,          0
$$ Real data points
##PAGE= N=1
##DATA TABLE= (X++(R..R)), XYDATA
0@%%%%%%%Qj6J6j6J6k4L3m1N6p2Q8j04J28j53J82k21K61l07L59m18M85n61O44
30C43p37Q42r59J089j232J391j563J752j964K196k446K721l022L349l708M099
46B151m528M998n508O068o684P364q116Q950r878J0919j2101J3450j5002J6815
60H898j8968K1569k4788K8894l4337M1941n3393P2800j14087L54474m55769m46196
72f18962Q72711J5793l72722R9766N6375k91898K59168K10681l25446r1552L35694
83A49608j01004k03866J62368J07827j17539J8216o2021q3741K16709J24673l14407
94a03177r8039K58088L3071j25064O6162l5569j21307J39388J29497j51594m8742
105e7286R5430n4294j9216J42671m8161j71760O8165J27561p0261o1153M2194
$$ plain form
0 0 0 0 0 0 0 0 0 8 -8 8 -8 8 -16 17 -24 32 -40 48 -56 72 -81 101 -120 141 -166 193 -225 260 -301 343
30 343 -394 448 -511 578 -654 737 -826 926 -1038 1158 -1288 1433 -1589 1760 -1948 2151
46 2151 -2377 2621 -2887 3181 -3503 3861 -4255 4695 -5183 5736 -6365 7085 -7917 8898
60 8898 -10070 11499 -13289 15605 -18732 23209 -30184 42616 -71471 283003 -172766 -618962
72 -618962 253749 269542 -103180 -3414 52961 -238937 20231 230912 -94534 -186086 149608
83 149608 48604 -155262 7106 114933 -2606 15610 -46411 -130152 86557 211230 -103177
94 -103177 -201216 56872 89943 -35121 31041 -4528 -125835 13553 143050 -8544 -57286
105 -57286 38144 -16150 -35366 107305 59144 -112616 -44451 83110 12849 -48304 -6110
116f110M481j3683O268j0436K7970K8147o5743k3921Q7586J0061o0647K0396J154
129E523n3540O7724P6129j20400q3405J33258O9880j14901m5963P9697K3909m4296
141f385j0263K3416Q142j4545j1443J0002R979o169m600r791j0712L0181K2553
154C0365n2759k7278O7115K4801o1047j0833M2516l3r834Q358j8937k257L8115
167B8292j4451m3716L1561L4000m2653k2514L3827J2094j1262j1020k0140J7239
179h743M5896k6250n3947L1773M2145l0423j5543K0233j2002m120K6746j1354
191D411k3461K4719P806l0314J1395K9963j8932j9536J3601N015M177P030k3594
204g720j2213L3020N827l3212N244J9740j7534m708K0809r308j2008J7439o211
$$ plain form
116 -6110 -1629 -15312 -9044 -19480 8490 36637 -29106 -53027 34559 44620 -16027 4369 5523
129 5523 -48017 19707 95836 -24564 -107969 25289 95169 -19732 -65695 14002 37911 -6385
141 -6385 -16648 6768 14910 365 -11078 -1076 8903 2734 -1866 -11657 -22369 7812 30365
154 30365 -22394 -49672 17443 42244 -18803 -29636 12880 12847 3013 11371 -7566 -9823 28292
167 28292 13841 -29875 1686 35686 -6967 -29481 4346 16440 5178 -5842 -25982 -8743
179 -8743 37153 10903 -43044 -11271 30874 451 -15092 5141 -6861 -10981 15765 4411
191 4411 -19050 5669 13475 -16839 -5444 24519 5587 -13949 -348 4667 8844 15874 -7720
204 -7720 -19933 13087 18914 -14298 -9054 10686 -6848 -11556 9253 -55 -12063 5376 -835
217h35j7748K6525J4437l6672o882L3833K62j6922N811k338q645J7294N545k0672
231g007J500J4896j0529m465J4425m103j2659P497L920p189N493J863j2218K514
245f062J2607p499p467J0053N33r150M863P050m750k095L068l117K181P780m262
260C733r895N255Q631l478o926M89L875K109l189m913K472N567k610n843J781
275b942L956q92j738K5r88J394K834j521l614K372M357k314l698K382M349k075
291A887l011J671J795r55l59L49j434J90J503j649j160J621j89k421J057J898
307G93j704j575J647N41p42L93K56m47J051J15j102J521J064k000l62K282p33
324I98r20J650L3k531N27K613j580k164J856P25k330N8J400r51o58Q01l88p38
$$ plain form
217 -835 -18583 7942 22379 -14293 -21175 12658 12920 -4002 1809 -529 -9174 8120 13665 -7007
231 -7007 -5507 9389 -1140 -5605 8820 4717 -7942 -445 3475 -3714 1779 3642 -8576 -6062
245 -6062 6545 -954 -8421 1632 2165 -6985 -2122 4928 178 -1917 1151 -1966 215 7995 3733
260 3733 -6162 -907 7724 4246 -2680 -2191 1684 3793 604 -4309 -1837 3730 1120 -4723 -2942
275 -2942 1014 122 -1616 -1591 -2579 -1185 1649 128 -3486 -1114 3243 929 -2769 -387 3962 1887
291 1887 -1124 547 2342 1387 1028 1377 -57 133 1636 -13 -1173 448 259 -2162 -1105 793
307 793 -911 -2486 -839 -298 -1040 -647 -391 -838 213 328 -774 747 1811 -189 -551 1731 998
324 998 78 1728 1761 -770 -243 2370 790 -1374 482 1207 -1123 -1065 335 -616 -1274 -473 -861 -1599
342a599J171M54j245K80J302q67K75J071n98p48J309Q34j104j89N84n50J84R25
360A489j351n23J299n65j585J384P20k125j9J589p27j321K006K21j974K62J632
377D12l11j34K01p60N75J433p29j165J187k45l03J430r16j920J653J895k355j346
395a398K025m0j007K82n40o29J757l2k261O06K120j462o50J460o47k30J819q17
413C56k161K220J852k180q63J574q74O91J660k711j651L337O13k463R08N0k141
430a783J385K215k635q11K134j016r34K567k78k826J571R03j517J663J404l115
446a073j093L780J83k353J543p11k124K853J924l687p39L084j831p62L018j987
462B5k757K693J322k220R39O29l341J774M078l217l043L655M83k384K283M15l338
$$ plain form
342 -1599 -428 26 -1219 -939 363 -504 -229 842 244 -504 805 1639 535 346 930 380 564 1489
360 1489 138 -385 914 349 -1236 148 868 -1257 -1276 313 -414 -1735 271 492 -1482 -1220 412
377 412 101 -33 168 -592 -17 1416 687 -478 709 464 161 1591 675 -1245 408 2303 -52 -1398
395 -1398 627 587 -420 -138 -678 -1307 450 418 -1843 -1237 883 -579 -1229 231 -416 -646 1173 356
413 356 -1805 415 2267 87 -776 798 -76 615 2275 -436 -2087 1250 1863 -600 308 358 -1783
430 -1783 -398 1817 -818 -1629 505 -511 -1445 1122 844 -1982 -411 492 -1025 638 2042 -1073
446 -1073 -2166 1614 1797 -556 987 276 -1848 1005 2929 -758 -1497 1587 -244 -1006 2012 25
462 25 -2732 -39 1283 -937 2 631 -2710 -936 3142 -75 -3118 537 1020 -1364 919 1334 -2004
479b004J624L096k946j120L617j735k793L138Q93k237O99K35l002K987L195m892
495a245k112L618J301k233R05n48k183K697K326l366p84K194o56m32K182j334
511C30k278K253J001k354J541J273k768l03K617m82j203R35j164p06K194N09k542
528a147L03R44m84O85J105k396r85K707M44j727K13N69p94Q66M72j113q8P14m28
547a40J18R53o60j093J004N0m92M02k3o86J99J049r67l65Q08k10LN54q46k49R77
568C86j10m57L28l75o27J214L82j120k43O74j14N09L11j177n13J380p5n47N89
587D15n35p74J423O88j788M8J106r28j64K077j088k040J084R63l80N23m22j876
605a668J145J946j221j192J199p50m51K460m64k596R00J794j464M64J326k068
$$ plain form
479 -2004 -380 2716 -230 -1350 2267 532 -2261 877 1770 -467 232 467 -2535 452 3647 -1245
495 -1245 -3357 261 1562 -671 234 -314 -2497 200 2526 -840 -1624 570 -86 -518 1664 330
511 330 -1948 305 1306 -1048 493 1766 -1002 -1305 1312 830 -373 562 -602 -1308 886 1395 -1147
528 -1147 -844 100 -384 301 1406 -990 -1975 732 1176 -551 -338 231 -563 303 775 -338 -426 288 -140
547 -140 -22 931 271 -822 182 232 -260 142 119 -567 -368 681 -286 -651 157 -53 -50 504 -342 -591 386
568 386 276 -181 147 -228 -855 359 741 -379 -622 52 -62 447 758 -419 -932 448 373 -174 415
587 415 -120 -894 529 1217 -571 -523 583 -345 -509 1568 480 -1560 -476 487 107 630 208 -1668
605 -1668 -523 1423 202 -990 209 -541 -992 1468 1004 -1592 -692 1102 -362 102 1428 -640
621f40q24K590j21j681R06j44j224J724J311k960j5J796j203q6K147j452k314
638b190K003J281j320J58K95j772J349K275k184j344K066j80q27J713r1l087J540
655c15J940j908l4J446j779o84K596l00j776O31J3q36K302K3l127K96K938j245
673A81j016J693j080j490K312O14j861O23M20j771J425K862k626k414K557M39
689H68j140J500o85k657J983K461k529q77J680r87o56K005m89k056J529K83j752
706a519J931J079k691m61K564L6j148P94m77j119J735P15k100N61Q45j178K16
723b17J857j831j375K142K27j617J051J58j790J070J518j646o25J468n75p18J814
740I11q38j172J045Q63j463P31J430k079k70K002j41j623J128l36l46J189J68
$$ plain form
621 -640 -1464 1126 1005 -676 230 86 -1138 586 1897 -1063 -1078 718 -485 -571 1576 124 -2190
638 -2190 -187 1094 -226 -68 227 -1545 -196 2079 -105 -1449 617 437 -390 1323 1232 -1855 -315
655 -315 1625 -283 -317 1129 -650 -1334 1262 962 -814 -183 -170 -1006 1296 1319 -1808 -1512 1426 181
673 181 -835 858 -222 -1712 600 1214 -647 -24 396 -1375 50 2912 286 -2128 429 868
689 868 -272 1228 543 -2114 -131 2330 -199 -1076 604 -383 -1039 966 477 -1579 -50 233 -1519
706 -1519 412 1491 -1200 -1661 903 939 -209 585 108 -1011 724 1439 -661 -100 745 -433 -217
723 -217 1640 -191 -1566 576 803 -814 237 395 -1395 -325 1193 -453 -1078 390 -185 -903 911
740 911 73 -1099 -54 809 -654 77 1507 -572 -842 1160 1019 -604 524 188 -158 1031 1199
757A199k133L39J378q65q15J355o36r88J192L35r37J03N85q26k8J637n99q15M89
776c0R7j88Q27R1j235O83R47p72n82P16J27j091L05N72q73L19K30o97K42L13l93
797c92q1N02k14p38P60K74m89K06M56m17K09K71K5j81J70m0k09K64J78l41r2L34
819D55r05M48K72K33p75J44J58l4k57j86K01j81M13l80K31K36n68K05K41N76m89
840C8k70N57l5k29J16O07n66k15M58k14k22j9n8M0l33J68J02J9n07J19L2M70k27
863a69N8j29KJ82j45P1L27k03j41O8M34j3l46P34m42m89K39O69n83k50l4K20K94
886C54k93m97O6J54L42q38P49J17r27K26P86k15m49N97on79N60J86m10L20J09
907C52k38j15O15m59m49Q59j62p03P02K57j378J95J012q03k58L36j78n8Q04m14
$$ plain form
757 1199 -934 -595 783 -82 -897 458 -178 -1166 26 361 -576 -473 112 -714 -742 895 296 -519 -30
776 -30 67 -121 706 797 -438 245 1192 420 -162 554 681 -410 -105 467 -406 -87 143 -554 -312 1 -392
797 -392 -473 29 -185 -923 -163 111 -378 -172 284 -133 76 347 372 191 361 321 112 376 554 213 121 455
819 455 -450 -2 270 503 -272 -128 30 -4 -261 -447 -246 -427 -14 -394 -163 73 -495 -290 -49 527 38
840 38 -232 325 290 61 177 784 218 3 461 247 25 6 -52 -12 -345 -177 -75 -56 -563 -444 -412 58 -169
863 -169 -111 -240 -238 -56 -201 -130 197 -6 -147 -79 355 342 -4 730 288 -201 38 707 124 -126 -160 60 354
886 354 61 -436 -370 -216 126 -712 37 154 -773 -547 239 24 -425 172 166 -413 147 333 -77 243 352
907 352 114 -1 614 155 -294 565 403 -300 402 659 -719 -524 488 -315 -573 -237 -415 -473 331 -83
927h3j040R62Q29j305M14P64j153j39K168j101j301J575K59r53N43N52j437Q2
945c64J154j366J30J388j343j225J884O32j753L26Q61j346N23J948j522j682J877
962A22L18q40J357l55k140J290K233j962q80J944j212r96K740l01k427O16J297
979H04j649Q70J897k642j229K420M5j243J296o84k110K374K090l316J08J620j390
996g39k9K951j466k909K497J286j846N48J044l055N71L687j827k138J897o28j363
1013a519L001K84l964J057K174j834J12K564k616k018L600Q66k456P66N73k616
1029b026K207K948l175j697K619l48q83K346j150l744K669K455k253m84J674k926
1045a768J36M108j212l403J883N42j742K486Q27m099K33L484j061j234K532j796
$$ plain form
927 -83 -1123 -161 668 -637 -223 541 -612 -751 1417 316 -985 590 849 -104 439 991 -446 -364
945 -364 790 -576 -446 942 -401 -1626 258 890 -863 -537 324 -1022 -499 1449 -73 -1755 122
962 122 440 -400 957 602 -1538 -248 1985 23 -857 1087 -125 -1121 1619 1318 -1109 -493 804
979 804 -845 25 1922 -720 -1949 471 516 -727 569 -115 -2225 149 2239 -1077 -969 651 -739
996 -739 -768 2183 717 -2192 305 1591 -255 293 1337 -1718 -1147 2540 713 -1425 472 -156 -1519
1013 -1519 1482 1766 -2198 -1141 1033 -801 -689 1875 -741 -2759 841 1707 -749 17 590 -2026
1029 -2026 181 3129 -46 -1743 876 528 -355 1991 841 -2903 -234 2221 -32 -516 1158 -1768
1045 -1768 -1632 2476 1264 -2139 -256 286 -1456 1030 1857 -2242 -2009 1475 414 -820 1712 -84
1061h4k862L992J674l325j0J085j873J559L118l067k705K801N18j394J912n78
1077G61l643K304L279k763j615K629k113r71M200n54l662J552J455j654J657J335
1093B197m098m94M499n69k634K319j098k480L315K198m158m02K102j282J84K716
1109B315k415k857L048J097j726J044K4k809J490L684k201k864K538j1j532K623
1125A448M46l790R92K496j639L59J508k710j223L513L51k629Q51K78k069K087
1141B69K122l018j125K141k43q90J889q66k547J902K153k036K75J083k186J59
1157i18L215j300k547J478Q71j341J266N25k505J48K622j495o00J641j268j775
1173a983K692Q30k446K54J181j342P75J351j464j454K111J14j184R51J15j755
$$ plain form
1061 -84 -2946 1046 2720 -605 -615 470 -1403 156 3274 207 -2498 303 821 -573 1339 761
1077 761 -2882 -578 2701 -62 -1677 952 -1161 -2132 2068 1514 -2148 -596 859 -795 862 2197
1093 2197 -1901 -2395 2104 1535 -1099 1220 122 -2358 957 3155 -1003 -1405 697 -585 -401 2315
1109 2315 -100 -2957 91 1188 -538 506 530 -2279 -789 2895 694 -2170 368 357 -1175 1448
1125 1448 1894 -1896 -904 1592 -47 312 1820 -890 -2113 1400 1751 -878 -27 251 -1818 269
1141 269 2391 -627 -1752 389 146 -744 1145 279 -2268 -366 1787 -249 26 1109 -1077 -918
1157 -918 2297 997 -1550 -72 799 -542 724 1249 -1256 -1108 1514 19 -581 1060 -208 -1983
1173 -1983 709 1539 -907 -653 528 -814 -39 1312 -152 -1606 505 619 -565 386 501 -1254
1189a254J267J506j596m79J028q09m96J863k36j863P86R75q29M17j99q22m3J780
1207I96p13r81Q68j8r09Q39O90j064k11O97l71o3J096r51o47J057M42p73J61J72
1227C17q63M50J074r14n43P59k43o35Q06J05p96P4M54k26K68K77q67r1R66l09
1247F3p68P85J72m11N49n8m25l4O06k49k99M31j1l96m1L38n70N20k97l00J49N59
1269C13k74l80K47L45n68K35N2j80R5K87k60j59M46l33L2L53J73n24R6MK0K9J58
1292B07l22k62O76j05j54j3j08j24L38L0q2k85K21K3l6J78k09J75j61K18k46o0
1314a01O5J37n7l06M63j87k4k10K40J23k41K23j31K29j81O9m07M07L8k11K02j12
1336B8J7k69L98k73J84J1j12K6M0K1j63J80K3j70J01n9N5m8j10J21P0n5j37J08
$$ plain form
1189 -1254 13 1519 -77 -556 472 -337 -833 1030 794 -1069 -283 692 -137 280 81 -741 -784 996
1207 996 283 -698 170 152 -757 82 772 -292 -503 194 -177 -240 856 -95 -742 315 757 -16 145 317
1227 317 -546 -96 978 64 -479 280 37 -598 208 313 -483 -409 45 -181 87 364 -503 -594 372 63
1247 63 -705 80 252 -159 390 332 -93 -127 479 230 -69 362 351 -45 -86 252 -318 202 -95 -395 -246 313
1269 313 39 -341 -94 251 -317 -82 -30 -210 -115 172 -88 -247 199 -134 -102 251 424 -100 -4 0 20 49 207
1292 207 -115 -377 299 194 40 27 -81 -205 133 163 81 -204 17 40 4 182 -27 148 -13 205 -41 -101
1314 -101 -36 101 44 -262 201 14 -10 -220 20 143 -98 125 -6 223 42 111 -296 111 149 -62 140 28
1336 28 45 -224 174 -99 85 96 -16 10 50 71 -92 88 111 -59 42 -17 38 -10 -120 1 71 16 -121 -13
1360a3k44R8J92j0p2j05K53k78J53n3K06k87J24K4Q0l6p1O1l1j03K27k66J69J37
1384A55k24K16p3j66J33n1r8L9M21l61J74j06k38L72p1j23m6j91L15p8J79p5j13
1407a0J58j12O3k8k0p8O8k22L09J53n47J25Q8m0j82J31L17j02j72k2L33r0k63
1430a43L35j01j20L35K2l62l3Q4mo6J67j39M1O7R8j52N1j44j2J62J24l09J80l50
1454b69l7K61L5j02M3J20j85R4J95k19n9J32J61r3J28l0l41J29K16k28m8L12l85
1477a70J8K19J7l69Q1M03l97J5M05m74K44J76nj61J82P5k65N6N84o88j62K64j36
1500h8j67O15k65n08M06K62l42M5J68m86J32L79j5m71M30k44K3L80o5o78M52K12
1522A75l30K16K85o39o6R47j44n57J46J11o80O20O86j177p5O48j67r2J67Q4p79
$$ plain form
1360 -13 -257 -159 33 23 -49 -154 99 -179 -26 -79 127 -160 -36 -12 68 32 -39 22 -9 -112 115 -151 18 155
1384 155 -69 147 74 -92 41 -10 -108 -69 352 -9 165 59 -179 193 122 -1 -47 -238 77 -1 178 103 -10
1407 -10 148 36 99 71 51 -27 41 -181 128 281 -266 -141 -53 -93 -275 -144 173 71 -101 -123 210 120 -143
1430 -143 192 91 -29 306 328 -34 -67 17 13 -53 114 -25 16 83 181 29 80 -64 -76 86 210 -99 81 -269
1454 -269 -306 -45 -10 -112 -69 51 -134 -40 155 -64 -123 9 170 77 205 175 -166 -37 179 -49 -97 215 -170
1477 -170 -152 67 84 -285 -204 199 -198 -183 222 -252 -8 168 163 2 184 259 -6 50 634 -54 -216 48 -88
1500 -88 -255 360 95 -413 -7 255 -87 -42 126 -360 -228 151 136 -335 95 -149 -126 254 189 -489 -37 175
1522 175 -155 61 346 -293 -359 588 444 -113 33 144 -536 84 770 -407 -482 166 -1 -93 74 158 -621
1543f21N64N18o27J44L02m88PR70o50o48N81J95n81O47K22j036K71P83q3n64N39
1564D45n94m29J118j24q65J15N68m66P1Q57j078m75J000O3n47O44m23o59O38J044
1584I03j054k60P34l97J3N99j51j323O09O35n74M70L48r86j10J381n23p95N75
1603I4l33n24J136N17j510J23P38m09j52Q21o04q90J495J53r93L63L92j237Q28
1622HR64q82n16N53q1l81Q87q4j398P65P76o27n4L40p58k99J329K1j163J35N13
1643D8q98J035N30j041o42J620n12l14O22m49o94J205L16j310M37J88p25J91J241
1662H48p22q66O81L62l81K58L76j426J42J512p14j75M29n70m01J080K43j138L24
1681a38Q17r75L75O57q39o44R98K56o89L23m5p54N98O95j016j01O10l95j59R26
$$ plain form
1543 -621 -57 461 -166 -22 280 -208 -201 769 119 -529 52 247 -334 313 535 -501 -230 553 470 -94 445
1564 445 -149 -578 540 416 -449 -334 234 -232 -161 696 -382 -857 143 206 -341 303 -120 -779 -141 903
1584 903 -151 -411 323 -74 -61 538 387 -936 -327 308 -266 204 552 -434 -544 837 314 -481 94
1603 94 -239 -763 373 890 -620 -497 241 -168 -320 501 -103 -993 502 655 -338 25 417 -820 8
1622 8 972 90 -426 127 46 -335 552 468 -930 -165 611 -16 -70 270 -488 -787 542 563 -600 -465 48
1643 48 -850 185 715 -326 -968 652 140 -174 448 -1 -695 510 826 -484 -47 141 -584 -393 848
1662 848 126 -740 -59 303 -78 180 556 -870 -728 784 70 -105 324 -246 -647 433 676 -462 -138
1681 -138 679 -296 79 736 -103 -747 251 507 -182 141 96 -658 -60 635 -381 -482 128 -267 -426 500
1701E00o18m81M31N61n90K74J96p61K48R15l85n44M14r4k85O26K07r48M4P55o19
1722a54q1Q12n88o82Q81J92o00J50o5j22J16N20l02n29M25l5k20M01r5l29J97
1743a08M50l83L3M09m79k77O04J57o20M33J95m90L45j31m78k30P82j2k57J68k70
1764a59l6J84L04m12J96J03m39O2M29j53l14J52J17k6k7K69n35J36M83l60j36
1785a62K15p0j4R9k2k60J78J57l43J34J02j47k3J45jj35M1J10Q1M1L3k03M6J85
1809A87q2j20K64j85j0J83Rp0k71J30J03j46m7j8L0o0n6J69L03q9k01q0j83L05
1833F5N1j62p7N6L14p4l15M8P1j9J01J77l54K33kj35o9l6K73k33J11K47k44j48
1857a21J88J29l37nJ8L15l46o9L8K00Q6k36J16K29Q8j90j10N5R1j45KQ2n7k28
$$ plain form
1701 500 -118 -599 -168 393 -197 77 273 -488 -240 675 290 -254 160 66 -219 407 614 -334 -290 465 -154
1722 -154 -235 577 -11 -693 188 380 -220 -70 -135 -257 -141 379 77 -452 -27 -62 -282 119 24 -305 -108
1743 -108 342 -41 -8 401 -78 -355 249 406 -214 219 414 -76 269 138 -340 -570 212 200 -57 111 -159
1764 -159 -195 -11 293 -119 77 180 -259 -197 232 79 -235 -83 34 8 -19 250 -285 -149 334 -26 -162
1785 -162 53 -17 -31 68 46 -214 -36 121 -222 -88 14 -133 -156 -11 -12 -147 -106 4 85 126 159 -44 2 187
1809 187 105 -15 249 64 54 237 246 176 -95 35 138 -8 -55 -73 -43 -103 -159 10 313 224 23 -57 -240 65
1833 65 116 -46 -123 -67 247 173 -142 -94 -23 -42 59 236 -118 115 113 -22 -91 -127 146 -87 24 271 27 -121
1857 -121 67 196 -141 -146 -128 187 -159 -228 -190 10 96 -140 -24 205 293 103 -7 48 139 -6 -4 78 21 -207
1881b07L91k06J12l42K80j1j98J07J3k11L32k05M9K5j37K06o2n8K56j84J29j04
1903b5J68p8k45J73J5j25J37j56J50J61j14j64Q1J23j20K49m03J31N4r7J07l59
1925c37M53j7k51J81j36K41jJ9k9k92K58J16j43j12l6m6J24L1p5l5J49q3k41K81
1949A9K1l67M48j35p7n2L5M8j2K45l31k5M01m6l83O3K13k77m6O58l43j33J94k40
1973a22K98O7l19j79K45q6o5L20J7l32J25O1kl59L06K3q0J32P8l79L78J64k21
1996G0m15M95l25k25N24Ol88K23J36J3P0J61k26n93N75k84J21K98k95k80K65J95
2018A21l22J62J77l30J11L99o4n78K33j02n1L64K61n88J39K65k31k8K09l72PN17
2040B99O2o26K60p4l74M99L95o68k12N82k00J42Q3n7n27M60K14k34K0R3j39j38
$$ plain form
1881 -207 184 -22 90 -252 28 17 -181 -74 -61 -272 60 -145 -96 -71 -208 -2 -64 -122 134 -50 79 -25
1903 -25 143 65 -180 -7 8 -117 20 -136 14 175 61 -103 -22 101 -19 230 -173 -42 12 -85 22 -337
1925 -337 116 99 -152 29 -107 134 133 152 123 -169 89 205 62 -50 -86 -132 -8 23 -52 -87 62 -21 -262 19
1949 19 40 -327 121 -14 -91 -143 -108 -60 -72 173 -158 -183 218 172 -211 -148 65 -212 -258 400 57 -76 118 -122
1973 -122 176 243 -76 -255 -10 -96 -161 159 176 -156 -31 30 28 -331 -25 -2 -82 50 128 -251 127 291 70
1996 70 -345 150 -175 -400 124 130 -258 -35 101 114 184 345 119 -474 101 -183 -62 236 -59 -339 -74 121
2018 121 -201 -39 138 -192 -81 318 254 -324 -91 -193 -244 120 381 -207 -68 197 -34 -62 147 -225 -218 299
2040 299 361 -265 -5 -79 -453 46 441 -227 -439 143 -57 85 168 111 -416 44 258 24 44 137 -2 -140
2062a40M55j22m91L54J24m18L57Jl59K50L78l37Op0k06P1K86j60l73M24Q7k60
2084a43J9K76l58J80L21j57l14K58L2j31K22J04k54O8r6K8J05k4l26N8R6M25m06
2107a7J83J2k54R1K81l92k10L25p3k43N29l76k81L98K83m41J81K0l93M20L77j32
2129B88n95L71k04j93M68n6m41J87L82k65N5L62j88n49O58n5m75M51l40k54O18
2150B25J34l92r7K03o0l57K98J20j58O2J91r0Qj01j89m4O27k45k58p1m5M13R5
2173B69k40j02k98M96r0k29J79Kj19M08j86k43K49k28kk5L00j75m8R1K47m03L57
2196B10k12o4L46jl36r6M63n54K50L23l33k1j39K28p0K40k00j09O7j64Q3J7J4
2219e8j56J44K39r3k46J13J79j49K39p5m2n9K66k51j74L07k33k27J88L25m82J82
$$ plain form
2062 -140 315 193 -298 56 180 -238 119 120 -239 11 389 52 58 -12 -218 -147 139 -21 -394 30 117 -143
2084 -143 -124 152 -206 -26 295 138 -176 82 114 -17 205 309 55 123 27 55 160 136 -190 -132 -36 389 -17
2107 -17 166 178 -76 15 296 -96 -306 19 -54 -297 232 -144 -425 -27 256 -185 -4 16 -377 43 420 288
2129 288 -307 64 -140 -333 135 79 -362 -175 207 -58 -3 359 171 -378 280 225 -250 201 -139 -393 225
2150 225 359 -33 -130 73 13 -344 -46 74 -84 -22 169 79 87 -14 -203 -247 380 135 -123 -194 -239 174 269
2173 269 29 -73 -371 125 35 -194 -15 -13 -132 276 90 -153 96 -132 -134 -159 141 -34 -82 9 256 -147 210
2196 210 -2 -66 280 279 -57 -153 310 -244 6 329 -4 -25 -164 64 -6 234 34 -75 -8 -172 -89 -72 -58
2219 -58 -214 -70 169 76 -170 -57 122 -27 212 137 95 36 302 51 -123 184 -49 -276 -88 237 -245 -63
2241f3n3J19j62M71l51n1Q7J17k35J66j13k74K89K72j79q1m4l1J2M28j44j99J78
2264A59qQ7j7O7l63l6M26j63l37L18j65l7J30J40j33k90K69J3j62J54Q6l04oN6
2288a16J81j40P6p3J45R4j9l15L28O4J3l07j0j6K22K2j78j43J19km6K05k02j69
2312b67P7J85j65Q7j66K01l2J63J05l7L3k31k73K47R9l1l9O1L9L1J68k75J24l
2336A01k09J24j23K99l14N0K45k80j7Q1J33p1j10J6J03j27o3N5J9K53j69L5J89
2359B20k75j40J41N2O2j01k44M62j61j78M7K59k23j7J90k94L79j54n7o6j08J65
2381d1j5j71L04O3l93J78n4M9L29k78m8J15R4l8k47J80K68k59j43K0K07k00M2
2404c8K11j39m1m19M97m7k71K70j34K6L50l43J09N3Nj08k6Llp7k8K78k6K7l50
$$ plain form
2241 -63 -116 3 -159 312 -39 -90 -3 114 -121 45 -68 -342 -53 219 40 -41 -85 -116 -104 324 180 -19 159
2264 159 151 238 221 288 -75 -111 315 152 -185 133 -32 -69 61 201 68 -222 47 60 -102 52 138 -166 -172 -116
2288 -116 65 -75 1 -72 73 167 148 -167 161 225 238 -69 -79 -95 127 149 -29 -172 -53 -55 -101 104 -98 -267
2312 -267 -190 -5 -170 -83 -249 -48 -80 83 188 151 184 -47 -320 -73 26 -5 -44 17 56 87 255 -20 104 101
2336 101 -108 16 -107 192 -122 -72 173 -107 -124 -43 90 19 -91 -75 28 -99 -162 -107 -88 165 -4 31 220
2359 220 -55 -195 -54 -2 60 -41 -285 177 16 -162 -115 144 -79 -96 94 -200 179 25 -32 -98 -206 -41
2381 -41 -56 -227 77 140 -253 -75 -129 -80 249 -29 -77 38 132 94 -153 27 295 36 -107 -87 120 -80 -38
2404 -38 173 34 -7 -426 71 24 -247 23 -111 -85 265 -78 31 84 89 -19 -45 -42 -45 -122 -150 128 102 129 -221
2429b21J83J45l32K74l7J0j30J94j34J43O9j29O2l2J27m41J56K3j08N0K57j36
2451gp0J20L9l1n8J2L7p1k27K44j69K39k6p9J32Q9M9j73J45n12L0L21l9l57L01
2476f1N8j78K50Q5j56Q4j5j61Q0K51j74k1j47J76k64K73Njj56K03j99J37j22j4
2500f7RJ83K70o58r2M61q9j32J13o2J5J57r2k43r0M61j28j69K19j99m2L26l2k49
2524a30N04m35J0L07J15l44j63p8J44l8K60l06M7R4l6o4J72O2k60j24M31j92j58
2547a82L88l01j28N74j08m17L91J1k03M7J19m25K43J09o7j19J91jj92J68P7k33
2569e8l37M29pr0K80p7l76J81L54k64l18Q50o47l30M34n5j21m0J37r6K58J56m52
2592a89K9L79l07J37L49n37k47L90K59n37L72J42k28J8M5j47k17O66l99OL65n31
$$ plain form
2429 -221 -38 107 -225 49 12 22 -108 86 -48 95 164 35 97 65 192 -249 -93 -70 -178 -128 129 -7
2451 -7 -77 43 82 51 -7 5 42 -29 -256 -12 -181 58 32 -47 85 174 223 50 195 -317 -287 34 -5 -362 -61
2476 -61 -3 -181 69 154 -2 82 67 -94 -14 237 63 42 -105 71 -193 80 85 84 -72 131 -68 69 -53 -67
2500 -67 -58 125 395 -263 -355 106 17 -115 -2 -64 -49 108 16 -227 -317 144 16 -153 66 -133 -175 151 119 -130
2524 -130 374 -61 -51 256 371 27 -136 -214 -70 -108 152 -154 -107 -13 -49 -113 59 121 -139 -263 168 -24 -182
2547 -182 206 -95 -223 351 243 -174 217 228 25 72 191 -234 9 118 51 -68 123 122 -70 98 175 -58
2569 -58 -395 34 27 -63 217 140 -236 -55 299 35 -283 567 -80 -410 24 -31 -152 -192 -55 -151 107 263 -189
2592 -189 -160 219 -88 49 398 -139 -386 4 263 -274 98 240 12 30 75 -72 -289 377 -22 -16 349 -182
2614a82k39N61M09m42q3K55n46R6M71l48k23K56K07k19J49K72n92j88N40k29q7
2635a62K73K0n27M31J62j61k83L29r6p2L39m87K48K23r5k86L17m6l74K06L66k53
2657G2j23R4j6j5K42n8m25J86Q4j6N8J61m11R4L12j79k12K40l8o4K6j53pL30l6
2682A46l46L86l77P1N5K31L3k36Q4j32k39N20Q9k71j26N8L04k61J87l76R1K42
2704A33p7N7k49J37j03N4K54m62Q2J67L54m92K61K4k43n3J18k7j18L12j99K10
2726A40r0Oj93J04m6N3Q6j48r3r7O7L39j46n3q7J81o9P6K04l54j63K18l3K04J98
2751C04m13n8L3P7N3L1nj42K51L1j60ok68K83j34J47r9j6n6PJ6L76l78J80l0j38
2777a14K05K89m41j19K07K5K6o6M5J85k56R4k20O8K23j56RJ2J3j69JR9J44k13
$$ plain form
2614 -182 -421 140 549 107 24 279 -267 -171 300 -48 -271 -15 192 -27 122 394 -198 -386 154 -75 -162
2635 -162 111 131 -396 35 197 36 -247 82 -14 -86 253 -234 14 237 142 -144 173 127 -247 -41 325 72
2657 72 -51 43 27 12 254 196 -229 -43 41 25 83 244 -167 -73 239 60 -152 88 50 -14 12 -141 -148 182 146
2682 146 -200 186 -191 -120 -65 166 199 -37 47 -85 -324 196 285 14 -112 -54 250 -11 176 -200 -109 133
2704 133 56 113 -136 1 -102 -48 206 -256 -174 -7 347 -145 116 140 -103 -156 -38 -65 -183 129 -70 140
2726 140 50 56 -137 -33 -79 -26 60 -88 -181 -278 -211 128 -18 -71 -158 23 -46 30 234 -120 -283 -65 -98 106 304
2751 304 -109 -167 -134 -57 -4 27 22 -120 131 162 2 -4 -272 11 -123 24 -75 -91 -147 -140 -124 252 -126 54 24 -114
2777 -114 91 380 -61 -180 27 52 78 12 57 242 -14 80 -140 -72 151 -5 4 16 29 -140 -139 -40 104 -109
2801a09L27o8k09j09J24LP3P6k88K17L5L2j1j24J99j22k33L61J46k78j71J98j02
2824c3l0m5NJ08K18m92M6K15rm2Q7k3q4K51j29k09J04L19q1m0k82L0M5qL5n7N8
2851d3J06K7ok1J07l52J34O7M0j8n8M0m8J31k79R7J08k0Q7J08j37q1J30n0j2j21
2877f4J32M0k11n3k56K80N0J21N4j65qK64l05M9j07M16l45R6j50K16j31J48J75
2900B46j02k53p5J25K42k63j25J6K92N3m23K04m7RL0o6J82M5K26m09L3K84k33
2923iQ4l00L02j61J02J67o8k83J16K23m24M89P2j76j13K8LO9l3j01P8N5k20QK75
2948A83j09j13R8j9J04kj06l59L96k31M41m20R0M8k04K12LL4j37P2%j94J71K17
2972A75l54J38j96K18J44k16P5P5l13L51k55J67l1r2n2M1Q6R2l40L32j29K73j69
$$ plain form
2801 -109 218 150 -59 -168 -44 -41 32 108 -180 37 72 104 93 -31 168 46 -187 174 320 42 -129 69 -33
2824 -33 -63 -108 -103 5 223 -269 -223 -8 -17 -59 28 5 -79 172 43 -166 -62 257 176 136 -146 -116 -71 -79 -44 -101 -43
2851 -43 63 90 84 63 170 -182 -48 19 59 41 -17 23 -25 106 -173 -76 32 12 99 207 70 -11 119 69 57 -64
2877 -64 68 108 -103 -156 -412 -132 -82 39 93 -72 -80 184 -121 -72 -179 237 -108 -12 -162 54 -77 71 246
2900 246 144 -109 -184 -59 183 -80 -205 -189 103 156 -267 -63 -110 -101 -71 -137 45 90 316 -93 -60 224 -9
2923 -9 75 -225 77 -84 18 185 117 -166 -50 173 -251 238 310 134 21 49 52 121 88 -13 65 120 -100 -92 183
2948 183 74 -39 59 40 144 142 36 -323 73 -158 283 -137 -47 1 -203 9 12 46 -91 -19 -19 -213 -42 175
2972 175 -179 -41 -237 -19 125 -91 -16 59 -254 97 -158 9 -22 -114 -166 -125 -39 53 -287 45 -84 189 20
2995B0P0k26K15j18L3j49J87k11J1J53k79R1L62l51j8K85j81K35o5j12l4L91l46
3018c7L1p0j51N3J05r7L13n9l3J01l1k95K65k34N6J89j55L12k16l07J93J92j91
3041f6J26N2k81J88j60J87q6J58j8j74R7r0j65K56J53k54R1K26l52j83R1J85j43
3064a62K91J10l11Q1n4J80j9jj86J00j31K92k67q5J20j52J06OJ68j24P9oj83l
3088a51L32j36j45J28M3j72O7k7m7K61l15N1J23j05K04j90q0K32J3K78m95P0N7
3111dP9O1k2l14L25j84K38j15k02M27l04j00j01K49r3n9L05k8k80j9J14l0L5j9
3135d1K08k38j46K33o1M07k41j20J42q2j38l08K63J30M4m3j50J52j06j6k92N32
3157A29N3k21L42j77j21M4k48J57k11J61J89L7j68Q0ok05L39Q0k6k89J36j61J87
$$ plain form
2995 20 90 -136 79 -39 -6 -155 32 -179 -168 -15 -294 -203 159 -192 -210 75 -106 129 64 -48 -82 309 -37
3018 -37 -6 -76 -227 -174 -69 -166 147 88 55 156 125 -170 95 -139 -83 106 -49 263 47 -260 -67 125 -66
3041 -66 60 112 -169 19 -141 46 -40 118 100 -74 23 -67 -232 24 177 -77 14 240 -112 -295 -204 -19 -162
3064 -162 129 239 -72 9 -45 135 116 115 -71 29 -102 190 -77 -162 -42 -194 -88 -82 86 -38 41 35 -148 -151
3088 -151 181 45 -100 28 71 -101 -34 -61 -108 153 -162 -111 12 -93 111 -79 -159 73 86 364 -131 -61 -4
3111 -4 75 136 114 -200 125 -59 179 64 -138 289 -15 -115 -216 33 -60 -119 186 158 -122 -141 -27 -57 -22 -41
3135 -41 167 -71 -217 16 -45 362 121 1 143 61 -77 -385 -122 8 52 9 -141 11 -95 -111 -403 129
3157 129 182 -39 303 126 5 49 -199 -42 -253 -92 97 134 -34 46 40 -165 174 254 228 -61 75 -86 101
3180A01J4j94P1Q0j92j01J69M1j03L9J27j45J68m0o5rK09l14K55J31J72n33L06
3203A87j97j39K42k30J30l04L72Ml37L61o3k51L16qj89o3J86k57L07q8J58p5j3
3226D9M7l27K25J1j31K35o1m34M85k57M4l9R4j43r8L40J23j73K02k27J00J6k2
3249E9K7j22jn2o6J58j58K71j71k1o6o8K91k91J80m3J60j31N4k5K06l77mJ03M
3274h3L03m34K58P9qj34o8K0L68k94P1M2j59K39l18J99qp5J56k14O3j41J55m9
3298c2k53L65j91N7Q7L0k3R9m36L95J28l51K42K1k53LJ42k67K45M9j43j8J37o
3322B7K95k11Kk40K26j37J01j83L1J63j4J34l28R8l8J83R4j96J09k82L4K99J28
3345B95k68j79L62k05p8k06M04k71M8L68k52j78P6on9K35k00n3J90L6j41nj8k7
$$ plain form
3180 101 115 -79 -8 72 -120 -221 -52 -11 -114 -75 52 -93 75 35 -30 -39 170 -144 111 242 414 -119 187
3203 187 -10 -149 93 -137 -7 -311 61 65 -272 89 26 -225 91 83 -106 -169 17 -240 67 -21 137 62 49
3226 49 96 -231 -6 5 -126 109 48 -386 99 -158 -114 -153 -59 -202 -300 40 163 -10 192 -35 65 81 59
3249 59 86 -36 -37 -89 -155 3 -155 116 -55 -76 -142 -210 81 -210 -30 -73 87 -44 10 -15 191 -186 -190 -87 -83
3274 -83 220 -214 44 123 115 -19 -87 -67 301 7 78 120 -39 200 -118 81 73 -2 154 -60 3 -138 17 -32
3298 -32 -285 80 -111 -54 33 63 40 139 -297 98 226 -125 117 138 -115 -112 30 -237 8 57 -86 -104 33 27
3322 27 322 111 113 -127 99 -38 63 -120 -89 74 60 194 -134 -36 -74 109 203 7 116 -166 -132 167 295
3345 295 27 -152 210 5 -73 -279 125 -146 -98 270 18 -160 -84 -90 -149 86 -114 -167 23 59 -82 -87 -105 -132
3369a32J10Q4L8j92J1J31k42K98j86k9K56k12Q1j23J68p6j8P8r2P2j65N9j49k
3393b32L28q7K7j59K03q4R3PL0l5q7J75l29R4k14K19Q3M2m53M92k11l0J34J4J36
3418A56k50O7l8n7O2j30K43N5k15R8j98P7J47R3j11J08Q4j09o4k31L02m6j39K11
3442A15k12K63k63K86l0k73K22k14J3K47L7l38K60k10J02o2j43L86k82Q2J01m0
3464D7n3J32k48j8N9l9L7J32l06K38m2j93M48k56R4r3K1J98j2k98J37k87J09J71
3488b2j00K76R3r6r8j97K98l43N3m1J65rrO4j83J14J90k45J76n9n0r1K28o1k2
3513C1k3On3QJ77k27R0q6K81l09k34K35J31K0J14k19P4L1q0lJ91l77K57j4K48
3538B69l21N5J32l61J33J17j8L1M8J27k36O4l9j6rjm6j35K40K7n5K76l92K90k15
$$ plain form
3369 -132 -22 62 100 -92 -81 50 -192 106 -80 -109 147 -65 16 -107 61 -15 -33 45 -47 25 -140 -81 -230 -232
3393 -232 96 9 36 -123 80 -4 89 96 126 91 4 179 -150 -56 -270 -51 32 74 -379 113 -98 -128 6 20 156
3418 156 -94 -27 -65 -122 -60 -190 53 108 -107 -9 -207 -130 17 110 -1 107 191 82 18 -213 89 43 -96 115
3442 115 -97 166 -97 189 159 -114 108 -106 -93 154 191 -147 113 -97 5 -57 -200 186 -96 -14 87 47
3464 47 -6 126 -122 -140 -81 -120 -83 49 -257 -19 -61 -254 194 -62 32 -61 -40 158 146 -152 -15 -302 -193 -22
3488 -22 -122 154 247 151 53 -144 154 -189 -136 -177 -12 -21 -30 34 -149 -35 155 -90 86 27 -23 -114 114 53 31
3513 31 8 14 -39 -31 146 -81 9 -77 204 -105 -339 -104 27 47 161 -58 16 47 -33 -36 155 -222 35 21 269
3538 269 -52 3 135 -226 -93 24 6 37 85 212 -24 40 1 -15 -24 -25 -71 -206 34 61 6 282 -110 180 -35
3563c5k4P6Q5Q3k22j13K56j90m4Q3J24k61K32L5k18P8J91k48P3K55k93n1K81l41
3587a88J07M61l73k79K56L14l90j34L45j31q3M19l16j3j4J41j70J87j63r3Q5J14
3609H2j51J76O9j67R2J83j23k16k6K76k14R7o2k00P6M59j73j33j68j3k9J58J05
3632I8j35j93L13j58q9L71l69P1R3J27j33R6k38q3L97J15k67l76L69j84OJ73J30
3655A34l80K36M38k58k52J15m5l07N36P9p12M38k03K13l3J60l3l84L11J4k46K06
3677B7M1n19O16j18l28K18J56J45n98N85K3n27J43J11j35J24M8k1PK05M7l92J18
3700b4n1Q1N2J84j55j38J08j66L78Pk93m8K87j26k20QQ0j48M9L06j68o%M0k97
3725b60L83k46q6J19M77l98q0M25l31k41M11j24k51P9m1K6K17K91o65L61J0N2
$$ plain form
3563 -35 -59 17 102 185 -37 -150 106 -84 -128 -45 79 -182 50 85 -133 -55 136 -112 -39 216 -77 -128 153 -188
3587 -188 -81 380 7 -272 -16 298 -92 -226 119 -12 -95 324 8 -5 -19 122 -48 139 -24 -117 -32 82
3609 82 -69 107 176 9 101 284 161 -55 -81 195 -19 78 16 -184 -108 351 178 45 -123 -136 -165 -7 98
3632 98 -37 -230 83 -75 -164 207 -162 -91 2 129 -4 92 -146 -229 168 283 16 -360 9 -175 -169 4 134
3655 134 -246 -10 428 170 -82 33 -12 -319 217 296 -416 22 -181 32 -1 159 126 -258 53 67 -179 27
3677 27 68 -451 165 47 -281 -63 93 238 -360 225 248 -279 -136 -25 -160 -36 12 -9 -2 203 250 -142 -24
3700 -24 -75 6 58 242 87 -51 57 -109 269 276 -17 -65 222 96 -124 -116 -36 -184 -135 171 3 -3 -3 37 -260
3725 -260 123 -123 -209 -90 387 -11 -91 334 3 -238 173 49 -202 -123 -164 -138 79 370 -295 66 76 128
3747A28j37J83n14K18L43r3j28J12k9j69J70r4j07L2J37k9%J89k25k09l5M60k95
3770i2lO4j9J4J03k53j22L27Q1k31J81k6j14K0K87j18j86M6ok1J68M3j89r3L09
3795A70k37K66p7j68j91M86q2l63R2J21k18O2K24n5j27j02J52k00K39n4R0r8K03
3818A33k55J38R4k53K09p0mp6J33Q5r3k75N0L81l64L56k44N2m20J96nK38rJ0k11
3843b04N2jJ7L50k49M4r0K55j65j9J90j86J3J76j88J93k71O4Q5j41M9N0n0J02
3867G6o8Q5k46L62m44J43K38k07J89k58Q8j77L09j69K6N1l30L16j88J61K69q4
3889A42k31J07m3K20j30j24P1j22N6l4O8J48j29K59k48k2j86j31M39M8j06J35
3911A87k36R9Nj68l0K89j43j54p7K54q4J36l8L3n4k48J04K41j53j17M5j29Q7K95
$$ plain form
3747 128 -9 174 -340 -122 221 128 0 112 83 -86 84 -10 -117 -85 52 23 23 212 -13 -222 -257 203 -92
3770 -92 -95 -31 -50 -36 67 -186 -308 19 100 -131 50 24 -90 -70 217 99 -87 -41 -47 -68 100 143 -46 -139 170
3795 170 -67 199 122 -46 -237 249 167 -196 -104 17 -201 -139 85 30 -97 -199 -47 -247 -8 -62 28 -70 133
3818 133 -122 16 110 -143 66 -4 -8 -84 49 134 41 -234 -184 197 -167 189 -55 -3 -423 -227 -232 6 -3 7 -204
3843 -204 -152 -153 -136 214 -35 9 -81 174 9 -10 180 -6 7 183 -5 188 -83 -19 66 -75 -26 24 -26 76
3867 76 8 93 -153 209 -235 -92 146 -61 128 -130 -42 -219 90 -79 -53 -2 -332 -16 -204 -43 226 142
3889 142 -89 18 -25 195 65 -59 12 -110 -54 -88 -20 128 -1 258 10 -12 -198 -329 110 158 52 187
3911 187 -49 50 55 -113 -143 146 3 -151 -228 26 -58 78 40 73 19 -229 -125 116 -37 -154 -109 -238 -151 144
3935A44j12K4j91j7M7k2J1J08j08J56J11j70J15j04j67J73R0r6j41K48J67m44
3957a78j11K12m0J01j06m3J70j53K02n4j96K23J85R6k31l85K63qk0J76k6j3K64
3980C28l30K36k7j41j73j0K11J56n03L18j50P9j58o2N9l0J73k62K12pL75l31J86
4003A49q5m9K32ml91J44J29k77M1K56j03q0L03j47l83J84l9J96l05L22l30K78
4025D1Q3j27q6L35m79L67j36P5J36j80k7r3J9J98j45MJ17l02L17k63K37m7q7J42
4049I9m1j19J68J16k42L4j97Q9L71j82j10j69M4K9k2R3j47L69j77J86k51K18j97
4072c8p7o7K23J95k35J47M3j05k0K58m81jJ38J01p1o4q3J95k63K14p4J88%o9k03
4097a49L35r3k34K05k27o9M46K19m17j92J34M3j3J7j65K0K92L3k48O7j41J48l07
$$ plain form
3935 144 32 56 -135 -152 -105 -127 -116 -8 -116 40 151 -19 96 -8 -175 -2 88 -8 -149 99 266 -178
3957 -178 -289 -77 -117 -16 -122 -165 5 -148 54 0 -196 27 212 308 77 -308 -45 -53 -73 103 77 64 328
3980 328 -2 234 207 66 -107 -117 94 250 -253 65 -85 -6 -164 -226 -167 -197 -24 -286 -74 -81 294 -37 149
4003 149 64 15 247 243 -148 -4 125 -152 -111 145 42 -38 265 118 -265 -81 -120 76 -229 93 -237 41
4025 41 124 -3 -89 246 -233 134 -2 73 209 29 2 -91 -72 126 -19 -15 102 -200 117 -146 91 44 -43 99
4049 99 58 -61 107 223 -19 15 -182 -93 278 96 -14 -183 -139 -110 -132 -39 -186 183 6 192 -59 159 -38
4072 -38 -115 -182 41 236 1 148 191 86 66 324 -157 -158 -20 81 10 -54 -137 58 -205 9 -65 123 123 54 -149
4097 -149 186 93 -141 64 -163 -232 214 433 16 -176 -42 1 -12 5 -160 -140 152 185 -63 4 -137 11 -296
4120b96K72L36m91K21MO2j75j61R0J37O2J7j07R3q2p4L75l02k89K88J29j85K81
4143B05k16q0K36j14p7o2K89l80K45M7J44m15L29l7k10q5L02l3j06K67M3k49j81
4166a38K05j27k8J72o2L10k55j67OJ4L84m73M09j97jk26nL1O4K05m05N66k53K37
4190B66k22L6p8j15L68k45J13j61J37j49J61j93J83J04J2k52k02K76K12l76J03
4211b2J96l60nK01J58j95Q9k78K13k8K85m78L35k15J86j40J15j55R2K8k5M4j64
4234a23M4J98J22k40O9q1L5k4N0k53K19L6o9j6j37R5n8P7j44J25l4Q4J30l62L86
4259A29K06m03n5J95J1j64j19J0K17k6J46p0Q3r2o9l5j1P9j4o9r6L37j88J63P3
4284B38q6p7j8n7J91k38K81k41j67M74j86k30K36j22k9M1k5K46k46j12J69mj21
$$ plain form
4120 -296 -24 312 -179 42 46 108 -67 -228 -138 -1 61 78 -29 64 -18 -92 283 -19 -308 -20 109 -76 205
4143 205 -11 -91 145 31 -46 -108 181 -199 46 93 237 -178 151 114 -96 -181 121 88 -18 249 292 43 -138
4166 -138 67 -60 -88 84 22 332 77 -90 -84 -70 314 -159 250 53 52 -174 -179 -148 -84 121 -284 282 29 266
4190 266 44 80 2 -113 255 10 123 -38 99 -50 111 -82 101 205 217 -35 -237 39 251 -125 -22
4211 -22 174 -186 -191 10 168 -27 62 -216 -3 -31 254 -224 111 -104 82 -58 57 -98 -6 22 -3 41 -123
4234 -123 -79 119 241 1 70 -11 24 0 50 -203 16 52 -17 -33 -170 -75 -133 -56 -200 -75 -109 -25 105 -257 129
4259 129 335 -68 -123 72 83 -81 -200 -190 27 1 147 77 160 68 -1 -36 -47 32 18 -51 -147 190 2 165 238
4284 238 152 75 57 0 191 -47 234 -7 -174 300 114 -116 120 -2 -31 10 -15 231 -15 -127 42 38 -83
4307h3K8j3J61j88J01j0Jn9j7L26l70P5j75L52Lj74N8J54k61J21r0J24k01J34
4331cl88L93l6O4q8J59j24M3P0q1J6j31nn4J55j52j77K97p5L4m7N1J76j20n0n2
4357a25l0K38j04J72j21j56R5m3K84k65R6m2r0J43k58J17L14l58L28k37J24j0
4379G2K3j08j26K19j96P5O8Pj41K80j60K01n2M7j54N1p7q7J44J3Q7j13J11j16
4403F8q7k22K41p7J60lj06M8m2qJ34j20J0k06J18M1J21l23L50j51j01M23l14J11
4427F5m9J28n6J13o2lj80L19k06k05K71k24J53j19K07j2k67JK13K38l96J20J29
4450A78o4l67R8K09K34q0K4k13j64L74j95l3j62J47j8k40L49N6Q6l31J54j94L2
4473a20N7L0l9J66K06m84K81j85Q1r4L90k36N2k49L8Q0lqR5j46L72j67k68N3J53
$$ plain form
4307 -83 -55 -68 93 -95 6 -4 -3 -62 -79 247 -123 -48 -223 129 132 -42 16 170 -91 30 -60 64 -137 -3
4331 -3 -391 2 -34 30 -58 101 -23 20 90 9 25 -106 -111 -165 -10 -162 -339 -42 -117 -83 -130 -79 97 -23 -73 -125
4357 -125 -155 83 -21 151 30 -126 -31 -74 210 -55 41 -1 -91 52 -206 -89 225 -133 195 -42 82 72
4379 72 95 -13 -139 80 -116 -41 27 34 -107 173 13 214 162 209 55 106 29 -58 86 99 186 73 184 68
4403 68 -19 -241 0 -77 83 80 -26 22 -20 -28 106 -14 -4 -210 -92 -51 70 -253 97 -54 -155 268 -46 65
4427 65 16 144 88 201 139 136 -44 275 69 -136 135 -89 64 -55 152 140 -127 -126 87 325 -71 49 178
4450 178 114 -253 -155 54 288 208 232 19 -145 229 34 1 -161 -14 -32 -272 77 133 219 -112 42 -152 -120
4473 -120 -63 -33 -72 94 300 -184 97 -88 -7 -101 289 53 105 -144 -106 -26 -29 -37 58 -88 284 117 -151 -98 55
4498E5k09M0J39Kj52L11k18NJ52o6J92j90L7k53K49j70j43L31J9Q3j79P2l8j35
4522f6oK48k69k3J08q2l0J44n0Q4k1N3K8j04j07N3j00P0K1K3j34K98q4m5O9k22
4548a44K02j60J42j74P4K35l52K95o1m5l7J63l5k36J38j28J18j16L66k41J33k14
4570g7K00k39J59k11J76J28j67J18m1R7k06K1L82k57k04K74R5k76n6K10j45P3
4592E4k7M9m24M32q7J8O6j90J14R9K9k49M0O7m6N6K60k45N2n0M9j75J37j5j37
4617a23L14j29j80m7J48k07K51L43k81Pl0J50j92r0O7n9j72L95J3j97j22J4N4
4640g3R6q4k8J27J16k03O0L7j93K62M8l20J46N9j51r1J69L29l61j6R0O1j43K20
4664A57r5m38J2O58l15j7o4Q7j57J95J72m6j53J69l25L9L50k40%P3r7K06o7R7
$$ plain form
4498 55 -154 -114 25 27 -125 186 -32 -27 125 59 251 61 98 -155 94 -76 -219 112 131 214 35 107 69 -66
4522 -66 -72 176 -93 -116 -8 -90 -120 24 -26 58 37 90 118 14 -93 -40 -140 -70 -49 -26 -160 138 54 9 78 -144
4548 -144 58 -102 40 -134 -60 175 -177 118 57 12 -25 138 103 -133 5 -123 -5 -121 245 4 137 -77
4570 -77 123 -116 43 -168 8 136 -31 87 46 143 -63 -42 340 83 -121 153 248 -28 -84 126 -19 54
4592 54 27 76 -348 84 -3 15 81 -109 5 104 133 -116 -76 -9 -55 1 261 16 68 18 67 -108 29 14 -123
4617 -123 191 62 -118 -165 -17 -224 27 370 89 96 66 216 24 -66 1 -58 -230 165 178 -19 -141 -127 -73
4640 -73 23 -61 -89 38 154 -49 11 48 -145 117 165 -155 -9 50 -101 -192 -23 306 -55 -71 19 80 -63 157
4664 157 62 -376 -364 294 -21 -38 -102 -15 -172 23 195 149 -4 165 -160 -121 229 -11 -11 62 -35 171 104 201
4688B01l13J60k17K79k62J32k44M18L2j71j58K61j57M5J1J99n35L72k35J9K62
4709I9n9Qr9O4k8m4J37r7J41j20J55j47j73K18j29J88p7l38J22K34q6K71p5o5
4733A00q7j11K74l74R9N4o4o5L21j10R9j78Pj05K69q2q1m9N2J25k74N5J9P8l2
4758f0K85j35j80m3O9K40N7j64j72K71k3k84k1J01o7o1K76q5P6k5Jj85K87l19
4782a61L6o1M46l79j17K98m5n7J23j33j14K08j56l7K08pj64k07L77q4M2J9p3K53
4806B15j27j6m42M26j22j33K6O8J31p5M9K50l34m9O2L13l01L0q4N8O1j46J49j7
4830hj02j34K17K3J31j70PJ00k34L03p4k95K69j6j62O4O8K9n7J17j80O5M9j8J42
4855A34r5j34K04o9J14Ol55K90j96m5J39J14j41N8j30J20j73PJ03J48l8p3K11
$$ plain form
4688 201 -112 48 -169 110 -152 -20 -264 154 186 15 -143 118 -39 6 17 216 -319 53 -182 -163 99
4709 99 40 48 -51 13 -15 -59 78 -19 122 2 157 10 -163 55 -74 114 37 -301 -179 55 -31 240 165 100
4733 100 13 -98 176 -198 -99 -45 -109 -174 147 37 136 -42 -35 -140 129 47 -34 -83 -31 94 -180 -125 -106 -28 -60
4758 -60 225 90 -90 -133 -64 176 233 69 -103 168 145 -139 -160 -59 -126 -187 89 4 80 55 56 -129 158 -161
4782 -161 -125 -186 260 -119 -236 62 17 -40 83 -50 -164 44 -112 -149 59 52 -112 -319 58 -26 16 35 -38 215
4806 215 88 72 -370 56 -66 -199 -173 -105 26 -49 0 250 -84 -133 -71 242 -59 -29 -113 -55 6 -140 9 -8
4830 -8 -110 -244 -27 -4 127 -43 -36 64 -170 133 59 -236 33 17 -145 -81 -13 16 -41 76 -104 -39 10 -8 134
4855 134 39 -95 109 40 154 160 -195 95 -101 -146 -7 107 -34 24 -106 14 -159 -152 -49 99 61 -12 199
4878A99n04K47o7jK83j97J93%L8j68L7Q1n8Q2k24j44K40k5K03l68L11l08J72M1
4902F3j52j15J71K36k41O2j02n7K50M6j84P8j34R2J29j49O9q8M4O9k82K51J3j4
4926E5k28L49j43n8k9J68j53Q9j56R6n2K40j00J12j70K73l93PK41j76J04l78M60
4949A58k14J03j48K84k66J98k40l00L31M1j46lJ09K81k60K1q7J88j8r2Q2q9P8
4972A1j22J65j87j68L60l3J25o2j40K51l05J25o0k89K46j38M46l18J29j72P0j26
4994a92R3J0OM8k2j4K7r3J06j30J37J69k3j32nM4k47K28J17Q5p2k07o3J89j42
5019h3K00m01L51K32k94j66J38R1lo3r8K34j48J99k68p8j71K02J40K05r3Kj19
5042Ij1j26l6J83J45k06MK06l52L20k05J20o5j08R9rJ25l50K18q7P1j28Q4J39
$$ plain form
4878 199 -305 -58 -125 -126 157 -40 153 153 191 23 60 141 83 165 -59 -203 37 12 215 -153 158 -150 22 63
4902 63 -89 -204 -33 203 -38 24 -78 -135 115 161 -23 55 -79 13 142 -7 62 -26 18 87 -195 56 69 55
4926 55 -173 176 33 -25 -54 114 -39 50 -106 -10 -62 178 78 190 20 293 -100 -93 148 -28 76 -302 158
4949 158 -56 47 -101 183 -83 115 -125 -425 -94 -53 -199 -202 -93 188 -72 -51 -138 50 32 -60 22 -67 11
4972 11 -111 54 -133 -301 59 26 151 89 -51 200 -105 20 -40 -329 -83 -221 225 -93 36 -136 -66 -192
4994 -192 -99 -89 -83 -35 -57 -71 -44 -137 -31 -161 -24 145 122 -10 -15 29 -218 10 127 212 140 -67 -130 59 -83
5019 -83 117 -284 67 299 5 -161 -23 68 65 2 -96 138 -10 189 -79 -157 -328 -126 14 219 126 128 9
5042 9 -2 -128 -164 19 164 -42 -38 168 -184 136 -69 51 -14 -122 -23 -32 93 -257 -39 -126 -55 -183 -99 40
5066D0j7j17J73k33J72J22m94K30K74k31L3P5k9K8r7L1J12o6K4K2J82j19k83Q5
5090h3l7L26j76j37K39k37Q0p6J43K91j27l59M38j72r0L9j88L9J21N5n4N5J87
5113B77k86K68q6k55lJJ1j9k1m1K21r7j51L09k74J19q6K20P4m07J6O73n40K7J83
5138A33l70L02J7j03J72K9m23n5L88N8k37L50j91J22j12R3j99K0qJ00j66J87J9
5161A26l78K56m4r9K74j65Q6J36o8k49J93j88J47n1J97l15q8K57j51J9J72k64
5183a97L01mR6K0m04l2J07J88j22J40j65k4J73k61J19J71j43J42m07N36m65K17
5205a4N9k28L38j72k74K37Q2kj27J69k11J20P5k06J87k9J32k66K09l6m4j49K86
5228A36J2l95N76m42j4K29o7K77l68J17j6J92k83K97l40r2J55r0Q3K02l6l62M04
$$ plain form
5066 40 23 -94 79 -154 18 140 -354 -124 150 -81 -48 27 -2 26 -71 -40 72 6 30 52 234 115 -168 -83
5090 -83 -120 206 30 -107 132 -105 -25 -101 42 333 206 -153 285 113 23 62 -126 -87 34 89 35 90 277
5113 277 -9 259 173 -82 -85 -84 -73 -92 -113 -154 67 -30 -181 128 -146 -27 -113 107 181 -226 -210 463 -77 -50 133
5138 133 -237 65 82 -21 151 180 -243 -298 90 148 -89 261 70 192 80 173 -26 -6 -14 86 -80 107 126
5161 126 -252 4 -40 -139 135 -30 56 192 124 -125 68 -120 27 -24 173 -142 -230 27 -124 -105 67 -197
5183 -197 104 100 196 216 -188 -220 -113 75 -47 93 -72 -96 77 -184 -65 106 -37 105 -302 234 -231 -14
5205 -14 45 -183 155 -17 -291 -54 28 26 -101 68 -143 -23 52 -154 33 4 136 -130 79 43 -1 -150 136
5228 136 148 -247 329 -113 -127 102 35 312 -56 61 45 237 -46 251 -89 -181 -26 -116 -33 169 133 -229 175
5251A75l81K18p3M9L49m60K97j71KK04j75j40K51k43j53J98J13k27K41n5j9J02
5273A02p1k01j36L07J01j00qJ48k90K55m09K14K3k3J35O2j82O8l13K78j3K41Q
5296A96l84K84k15l6N9K0P8J3J26l41J41R2p6qJ12K8j68j12P3K97j72j36m0K92
5320A23l0q0p5k0J20k9k9j71M58k75k33K39r0nJ42j51K0J45k10J19O0J04m61L61
5344C2n3N7p3P2N2Q7j83J05k4k6J40k71O2J52k18K32l02K08k19L9O2k32M68k94
5368a27K43L3k82J36J19l03K85j48J98j14J03j25k9j40qK7R0k3O2K93k93J85j97
5391a5J47k19P9J29j83R5Q5p3J7N5O0k72QJ50P1p3q9K74k84k15J51J49J92k84
5415d5k2K08j20K25N0l17K81k48J9N8J20j33j16L09k91L6N1J32p7k27j02L93k66
$$ plain form
5251 175 -206 12 -61 -12 337 -123 174 3 5 209 34 -106 145 -98 -251 -53 60 -167 74 19 0 102
5273 102 31 -170 -306 1 102 2 -6 142 -148 107 -302 -88 -65 -88 47 109 -73 -5 -318 -40 -53 188 196
5296 196 -188 96 -119 -155 -96 -76 2 15 141 -200 -59 33 -43 -51 61 89 -79 -191 -118 179 7 -129 -169 123
5320 123 93 13 -62 -82 38 9 -20 -191 267 -8 -241 -2 -92 -97 45 -106 -86 59 -151 -32 28 132 -329 32
5344 32 -21 36 -37 35 87 174 -9 96 72 46 186 -85 -23 129 -89 143 -159 49 -170 -131 -69 -301 167 -127
5368 -127 116 149 -133 3 122 -181 104 -44 154 40 143 18 -11 -151 -159 -132 -42 -65 -3 290 -3 182 -15
5391 -15 132 -87 -8 121 -62 33 118 45 62 117 177 -95 -87 63 134 61 -28 246 -38 -253 -102 47 239 -45
5415 -45 -67 141 21 246 296 -21 260 12 31 89 209 76 -40 269 -22 14 65 197 120 -107 -209 184 -82
5438h2M0n3K12j23K8J33k11K80k97j59K42O8k08K50j37k10J02L35j66j74J92K
5460F4j02j47J42k89L34pK58m19Q6J02p5J43J16l29N8j10K20j69K7O3Q1L28m38
5483f3K92j93r3P2j04K16k47J96r9j46L34k11j37j3J22L2R6L6M9k05p8Lj19K05
5507e5Rl9J03p2j55L55O2r6j70K21j06L6P9k76k8J48j61M20k42q7K27k28K7J95
5531A67n3k33pK06j49J82O0j21q0M6J88l17j9N0K74k87J55q4K7J84L1k92K24l53
5555b01K61o4rM3j11L5M8k57J01L52l42LL01n5j08j8j89K22q5j81L99L08m57p0
5579g4j54K44M7k65J62L62m33K46l48K80r5J94j28j03K21j35k2q6N3m4J97K7j10
5602C6K1N3j76Q0%p2o1P7n7J94j59J69q0J63j69ro1o9j00Q0j3J19m7N6n0r1L84
$$ plain form
5438 -82 -42 -95 117 -6 22 155 -56 224 -73 -232 10 78 -130 120 -17 -227 -125 210 44 -130 62 64
5460 64 -38 -185 -43 -332 2 -5 253 -166 -80 22 -53 90 206 -123 -65 -175 45 -124 -97 -34 47 375 -63
5483 -63 229 36 -57 15 -89 127 -120 76 -23 -169 165 -46 -183 -196 -74 -42 54 90 139 -66 -144 -141 -260 -55
5507 -55 -46 -85 18 -54 -209 146 208 112 -58 163 57 93 172 -104 -132 16 -145 275 33 -54 173 -55 -28 167
5531 167 114 -119 -126 80 -69 113 173 52 -28 18 206 -111 -130 -80 194 -93 62 -22 5 189 220 -72 152 -201
5555 -201 60 -4 -13 30 -81 -46 2 -255 -154 198 -144 -141 160 105 -3 -21 -210 12 -73 -254 145 453 -4 -74
5579 -74 -228 16 63 -202 -40 322 -111 135 -213 67 -28 166 38 -65 156 21 -1 -87 -34 -78 119 146 36
5602 36 57 110 -66 14 14 -58 -119 -42 -99 95 -64 105 25 188 19 10 -51 -120 -220 -140 -153 -34 -81 -25 -75 -166 218
5629B18l71M07l24J32m10M14Q2j51m4l5K51Rp5o4k13q2L99j19m0O7j00k12L44
5652H3P2o8j47P3R8j76m9N7R8j88K22j3j97K08J88m68J5j23J56K97k04L25k17
5675D2j29J38j50l3o5J42j53k0L60m5k79J50J92l15J47Q5j98K37k9o3J25K03p02
5698c60K05K66l53K59Mj13J13O4N3k33J47k7q8K24j22p5l8M3N0J19j08j9J6o8
5722d1J50j36J28k49J00L66l25J0k31L01l1o2l2J56k4k69J95K0j83K26j6k30K8
5745a49J97p0J48j31M3J0Q8o5k60L52k17j6J34j10J5l6J88l73Q1J37K14l18L80
5768B42k11j05P6J75r6m7j80J39j82L69o49L08K08J05k85K8K50l14J14O6K32l66
5790a23L16k17k10Q6J07K78l31J74k91J3P9M1K46N4j61j71j18N54l76K45j66m6
$$ plain form
5629 218 -153 254 -70 62 -348 66 148 -3 -47 -82 169 178 103 39 -174 -256 143 24 -16 51 -49 -261 83
5652 83 155 87 -60 13 111 -65 -114 -57 41 -147 75 62 -135 73 261 -207 -192 -315 -159 138 -66 259 42
5675 42 -87 51 -99 -132 -197 -55 -208 -228 132 87 -192 -42 150 -165 -18 67 -131 106 77 14 139 342 -360
5698 -360 -155 111 -242 17 21 -92 21 85 138 -95 52 25 -63 161 39 -36 -74 -31 19 138 30 11 27 -41
5722 -41 109 -27 101 -148 -48 318 -7 3 -228 73 42 -20 -52 104 80 -189 6 26 -157 69 53 -177 -149
5745 -149 48 -22 126 -5 38 48 136 71 -189 163 -54 -70 64 -46 -31 -67 121 -252 -171 -34 180 -138 242
5768 242 31 -74 2 177 81 34 -146 -7 -189 180 -469 -161 47 152 -133 -105 145 -169 -55 11 243 -123
5790 -123 193 -24 -234 -148 -41 237 -94 80 -211 -198 -119 -78 168 222 61 -110 -228 326 -50 195 29 -17
5812a7j67Q5K70k50K55j83j54j14L15J59l02R3O4k23J0k1P7K25j48o5r9J75J08
5835I3R7k62m1K36k6K8k03j09J91o4l8L9K62l03K92Q1l04L7RJ67k77N6L9k5l6
5860f1K4m4K06j32P1k30L02l08P5J47Pr8j92J54J41L2j73o0K40j58J7K04p9K86
5884C71j61k34o3J34k23L34o3l06K46P1m6K22k33k88N6K97j72j11L61m8k11K03
5906A36j34o5J04j32m5J56r8J55M9j17K20m7k8l22n7K38r0J97J5K77n49K18J96
5929B77m83J03J16L3LP7j79k9O8k7On2P2Q8k97K03O5j29M09l29Q8K87l21k70O8
5954a53J07j7M5k0J3j32J84Mk03PJ12K75j49j62K73k38j54L65j59j48K12j10J55
5977A07k3l0j54P0q5j65Q0L18j49L49j86j87l4M3k53K67j5J26n5k7k70J86J62
$$ plain form
5812 -17 -184 -99 171 -79 176 -7 -161 -275 40 199 -103 -10 54 -169 -159 -180 -103 122 -26 -91 -190 -15 93
5835 93 190 -72 -113 123 97 125 -78 -187 4 -60 -98 -59 203 -100 192 273 -31 6 15 182 -95 -39 0 -25 -61
5860 -61 -37 -81 125 -7 64 -166 136 -172 -97 50 57 -41 -233 -79 62 94 -79 -139 101 -57 -40 164 85 371
5884 371 210 -24 -87 47 -176 158 95 -211 35 106 60 282 49 -239 -183 114 -58 -169 192 144 -67 136
5906 136 2 -63 41 -91 -136 20 -78 77 126 9 229 182 154 -168 -225 13 -77 120 135 412 -137 81 277
5929 277 -206 -103 13 46 49 126 -53 -82 -14 -41 -35 -87 -15 73 -224 -21 44 -85 324 -5 83 370 49 -221 -153
5954 -153 -46 -63 -18 -38 -25 -157 27 31 -172 -165 -53 222 73 -89 184 -54 -208 157 -2 -150 62 -48 107
5977 107 84 54 -100 -30 -115 -280 -200 118 -31 318 132 -55 -89 -46 -299 -32 -47 79 24 -3 -273 -87 75
6000G5k41J00k12J56n6L78k86J72N3k61J88K4k5j53j21J81l4jj0j33K04j49J16
6023c5K18k18k2K20l5l4q9R9j97j32N81m51Q5J64k31O8j08k06L25O7LJ6k03L00
6047A85m2k70K58l76L43o8k83O9L84j91m0L59k78m5N1p0j73rJ51n9J94j37l8M7
6071c8m1j9L02r7k49J15j2P7j00o2J92K4j09J12j71kJ57m8j01j0K04j42M5j03
6095g6r3L05k1j99J94j16nj0O8j28J12j4p6P9M9J29j87J56k86J67M4qJ41j47P
6120H5q4j17m4L01l1r8j3n4l07L56pp2K54k05J52j69l5K93l02K97J02n27L88O3
6144B26n15J78J08k0J44j36j9K69l02L19m12J02k25M31j71N6k48L85j85K2k07
6165b00J22J65l0m3J61J08k85J89k51j47P8l4J22J71j36k02P7O1L3K31k47J03
$$ plain form
6000 75 -166 -66 -278 -122 -178 200 -86 86 139 -122 66 90 65 -88 -209 -28 -62 -63 -73 -206 -2 -151 -35
6023 -35 183 -35 -57 163 128 94 5 104 -93 -225 356 -95 -10 154 -77 -9 -117 -323 2 69 72 88 -115 185
6047 185 143 -127 131 -245 98 30 -253 -184 200 9 -31 328 50 5 56 -14 -187 -196 -45 -104 90 -47 -85 -38
6071 -38 -79 -98 204 107 -142 -27 -39 38 -62 -124 68 92 -17 95 -76 -78 79 31 -70 -80 124 -18 27 -76
6095 -76 -169 136 115 -84 110 -6 -11 -21 47 -81 31 17 -59 20 69 198 11 167 -119 48 92 84 225 78 85
6120 85 1 -116 -160 141 110 12 -1 -55 -362 -6 -13 -85 169 -36 116 -53 -88 205 -97 200 302 -225 163 226
6144 226 -289 -111 -3 -23 121 -15 -34 235 -67 252 -160 -58 -283 148 -23 33 -215 170 -15 7 -200
6165 -200 -78 87 57 14 175 283 -2 187 -64 -211 -133 -167 -45 126 -10 -212 -135 -74 -41 190 -57 46
6187D6m6k25J66j38L99k59P1n9L25m75L25R0k23q8K82k63l7K49j21k49N26l68
6209g2o4Q7K69r1k03l3k58K63M3J59j82k1O9J7J81k3l09p9L26j63K41k16j76M53
6233B18j58R8k27N4M8J56j80R6j15k2Q0K01l93K4L21k3O7k83M8j0LMj0M2O5M2
6259A46k83J90J73k73Q8O3l36L0L36q8lk04L54n2J75l11r5J87L9j85O6O0p5J06
6283A08o9m2N5k55P4n1L15p7j76J6L35l67P4J39l22J80Q9J08j1j13l7P5j8o2K48
6308B16k81M5j46K7K97k67O2Mj86q6L08j62R6J03j01kM9R5pk47M41k33j21J08
6332A2L90n93J50J04m8j35L19k87oL22k47M9l4L39n99K29L5l3K3J0p8R6j54J58
6356B2Nj34K93l44M2K04O5p9l6m0j27J69Q9k75j2J78k80J52l7J04J02J24j05J83
$$ plain form
6187 46 0 -225 -59 -197 202 -57 14 -45 280 -195 130 220 -3 -91 191 -72 -109 140 19 -230 296 -72
6209 -72 -136 -49 220 129 -74 -107 -365 -102 -59 100 -82 -103 -34 -17 164 141 -168 -247 79 -84 157 -59 -235 218
6233 218 60 158 -69 -15 33 189 9 105 -10 -32 48 249 -144 -120 201 178 245 -38 10 0 3 7 -3 39 104 146
6259 146 -137 53 226 -47 41 104 -232 -202 134 46 43 -161 193 141 316 5 -90 97 136 -49 17 77 2 108
6283 108 39 -3 52 -203 -129 -180 135 58 -118 -102 233 -134 -60 79 -243 -63 26 134 123 10 -27 48 30 -32 216
6308 216 -65 -20 -166 -139 158 -109 -47 -43 -229 -315 -7 -169 -73 30 -71 -73 -24 71 64 -183 258 25 -96 12
6332 12 402 -191 -41 63 15 -120 199 -88 -94 228 -19 30 -4 335 -264 -35 0 -33 -10 0 -78 18 -136 22
6356 22 27 -107 186 -158 -116 88 153 74 38 -2 -129 40 129 -146 -158 20 -260 -108 -145 -41 61 185 80 263
6380B63j54l67L80k24L89k93J77l3k31O1l7Q2J1k35L53k71n9LL93j78j1p2K72
6403B19k18q0N8j11L53k49Q7JK28m23K16k32K4P0K56J02j30q6R2j95j27J57k96
6426b84L79oj70P8n8M2o8J00j18L5Ml5L4J90k24K55j57K2Nm5K9p9K74m49J33O8
6452d5Q3k90M9J30N2m8J26J71j58j79o1L32r2l1Q4m0j04J14k39K06q2K5J37J9
6476A59n4n7j22L34k52n2LJ39j29k8J27R7m7j60J31j38j06J10k6K33j09p8K54
6499B29l12l4K23j92J31L2L4j30k9O4jJ51l4Qk33J95o6Pn0J07m20L02k0J84k58
6524a12M62n30J18L6K18k41O3o5N1k4p7k4K54n3J9rQ2j80Qj65P5J30p3j35K90
6549A18R9j43j26QM9lo1J25j97K1J24j7l00K87n1k9L2J22n7Q6m0q2J33j21Qn6
$$ plain form
6380 263 109 -258 122 -102 287 -6 171 138 -93 -32 -69 13 24 -211 142 -129 -188 -185 208 30 19 -53 219
6403 219 1 -79 -21 -132 221 -28 59 60 288 -135 81 -151 -127 -57 199 301 171 85 177 -18 -145 12 -284
6426 -284 95 89 -81 -3 -61 -19 -87 13 -105 -70 -66 -101 -67 123 -101 154 -3 19 24 -21 8 -71 203 -246 -113 -45
6452 -45 38 -252 -203 -73 -21 -69 57 228 70 -109 -170 162 70 39 123 83 -21 93 -146 60 -22 3 140 159
6476 159 105 48 -74 260 8 -44 -41 98 -31 -59 68 165 118 -42 89 -49 -155 -45 -71 162 53 -25 229
6499 229 -83 -117 106 -86 45 77 111 -19 -48 16 15 166 132 140 -93 102 36 43 -7 100 -320 -18 -38 146 -112
6524 -112 350 -180 -62 -26 192 -49 14 -51 0 -24 -101 -125 129 76 95 86 168 -12 -4 -169 -94 36 -37 -172 118
6549 118 217 74 -52 -44 5 2 -59 66 -131 -110 14 -3 -303 -16 -67 -96 -64 58 1 87 47 -35 98 -23 -15 -71
6575g1k85M63j39K61K7k96r5J81J36k72O2k38K86K3r6l4J35j98K25L9j55J45n4
6598E0O0k16J84j85R9kJ40j64j29L00q2m8K2j17L14j11k40L75l41k2J45k6O8Q2
6622A56k19J0K78j34k41K28j4j71K95j90k04M08j21k07k6K26r9j13K04J9j72K70
6644A83k73J5j15J23J38l4j55J42N3k4l3k39L05k00jJ56J75r8k18K53k93J01Q0
6667D1Nj43R0l8M0K3J92m08j27M05j13jj06K54J6k21j4J90p8K13n4j75j9p7J44
6692C9L4m0r2J35J25j84j16K31n2j28R5J89l13J42N4Q7j68N2k47R4J54l48R1K29
6716F3J79j86P5k03K15r0k4j18l9J55m2O9l75L27l41J35K72j01p8K74k89q3L02
6739I7k31P1k9Q5P1p7J72l64J87j15l6K03l7o4O5M1Q0l1k03P8n7j09J15Nj59M22
$$ plain form
6575 -71 -356 107 -32 229 256 -40 -135 46 182 -90 -28 -266 20 43 -53 -87 48 -150 75 114 -41 104 50
6598 50 110 -106 78 -107 -8 -10 130 -34 -163 137 55 7 29 -88 226 115 -125 250 -91 -113 32 6 74 156
6622 156 -63 -53 225 91 -150 78 64 -107 188 -2 -206 202 81 -126 -152 74 -25 -138 66 85 -87 183
6644 183 -90 -75 -190 -67 71 37 -118 24 77 53 20 -219 86 -114 -115 41 216 118 -100 153 -140 -39 41
6667 41 46 -97 -7 -45 -5 18 210 -198 -325 80 -33 -34 -140 114 130 -91 -105 85 7 220 166 -9 -28 -105 39
6692 39 73 33 -59 76 201 17 -99 132 80 -48 47 236 -77 65 119 206 38 90 -157 -63 91 -257 -166 63
6716 63 242 56 131 -72 143 53 29 -89 -128 27 -15 54 -321 6 -335 -200 72 -29 -107 167 -122 -205 97
6739 97 -134 -63 -92 -7 64 -13 159 -205 -18 -133 -169 34 -3 -67 -2 39 119 88 -115 -37 -94 -203 -88 -83 -242 180
6765A80j09p1r8K87k87O7PL6J31j44j08Q7J74k53J82R7j86p7J24l1j63J70q7L6
6789c6j01K58n3k48L27l27K47j7pj36l9J77J55k85K59j43M9j78J56nj96J71l3
6812eR7m7ml08M99j66o3J06k58L5l03N03k3k43J27j15J50j84J31K42k24r9K92
6835A40k17M6k06O1K74l1j43J15J30mq2j52L6MJ89j77K04l59j07L2K11m8J34n3
6859cQ3R9k85K48R6l41O7o2J12p7M30l05%j10J71o6l4K9k44N7j03K5Q8J94p0m8
6885d9K8K59m90L42j45J31mm7J23m44J07J86nk4LJ26r7J08k21J87o5K61k13q9
6909c2N3J20j49R4m2l2J9j46K48k42J7j72J14K86j63P9Q6k78L3k6K44j11j71P8
6933i3Q8J36k28J02m6O6j62J11j06J83%R0J35m66K55q1j1J15j87K98m16J60K05
$$ plain form
6765 180 71 0 -98 189 -98 -31 -24 12 143 -1 -109 -22 152 -101 81 178 -8 -85 39 8 -155 15 -72 -36
6789 -36 -137 121 68 -180 147 -180 67 50 43 -93 -132 45 200 -85 174 31 80 -98 58 53 -143 28 -5
6812 -5 92 45 41 -267 232 66 3 109 -149 -114 -417 86 63 -180 -53 -168 -18 -202 -71 171 -53 -152 140
6835 140 -77 -31 -237 -176 98 67 -76 39 169 165 83 -69 -33 -29 160 -17 187 -172 -279 -247 -36 -84 50 -3
6859 -3 80 179 -106 142 238 -103 -36 -98 14 -63 367 62 62 -48 123 57 23 52 -192 -135 -238 -213 -125 69 -1 -49
6885 -49 -21 238 -252 90 -55 76 72 25 148 -296 -189 -3 -8 -32 -29 97 0 108 -113 74 9 270 57 -32
6909 -32 21 141 -8 86 44 12 31 -115 133 -109 -92 -264 -150 136 -27 52 138 -140 -107 -133 111 0 -171 -93
6933 -93 -5 131 -97 5 -41 25 -137 -26 -132 51 51 141 276 -190 65 -16 -27 88 -99 199 -217 -57 148
6956A48j42N5L0Pk7K25j60l7j90L8J79m03J92L8J34J49l25o9J69p5R3n9j37J51
6980a6m7P3J51j24o2n8Jq7J38qJ00j81JL04l00Q5r8K9K13l95J89L8J53J16m70
7005b55J11L44m56L82j2m5k13J15j1j1J34L2r0K9r9J66k78J26N3j89M54l75J23
7028C5l3J13p2N0k59j83M38J29l75M0o6L15j33QK64j49k11oK37l26K01jj7j6j26
7053a43J30p2K42j57J28j82r9JM17k58J34n5j10J11q7o5J12j77j2j55K71O2M5
7076H1l4Lj56K65p9nk17J36j20N3K14mj90J23l2J53k46K4j42J49P6L7K0j46P3
7101C6q0lJ10k09p0k1K29k48L02L7j37j52L81l49O1MK66j53K14m5j3r2k59L01
7125A10r3J8l53L65mj23P1J6j44N3J21J41j63m0J76j81K58l02N2j23J91j93K7
$$ plain form
6956 148 6 61 91 98 71 296 136 99 -91 -53 126 -277 -85 -47 87 236 -89 -158 11 -64 29 -30 -167 -16
6980 -16 -63 10 161 37 -25 -83 -82 -169 -31 -39 61 -120 -119 185 -115 -30 -128 -99 114 -281 -92 -54 99 215 -255
7005 -255 -144 200 -256 126 114 69 -144 -29 -40 -51 83 115 25 54 -45 121 -157 -31 22 -167 287 -88 35
7028 35 2 115 43 93 -166 -349 89 218 -157 -117 -183 132 -1 7 271 122 -89 -95 142 -184 17 16 -1 -17 -143
7053 -143 -13 -85 157 0 128 -54 -153 -152 265 7 141 86 -24 87 0 -65 47 -130 -142 -297 -26 36 81
7076 81 47 50 -106 159 80 75 -142 -6 -126 -73 141 137 -53 70 38 191 -55 -31 -173 -24 52 89 109 -37 36
7101 36 -44 -47 63 -146 -216 -237 -8 -256 46 83 -54 -206 175 -174 -113 -109 157 4 218 173 160 68 -191 110
7125 110 17 35 -318 47 43 -80 -9 7 -137 -84 37 178 15 -25 151 -30 228 -74 -22 -145 46 -147 -120
7148a20J69l22L44l84K98j06K90k06K86n7k46q2K58j54J07j74K00k64J14kJ63
7169A12j4J12k52j08J25l1M7j00K11j32o4J21P0j14l9M3j75L17k28PJ19j9p6m8
7193a16j44K57J63j60O4j82n6L27l09r0J47K06q0o7Nq6p2K70k9Q1j95K04Qk78
7217a32O7R7j68L43k16P7j08O2MJ19k20p1K28R1j79j24o8Q9Q0N5j96L23k05J81
7241A29n6p5o9k2kJ48R4k11j97J97M0K9J18L2nj17k75L58nk14K20k30j98M78j35
7266C2N8j54j44M8K5K71k55K76j71J28j20j8k52J50K93j93L45k42j22J19l18K99
7288E5r7j2K82j38j47J59k33J85m5j54L2m2j48J90R9R0k03J56J2k32K86j69J9
7311e5K38j50j34k4K16O5Jq0j52lp2oMK22j02j6L25l42P4q4O1p9OJ28mK9r6r4
$$ plain form
7148 -120 49 -273 71 -313 -15 -121 169 -37 249 192 -54 -136 122 -32 75 -99 101 -163 -49 -51 112
7169 112 98 210 -42 -150 -25 -56 -9 -109 102 -30 -94 27 97 -17 -56 -13 -188 129 -99 -92 27 8 -68 -116
7193 -116 -260 -3 160 0 64 -118 -174 153 -156 -246 -99 107 27 -40 -35 -121 -193 77 48 129 -66 138 146 -132
7217 -132 -65 32 -136 207 -9 68 -40 22 26 145 -75 -146 82 173 -6 -130 -198 -109 -29 26 -170 153 -52 129
7241 129 73 -2 -71 -93 -95 53 147 -64 -261 -64 -24 5 123 155 150 33 -242 116 111 -103 117 -113 -311 167 32
7266 32 90 -64 -208 -160 -135 136 -119 157 -14 114 -6 -24 -276 -126 167 -26 319 77 -45 74 -244 55
7288 55 -42 -54 228 90 -57 102 -131 54 9 -145 -113 -155 -303 -113 -14 76 -127 29 41 -191 95 -74 -55
7311 -55 183 33 -101 -125 91 156 157 77 -75 -78 -150 -156 -152 70 -32 -48 277 -65 9 -75 -14 -93 -87 41 37 66 -30 -124
7339a24l6K77j11J33K2p4N4k20K40k76l9m2K61j12M6J97m82J06J52j6o8r6L98
7362A90j77q8J44Pj9R8j91j6J34J18m13J32k30L83k7k32L91k50K23j56Nj98K20
7385D8P0j32m2J30m35L85j4Q4R3l79L71M7J21j98j03j17J00j60K39j67n6M6L5
7408c4J27j08O0o4o1J77r1j2k0N3J66l09K6N9J62j89K35P7q2l1j89K01j92K22
7432A83o2j32j16J72N0K3Nq8J70k25ro0k26M34k5lj89l9J81q1L88l16o6J07k92
7457b16J25P7lL6j3O6j01M6J12j49m3L94l47QQ6j74K51o8q3j44J24k43K28J75
7481A44k34p3J21J88j0kj75J23j93L05l00Q5j50L01k18K8n1m9L47k31o7Q5J09
7504H3k30M0J30P9l4j90K20Ok68Q3N1M0o9nQ8j2j39N9J4L21j56k14J40J5q0J66
$$ plain form
7339 -124 -160 117 6 139 161 87 141 -79 161 -115 -154 -196 65 -47 -1 196 -286 -180 -28 -44 -112 -208 190
7362 190 13 -75 69 76 57 155 -36 -52 82 200 -213 -81 -311 72 45 -187 204 -46 177 21 26 -172 48
7385 48 118 -14 -56 74 -361 24 10 94 187 -192 179 226 347 149 46 -71 29 -131 108 -59 -115 -69 -34
7408 -34 93 -15 45 -19 -80 97 6 -6 -26 27 193 -116 -90 -31 131 -58 177 254 172 141 -48 153 -39 183
7432 183 121 -11 -127 45 95 118 123 35 205 -20 -29 -89 -315 119 94 91 -98 -137 44 -37 351 35 -31 76 -216
7457 -216 -91 -14 -17 19 6 72 -29 17 129 -20 -63 331 -16 -8 78 -96 155 87 4 -140 -16 -259 -31 144
7481 144 -90 -163 -42 146 136 134 -41 82 -111 194 -106 -21 -171 130 -88 -60 -111 -160 187 -44 -111 -26 83
7504 83 -147 -107 23 102 68 -122 98 104 -164 -81 -30 10 -59 -64 24 12 -127 -68 -54 267 111 -103 37 52 -28 138
7530A38o8Q6l27j0NL17j95k5K7m8L27l22J35J9j82J28J30j26P7j29n0K7kj54L68
7555A46l49K27p1n2M8L9j62N86k38k43o5M53k31m1K7j17JJ88j43k28J68J65L2
7578A40j87j26K53j95m4K13j44O7j13J93j27J49j06l2J41N6j94L10l08J86mm26
7600b98K20J15o0O1j65k2p5N86m14q1J75J87k80K06k63K70k7J0k11p5L65k44O5
7623D5J64k25m5J75j05J43k70K2Q8J58j75j54K43O6n3k10J05j4j6P8o4J19r7M6
7647B4j92K80r0j08J85J5Q9j27j25l8lj43J96j9J32n1p2Rp0Q2J21o9j87K49Jm52
7673c63K39j65J27M5J08p7O5J55Q1j53J50k58L4Mj90J24m6q3R4L43j50j21L0M7
7697D0j58Q2l12N24j47j73L9L10l99K48j56J90q5l1J96j01J30l20J01q1L12m6
$$ plain form
7530 138 70 156 -171 -181 -176 141 -54 -79 -52 -100 227 -95 40 59 -123 5 135 9 86 -43 -93 -66 -68 -222 146
7555 146 -203 24 -47 -99 -51 -12 -174 412 174 -69 -134 319 88 47 74 -43 -42 146 3 -225 -57 108 140
7578 140 -47 -173 80 -115 -159 54 -90 -23 -136 57 -70 79 -27 -59 82 138 -56 254 -54 132 128 -298
7600 -298 -78 37 -23 38 -127 -149 -224 362 -52 -133 42 229 -51 155 -108 162 135 145 -66 -141 224 -20 45
7623 45 209 -16 -61 114 9 152 -118 -96 -8 150 -25 -179 64 130 77 -133 -28 -42 -58 20 -44 75 -22 24
7647 24 -168 112 22 -86 99 114 203 76 -49 -87 -90 -233 -37 -56 76 25 -47 -38 -108 -26 95 26 -161 88 89 -363
7673 -363 -124 -289 -162 -117 -9 -86 -21 134 215 62 212 -46 -12 -8 -198 -74 -120 -203 -109 234 84 -37 -7 40
7697 40 -118 -36 -348 176 29 -144 -105 205 -194 54 -102 88 3 -28 168 67 197 -123 -22 -103 209 163
7719A63n40L99J23l51K30k6j5n9j3Q7J85m53K60J03N4j85j22M8q1K07l51L12l4
7742e9J12J05j51J15j15k2j1J33j61p7N0kM0K6j65J00J38j43K79l94M03n45M74
7765A30J2j68J17l5j37j46K47k11j0K30J99l47R6K3j22M4J9L2j86N38k23m9oj07
7789f0L9Jq3j72k1K84n3m9J49j12M3o7J53P6n5O3q3k05J42J63k45n8K9K87j79
7814a3nJ36k78M1J44j10J42J85m88P7J03j4K11l17R6O1j63M06L3k87j4O4k5k53
7838b68J66L23m59K10m3NJ92k7q5r6J34k77K46M5O5k10j5J33J13m8j68J59q8J4
7862B1Rj29J12p8N7N0r4J17k43J64R9k30J78J10J38l95j5j02K12M0J75k41J8r7
7886a24J40j09J78J3Nj03j2Q3k41J71k18K96j10J1j29J80qo5J4r5J97j9J2j26
$$ plain form
7719 163 -377 22 145 -206 24 -2 -17 -76 -89 -2 183 -270 -10 93 147 -38 -160 -112 -193 14 -337 -25 -59
7742 -59 53 158 7 122 7 -15 -26 107 -54 -131 -81 -83 -43 -17 -182 -82 56 -87 192 -202 201 -344 130
7765 130 142 -26 91 56 -81 -227 20 -191 -201 29 228 -119 -23 0 -122 -78 -59 -27 -213 325 102 53 47 -60
7789 -60 -21 -20 -103 -275 -296 -12 -65 -114 35 -77 -34 -101 52 128 73 136 53 -152 -10 153 -92 -150 -121 166 -13
7814 -13 -18 118 -160 -119 25 -85 57 242 -246 -169 -66 -80 131 -186 -90 -29 -192 214 247 -40 -54 10 -15 -268
7838 -268 -102 221 -238 -28 -71 -66 126 99 14 -82 52 -225 21 66 131 -79 -94 39 152 104 -64 95 7 21
7862 21 30 -99 13 -65 -8 42 -52 65 -178 -14 85 -145 33 143 281 -114 -129 -231 -19 21 196 -45 -27 -124
7886 -124 16 -93 85 98 103 0 -12 71 -170 1 -217 79 -31 -20 -149 31 23 -42 -28 -123 74 55 67 -59
7910e9M6l8K23PN4l15J37J51j48O8j49J10p6OK14n18L13j03j35M24j06l06N4J28
7934a8K23j16k77J78J23j25M0q5J34j3J07O1k14j87K34J04l31K4J08M5p7N8M7
7957D3j6p4J52n0J4j42j01L00m2Q7k16j03j2K37l34L19J62k34J1j72j20J33N4
7980a04J45O2j64P3J08N0r3m4j1j6l3M5n2P0J26j05M3k3o3on7M9J52k61Q6J03
8006H0q2M1R8k16j17J06J92l60R0K13j09J21O2J66m80J66N8r2l5J76j75K08l4
8029G7J38m39N3K47Q2l15J8n1K94l39n2K54j44j80M05j55J62j05M1J00j34k2K71
8052B06k72N8J28k24R6N5j56K3P6k16M10l37p3M63m61J16J77j46J70l29L61O2
8074A87p4k26P1Q3l2j94N4J91j74K90l49M2n8L2J14j23O9K26k29N2Q2o7j15j77
$$ plain form
7910 -59 -13 -51 172 179 233 -82 55 206 58 126 -23 87 11 17 231 -287 26 -77 -212 212 106 -200 -146 -18
7934 -18 205 89 -188 -10 113 -12 28 -57 77 64 171 232 18 -169 65 169 -162 -138 -30 15 -62 -4 43
7957 43 27 -47 105 55 69 -73 -174 126 84 171 -45 -148 -160 77 -257 62 224 -10 1 -171 -291 -158 -104
7980 -104 41 103 -61 12 120 170 77 33 22 6 -27 18 -34 36 162 57 100 77 14 8 -49 0 152 -109 -23 80
8006 80 -2 39 137 -79 -196 -90 102 -258 -168 45 -64 57 119 285 -195 -29 29 -63 -98 78 -97 111 77
8029 77 215 -224 -171 76 158 -157 -139 -190 104 -235 -287 -33 -177 -357 48 -107 55 -50 -9 91 -43 -65 206
8052 206 -66 -8 120 -104 -8 47 -109 -86 -10 -226 184 -153 -226 237 -224 -108 69 -77 93 -236 125 187
8074 187 113 -113 -42 41 9 -185 -131 60 -114 176 -173 -131 -189 -157 -43 -166 -97 129 -100 -48 34 -33 -148 -325
8098c25K22K0L7Q6Mj34J09QJ04k60J30J80q4o5j26opj92M54M9k79J69k99L55k70
8123a20J55m04L32l6N0P0n4j56M3N5p5J90o7J98q9q6j04k5J13l31M87l26M07k87
8147f0J87r8l9k3Q5k09K60q7L2j67J68J17j52j08m2R6Ok03M21l22K9M5J3r2J54
8172A1J1J57j35n6Om2K83k05j91Q5j04K63r8j44R3k96J96J89P0
$$ plain form
8098 -325 -103 -83 -46 40 44 -90 19 27 131 -129 1 181 97 32 -94 -100 -107 -299 155 204 -75 94 -205 150 -120
8123 -120 35 -369 -37 -73 -23 47 -7 -163 -120 -65 -140 50 -17 181 92 6 -98 -123 -10 -341 146 -180 227 -60
8147 -60 127 29 -10 -33 52 -157 103 16 48 -119 49 166 14 -94 -136 -40 -34 -237 184 -138 -109 -64 -51 -143 11
8172 11 22 179 44 -12 -6 -48 235 30 -161 -76 -180 83 -15 -159 -66 -362 -166 23 93
8191I3
$$ Imaginary data points
##PAGE= N=2
##DATA TABLE= (X++(I..I)), XYDATA
0@%%%%%%%%%%Qj6J6j6K4l2M0m8N6p2Q8j04J20j41J66j93K25k62L01l41L91m48
32b38N08n74O47p28Q16r13J021j138J264j402J554j720J901k101K318k555K815
49A475l098L413l764M152m582N063n609O234o953P793q788R985j1463J3344j5819
64h617J9230k4247L2339m7456Q4710l34416m48258R70745J76614n92230K4748
75a46838K30712k26972J38972K61889k98486j67870L52815j7540k70178J40029
85c467J57984j65932m1114K7971n5684J39306J11262k84420j15786L00263P3938
96A44321j99098K1345M2620r6240R9163J37686j56247r5434J29113j860n7854
107c2485J04133k0024j65965O1726J56360p2746r4692N7900K8908k7831O925O74
$$ plain form
0 0 0 0 0 0 0 0 0 0 0 0 8 -8 8 -8 16 -16 24 -24 32 -40 48 -56 64 -77 89 -104 121 -141 160 -181 210 -238
32 -238 270 -304 343 -385 431 -482 539 -599 665 -737 817 -903 998 -1103 1215 -1340 1475
49 1475 -1623 1790 -1974 2178 -2404 2659 -2950 3284 -3669 4124 -4664 5321 -6142 7202 -8617
64 -8617 10613 -13634 18705 -28751 55959 -278457 -726715 244030 420644 -171586 -146838
75 -146838 83874 -143098 -4126 257763 -40723 -208593 144222 126682 -143496 -3467
85 -3467 154517 -11415 -52529 -24558 -80242 59064 170326 -114094 -229880 70383 144321
96 144321 -54777 -33432 9188 -87052 12111 149797 -6450 -101884 27229 25369 -32485
107 -32485 71648 51624 -114341 -52615 103745 30999 -63693 -5793 23115 -4716 2209 2883
119B883O767K0242m8587k9119P9886J7478q0875K934L2974l7506L4181O6711r6958
132b8989q1109J33461P9889j25686n6931R9710L5261n9964j5251L2080P906j8216
144B161j0895J1201J0457j0059r356j221l620J9003J6990m2666k5802O1551K7647
157D5391o6651j8110N3542N440k6744N474m945p073L0730m716m2460K4134M0473
170C4485l8381k7333M0911J7020k3845j0511m313J3710L3693k2477n2875K9035
182a0881M9349l2848l0536K5096O81j2936K1460m037k6961J8955J7041k8270K894
195a0993L2066j6592k4836J8201J3011n254K210j4440j0802L0031J0698l4878
207a1578j136K7363j1900j2866K0644k952j8585J3738L216j8641J6592J5945l3690
$$ plain form
119 2883 9650 29892 -18695 -47814 32072 49550 -31325 -28391 4583 -32923 1258 67969 -28989
132 -28989 -110098 23363 103252 -22434 -79365 20345 55606 -4358 -19609 12471 20377 2161
144 2161 -8734 2467 12924 2865 -6491 -7712 -11332 7671 24661 -18005 -43807 17744 45391
157 45391 -21260 -39370 14172 19612 -7132 -1658 -6603 -13676 17054 12338 -30122 -5988 34485
170 34485 -3896 -31229 9682 26702 2857 -7654 -11967 1743 35436 12959 -39916 -10881
182 -10881 38468 5620 -24916 180 861 -12075 9385 5348 -21613 -2658 14383 -13887 -10993
195 -10993 21073 4481 -20355 -2154 10857 5603 7813 -6627 -17429 12602 23300 -11578
207 -11578 -12714 14649 2749 -10117 10527 7575 -11010 2728 5944 -12697 3895 19840 -13850
220a3850j1423L7009L414k6116L103P384p655J1437Q203j9609k089J9425n654
233C579r620J3435k2j4180O564Q618q081M66M502r380l02J2877n966j0473Q669
248F86L802j0398K295Q474n581m292L811m81m72O284l423r059N576J0057m145
263C134p875K421N399J143k901l537K805N082k637n722J817M752j841k926q7n9
279a032O38J416j437l489J941L714k387l541K007M371k085l114K055K660j027
294F90q24Q48m84J93J556p00j481J711O02k519L68K395j700j869J321N67r84k19
312e29J11p46J59K62j011R34R85j382r52K269M06j671J307R03j873K64L167j282
330A321k298J471K026k298l81J997q65j501J140k67j053P75M71j733j73J402m53
$$ plain form
220 -13850 -25273 11736 15150 -10966 -7863 -479 -8134 3303 11506 -8103 -10192 9233 3579
233 3579 -6041 7394 7372 -6808 -244 8374 293 759 5261 -4119 -4421 8456 2490 -7983 686
248 686 4488 -5910 -3615 4859 -722 -5014 -1203 -1684 -2156 4128 705 -8354 -2778 7279 3134
263 3134 -4741 -2320 3079 4222 1321 -2216 589 5671 3034 -2688 -871 3881 2040 -886 -973 -1032
279 -1032 -394 1022 -415 -3904 -1963 1751 -636 -4177 -2170 2201 116 -2998 -943 1717 690
294 690 -134 714 230 423 1979 1279 -202 1509 2111 -408 -40 2355 655 -1214 107 674 -310 -529
312 -529 -418 -1164 -1005 -743 -1754 -820 165 -1217 -2169 100 506 -1165 142 1045 -828 -564 2603 1321
330 1321 -977 494 2520 222 -159 1838 973 -528 612 345 -708 67 538 -1195 -1368 34 -419
347d19r52J004l70j033J238J095r75p68J134q7K58Q03o87n08J209Mj225R00J278
366A899j548p50J549l85j409J277J53k088M6J931p26o19n2l51J07J285m21j136
384a238Q99M77r01R60L53j531P42K323j567k000K199J007j708L95K56p71J067
401I62K85k269L75K112j232j749J526K19j263J176%k248J633K166k502j126J994
418E9L49j22Q63j695j354L099J003k768k0J704j595O61K110k346j695K513L08
435A074k239J710O27k951O87K179j903L09J836k652j190L867J65l375J379J088
451F11k378K497K020l668r74L324n17j858K399o63k968K551K192k839k87J502
467I44k406N87M010k834l805L591J944l626J144J604l183P02L374k119k057L489
$$ plain form
347 -419 -1371 -367 -737 -1770 -532 563 -412 -1180 -46 -133 125 928 241 -267 942 946 -279 621 1899
366 1899 351 -399 1150 765 -644 633 786 -1302 -1256 675 -51 -670 -722 -1073 -966 319 -102 -1238
384 -1238 -339 138 -763 197 550 -981 -239 2084 517 -1483 716 1723 15 410 666 -105 962
401 962 1247 -1022 -647 1465 233 -1516 10 229 -1034 142 142 -2106 -473 1693 -809 -1935 59
418 59 408 286 1149 -546 -1900 1199 2202 -566 -586 1118 -477 184 2294 -52 -1747 766 1074
435 1074 -1165 545 1172 -1779 -1092 1087 -816 -507 1329 -1323 -2513 1354 1519 -1856 -477 611
451 611 -1767 730 2750 -918 -1892 1432 915 -943 1456 793 -2175 376 2568 -271 -558 944
467 944 -1462 -875 3135 301 -3504 87 2031 -1595 -451 1153 -2030 -1328 2046 -73 -2130 1359
483A359n86k990K759J974l226L84J253k093J588K843l877l019M465J920k968m32
499f46P56j830J949K523l303j839L038M8j327J380o22k334K336J570k550K82K033
516A464k108r14K847k44j826R79j5j141K088N92k685k8J846q98J12Q78j637j273
534a963K954P00k385j90J028l26J25P59j006m76J143k00l35P03l89p66N85Q14
552G75p61J62Q0q49O01O22p15m59M41O48n28J63m43l03Q53j69l00L89j18m14N32
573B07N41j199lO70k75P2O41p55r16J250Q09j308M37m14m15Q03J164j754o82J703
593E76n34o81J765m28k298J089J481n52o18L92j086P15J793j232j631J120L41
610B12q95J659O2k844N99K453j254l48R61r15j371K954L70k471K73R00j147J452
$$ plain form
483 1359 773 -2217 542 2516 -710 -326 927 -1166 422 3265 -612 -3631 834 2754 -214 -646
499 -646 110 -1720 229 2752 -551 -2390 648 696 -631 749 127 -2207 129 1699 -851 -569 1464
516 1464 -644 -1558 1289 1045 -781 198 183 -958 1130 1722 -963 -991 855 -43 69 947 -690 -1963
534 -1963 991 1691 -694 -884 144 -182 -57 702 -304 -780 363 163 -172 531 142 -624 -39 775
552 775 14 176 256 -593 8 630 -85 -544 -103 545 17 180 -263 -566 287 118 -182 207 89 -325 207
573 207 748 -451 -454 216 -59 13 654 -101 -1017 233 1042 -266 171 -243 -658 145 1309 -445 -1127 576
593 576 42 -639 1126 698 -1600 -511 970 418 -200 192 -894 -179 1614 382 -1249 -129 212
610 212 -683 976 1038 -1806 -1207 1246 -8 -356 605 -310 -1681 1273 1643 -828 -555 345 -802 650
628F50J332k542r79K539l04j173J560m57k640J968K044k499j50P67j047O22K435
645B126k367k114K221Q64j298J136J28k586J256K597j603j248J667r90o61K192
661A320q8k370P98J113j055J016L70k803K22L186n58k122J287k00j826J942J331
678A563k315k34J604j565L73K758k326k471K873J313j890P09p6j625J177K594
694B462k145j641K072l29j285J955k93k186R69J425j746N20J577k171r94L048
710A238k38k247R76J72j122J622J006k222k57J811n09p28J832j054j683J899J001
727A497j773L88N70j356K30J857j508r38J525k58j176J266N3j648P46J354j255
744d26j04J424j491q49K265K58j937L98Q09m97N43Q61k051R3J869n55j117J036
$$ plain form
628 650 1982 -560 -1539 1000 696 -477 1083 626 -2014 -46 1998 -501 -651 116 -931 -309 2126
645 2126 -241 -2355 -134 730 -568 568 696 -1890 -634 1963 360 -888 779 -211 -872 1320
661 1320 1232 -1138 -340 773 -282 734 1104 -1699 -1477 1709 1151 -971 316 116 -1710 232 1563
678 1563 -752 -986 618 -947 -574 2184 -142 -2613 260 1573 -317 392 316 -1309 -132 2462
694 2462 317 -1324 748 419 -866 1089 796 -1390 -421 1004 -742 -222 1355 -816 -1810 1238
710 1238 1000 -1247 -271 -99 -1221 401 1407 -815 -1072 739 230 -498 1334 280 -1403 496 1497
727 1497 -276 112 682 -674 -444 1413 -95 -1033 492 234 -942 324 377 -1271 -525 829 -426
744 -426 -530 894 -597 -1446 819 1077 -860 -462 347 -150 393 1254 -797 -704 1165 610 -507 529
762E29l4j176Q46O70j291K05O45p38m22J071j05j098M86M78o62N72M1p81L22R60
782E18j73q70R64K7p06R6P53l98k7M15m21m6M86l72m06L92Rp54L48N26p32J69
804b02J03k03j53L07P5k44K44R9j37n3L66j71N2J79j18p3N56jo34J1M35mk23k3
828A88k7j41KJ2j0k8l40j45J87L18k52l78M92L08m28K16L24m33n8K71K05k5J01
851C59j8k54M02k79J15j04l25J60L9L07m75l20j30N99j82j5l09K02J32l08K67
872a37J22n5k17M44L53o91O1N91k78n2K00Q3r1K59m04k65L56K27l58j90O3m31
894d10N3R49m22p48L88K17q65O12L25m90j13M37k48o6P50l34m92P96L72q97L83
915A97L27n13j80J070m11q41N08q5l51Q11m71j203J040Q80j193l86J357q60n25
$$ plain form
762 529 495 -681 165 835 -456 -251 394 -344 -766 305 200 -898 -412 66 -596 -24 17 -764 -442 518
782 518 345 -525 439 466 -240 -144 609 211 184 599 178 132 618 246 -160 232 241 -513 -165 361 -371 -202
804 -202 -99 -302 -455 -148 -73 -317 -73 26 -111 -164 202 31 83 262 144 71 627 626 -8 3 438 434 211 188
828 188 161 20 22 34 24 -4 -344 -489 -302 16 -236 -614 -122 186 -242 -26 298 -135 -193 78 283 258 359
851 359 341 87 489 210 325 221 -104 56 95 402 -73 -393 -523 76 -106 -121 -430 -228 -96 -404 -137
872 -137 -15 -70 -287 157 510 -181 -120 471 193 141 341 424 333 592 188 -77 279 506 148 -42 21 -410
894 -410 -357 592 170 -578 -190 27 -838 -226 99 -391 -504 -67 -315 -381 369 35 -457 339 711 -186 197
915 197 524 11 -169 901 490 -351 157 72 -279 532 61 -1142 -102 778 -415 -801 556 -304 -829
934h29J842o59j473R44O64p74O2J129j213m4J301n88q14J305k55j642J764Q61
952A581k001l34J524j165k63J947r99k210J850J192j459M2O41j993Q55K501j924
969b15j264J941m79j002J895N89k766N32J872j231j02J735j836j542K990J68j737
986d52M59P9j702J738J877k858j175K518o41r55K337p09l148K284K259k285k42
1003f16J632k297l5L478j066k708J712O45j739K361O13l737K63L320j221j659
1019a054K347j383k526L492J210l286k09J581j469Q00L158l111k428L279P21j828
1035g06J563j77l520K079M021k663j967K096j388q14M045n38m207J306K257j877
1051d90P76J490l570n14M196p88k557J828o24k348L022K498l748j181K390q22
$$ plain form
934 -829 1013 354 -1119 -175 489 -285 -223 906 -307 -351 950 362 -452 853 598 -1044 720 1581
952 1581 -420 -754 770 -395 -658 1289 290 -1920 -70 1122 -337 -295 346 -1647 -792 1709 -215
969 -215 -1479 462 -17 -1019 876 1465 -1301 -769 1103 -128 -230 1505 -331 -1873 1117 1285 -452
986 -452 7 86 -1616 122 1999 -859 -2034 484 -157 -1112 1225 516 -2632 -348 1911 -374 -616
1003 -616 1016 -1281 -1316 2162 1096 -1612 100 745 -994 1367 1980 -1757 -1494 1826 605 -1054
1019 -1054 1293 -90 -2616 876 2086 -1200 -1409 172 -1297 -497 2661 -450 -2878 401 1122 -706
1035 -706 857 680 -2840 -761 3260 597 -1370 726 -662 -1476 2569 2031 -2176 -870 1387 -490
1051 -490 286 1776 -1794 -2308 1888 1100 -1457 371 -253 -2601 421 2919 -829 -2010 380 -442
1067d42M39K696k689l039L292J800k520R48M20l104J665M063k992k503K433j82
1083B85j780L341j53l914N59K908j544L53J295l119r58M525P5l708J463R37k206
1100a641J961K653l959j302L151k14j188K655j793k980K930K141k552j82J083
1115G63k476O51L832k018l478K603J024j918J912N77k999O4L058j194j087J665
1131I79j694j378L667M75l229L51J652j480N98K183k457k068L217M09j638J074
1147F61j65k409J551K340k205j102J662j219k87L156j015l145J766J865j567K37
1163A24J208k275j25K429n88j645J515l44j550K125O23k152n31J824p77j23J680
1180A418j680j553K008J066k114N11Q97j366M97J573j161j324J637j51j019J596
$$ plain form
1067 -442 -3 2693 4 -3035 257 2057 -463 485 905 -2199 -534 3529 537 -1966 467 285
1083 285 -1495 1846 1693 -2221 -1662 1246 -298 55 1350 -1769 -2727 1798 1873 -1835 -372 565 -1641
1100 -1641 320 2973 -986 -2288 863 649 -539 2116 323 -2657 273 2414 -138 -320 763
1115 763 -1713 -1062 2770 752 -2726 -123 901 -1017 895 1472 -1527 -1463 1595 401 -686 979
1131 979 -715 -2093 1574 2049 -1180 -829 823 -657 -59 2124 -333 -2401 816 1225 -413 661
1147 661 496 -1913 -362 1978 -227 -1329 333 -886 -1173 1983 968 -2177 -411 1454 -113 124
1163 124 1332 -943 -1068 1361 773 -872 643 299 -1251 874 1497 -655 -1186 638 -139 -262 1418
1180 1418 -262 -1815 193 1259 -855 -344 553 -813 -316 1257 96 -1228 409 258 -761 835
1196H35j7j702L45J546p81l17M15q46k30J636j99j390O12J52p58P49J125j894
1214g19r3J108j29l57O68m18q32P36O96j006J73N04q21L49J033q96n73P59J53
1233C35p54Q14K34j002l3J082p20j53M52m73l10R44k08r56N42M10l40j31O65o12
1253b14j93O81j57k20J75J97n19J43P03r45L75K77n20J29M07l94k26L27L45o40
1273b69L78p7M7j50j0M8k02J73k68L1L6L42j35j20M99k24m23L35J8l4R4j57P6
1296HQ4N4n8o3j8j1K4q6J6N1L1m6j48l4K70o5j60p9J65Q4o3P5N2K99l18k95K31
1323@J8j09J74qq1K18j69R1k68O6L3n7J31M8J44m64p4K25j65Q3J48j32L65k22
1347ek74J09K08%O9k4Kj54M8Q6j15N1O2k21K53J17j16j18P2j69N1l0Oj54K75J19
$$ plain form
1196 835 818 -884 -539 1007 226 -91 324 -522 -752 884 685 -705 -93 59 -699 50 1175 -719
1214 -719 -812 296 167 -190 478 60 -772 -36 660 -346 -173 331 -490 -141 892 -4 -577 182 335
1233 335 -419 395 629 -373 -406 676 -44 -197 255 -218 -528 416 208 -748 -206 204 -136 -267 398 -214
1253 -214 -407 274 117 -103 72 269 -250 -107 596 -349 26 303 -217 -88 319 -75 -301 26 371 -269
1273 -269 109 32 79 -71 -81 -33 -235 -62 -330 -299 -263 79 -56 -176 323 99 -324 11 29 -5 89 -68 8
1296 8 92 146 88 25 7 -4 20 -66 -50 1 32 -14 -162 -196 74 9 -151 -230 -65 19 -44 31 83 382 64 -231 0
1323 0 18 -91 83 75 -6 212 43 134 -134 -68 -35 -92 39 87 231 -233 -307 -82 -247 -164 -16 -148 217 -5
1347 -5 -279 -170 38 38 107 83 85 -69 -21 65 -50 1 63 -158 95 212 96 -22 50 -119 -68 -98 -92 -246 29 148
1373A48l05K08J83j93K22j74l99L17J6K81l15l7nj7J35j72J39oK30m60P7Q8L9
1396@k25K91j80J82J25j74Mj80J92J7J6j87J74j46K72j60j16p2K97k71K33k28
1418a36Q5J08k54K36o7K29j85J56o1m00PM50l52J0K28K9k42K87l7o6J79k91j14
1441b01K70m2j1j25Q2N9k9M7Oj34r7J26N8J27k49j2J65no0j69L66P3n58L24Q8
1466I9k51L13J34l73J54J50r6m40K93K1m06K91L63o80L52K51j70j74J71j8j02
1487a18M61k64j66k23L76k40M81M8m55k12N68j45k99N27m27o7M66J5l52O0R7j44
1509a3R5L48m85l86K56M68k91K39K5p55L24K68k72O9K49k73j92O52K3p42J66O12
1531C85n68L26M58p24m28O99J94o07N64k17n13L55M99m80k14M72k67l08R48l54
$$ plain form
1373 148 -157 51 234 41 263 89 -310 7 23 304 -11 -48 -53 -70 65 -107 32 26 256 -204 -127 -39 0
1396 0 -225 66 -114 68 193 19 23 -157 35 52 68 -119 55 -91 181 21 -95 -167 130 -141 92 -136
1418 -136 -51 57 -197 39 -28 201 16 172 111 -289 -282 168 -184 -174 54 83 -159 128 91 25 204 -87 -201
1441 -201 69 27 16 -109 -27 32 3 50 56 -78 -175 -49 9 136 -113 -125 40 35 -25 -194 172 245 -313 11 99
1466 99 -152 161 295 -78 76 226 130 -310 -17 4 -402 -111 252 -428 -76 175 5 -169 2 -16 -118
1487 -118 343 79 -87 -310 66 -174 307 355 -100 -312 256 111 -188 339 -88 -155 311 326 -26 34 131 -13
1509 -13 82 430 -55 -441 -185 283 -8 231 256 -499 -175 93 -179 -110 139 -134 -326 326 349 -393 -227 385
1531 385 -183 143 601 -123 -551 148 342 -265 299 82 -431 -76 423 -57 -271 201 -66 -374 574 220
1551B20q51N14L18k59R9L46q30L5R89k07n20K23J12p11J135Q2j053R8P04l74k46
1572a76P25p64r06J185M77p06K38j40m93M69R34j089n39Q10j15k64R38J5j576
1591i77O39J027p12j2M55p55j7J209k07j030N7K86n31Q50M40j233k13J240k23
1610B93n90N26m0j025J000N66j010M5L23n92K92J121p64q82Q39M30n72M18L68
1629G46j397M11J413q60p60N49n00k17J096N7j251M73P69r08L57R00j158p94J562
1648D88M9r56N21j4o29P44M96j147K64L75k73j17J063n92j008O02O70o74K09K77
1668C48j234L47J287n60p91N59l3m03R77K17j272K28P09n13j99R92p19r22J109
1687A27N87q56J15K03m79N13N96o32n41O32k52l83O32N6q67J55J139q91o8M43
$$ plain form
1551 220 -631 -117 201 -58 41 387 -443 -408 581 374 -146 77 189 -522 613 695 -358 -260 444 70 -176
1572 -176 549 -215 -1121 64 541 -165 73 -67 -560 -91 843 -246 -785 25 -90 -354 584 599 -977
1591 -977 -338 689 -23 -35 420 -335 -352 857 650 -380 -323 -37 -568 282 722 -511 -724 516 293
1610 293 -297 229 189 -836 164 730 -280 -235 88 -504 -212 909 145 -737 102 532 -40 378 746
1629 746 -651 -240 1173 313 -447 102 -398 -615 481 538 -713 -240 529 -379 -22 878 -280 -1074 488
1648 488 537 -419 102 88 -541 203 699 -448 -184 191 -82 -199 864 272 -736 -134 536 -138 71 348
1668 348 -886 -539 748 188 -603 -44 -77 -480 497 714 -558 -330 379 -134 -333 659 -60 -982 127
1687 127 714 -142 -27 176 -303 210 806 174 -367 265 13 -370 262 318 -549 -394 745 -146 -214 229
1707B29l34k99P41j2q55M91O7m8O7N44q71j61Q30k28l82M47k5o07P43L00o39k62
1729b64O12m72K26N64p02n37N66K30o50M97Q2m90L12L70l32j80K28k2m79P90r2
1750B57o86L7P13l59k9M01k81l95P56O5o87J29M46m52p1K44m06J36k6J26j24M86
1772B80n17k20M68K14k30j43M00k79j96J49J57l14N32q0j32r5O7j51J39j9j06
1793g6l51M96jm80N14l1Q2j89N2k49L71j68j01J64o9Q6j83K37j84J7L5K49k2p6
1817A23N2J09j44n7J89l06k1m4m4M81l01j34j31K20j54J34P3k4k74L23L2l06J18
1840h6j8j8J87P2k83K14N8J28N0l71K51l48L91p6l5K12n41M54j78Nk66J17p5J40
1864a6j14J77j23J26O2j11oo8r1K12N4r0n5n2J70K7m0M3N4Pm5K11l45n8L08k62
$$ plain form
1707 229 -105 -404 337 325 -530 -39 28 -20 47 591 -280 -441 389 161 -221 226 201 -406 337 637 -2 -264
1729 -264 348 -124 102 666 -36 -573 -7 223 -427 70 152 -338 -26 344 12 -168 60 38 -441 349 257
1750 257 -429 -392 321 -38 -67 334 53 -342 414 479 -208 -79 367 -85 -156 88 -318 -182 -208 -82 -206 280
1772 280 -237 -457 11 225 -5 -148 252 -27 -223 -74 83 -231 301 221 89 -6 61 -90 49 30 -76
1793 -76 -427 69 68 -412 102 71 153 -36 16 -233 138 -30 -131 33 -36 50 -133 104 -80 -63 -28 221 199 123
1817 123 175 284 140 83 272 -34 -55 -99 -143 338 37 -97 -228 -8 -162 -28 45 21 -253 70 102 -204 -86
1840 -86 -104 -122 65 137 -146 68 126 254 304 -67 184 -164 227 151 116 328 -213 241 63 68 -198 -81 -156 -16
1864 -16 -130 47 -76 50 112 1 -5 -73 -164 48 102 12 -43 -95 75 102 62 105 159 166 121 332 -13 -71 237 -25
1890b5j52K16j10L24k65J60m9l8j6p4J09k79R1n6j45J47L3J8O8K40l8j46J55r6
1914G2j04K08k71J93J1n5j0o6J44m8r5K79n69L08J18j20k1K9O4j3k74P4L4P4N6
1939A8j36J51k1n5J12J24%l58L30k58K6J18j13L1N3K1j01j11M06m12q6L98q2j99
1963a44R4m5nN7oJ78n09M81J36m37L87k07j38K61K20l85J03j8J6j84N34l60j41
1986a12QR9l5J75j9l04R8L86k52KK15m24n8K56n8l83N54j86k33J87L86l36l63
2009c97M54j2r7L84r0k85J36K61r0l73N02n55K52M21l58m48K57J21k93L24K01
2030C15n03J2L35k5l01J71k13J73R9L00n90J56K50l29K42J02m88k3L48K56m41
2051a54M88J20p53K84M37p27O8L35j53J9K58J5m10K03Pk30N4J90l35k2O34k69
$$ plain form
1890 -25 -177 39 -71 253 -12 148 99 61 45 -29 80 -199 -108 -164 -309 -162 -129 -111 -43 197 159 13 168 72
1914 72 -32 176 -95 98 109 54 44 -22 122 74 -21 258 -311 -3 115 -5 -26 3 67 54 -220 -146 -112 -38 18
1939 18 -118 33 12 -43 69 193 193 -165 165 -93 -67 51 -62 -31 22 43 -58 -169 237 -175 -261 137 55 -144
1963 -144 -50 -95 -100 -43 -49 129 -380 101 237 -200 187 -20 -158 103 323 -62 41 23 39 -145 389 29 -112
1986 -112 -104 -5 -40 135 116 -188 -90 296 44 46 261 -163 -221 35 -23 -406 148 -38 -271 -84 302 -34 -397
2009 -397 57 45 -52 332 242 -43 93 354 264 -109 393 -162 90 511 153 -295 -38 83 -210 114 315
2030 315 -188 -176 159 134 -167 4 -209 -36 63 363 -227 -71 179 -150 92 194 -294 -317 31 287 -154
2051 -154 334 454 -299 -15 422 -305 -237 98 -55 -36 222 237 -173 30 37 -193 -139 51 -284 -306 328 59
2073E9l01K84m9j34K45J06l46K42J52l95J45M04o18q5M06J52m75M14k82k50M67
2094A41K77n60l64P57k95Q5K39l62k99O49J12l75Q5R9l32K33J89p7l07M19l50
2115c6l2K25Q9n26K44M50k83j15p3m1R3J65Ln37K31L81m46L39N7m39K07J79p8
2138E7l38L64N4l94P34l92k33K48r3L8J9K37l02k98L48L23l71p2P8m50L61K56
2160A74k53P0K6o3j09M94n88l2M02l8K8R5j12j10J57P1j86q4M45l66m7K19L16
2183E09q89K53L38l98K43K68m31j39L98j47j35R7j13m3L10k33J69q9K44nk79M79
2205D07n15k33J43M34k30j27O0j60k6M10k8l31J71J74q5M0j6m99J70L45J7k9k25
2228a33j06J72jK02k11O1P5r1J63j50j6Q5J80l31J44K65k46l79L48N6j32j78K51
$$ plain form
2073 59 -242 42 -7 -141 104 210 -136 106 258 -137 8 412 -206 -291 115 267 -208 206 -76 -326 141
2094 141 418 -142 -506 251 -44 41 280 -82 -381 268 380 5 90 189 -143 90 279 202 -105 314 -36
2115 -36 -68 157 246 -280 -36 414 131 16 -57 -98 -5 160 163 -374 -143 238 -208 131 188 -251 -44 135 57
2138 57 -281 83 137 -257 477 85 -148 100 7 45 64 301 -1 -299 49 372 1 -71 7 -443 -82 174
2160 174 -79 -9 17 -46 -155 339 -249 -281 121 83 111 206 94 -16 141 212 26 -58 387 21 -26 193 509
2183 509 -380 -127 211 -187 56 324 -107 -246 152 5 -130 -33 -146 -189 121 -112 57 -32 212 207 -72 407
2205 407 -108 -341 -198 236 6 -121 -61 -221 -247 163 135 -196 -25 149 64 104 88 -411 -241 104 121 92 -133
2228 -133 -239 -67 -68 134 -77 -16 59 -32 131 -19 -35 50 230 -101 43 308 62 -317 31 87 -45 -223 28
2251B8j56N4K17r8k51K80k19P1R7P2j35k42O60m55P1J71p9j72M01qn03J54Q9j71
2275a24J07K08j62k10L00k3l09L63j06j11o5k8K96k96K60l5k28N23l49j2O4j08
2297d5N3O6j07k15J29p1M19l52rJ00l3q9Q4J72j25l8L6J23j5L0j70n5J22N8o9
2322aQ7n1k4o4O5L9j87M9K51n02O35l64J75l55J68K77l6k12O9j4j9k3J04R3l74
2347b14J1K43j28K24j94Rj27O39n52J40o1R0j95R1l9J10m6j07mK39q3j62J43l8
2371a1J19k21J72Q6k55o1M29l27K21j63O5j9k8J80j8k40j91K20J84j88R4j14K67
2394B01j35J30J11l60J2K72k92n4J27P9o6K50L9k20k1j40jL3n8J32L6Q5p4k26
2418a40K36l09M4J33k14K91k04K72n0k22J54l1j9J84r5j0m0k9L93k97L8j76o7
$$ plain form
2251 28 -128 -74 143 45 -206 74 -145 -74 23 95 -40 -282 378 -77 -6 165 86 -86 315 307 -196 -42 47 -124
2275 -124 -17 191 29 -181 119 96 -213 150 44 -67 -132 -160 136 -160 100 65 -163 360 11 -1 63 -45
2297 -45 8 74 -33 -248 -119 -190 229 -123 -132 -32 -65 -154 -70 102 -23 -61 -25 98 83 113 -57 -112 10 68 -1
2322 -1 86 35 11 -53 12 51 -136 -87 164 -338 297 -67 108 -247 -79 198 162 -50 19 5 -14 -37 67 160 -214
2347 -214 -203 40 -88 136 -58 -49 -176 463 -89 51 -10 80 -115 -24 -63 47 1 -106 -110 129 46 -116 27 -11
2371 -11 108 -113 59 145 -110 -171 258 -69 152 -11 54 35 7 187 169 -71 -262 -42 142 -46 48 -66 201
2394 201 66 196 307 -53 -41 231 -61 -115 12 91 25 275 314 94 73 -67 -68 -35 -93 39 75 160 86 -140
2418 -140 96 -213 -169 -36 -250 41 -163 109 59 -163 -9 -40 -59 125 30 20 -20 -49 344 47 85 -91 -158
2441a58L14L6j20N3j97pj1K26j34jr8j17K95k99K50K36k75J60j97p1J68O8p0%
2465E1j6j4j49J58R1k16P9J04j20J36K7j94J00j5j81K32J00l9m78M74l55N7K0
2488a48K30j57j01K27K64k13K44k97k90K60j20J29MJ90m16R0J99k4m4K1K8j07
2510c1J8Q5M1k84J7K62j33L84l57l30O03o5l23K21K7m77L38n8j09m9O00j55l79
2533a54M30k44j21K39J03k25n3P9p6j71M82k34k23J66j29P0J63Q9k90J54j01J82
2555A36l0N8l23O8K6K13p2o0N5j66j1M35l90k21L23ll0K03k17m49L64K64q9l61
2579b77L64m10K36K10K3n08K51L16l31K63K16m32k22N60p0j28q8J21j88K33J32
2600B71n70J8K43p9r3L26l22O8K63r2n8K56j25j97K29j4k37N0P0mO9L32o14OJ89
$$ plain form
2441 -158 156 192 72 125 -72 -79 -90 136 2 1 -97 -214 81 -218 32 268 -7 153 -44 -115 53 121 51 51
2465 51 35 21 -128 30 121 -95 -16 88 -32 104 131 -63 37 22 -159 73 173 134 -344 130 -225 -168 -148
2488 -148 82 -75 -176 51 315 102 346 49 -241 19 -101 28 32 222 -194 -104 95 71 27 48 76 -31
2510 -31 -13 72 113 -171 -154 108 -25 359 2 -328 275 210 -113 108 135 -342 -4 -62 -171 -220 380 225 -154
2533 -154 276 32 -89 150 253 28 -25 54 -22 -193 289 55 -168 -2 -131 -61 102 191 -99 55 -46 136
2555 136 106 164 -159 -91 -65 148 76 16 71 -95 -106 329 -61 -282 41 38 8 211 -6 -455 -91 173 84 -277
2579 -277 87 -323 -87 123 146 -362 -111 205 -126 137 353 -79 -301 259 189 61 -27 94 -94 139 271
2600 271 -299 -281 -38 -117 -210 116 -206 -138 125 33 -25 231 106 -91 138 124 -113 -63 7 3 72 404 -210 -204 -15
2625a5P2K27j12j67p2k12M07j25pL9j53O9J40K00n91K70L0M6r1r3J13k10L92j97
2649d0m9K3R1k80K71K32l32N6K3n6j65K15O8k55K38J01o7k33L82p9l87M56l04
2672i1%K73M0j78j13L06m85J59K83m96L89m5J27m10K00J64j78J12J29m36O30m56
2694g6j95J77J39J23m18O08l42l9j92M24k55K0j60M2J11O6J11j37r7L04k03l2
2716b1L29m09N0J94m3l21J93O7j74K80l11J12J29N8l71P2K42%j59J09J29k23R8
2739C0K31m45j03O44l82l67O05k58j55K13J21l13J93J20r8J67k53J61m0P6Ro3
2761I3L8j52k25J48J46j31j17L19K62m24r5R1K18j12K8K28l08J7O7K42j93o5j33
2784e8J11o9j23l7K35N4n8J21j99J72k49O2n6J01K28k94R4j2n9J47r1m3Q4j85
$$ plain form
2625 -15 57 284 172 5 -67 -279 128 3 -4 35 -118 -49 91 291 -300 -30 0 46 -45 -138 -25 -235 157 -40
2649 -40 -89 -66 25 -255 16 248 -84 -28 -5 -61 -226 -11 57 -198 40 141 74 -159 223 144 -243 213 -91
2672 -91 -91 182 222 44 -69 237 -248 -89 194 -302 87 42 169 -241 -41 123 -55 57 186 -250 380 -76
2694 -76 -271 -94 45 168 -250 358 16 -23 -215 209 -46 -26 -186 -144 -33 33 144 7 -90 214 11 -21
2716 -21 308 -101 -51 143 100 -221 -28 39 -135 145 -166 -54 75 133 -238 -166 76 76 -83 26 155 -68 30
2739 30 261 -184 -287 357 -25 -392 213 -45 -200 13 134 -179 14 134 36 203 -50 111 71 147 156 93
2761 93 131 -21 -246 -98 48 -83 -200 119 381 -43 -138 -47 171 59 87 315 7 24 91 333 140 75 -58
2784 -58 53 -16 -139 -176 59 113 55 176 -23 149 -100 -38 -94 7 235 -59 35 23 -36 111 20 -23 61 -124
2808a24K67j80Q2m1K6J77k35P3j14MJ2L54k10k17J75J51q5j59J90n31N31l19J69
2831dR1k19R8R5k78K75lJ24j40p8j14K82P1l57M0j13J86J70k06J06N6J7p6j22
2855i9p5J21N3O5j15r3J52j10J05L3qj73l7N46k83p7J39j04n4P1Q5j73K48l60
2879a43K56l22J90K80k35lJ71j36j52K11j50r8J42NNP1R9j81Rk41J08Q9j80L06
2903A01k0J36m50L96q5j69J73j14m5J28K03l05k5L79j93L7l37K83O3r2m7j28J94
2926H3n3k54L26j7l17K69k6j77N57k85q3J40k84oQ2J06q3K5k7k48K12n4M5J08
2950C9J17j34L1n6j50J27J02J38j76J42j72op9k46K48J37l56R9o5M47k02J6R0
2973I1k50R3J14k58J00L6J4R2l01J95J06j54J20r3J9J29J30k90k02N09j15j71
$$ plain form
2808 -124 143 -37 45 4 30 207 -28 45 -69 -65 -53 301 91 -126 49 200 115 -44 146 -385 146 -173 -4
2831 -4 87 -132 -34 61 -217 58 55 179 39 -39 -153 129 200 -157 -117 -230 -44 126 -80 26 82 99 23 -99
2855 -99 -174 -53 0 65 -50 -143 9 -101 4 37 29 -144 -181 365 82 5 144 40 -14 57 142 -31 217 -143
2879 -143 113 -209 -19 261 26 23 194 58 -94 117 -33 -131 11 16 21 92 191 10 19 -222 -114 -25 -205 101
2903 101 81 217 -233 163 78 -91 82 -32 -77 51 254 -51 -76 303 110 147 -190 93 156 64 17 -111 83
2926 83 30 -224 102 85 -232 37 11 -166 391 106 23 163 -121 -127 -45 61 -22 3 -24 -272 -60 -114 -69 39
2950 39 156 22 53 -3 -153 -26 76 214 38 180 8 2 -77 -323 -75 62 -294 -195 -260 187 -15 1 91
2973 91 -159 -66 48 -210 -110 -74 -60 32 -269 -74 32 -122 -2 -95 -76 53 183 -107 -309 200 85 -86
2995h6M24l47M7j36J60l16J21n4M12k70L17j18k07N3j08O7l8J61m6n3J03Q4r9
3018G1Q4k68P3q3o0K7K53j38m3K11K8p2k6Km9R2m4m2K40j52P4qj97R2J32q7n10
3045d00L03Q6j22K94k43J2J71k72L34p5j24j40J42P7kj18j1N1r2L32j57j38J21
3068B9kk4n9K55L2l98J24j58K35p1K38k01L18l43K24k13j02J25k37K74j43L59
3090B62l44L4k9J57p1m8Q7J48O9j91NL0j96K47j95N9j15J38k4JR9k53J36k32J56
3115g0n9J41l20J05K57J51n1k35J8K11l77M05k49j86M54k79o6J36K58m34L4M0
3137a16K33k6Ql36P3J93J03n5j78J87n8J00J6j79k39N43l20j11m7L74k71P2J98
3160A64p8j1j56R1J70R0k99M3j69J62k3J01L8k50J43o8J49Q8Q4k00k10J51P8j28
$$ plain form
2995 -86 338 -9 38 -98 62 -254 -133 -187 225 -45 272 154 -53 0 -108 -41 -79 82 36 -17 86 170 71
3018 71 155 -113 -40 -123 -183 -156 97 -41 -84 127 155 83 57 59 10 102 58 16 256 104 178 170 -27 65 197 110 -400
3045 -400 -97 -11 -133 161 -82 -70 101 -171 163 88 -36 -176 -34 43 41 -77 -88 -37 -129 203 46 -92 29
3068 29 27 3 -56 199 231 -167 -43 -201 34 -37 201 0 318 -25 199 -14 -116 9 -228 46 -97 262
3090 262 -82 -48 -77 80 9 -39 48 196 265 74 79 109 -87 160 -35 24 -91 47 23 24 123 -130 6 -226 -70
3115 -70 -129 12 -308 -203 54 205 154 -81 -63 148 -229 176 -73 -259 195 -84 -150 -14 244 -190 -156 -116
3137 -116 117 91 99 -237 -164 29 132 77 -101 86 28 128 144 -35 -274 269 -51 -162 -209 165 -106 -34 164
3160 164 86 75 -81 10 180 270 -29 14 -155 7 -16 85 123 -127 16 -52 97 185 269 69 -141 10 88 -40
3184d0m4K43k15n0P6L7k69M4L62l45L75j94j83K42L8K1mM9l54N2K56k80L41k10
3208e2J71o1j9o8p4M2Q9p6j31L4K88n8k40J42l2M6J01k74L14k17q9L5K65j04j44
3233a12N8j04J53L9j41J93j64J66o8qJ55K6j17j88j48M42q0p6k4j39K5J98j76
3256i0J68j44J0Q3J31k87K85j81l0R6k6n9J54j48qp9o5K00J08p5k00nK55j94K25
3281A24j5kk0l41J2J99L49l56K22k50J00m00N82j47O6j91L50j39k45J65m7J47
3303A63q8j3j0N7j50q9L34j72mK3k4J11j35m9j82J59L2Oo7J70j89J17j2R7m7p8
3329d0J53j28N4J88o4J2j92j54L52m65K17J42l16M45j29j46J85j47l14J90K31
3350G4j14OP1N6q5J85l28k1K58j85K51l2j37M8k85J61M1m6j4K44P1j95j67J03
$$ plain form
3184 -40 -84 159 -56 -106 -30 7 -262 -218 144 -201 174 -20 -203 39 77 98 94 143 -211 -159 97 -183 158 -52
3208 -52 119 58 39 -29 -103 -61 28 -48 -179 -145 143 85 -155 -13 -45 1 102 -172 142 -75 -164 -129 136 32 -112
3233 -112 -54 -158 -5 34 -107 86 -78 88 20 12 167 193 76 -112 -260 182 102 26 2 -137 -112 86 -90
3256 -90 78 -66 -56 27 158 -129 156 -25 -55 41 15 -44 110 -38 -46 -125 -190 10 118 43 -157 -162 93 -101 124
3281 124 109 107 87 -254 -242 -43 306 -50 172 -78 22 -378 204 57 123 -68 282 143 -102 63 16 163
3303 163 75 62 52 109 -41 -130 204 32 28 51 27 138 3 -46 -228 -69 -37 -31 -98 72 -117 0 -12 85 38 -40
3329 -40 113 -15 39 227 163 175 -17 -171 181 -284 -67 75 -241 204 75 -71 114 -33 -347 -157 74
3350 74 -40 -34 37 93 8 193 -135 -156 102 -83 168 136 -1 47 -238 -77 -36 -82 -96 148 219 24 -143 -40
3374d0QO1k7J56j00j63l9j2J78j41K2J81J5j45K3J18l5p4j28r2P4J80J73m13J66
3399e4K1j4M5j36N4J68J59r7o7j02K3p1O0k1L5o1KLJ37L8l94L49o8lJ07q2M3j36
3427f2K32k34K39j43J32k32N9l74N65j9k87J86j83L12l4k23L32j69qj06j39k0
3449a76P4J58O1j32j10K53m3j09K2O1j15j97K14l6K64p4q3M6Oj07K19j81M5J83
3473B43r0j88m0J18pK04l68K49j68j67K49L6l91N54l63P8J7m0J01j5m3l02L11
3496b2MM4k21K7J51Q9J51j67R4j21K61l46Q5n1J6K09k07K50m30J78Q9J05r7k0
3520G1M5j73J53J4l06L50j59J22k13J91k8p0j50J47k00M00j80k37K6L86k57lL44
3543B73m31K8J93oj26J06k35K54j39K18l98J56J95J1J5r1jm49Q1O24k43l04M16
$$ plain form
3374 -40 -32 29 2 158 58 -105 -144 -156 22 -119 -97 84 99 -46 -23 95 60 -14 -142 -234 -160 20 193 -220 -54
3399 -54 -33 -47 -2 -138 -84 84 243 146 79 -23 0 -71 -11 -32 3 -58 -56 -53 84 122 -272 77 9 6 113 31 74 -62
3427 -62 170 -64 175 32 164 -68 -9 -383 182 163 -124 62 -121 191 157 -66 266 97 89 -17 -156 -176
3449 -176 -102 56 117 -15 -125 128 85 -24 -2 59 -56 -253 -39 -75 189 115 32 78 84 -23 196 15 60 243
3473 243 153 -35 -75 43 36 240 -128 121 -47 -214 35 71 -320 234 -129 -51 -34 -74 27 12 -31 -333 -22
3496 -22 -18 26 -195 -168 -17 72 223 56 150 29 290 -56 29 -22 -6 203 -4 246 -184 -6 83 188 91 71
3520 71 116 -57 96 110 -196 154 -5 117 -96 95 67 -3 -153 -6 -206 194 14 -223 -197 189 -68 -71 273
3543 273 -158 -130 63 57 -69 37 -198 56 -83 135 -263 -107 88 99 114 23 22 -427 -346 278 35 -269 147
3566A47j35O4r8k36K41K76k40k68L81p0j87j22N42k44r1L2j45m9J78J24j33L5
3588Bo5p1J15K61k44k43K71kk8J1J02j43qJ57j72K4J05q3P2J31j1k75j27L13j82
3613i0J84M1l35j86N98k22n6J10R1j78K96j91q8K65k54l03K64K43k55k3J27J94
3635B32k56J09Nl19J71R8j33O2kK8q2J67L07o58J12M26l44K79j94j56kL16J36
3658C02m28K44j51k00M99K7k88j01K87j75J25K38n01J6L32q9l04K27r4q1J26L54
3680C65n08k72O20n5k15K74no58L05K24k05k12M36j30J30J85qm05J26k3j90L64
3702A43K84n10J34j11P5j29K90l12L3k4M33k71k33L54m57L79J08j71N1K51j68
3723A49j25M59l19m33J81L51k89J37r6j20J1J06K11l89N8J87j51O4O6k56N1L64
$$ plain form
3566 147 12 76 -22 -258 -17 259 19 -249 132 62 -125 -247 295 51 -40 -8 -153 -202 -24 100 -33 2
3588 2 -63 -134 -19 242 -2 -245 26 24 -4 7 109 -34 -42 115 -57 -33 72 -11 61 192 181 -94 -221 92 -90
3613 -90 94 135 -200 -386 212 -10 -66 44 135 -43 253 62 -26 239 -15 -318 -54 189 -66 -89 38 232
3635 232 -24 85 90 -229 -58 40 -93 -31 -33 -5 -87 80 387 -271 -159 267 -77 202 8 -148 -150 166 302
3658 302 -126 118 -33 -233 266 293 5 -96 191 16 141 379 -122 -106 226 137 -167 60 -34 -115 11 365
3680 365 -143 -415 205 150 -65 209 204 -454 -149 75 -130 -342 94 -36 94 279 271 -134 -8 -31 -221 143
3702 143 427 -83 51 -60 15 -114 176 -136 -103 -127 306 35 -198 156 -301 78 186 15 66 317 149
3723 149 24 483 164 -269 -88 263 -26 111 15 -105 -94 12 223 -166 -108 79 -72 -8 58 -198 -147 217
3745B17m46P4J79J43k11K06K61k77j92l3j40N9K81j58K48%k01mnj8n1q6L63n1
3769A58l62J79P4j29N8K26m94J92K91k56j44J12K71j40k5Q8l13K77j59K39j9j44
3791b0N6k84K60J66l86M43l04K8J48j94j19p3J21J3J2M51q6n60J46L12k01J95
3813A24j94J41k59Q2J24k00M27j97j48K27j13O9k77L83j66j23J26j1Q0r2M4j12
3835f5o5l2J05J08J26l9j21l2j9q7Q3N7J36k28K14k86J71j23n1M4J74k55J91J91
3859A97J1k20j40L82k22J0J38j83r7J22Lk56J00q2K17J02O0P0l32KJ09n6k04L32
3883F3L18o08J53n4M6J42j6j1J84j64k09K48J27m20L11p0lq6K64l18Q7J28L9k55
3907a04L18n84N10oj80P7l0P8j61K85j25J25l09L35j02k09K77j36k8j7J23j04
$$ plain form
3745 217 -229 -155 24 167 -44 162 423 146 -46 -79 -219 -160 121 -37 211 211 10 6 1 -17 -68 -154 209 158
3769 158 -204 -25 49 -80 -22 204 -290 -98 193 -63 -207 -95 176 36 11 99 -214 63 -96 143 124 -20
3791 -20 36 -248 12 178 -208 235 -69 -41 107 -87 -206 -279 -158 -145 -133 318 232 -328 -182 130 -71 124
3813 124 -70 71 -188 -106 18 -182 245 48 -100 127 14 83 -194 189 23 -100 26 15 95 3 47 -65
3835 -65 -130 -162 -57 51 177 138 17 -15 -34 -121 -38 19 155 -73 141 -145 26 -97 -148 -104 70 -185 6 197
3859 197 208 -12 -152 230 8 18 156 -27 -124 -2 1 -255 -155 -237 -20 82 142 212 -120 -118 -9 -65 -269 63
3883 63 381 -227 -74 -128 -82 60 44 33 217 53 -156 92 219 -201 110 40 37 -49 215 -103 -16 112 151 -104
3907 -104 214 -370 140 134 -46 31 1 79 -82 203 78 203 -106 229 127 -82 195 59 31 14 137 33
3929C3Rj96K35j83r1K28K1J07k09j29Q1M2P3L2j24K97k03K02k08j26J59Pj76J11
$$ plain form
3929 33 42 -154 81 -102 -193 35 56 163 -46 -175 -94 -52 21 53 -71 226 23 225 17 -109 50 57 -119 -8
$$ [...]
8191A9
##END NTUPLES=NMR FID
##END=
