##TITLE=1H_Pr 5778
 CDCl3
 8 sc, 
 14.12.2022
##JCAMPDX= 6.0         $$ Bruker NMR JCAMP-DX V2.0
##DATA TYPE= NMR FID
##DATA CLASS= NTUPLES
##ORIGIN= UXNMR, Bruker Analytische Messtechnik GmbH
##OWNER= root
$$ XWIN-NMR		Version 3.5
$$ Wed Dec 14 15:59:01 2022 Russian Standard Time (UT+4h)  she@DPX200
##.OBSERVE FREQUENCY= 200.13135
##.OBSERVE NUCLEUS= ^1H
##.DELAY= (6, 6)
##.ACQUISITION MODE= SIMULTANEOUS
##.ACQUISITION SCHEME= undefined
##.AVERAGES= 8
##.DIGITISER RES= 18
##SPECTROMETER/DATA SYSTEM= spect
##.PULSE SEQUENCE= zg30
##.SOLVENT NAME= CDCl3
##.SHIFT REFERENCE= (INTERNAL, CDCl3, 0, 15.7039)
##AUDIT TRAIL= $$ (NUMBER, WHEN, WHO, WHERE, WHAT)
$$ ##TITLE= Audit trail, XWIN-NMR		Version 3.5
$$ ##JCAMPDX= 5.01
$$ ##ORIGIN= Bruker BioSpin GmbH
$$ ##OWNER= she
$$ F:/spectra/data/she/nmr/H-F/1/audita.txt
$$ ##AUDIT TRAIL=  $$ (NUMBER, WHEN, WHO, WHERE, WHAT)
(   1,<2022-12-14 15:57:37.46 +0400>,<she>,<DPX200>,
      <created by zg, POWCHK disabled, PULCHK disabled
       configuration hash MD5:
       00 E9 B6 7A A2 85 ED C7 34 08 36 98 17 FE 4E 26
       data hash MD5: 16K
       0B 1A F0 3D B5 E7 5C 61 E9 E3 BC 3A 8C 09 B3 65>)
$$ ##END=
$$ 
$$ hash MD5
$$ F3 8D 7B 19 2F 5C E6 46 0C 4B C0 1B 05 83 00 AB
##$RELAX= 
##$RELAX= 
##$RELAX= 
##$RELAX= 
##$RELAX= 
##$RELAX= 
$$ Bruker specific parameters
$$ --------------------------
##$DU= <F:/spectra>
##$EXPNO= 1
##$NAME= <H-F>
##$PROCNO= 1
##$TYPE= <nmr>
##$USER= <she>
##$AMP= (0..31)
100 100 100 100 100 100 100 100 100 100 100 100 100 100 100 100 100 100 
100 100 100 100 100 100 100 100 100 100 100 100 100 100 
##$AQSEQ= 0
##$AQ_mod= 1
##$AUNM= <au_zg>
##$AUTOPOS= <>
##$BF1= 200.13
##$BF2= 200.13
##$BF3= 200.13
##$BF4= 200.13
##$BF5= 200.13
##$BF6= 200.13
##$BF7= 200.13
##$BF8= 200.13
##$BYTORDA= 1
##$CFDGTYP= 0
##$CFRGTYP= 5
##$CHEMSTR= <none>
##$CNST= (0..31)
1 1 145 1 1 1 1 1 1 1 1 1 1 1 1 1 1 1 1 1 1 1 1 1 1 1 1 1 1 1 1 1 
##$CPDPRG= <>
##$CPDPRG1= <>
##$CPDPRG2= <>
##$CPDPRG3= <>
##$CPDPRG4= <mlev>
##$CPDPRG5= <mlev>
##$CPDPRG6= <mlev>
##$CPDPRG7= <mlev>
##$CPDPRG8= <mlev>
##$CPDPRGB= <>
##$CPDPRGT= <>
##$D= (0..31)
0 1.2 0 0 0 0 0 0 0 0.06 0 0.03 0 0 0 0 0.0002 0 0 0 0 0 0 0 0 0 0 0 0 
0 0 0 
##$DATE= 1671019056
##$DBL= (0..7)
120 120 120 120 120 120 120 120 
##$DBP= (0..7)
150 150 150 150 150 150 150 150 
##$DBP07= 0
##$DBPNAM0= <>
##$DBPNAM1= <>
##$DBPNAM2= <>
##$DBPNAM3= <>
##$DBPNAM4= <>
##$DBPNAM5= <>
##$DBPNAM6= <>
##$DBPNAM7= <>
##$DBPOAL= (0..7)
0.5 0.5 0.5 0.5 0.5 0.5 0.5 0.5 
##$DBPOFFS= (0..7)
0 0 0 0 0 0 0 0 
##$DE= 6
##$DECBNUC= <off>
##$DECIM= 32
##$DECNUC= <off>
##$DECSTAT= 4
##$DIGMOD= 1
##$DIGTYP= 9
##$DL= (0..7)
0 120 120 120 120 120 120 120 
##$DP= (0..7)
150 150 150 150 150 150 150 150 
##$DP07= 0
##$DPNAME0= <>
##$DPNAME1= <>
##$DPNAME2= <>
##$DPNAME3= <>
##$DPNAME4= <>
##$DPNAME5= <>
##$DPNAME6= <>
##$DPNAME7= <>
##$DPOAL= (0..7)
0.5 0.5 0.5 0.5 0.5 0.5 0.5 0.5 
##$DPOFFS= (0..7)
0 0 0 0 0 0 0 0 
##$DQDMODE= 0
##$DR= 18
##$DS= 0
##$DSLIST= <SSSSSSSSSSSSSSS>
$$ [...]
##$SUBNAM2= <"">
##$SUBNAM3= <"">
##$SUBNAM4= <"">
##$SUBNAM5= <"">
##$SUBNAM6= <"">
##$SUBNAM7= <"">
##$SUBNAM8= <"">
##$SUBNAM9= <"">
##$SW= 18.05172834244
##$SWIBOX= (0..15)
0 0 2 0 0 0 0 0 0 0 0 0 0 0 0 0 
##$SW_h= 3612.71676300578
##$TD= 16384
##$TD0= 1
##$TE= 0
##$TE2= 300
##$TE3= 300
##$TEG= 300
##$TL= (0..7)
0 120 120 120 120 120 120 120 
##$TP= (0..7)
150 150 150 150 150 150 150 150 
##$TP07= 0
##$TPNAME0= <>
##$TPNAME1= <>
##$TPNAME2= <>
##$TPNAME3= <>
##$TPNAME4= <>
##$TPNAME5= <>
##$TPNAME6= <>
##$TPNAME7= <>
##$TPOAL= (0..7)
0.5 0.5 0.5 0.5 0.5 0.5 0.5 0.5 
##$TPOFFS= (0..7)
0 0 0 0 0 0 0 0 
##$TUNHIN= 0
##$TUNHOUT= 0
##$TUNXOUT= 0
##$USERA1= <user>
##$USERA2= <user>
##$USERA3= <user>
##$USERA4= <user>
##$USERA5= <user>
##$V9= 5
##$VALIST= <valist>
##$VCLIST= <CCCCCCCCCCCCCCC>
##$VD= 0
##$VDLIST= <DDDDDDDDDDDDDDD>
##$VPLIST= <PPPPPPPPPPPPPPP>
##$VTLIST= <TTTTTTTTTTTTTTT>
##$WBST= 1024
##$WBSW= 4
##$XGAIN= (0..3)
0 0 0 0 
##$XL= 0
##$YL= 0
##$YMAX_a= 295170
##$YMIN_a= -252179
##$ZGOPTNS= <>
##$ZL1= 120
##$ZL2= 120
##$ZL3= 120
##$ZL4= 120
##$ABSF1= 10
##$ABSF2= 0
##$ABSG= 5
##$ABSL= 3
##$ALPHA= 0
##$AQORDER= 0
##$ASSFAC= 0
##$ASSFACI= 0
##$ASSFACX= 0
##$ASSWID= 0
##$AUNMP= <proc_1d>
##$AZFE= 0.1
##$AZFW= 0.1
##$BCFW= 1
##$BC_mod= 2
##$BYTORDP= 1
##$COROFFS= 0
##$CY= 11.3945322036743
##$DATMOD= 1
##$DC= 2
##$DFILT= <>
##$DTYPP= 0
##$F1P= 2.36226072786647
##$F2P= -0.459571619588291
##$FCOR= 0.5
##$FTSIZE= 0
##$FT_mod= 4
##$GAMMA= 1
##$GB= 0.15
##$INTBC= 1
##$INTSCL= 1
##$ISEN= 128
##$LB= 0.24
##$LEV0= 0
##$LPBIN= 0
##$MAXI= 10000
##$MC2= 0
##$MEAN= 0
##$ME_mod= 0
##$MI= 1.114404
##$NCOEF= 0
##$NC_proc= 0
##$NLEV= 6
##$NOISF1= 3.799351
##$NOISF2= 2.8
##$NSP= 1
##$NTH_PI= 0
##$NZP= 0
##$OFFSET= 15.70392
##$PC= 1
##$PHC0= -19266.21
##$PHC1= 11.00072
##$PH_mod= 1
##$PKNL= yes
##$PPARMOD= 0
##$PSCAL= 0
##$PSIGN= 0
##$REVERSE= no
##$SF= 200.130013532006
##$SI= 16384
##$SIGF1= 3
##$SIGF2= 2
##$SINO= 400
##$SIOLD= 16384
##$SREGLST= <1H.CDCl3>
##$SSB= 0
##$STSI= 0
##$STSR= 0
##$SW_p= 3612.71676300578
##$SYMM= 0
##$S_DEV= 0
##$TDeff= 0
##$TDoff= 0
##$TI= <>
##$TILT= no
##$TM1= 0
##$TM2= 0
##$TOPLEV= 0
##$USERP1= <user>
##$USERP2= <user>
##$USERP3= <user>
##$USERP4= <user>
##$USERP5= <user>
##$WDW= 1
##$XDIM= 8192
##$YMAX_p= 0
##$YMIN_p= 0
$$ End of Bruker specific parameters
$$ ---------------------------------
##NTUPLES= NMR FID
##VAR_NAME=  TIME,          FID/REAL,        FID/IMAG
##SYMBOL=    X,             R,               I
##VAR_TYPE=  INDEPENDENT,   DEPENDENT,       DEPENDENT
##VAR_FORM=  AFFN,          ASDF,            ASDF
##VAR_DIM=   8192,          8192,            8192
##UNITS=     SECONDS,       ARBITRARY UNITS, ARBITRARY UNITS
##FACTOR=    0.0002768,     1,               1
##FIRST=     0,             0,               0
##LAST=      2.2672688,     0,               0
##MIN=       0,             -252179,         0
##MAX=       2.2672688,     295170,          0
$$ Real data points
##PAGE= N=1
##DATA TABLE= (X++(R..R)), XYDATA
$$ [...]
1338C303r533O834O525j1710o87J3083o223r745J0938L110j1135L361P710q011
1352b180k380J0280m150r560J0403M807j3233J696J1164o824n680Q931o20q354
1366e700O900N175j1578N57J2580o890q779J0496K385r985L837O524q337j482
1380d297J0667m950r335J0532L958j2355K601R766p516m460R448j585q752P469
1394A191M954j1508J447J1585p805p165J0960R13j0162M828O591q902q52J0447
1408F522n974q088J1321K231j2386M141R008q398l326R579k898q132Q635L528
1422E763j1928L204J0642q914n313J0934j043r254O309N227r848Q68J0265p381
1436d69o530J1523R3j1157N895P070r185j555R707m425p218R352J764j1210M925
$$ y = [3303, -6230, 604, 7129, -4581, -5268, 7815, 1592, -8153, 2785, 5895, -5240, -1879, 5831, -2180, -4560, 5720, 1570, -7990, 2413, 7220, -6013, -4317, 6847, 23, -5657, 3274, 2654, -5700, 1200, 6375, -5203, -4646, 7934, 1044, -7735, 2761, 5146, -4839, -1002, 5522, -2815, -4297, 6370, 1420, -7915, 2617, 6575, -5780, -3179, 6587, -929, -5389, 4059, 2474, -6278, 1191, 6145, -5363, -3916, 7669, -136, -7301, 3659, 4572, -5590, -762, 5829, -3073, -3925, 6522, 548, -7540, 3781, 6012, -6374, -2233, 6775, -1623, -4949, 4630, 1732, -6400, 2235, 5763, -6165, -2961, 7681, -1233, -6546, 4388, 3345, -5909, 400, 5627, -4221, -3353, 6912, -469, -6999, 4524, 4617, -6540, -645, 6425, -2760, -4315, 5392, 967, -6251, 3101, 4865, -6345, -1420]
1451a420Q497r560l025J0439k685q116P082L767r653K266Q946q070m438J0884
1465D914j701r485O695N312r079j5Q851n298n901R311L19r896N680O492r213j309
1481d323R336l741o883P465K604r287L080P735q077k888R784k825p839O931L874
1496D946q751R98Q299n791m937R041o47q756O028M998q691p3Q432m412o099P807
1512B392J813r019L534O785p794j805Q716l461o620P081K821q602J665P893o163
1527g64m310Q783j229p665O104L780q279R22P942n132n518Q200J045q797M317
1542f01N812p907o57Q115m279n654P458J845q833K764P547p021l306Q687k241
1557A729o793O619K518q191K040P568o153m603Q728r7q450N116M772p845N55P296
$$ y = [-1420, 7077, -2483, -5508, 4931, 2246, -5870, 1212, 4979, -4674, -2408, 6538, -1532, -5970, 4914, 3213, -6272, 423, 5735, -3344, -3359, 5492, 194, -5707, 3604, 3923, -5973, -293, 6199, -3014, -4323, 5013, 1272, -5611, 1854, 4458, -4829, -1749, 5986, -2091, -4979, 4805, 1980, -5859, 1072, 4946, -3805, -2807, 5492, -299, -5236, 3805, 3158, -5598, 430, 5428, -3263, -3336, 5096, 684, -5415, 2392, 4205, -4814, -1280, 5505, -2289, -4094, 4622, 1161, -5459, 1622, 4443, -4159, -2494, 5399, -764, -5074, 3709, 2480, -5185, 919, 4699, -3580, -2658, 5284, 152, -5366, 2834, 3879, -4918, -601, 5211, -2696, -3353, 4762, 483, -5171, 2287, 4132, -4701, -1937, 5610, -1411, -4717, 3970, 1729, -5064, 1555, 4073, -4118, -2078, 5490, -663, -5266, 3462, 3365, -5085, 31, 4803, -3042, -2487, 4809]
1573D809n047m707P962P46q812L838O749p559k031Q299l358n688O852J416p889
1588d420L053O801o856l583Q932j350p670N885L446p697J747O489n761l508Q150
1603C658o10q284M977N520p876n69P560m324m326O924R0p383M074N748p404k052
1619d277Q568k736o405O249J934o966K669N368o048k214P796j724p303N691M037
1634D639p593P37O358m626l023O465q84o523M571M654p389q77P712l423n099O115
1650A814P52o145L192M446o118j369P341k359o383N886K895p051J520N463m796
1665i12k247O239j336n998M842L845p234%P045l981m154O034J02n782L402L890
1681C755n984q81P106l009n624O033K003o672K133M823m967j604O170j903n641
$$ y = [4809, -238, -4945, 3017, 3763, -5049, -1211, 5538, -2021, -4052, 4247, 889, -4799, 2053, 3469, -4420, -1367, 5434, -1422, -5005, 3927, 2577, -5093, 792, 4238, -3459, -1712, 4777, -984, -4492, 3658, 3048, -5236, -259, 5261, -2615, -3184, 4376, 52, -4274, 2650, 2740, -4643, -569, 5179, -2225, -4277, 4291, 1555, -4850, 1399, 3333, -3633, -964, 4404, -1644, -3858, 3938, 2214, -5089, 602, 4639, -2954, -2217, 4141, -485, -3508, 2957, 2073, -4450, 121, 4775, -2614, -3491, 4221, 798, -4301, 1814, 2566, -3579, -387, 4059, -2059, -3428, 3913, 1554, -4829, 1057, 3952, -3099, -1579, 3884, -912, -3159, 3080, 1744, -4254, 588, 4433, -2801, -2801, 4244, 263, -3891, 2143, 2245, -3537, -135, 3755, -2229, -3110, 3996, 987, -4637, 1396, 3399, -3273, -1140, 3683, -1284, -2888, 3282, 1379, -4262]
1696d262N277L140p248Q25O467m435l221N972p17n457M062L406o415j49O972l813
1712D04m804O324Q08o228L026M010n466p28O214k733n214N866K177p007J927N454
1728D030m993k046N964j625n048M664K654o517P74O304m374l667O268l99n473
1743c484L694L066n633R7N907l329m496O051J134o469K668M349n110q14N520k468
1759F83m375N158J881o490J561N579m666k429N708j333m564M223K056n639Q24
1774a823N598l860l720N868K30n626L203L141n079J80N083l014l810N294J222
1789B887o066K172M671m732j457N262k024l769M360J359n459J443N109m274k860
1804c378N662n21m901L493K164m691Q25M501l503l074N433N72n829K472L989m524
$$ y = [-4262, 1015, 4155, -3093, -2268, 4199, -236, -3457, 2515, 1798, -3659, 403, 3809, -2606, -2755, 4217, 404, -4400, 1924, 2732, -3496, -470, 3540, -1926, -2654, 3560, 827, -4387, 1479, 3656, -3351, -1424, 4030, -963, -3009, 2955, 1330, -3718, 946, 3600, -2917, -2143, 4161, -213, -3880, 2388, 1989, -3484, 210, 3276, -2357, -2260, 3647, 318, -4178, 1873, 3007, -3462, -794, 3555, -1555, -2369, 3151, 683, -3692, 1466, 3347, -3143, -1582, 3997, -669, -3098, 2610, 1277, -3287, 936, 2992, -2647, -1823, 3775, -85, -3805, 2063, 2293, -3333, -130, 3011, -2068, -1888, 3195, 181, -3629, 1665, 2887, -3179, -1007, 3664, -1068, -2525, 2737, 713, -3056, 1304, 2663, -2796, -1353, 3756, -518, -3378, 2284, 1763, -3138, 355, 2519, -2172, -1347, 3154, -349, -3423, 2010, 2582, -3247, -775, 3214, -1310]
1820a310n64M450k510k898M568P34n500K025M730m449k226N276j138l946L657
1835H99J312m556J364M215l919k595N503j82n305L030L101m528J13M107k765k410
1851b616M537P3n193K627M243m838j486N154j567l440L586P64m271J955L727m355
1867a100j997N670p67n115L406K404m280O66L532l173j783M733m58n155L182L629
1883C394m911p17M728k103k764L828J00m165K524L280m625j215N532j666m372
1898c152L813J592m148J152L095l350j188M672j444m491L820K836n121Q9M242
1913B417k491j941L591n66l619L031K612m908m07N327k303l536L712Q67l607J645
1929a76K428l614m33M482j879m057M055J847m678Q53L439k750j358L480r25l225
$$ y = [-1310, -1874, 2576, 66, -2832, 1736, 2470, -3030, -1005, 3725, -724, -2950, 2326, 1188, -2758, 899, 2211, -2345, -981, 3234, -685, -3280, 2223, 2041, -3264, -234, 2867, -1661, -1548, 2559, -206, -2616, 1921, 1994, -3199, -572, 3671, -1167, -2653, 2501, 934, -2506, 1080, 1844, -2427, -472, 3255, -1100, -3097, 2573, 1806, -3309, 97, 2501, -1779, -1113, 2419, -754, -2537, 2196, 1738, -3417, -235, 3394, -1517, -2234, 2494, 391, -2373, 1455, 1555, -2610, -86, 3194, -1431, -2646, 2886, 1220, -3152, 661, 2253, -1895, -743, 2352, -998, -2186, 2486, 1042, -3449, 371, 3207, -1914, -1825, 2417, -74, -2015, 1576, 1010, -2609, 422, 3034, -1874, -2281, 3046, 743, -2793, 919, 1786, -1821, -176, 2252, -1362, -1795, 2687, 808, -3249, 806, 2653, -2025, -1172, 2267, -483, -1841, 1639, 714, -2511]
1945b511L187J902m671L34M682k720k751L732K35l306J947J951l376j1M036k344
1961C16l296M196J067m323J144L026k733r25L245j198l026L358J494m587Q67M054
1977B679k854k109L568j71l026K109J758l473K22L951k637k710M096M55l985J712
1993d15K549k929o22L249j497k675L380R18m296J436L555l249j487L569o17k813
2009a944K306J409l480O85L563k911k057M132k56l595K034K143l028k30L186j849
2025A08k335L551L26l959J973K742l280r07L407r97k684K582J122l426J055L133
2041B411l162j307L912q05l177K368J649l072J05L021k133j898L622l05l482K389
2057A36K078l283l15L221j453k315K757O70l368J441K623l190p19L563j268k731
$$ y = [-2511, 676, 2578, -2093, -1759, 2923, 203, -2548, 1184, 1419, -1887, 60, 2011, -1365, -1376, 2660, 316, -2980, 1216, 2283, -2040, -896, 2130, -603, -1528, 1717, 519, -2507, 851, 2345, -2242, -1375, 2679, -175, -2284, 1284, 1113, -1913, 196, 1954, -1519, -1297, 2654, 17, -2693, 1403, 1858, -2127, -415, 2134, -795, -1417, 1832, 335, -2340, 1040, 1958, -2338, -902, 2653, -596, -2083, 1486, 869, -1944, 362, 1771, -1709, -1024, 2539, -372, -2429, 1703, 1447, -2148, -114, 2029, -999, -1229, 1957, 108, -2227, 1324, 1650, -2309, -336, 2406, -874, -1781, 1626, 629, -2055, 527, 1649, -1777, -722, 2411, -751, -2058, 1854, 1049, -2128, 240, 1889, -1183, -1078, 1943, -190, -2088, 1534, 1229, -2253, 136, 2214, -1069, -1384, 1837, 384, -1931, 826, 1496, -1872, -431, 2192, -998, -1717, 1846, 578, -2153]
2073b153K680J196l118M88K801k261j410L430p43l039K501J543l224J59L012j684
2089A78k063K890K83l109J802J967l139q4L100j588k248K722Q18l103R11K602
2105A939k502j016L208j160k376K586R03l067O22K813j990j687K922j06k830J952
2121B11J501k930L09K704j839j805K819L71l027J212K295k539n44K813j373j938
2137a760K590M53k841R39K502k161j408K923m00k552K105J005k690P20K356k035
2153b54j395K758J22k968J428K038k624j43K565j592j480K491J54k725J195K294
2169A864k402j058L026q18k251K173O03k530J036K020k115j139K921k93k765J763
2185C5J546k597K79K256j795j088K532k40k599J476J993k644n59K871j234j777
$$ y = [-2153, 527, 1723, -1395, -907, 1894, -367, -1777, 1653, 910, -2129, 372, 1915, -1309, -1150, 1862, 178, -1885, 1005, 1288, -1821, -19, 1948, -1191, -1275, 1825, 237, -2011, 711, 1529, -1574, -663, 1939, -563, -1579, 1629, 469, -1907, 679, 1582, -1485, -863, 1950, -40, -1727, 1195, 1089, -1741, 211, 1712, -1218, -909, 1795, -44, -1849, 970, 1341, -1686, -474, 1821, -718, -1262, 1551, 178, -1760, 830, 1283, -1558, -619, 1883, -278, -1686, 1237, 837, -1715, 390, 1395, -1295, -575, 1781, -254, -1649, 1109, 1231, -1737, -309, 1729, -895, -1038, 1527, -65, -1545, 946, 1100, -1625, -430, 1864, -538, -1596, 1430, 612, -1639, 534, 1137, -1393, -357, 1663, -452, -1591, 1330, 1037, -1728, 35, 1581, -1016, -737, 1519, -276, -1364, 1168, 928, -1671, -195, 1798, -846, -1405, 1466, 232, -1545]
2201a545K283J88k421J344J781k364o51K789o50k523K042J137k539O65J969j953
2217d48p68K519o38k314J771J594k696j14K595j456j411K228j91k112J519J399
2233A477k384k61K589r66k091K185N65k321R86J566j949m00K267p46k093J914
2249C38J200k631L68K117j603r31K137m92j858J501J221k354m9K495j302j693
2265a536K172K49k118J142J269j896k13K210r48j909K053Q03k429O88J858j759
2281c64o23K025o29j706J634R28k297K50K265j479j352K152j78j850J342R99j992
2298h75P6K078j093j681K110M19k285R88J524j836k86J974q38j525J752P38k318
2315a078M30K034j641q83K094m93j644J473P22j920K31K037j420j401K255L3k042
$$ y = [-1545, 738, 926, -1495, -151, 1630, -734, -1385, 1404, 754, -1769, 273, 1410, -1129, -464, 1505, -448, -1216, 1303, 665, -1649, 122, 1716, -980, -1094, 1501, 45, -1366, 862, 671, -1441, 78, 1477, -907, -1168, 1421, 455, -1636, 549, 1114, -1207, -221, 1345, -604, -1004, 1263, 517, -1576, 338, 1538, -1093, -725, 1392, -211, -1142, 995, 503, -1355, 146, 1367, -987, -1036, 1459, 157, -1536, 636, 885, -1233, -91, 1178, -718, -931, 1279, 331, -1578, 475, 1278, -1151, -463, 1395, -364, -987, 1038, 409, -1297, 337, 1265, -1032, -782, 1483, 4, -1348, 804, 626, -1224, 118, 1117, -875, -799, 1279, 186, -1495, 615, 1034, -1251, -263, 1261, -575, -861, 1113, 275, -1250, 502, 1240, -1078, -648, 1386, -255, -1138, 956, 463, -1181, 292, 1014, -906, -675, 1362, -58, -1459, 796, 829, -1213]
2332a213J217J115j888J06J837j076j364J831N11k268P33J791j765m55J897p31
2348B78j426J649M96k070M89J902j488j092K028k10j725J372P64j799L04J719
2364A191j261j242K002K25k070R15J391j717q4J688r83j098J632L95k040O49J709
2381A302j546q19J954m74j465J420M23j755N32J583j350j013J995J7j997J117
2397g6J063j613J51J440j111q44J671J74j974Q81J571j678m80J738p44j102J483
2414E50J46j679P95J396j555q21K029l06j602J177O81j514M12J203j179o80J729
2431G82q8j788R68J284j639j99J577q67q75J432Nj565Q60J303j632n20J898n07
2449D29j420J243M59j446N59J051j257m66J673k54j736J181J084j680m0J451r41
$$ y = [-1213, 4, 1119, -769, -663, 1174, 98, -1266, 565, 1076, -1192, -459, 1332, -433, -888, 1009, 278, -1148, 501, 997, -1073, -584, 1318, -170, -1262, 766, 556, -1169, 203, 967, -832, -528, 1191, -70, -1312, 690, 915, -1155, -240, 1151, -566, -650, 1038, 55, -1043, 589, 984, -1056, -407, 1302, -244, -1063, 891, 417, -1048, 372, 795, -960, -428, 1155, -195, -1208, 787, 804, -1193, -76, 987, -626, -475, 965, -146, -990, 681, 855, -1119, -238, 1333, -345, -825, 913, 169, -933, 550, 696, -983, -188, 1208, -347, -1168, 861, 555, -1047, 130, 811, -703, -291, 912, -267, -947, 782, 694, -1094, -126, 1158, -481, -680, 897, 30, -845, 587, 592, -973, -113, 1190, -442, -962, 936, 429, -991, 252, 711, -735, -176, 875, -382, -848, 825, 571, -1165, 16, 1100, -580, -620, 831, -110]
2466a10n58J395k68j490J068J171j744l24J810o26j225J261K49j350P15R26j382
2483d82k67J670m43j679J358P20j561K52J234j026m19J336l89j322J236P98j656
2500f40m1J708q52j072J360Kj142P84P55j408j16J685p91j327J490L78j447M49
2518b25Q69r99j55J232n76j148J257O78j715K72J376r12o72J220j50j054R43N52
2536G93j410J27J507r46j078J492J92j344N70P86j076k6J143o44j021J297M17
2553G79j574L78J256r89n25J164k92r05R25M79j364K40J357r62q92J463l2j167
2571f61O45O51r93j0J127p62r35J449J83j449M92J045j065l28J198m34q34Q97
2589B16L91j349M55J135j067n55J340j79j072Q25M07r98J65J006p66p44J397k9
$$ y = [-110, -668, 727, 459, -1031, 37, 1208, -536, -860, 950, 324, -901, 360, 609, -741, -26, 900, -482, -749, 921, 478, -1201, 157, 877, -684, -432, 802, -224, -643, 693, 304, -1018, 218, 1016, -640, -681, 1027, 175, -897, 463, 465, -677, 107, 862, -546, -662, 1023, 232, -1095, 395, 773, -674, -225, 644, -355, -510, 722, 146, -1002, 255, 933, -782, -510, 866, -46, -718, 502, 352, -702, 241, 793, -617, -490, 1017, 71, -1007, 485, 677, -667, -97, 689, -387, -413, 730, 86, -935, 362, 779, -795, -417, 839, -150, -675, 489, 197, -708, 217, 696, -668, -428, 929, -33, -925, 538, 506, -661, -16, 635, -358, -368, 759, -3, -938, 511, 694, -755, -263, 782, -283, -611, 587, 153, -681, 216, 607, -742, -287, 848, -219, -774, 566, 387, -685, 140, 547, -451, -286, 720, -46, -790, 607, 578]
2607E78j334O96P71j000j47J056n52p51J034J88j292O01R46j088l83J290l75r38
2625g00Q47M29j074K12J005q97m43J268k67j122Q17O07j101R3R07o05n66R90L1
2644D31j165O99P57j163r3J153n03p84Q44K97j013K99Q97q89l22J189l82r92R39
2663A99L99j058J59R56o57n74J058j28j093Q53N96j198N2J065n92o78Q98J74j015
2682e84M60P08r57j35J144n54p93R38K92j052L19Q08o64m80J049k01r89R32L39
2701E80j101K58R38p86n03R99j7r15M82O32r61O0R96o66o11R39R6r30L10P96q31
2722b35k60R70l48p02Q92J16r79L61P91p40m27R88j47q24O15M66r92K66P54o52
2742h7m72R00K8r44M72O86q26k15R19m30o01Q65Q5q68M15O47p09l79R50j59q38
$$ y = [578, -756, -60, 711, -289, -436, 620, 68, -683, 351, 539, -753, -152, 794, -294, -677, 613, 238, -700, 147, 576, -498, -286, 719, -178, -621, 647, 380, -742, 75, 682, -419, -326, 581, -24, -590, 400, 431, -734, -35, 722, -441, -534, 619, 116, -668, 176, 473, -540, -241, 656, -233, -555, 634, 252, -740, 199, 598, -460, -301, 655, -2, -576, 482, 354, -739, 114, 710, -488, -436, 629, 37, -641, 257, 431, -584, -124, 584, -373, -508, 636, 82, -711, 227, 519, -533, -214, 594, -70, -550, 499, 298, -691, 241, 580, -521, -263, 675, -111, -614, 385, 368, -547, -65, 567, -394, -334, 662, -4, -615, 324, 420, -510, -200, 596, -235, -495, 475, 127, -575, 317, 433, -546, -185, 606, -134, -561, 427, 280, -544, 71, 537, -455, -189, 565, -87, -559, 341, 369, -575, -103, 583, -243, -458, 461, 31, -570, 295, 380, -488, -73, 574, -135, -514, 436, 277, -561]
2763e61P31L33r25L21O74p01l25Q77j03q94M96O20q15n5Q44n94m29Q65q3q59O29
2784D6N33p95k25R53l65p10P99Q0p63M52N44p98j55R01l01p33N94M64q86J21P70
2805E26o78k43Q47k62o90N10M93q11q6Q79n08m94P54N3p64N27M15q17m6Q99l28
2826A76o89O74L09q85K86O48p21r8P11k94o36O05M35r02M7P91m74m69Q04j33o83
2847d98N82L22p68P1P65l77o24P43K08q43M12M13o12p0O62l05o42O97L33q74J58
2868b47P38n98k70P21k85n11N38L01p46O8P53m75m82P53ko52M53L29o74L8P06
2889D56l87n22N96K81p97K11O57o28j86O73k71m46N32K30p94J44O71m46m29P20
2909B65n0o23M88K19o74J68O04l91m96P71N6p31K95M64n92%O33l79m29O02K06
$$ y = [-561, 170, 503, -422, -101, 573, -128, -453, 424, 321, -573, -77, 543, -272, -327, 517, -77, -506, 359, 276, -583, 46, 579, -216, -441, 512, 147, -563, 236, 316, -447, 5, 549, -249, -404, 497, 196, -537, 57, 521, -365, -244, 526, -152, -395, 452, 190, -500, 10, 503, -308, -394, 485, -23, -517, 237, 290, -474, 53, 468, -349, -395, 504, 176, -513, 161, 470, -415, -129, 519, -202, -300, 411, 117, -519, 86, 521, -381, -334, 457, -17, -486, 318, 185, -498, 84, 406, -362, -291, 474, 97, -527, 216, 424, -419, -7, 406, -206, -276, 386, 81, -561, 136, 469, -405, -247, 491, -107, -377, 344, 59, -452, 86, 387, -359, -291, 462, -13, -495, 258, 256, -396, 57, 386, -288, -250, 456, 69, -453, 143, 424, -373, -162, 495, -133, -319, 354, 83, -363, 169, 399, -395, -251, 420, -26, -455, 265, 215, -408, 80, 299, -375, -207, 397, 6, -490, 281, 337, -394, -99, 365, -227, -227, 406, 27, -402, 200, 406]
2930D06p96K47O20n69k83O37j51m99N12J32o02J61O04m45l99O57P1p18M29L20
2950C34n82J15M74l55l32O19Ro54K88N44o26j56O42k39m35N59P2o51K92N09n30
2971a03l15P12p6n87M60J89n67K00M31m35k70P10q9p17M45M71o28j10N77l81k62
2992c45N77o3n15K77M59m83l02P36j79m85M34N6m76L03L26m81j76O37j26n99M00
3013b5M28o19L3M98l78j53N46j54n39L39M68o14j32O51k47l94M05J00m89K91K60
3034B75m06k25N87r8m80M20K02n19R6L79l25j57M71j18n01M13L99o18l7O26l51
3055C3k88M58k4m61L32K24m51j25N89j68n29N17J89n85K28L14m51m9N09j46m92
3076c76M52K50n91K5N43l11k59M47q8l92L92K09n11kN81l05m24M68P4m38K36K48
$$ y = [406, -390, -143, 477, -92, -375, 262, 111, -388, 124, 256, -346, -185, 419, -26, -425, 232, 303, -415, 14, 334, -248, -133, 341, -14, -346, 273, 282, -372, -84, 460, -166, -322, 320, 81, -354, 205, 277, -374, -82, 427, -103, -418, 294, 218, -369, 91, 280, -287, -87, 344, -91, -361, 349, 260, -457, -12, 459, -169, -279, 298, -83, -345, 232, 169, -346, -69, 390, -93, -395, 341, 162, -323, 111, 167, -309, -6, 320, -161, -337, 300, 174, -425, -25, 403, -216, -183, 315, -63, -216, 330, 176, -363, -24, 444, -170, -302, 349, 102, -292, 113, 213, -276, 15, 275, -131, -356, 231, 133, -347, 73, 275, -244, -148, 231, -94, -251, 220, 102, -399, 14, 413, -205, -242, 384, 33, -255, 203, 179, -282, 50, 274, -177, -302, 287, 119, -410, 107, 296, -289, -61, 253, -198, -247, 262, 116, -376, 76, 326, -265, -240, 303, -8, -267, 180, 92, -300, 92, 301, -210, -212, 369, 64, -360, 108, 182, -256, -20, 228]
3098B28m13J7M40k45m00M91J94n84J34M44l76r2L69j63k84L58J19m59O9N41m17
3119b9l51N88q4l33K47J58m15M5M63k88k97M39R6m92J83L68m15r2M46k15k45K84
3141F1K07n88K11M55l94k48N52j54k84K49J68l78kM52l33l34N62M5n64K93K84
3162B60l75NL00k33k55M17J15n65J98L94l73j94N20j88k81L42N5l12R0M49m61
3183i2k02N37p0m73L38J73l39j0L93k94k23M50K5n20K65L50n08L8L40j72j92K55
3205F9Q5l79J68L59m12j23M84j12l57K77J67l18l2L26k19k09M43q0m15L12K37
3226B71m23K0K83j18k69K84R5l58J83K73m21mM54k21k96K84J53l67Q9K73k35j27
3248a77L88m5m07L06J38l83j0M09k03j93L14j0l13J78K32l71J3L71k42k46L50
$$ y = [228, -185, -168, 272, 27, -373, 118, 312, -272, -138, 306, -70, -162, 207, 44, -240, 118, 237, -222, -153, 388, -29, -380, 208, 124, -209, 38, 196, -219, -174, 289, 1, -296, 143, 239, -253, -70, 298, -117, -209, 237, 22, -223, 61, 268, -320, -109, 346, -48, -296, 256, 102, -182, 67, 235, -143, -145, 307, -26, -360, 202, 247, -317, -24, 260, -115, -110, 190, -43, -298, 119, 234, -331, -133, 261, -112, -306, 214, 26, -255, 87, 142, -170, -80, 369, -92, -294, 243, 173, -300, 38, 211, -128, -138, 255, -39, -262, 188, 213, -307, -42, 308, -200, -162, 178, 6, -186, 69, 154, -225, -57, 302, -110, -233, 251, 139, -218, 59, 226, -92, -124, 202, -17, -226, 217, 137, -278, 34, 271, -152, -132, 151, 33, -236, 48, 143, -215, -32, 241, -180, -184, 270, 49, -247, 37, 190, -177, -88, 185, -50, -177, 211, 166, -241, 65, 203, -180, -190, 219, 16, -177, 137, 127, -186, -8, 224, -147, -134, 237, -5, -251, 99]
3269I9O5k93O9L20l40j19M71k42k90M16L2l22N3L08j93k18L12M1l94L04J44m48
3291b25N2M03k46k04L39j6k85J53K60l36J0L18k71k07L92J3l23J46K58k51j22
3312a42K80q3l06L25J12l80J98K34k89j40L05j8l25K05K30l52nL70k82j57L53
3333A33k0l35K58J12k16n4K56n9k53K97J9l38J66K72k67j42K71j4k70K32J69l58
3355a41M9L15k52k32M31rl96K25J79k63m1L70k21j76L51n2k97J57J92k69j00L12
3377A32o6k55K19J25l09J31K10k74n2K91r0k69K25J71k85%K60k42p9L23p7k91
3399b02K48P5j46q8K48l4k62K17K9k94K43J77l26j7L57j92k21K02J48k92Q9K39
3421A98l22k2K91j34k62K77J90l55l0L78j01k82K13P7k75J82R3j95l8L44j44k63
$$ y = [99, 164, -129, -60, 260, -80, -199, 272, 30, -260, 156, 188, -134, -81, 227, 34, -184, 128, 169, -225, 79, 223, -225, -173, 230, -16, -220, 119, 103, -182, -29, 231, -105, -95, 223, -48, -255, 137, 150, -173, -27, 231, -20, -142, 138, 55, -251, 74, 186, -194, 4, 238, -51, -191, 114, 96, -229, -24, 206, -146, -151, 219, -63, -220, 133, 113, -222, 36, 148, -68, -122, 134, 75, -178, 119, 138, -200, -34, 238, -29, -171, 100, 86, -184, 48, 217, -141, -92, 223, -29, -261, 170, 161, -235, -10, 169, -94, -135, 235, 14, -162, 189, 137, -160, -3, 189, -80, -180, 132, 66, -189, 30, 155, -154, -23, 187, -87, -139, 152, 62, -207, 18, 189, -96, -96, 164, -78, -157, 166, 89, -202, 46, 121, -25, -113, 135, 101, -161, 56, 85, -209, 34, 211, -115, -132, 225, 33, -188, 14, 162, -130, -41, 198, -124, -146, 145, 11, -251, 26, 216, -139, -169, 209, 108, -174, 39, 116, -159, 23, 116, -79, -117, 227, 83, -180]
3443a80K40J00k46K8J77j93n4L27j97j86K52J30l20j0K76j64j70K53j1k18K80
3464A14J1k29J4K69k16j42K48J13k77P4K01l27R3K68k06j63K05J43l38Q6K39k14
3486c4j14K45r0k01K68R8l40J11K43j80k29K72O9l35K39J20k64N6K15j58j62K64
3508I3k6j92P4K10k20p6K20q5j38K65l2k50J23J98k38n9K27J2k07J01J18k77J37
3531b2J98k37j01K84j7k47J20K21l10N4K09j70j09K07kk32J18J96k14p9K55n0
3553G2k07J56O4k11J19J91k63j05L19m3k14Q2J62k29P1K38k54p1K50k3k65J48
3575a3J91k00p0J77o8q7J17j1j80J61J24j78j26L03j02k05J72J20k30J24O9j64
3597g6m4K23l3k21J33J92k66J1J94j21j25K38m8j85J64J35k38n9K85q4k63K12
$$ y = [-180, 60, 160, -86, -58, 119, -74, -128, 199, 2, -184, 68, 198, -122, -132, 144, -20, -190, 63, 52, -166, 114, 125, -104, -90, 179, -37, -179, 69, 182, -95, -21, 180, -147, -54, 214, 8, -155, 50, 193, -145, -59, 180, -34, -148, 97, 7, -194, 74, 172, -168, -57, 186, 6, -223, 49, 118, -217, 22, 142, -122, -66, 149, -9, -171, 93, 67, -125, -51, 159, -61, -137, 83, -2, -140, 125, 93, -157, -34, 164, -74, -133, 94, 106, -101, 0, 118, -159, -22, 176, -61, -162, 122, 105, -142, -22, 199, -111, -57, 152, -18, -127, 80, 78, -154, -36, 160, -54, -133, 122, 72, -135, 21, 85, -126, -7, 184, -79, -184, 135, 92, -122, -40, 122, -107, -36, 202, -52, -123, 127, 104, -161, -13, 178, -22, -92, 85, 17, -70, 47, 36, -144, 17, 141, -37, -163, 140, 38, -167, 5, 125, -105, 19, 88, -76, -120, 103, 70, -151, -18, 174, -92, -81, 113, -8, -133, 105, 57, -128, 36, 171, -67, -126, 159, 75, -188, 24]
3619B4O3k38J24J13j22p4K39o0k23J64J44k54KK15j36r2K01j00j07J63O7k69J6
3642a40L28j35k18J88N8j40K1J42j87k1K51o9k62K00J43k49jK55k19l4J77j27
3664c9n8J65P6k47k6K43j47r7K03J7j94J28N1j96J4K83k31j03K73nk47R6J31j78
3688h8nJ83p8j15J60R0k59M0K20j84p3K14o7j36J18J03k15j2K55j12j62K33Mk18
3712a04R1J02j91R3Q3j05q9J84L1k46Q3K46k08j41K83j09j14J75L7k16N2K29k27
3735f1p5J88L5j90J21N3j19k6J27m2j57K13O8l29J54K22k36%J33j11q6J52R2k79
3759a53J33J41j79n3J99n1j71J85k1q9J9J50j23q4J98pk20J08J10j16k9J34r1
3782a0j02J40L2j53Q1J69k35l0K30p5j71J46M7j52J13P5j25o2J79k9k44J71J40
$$ y = [24, 87, -151, -27, 86, -36, -110, 129, 69, -154, 10, 154, -100, -98, 117, -19, -111, 90, -10, -117, 46, 113, -156, -140, 188, 53, -165, 23, 81, -59, -38, 104, -83, -104, 147, 78, -184, 16, 159, -90, -91, 164, -55, -89, 88, -39, -97, 68, 144, -103, -129, 114, -33, -130, 73, 90, -104, 24, 75, -121, -107, 176, -55, -158, 115, 110, -137, -41, 90, -88, -93, 90, 12, -103, 57, 147, -112, -72, 148, -36, -109, 105, 38, -98, 20, 123, -92, -104, 151, 39, -123, 110, 114, -104, -13, 89, -102, -9, 74, -31, -120, 64, 95, -151, -68, 178, -30, -171, 112, 3, -111, 64, 101, -115, -63, 166, -61, -136, 52, 87, -103, 18, 71, -48, -74, 53, 11, -146, 67, 135, -194, -40, 182, -54, -54, 79, -32, -118, 34, 126, -153, -20, 121, -58, -111, 88, 37, -134, 51, 30, -59, -40, 110, -13, -97, 101, 94, -126, -18, 92, -24, -53, 81, -10, -112, 28, 60, -93, -12, 157, -78, -108, 122, 47, -124, 22, 69, -83, 30, 105, -20, -82, 97, 68, -176, -5, 135]
3805A35j59p0K13j24j02J35nj28J17Q6j98K7J64r7q1J25Kj48J33Q2j76j3K09q4
3829D3j79K20K3k05P3J63j05p7J35q0j71J58J31j85%J80j32r4R2P6j59O1R8j43
3853g7L9K17k08j32K09R5k05L9J17j83L5J68r2j63K22J3k00O6J05n4p6J25k2j04
3877f6R2M3j98O3J19r6p5J68l2j29R9R0p2k7J06n1j51J91nk10J24J75j52j03J76
3902G9K1j93N5J26j69N5J74j78j10K14oj35K9J26j83L8J49j07j33K32m5j47J08
3925@P5q4p6J58kj27J35m4j45N2J61j62p3K21k0k13J24N9r8LJ37j09o0J80r7r2
3951i7J34R1j62L2R3n6r9O5J17j69J19Q6j81l6J34k0j27J01O5j80M8J38j17l3
3975e4Q8%j46J20O5q9l5R0k9j22J26J9j55J31R5j74rJ75p9p7Q7O3j86N7J44k08
$$ y = [135, -24, -94, 119, -5, -107, 28, 23, -105, 12, 98, -100, -73, 91, -6, -87, 38, 40, -108, 25, 107, -69, -82, 127, 43, -136, 84, 107, -98, -25, 138, 33, -44, 91, 11, -160, -2, 129, -56, -56, 124, -8, -102, -10, 66, -93, -32, 66, -77, -38, 179, -29, -161, 48, 143, -62, -23, 94, -89, -54, 114, 22, -141, 81, 94, -106, -40, 65, 11, -65, 60, 38, -66, 26, 69, -129, -66, 53, -43, -118, 50, 18, -111, -12, 78, 6, -21, 85, 34, -117, 74, 69, -141, -17, 158, 6, -97, 79, 100, -93, -38, 88, -81, -26, 148, -30, -140, 74, 68, -67, -38, 88, -95, -57, 92, -15, -148, 84, 39, -108, 0, 75, -9, -85, 73, 71, -56, 79, 35, -110, -58, 103, -59, -132, 89, 69, -144, -20, 39, -59, -56, 81, -28, -88, 92, -5, -97, 37, 128, -34, -2, 91, 35, -64, 1, 118, -51, 68, 154, -27, -63, 71, 51, -76, 25, 90, -90, -42, 96, -21, -54, 34, 34, -112, 8, 73, -16, -51, 39, 10, -112, 14, 33, -122, 9, 104, -70, -79, 96, 17, -60, 27, 90, -96, -39, 105, -103]
4001a03K7J14k2j16J08M5q1p0J67j35l0J88p3j14J40M0j18p6J99p5j37J77Mj22
4025f3M4J29j42j4J49j18p0J52Pj31K4J04q9l7J13q4j10K17K1j59K5Q2p1k8J31
4050H2lj04N9M0j66O4J99j74p5R9P5j34NJ26j74%K28j33o1Q9O0j91jJ73r3j06
4076a16K07m2j31J38rj09L3Q1r2L2L6L7j56O6J02j40Q5R1q4p4P7P5j56LJ06q3
4102b3n2R8N6j30M1L0j22O0J00m4n0J19m0r7P7L6j31N5R8o3r5J12Ko0J1P1j10
4129e1q5K35p4j27J10L8j41N5J53j26l9J15pj43N8M3q5M2J32j22o6J44o3j09R8
4154a5J01j05k0P3Oj39J23%r6P8N8j57jJ48J7j14M6K9j21L8J12j19JJ28k4j26
4180g9L5R4p6L0J13j30m0O9j8o4Q8O8j46p5K22p2o1R5j5j20N1N6o3l1J13l5p2
$$ y = [-103, -76, 38, 16, -100, 8, 53, -28, -98, 69, -66, -96, 92, 19, -95, 45, 85, -33, -109, 90, 15, -122, 55, 59, -63, -19, 110, -32, -46, 103, -15, -85, 67, 74, -57, -33, 71, -18, -55, 58, -26, -136, 81, 102, -57, -32, 50, -21, -49, 82, 79, -25, 34, 74, -92, -28, 171, -3, -78, 21, 96, -38, -33, 93, -81, -81, 147, 14, -47, 42, 102, -89, -90, 83, -10, -116, 91, 49, -82, 56, 47, -62, -29, 52, -40, -8, 28, 65, -91, -25, 77, -63, 22, 113, 29, -45, 32, 107, -49, -46, 60, -23, -75, 23, 79, -51, -10, 20, -102, -42, 58, 14, -36, 83, 43, -54, 23, 59, -72, -17, 81, 18, -77, 35, 37, -23, -12, 59, -51, -136, 99, 25, -102, 8, 46, -95, -40, 113, -13, -52, 63, 56, -87, -29, 14, -71, -29, 103, -19, -85, 59, -4, -113, -15, 86, -19, -39, 34, 40, -99, 24, 24, -72, 6, 64, -93, -94, 54, 71, -43, 3, 32, -89, -51, 61, -58, -57, 71, 47, -79, -44, 50, -26, 4, 117, -13, -53, 16, -2, -66, 22, 90, -56, -131, 91, 19, -42, 53, 38, -82, -31, 25, -38, -69, 44, 9, -63]
4207f3P8Q5j53j7J13m9k9R6k8j12J02J20j47o3J22o5l6P8J9j32J34K1j37N8Q3
4232G8r7o1M8P6j44J16K4r8L9M1j8j14R6R6j51N8Q9o2j12J44Jr0P7J5p5m4J16
4259D8L1j22N4Lp9P6L1n1l5J22p1o8N9P8j48P3J01q3j09J81q8k9P3M2j22L3J23
4286A23j48j09J07J7n6O3L5p0N5K8j06J3L0J00j31Q0O1j09o8J37r9J4L5m4k6P5
4312GQ2n2j16J32n0n4R3k0m5k6R1p2r1J54J6j64R3L7r4N1K1%o7Q9L8j23Q5N4r2
4341b3n9Q1J8o3J26k9j03Q7j6j2o2J21rj44J34K0j72O0Q6j6o7Q0k1j19R5M5o9
4368c1PP2m1p5P4J4l7mN1n0J0O3qo4nN8n8j0Q3n8k0P0k6n8J8R9r9K4M6m6p3J16
4400D2l0q3L4R8l9j04J68p4m5P9kj08L2M7m8k4J12j9j29J37L5j20rJ45r8o8R3
$$ y = [-63, 15, 100, -53, -70, 43, -6, -35, 61, 33, -79, 23, 143, -4, -67, 55, -10, -46, 32, 51, -81, 53, 74, -63, -5, 78, -19, -80, -32, 44, -100, 16, 40, -58, -19, 22, 4, -110, -14, 82, -69, -11, 78, 16, -96, 48, 49, -41, 36, 51, -24, -68, 48, 79, -43, 11, 14, -65, 11, 42, -9, -44, 78, 7, -61, -2, 76, -72, 1, 102, 19, -90, 91, 3, -26, 47, 89, -33, 0, 123, -25, -134, -27, -10, -66, -3, 32, -38, 17, 45, -61, -48, -18, 82, -49, 31, 92, -17, -85, 52, -47, -33, 2, -42, -68, 7, 89, 37, -79, 53, 3, -51, 42, 22, -23, -49, 42, -30, -121, 33, 49, -115, -22, 15, -79, -28, -7, -7, -74, 15, 53, -70, 15, 69, -23, -82, -1, 17, -46, 80, 51, -52, 35, 19, 7, -55, 66, 57, -87, 47, 67, -105, -45, 41, 25, -42, 38, 17, -102, -7, 38, -31, -24, 48, 7, -68, 6, 20, -17, -21, 30, -20, -10, 53, 45, -19, -24, 34, -24, -34, 49, -9, -29, 41, 15, -43, -25, 74, -25, -1, 45, -1, -74, 42, 12, -71, -37, 61, 22, -82, 86, 12, -33, 46, 44, -64, -32, 15, -33, -57, 55, 36, -93, 44, 79, -41, -50, 95, -3, -71, 22]
4427B2Pr6Q1Q1j30l9J33p9n3Q9M8j00J1L6l4MJ10Lj88J32M2j29P1K6p1k4R2Qj30
4456g7Q2J4o1KP3j6q4O4K7m1K9On5MR0l9l7J7L0n4j9N2k8M9J6k3q8J04K3j35M7
4487b8R4j33L2L5M0j05J1J07j24J7J04m9p7J41Jj69J20K4Km4P3m5l5M1L5o0k7
4514a9P6o2n0K2P0r9O6L0j4kP0j01m6J16Kr5O6L8o9o7Q9K2r7Q3K8j16M9Q9j39
4543f0j8J21m8j1rN0o5L9Q4j41j3Q9Rn3J6N7m5kj9J9m9P4Mp4J11j5m9J2J2k2j05
4574a01J23nm6M3K5j13P3K2n2J7m3J18j31O7O1p5l8J13k4r2P9oj7j9M7j0j3J4
4602A7J4n2O4K8q9k9Q2K1p6J7O2r9L7J09j10m7O0j6k5M2O2r5nM4K4n0N2J6j08
4631e0J9O1j03O2M1l5m0L3L8k3rL3m2mK7K0l9J4O5r7K5J0L0j01J09k2r9J85m6
$$ y = [22, 29, -67, 14, 95, -35, -74, 59, -20, -73, 16, 64, -36, -25, 11, -23, -19, 91, 94, -94, 38, 80, -49, 22, 48, -23, -47, 45, 53, -77, 5, 19, -42, -40, 33, 17, -67, -3, 24, -17, 12, 18, -37, -33, 57, 18, -19, -2, 28, -26, -45, 7, -21, 28, 44, 21, -67, 37, 60, -75, -28, 66, -67, -35, 0, 40, -65, -54, 53, -71, -54, 50, 1, -76, 65, 66, -103, 17, 41, 43, -1, 72, 27, -8, 33, 68, 8, -19, 57, -5, -55, -33, 37, -62, 4, 34, 20, 18, 88, -13, -59, 57, 59, -36, 30, 68, -1, -68, 21, 43, -54, 29, 57, -59, -10, 79, -60, -78, 43, -5, -16, -25, 25, -40, -1, 83, -58, -71, 18, 27, -26, -10, 47, 2, 0, -19, 0, -49, 25, 29, -45, 66, 51, 2, 14, 26, 4, -101, 22, 17, -29, 14, 39, -74, -1, 21, -31, -14, -57, 61, -70, -3, 58, -17, -55, 58, 34, -58, 21, 15, -2, -21, 26, 16, 3, 17, 31, -21, 43, 71, -18, -47, 35, 56, -20, -3, 59, -40, -3, 106, -4, -51, 9, -7, -32, 10, 72, -23, -28, 16, 40, -10, 42, 58, -50, -31, 30, -73, -11, 30, -5, -45, -12, 26, 3, -6, 27, -15, -19, 8, 28, -11, 3, 68, -29, -4, 6, 36, -65, 44, 22, -77, 108, 62]
4660F2m1l8O0N6q6M1k4j08K9M1k4n1O0N0j21R5M0q6K8Q5n8l2J2lj3N3j4l9RK5
4690HL4k6M6k8r9R4J3n5JK8om1j0J00q4j8Q3q1j3J25n6n7M8P0j07K8Jjq2R6J9
4721C0p4K8O5r0L5N9k4p9J16on3PM8n1j4O3r4P0J4l9p6N1O7k3l0J24o7j24J37
4750G0l3n6J2L1q4L0K5M1r8M5O7n0j0O6o9rL4Lq6O0N3n6l3N8l5j5P6k0n0N4L2
4781E3o6RO9j8j13R0j8n7N2M7o1KK8n7l9R6N8o7l7P5q0J5L5K0l5J5J8l4k9L9J1
4812B1r3P1l1L5l5L3pK6j2J7n4K0K8o5j0N7m2O0N9n6p3O3J10j21k9K1lm1L8M5
4842C2q9P2L7j12J1N5k5o9P9O3l5q5Q2l8J7M5K4j02R0Jj02j0J13p3J8KK4QK4q2
4872b5m1O3J5l4m1Q0lm0%K8l0J7O2m6m9K6N5p4L4O9j04KQ6J2r2N1j2mk2K6np2
$$ y = [62, 21, -17, 43, 99, 13, 54, 30, -78, -49, -8, -32, -83, -23, 27, -94, 1, 41, -45, -17, 68, 10, -22, -10, -13, -26, 27, 13, -26, -17, 8, 42, 16, 62, 34, -65, 29, 42, -13, -12, 16, 10, -31, -41, 59, -25, -43, 40, -41, -54, 71, 15, -42, 6, 76, -31, -3, -2, -3, -85, 11, 30, -44, -16, 49, -41, -6, 53, 29, -50, 66, 60, 7, 14, 62, 11, -3, 60, -34, 36, 50, 11, -65, -14, 53, 30, 0, 124, 57, -67, 70, 37, -19, -7, 24, -60, -30, -5, 36, -62, -17, 50, 0, -10, 56, -13, -22, 12, 15, -71, -11, 42, -14, -47, 11, -24, -39, 37, 17, -33, 21, 53, -13, -4, 65, 47, -66, 24, 6, -51, 1, 48, -13, -11, 17, -40, -79, 17, 75, 8, -29, 46, -34, -19, 16, 36, 1, 16, 34, 0, -29, 10, 21, -72, -1, -32, 3, -32, 1, -6, 20, 8, 25, -29, -9, 19, -46, -56, 1, -41, 19, 78, 22, -51, 12, 122, 1, -28, -7, -10, -51, -13, 32, -57, 15, 52, -60, -49, 6, -19, -88, -9, 54, 19, -66, 16, -22, -5, 40, 64, -38, 52, 53, -49, -59, 54, -19, -1, 1, 25, 33, 57, -25, -66, -3, 12, -22, -63, 17, 14, -26, -26, 2, -28, -11, 51, 5, -44, -18, 37, -37, -3, 66, -38, -36, 50, 62, -30, 21, 9, 5, -17, 9, 4, -68]
4904f8Q7K0o0L0J2l9j0J8j3n4J15j8j5QOpm0O2k1N2p6N7q4m0J29p6k4R0k3n6Q0
4935D2Rq1M1J5m3KN6j2o9j4Q1k8m5P3j5KL6r0O8l9J14j18JP7n7j05J07N7r6N5
4965B4O0j39K9M1l6j0JP5j24jO8NK0K3j5n4K5pk6jJ4M8m5K8M1m5K9L4p0k3M9m1
4997b3K3J4J2o7M9O5j19P0nj8MOJ1j01P6K3M2j24P3Jp6O0Q4j48O9L0l5j05J30
5026B1K2p4K2M6n7j4N9l3kM5J5r7L6J7j3m0M7J4m0rJ11j35J7P0l7l3P5Nr8O7O4
5057G1o6j8K1k8l4N6%jm0MJ1l5N0K0p6O9O4r0lM4j8j7O0n0lj2O3l6l7P9k3n4%
5090b9N5n2L2N7o0K5ol5mk0Q3m5K0J9j33N1O2j7k8KN5j9n4J01p7qL8Qm8L6O0m3
5122B6l0O9o5m0N2K6j6k5O2p2kP7q7J9J3N9o6K2O3n5j02N1O6j04N9M9l2m4L3m0
$$ y = [-68, 19, 39, -21, 9, 21, -18, -28, -10, -23, -77, 38, 20, 5, 13, 19, 12, -28, 34, 13, 65, -11, 46, -38, -78, 51, -25, -49, 41, 18, -38, 42, 51, -30, 11, 26, -17, -15, 41, 29, -40, -54, 27, -1, -46, 27, 12, 14, 50, -40, 28, -11, 103, -15, -14, 63, 6, -99, 8, 65, -31, 24, 84, -55, -26, 15, -21, -31, -30, 45, -79, -80, -12, -7, 13, 36, 21, -33, -8, -15, -41, -42, -28, 20, -25, 3, 44, -1, 28, 62, -8, -31, 18, -23, 0, 14, 26, -41, 8, 73, -46, 24, 19, 1, 5, 11, 22, -79, -3, 20, 62, -62, 11, 12, -64, -4, 80, -68, 1, 31, -4, -109, 21, 43, -31, -9, 37, -20, -34, 25, -8, -10, 35, 50, -47, -11, 6, -7, -47, 0, 14, -26, -35, 76, -59, -42, 28, -9, -42, 33, 38, -60, 7, 71, 5, -13, 8, -20, -54, 2, 2, 1, -39, -35, -24, -59, -9, 11, -65, 4, 68, -22, -25, 19, 1, -16, 44, -6, -9, -21, 42, 6, -31, 48, 25, -29, -29, 26, -26, 6, 63, 3, 28, 22, -13, -17, -37, 46, 1, 21, 40, -93, -42, 20, 3, -25, -23, 32, 13, -41, 60, -17, -25, 13, 21, -27, 9, 69, 26, -4, 65, 0, -40, 12, 38, 22, -3, 59, -13, -15, 62, -25, -6, 7, 66, 0, 22, 85, 30, -72, -21, 45, -59, 0, 49, 17, -27, 6, -34]
5152c4J9J6L3q9P4J0o1O6m0J1j6N7ko9O4K2j03L3ql5N0J8N1p1j9N0lr1O6N7j02
5183d6K9M0k3o4M8L0l1Nj6J0OM0p0K5JK9n1K5M7n8l4J11j12K2R5Rj00K9L8p3L6
5214cL5j4m0N9j9k5J4M6n9K9oq1N7L0j2nk0P1j11N3pl2OM8Nj7j7ML3l9PK7k0j4
5248a7Q1q5L4Om2J9L2nm0K0K9l3k4M4l7k6L9N2p0J2K3k5nK5M1o9K2J7p4M0N6o0
5280b0%NRlmM2m7RM6k1o6O0oj00J52j1n8k9O5K0k7%pk5J7J8n1K9J3j9j1N3L1j06
5314d2jO1m5lJ8Jk0L2k1oj4N7m7QJM8l2kK0l5j8K2L7o2O5j6j6J7O6j1k8j3Om7
5348b0NK8j8k4K6j8n5J43n7m1M2mk0LOj1k9L3m5Q9o1O9l9pNM9n0k8L5k9k5O4j2
5381DnM9k1k0M8k0n0M4j9k6q1Q2j9J1M1J6l6qJ7o6L8K7k2m7O7j7Jj8P5j0m4L0
$$ y = [-34, -15, 1, 34, -55, 19, 29, -32, 34, -6, 5, -11, 46, 44, -25, 39, 61, -42, -9, -17, -52, -2, 16, 67, -4, -23, 27, 24, -67, -1, 56, -46, -17, 23, 0, -64, -16, 14, -17, -12, -28, -18, -12, 28, -42, -17, -16, 13, -38, -13, 34, -24, -58, 53, -59, -37, 58, 67, -33, -4, 34, -39, -3, 32, 18, -22, 37, 18, -7, 7, 53, -6, 23, 17, -64, -7, 23, 11, 6, -14, 57, -54, -1, -8, -40, -34, 14, 19, 2, -15, -11, 22, -17, -10, 17, -3, -17, 64, -21, 13, 19, -23, -4, 28, 23, -17, 3, 32, -1, -25, 19, -18, -44, -5, 47, -23, -11, 12, -13, -18, 7, 48, -21, 1, 18, -56, -16, 40, -20, -20, -15, -6, -9, -13, 29, -18, -9, 37, 16, -50, 10, 4, -96, 56, 45, -13, -42, 23, 43, 16, 16, 9, -16, 1, 19, -32, -3, 10, -9, -20, 33, 64, -42, -43, 18, -27, -30, -12, -11, -31, 1, -20, -26, -40, 17, -30, -22, -21, 27, -5, -7, 13, -22, -40, -18, 19, -43, 22, 6, -10, 7, 73, 62, 34, 21, 27, -20, -15, 13, -5, -29, -3, -21, -76, 67, 10, -31, 11, 7, -13, -10, -4, -15, -44, -11, -56, 33, -28, 41, 2, -5, 0, 49, -1, -29, 6, -23, -48, 16, 4, -1, 48, 27, 7, 55, 35, -15, 29, 10, -16, -97, -15, -34, -23, 18, 34, -2, -10, 7, -59, -21, 6, -16, -63, 4, -13, -12, -30, 45, 35, -9, 21]
5413B1L4n6l9R6J1j66J34lo2k7P3m8j7J13p0k9Q0m0n0L5L6k7lO0o3K0J3n8M6K7
5443D1j6Nj7k7lKL4Kj6oNL6q1L2N0j20R9j1jmJ0ln6NO4q2J10j7l7nJ5J0j1nj8
5478a6P3n1Pk5k5P7J8r8M2J5k9M0j8k9K3j7Mk5O4Kn7Q5j2k4l6L6k1m2O0Ml1k4
5510c0J02k9q6O2j0m1N4L9q1j8O0l1PN0L0q5PLOmj3qrL0K4nk4P6p9l0J8M8o1M7
5544A9K0n4oL2J9j12J77l3j11NP1ok6J5ro9M0P4o4k8P5nk9M5q5K9k0P4Nm5J9M
5576B1m1M6j2l1KL8j7l5M4m9k2J9M5n5O0p5Q5pl6J0L7j4Ok0l7J14q2l5M0O0p0
5607a1k0O6L3j24P1o1Q9k0k7k7oM5m3K2L9jo5N5k5K2oN0q9N7k4K7l4N8K5q3j5
5638b2R3l4r8M8Q1p9MK8Qn1M8j0n4L9N1j27P8J5k0J0k1Mm9K7O7j6m8P3kp7O4p0
$$ y = [21, 55, -1, -40, 56, 67, -99, 35, 32, -30, -57, 16, -32, -49, 64, -6, -35, 45, 5, -45, -10, 26, -1, -4, 56, -7, 13, 26, -32, 14, 41, 25, 30, 13, -14, -17, -15, 19, 21, 5, -1, 4, 40, -41, -9, 41, -79, 20, 9, 8, 4, 14, 11, -45, -40, 24, -58, 52, 35, -2, -7, 8, 18, 7, 2, -16, 57, 6, 13, -12, -37, 40, 58, -40, 2, 17, -12, 28, 10, -19, 4, -13, -9, -34, 30, 32, -25, 60, 48, 24, -12, 24, 3, -39, 21, 25, -6, -30, 72, 43, -43, 19, 9, -32, 22, 61, -20, -38, 22, -9, -2, 48, 78, -7, 0, 3, 9, 5, -8, -16, -25, 5, 29, 24, 0, 76, -3, -33, -15, 33, -28, 19, 39, -15, -21, 11, 30, -82, 95, 62, -49, -44, 27, 21, -5, 10, 1, -68, -28, 46, -18, -46, 29, 24, -5, 40, -45, -16, -36, 38, 43, -2, 17, 21, -20, 26, 14, -17, -15, 23, 6, -29, 15, -34, -56, -37, 8, -47, 13, -62, 23, 16, -20, -10, 27, 13, 19, -1, -38, 76, -6, -41, -1, 59, -11, -31, 35, 68, -56, 15, -46, 43, 23, -4, -31, -37, 8, -35, -13, 26, 25, -40, 15, -10, 12, 6, 56, -33, 24, 0, 27, -7, 51, 76, -7, -22, 71, 37, -61, -13, 68, -11, -7, 21, 29, -22, 26, 16, -38, 1, 52, -75, 3, 18, -2, 8, -13, -9, -58, -31, 36, 20, -28, 45, 43, -34, 30, -40]
5670d0jK9J3J8LK5l3j6J1ko4J20o9l6N8L8p0l9K9N1o4PR3q2j1L3jk1M1L6m4m7
5702c5MK0L6m5L8m4N7lm9j8P5p8N6o8P5q1N8j8L0l8P7m7m4O4N%J1j5l3J2J9R5
5734A16j29J8Q7r3QL6l6k0qP0n5M4k9p3M7j9L4kj3qJ6Nj5K4m7P5k9Mj0L4p1K5
5766a4mN4m9j7N1l7JR0r7NR5k0r4M3P9r1J6O4p0k6L7j5o1J5J08o3l7L8nj5K8K1
5798C0n5mN1o0K7Q4q6m4M4L5l5n8J11K1q6jpL1J1jo3J6O6L7j7m2l3J4L4l6L6J0
5830C0M2r3L2j1l5NN1n3j9K8l4L1K5l0K1k1MoN4k3K0p6P4m7j1k3M9R1p2l0N9n6
5862b4kk8J16p5l0J07n9j8pLL2n1N2j7j9P7m8p7Q2k5m3QJ02r3k2J08p0l7N5Q2
5892G9r7N7n6J4KK0M3r4J8J5j1j2M4J3m7L0j0MK0Qk6j1K2l3J8k7M9q0K5P7p9J2
$$ y = [-40, -41, -12, 1, 19, 22, 47, 14, -2, 9, 7, -57, 63, -6, -42, 16, 54, -16, -55, -26, 25, -39, -32, 61, -21, -32, 1, 0, -21, 20, 56, 12, -35, -31, -11, 25, -20, 18, -26, 31, 28, -21, -39, 36, -42, 14, -54, 21, -60, -2, -20, 10, -28, 49, 2, -42, 22, 27, 27, 38, 23, -10, 2, 21, 116, -13, 5, 92, -1, 7, 43, 7, -13, -21, 49, -6, 38, 9, -64, -17, -36, -2, -4, -17, -25, -9, -4, -19, 5, -42, 33, 4, 8, -2, 32, -39, -14, -18, 36, -13, -30, 21, -16, -15, 75, -22, -17, 78, 58, -36, 7, 86, -5, 11, 75, 5, -21, 16, 1, -60, -45, 63, 0, -37, 1, -4, -19, 9, 30, -25, -29, 22, -38, -11, 73, -13, -57, -13, 22, -13, -71, 40, 61, -25, -26, -33, -2, 9, 8, -55, -39, 27, 64, 47, 5, -28, -14, 20, -16, 20, 30, 72, -21, 11, 0, -35, -30, 21, -32, -51, -23, -57, -26, -1, -31, -10, -31, -27, -33, 21, -2, 18, -58, 16, -31, -42, -65, -16, 75, 3, -27, 32, -24, -26, -54, 62, -13, -43, 64, 5, -13, -20, -17, 15, -36, 16, -1, -20, 57, 9, -68, 14, -11, -54, -46, 56, -37, -59, 49, -21, -58, -3, 79, -18, 39, -17, -3, -1, 19, 62, -32, -14, 1, -10, -22, 22, 35, -12, 18, 8, 12, 32, 40, 14, 3, 25, -8, 10, -17, 32, -48, -23, 54, -25, -13]
5924a3rQk0N9mn4O0m4j2M1l5L5j8j2J2k0L0LOoK7j7j6RPL7n4J6Jn5L6RQjJ1j5
5960A0j0QNMj9Ll6L6k6N1pL0m9j6n1M1K8j0K4j2l8OlK3Jl0M1mJ5j9l0K4k6LN7
5995B4oqK4%m8K9j2l3L6l1M6m9J3R0q4M3m4%m0P5Rl5K1n8N7oK5Jp0PO7Ok1j8M6
6030E6k9K1k8J2l9M0k1j2j0P8n7n3M5J8k2K8k7l5l2P7k3J7K4l9Nj0J1k4j5N6N2
6061F4l8J2Qj22J10J5j4m1%J1l5L2J1k7JNOMNl6P2l3Rn5J9PJ3K3JJm6K9k0k6N3
6096A8Jm5j3O8m8J3K1j9K5MK5m5n2O4k4l5L2m4O8k3L1Oo3M3rj9m6J12k9n4J0j5
6128d2J3Q3l3k5kj6L0k7L2K3n4jM4l5k5O2l1j2L0J3l0OM8m6m3L4j1J9L7n3L8m2
6160a6j4K8p3J07m1l8L1L8Mn3N0m0mL2Km4K0L2Qk1L9m6n7O9Mmo0K1M7k8M5kn2
$$ y = [-13, -22, -14, -34, 25, 21, -33, 27, -17, -29, 12, -23, 12, -6, -18, -6, -26, 4, 7, 13, 7, 34, 17, 1, 10, 17, 54, 0, 16, 17, -38, -2, 7, 15, 14, 25, 10, 0, 8, 13, 17, -2, 1, -35, 1, -25, 26, 19, 49, 0, -16, -67, -26, 2, -8, 16, 4, -34, -28, -31, -8, -7, -37, 4, 0, 15, -4, -34, -10, -36, -33, 24, 18, 10, 34, 34, -14, 15, 3, -30, 6, -25, 21, -28, -15, 75, -9, 34, -10, -10, -50, 25, 34, -1, 20, -38, 19, 13, 38, 39, -31, -24, 43, 49, 28, 10, 56, 27, 48, 20, 32, -7, 33, 12, 0, -10, 68, 11, -42, 3, 21, -1, 27, 0, -35, -67, 10, -13, 4, 28, -11, -6, -16, -5, -29, -44, 12, 64, 26, 38, 46, -76, 34, 49, 35, -6, -6, 5, -30, 2, 13, -14, -13, -8, -2, 2, 7, -29, 43, 10, 19, -36, -17, -10, 3, 26, 27, 28, -18, 11, -9, -35, 18, 19, -26, -39, 29, -19, -6, 15, -4, 21, 25, 50, 5, -47, 17, -7, -42, -10, -54, 14, -9, 22, 28, -35, 8, -1, -20, -66, 46, 17, -37, -27, -42, -29, 54, 21, -4, -6, -22, 8, -19, 13, 36, -18, -19, 25, -10, -35, 27, -4, -16, 14, 27, -3, 3, 51, 5, -38, -4, -15, 4, 41, -12, 26, -16, -30, -2, -75, 32, -9, -47, -16, 22, 26, -27, 23, -17, -21, 11, 13, -31, -11, 21, 29, 8, 47, 1, -56, 13, 17, 13, -47, -26, 21, -7, 38, 36, -16]
6193a6kO1m9l3J5J3K2l8R4n0K4M3p6mK7o5P8pm0RJ6m0J5l7O2j2Jm7O8r3N4Ql1
6226c0%N2oJl7QL4q0M6Pm0L0K9k2K6Po5PL8O5r8J3N0p1NN9o6M0N5k0p4K7L9k0
6260IQJ6n5l1N8J8k5k8J7N4q0L5M5j3j2l7k4L4L9k3K5j0m4O1o3MK5l8M2n9K1N7
6292B6J2o8O6Qq0K7Q1m5n3K0k1Lj6M8j9M9j3j1j2K5l6J8L2k1l1p5J24m0K8J3L1
6323G0q4l3K0Mj2M6J1l5L0RJ8l1l0L3mj6M7m3L4K5k8k8J7k9qL8j0m7L3k6J5k4
6355c8O7n1N0K5l7j6rM6m6k9M3l2M5j9M1l9J6Nk7JM2Nj07J15j5nK3o8k3L4K9p5
6387d9O6m5N4l5JNK9o4J0K4l2J3npL8k9N5m4J6L0J8n7J9MJ4K0n9M4n6P9l9J6m5
6420a1jM9o9P3m0oJ1jM3o0ojJ0Mrl5K6L8m4KN7l7Q5j23M3K8o4J07p9pjO8l9M9
$$ y = [-16, -18, 43, -6, -39, -24, -11, 11, -27, 67, 17, 41, 84, 8, 4, 31, -34, 44, 37, -3, 6, 22, -18, -3, -40, 22, 10, 11, -36, 32, -61, -7, 1, -30, -30, 22, 16, 17, -20, -12, 22, -58, -12, -5, -45, -15, 14, -8, 18, 25, -40, -33, 5, 70, -28, -15, 35, -36, -31, 28, -38, 2, 57, 37, -37, -10, 29, 9, 17, 33, -22, -53, 5, 23, -2, -30, -13, 41, -39, -4, 41, 28, 16, -21, -45, -11, 28, 5, 30, 20, -24, 37, -26, -22, 3, -35, 7, -52, -31, 26, 38, -30, 36, 44, -36, -9, 72, 27, -26, -6, -27, -24, -40, 8, -11, 38, 25, 14, 2, 27, -9, 9, 41, 20, -11, -86, 38, -2, 26, 39, 70, -14, -47, -27, -23, -35, 11, 22, -13, 17, 26, 44, 13, -17, 16, 12, -4, 43, 0, 34, 59, 31, 3, 20, -9, -17, 21, 11, -36, -3, -29, -14, -38, 29, -22, 28, 53, 16, 0, -9, 37, -9, -38, 5, -27, 18, -1, 40, 1, 17, 22, -5, -4, 38, 43, -64, 51, 36, 31, 54, -14, -37, -3, 26, -49, 17, -28, 26, -9, -8, -3, 26, -38, -28, -4, -36, -23, -28, -35, 3, -26, 29, -15, 1, 31, 49, -8, 11, 15, 29, 49, -10, 34, -22, 57, 18, 34, -11, -12, 37, -32, 41, 1, -5, 6, 5, 48, -12, -18, -19, -9, -5, -14, -49, -23, 15, -29, -27, 30, -7, 78, -45, -2, 26, -38, 69, -10, -17, -18, 50, 11, 60]
6454F0qp6J9K5mk8LNL4l5n3O3K4L2r0M7L7r3N1M8m5K8p7Q4n3j4L7m7l0NJ5j0j
6487d7P3l6L2l0l3K2L6Q5j20L0M9p5L9Pk7OOK0m4K3K3Jk0k8j4M9j2K1p6L4M7q5
6519d4oM5N3j0k2m7K6j3K9knkL9k4L1p6J9K4k4K1l0L6N7o8MRJ6pRK3k8l9o3Q0
6553A1k0mJ6m2R9m6l8K2J7Rk6LL0m7k4MQN2k4M5j03M3l5N0j9P8p7K3N3o1L7l3
6585AJ3k6M5n1OM0n1rP0o3J1M6n0L6j0k2k3N5m0J1Rk0L7M1o4l3O3K8m4O4o0l3
6617b3p2J07K9rqp7P4m2K1L4m3K5l8R4o0k0K2K9o2O1p8K2P6j26J58n8Lp3L5j9
6647a8K1l8O6rj4J7p7N3l0K2Nj5J3Qj1ml1K3m8J03qql8N4j9l0j1K3K1pk3K0rJ6
6681A7pj1K0Rm7K3P0r7mMN9J5q1NL8l0K8m2qL8M0n3M9rm0RO0m4rJ8J3K8p3J6k
$$ y = [60, 52, -24, -5, 20, 16, -12, -9, -4, 30, -5, -58, 5, 29, 61, -29, 18, 55, -38, 13, 61, 16, 44, -33, 51, -2, -16, 21, -26, -56, -51, -36, -46, -47, 26, -10, 22, -8, -41, -19, 17, 102, -18, 12, 61, -14, 25, 32, 5, 11, 17, 37, -7, 16, 39, 40, 20, -8, -22, 27, 15, 36, -40, -6, 41, -44, -50, -5, 48, 38, 16, -31, -5, -18, 11, 9, 4, 2, 41, 17, 48, -28, -9, 15, -9, 12, -18, 18, 75, 7, 11, 20, 36, 29, 38, 61, 33, -6, -69, 11, -9, -13, 3, -39, 60, 14, -24, -2, 15, 24, -2, 1, 31, -16, -40, -36, -28, 24, 0, 45, -58, -15, -50, 0, -19, 59, -18, 5, 58, -3, 34, 1, 14, -12, 33, -18, -12, 28, -23, -32, 38, -25, -14, 32, -18, 18, 8, -14, -37, 18, -22, -11, -2, -22, 15, 56, -8, -41, 22, 50, 6, 70, 10, -23, -95, 12, 41, 32, 24, -53, 21, -21, 0, 34, -9, 16, -22, 72, 12, -8, 14, 43, -19, 42, -36, -14, 62, -64, 94, 36, 39, -34, 1, -18, 3, -35, 31, 22, 8, 25, -52, 1, -29, -7, -2, -17, -4, 4, -7, -11, -42, -19, -67, 36, 28, 20, -18, 36, 17, -13, -24, -1, 20, 13, -10, 10, 1, 17, 10, -1, 19, 28, -19, 4, 74, -23, -27, -23, 36, 51, -30, -25, 13, -17, 11, -31, -39, -1, 39, -14, 35, 26, -14, -5, 55, 11, 2, 20, 33, 61, -12, 4, 2]
6716Bj1pK0L2n6J9J9p5M3K4j2K2k6L3k4%L1RJ0n8k4Q4l8Lo1M1j7K2ok8O2nj0j5
6750Cj8J9o4P4K0m5Qj9K5M3m2l7P5J4j13K9P1l7k8k0K0l5P0k8J3J8m1J7Mj9N0
6781B7n8J4k6M2Nq1L9M4l1L4m1P2n6j8M6J2Pjm6N1K5n7rJ6K3K6K9p9l7M8j6LL0
6814C7m9M6l7k8Q1k1n8N3o7P1qJ5m1KpM6k2j4l3M8j1K2ok4rm8J13m7j4J9M3o3
6846a1L0J1m0k7L4j9J2N7op6L1L0K3Mj01R1k4j7l6K8pN0k1l3L7o8L6mK1L3p3k
6878c7J6m1J33q0N1k5n2J05r7M0L1n0M4L2l0q6M7j3L4J3o2JJPnJ0Oj5J8n9N6k7
6910c4RK0j9N6mJ5o0k6N1J8l8J0J3m0K5K1NKL6o4NM2nl5lJ5rj7L4Jl0MK5qm3K4
6946dk3j2Q6n6j4N7n4JL3J5m5M1J2q3L7m7M6k2R4p5PJ9j3J2n7M2M1ln8k2N6Ll5
$$ y = [2, -9, -16, 4, 36, -20, -1, 18, -57, -14, 10, -2, 20, -6, 27, 3, 3, 34, 43, 53, -5, -29, 55, 17, 20, -41, 0, -17, 5, -1, -29, 33, 28, 18, 3, -15, 4, -60, 14, 34, -11, -3, -22, 3, 46, 4, -33, 42, 56, -57, -28, 43, 6, -22, -42, -22, -57, 13, -15, -2, 16, -25, -8, -4, -23, 27, -31, -17, -43, -1, 4, -77, -38, 6, -25, 9, -32, 40, -16, -34, 12, 24, 31, 30, -16, 35, 60, 3, -6, 10, 33, 59, 88, 9, -28, 20, 4, 7, 37, -12, 34, -3, -31, 50, 29, -29, 24, -43, 28, 20, 35, -6, -4, -11, 35, 13, -1, -34, 14, 3, 25, 19, -5, -14, -62, 51, 4, -10, 9, 52, -11, 19, 30, -10, -37, -3, -22, -10, 47, 41, -35, -4, 26, 49, 53, -48, 43, 19, 2, -34, -6, -13, 37, 16, -17, 20, -48, -12, -16, 5, 38, -35, -37, -21, -62, 71, -9, 42, 17, -35, 70, -27, 13, 44, -6, 38, 70, 40, -46, 1, -12, 22, 35, -27, -26, -25, -18, -23, -13, -7, -22, -4, -63, -7, -34, -25, -5, -24, 32, 28, 43, -17, -43, 8, 26, -12, -2, 11, -29, -4, 17, 22, 24, 60, -4, 1, 43, 38, 3, 0, 15, 6, -11, 23, 24, -6, -2, 23, 15, -28, -4, -27, -39, 47, -9, -23, 34, -20, -19, 14, 29, -16, 25, 37, -46, -9, -56, -10, -32, 62, -13, -6, 13, 0, 12, -45, -3, 38, 35, -23, -45, 11, 14, -21]
6979b1P4o9LL8j2Jm6K2oJ6P2q6%j3oM1M5l2j0qj7mL7Oo0L3Lj5j0L3Jj1j2M2k9
7014@Qnoj9QJ2J5n2kN1l8k1Q1j1K2m2L5m3J2m0K4N8j08O4k5L8K5jn8J2k9J5K1
7047AOK1jJ5n1k0K6j7mL2J0m7Q0n7L0J5nn9PQnK2oL1m7L4j2k6P4n6L1m3j6L1k0
7082a8N7p7K8qP7q7k6P4LJm8ML0j0J4J4jn4M2jj5L9m2j4J2J4KM3p6O6n0j9L6O
7116A6J8o0K8j0J6m2N0K1m1j2K5k3j6N7k4pk2qN2rqj6J7m1K2O2l0k6j5Q8j2j1
7148C9JLJl4J0m%l6j6O6lk6j4J9J2Mj3J7n2L7L1m0J0j2l5J6m7L2P3p9L1rL0K4
7182C6Lp3M1QK1kk2n5N4l6L6OK2m1K7nl5N2l6m3P4n6L8j1j3J9k1O6p2NL0m4QO1
7216D2Ko9J9Nj8L1j7J6j8k6lJ3L4j2nk4N4m7j4P0mo7M1N2l3rj2J7j0K1n0pK0K1
$$ y = [-21, 53, -16, -13, 25, 13, 14, -32, -10, -16, 0, 72, -14, -14, -27, -33, 8, 53, 21, 11, 3, -14, -18, 19, 25, -35, -2, 1, -14, -24, 9, 10, -1, -13, 29, 0, 8, 3, -3, -22, -14, -2, 13, -39, -41, 10, -28, -49, 32, 21, 43, 1, 36, -7, 5, -35, -11, 47, -61, 3, -22, 16, 41, 40, -18, -6, -35, -20, 1, 7, 28, 27, 42, -9, -29, -3, -20, -24, 8, 18, -29, 51, -6, 24, 39, 34, -25, -18, -10, -15, 7, 1, 32, -15, 19, 7, -19, 55, -1, 30, -13, -29, 2, -18, 39, -38, -10, -18, 59, -28, -54, 20, 23, 24, -24, -20, 10, 0, 14, 28, 27, -27, 15, 14, -1, 38, -4, -18, -6, 8, 10, 53, -23, 43, -7, -26, 10, 16, 34, -26, 2, -8, 8, -34, 16, 37, -4, -16, 9, -14, -30, 27, 3, -4, -26, -34, 18, 9, 1, -15, 2, -39, -17, 45, 15, -11, -26, 62, 50, 39, 40, 43, 44, 10, 20, 16, 16, -20, -36, 30, 27, 1, -13, 6, 18, 22, 9, 26, -26, 11, 42, 2, 12, 0, -35, -19, -66, -34, 39, -40, -9, -18, 12, 36, 39, -34, 7, 15, 36, 34, 12, -43, 11, -25, 11, 17, 39, -2, 25, 20, -15, 37, 1, -42, 32, -24, 14, 3, -10, 9, -12, 54, -18, -13, 17, -27, -19, 42, 44, -25, -6, -1, -19, 12, -5, 11, -7, -33, -36, -23, 11, -1, -6, -30, 24, -23, -37, 33, 29, -38, 3, 55, 22, 13, 1, 18, 8, 29, -21, -28, -8, 13]
7250A3rRj5O2q8M4PJ9pln7M2n1J0O8%l2n2Q7n5K9k9K7o2L1K6jj6K6Ko3Q0j8k5
7284aL3p4O4nmJ8o5J3nM1l7Pj2N7K0m4J5k7jM7o0k1K2nO5l8L4k6J0Oj6k9j5M9
7318A6j7j6K4L6r8P5l4K5k1k8P6q4L2J2O8o9M2l1n3P4m0j4M1p8N4Jj4M2m6K2J0
7349GM2o3N2j7j1l6L0j1M4k9k7J9pK8L2k6o8O8l7L7K3l7R%Kn9M0k2M2%j0Qm5J9
7383ck7M6m8J4M2o0K9nrN3n7O9l5K8l3NQk9J7K1k1L1r2O1L3p9M4j9L7o9PJ2L0
7416A%pm6Q8l3L7k8Qm2K6l8j3M2j1rL0ql5Q7j16K5M8N5p4L5l1j1P0n5L0k0l8L6
7449CL9l1m5N3l8L9m4L0j4rO8lp4j0K3R0k0p4%l7Q0l3k2MjP8n8NL7r2O9k1j6R
7483a5kJ7Kk0n4P8jK0j5Jn3qL4P0l4K2l6nK2J4p4N1o6N6L9ml5K4j9K2m5l8J2J7
$$ y = [13, 4, 13, -2, 60, -28, 16, 23, 42, 35, 32, -25, 17, -34, -24, 44, 44, 12, -40, 47, -8, 21, -8, 19, -43, -12, 14, 13, -3, 23, 25, -38, 42, 24, -1, 32, -42, 22, 17, 13, 31, -34, -21, -26, 15, -22, -15, -27, 30, 50, 6, 21, -6, -7, 40, -20, -41, -19, -24, 41, 3, 37, 11, 21, 27, 11, -18, -33, 16, -1, -17, 7, 43, -55, 20, -14, 11, -10, -38, 38, -46, -14, -2, 66, -3, 39, 8, -45, 29, -11, -25, 16, -62, -8, -7, -21, 21, -25, -3, 7, 49, -14, 38, 21, 10, -26, 4, -7, 37, 8, -19, 0, -7, 21, 53, 27, -41, 27, -10, 27, 50, 13, 22, 22, 24, -35, 5, -17, 25, 25, 15, 23, -22, -3, -30, 16, -32, -18, 24, -36, -7, -12, -21, 32, -25, 44, 9, 37, 4, 9, 17, -12, 5, 26, 5, 36, -56, 5, 38, -41, 3, -16, 21, -48, -41, -29, 1, 1, -6, -52, 36, 3, 40, 12, 20, -22, 4, -34, -47, -5, -16, -25, 5, -3, -38, 49, -67, -42, 6, 61, -13, 22, -9, -20, 50, -5, 25, 5, -33, 3, 42, 11, -34, 19, -19, 20, -24, 6, -8, -17, 51, 48, -26, -36, -13, 77, 57, -17, -17, -54, 26, -7, -29, -25, -26, 52, -6, -1, 36, -56, 13, -8, -24, -15, -17, 0, 2, -18, -72, 6, 5, 25, 10, 11, -42, -50, -16, 54, 20, 42, 6, 1, 23, 37, -37, 14, -52, 4, 43, 39, 4, 28, 9, 31, -14, -52, -40, -23]
7517b3K3k9N3m9K5j9L2O8q5o5Q8j3m9J14n1n1Q2n0PJ3k7QK8n2M4JK7k5J4k1oj4
7549bk2J3j4K7k5O4p0M3lM4r7N5%j4j4j3J3M6J2l6m6M7MLk0lK2j0L7l4j9m3L8
7582a7L9l2O4n8k8P0o6M7K9l2qKO6j03J4j0M8o8M6m9M3J4j4j4L1L6j17M6NJ1j5
7613b0oNL0K0m1P9m3m2K7l7M9l4PL4k3rl0N3k2n5QL6M6n8O4J2n0ONNk1q3J11n8
7647c5k5R7o0N6L4o0k0N7m8K4m6L7k0L3k9JK9K0M0p1m1P6o6oK1Q2k1p1P2q5L1
7678Fl8N1o0MK9K0k1k7k6K6Q5p3QRoL4Jk6QP0n4J1j6j4Rnk0K8K6J0o8K7kk3M0
7713B3L4n0L1k8j3L6l6pK6m0L7J2MJ7m0l5O4k1l8O0n5OO0p1M0n5N4j9P1o4J6m4
7745b5L3k3K5Oj6j3M0N2r0J9RJ5k5j5O1m2MM5m8k0n4M6M2mmnK5n0L4Lq1O4qK7
$$ y = [-23, 0, -29, 24, -25, 0, -19, 13, 81, -4, -69, 19, 6, -43, 71, 20, -31, 51, 1, 8, 21, -6, 2, 30, -22, 22, 23, 50, 25, 39, 18, 12, -2, -24, -11, -25, 2, -23, 41, -29, 14, 11, 55, -42, 13, 13, -1, -15, -28, -15, 31, 43, 7, -39, 8, 12, 15, -5, -8, 14, 4, 41, 7, -12, -55, -17, 22, -10, 54, -4, -32, 38, -28, 19, 48, 16, 8, 10, 76, -27, -13, -23, 25, -43, 3, -46, -3, 11, -3, -17, 14, 50, -67, -21, -16, -5, -20, -26, -21, 9, 29, -12, 67, 24, -18, 9, -28, 21, -13, -6, 28, 5, -4, -34, 19, -3, -58, -50, -14, 32, -26, 38, 50, 0, 6, 11, 16, -5, -88, 23, -35, -60, 37, -23, 33, 67, 7, -13, 44, -4, 20, -26, 11, -9, 24, -5, -4, 25, 45, 85, 14, -27, 49, -17, -23, -2, 80, 59, -12, 60, -25, 6, -32, 19, -41, -37, -8, 12, -9, -36, -62, -36, 49, -24, -16, -7, -13, 21, 22, -4, 4, 74, 20, 31, 15, 1, 10, 5, -15, 13, 39, 49, -19, 8, 6, -17, 23, 57, 7, 38, 10, -3, 33, -3, -10, 16, -24, 13, 25, 29, 46, 6, -29, 35, 14, -24, 36, -19, -13, 47, -24, 16, -39, 15, -4, 67, 3, 19, -25, 8, -15, 10, 16, 0, -13, 27, 79, -11, 8, 17, 32, 7, -8, 53, 11, 15, 60, 12, -8, -62, -16, 26, 22, 18, 13, 38, -12, 22, 25, -56, 8, 0, 27]
7779B7q9L2Mj9N4NrJrl2K9O7p5J4N7q8K3K7N5k2j4j6Ll2L8l3L3J9p8J3kj8J00
7812F5p3L5k8pK0Ql7jLQOn3N3n0N0%j1Qj5L8nk7N1j6k1N8o3NL9j4k4j0N5m0l3
7847b6O5o0j0O7m6MN7n8%N2n1m4K0M7n5N8J6k5k9qO0m4k4N8Jj9mmnM0J0j7j6j7
7881gO9p8O2k4n0K2K4K6n0K0J3l6NL9rj1p7L2L4N3j9q6O7q8P3pk9L0j1j8L2ML2
7914C7l1j5P3m4l3O0k2m6NN6k3l2J3JN0l4K5n6K9Ok8j4qO0l0k6O5j0j9j5N5k4
7946B5j3ok9K0oJ5k2L2nJ5J9k5K1n1K8k0J3K2J2Lk1n1N2j5ORrLl0M1NRp0K6K4
7981B7o0L2K0Lk9%K4l1n7Q1K4j8k0jM0j9KJl9K7j8MK9n8M8n3O3j8OM1l7m0O2n7
8015b1K6L5n8J7K0m6j9Q3n1r0J26l1J0ROk4K2l9p7R8k9PO4m7M3m2j9j8LJ8J3j6
$$ y = [27, -62, -30, -26, -45, 9, 14, 5, 6, -3, -35, -6, 61, -14, 0, 57, -31, -8, 19, 74, 52, 38, 22, 25, -7, 31, -2, 31, 50, -28, -15, -17, -35, 65, -8, 27, -1, -8, 12, 20, -17, -18, -15, -7, -1, -54, -1, -51, -1, -1, -12, -4, -19, 19, 14, -13, 38, 22, 1, 59, -4, 1, 40, 26, 2, -8, 47, 7, -26, 39, -21, -31, 36, -10, -6, 51, -7, -7, 45, -6, -50, -30, 17, -38, 20, 36, 11, -18, -26, 34, -10, -34, 24, 25, 6, 2, -2, -7, 33, 43, 26, 10, -7, 62, -16, 46, 22, -28, -6, 18, 44, -6, 14, 27, -9, -4, 35, 26, 15, -62, -30, 4, 57, 38, -48, 19, -69, 4, -3, -32, -2, -13, -31, 1, 5, 37, 6, -9, 64, 20, -13, 47, 25, -21, -16, 40, 17, -15, -2, -1, 49, 15, 40, -16, 13, 19, -9, -23, -31, 29, -1, -27, 38, 28, 9, -6, 49, 25, 12, 6, -23, -3, -9, 6, -16, 16, 11, 26, 45, 20, 41, -10, 18, -2, 11, 33, 45, 48, 27, -24, 28, 13, 19, 28, 19, 22, -8, 33, 38, 47, -23, 3, 27, -33, -1, 19, 22, -7, -7, 17, -14, -71, 10, 34, 16, -4, -5, 35, 16, 18, 19, -20, 7, -11, -7, 22, -36, 12, -41, 22, 4, 10, 51, 14, -26, 36, -21, 5, 40, -18, -1, 19, -27, -46, 37, -14, -104, 22, -9, 1, 10, 16, -8, 14, -25, -102, -4, -33, -26, 38, -9, 34, -8, -27, -45, -42, -24, -11, -27]
8047b7qM4kL5k9Lj6N5l1j5j4j4K9J7ok3N0o2K8Qm4moK8LPL8n3pJ0j9K8l2K6L6
8082C3o3L5m0PP3j2J1p3N0J9k5j0n9N2L2J7n0k4K5J5J4Mn0nK4N1n1K2m0kR7m0
8114C7m4l6K9K8J7l7%k3K2KL3N2q4K5OJ1o1P4l5J3%q5M5N6p7L3L5JJ6j9k0L0o8
8147b4PL5m3P5n5Pk2L2m5m1R5m1M1n1J9k8L1PK4lq3K9j2O2J8Qn1j9N2L3j1k2J0
8180C4n0j6P2l4J9k2J6j5M6jl2
$$ y = [-27, -35, 9, 7, 42, 13, 16, 0, 55, 24, 9, -5, -19, 10, 27, 21, -2, 48, -14, 14, 22, -22, -26, -32, -4, -1, 6, 44, -9, -16, -6, -25, 3, -29, -3, 33, -30, 5, -35, -28, 45, 33, 44, -29, 21, 40, 15, 5, -54, -2, 30, 47, -3, -27, -2, 13, 27, 31, -19, -24, 0, 51, 0, 22, -18, -20, 77, 37, -7, -43, -14, 14, 31, -6, -6, -29, -7, -5, 28, 80, -4, 21, 27, 38, -23, 51, 16, 29, 29, -56, -11, 45, -32, 1, 36, 37, 53, 34, 14, 44, -24, -17, 18, -25, 50, -5, 2, -20, 12, -33, -74, 21, -20, 21, -30, -11, -39, -8, -1, 23, 20, -63, -34, -46, 16, 34, 42, -9, -28, 24, 57, 46, 24, 34, -16, -32, 40, 6, 25, 3, 19, 4, 50, 49, 17]
8191A7
$$ Imaginary data points
##PAGE= N=2
##DATA TABLE= (X++(I..I)), XYDATA
0@%%%%%%%%%%%%%%%%%%%%%%%%%%KoRj3J6j6J9k3K4k7L5m1M5n3O0o6P6q6R6j08
46e7J20j34J51j66J80j97K17k37K58k82L06l30L53l72L87l93L79l26K00Q0p25
67e88K390p949N1918K49399l33709j57298L40008p6921j98465K25189j3888l18037
79b37951K13006K73987l43235j16009L83470o4807k68977K14893Q1246k81733
89a46110R5557K22368k42142r7122L03140o7747k44425K34792J21127l04801L4120
100i1243K60786j61699j53028J98483j0139j69245J72437Q8417k69485M3451K88890
111A97625j48691k15355J81227P5612j57705N5782P7896j60764L3123K24505j28880
122C4375k00412J95098J12721j98789j0866J30182q5628m0727J42348m9822j44647
$$ y = [0, 0, 0, 0, 0, 0, 0, 0, 0, 0, 0, 0, 0, 0, 0, 0, 0, 0, 0, 0, 0, 0, 0, 0, 0, 0, 0, 2, -4, 5, -8, 8, -8, 11, -12, 12, -15, 20, -21, 24, -29, 31, -35, 41, -45, 51, -57, 63, -71, 80, -86, 94, -103, 114, -123, 135, -147, 159, -171, 182, -190, 197, -196, 183, -143, 57, 137, -588, 1802, -6147, 45771, 295170, -38539, -195837, 144171, 67250, -131215, 93974, 80086, -237951, -24945, 249042, -94193, -210202, 173268, 108461, -160516, 54377, 135623, -146110, -50553, 171815, -70327, -167449, 135691, 67944, -176481, 58311, 179438, -125363, -91243, 169543, 7844, -145184, 53299, 43160, -126085, 46352, 134769, -134716, -91265, 197625, 48934, -166421, 14806, 90418, -67287, -11505, 66391, -94373, -61250, 163255, 34375, -166037, 29061, 141782, -57007, -67873, 62309, -23319, -64046, 78302, 28480, -116167]
133a16167J37988J03218j81242j7755J65196p6539j12289J27378L3610j38983
143g5585M3396J14772r8993m0882J33264n3918j22440J32926O6204j75576m475
154h1307J63524m9833j04252R5174J7815j04972Q7738P2744j73041j2390J94503
165A05703n8676j60183J07870Q4552j21812K0718J02754j19877l9172J77142n4348
176D4671j72875J29648J04828j63968o114J52905q6210r1148J54707l771j67276
187a04603J03493J07648j73159p161J79323r3438j26541J63311M1629j77038N8813
198b7723J28876j43346l0869J70337q7639j33264J73047N1266j94955M5373J57886
209A08989j22136o9162J57145m8700j34857J49441N4667j94321M7387J70099j25971
$$ y = [-116167, 21821, 125039, -56203, -73958, 91238, 14699, -97590, 29788, 63398, -75585, -32189, 82583, -16410, -57292, 75972, 22054, -100386, 32540, 98744, -76832, -81307, 82217, 32384, -71868, 23306, 41121, -63851, 23887, 96631, -76410, -88800, 105703, 47027, -113156, -5286, 79266, -42546, -21828, 80926, -38951, -78123, 99019, 44671, -128204, 1444, 106272, -57696, -63810, 89095, 2885, -88263, 66444, 62673, -104603, -1110, 106538, -66621, -73782, 105541, 12103, -114438, 48873, 90502, -86536, -27723, 101153, -42193, -73062, 97275, 9636, -123628, 49419, 100685, -94270, -48897, 108989, -13147, -82309, 74836, 26136, -108721, 40720, 95387, -98934, -51547, 118552, -7419]
220g419q9197J62456j4885j45789J11929P4597j71652K6684J63596j20277r2735
231a02692J68450m322j56223R4037R5740j50688o447J53568q8707r9626J50783
242E3873P366j53225Q4819J03695j39599k4816J46711n7381j08007J18635L0924
253F2995j37978N8282J04937j21603l4495J37904l9825j08990R4358M9118j19158
264e4455K3677J03900q9369n0527J21279j9192j07022P6378N9558j03666K10R9292
276F0063n7728o6026R8024J0062j04135N0261P3069q8669j9769R4897l3700p4324
288e7975P4695L3580r5555J9520Q6240o8289m6200R1923p752q3272N3797N0654
300E1366q2142n896Q8244m3220o7275Q2640K1277r3879L2393P2269p1596k9536
$$ y = [-7419, -96616, 65840, 50955, -94834, 17095, 91692, -79960, -53276, 110320, -9957, -102692, 65758, 61436, -94787, -750, 94990, -55698, -62145, 91423, 2716, -96910, 53873, 61239, -91986, -7167, 96528, -43071, -67887, 78824, 21443, -86564, 32071, 62995, -74983, -16701, 88236, -33367, -67862, 70042, 30217, -78773, 15585, 64703, -54455, -30778, 73122, -16247, -66774, 54505, 35313, -71709, 4669, 64227, -39439, -39229, 60063, 2335, -63691, 34333, 44395, -59740, -9479, 63590, -25079, -44848, 50049, 16349, -57975, 16720, 50300, -45255, -25735, 60505, -7784, -53984, 37939, 30187, -53085, 712, 51366, -30776, -36672, 51572, 8352, -58923, 23717, 44994, -48885, -16492, 55777, -15819, -45355]
312d5355Q6625j9293p7250O5052M3682r3951R213R1441o1957n5391R1599J992
324C6407q9913M8851O1057q5493j1956R7153m7044p4546R3845K1722j06996L8695
336a8218Q1844q3153l1161J00045k9167q4872Q3834L8254j12354K7587R9479q5022
348a2904m9385J10077j5240r6591P2061N2223j05721J1581J03744p5998o2251
359f8404J14329m573j09649O6997O6585j02485m465J02824n7924o8732J02332
370C6835Q039j10903N8588P7203j02306j6240J06963m5075p5678Q7866K1600j01221
382e4329M0864P9166r1087k6115J07639l6494q3964Q1845L3341r6355K3751P9381
394E7643p1778l6442R5961k1524q5334P2620M2581r5356J2732Q3401n8105m6497
$$ y = [-45355, 41270, 21977, -55273, 9779, 53461, -40490, -31277, 60164, -1793, -57184, 34415, 36407, -53506, -4655, 56402, -29091, -41047, 56106, 9062, -65484, 28361, 50083, -56913, -18218, 63626, -19527, -50688, 49357, 20190, -64682, 19152, 57406, -54948, -27361, 72118, -12904, -62289, 47788, 32548, -64043, 8018, 60241, -45480, -33899, 69845, -6153, -68404, 45925, 41352, -68297, -1300, 65285, -37200, -41665, 61159, 3235, -65497, 36835, 44874, -66029, -7441, 69762, -32544, -48784, 58179, 13104, -62574, 25292, 46892, -54329, -13465, 65701, -25386, -51501, 56138, 19644, -64320, 17525, 50866, -45489, -21738, 57643, -14135, -50577, 45384, 23860, -61474, 11146, 53727, -41629, -28897, 54504, -3601, -50098]
406e0098Q2384k782q0107N1904M9994q3402l09Q3647m7582n4271P5077J0874p6828
419d1499L1535N6040o3285j7745P4410k8146n8493O3210K1518p3996J9131O0437
431D3117m9598l1707O4532n038o0342M1441L4979o3689M078O1940l9313l9917
443c9517N9512Q796o2159K3646M8200n0541j7894O1357k0496m9116N0907J9281
455C1976o2647J4530N5590m3441l3722O1150K68o0681L5506L7531n8401r9N8965
468C6525l5971l9999O0111J0119o7779K4279N5523n3260k2807O3918j8875m9713
480c7929N2467J7693o6587J8837O0718n0943l6513O9457j816o5157M0741L5775
492C6743o3289O432O1027m4775l8401O8592L315p2720L5700N3124o4820j3324
$$ y = [-50098, 32286, 29504, -50603, 1301, 51295, -32107, -32416, 51231, 3649, -50622, 24455, 35329, -41499, -9964, 46076, -17209, -34954, 39456, 11310, -47183, 16027, 37545, -36451, -17320, 43117, -6481, -38188, 26344, 21306, -39036, 2405, 37384, -26305, -22227, 39713, 400, -39517, 19995, 28791, -33368, -9722, 38478, -12063, -29957, 31400, 10904, -38212, 12695, 31976, -30671, -16141, 39449, -3992, -37714, 23436, 23704, -36977, -1471, 36060, -22341, -22440, 36525, 554, -39445, 20666, 30785, -36994, -12715, 42808, -10452, -33259, 30659, 11784, -37929, 14538, 32231, -34356, -15519, 45199, -5744, -42257, 27200, 25384, -39773, 968, 36743, -26546, -20114, 40913, -3862, -42263, 26329, 29644, -43076, -7376, 45748, -19072, -32396]
504c2396O9804l0527m6982O0688P763o8508L4018N4599o6968k2336Q0042j9541
516A9656o4954N4268K5255o5939K2129N1319n9825j9666P7943j9235p2381N3972
528B542M2345p0734L006N9964m4347k6214O5963j5333o3829N1186M1657p2149
540b5943n145P0924l3672m4518N8389L016n8141L6006L6051o0236k967O5540l2091
553G213n1253N8630K0047o5152J6787M6400m3094j1779N0402k4984m0779N3780
565A6218J9135o7795R683O1126l5153l3396M5458l779l6540L5684J5240n4489
577b8608J0496N7579l4416m3647M9475J5369m7669J6030K8014l7350o17M3245
589B7901k5234l5964M4538J7517n3136Q431M5768l1448k3657M0693l406l3980
$$ y = [-32396, 37408, 6881, -40101, 20587, 28350, -40158, -6140, 48459, -18509, -40845, 39197, 19656, -45298, 8970, 34225, -31714, -9585, 41734, -18091, -37757, 40186, 20951, -51430, 2542, 44887, -25847, -22841, 37123, -7224, -33438, 32525, 17192, -46637, 4549, 46206, -25943, -31088, 39836, 6164, -38354, 20035, 23051, -35090, 916, 36967, -23269, -26236, 39304, 7213, -44040, 14590, 34637, -30515, -13728, 32672, -10422, -22201, 28201, 3217, -37562, 16218, 35353, -32442, -22759, 38367, 3214, -30182, 15276, 11497, -25043, 10641, 25881, -28608, -18112, 39467, 5051, -38596, 10879, 26248, -21421, -5391, 22623, -14727, -15344, 27901, 2667, -33297, 11241, 28758, -24378, -15947, 29821, -1627, -25284, 15409, 12003, -21977]
601b1977K6016J6591m0107O797M4370l1557l4901M8840J3569m9189R739L2380
613B0571k5828o372L2113k1718k8790M6210J4603n9134P026N2609k6516k8825
625b4051L4310j974k9113K9939J4503m9197P462N3985l1398l9916M7061J1746
637B3357m5674J7771K8901l7629l701M4195k3666l5571M6636J2213n6394J7673
649a1889M6649m0545k2188M6559o515l5856L1172J2618m6646J7754M7003m5947
661g831k9992N9052L106n0591K1307K5923l5164O106L6734l7185k4843N8602J387
674B6611o0657K3996M1354l8849j0049L8280k1223k4616M3761J845n2451K4507
686g491M2623m5226j6908M9928j3008l6733L4323J2956m1587J3719L4644l7069
$$ y = [-21977, 4039, 20630, -19477, -12680, 31690, 133, -34768, 14072, 27641, -21548, -11809, 20571, -5257, -11629, 20484, -1234, -30024, 16186, 30789, -28345, -21319, 31290, 4774, -24051, 10259, 8285, -20828, 9111, 23614, -25583, -18121, 35864, 4466, -35450, 11611, 23357, -22317, -4546, 24355, -13274, -16975, 27220, 3554, -32017, 14619, 26832, -29562, -11889, 34760, -5785, -27973, 18586, 12071, -23785, 7387, 20005, -26641, -8887, 38116, -7831, -37823, 21229, 24335, -26256, -4949, 20974, -14190, -8084, 28650, -8535, -33378, 25224, 26611, -34046, -10050, 31304, -7545, -17594, 20686, -537, -25153, 18608, 20453, -31998, -7491, 35132, -10094, -27002, 22926, 9918, -26815, 7508, 20464, -21123, -7404, 27240, -9829]
698i829j4715M9953j2562m5643L5784K6031m3909o92L5785k1289j6439L5487q861
711I101l8885L3920K8036m8540p275M5694j3493k7911K5995L366k9006K0758K2723
724B4483l9600p285M6562j2489l7249K7523J6383l1055O575K4429k4880j0813
736a7416L5526p539l4837K6154K1238l6615k90L3763j7907k1165K7793L614k8837
749a6518J5133K0489l1065l465L7272j6238l0392K9285J4612l1183L035K3865
761A4830j8780r342K9745r963l0696K8284K0069l6917k885L2686j2940j9305K3470
774H256J270k7224J8180K1522l3631o184L7465j2449k8184K5449J0858k9391P876
787f187K4777k4313j1675L4048p996l1321K6601J6370l5285L416L1858k0008j9090
$$ y = [-9829, -24544, 25409, 12847, -32796, 2988, 29019, -14890, -15582, 20203, -1086, -17525, 17962, 9101, -29784, 4136, 32172, -16368, -23643, 22051, 8558, -19353, 6642, 10008, -18998, 1760, 24483, -15117, -22402, 24160, 11671, -25578, 1945, 18328, -12727, -6152, 18277, -6603, -17416, 18110, 10571, -24266, 1888, 23126, -13489, -13779, 19984, 2077, -19088, 8705, 12319, -16518, -1385, 19104, -11961, -15426, 21846, 5608, -24784, 4501, 19113, -12070, -9035, 14830, -3950, -13292, 16453, 6490, -24206, 4078, 24147, -12770, -15655, 17031, 4091, -15214, 8256, 9526, -17698, 482, 22004, -11627, -17811, 19654, 7205, -20979, 4470, 15328, -14063, -6187, 18590, -5723, -17398, 16650, 8654, -22667, 3934, 20304, -14981, -11565, 20293, 285, -18805]
800a8805K9915N19l0574K0271J9480l5397N27L7199k0380k5779L1593P270l2179
813a6340J2308K2819k8633m914L5676j6977k8950L3268J1179l6743Q959K7785
825A9437k4041j1183L1598r121k8688K8027J4276l7195O402L2318k3737j6590
837a8497L1387k709k8743K0082J7202l1871J378L2540k1042k0572L2524J444l1445
850a8322J5926K0499k6721m297K9426j4058k2114K8997N684l3187J3193K4774
862A9800k5367r015K8110p662k2387K1671R720k9464P508K6624k2858j3530K8891
875A2041l115k4565J6412J3382k3940R05K4547j5956j6741K6437K036k7011J3019
888b549J7965k1676m586K3082q780j8172K0094P281k5727P734K1899k0052r974
$$ y = [-18805, 11110, 11629, -18945, 1326, 20806, -14591, -14064, 23135, 2755, -23024, 8569, 15839, -16340, -4032, 18787, -9846, -14760, 20916, 3939, -25011, 8257, 19436, -17307, -8348, 19437, -4604, -15787, 15811, 6690, -21998, 6029, 20305, -16890, -10488, 21830, -1907, -18497, 12890, 10181, -18562, 1520, 18722, -13149, -11771, 20769, -273, -20845, 11679, 13123, -18322, -2396, 18103, -8618, -12915, 16511, 2453, -19661, 9336, 15020, -18167, -4974, 19800, -5567, -14582, 13528, 5866, -16521, 5150, 14870, -14594, -7086, 19538, -3320, -16850, 12041, 8926, -15639, 773, 14155, -9785, -8880, 15667, -289, -17030, 9407, 11443, -15568, -2549, 15416, -6260, -10846, 12236, 3456, -14716, 5378, 12659, -13068, -5334, 16565, -3487, -13461]
901a3461K4205l852k0343J4890J1282k1883J239K2710j5153j5018K4362R99k4223
914a4246J2382J5873k0361l870K2172r016j7741K0529O568k5572Q405K0853k0073
927d097q602K3785m930k0108J6262J0973k3362K514K3268j6896j3866K5074q93
940I122k3648J3881J4677k1651k113K3068j1464j7412K2688M457k6024J1048J9143
953A5772k1718n866K4055p775j9155J9008Q598k5028O190K2381j9877j0487K5699
966A1797n000k1743J7187J1288k3446K013K2806j5607j4392K4891n59k4715J5270
979b10J4909k3316q47K3012j2259j5959K1655L985k4748J0772J8652k2008m861
992a1223K4194r552j7579J9276O343k2860O487J9682j8089r550K4006n116k0326
$$ y = [-13461, 10744, 6892, -13451, 1439, 12721, -9162, -7923, 14787, -366, -15384, 8978, 9977, -14246, -1864, 14009, -6352, -10222, 11950, 2934, -14807, 5722, 12290, -13282, -4877, 15976, -4097, -12699, 11086, 6156, -13952, 2310, 13283, -10079, -7565, 15703, -1193, -15059, 10015, 9122, -14526, -645, 14032, -7619, -9732, 13336, 1872, -15540, 7148, 11605, -14419, -3371, 15772, -5946, -11812, 12243, 4468, -14687, 4321, 12919, -12109, -5919, 16462, -3415, -13902, 11797, 6797, -14946, 2241, 13529, -9917, -7904, 14902, -705, -15097, 9794, 9235, -15480, -210, 14699, -8617, -9464, 13548, 1289, -14670, 6985, 10970, -13778, -3006, 15646, -6362, -11223, 12971, 3419, -14160, 5116, 11459, -11401, -4914, 14768, -3321, -12871, 11135, 6019, -14307]
1005a4307J7107R243k1916L541J9535j4513j1705K1321j66k1676J3101J3575k0875
1018g735l78K0299j1589j2953J8817K540k0414Q743J6082j8184n515K1317p439
1031C591j5926J6633N304j9203N675J6066j4682q678J9932k328j8748J3145J0161
1044A0942j8591J723J6738j1626r907J7275R06j8484R103J4047j6994l862J8569
1057I839p477j2870J5065L541j7224N985J4673j4144p820J8768k597j6977J2530
1070A292Q508j7084K329J5111j1393r105J7092L82j8319R606J3442j7156k874
1083h169J7811q199j1714J5321K493j7303P304J4503j5756o694J9999m539j6605
1096a1548J3961O836j7294M306J4469j3317p727J8701j897j8851J2205J1987j8427
$$ y = [-14307, 2800, 12043, -9873, -6332, 13203, -1310, -13015, 8306, 8140, -13536, -435, 13140, -7735, -8113, 12186, 597, -12356, 6461, 9001, -11413, -2670, 13412, -4772, -10287, 11030, 3591, -12335, 4298, 9602, -9601, -3926, 12140, -2542, -11220, 8712, 6384, -12364, 781, 10942, -7649, -5926, 10812, -814, -10721, 6554, 7460, -11024, -1921, 12126, -4868, -8730, 9839, 2362, -10508, 4557, 8098, -9126, -3141, 11532, -2612, -10432, 8336, 5739, -11238, 1292, 9800, -7284, -4955, 10156, -1237, -10342, 6750, 7132, -11187, -1581, 11861, -5295, -8169, 9642, 1443, -10271, 5050, 7543, -9760, -2456, 12047, -3709, -10403, 9596, 5057, -11548, 2413, 9249, -8045, -3739, 10730, -2587, -10314, 8387, 6490, -12361, -156, 11831, -6596]
1109f596n44J7174j0300r598J6480l33j7406J0187J3572j7992m392K0112p001
1122C363j4403J5167L598j6807P366J2871j5548n223J9582m885j7518J4273Q614
1135A0450j8307L224J4764j2709o303J6987l457j6237J2556J0548j8745m21J8473
1148A0823j0148j0800J5808o4j4878R789R535j6220j429J8437q129j4578J5501
1161C647N037j6542N524J1096j2797k425J5299o471j3722J4023P620j7865J725
1174e851J5082j0102o712J3675l093j1951J0928P084j5801J98J6455q400j1348
1187i836J4019K113j3695O913Q360j2319j055J3874o618j1691J3296N177j6274
1200g736L631J3104j0566n296J2462l251j0246J0331N243j5063K070J5553r643
$$ y = [-6596, -7140, 10034, -266, -9864, 6616, 6283, -11123, -936, 12636, -5356, -9748, 10364, 3363, -11040, 4127, 7725, -9082, -1716, 11155, -4393, -9616, 9966, 5081, -12437, 1836, 10450, -7857, -4633, 10131, -2578, -8881, 8106, 4649, -11588, 968, 11516, -7229, -7650, 10823, 675, -10125, 5683, 5619, -9259, 530, 10065, -6155, -7584, 10853, 2724, -11854, 3647, 8684, -7858, -2334, 8762, -4035, -6460, 8839, 2368, -11354, 2669, 10289, -7576, -5851, 9231, -871, -7583, 6092, 2999, -8952, 1976, 9060, -6741, -6543, 9912, 1512, -9836, 4183, 6296, -7399, -486, 7874, -4445, -5500, 8374, 1756, -9935, 3361, 8538, -7736, -4105, 8999, -1567, -6863, 5599, 2348, -7898, 2433, 7676, -7387, -5317, 10236, 593]
1213E93j0312J3807J604j2248O487O662j1600O16J3438q116j1426J4352M819j5838
1227g162L713J1227r867l274J1771m989j0053J1539N298j5578K261J4721r947
1240c40q213J3528n82j1774P973O336j2316J031J3223q821r804J4976K145j5700
1254h338O139J0580j1056k480J1516n743q504J2536K557j6285N375J4295j1988
1267a396p111J3639j955r989Q998L599j3023M037J3348j1494q734J5828N58j4245
1281g940P319P616j1291P12J1235q289p754J3902J187j5516O908J1385j2609l428
1295f563J2983m618q870J0055K212j2398N443J1059j2525n356J5729k655j2917
1308h421Q806N880j0767K093R286r150m854J4095j930j4551Q868R638j2399j647
$$ y = [593, -9719, 4088, 5692, -6556, -69, 6593, -5007, -4391, 9047, 931, -10495, 3857, 8676, -7162, -3449, 7778, -2089, -5363, 6408, 1419, -8634, 2905, 8203, -7375, -5114, 9607, -340, -8553, 4975, 4393, -7381, 592, 6928, -5388, -4357, 8866, 45, -9759, 5217, 7362, -8338, -2199, 8381, -2675, -5155, 6361, 618, -7886, 4650, 7207, -9078, -3703, 10592, -1396, -8507, 5132, 3177, -6812, 2186, 5785, -7238, -3201, 10147, -1347, -10081, 5747, 6305, -7940, -621, 6995, -4296, -3584, 7651, -638, -8392, 5510, 6697, -8819, -1911, 9474, -3135, -6563, 6420, 1802, -7068, 2987, 5199, -7199, -1756, 9303, -3222, -8578, 7151, 4496, -8421, 385, 6265, -4502, -2409, 6877, -2273, -7127, 6968, 5038, -9513, -645, 8993, -3406, -5053]
1322e053J0851n540n947J0231m81j2070P332R864j2769l692J3761l717r767Q743
1336A746L062j0113L790Q416r608l869J2973k748j1996R057O691j1551L45R651
1350E846n883n259R466q44j0371P517P596j2436j580J2732m657q695Q303K433
1364D168q946L947O979r516k495J2572l850j1119R185N676j0694J022Q497o305
1378h79m178R871j715j0479Q046P020j1999o49J1592n453p402Q856J498r517M607
1393g81P218r911j904J2137m863r832R892M126j1080K190Q585o975l948J0094
1407D948k572r710R015N528j2491J083J1205o652o354R343L03r319O013O176j0848
1422d332k09J1859o445q305J0402K093j0521L899P468q365k329J0473m225q813
$$ y = [-5053, 5798, 258, -5689, 4542, 4061, -8009, -677, 9187, -3582, -7274, 6487, 2770, -6997, 1746, 4808, -5305, -1515, 6901, -2707, -6576, 6397, 3649, -8347, 710, 7401, -4150, -3805, 5846, -37, -5296, 4170, 3326, -7045, 472, 8068, -4368, -5948, 6784, 2127, -6568, 1735, 4168, -4778, -831, 6148, -3368, -5863, 6709, 2859, -8260, 925, 6601, -4093, -3071, 5426, -879, -5057, 4814, 3099, -7380, 666, 7686, -4313, -4962, 6630, 1177, -6225, 2631, 4129, -5388, -781, 6437, -3474, -5378, 6759, 1896, -7936, 1956, 6082, -4998, -2808, 5777, -1198, -5146, 4948, 2376, -7334, 1681, 7209, -5282, -4199, 7006, 354, -6000, 3343, 3646, -5673, 340, 6516, -4332, -4541, 7318, 873, -7432, 2970, 5063, -5458, -1559, 5909, -2456, -4785, 5688, 1463, -7350]
1436g350R989L356j1810L185R398p915m294R717j489q781P230M692j0820J628
1450c264J0382p625n969J0410N1r626N136O164q721r12R760n331p119R970J363
1465D669j0630M483P608q104k721R259k668p748P584L383j0126K764Q701p817
1479a363m016R695j396q404N820N028q703R6Q917n919n593R522j77r088N094N964
1495E477q030j532Q778l460o941P784K264r295L544P135p668k530Q902k250p498
1510e320O237M118q701Q54Q310n978m476Q696j000q032N613M774q087p64Q649
1525D893l967o504P857J649q766L976N989p566j439Q404l054p026O938L534q963
1540d045J742P715o468l363Q424j981p081O091L898q459M28Q530n122n728Q250
$$ y = [-7350, 2639, 5995, -5815, -2630, 6768, -1147, -5441, 4276, 2787, -5994, 1236, 5928, -4892, -3264, 7118, -507, -6476, 3934, 3985, -5641, -505, 5659, -3062, -3974, 5786, 455, -6664, 3306, 4669, -5961, -1478, 6130, -1974, -4695, 4564, 1896, -5852, 1732, 5115, -5011, -2247, 6454, -1363, -5379, 4316, 2920, -5484, 336, 5364, -3339, -3243, 5674, -245, -5838, 3684, 3507, -5581, -487, 5477, -2553, -4085, 4693, 1233, -5708, 2076, 4340, -4955, -1411, 5724, -1944, -4474, 4428, 2178, -5320, 917, 5035, -3666, -2812, 5498, -480, -4956, 3740, 2740, -5292, 321, 5095, -2992, -3756, 4893, 926, -5578, 2279, 3928, -4838, -862, 5127, -2439, -3878, 4526, 1472, -5554, 1384, 4918, -4045, -2303, 5412, -1056, -4419, 4005, 2024, -5057, 1034, 4932, -3527, -3099, 5431, 309, -5419, 2831]
1555B831N03q141M700M772p692k23Q130m210o363P710K475r106K791P031o864
1570a656k123P929k941o223O756K834q683J534Q185n918m628Q285p52p293N400
1585G06L565p716R04P677n136n438Q177J170q724L846N786p167p21P303l902n132
1601d802P176J592q527K831P351o757l229Q129k035o163N934K190p526K135O832
1616E131n940m118Q284k90p912M755M336o989M44O419m578l905P228L11p918L818
1632i24O088p023j743P426k928m871N881J081o706K783N820o228k895P869j401
1647B229o708N067L045o519J322N490m788l026O890m70p221M381M862o867n94
1662b907O534l359l952N769M31o371L217N248o306k096P545k143n762N225K134
$$ y = [2831, 3334, -4807, -107, 4665, -3027, -3250, 4880, 670, -5693, 2017, 4492, -4614, -1823, 5208, -1656, -3779, 4150, 1209, -5014, 1742, 4576, -4107, -2573, 5612, -306, -4934, 3351, 2599, -4694, 706, 4271, -3445, -2541, 5136, 0, -5438, 2739, 3909, -4815, -969, 4817, -2350, -3071, 4232, 330, -4802, 2374, 3966, -4561, -1730, 5621, -1136, -4365, 3764, 1729, -4434, 1500, 3690, -3836, -1701, 5131, -809, -4927, 3357, 3067, -4845, -90, 4246, -2743, -2299, 4120, -458, -4363, 2865, 3176, -4742, -924, 5164, -1859, -3602, 3824, 896, -3975, 1906, 2987, -3719, -936, 4884, -1344, -4239, 3630, 2229, -4479, 588, 3633, -2886, -1564, 3926, -862, -3888, 3002, 2532, -4689, -308, 4554, -2313, -2907, 3627, 268, -3684, 2085, 2516, -3855, -638, 4610, -1696, -3792, 3753, 1610, -4152, 1073, 3207]
1677C207o111J785N009m996k459O821j057o794M797M035o774J50N988l733l409
1692c541N837q6o178L709M697o545j318P292k854m975N459J317n992K519M619
1707C960n412j946O996j876o191N315K898o666J330N282m465k442N973r51n971
1722d166M372L944o732r2O529l674l922N856J56n690L227M043n782j045O763k680
1738A107n278N628J690o245K264M377m852j564N999j755n480M881K944o565R15
1753a934N631m169k695N586r33n045L893L334n967k69O327l254m264N547N36n359
1769c035L002L388n130o79N846k444m886N103K076o108J674M500m436j447N237
1784B661j653m622M304K651n944M90N667l666l189N274l47m638L364K604n020
$$ y = [3207, -2904, -1119, 3890, -1106, -3565, 3256, 2199, -4595, 202, 4237, -2537, -2387, 3601, -132, -3541, 2296, 2210, -3968, -259, 4438, -2107, -3425, 3867, 1013, -3962, 1497, 2814, -3178, -659, 3960, -1452, -3398, 3598, 1722, -4469, 846, 3744, -2922, -1592, 3690, -775, -3217, 2756, 1805, -4166, 206, 4150, -2582, -2674, 3855, 181, -3741, 2115, 2271, -3419, -192, 3851, -1931, -2976, 3787, 1107, -4171, 1457, 3147, -3098, -834, 3543, -1309, -2873, 3126, 1371, -4109, 772, 3716, -2849, -1934, 3697, -472, -3167, 2419, 1486, -3559, 334, 3668, -2299, -2568, 3759, 505, -3759, 1788, 2324, -3035, -33, 3355, -1775, -2454, 3392, 948, -3938, 1165, 3241, -2867, -1193, 3307, -1129, -2576, 2661, 1008, -3614, 690, 3341, -2603, -2113, 3554, -112, -3301, 1973, 1626, -3012, 352, 2956, -2064]
1799b064ON489k888m279N232J250n487K112L578m243o73M765k273l928M596J995
1815C188n963R52N179l780k277M692j023l836L679J913n195O27N313l310l684
1830c525N202N63m934K566K784m288N3M474k665l581M793J409n723J669M460m068
1846h11j502M495j534l362L779J327n054J219M990l906l023N263Nm505K732K188
1862B301m108O74M128l243l024N196O86n672K191L909l990q78L970j979k763M086
1878A484P65n220J819M724m297k265N050p50l885L146J448m143J235L851l593
1893f31k448N355j91n218K968L056m241j32L780k395k211M143n2m891K736L892
1909C520m793j342M868j415l260L247O89l822J935L249m055j645N350r61m642
$$ y = [-2064, -2058, 3431, 543, -3736, 1496, 2746, -2741, -629, 2949, -1294, -1967, 2798, 525, -3403, 1193, 3188, -2775, -1823, 3356, -424, -2701, 1991, 968, -2868, 811, 2724, -2471, -1844, 3469, 159, -3525, 1677, 2240, -2694, -128, 2656, -1632, -1579, 2895, 230, -3351, 1442, 2851, -2872, -1203, 3257, -811, -2313, 2182, 648, -2714, 1065, 2392, -2662, -1443, 3547, -359, -3382, 1881, 1886, -2619, 113, 2301, -1807, -1133, 2995, -248, -3272, 1924, 2610, -3062, -871, 3038, -952, -1830, 2140, 161, -2602, 1484, 2249, -2971, -1152, 3572, -725, -2990, 2060, 1310, -2575, 571, 2019, -2124, -889, 2962, -631, -3079, 2276, 2085, -3133, -165, 2891, -1350, -1482, 2298, -97, -2308, 1835, 1783, -3108, -372, 3520, -1273, -2615, 2253, 838, -2422, 825, 1514, -2308, -373, 2876, -1179, -2824, 2526, 1565, -3077]
1924c077L176K290l841N75K992k676j505M226o60m551L122L103m637n20M308j952
1940C73k441L154K17l466K106K730m137q27M896j683l856L527J401l653Q98K743
1956A982k695j108L943j149l899L370K411m473L3L818k099j898K997j77l244K377
1972A89K351m133l73M486j936l220L454Q89l411J191K486k869q34L829j398l460
1988b759L462J696m250O67L473k482j649L229l67l125K488J956m173L57M112k480
2004A55k588L547L94l343J507K252l075l84L721j845l016L739R24m032J166L051
2020B173k642j209L207p33k960K776J501l984Q68L539k751j911L536j64l128J847
2036c5J933l123k2L458k259k343L725K02l695J737K482k813q69L248j128k589
$$ y = [-3077, 99, 2389, -1452, -877, 2115, -561, -2066, 2160, 1500, -3051, 71, 3174, -1463, -1983, 2325, 373, -2068, 1086, 1303, -2163, -57, 2673, -1464, -2291, 2605, 922, -2934, 593, 1994, -1659, -761, 1982, -713, -1821, 2122, 973, -2926, 444, 2855, -1618, -1585, 2233, 134, -1764, 1233, 1056, -2188, 189, 2540, -1593, -1966, 2520, 584, -2636, 818, 1707, -1704, -513, 1973, -896, -1730, 2099, 701, -2759, 703, 2399, -1851, -1184, 2289, -193, -1842, 1387, 1020, -2105, 383, 2339, -1834, -1477, 2635, 155, -2433, 1114, 1508, -1835, -328, 1924, -1151, -1535, 2186, 341, -2675, 1064, 1988, -2044, -878, 2173, -469, -1678, 1529, 796, -2164, 612, 2113, -1871, -1003, 2536, -215, -2126, 1410, 1246, -1882, -35, 1898, -1225, -1247, 2211, -48, -2391, 1334, 1536, -2159, -422, 2060, -753, -1622, 1626, 498, -2091]
2052b091K951Q72l766J471K907k948j174L288n43k852K113J627l188L26L196k495
2068c06j729L553l56l250K012J978k907l69L059j392k337L024L84l401J768K362
2084B093l044o27L252r45k700K366J306l121P20K754k623j147L379q59k792K258
2100B70J560k928q0K940j710j883K956o3k982J990J722k981j43L045j355k277
2116a919K536R18l073J081K287k598n48L022j264k280K363J178k998L15K833j982
2132a29j480K840m75k487K032J258k746J75K777j654k024K671N69k935J333J966
2148A691k604j66K709j465j917K505Q15k995O51K642k139j210K797p74k127K167
2164E80P97k709N27K663j920j791K861J33k780J571J511k558L11K358j635j702
$$ y = [-2091, 860, 1732, -2034, -563, 2344, -604, -1778, 1510, 967, -1885, 228, 1855, -1333, -1007, 2189, -306, -2035, 1518, 1162, -2088, -76, 1902, -1005, -1374, 1685, 293, -2044, 980, 1364, -2037, -269, 2093, -951, -1578, 1674, 729, -1971, 395, 1701, -1420, -700, 2054, -569, -1716, 1663, 804, -1988, 270, 1830, -1098, -1178, 1762, 52, -1831, 1125, 1062, -1920, 70, 1792, -1189, -1332, 1713, 358, -1919, 617, 1535, -1538, -457, 1830, -768, -1316, 1706, 442, -1838, 525, 1703, -1295, -980, 1853, -129, -1609, 1231, 756, -1731, 301, 1559, -1187, -1012, 1765, 111, -1913, 758, 1327, -1608, -275, 1691, -913, -1079, 1630, 165, -1752, 753, 1568, -1427, -776, 1866, -273, -1483, 1314, 540, -1587, 580, 1377, -1332, -805, 1858, -62, -1853, 1008, 1141, -1639, -68, 1443, -1115, -804, 1554, -81, -1783]
2180a783K673M13k918J128K282k298p31K632j134j776K330L91k685R53K370k124
2196b77j358K808l07k430J794J049k441N85K145j842j327K706%k803J449J893
2212A644k466j70K387j460j335K285P1k447J166K113k314r05K733p35k066K006
2228E07N37k216Q77J770j948r10K605l50k543J694J408k475L00K041j524j001
2244a228K179k01k263J435J776k408m56K527j090j603J952K72k077J015J590j926
2260e06p00K454n76k228J865R46k306N56J744j583p95K126l75k128J544J399k268
2277h31j14K267j316j247K033o3j908J159J324j963l93K393r23j875J987N85k175
2294a060Q36J431j645n89K168o66j925J660J086k292K71K024j560q70J999l45
$$ y = [-1783, 890, 1303, -1615, -487, 1795, -503, -1234, 1398, 264, -1512, 818, 1209, -1476, -523, 1847, -277, -1635, 1173, 866, -1564, 230, 1279, -1162, -577, 1568, -274, -1601, 1105, 1105, -1698, -249, 1644, -822, -992, 1395, -65, -1400, 885, 956, -1491, -325, 1788, -526, -1431, 1302, 567, -1499, 507, 1044, -1172, -295, 1475, -473, -1383, 1222, 872, -1671, 23, 1431, -1044, -744, 1297, -227, -1228, 951, 750, -1513, -78, 1698, -710, -1166, 1361, 271, -1332, 620, 892, -1185, -170, 1420, -506, -1206, 1248, 672, -1556, 309, 1255, -1051, -495, 1249, -334, -1129, 997, 622, -1506, 38, 1437, -831, -945, 1322, 6, -1241, 792, 729, -1179, -20, 1304, -659, -1052, 1341, 418, -1457, 530, 1115, -1060, -224, 1207, -438, -1027, 1141, 475, -1450, 210, 1296, -996, -725, 1299, -261, -1131, 868, 523]
2310E23j791J356J258k138j62K315j183j490K039J93k044J088J232j800k76K065
2326A185q37j789J830P51k217O23J696j642n22J879o62j625J521J039k156J51
2342g75K097j381j096J899j39j724J299R24j858m8K038r65j645J958M16k011Q32
2359a79J250j596k67J854q07j551J668Q23k183L27J876j488p17J895n29j515J375
2376B36P99j906J67J949j126j387J925Q1j780J045R33j646R9J726r68j423J784
2393E08N63k068O22J516j533m10J658p70j171J507N22j942M26J816j370j028J889
2410G35j88j499J202O06j556K43J587j102j193J805K96j943P80J192j396j73J493
2427H89q86j015J558K61j839N52J666j412q02J719m10j214J248L87j524M55J467
$$ y = [523, -1268, 88, 1346, -792, -954, 1361, 178, -1312, 727, 920, -1124, -36, 1196, -604, -880, 1185, 348, -1441, 389, 1140, -1077, -454, 1242, -400, -922, 957, 295, -1330, 191, 1230, -926, -775, 1322, -59, -1155, 744, 605, -1119, 180, 1104, -754, -802, 1236, 271, -1374, 584, 1000, -1011, -179, 1071, -525, -792, 1062, 255, -1296, 372, 1195, -988, -661, 1215, -273, -990, 905, 376, -1139, 236, 1035, -871, -704, 1245, 119, -1268, 657, 738, -1042, 3, 936, -710, -611, 1115, 147, -1276, 508, 1071, -997, -375, 1141, -392, -802, 856, 86, -1085, 422, 944, -998, -572, 1244, -126, -1154, 735, 547, -952, 250, 856, -700, -457, 1130, 28, -1165, 640, 936, -1007, -227, 965, -431, -604, 889, 3, -1012, 546, 807, -1032, -480, 1186, -226, -1028, 691, 281, -933, 315, 702, -822, -367, 1100]
2444A100j213r66J809mj714R62R57j453J26J328r73q20J522O3j741P13J487j531
2462c48n50J594m70r98J163J68j417O38J323j395p65J855k18j540J063P00j334
2479e31K63J128j085p05J693j30j660R13J259j584k71J535p00q82J221J1j343
2496h68P88J162j566n24J884m76j356J182M32j340N18Q99j082m07J558l36j500
2513a032J100R75j580oJ272p70o21J259k45j243R34R46j532k12J640o56j068J079
2531B40K84j167N54Q04j166k09J544n77j321J226O81j483K71J057q23m88J131
2548E58k54j183J083O94j543M2J490p70q65J114jj028O76O86j203o4J384o46j172
2567a002J262M56j308L09R54q81k91J118l81j089J092O02j458K01J316r19p20
$$ y = [1100, -113, -1079, 730, 726, -988, -26, 931, -522, -396, 932, -41, -861, 661, 724, -1017, -304, 1183, -348, -898, 696, 226, -772, 391, 559, -858, -220, 1103, -292, -1057, 798, 580, -960, 103, 803, -531, -268, 860, -225, -930, 763, 633, -1027, -114, 1145, -439, -710, 825, 125, -757, 464, 475, -868, -80, 1082, -484, -1008, 876, 400, -956, 226, 658, -682, -164, 735, -347, -754, 804, 468, -1032, 68, 1043, -537, -543, 729, -41, -662, 597, 352, -891, 43, 989, -543, -755, 885, 229, -839, 240, 524, -643, -89, 715, -451, -660, 884, 307, -1014, 212, 893, -590, -319, 738, -85, -573, 558, 304, -879, 204, 898, -645, -603, 887, 117, -748, 366, 365, -663, 13, 699, -504, -568, 816, 170, -1002, 260, 716, -592, -283, 671, -210, -501, 617, 236, -853, 239, 841, -617, -416, 900, -19, -739]
2584g39J200j24r98P36O11j168M1J249p41r69J354J18j268N67P95r49k24J156
2602F47m42j020J134L59j443M97J091r71m74J102j89r49Q34N12j259K22J191q71
2620b9p44J292o3j161P18O01r78p1J110o51p89J196J48j326O08Q93j037l00J145
2639E62l61q55P99M29j147L68J067j016n00J215k82r67O65O09r85l0J023o49o61
2658g16J154k6j163P36O30r47r7R41l73p91Q56L80j153M63Q78j095k35J186l70
2677B58r27Q14M96j035R6R51p88m90J190k85r91Q04M39r42pR95n49o71R31R5r96
2698f12N47P07j080l7J087n55o41Q26L04r92K12R05q64k49J070m31q06Q37L27
2717E55j005J11R15o20n31R19j5r37P01M11r56J75Q57o02n90Q97J39r21L61P32
$$ y = [-739, 461, 337, -661, 75, 686, -482, -441, 808, 67, -902, 452, 570, -698, -131, 664, -285, -509, 647, 205, -815, 319, 678, -765, -268, 823, -148, -622, 480, 291, -658, 176, 688, -571, -349, 842, -29, -773, 519, 456, -705, 13, 614, -364, -435, 675, 24, -765, 431, 579, -747, -139, 754, -283, -583, 562, 201, -654, 145, 574, -573, -205, 862, -154, -654, 561, 279, -688, -23, 586, -399, -429, 594, -55, -716, 438, 412, -751, -15, 615, -332, -429, 512, 139, -652, 204, 584, -569, -106, 772, -323, -558, 628, 258, -669, 145, 641, -394, -298, 653, -135, -625, 565, 280, -711, 93, 532, -410, -417, 578, 29, -642, 289, 384, -612, -65, 642, -438, -475, 612, 57, -584, 242, 546, -446, -234, 671, -193, -442, 628, 197, -609, 228, 555, -450, -339, 576, -44, -575, 344, 329, -608, 93, 504, -452, -277, 580, -22, -612, 285, 424, -497, -136, 596]
2737E96q00k76R88l96p06Q44J91q82K41P11n88m31Q91j31q22P23L24r52K10Q44
2757E79o21m90Q77M7r26M64O31q60k8Q48n91m24P60J77r08L17P24p08l14R10l34
2778A30o70P92R0q34M00P02p03m41Q91l0q78N76N06q70J49O84n88m04Q38L5r02
2799e27M32O61q13j46Q76l92n39Q22m1p82M18N93o70l36Q77j70q03O40K89q45
2819d56L32N62o04k62P69j47o69M52N04p81M1P02m71m06Q28j06p58M61N31p10
2839a88k57R09k95o01O31J90q07L61N04o55j65P68j69p44N26M20q04J31O99n95
2859a41k20O96k18o13N29M16p16o8Q06l70n47O72J5o35M07M23o42j21P45k32o61
2880d75N98L08q05K47N41n86q9O02j70o31N31L98p87N2O94m75l12O41p5o12M75
$$ y = [596, -204, -480, 508, 112, -594, 250, 441, -441, -200, 511, -77, -508, 383, 252, -570, 153, 477, -475, -265, 579, -42, -532, 345, 392, -534, -70, 561, -299, -327, 521, -70, -494, 266, 443, -465, -148, 576, -132, -446, 464, 130, -540, 252, 342, -492, -92, 610, -93, -534, 357, 327, -551, 25, 531, -339, -190, 494, -94, -498, 340, 375, -527, -95, 566, -247, -393, 483, 91, -448, 374, 333, -449, -31, 562, -108, -444, 433, 263, -540, 100, 389, -456, -124, 438, -166, -428, 341, 194, -475, -23, 481, -300, -259, 443, -28, -434, 394, 288, -470, -9, 522, -188, -445, 464, 169, -432, 199, 389, -418, -57, 447, -208, -373, 395, 226, -518, 8, 428, -376, -245, 454, -141, -361, 335, 117, -496, 33, 449, -267, -335, 471, 101, -446, 226, 241, -394, 13, 436, -206, -327, 418, 186, -475, 123, 431, -374, -127, 414, -172, -261, 341, 171, -460, 71, 469, -318, -266, 428, -47, -359, 282, 207, -405, 70]
2901G0L27o81k2P31k97o15O16K04p19L39L72n89J2O07k86n51O65K21p68J75O17
2922D28n48k38P43k83m64M67K70o96O1O96l76n06O21R7o18M12K40n43QO17l31
2943E7n11N94K29p18J99N85n93j50O43l16m24N24K49p50J88O28m44m09O58n1n36
2964c48N06J94o07J30N41l79m85O59J43p36L33L55n16m0N64l59k94N07J06o52
2984c78J92O13n00l17O72j83m44M71J26o00K53N21m90l68O49J02o47L65K63m95
3004a95Q4M33l49k92N54N4p34L10N37n36j76N80k51l17M41O1n48K17N37m69l46
3025d05P25p7o05L99K27m58O1M37l55k58N28L6o79L75M46o09l6M84k76k34M00
3046A26L4n04K57M70n15j83N80j11m62L96J37m95K00L98m04k06N82n4o49M29K87
$$ y = [70, 397, -284, -306, 425, 128, -487, 129, 333, -386, -47, 325, -264, -252, 355, 69, -482, 183, 404, -364, -189, 428, -120, -358, 385, 102, -362, 105, 375, -321, -260, 436, 60, -446, 175, 272, -346, 66, 306, -237, -229, 388, 57, -454, 140, 369, -349, -150, 435, -158, -308, 335, 19, -405, 119, 368, -382, -194, 434, -10, -419, 239, 188, -348, 158, 352, -255, -125, 416, 37, -448, 211, 354, -382, -49, 306, -210, -250, 314, -45, -339, 168, 274, -378, -186, 427, -73, -390, 282, 99, -345, 126, 252, -348, -95, 426, -64, -432, 217, 319, -328, 37, 300, -195, -111, 322, -27, -319, 235, 289, -445, -135, 402, -134, -310, 270, 19, -298, 143, 204, -344, -127, 410, -59, -405, 320, 243, -362, 37, 264, -194, -133, 304, -51, -309, 219, 255, -424, -49, 397, -212, -248, 236, -40, -274, 126, 160, -344, -87, 383, -132, -315, 265, 154, -308, 88, 225, -270, -70, 328, -76, -282, 300, 246, -403, 26, 313]
3067C13n14Q3L88k82k70M93o9m64L13M14o27n8N34k28l19M13M4m16K38K98m02
3088a18j44N88j84n19M15K58n18J75K91l31p6M13j42m38L64L43o06J4N70l26l20
3109b91M07l7l54K92K25m62o9O10k79m63N33J08m43J78K97l43j05M72k22m33M76
3130I7K40n75L3N20l51j93M01l3m16L35J82m24qN44l22l15M42K9m05K00K61l62
3152a20q3M22j16m48N05J39o40K45L81l11j77L86r3l35L34J11l81j3N11l29k85
3173b97M61J4m22K67J56l11lL82k28l34M94lm55K18L01l40p8M11j26k80K69K12
3195C08m82J08L82l85k04M73j10k94K53J36l56J02L51l11k08M05K2n07K79K45
3215B07l47K6L08j95k15L20J45m54J84K94l50j48M49j47k65K43J08l27R8K87k95
$$ y = [313, -201, -118, 270, -12, -282, 211, 142, -322, -9, 405, -222, -280, 254, 26, -293, 120, 164, -252, -14, 284, -118, -262, 326, 142, -377, 38, 296, -222, -47, 244, -87, -163, 250, 108, -330, 34, 377, -229, -215, 355, 29, -291, 116, 79, -275, 17, 242, -220, -289, 321, 42, -421, 112, 220, -223, -45, 252, -91, -196, 276, 54, -379, 97, 337, -238, -205, 315, -36, -229, 172, 139, -277, 58, 240, -184, -192, 352, 30, -285, 157, 186, -219, -19, 242, -120, -203, 219, 103, -345, 160, 299, -341, -96, 285, -26, -203, 183, 90, -245, 89, 200, -181, -194, 317, -12, -297, 164, 178, -244, 23, 179, -132, -135, 247, 19, -315, 179, 176, -279, -61, 240, -100, -178, 233, 107, -173, 96, 308, -174, -66, 316, -69, -273, 200, 90, -204, 49, 185, -171, -69, 282, -29, -237, 168, 190, -317, -38, 207, -140, -114, 194, -1, -216, 104, 249, -205, -21, 273, -77, -225, 224, 77, -188, 55, 163, -164, -66, 221, -74]
3236g4j80M67p0m09K96J30k83l6L51j87k64L72J3l62K39K82l83p9L94j66k04J90
3258C7J31l63J49K84l26j96N26j44l38K90J78m12Q8L32k42j85L62o8l64K91J89
3279B19l85qM31k27k48L28M0l78K22K34l76k0L97j78k77K78J03l05J7L48k44j84
3301b13L67q3k78K87R9l53O7L23k45j73L52l4l13K40J15l39J25L44l08j64K18
3322C4J71l36M5K82k69p7L43j84k65M03N8l91O1K55j79j71L55pm01K79J76l54
3344a72P5L37k60j26K18J00l88J64K54k72m7L25j75k31L26j2l37J80K61k84j70
3365b34M02j10k45K60Q1l30R1K99k95j10K90J2k80J49J97k82J3L04k13j76L32
3386A55nl17J33J73k02j00L11j12k33K96L1k86J43J93k04j53L32n2l16J61K35
$$ y = [-74, -254, 213, 143, -266, 30, 160, -123, -159, 192, 5, -259, 113, 126, -236, 3, 285, -98, -177, 217, 51, -153, 37, 168, -195, -46, 238, -88, -284, 242, 98, -240, 50, 228, -184, -96, 236, -6, -191, 171, 103, -261, 30, 219, -166, -174, 257, 30, -218, 110, 150, -228, -6, 228, -148, -168, 229, 51, -226, 52, 155, -150, -133, 215, -29, -213, 154, 71, -207, 80, 179, -174, -107, 216, -29, -202, 150, 116, -197, 43, 158, -181, -56, 288, -20, -184, 34, 205, -131, -86, 196, -73, -150, 193, 9, -256, 147, 205, -186, -125, 130, -49, -220, 135, 128, -273, 6, 182, -172, -97, 240, -20, -146, 72, 172, -216, -52, 202, -70, -117, 208, 33, -198, 128, 116, -221, -41, 220, -64, -234, 168, 58, -187, 73, 154, -176, -85, 214, -81, -191, 99, 111, -169, -20, 177, -105, -92, 212, -1, -177, 155, 150, -167, -34, 139, -63, -163, 148, 36, -197, 99, 130, -156, -13, 180, -24, -177, 155, 103, -213, -52, 183]
3407A83l01N6K28k64m7L40p3l22J61J87k22m7L09j61j75K72K5l60J92K17k94j20
3429b16L58r3k47K53N1k42P6K80l18j06L76q2l15K07J76k29o7K48p4j25J82m6
3451D7j71J52J30k07j30L35j23k34K78M4k81J96J14k95mK83q5k80K20J47k68M3
3473h9K21j46r9L03j48k11J99J44k84M5K43j17k07K55k1k53K09Q3k24JK21p8k23
3496a76K02J44l11P9K29k16k2K03j26j40K14J34l04j6K84j24k17K36j2j90J65
3517C6J2j60L8K09j07k10K09J16k69N3K37k44mK52j12k38K59Q4k95O5K44k18n3
3540i6J64k5j59K07M0k43O1J82o9k09J96O1k53J75Q2k19M6J64j13j76K95K2k99
3563a66J23J61j38j01J97o8j24K13lj85O9K68k31j61K52j3j73Q4J13k34Q4J72
$$ y = [183, -118, -62, 166, -98, -145, 195, 122, -200, -39, 148, -74, -121, 188, 27, -148, 124, 149, -211, -19, 198, -96, -216, 142, 49, -198, 55, 106, -136, -60, 220, -98, -204, 172, 90, -225, -18, 158, -71, -138, 110, 36, -89, 93, 47, -124, 28, 158, -49, -179, 156, 33, -201, 77, 121, -160, 36, 150, -145, -149, 134, 49, -231, -11, 136, -132, -89, 132, -14, -113, 190, 42, -169, 30, 174, -110, -65, 178, 61, -146, 109, 88, -165, 44, 127, -97, -96, 125, 47, -176, 26, 170, -141, -62, 167, -49, -71, 132, 6, -134, 80, 214, -90, -106, 178, 54, -163, 73, 61, -129, 36, 48, -112, -74, 135, 28, -182, 27, 143, -126, -73, 164, -80, -84, 168, 56, -182, 77, 161, -134, -69, 175, -43, -96, 68, 43, -116, 91, 131, -112, -51, 131, 62, -147, 49, 110, -143, 32, 114, -105, -59, 105, -8, -184, 111, 133, -166, -43, 118, -20, -121, 76, 8, -116, 97, 94, -91, -22, 246, 15, -146, 106, 93, -80, 4, 117, -117, -33, 139]
3585A39j61j83L18M8k82Q5K09k13k0J22q8p4J97ok92J79J96k25j38L03n5k39K61
3608H1K0j77R8J56k13r9K67j4l02J54K15k41L0J22j19q5K27p0k40J70J69k48m2
3631a41K36p5p6J20M5k01R6J23k18o5K70k9k08J32J37k01j0J55j36p4J84n8j51
3654a45J88J31k38q4K74j01j54K18l3j42J50O9k09m8K42p1k11K02O3j67N7R8j47
3677e8n2K46j12j84K03J15k86J08J56j88p2J97q0j64J82J12k67L9K46q0k04J89
3699D6M5j68J11Lj31J1K22j00j49J82P7k68N4J70j35j2J04o2j39J67J30k76Q0
3722c8J53j22j26J90k8j03R0R5k03J5J92r2j73K35R0l02O6K36k24m9K00o1j89
3745a48K05N9k86J00K45j54j43K05l9j14P1M4j45RJ98j54m0J57mj66J13P8j72
$$ y = [139, -22, -205, 113, 161, -121, -36, 173, -40, -60, 62, -26, -100, 97, 91, -201, -22, 174, -51, -189, 114, 59, -180, 81, 101, -76, 22, 178, -35, -134, 133, 119, -183, -29, 186, -55, -25, 97, -22, -107, 120, 50, -190, -20, 149, -99, -141, 95, 20, -56, 64, 109, -92, 4, 127, -91, -156, 114, 85, -123, 9, 146, -55, -65, 90, -46, -120, 64, 6, -145, 43, 174, -64, -148, 126, 25, -129, 89, 56, -86, 64, 133, -76, -124, 118, 47, -164, 38, 101, -66, -9, 89, -58, -110, 136, 24, -160, 43, 158, -128, -20, 136, -52, -124, 73, -7, -171, 11, 123, -144, -105, 141, 61, -143, 46, 91, -77, 34, 37, -94, -83, 139, 39, -110, 72, 149, -119, -65, 105, -30, -42, 62, 0, -139, 28, 158, -118, -38, 115, -7, -133, 57, 29, -74, 16, 111, -92, -77, 115, 23, -150, 85, 175, -127, -61, 175, -49, -98, 102, 41, -148, 57, 116, -170, -70, 175, 21, -122, 83, 44, -70, 1, 45, -100, -91, 107, -47, -87, 70, 66, -100, 13, 91, -81]
3768h1L1J98j38j27J70O7k73J29J31j08j06K16q4j51K02K3k13Q2J70j51j24K23
3790H6Mk67J95N6j05k8J86j10r3J72o4j19P4J07j20q0K14p4q9P3J9j31L4J72j17
3815ej02K31p1j36N1R8j61K4J68n9j49K01j7k08J80P3j96L4J68j26n9J78o6j49
3839i8J31J10j33j34K20p7r8J14M7j87Q9J26j98M6J34p1j94K04J10k04OJ50j00
3862gq3J72mk14J53J13k31K8J84p7j55J73K0j19O8J20k20J9J94j37j52J38P1j56
3886a02O6J16j9j20J52j1k17K09N1j86oK34j21j21J55Oj70O3J47j88K3J60j22
3909an0O5P3j07pJ20q6r2J34m7j11J69rj24M7J23n9j57J65k3q1O7N6j30p3K58
3935A20j06j09J08R2k16P2J29j62K9R6o7r8J46k0j65J39J30r1r7J01K5j58R4P8
$$ y = [-81, -50, 148, 10, -117, 53, 120, -153, -24, 107, -1, -107, 109, 25, -126, 76, 99, -114, -32, 138, -13, -137, 86, 90, -177, 18, 74, -31, -59, 127, 17, -76, 96, 32, -87, -13, 94, -26, -106, 108, 34, -55, 18, 37, -94, -60, 112, -5, -107, 124, 53, -83, -32, 66, -95, -71, 97, 38, -111, 90, 73, -135, 45, 118, -78, -44, 124, -2, -61, 117, 51, -98, 33, 143, 10, -124, 96, 19, -79, 35, 82, -105, -16, 110, -88, -42, 92, 21, -173, 31, 141, -63, -57, 93, -7, -90, 82, 78, -136, 17, 130, -101, -73, 111, 34, -121, 52, 72, -47, 21, 141, -79, -60, 134, -3, -155, -17, 54, -102, -36, 80, 61, -59, 93, 82, -135, 74, 125, -61, -67, 167, 46, -75, 80, 86, -84, -21, 126, -62, -39, 121, -1, -51, 14, 87, -20, -27, 93, 7, -85, 49, 2, -109, 60, 51, -73, -26, 97, 38, -119, 46, 23, -58, 9, 65, -65, -138, 120, 14, -95, 13, 105, -111, -39, 90, -72, -43, 53, -14, -112, 34, 14, -151, -12, 118, 27, -70, 31, 56, -102, -8, 70]
3959G0j49L5J68r2j25J37O4j59MJ03m3l5J28j65m5J83k1j88J08R5q8r2J32Rr7
3984f3R5M8j29K3R0j00o1J51K1j62O7J25j19MJ26j16n1J46q8o5P5R4m2n9M9j03
4010d4q5J92l9r5P9Q2j28o7J99p7n3M2L2q7M5J00r0o9J61o1j42J10R7j46l6J65
4036H5q1o3J74j19r1J25K0r0K1J06l7j53J09O1j46J14R3j67k2J63o8j37O4J44
4060A05j06n4J70q1j08J48m5j02J37J6j13j5J18o7r0P2N7q3Q3O5j91M2J64q4p5
4085c7R3K0j17NJ59j24k6J23k8j35J11O3j83P6P8m6j28J55m1p7Q8K0j19N6Q6r4
4111b2n7M6R4j47k1J95j15n4J14rj04J21N3j40O1R9p1j15J76m4j45J04J9j01J5
4136d8J21j06n8J30N9k09J25Pq2M4P8q0p3J36J3q9k4J22o3l9J22n8q1J18l9m9
$$ y = [70, -79, -44, 124, 32, -93, 44, 108, -51, -47, 56, 13, -22, 106, -59, -104, 79, 58, -130, -22, 73, -15, -107, 25, 34, -63, 32, 80, -49, -26, 64, -36, -97, 54, 75, -87, -20, 105, -14, -10, 116, 0, -51, 95, 7, -58, 17, 111, 69, 10, 59, -44, -129, 63, 24, -71, 8, 90, -38, -105, 94, 17, -36, 6, 38, -49, -4, 96, 6, -63, 98, 37, -105, 5, 102, -44, -80, 85, 4, -59, 115, -4, -95, 30, 50, -40, -19, 87, 50, -103, 6, 67, -79, 35, 128, -39, -61, 102, 34, -103, -39, 105, -1, -55, 115, 34, -74, 74, 29, -73, 64, 80, -33, -48, 70, 3, -87, -15, 42, -41, 42, 107, -84, -42, 122, 38, -37, 56, 76, -41, -36, 123, -1, -27, 96, 68, -67, 44, 107, -76, 0, 78, 32, -96, 59, 18, -59, 29, 49, -70, -14, 72, -22, -79, -33, 61, -86, -107, 88, -27, -81, 33, 24, -80, 41, 94, -46, 15, 114, 43, -72, 104, 60, -85, 19, 38, -63, -48, 73, -33, -91, 39, 98, -111, 14, 21, -61, -17, 61, -19, -92, 44, 57, -32, -56, 66, 3, -36, 86, 28, -53, 65, 26, -23]
4162b3qJ03p5q0J29K0j39M6J09j04k3R2k7n3P5n9m2M5J24j34OM9Or7R3l5o2M5
4190a9J16m4j20J46n7p8J15kj20N3Q3j00o1R5K4j17M8J16r4m3J28l5o6Q5n5k7
4216b9K9J15j22l5J53k3j47O8L2j12O6L6m1m6Q4Mj36Q4J24k08O8R0qo7J08o8j21
4243a02J70J4j31L7K6j0p6J08K9j32R7O3j04nJ04l6j32J06Q7j58Q5N5r0OK7n8
4269b0m9J19O1j97O5J02j09L1j7K3p5Q7Jm1oJ12m0r9R1On9O1lp4pL1K1o9R0L5
4299G1j32oJ05p0JN6k9p4M9R5j35K0P8m9p1R5M0j50R1N6q4M7N9o9n7O8L4q2RR8
4329F4q4j5O6n2J0J9M1j06L6Q4j11NJ23p4n2P0N6j09MR1p6n4L3J25j43N3R4r4
4357Dj5M3l6k3Q5j4r6K4Q3j9j16J44m1j11J11L6p8n5J41j5r2K5O1p7J1P7n4n0
$$ y = [-23, -31, 72, -3, -83, 46, 66, -73, -27, 82, -22, -45, 47, 20, -33, 42, -17, -59, -14, 110, -24, -18, 31, 37, -60, 33, -2, -64, -19, 97, 53, -67, 79, 22, -56, 59, 57, -63, -10, 73, -27, -88, 7, 31, -86, -38, 78, -16, -59, 69, 34, -32, 53, -2, -29, 0, 115, -7, -42, 111, 88, -59, 9, 41, -71, -5, 31, -10, -56, 28, 32, -104, -20, 104, -104, -36, 54, 46, -21, 87, 19, -102, 68, 82, -49, -12, 14, 4, -72, 36, 65, -67, 30, 93, -11, -16, 88, 52, -80, 26, 113, -45, 40, 95, 5, 11, 38, -20, -69, 50, 111, -86, -21, 81, -28, 3, -14, 9, -66, 21, 22, -19, -25, 87, 47, -52, 39, 45, -14, 47, 44, -30, -37, -6, 15, -54, 36, 71, -61, -67, 38, -32, -31, 25, -4, -78, -29, 66, -69, -49, 29, -20, -91, 4, 44, -106, -15, 41, -43, 4, 63, -6, -63, 5, 39, -43, -34, 64, -20, -35, 31, -21, -11, 8, 49, -57, -21, 63, -48, -43, 80, 6, -46, 24, 80, -29, -25, 66, -10, -64, -31, 94, -49, 4, 98, 4, -11, 32, -4, -27, 58, 44, -52, -28, 55, 36, -80, 64, 23, -88, 23, 59, -19, -74, 67, 52, -40, -15, 46, -31, -20, 57, 3, -47]
4385d7P8j8n5O1J9r2L7J08j38K9O2Lp1M4Q4j20O4M9p8p7Q8J3j42Q6M0p2NN5j09
4414i4k4J25J7q9M9J31j05j04J44l5o1RQ7j04R0K9r2n0J11lm8J6L8j9m3O7o5q
4442c1N2J1r1Q0P9j15m6J51p1m8P2pp4N3P5q7m8J22o3o5P9J2q2QO2Jm1J11p8q0
4472e9R1M4p6m3O3l9qO3M9j39P2L3k9p9J25p2o3J24k5r4M1N6jm8R5q4m4P2N5j48
4502f8O7J8j0j32J35Pq1J08nm5n0J44o0q3Q9J3j25Q6Q4o9n9Q6m2n7J00nj31O6
4530a9M6j0l1P6l7o2P1K4j26R2M5m3r7R6Qj02J04k5k9KR8p7kL3O7j30pJ03n6k7
4560a5R2n0j36J60J3j19R0Pn1m1J38o5n8K3P1n7pN4o3j4N7K5q5K3L2n9K8Q2r3
4589a8l8P6Qj29J39Oj2q8L7N3r9R9lm9L3R6j27n0J47m6k6OK7m4K6L8r4k5Q4jq4
$$ y = [-47, 31, 13, -42, 19, 38, -54, -17, 91, -47, -18, 44, 47, -24, 20, 104, -16, 48, 97, 19, -58, 30, 43, -99, -13, 27, -45, -40, 15, -94, -118, 7, 24, -65, -16, 115, 10, -94, 50, 15, -46, -37, 50, -54, 36, 65, -27, -77, 34, 31, -17, -1, 37, 18, -25, 42, -23, -31, 21, 32, -59, 21, 100, -15, -61, 90, 19, -29, 43, 36, -38, 15, 90, 3, -45, 77, 14, -51, 28, 40, -42, -34, 28, 29, -12, 99, 21, -59, 32, 76, 0, -43, 20, -19, -27, 36, 85, -54, 18, 51, 22, -57, 68, -4, -67, 57, 32, -62, -21, 35, 34, -14, 81, -3, -47, 25, 80, -68, -1, 17, 7, -125, 10, 17, -64, 44, 39, -6, -56, 88, 28, -55, 34, 47, -78, 8, 92, 23, -36, 50, 8, -49, 51, 46, -85, -19, 27, 17, -14, 62, 25, -37, 34, 58, -68, 24, 69, 26, -71, 25, 33, -69, 35, 10, -19, -17, 81, 4, 2, 35, 102, -28, -35, 68, 12, -15, 77, 27, -109, 51, 64, -55, 35, 42, -9, -50, 88, 23, -35, -12, 59, 2, -5, 49, -14, -28, 29, 54, -31, -8, 24, -35, -7, 75, -18, -56, 20, 28, -101, 38, 44, 32, -56, -19, 34, -65, 34, 31, -18, 15, 111, -16, -66, 81, 35, 9, 15, 42, -2, 24, 62, -32, -57, 27, 26, -58]
4620e8L4O5r5K1N2j5q5N3N0n7N6Lo8j6J22l1m8K6J9r6N9O0n3l5O6J9q9L5N4m3
4650EJP0o2l6O2J3p5K1R8j02q2J49r8o0J40O3j21qP1m9p8J30j09nM2N2r5K9P7
4679D3p7j3M6M6p1nJ05j01jR0n7o3Q8L2p6j9J30q5K0N5j06k7R1j2n6OP9o9j8N5
4709C0k9r1J38k3p8j2J45p2o8O0L0m0j0P2n7kQ0p4o4P4N6p8J5L9p1N4L7l0p0R6
4739E7rp3N6j8Kl6K5J4l2L8L6r5k9P3m9j7O7j5J0m2N2rl8L5jl9Q0k6o7L3O0k0
4771B3q4J03o0%P2Mq8RO6o4J5N6K5j08M9K7k9m5Q4q5L0K7mj03P9JK2m1O5lp3K6
4803dj5m3M3O8r2M5N3p0j1k8P9l5OQ9j33M0M3L6j74R1N3m3j5O1oj36J58o1p7J7
4833f1O3Nk4M6j4k1M0jo2mP5l3o0O2k0m7K9J20q1k2R0q8L8l0L0o6l5J49q4QM0
$$ y = [-58, -24, 41, -54, -33, 19, 4, -81, -28, 22, -35, 21, 24, -44, -60, 62, 31, -17, 9, 28, -68, -9, 51, -2, -37, 29, 48, -41, -6, 48, 5, 6, 76, 14, -22, 40, 53, -22, -1, 97, -5, -87, 62, -36, -96, 44, 107, -14, -22, 49, 0, -78, 52, -57, -62, -20, 32, -63, -34, 43, -34, -47, -1, 45, -26, -31, 74, -27, -28, 62, 5, -58, 30, 62, -14, -33, 97, 12, 32, 87, -19, -46, 45, 33, -23, -17, 62, -7, -25, 30, 1, -90, 48, 25, -53, -65, 80, 8, -60, 0, 30, -10, -20, 52, -5, -7, 73, -1, -65, 9, 65, -13, 2, 41, -30, 24, 61, 31, -39, 57, 48, -25, 31, 13, 15, -21, 4, 18, -14, 24, 60, -35, -64, 9, -40, -57, 10, -5, 5, -37, 15, 6, -32, 3, 2, -37, 43, 17, -50, -17, 43, 23, -61, 42, -18, -18, 54, 58, -30, -21, 45, -19, -4, 52, 77, -31, 18, 45, 16, -29, 55, -30, 0, 27, 23, -80, -1, 0, 22, -19, 46, 43, -30, -4, -19, -62, -19, 49, -43, 2, 55, -15, -26, -54, 25, -10, -4, 85, -48, -8, 35, 71, -103, -12, 41, -2, -17, 44, 38, -98, 60, -1, -78, -61, 2, 7, -17, 29, 15, -6, 34, 33, -29, -33, 42, 9, -51, 11, -9, -56, -27, 93, 12, -10, 80, -8, 30, 0, 30, -36, -71, 78, -6, 2, 42]
4864D2k1MJ2l2nQL7p9L4J9k8m7N8L1k0l2K5RJ3n0L3j9j0J01j10pR2l5p2M9J6l2
4896a6MJ6j3lM7mm9N2mj29J47K7q3J8N4r0j2K1N9q3K7P0p8JN8k3n0L9J5n6k4R6
4928C4l7o0Q9j1r0K8N7j9j2jmQR9o3p2J12Nn9k5M1k0n5N3J8o1K6N4m8o4J89j12
4959@l4K2L7o9K3P2l6l1k0M1m1rO2l4m2R1p9J0N3J9o5L0L3o8J3K6ml1l0P6l9K2
4991bk9M2k5P7j01J7M9kl7k0L1j6RJ0M9r0M4M3o9nN6o7J7J6J2j5j1L5m3j6O2M0
5023F1j21O3L4j01P8m8Q2o1O3k0l8L5J5m0p2R8n3J4rR3r0K5Rm0j4R9k1j08R9k5
5053Gp6Q3l9j2mnM3k4K7J5ln5R8n6k7P2m0o9R0K1q6J2Q3J0r6M7L7q1N6mj9j7L0
5086A8K5m1J2J1n2O6l9J1k7N5k4lo9P0j9n8Q2kn1M2J4p5LN5K9o4M7L1j04R1n4
$$ y = [42, 21, 25, 37, 5, 0, 8, 45, -34, 0, 19, -9, -56, 2, 33, 13, -19, 6, 15, 28, -22, 11, -8, -18, 83, -27, -34, 58, 23, -49, 0, 16, -16, -12, 4, -9, -12, 35, 31, -18, 34, 30, -99, 48, 75, -8, 10, 64, -26, -38, -17, 42, -41, -14, 56, -22, -21, 37, 14, -36, 3, 18, -38, -62, 34, -3, -63, 26, 15, -75, -47, 10, -9, -21, -22, -26, -18, 81, 18, -54, 58, 63, 4, -21, 20, 0, -55, -2, 16, -45, -19, 35, -13, -77, 112, 0, -34, -12, 25, -44, -21, 51, 15, -16, -36, 5, -36, -45, 17, -17, -59, 32, -47, -37, 16, 35, -30, 0, 33, -35, -22, 4, 0, -31, -61, 15, -24, -2, -31, 11, -14, 63, -38, -21, 28, 26, -11, -31, 0, -16, -7, 3, 52, -38, 6, 49, -20, -25, 31, -36, -19, -3, 9, -6, -17, 18, -25, -41, 21, 61, -60, 3, 37, -64, 14, -34, 48, -13, 50, 30, -8, 27, 42, 2, -70, 28, -25, -11, -20, 73, -17, 8, 17, -23, -37, 62, 41, -67, 32, 7, -69, 14, -25, -37, -41, -46, -3, -27, 0, 15, 12, -43, 55, -1, -28, 44, 4, -65, 25, 46, -40, -28, 55, 65, -31, 16, 53, -28, 28, 24, 5, -12, 18, 43, 2, 14, 25, -27, 39, 0, 11, -16, 39, 15, 12, -57, 13, -6, -64, 18, 16, -35, 7, 21, -54, -51, 4, 33, -31, 16, 47, -57, 34, -20]
5117b0JjL7l5K0J8jOl5O7o6j5Q2m6m5O1j5J6k8M4p7RM1mk2L2J4o3PP3q6J6%M3
$$ y = [-20, -19, -20, 17, -18, 2, 20, 19, 25, -10, 57, -9, -24, 58, 12, -33, 28, 13, 29, 1, 45, -32, -23, 18, 14, -8, 24, 38, -25, -18, 55, -31, -15, -15, 28]
$$ [...]
8191b5
##END NTUPLES=NMR FID
##END=
