##TITLE=1H_Pr 56-2
 CDCl3
 8 sc, 
 27.10.2022
##JCAMPDX= 6.0         $$ Bruker NMR JCAMP-DX V2.0
##DATA TYPE= NMR FID
##DATA CLASS= NTUPLES
##ORIGIN= UXNMR, Bruker Analytische Messtechnik GmbH
##OWNER= root
$$ XWIN-NMR		Version 3.5
$$ Thu Oct 27 14:47:57 2022 Russian Standard Time (UT+4h)  she@DPX200
##.OBSERVE FREQUENCY= 200.1313499994
##.OBSERVE NUCLEUS= ^1H
##.DELAY= (6, 6)
##.ACQUISITION MODE= SIMULTANEOUS
##.ACQUISITION SCHEME= undefined
##.AVERAGES= 8
##.DIGITISER RES= 18
##SPECTROMETER/DATA SYSTEM= spect
##.PULSE SEQUENCE= zg30
##.SOLVENT NAME= CDCl3
##.SHIFT REFERENCE= (INTERNAL, CDCl3, 0, 15.7039)
##AUDIT TRAIL= $$ (NUMBER, WHEN, WHO, WHERE, WHAT)
$$ ##TITLE= Audit trail, XWIN-NMR		Version 3.5
$$ ##JCAMPDX= 5.01
$$ ##ORIGIN= Bruker BioSpin GmbH
$$ ##OWNER= she
$$ F:/spectra/data/she/nmr/H-F/1/audita.txt
$$ ##AUDIT TRAIL=  $$ (NUMBER, WHEN, WHO, WHERE, WHAT)
(   1,<2022-10-27 14:47:04.15 +0400>,<she>,<DPX200>,
      <created by zg, POWCHK disabled, PULCHK disabled
       configuration hash MD5:
       00 E9 B6 7A A2 85 ED C7 34 08 36 98 17 FE 4E 26
       data hash MD5: 16K
       7F 61 03 58 B0 BF BD 71 25 24 0B FB D7 58 51 12>)
$$ ##END=
$$ 
$$ hash MD5
$$ 1D 4D D2 FC FB 67 A5 19 66 A4 FC 64 4E DE F9 02
##$RELAX= 
##$RELAX= 
##$RELAX= 
##$RELAX= 
##$RELAX= 
##$RELAX= 
$$ Bruker specific parameters
$$ --------------------------
##$DU= <F:/spectra>
##$EXPNO= 1
##$NAME= <H-F>
##$PROCNO= 1
##$TYPE= <nmr>
##$USER= <she>
##$AMP= (0..31)
100 100 100 100 100 100 100 100 100 100 100 100 100 100 100 100 100 100 
100 100 100 100 100 100 100 100 100 100 100 100 100 100 
##$AQSEQ= 0
##$AQ_mod= 1
##$AUNM= <au_zg>
##$AUTOPOS= <>
##$BF1= 200.13
##$BF2= 200.13
##$BF3= 200.13
##$BF4= 200.13
##$BF5= 200.13
##$BF6= 200.13
##$BF7= 200.13
##$BF8= 200.13
##$BYTORDA= 1
##$CFDGTYP= 0
##$CFRGTYP= 5
##$CHEMSTR= <none>
##$CNST= (0..31)
1 1 145 1 1 1 1 1 1 1 1 1 1 1 1 1 1 1 1 1 1 1 1 1 1 1 1 1 1 1 1 1 
##$CPDPRG= <>
##$CPDPRG1= <>
##$CPDPRG2= <>
##$CPDPRG3= <>
##$CPDPRG4= <mlev>
##$CPDPRG5= <mlev>
##$CPDPRG6= <mlev>
##$CPDPRG7= <mlev>
##$CPDPRG8= <mlev>
##$CPDPRGB= <>
##$CPDPRGT= <>
##$D= (0..31)
0 1.2 0 0 0 0 0 0 0 0.06 0 0.03 0 0 0 0 0.0002 0 0 0 0 0 0 0 0 0 0 0 0 
0 0 0 
##$DATE= 1666867623
##$DBL= (0..7)
120 120 120 120 120 120 120 120 
##$DBP= (0..7)
150 150 150 150 150 150 150 150 
##$DBP07= 0
##$DBPNAM0= <>
##$DBPNAM1= <>
##$DBPNAM2= <>
##$DBPNAM3= <>
##$DBPNAM4= <>
##$DBPNAM5= <>
##$DBPNAM6= <>
##$DBPNAM7= <>
##$DBPOAL= (0..7)
0.5 0.5 0.5 0.5 0.5 0.5 0.5 0.5 
##$DBPOFFS= (0..7)
0 0 0 0 0 0 0 0 
##$DE= 6
##$DECBNUC= <off>
##$DECIM= 32
##$DECNUC= <off>
##$DECSTAT= 4
##$DIGMOD= 1
##$DIGTYP= 9
##$DL= (0..7)
0 120 120 120 120 120 120 120 
##$DP= (0..7)
150 150 150 150 150 150 150 150 
##$DP07= 0
##$DPNAME0= <>
##$DPNAME1= <>
##$DPNAME2= <>
##$DPNAME3= <>
##$DPNAME4= <>
##$DPNAME5= <>
##$DPNAME6= <>
##$DPNAME7= <>
##$DPOAL= (0..7)
0.5 0.5 0.5 0.5 0.5 0.5 0.5 0.5 
##$DPOFFS= (0..7)
0 0 0 0 0 0 0 0 
##$DQDMODE= 0
##$DR= 18
##$DS= 0
##$DSLIST= <SSSSSSSSSSSSSSS>
$$ [...]
##$SUBNAM2= <"">
##$SUBNAM3= <"">
##$SUBNAM4= <"">
##$SUBNAM5= <"">
##$SUBNAM6= <"">
##$SUBNAM7= <"">
##$SUBNAM8= <"">
##$SUBNAM9= <"">
##$SW= 18.0517283424941
##$SWIBOX= (0..15)
0 0 2 0 0 0 0 0 0 0 0 0 0 0 0 0 
##$SW_h= 3612.71676300578
##$TD= 16384
##$TD0= 1
##$TE= 0
##$TE2= 300
##$TE3= 300
##$TEG= 300
##$TL= (0..7)
0 120 120 120 120 120 120 120 
##$TP= (0..7)
150 150 150 150 150 150 150 150 
##$TP07= 0
##$TPNAME0= <>
##$TPNAME1= <>
##$TPNAME2= <>
##$TPNAME3= <>
##$TPNAME4= <>
##$TPNAME5= <>
##$TPNAME6= <>
##$TPNAME7= <>
##$TPOAL= (0..7)
0.5 0.5 0.5 0.5 0.5 0.5 0.5 0.5 
##$TPOFFS= (0..7)
0 0 0 0 0 0 0 0 
##$TUNHIN= 0
##$TUNHOUT= 0
##$TUNXOUT= 0
##$USERA1= <user>
##$USERA2= <user>
##$USERA3= <user>
##$USERA4= <user>
##$USERA5= <user>
##$V9= 5
##$VALIST= <valist>
##$VCLIST= <CCCCCCCCCCCCCCC>
##$VD= 0
##$VDLIST= <DDDDDDDDDDDDDDD>
##$VPLIST= <PPPPPPPPPPPPPPP>
##$VTLIST= <TTTTTTTTTTTTTTT>
##$WBST= 1024
##$WBSW= 4
##$XGAIN= (0..3)
0 0 0 0 
##$XL= 0
##$YL= 0
##$YMAX_a= 261239
##$YMIN_a= -321762
##$ZGOPTNS= <>
##$ZL1= 120
##$ZL2= 120
##$ZL3= 120
##$ZL4= 120
##$ABSF1= 10
##$ABSF2= 0
##$ABSG= 5
##$ABSL= 3
##$ALPHA= 0
##$AQORDER= 0
##$ASSFAC= 0
##$ASSFACI= 0
##$ASSFACX= 0
##$ASSWID= 0
##$AUNMP= <proc_1d>
##$AZFE= 0.1
##$AZFW= 0.1
##$BCFW= 1
##$BC_mod= 2
##$BYTORDP= 1
##$COROFFS= 0
##$CY= 11.3945322036743
##$DATMOD= 1
##$DC= 2
##$DFILT= <>
##$DTYPP= 0
##$F1P= 2.36226072786647
##$F2P= -0.459571619588291
##$FCOR= 0.5
##$FTSIZE= 0
##$FT_mod= 4
##$GAMMA= 1
##$GB= 0.15
##$INTBC= 1
##$INTSCL= 1
##$ISEN= 128
##$LB= 0.24
##$LEV0= 0
##$LPBIN= 0
##$MAXI= 10000
##$MC2= 0
##$MEAN= 0
##$ME_mod= 0
##$MI= 1.114404
##$NCOEF= 0
##$NC_proc= 0
##$NLEV= 6
##$NOISF1= 3.799351
##$NOISF2= 2.8
##$NSP= 1
##$NTH_PI= 0
##$NZP= 0
##$OFFSET= 15.70392
##$PC= 1
##$PHC0= -18392.89
##$PHC1= 13.2007
##$PH_mod= 1
##$PKNL= yes
##$PPARMOD= 0
##$PSCAL= 0
##$PSIGN= 0
##$REVERSE= no
##$SF= 200.130013532006
##$SI= 16384
##$SIGF1= 3
##$SIGF2= 2
##$SINO= 400
##$SIOLD= 16384
##$SREGLST= <1H.CDCl3>
##$SSB= 0
##$STSI= 0
##$STSR= 0
##$SW_p= 3612.71676300578
##$SYMM= 0
##$S_DEV= 0
##$TDeff= 0
##$TDoff= 0
##$TI= <>
##$TILT= no
##$TM1= 0
##$TM2= 0
##$TOPLEV= 0
##$USERP1= <user>
##$USERP2= <user>
##$USERP3= <user>
##$USERP4= <user>
##$USERP5= <user>
##$WDW= 1
##$XDIM= 8192
##$YMAX_p= 0
##$YMIN_p= 0
$$ End of Bruker specific parameters
$$ ---------------------------------
##NTUPLES= NMR FID
##VAR_NAME=  TIME,          FID/REAL,        FID/IMAG
##SYMBOL=    X,             R,               I
##VAR_TYPE=  INDEPENDENT,   DEPENDENT,       DEPENDENT
##VAR_FORM=  AFFN,          ASDF,            ASDF
##VAR_DIM=   8192,          8192,            8192
##UNITS=     SECONDS,       ARBITRARY UNITS, ARBITRARY UNITS
##FACTOR=    0.0002768,     1,               1
##FIRST=     0,             0,               0
##LAST=      2.2672688,     0,               0
##MIN=       0,             -321762,         0
##MAX=       2.2672688,     261239,          0
$$ Real data points
##PAGE= N=1
##DATA TABLE= (X++(R..R)), XYDATA
0@%%%%%%%%%%%Qj6J6k0K8l2M0n6O4p2Q9j12J35j54J78k09K44k83L26l75M28m85
33b58N51o23P03p93Q89r94J110j239J380j532J698j878K076k292K528k788L073
50A611l387L731m108M529n001N530o128O809p594Q512r602J0919j2545J4617j7361
65i468K1190k6940L6625n7005J74400k53499j58085N14903j67746k98975K92080
76F7480J14053l80113J55454L04365l20060j95329L95527J886l31922J55922K19486
87A86749k65705n3504K67494r1864k11643K00327R8399k22057L0640J97505j50034
98a3693j29542K14545M9858k23002L9027J79131j00526r8873J30101j0350j28374
109i1698J11758R9663j83162m5027K03999k5455j79772Q4984J07756j19908p906
$$ plain form
0 0 0 0 0 0 0 0 0 0 0 0 0 8 -8 8 -12 16 -16 24 -32 32 -40 49 -63 72 -82 96 -113 131 -152 174 -201 227 -258
33 -258 293 -330 373 -420 469 -525 585 -654 726 -806 892 -986 1090 -1202 1326 -1462 1611
50 1611 -1776 1955 -2153 2376 -2625 2905 -3223 3586 -4008 4504 -5098 5821 -6724 7893 -9468
65 -9468 11722 -15218 21407 -35598 138802 -114697 -272782 242121 74375 -224600 67480
76 67480 181533 -198580 -43126 261239 -58821 -254150 141377 143263 -188659 -32737 186749
87 186749 -78956 -132460 135034 43170 -168473 31854 130253 -91804 -61164 136341 -13693
98 -13693 -143235 71310 121168 -101834 -62807 116324 15798 -83075 47026 36676 -91698
109 -91698 20060 119723 -63439 -108466 95533 70078 -109694 -24710 83046 -36862 -44768
120d4768J22975q8548r0518J52251K6852j68795M8876J41770j06290p3617J34008
131E4196r196j22954P8310P8984j10632j1600J06169n5717p1435R9312J7943j15311
143f1931L1747J02037o3791o7936O8503J9819n6070K3991L1413n5890k643P4038
155D3287k2381p7793L9523O7477m5957m2359N0603J1626m7150K3099L4501n3345
167a8869j0837P3507j9093p3372N0476M9960p6950j2264Q4165l1912o9238O7764
179A3337L0584q4622J7635P0957o4885l3024R5411j6456r6919O2571P0077r0035
191b5369k1786R0310k8694n9922P0621J2620q7876L7309P9572p5733m7054R2199
203C6197L209q2991L6717N1256o5550r706P2277l2050n9875O2250K9705p7473
$$ plain form
120 -44768 78207 -10341 -100859 51392 78244 -90551 -41675 100095 -6195 -79812 54196
131 54196 45000 -77954 356 79340 -31292 -42892 63277 7560 -63875 35437 53380 -61931
143 -61931 -30184 71853 8062 -59874 8629 28448 -27622 -3631 27782 -28108 -30751 43287
155 43287 20906 -56887 -17364 50113 4156 -38203 12400 24026 -23124 -25 34476 -18869
167 -18869 -29706 43801 24708 -48664 1812 51772 -25178 -37442 46723 14811 -54427 13337
179 13337 43921 -40701 -23066 47891 -16994 -50018 45393 28937 -67982 -5411 64666 -25369
191 -25369 -47155 43155 14461 -45461 25160 37780 -50096 -12787 66785 -8948 -56002 36197
203 36197 39406 -43585 -6868 44388 -21162 -30868 41409 9359 -50516 11734 41439 -36034
215c6034N991P3025m0013n1365O4108J9491p1202J7387N9865m7934l0815O8508
227C1012n973o9727M4462N3898p2660k1669Q2173j7210o8818N1391L5297p2567
239c0391Q019P1021n1992m8773P9791J0076q6033L1133O6350o4362k8005P7442
251C4276j6490o6684N5315L6904p5646M609P3885m1610n0316O7225J5116p1690
263c5106K2648N6496n0745k6431O2614q682n7218L8523L6034n7942q547O0234
275C1878k0882m8919M2652K4772n3241L507N0029l0196l4344M8990J0778n5144
287c0120J7186M8170l9692k7417N3831M95n2988K8163L8588m8722j2987N6562
299C1069j7006m8603M2051K6515n6877K526N4184l1666l7744N0816Q875n6148
$$ plain form
215 -36034 -30043 42982 2969 -48396 15712 35203 -35999 -18612 41253 -6681 -37496 31012
227 31012 25039 -44688 -226 53672 -18988 -40657 41516 24306 -44512 6879 42176 -30391
239 -30391 -22372 48649 -3343 -52116 27675 37751 -48282 -17149 49201 -15161 -43166 34276
251 34276 17786 -48898 6417 43321 -32325 -27716 46169 4559 -45757 21468 36584 -35106
263 -35106 -12458 44038 -6707 -33138 29476 20794 -36424 2099 38133 -19809 -28356 31878
275 31878 10996 -37923 4729 29501 -23740 -20233 29796 -400 -34744 14246 25024 -30120
287 -30120 -12934 35236 -4456 -31873 21958 22453 -30535 -2372 36216 -12506 -25493 31069
299 31069 14063 -34540 7511 34026 -22851 -20325 33859 2193 -35551 15265 24140 -32008
311c2008K1136M4371m5057k0270N5492q669m9791L4994L0804m9210k558N0195
323B9429k3389l6581M3148J4114m9296J1909M2398l2614k5060M3804J711m4110
335b4537K0524L2094l7747j3209M3586r755l9565K9118K4068m1013l925M2674
347B2313j7418l3510L4850J5654m2316P100M0065k7469k5277M1931M797m4561
359b3841J8376L5330l5817j6503M4084p259m0307K8441K4230m1933k783M3442
371B5460k1029l3360L7470J3016m4193R739L7597k9225k1141M0411n09l9569K2272
384c061K8372l6723q800M2061j1637l5102K9711J9686l8215M97L7492k0155k6196
397b2070L3858P808l9008J1349L3287k9313j9639L8227J1l8125J8708K7327l3227
$$ plain form
311 -32008 -10872 33499 -11558 -31828 23664 14995 -34796 198 31002 -18208 -20766 29429
323 29429 6040 -30541 12607 26721 -22575 -10666 31732 -882 -25942 17862 19573 -24537
335 -24537 -4013 28081 -9666 -22875 20711 10956 -28609 509 24577 -16436 -20361 22313
347 22313 4895 -28615 6235 21889 -20427 -13327 26738 -731 -26008 15923 20720 -23841
359 -23841 -5465 29865 -5952 -22455 21629 14370 -25937 2504 26734 -15199 -17982 25460
371 25460 4431 -28929 8541 21557 -22636 -12897 24700 -4525 -25666 14745 14236 -25333 -3061
384 -3061 25311 -11412 -20212 21849 10212 -24890 4821 24507 -13708 -13211 24281 4126 -22070
397 -22070 11788 19596 -19412 -8063 25224 -4089 -23728 14499 14510 -23615 -4907 22420 -10807
410a0807r442L8031j0575l2858K8980J8555l8817J791L9417k1083k7913L5359
422A0638J0503l9673J1075L3013k8694j6689L8345m781l7484K4615K5379l8117
434a1870p544M0245j3341l2158K8899J4769l7282O154L3878k5085k1273L7121
446A2513L332l9028J6609L1047l1115j3726L7746n305l2850K3031K0197l4126
458a1675r54L5482j8470k7586L3001J1968l9582O006L4728k2792k1260L1849J480
471A2195l2729J7691K4389l3570q953M0087r604l4966K5422K1773l3762k365L4151
484A9759j7021k3348L1709P038l6432J1924L1743k8220j7630L6516o47l6150J7953
497b806K5053l0043q500L2310j1158k6139K7308J1801l7113N681L6147k1161k6654
$$ plain form
410 -10807 -20249 17782 7207 -25651 3329 21884 -16933 -15142 24275 3192 -24721 10638
422 10638 21141 -18532 -7457 25556 -3138 -19827 18518 13737 -23747 868 26247 -11870
434 -11870 -19414 20831 7490 -24668 4231 19000 -18282 -12128 21750 -3335 -24608 12513
446 12513 15845 -23183 -6574 24473 -6642 -20368 17378 12073 -20777 2254 22451 -11675
458 -11675 -12629 22853 4383 -23203 9798 21766 -17816 -11810 22918 126 -21134 10715 12195
471 12195 -20534 -2843 21546 -12024 -20977 19110 9506 -25460 -38 21735 -12027 -14392 19759
484 19759 2738 -20610 11099 18137 -18295 -6371 25372 -2848 -20478 16038 15391 -20759 -2806
497 -2806 22247 -7796 -16296 16014 4856 -21283 6025 17826 -19287 -13606 22541 1380 -25274
510b5274L1466J0425l2125Q581K4698k4183r002L3458p860l2999K3910K4278l3642
523h269q217L4769j0162k6342K3721J1666l1390N573K8870k2212j8750L2162K291
536A3710l4411J4140K7698k7069j4499L2184j882k7611J7359J5580k7277K025
548a0053L0334j8141k5090L1213J3660l4874J418K9420j5003j6604K4375j055
560I600k6474J7571K0481l0429r188L4145n648k9542J7477J8085k6137k305K6779
573A4415j3372j9346K4926O040k8886J0018K5689k2521j5649L0742L013l0356
585a5287J0667K1942j9990p492K3623r365k0445K3459J1410l2547pL2273j1805
598F436k4785J9617R991k2083N929J8322k0584q667K8723l002k8968J4852K2547
$$ plain form
510 -25274 6192 16617 -15508 -6927 17771 -6412 -15414 18044 10184 -22815 1095 25373 -8269
523 -8269 -16486 18283 8121 -18221 5500 17166 -14224 -8651 20219 -1993 -20743 11419 13710
536 13710 -20701 -6561 21137 -5932 -20431 11753 9871 -17740 -381 15199 -12078 -10053
548 -10053 20281 2140 -22950 8263 21923 -12951 -11533 17887 2884 -13720 10655 9600
560 9600 -16874 697 21178 -9251 -18439 15706 10058 -19484 -2007 16078 -10059 -12364 14415
573 14415 1043 -18303 6623 12663 -16223 -6205 19484 -3037 -18686 12056 15069 -15287
585 -15287 -4620 17322 -2668 -10160 13463 4098 -16347 7112 18522 -14025 -14032 18241 6436
598 6436 -18349 1268 11259 -10824 -4895 13427 -7157 -15824 12899 9897 -19071 -4219 18328
611A8328k3099r471K6017m277k1761J6696J2350k3663J788K3458j5075j6762K5012
624I541M699k9224P577K5381j7698j6219K2163K018k0512J1801J2618k3236j105
637a2196K8120j1020k5495K0664J6852k4423l351K2203r597j3962K0687K188k4480
650a3810J0881K1892k1396j2527K6046Q5k4786J1671J6865k0488n422K2301p737
663C575j7761J7881P504k4058M525K3875j6089j7382K2628P533k3134M884J7504
676A1485j4710o401K1224o155k1185J8255J5398k4745n267K5244o117j9068J5349
689C307P902k0596M787J8917j6787j2092K2942J325k4277R770J9060j8957q647
702a3346K2178l054j9437J3736J1026j9934J427K0832j2343j5691K1477O664k3571
$$ plain form
611 18328 -4771 -14242 11775 7498 -14263 2433 14783 -8880 -7092 16366 1291 -15471 9541
624 9541 14240 -14984 -7407 17974 276 -15943 6220 8238 -12274 -473 12145 -11091 -12196
637 -12196 15924 4904 -20591 73 16925 -7498 -10849 11354 1757 -12205 8482 10670 -13810
650 -13810 -2929 18963 -2433 -14960 11086 11171 -13615 -1944 14921 -5567 -10989 11312 3575
663 3575 -14186 3695 11199 -12859 -8334 15541 -548 -17930 4698 12231 -10903 -6019 11485
676 11485 -3225 -9626 11598 5443 -15742 2513 17911 -6834 -12101 13143 7026 -12042 3307
689 3307 11209 -9387 -4600 14317 -2470 -14562 8380 9705 -14572 -4802 14258 -4699 -13346
702 -13346 8832 5778 -13659 77 11103 -8831 -7404 13428 1085 -14606 6871 13535 -10036
715a0036L710K0392j3048j1534J8266q07j7869J2163J2305k0853l516K2700o382
728E491j9737J4386J0770j8750k42J7772j0645j1645J8404K283j9900Q094J6764
741A3045j5845q627K0412j144j8924J0876J2128j6512k533J8174p753j4132J5411
754D576O564j9957K683J8373j1590j2893J6602L104j7147O367J2923j4267n062
767i724J7754l654j6685J1910J1348j6724k297J7260n828j3130J3226N824j6080
780f800L123J4885j0994r581J5982J414j7092O863J2938j3287o278J5643k313
793D503j4530J0010Q658j5048j306J6217o975j2956J3798O145j5910J789J5066
806I461r434r250J4775J788j5486O772J2540j3371n643J6078k304j5089R711R472
$$ plain form
715 -10036 -6326 14066 1018 -10516 7750 6943 -10926 1237 13542 -7311 -10827 11873 5491
728 5491 -14246 140 10910 -7840 -8082 9690 -955 -12600 5804 8087 -11813 -3719 13045
741 13045 -2800 -11427 8985 7841 -11083 -207 11921 -4591 -7124 11050 3297 -10835 4576
754 4576 11140 -8817 -6134 12239 649 -12244 4358 7462 -9685 -3318 9605 -4662 -9724
767 -9724 8030 4376 -12309 -399 10949 -5775 -8072 9188 3360 -9770 3456 9280 -6800
780 -6800 -3677 11208 214 -9367 6615 8029 -9063 -2200 10738 -2549 -8827 6816 4503
793 4503 -10027 -17 8641 -6407 -7713 8504 1529 -11427 2371 8516 -7394 -5605 9461
806 9461 27 -9223 5552 7340 -8146 -1374 11166 -2205 -7848 8230 5926 -9163 548 10020
820A0020j4817j811J5491p049j2215J3350M686j6111L212J4405j0872q578J5180
833D891J044j5521P459J1753j3159m425J6001l782j3622J1105Q100j4749l65J5171
847I901p809j1109J3605L606j5532M117J3214j1461p387J4567p24j4509Q317R495
861H291j3361k836J4968m682j2631J1733O727j4697J495J3622q269r182J3702
874D880K382j4579N657J1605j1474n706J4388j790j3591Q752Q659j3526k006J3785
888G436n401j1113J1105M761j3744J935J2902q974p951J2964J360j3100N291J0821
902H292j0642m740J3467k173j2075Q857P895j2904q05J2997n462j0275J0840M524
916G796j3742K589J1379q609p428J2540K71j2987O126R521j1167l757J2893k302
$$ plain form
820 10020 -4797 -6608 8883 1834 -10381 2969 7655 -8456 -5244 9161 -1711 -10289 4891
833 4891 5935 -9586 -2127 9626 -3533 -7958 8043 4261 -9361 1744 9844 -4905 -5270 9901
847 9901 2092 -9017 4588 8194 -7338 -3221 9993 -1468 -8855 5712 4988 -9521 -1204 8291
861 8291 -5070 -7906 7062 2380 -10251 1482 8209 -6488 -4993 8629 360 -8822 4880
874 4880 7262 -7317 -1660 9945 -1529 -7235 7153 5363 -8228 524 9183 -4343 -6349 7436
888 7436 2035 -9078 2027 6788 -6956 -5021 7881 -1093 -9044 3920 5280 -7820 -2529 8292
902 8292 -2350 -7090 6377 4204 -7871 986 8881 -4023 -4828 8169 2707 -7568 3272 7796
916 7796 -5946 -3357 8022 -587 -8015 4525 4796 -8191 -2065 7456 -3711 -7468 5425 3123
930C123j1834Q742P324j2374l36J2573n740r409J1311L858j3048L281J1383q818
944C6o940J2332L00j2570N989R022j1270l006J2146l533j0807R013N876j2419
958e831L92J2198o514q644J0791L046j2157L857J0140r043m905J2313j201j1579
972g137P362Q273j1441k198J2082l876r688Q831M557j1279J022J0676p446p288
986g550J1080J397j1959M427R376r086m350J0687j197r862O579O606j0388m47
1000d687J1303m821q747R591M052j1188J439J0265o508o057R621N34j0128M949
1014c82P138r340k719J0432k653r372O604N913r498j205R895m395o893Q424K205
1029D154r653K814R320p606n432J0361P17r713M336P034p775k389R121k759q199
$$ plain form
930 3123 -8711 31 7355 -5019 -5355 7218 1478 -7931 3380 7238 -5810 -2529 8854 36
944 36 -6904 5428 5728 -6842 -853 8169 -3101 -6107 6039 2506 -8301 712 6588 -5831
958 -5831 -5439 6759 245 -8399 2392 5438 -6719 -2862 7278 -1765 -6670 5643 4442 -7137
972 -7137 225 8498 -2943 -5141 6941 3065 -6623 2208 6765 -4514 -3492 7184 -262 -7550
986 -7550 3530 4927 -7032 -2605 6771 -2315 -6665 4022 2825 -7037 -458 6148 -4240 -4687
1000 -4687 6616 1795 -6952 2639 6691 -4497 -3058 7207 699 -5358 4263 4797 -5331 -382
1014 -382 6756 -2584 -5303 5129 2476 -6896 -292 5621 -3877 -5082 4813 418 -6475 1949 4154
1029 4154 -5499 -2685 6635 -971 -6403 3958 4675 -5038 -702 6332 -1443 -3832 5289 2530 -5669
1044e669P334M766j0211k40J0096m691p957P871L109r218J917P612o305m154Q903
1059C163k90r388N318P127q397k626R719j738q115O226M107p762L32Q595n601
1074F70n950Q854K093j0656K616Q612o494n170Q008N66q288M539N342q515j038
1089d811R556l426q321P550M810q992k33Q610m009n637P762J246q339L646P040
1104F452p529l330R277p92r358N153O120p842j880P674l014o045O676K265q850
1119e023J828Q476n623o285Q250K442q735K348O917o155k341Q159k110p574O477
1134A051N118q593j069Q841k974p285O512L193p924J701O082n636l663P842j67
1149C029q552M234O672p392l463Q336o03p265M804L809o829O87P280m814n143
$$ plain form
1044 -5669 1665 6431 -3780 -4020 6076 1385 -6572 1299 4408 -4810 -2893 4719 -1586 -5740 3163
1059 3163 2873 -6515 -1197 5930 -2467 -5093 4626 2888 -5227 999 5106 -2656 -2324 6271 670
1074 670 -5280 3574 5667 -4989 -2373 6239 -255 -5425 2583 3149 -5139 -600 4742 -3773 -4811
1089 -4811 4745 1319 -7002 548 5358 -3634 -3867 4743 734 -4903 2859 4105 -4234 -588 6452
1104 6452 -1077 -4407 4870 4078 -5280 -127 5993 -1849 -3729 3945 931 -5114 1562 3827 -5023
1119 -5023 -3195 5281 -342 -6627 1623 4065 -4670 -2322 4595 -1560 -3901 4258 2148 -5426 1051
1134 1051 6169 -2424 -3493 5348 2374 -4911 1601 4794 -3130 -1429 4653 -983 -4646 3196 3029
1149 3029 -5523 -1289 5383 -2009 -5472 2864 2261 -5004 -200 3609 -3220 -2533 4747 -67 -5210
1164e210P714K445q793J626P751n403l852O638L1o692M028M660p242j430Q092
1179D363k905o892N567L835o896n06O979l722m434O214Q43o813L035O206o347
1194a473l057P937k35o988L416N281n974j135O252k636n136N925K194p852J342
1209b139O958m337n253O278J633p364K652M992n374k254P102j486o574M726M343
1224C903o579p43O998k164n193M948K834o441J520M888l825l557O753K7o929K847
1240g13N517n802k335N765q68n196L768K583n902K85O324l203n116N617K430o324
1256c170J134N461l609l216N593Jn354L304M224n486j483O389j536n742L965L556
1272D031o009k61N620k792m188M890J104o083J864N317m662k903N776M31n943
$$ plain form
1164 -5210 2504 4949 -3844 -2218 5533 130 -3722 2916 2947 -3745 283 4943 -2299 -3729 4363
1179 4363 1458 -5434 133 3968 -2928 -3434 3545 -177 -4611 1603 2446 -4367 -1332 4874 -1473
1194 -1473 -4530 3407 3172 -3816 -400 4881 -1093 -2228 4024 1388 -3748 2177 4371 -3481 -2139
1209 -2139 4819 482 -4771 1507 3140 -4224 -1572 3420 -1954 -4208 2894 1408 -5166 -440 3903
1224 3903 -2676 -3419 3579 1415 -3778 1170 4004 -2437 -917 3971 146 -3411 3342 3369 -3560 -713
1240 -713 4804 -998 -3333 2432 1564 -3632 136 2719 -3183 -2898 3426 223 -4893 724 3154 -3170
1256 -3170 -2036 3425 -184 -3400 2193 2194 -3160 144 4368 -1118 -2601 3788 2252 -3490 475 4031
1272 4031 -1978 -2239 3381 589 -3599 1291 2395 -3688 -1824 3493 -1169 -4072 1704 2135 -3808
1287c808K994M016m807j219N938j665m741M205K948n704j43O179k973m472N193
1302A941J328n806J723M701m189k913N450o05n424L196L772m966j403N812k090
1317E27m548M413K433n356P10N053l399l364N752M65n411K239M590m689k201N896
1333C110j047m998L559L177n368n83N497k753m341M759J547n645J188M817l689
1348g70k956N209M25n348K376M089m425j199M962j087m486L901K918n297J42N129
1364C583k953l177M203J305n348J519M084l741k255M980k94n078K617L259m266
1379a562j443N210j663m141L591K467m733M57M595k684l078M622P99m558J492
1394f29M095l475k196M581m64m366K638K808m368r65M892j690l902L513J564m447
$$ plain form
1287 -3808 -814 3202 -1605 -2824 3114 1449 -3292 913 3861 -1843 -1986 4193 1220 -3252 1941
1302 1941 3269 -2537 -814 3887 -302 -3215 2235 1630 -3794 -598 3174 -1792 -3195 2617 527
1317 527 -4021 392 2825 -2531 -1821 3232 -167 -3531 2221 2686 -2725 -486 4104 -585 -2786 3110
1333 3110 2063 -2935 624 3801 -1567 -2150 3347 594 -3747 1012 2559 -3086 -1898 2919 -770
1348 -770 -3726 1483 1908 -3440 -1064 3025 -1400 -2599 2363 1276 -3210 691 3609 -1688 -1546 3583
1364 3583 630 -2547 1656 2961 -2387 -868 3216 -525 -2780 2200 1906 -3172 -555 2704 -1562
1379 -1562 -3005 2205 542 -3599 -8 2459 -2274 -1817 2778 94 -2984 1638 2437 -2121 -629
1394 -629 3466 -9 -2205 2376 1912 -2454 184 2992 -1376 -2341 2551 861 -3041 472 2036 -2411
1410b411L60M351k700k666L819P44m056J684L412l500j421M420m85l689K545K520
1426B927l779o67M185j669l201L450J423m252P89L334k640k547L838K36m011J517
1442a067L055l222j476M230p03l776K767K477l895M8L772j393l468L793J429l964
1458a393N55L695k794j892L559J29l795J817K739l290j302L685o31l385K295K050
1474B042l825m3L695k018k602L113J306l961J115L243k291k016L917p7l589J982
1490iK746l294p70L823j391l045K700J677l834N8L748k309k516L136P56l620J190
1507i54K720k946j447L628j91l551K086K889l443q63L885j238k616K865J453l450
1523a173J24L319j836k189L060P48l827J471K900l045j433L086j00l050J907J952
$$ plain form
1410 -2411 -2051 2300 -400 -3066 753 1497 -2559 -875 2537 -963 -2384 2036 1551 -2138 407 2927
1426 2927 -852 -1519 2666 997 -2204 1246 2669 -1583 -794 2540 -100 -2647 1191 1427 -2584 -1067
1442 -1067 1988 -1234 -2710 1520 817 -2959 -192 2285 -1610 -1562 2210 817 -2651 1142 2571 -1393
1458 -1393 -838 2857 63 -1829 1730 1859 -1936 -119 2620 -670 -1972 1713 1082 -2303 -8 2042
1474 2042 -1783 -1826 1869 -149 -2751 362 1668 -2293 -1178 2065 -226 -2242 1675 1598 -1991 -9
1490 -9 2737 -557 -1327 2496 1105 -1940 760 2437 -1397 -1339 2409 100 -2416 720 1476 -2144 -954
1507 -954 1766 -1180 -2627 1001 810 -2741 -655 2234 -1209 -2072 1813 575 -2041 824 2277 -1173
1523 -1173 -1049 2270 434 -1755 1305 2053 -1774 -303 2597 -448 -1881 1205 1105 -1945 -38 1914
1539A914l612k63L697j481k938K629J503l295O31L240k004k141L424L10l247J641
1555HK230k558j005L676q45l188K178J997l420l82L124j614k153K576P59l427
1571b044Q23K985k335k215L635K51l154J319K416k393j057L417q83k704K576J458
1587B095l165k21L678j547k355K218J490l331N71K541k357j057K838l69l341J765
1603e47K285k718r97K911n44k678K028J449k542L06K608j508j803K691Q61k957
1619a155R58K253j707j496K555l6k556J340J671k624n86K873r63k592K243J343
1635A521l055J93K686j347j952K320M33k721J475K098k324p29K881k52k648J451
1651C0J786k001m50K320j079j635J699J058k790L36K605j579k010K004P31k456
$$ plain form
1539 1914 -1698 -1961 1736 255 -2683 -54 1449 -1846 -1215 2025 21 -2120 1304 1614 -1633 8
1555 8 2238 -320 -1325 2351 1506 -1682 496 2493 -927 -1309 1815 201 -1952 624 1383 -2044
1571 -2044 -1221 1764 -571 -2786 849 1100 -2054 -735 1681 -712 -1769 1648 765 -1939 637 2095
1587 2095 -1070 -1291 2387 840 -1515 703 2193 -1138 -567 1974 -383 -1440 1398 1029 -2312 -547
1603 -547 1738 -980 -1977 934 390 -2288 -260 1189 -1353 -1047 1561 53 -1750 941 1802 -1155
1619 -1155 -197 2056 349 -1147 1408 1372 -1184 156 1827 -797 -1383 1490 527 -2065 178 1521
1635 1521 -1534 -1341 1345 -2 -1954 366 799 -1922 -447 1651 -673 -1402 1479 1227 -1421 30
1651 30 1816 -185 -635 1685 606 -1029 670 1728 -1062 -726 1879 300 -1710 294 1025 -1431
1667a431O33J824j860n29K186o30j810J181J834k395m94K576m97j878J776R32
1683A418k113N27J743j514j237K582j3k640J141J822j785j422K557m29k308J423
1699b48J147k103j32K404j178j778K290P99k488K70K264j448j158K075M6j781
1715a019J343J298j975k97J985l92k172J567J051j788m08K026q66j419J521K49
1731G04k245Q20J952j916r83K457k10k104R23J620j601m86J755k29j685J544J225
1748A541k176K5K126j000j333J746N81k121N12J299j279r80J766l8k035J294J108
1765A036j841n84J874n49j401J414Q99j748J35J944j527o62J595L68j624O78J532
1782A539j532o60J867l49j892J165R41j750k5J832r63j690J619O68j573k35J760
$$ plain form
1667 -1431 -798 1026 -834 -1363 823 193 -1617 -436 1398 -997 -1491 1085 588 -1290 486 1418
1683 1418 -695 -168 1575 61 -1176 1406 1393 -1247 -106 1716 -69 -1491 1066 637 -1671 -248
1699 -248 899 -1204 -1336 1068 -110 -1888 402 1201 -1287 -1017 1247 -201 -1359 716 762 -1019
1715 -1019 324 1622 -353 -650 1335 943 -1229 338 1389 -399 -807 1219 353 -1066 455 704
1731 704 -1541 -721 1231 -685 -1668 789 579 -1525 -602 1018 -583 -1069 686 457 -1228 316 1541
1748 1541 -635 -610 1516 516 -817 929 1510 -611 -99 1200 -79 -1059 707 669 -1366 -72 1036
1765 1036 -805 -1389 485 -64 -1465 -51 848 -900 -765 1179 -348 -1010 585 953 -671 7 1539
1782 1539 7 -653 1214 865 -1027 138 1079 -671 -696 1136 173 -1517 102 770 -803 -1038 722
1799G22p70j094J570O5j734Q12J114j164m68K036n75j531J150J152j621j15J485
1816A034k85j324J185O32j922L79J361q99q96J411J20j723J76J460j358n71J697
1833D77l09j357Q72R42j415j41J730n51j287J470M29j205J46J535j174p34J317
1850G45K26j643P25J000j222l65J333m94j326J155N38j612J6J687j024r79J254
1867A4N74j539L55J248q93n44J201J92j229P47R42j119l15J274l36q66P31N53
1885I90j424J29J286r64r56J183L06j327L77J098j118n04J156k4j046M92J138
1902G92j303k24J375k42j128J204K59j122K77R48m95r48J211J02j193N26Q34r88
1920a15l61J108l13j151P46M92q24k39J268o39j127J313K67j194K31J092n41n20
$$ plain form
1799 722 -48 -1142 428 493 -1241 -429 685 -479 -947 1089 514 -1017 133 1285 -336 -451 1034
1816 1034 749 -575 610 1242 -680 -301 1060 161 -735 676 796 -927 -751 709 -649 -1220 477
1833 477 168 -1189 -317 625 -790 -931 799 248 -1039 431 860 -345 -199 1336 162 -572 745
1850 745 971 -672 53 1053 -169 -534 799 305 -1021 134 672 -940 -924 763 -261 -1240 14
1867 14 588 -951 -596 652 -241 -785 416 608 -621 126 1068 -51 -366 908 572 -294 437 990
1885 990 -434 -305 981 17 -939 244 550 -777 -400 698 -420 -924 232 208 -838 -346 792
1902 792 -511 -735 640 398 -730 474 733 -389 -112 836 341 -607 604 706 -487 39 873 -115
1920 -115 -476 632 319 -832 -86 406 -418 -657 611 -28 -1155 158 425 -769 -538 554 13 -507
1938e07Q70L42j049N21Q53j104m19J391j32j294O86P24r78k34R53m90o64N10J50
1957A29r73M33P10p30n30P06L42j005N00J037r75l51J317k15j147R44N29j007
1975b86P0R33m58o24Q52K63j343N16P27n61m31O03K4j199N73R43j049j50R65k31
1995A37o86L59M06q83K80N90Mq13Q80L13j111L53O82n72k10R60J49r75L96M94
2015G53p95k94J016l15q63O10M21j337L11P88o74o77R80K71p91J71R46n90l91
2034d60R52qr45N44M06n86j39Q72j44q08O37K41n48k94R34l42q72J018l3j117
2054f92M23J003j199M1N51n0p81O28L60p38R8Q40m27m14M57M28n67M7P40n17m91
2075b60O17Q9p35M00M23m72q7M93j17q36M11N48o61m37P17l8q70P84J13p23N68
$$ plain form
1938 -507 363 705 -344 177 1030 -74 -493 898 766 -528 158 882 -96 -330 623 133 -531 -21 129
1957 129 -844 -411 299 -431 -961 -255 87 -918 -418 619 -356 -707 610 395 -752 192 721 -286
1975 -286 -216 717 259 -365 487 750 -593 -77 650 89 -342 261 285 -914 -341 602 -447 -597 368 137
1995 137 -549 -190 216 -667 -387 203 207 -606 274 587 -524 -171 511 -61 -271 689 838 -137 259 753
2015 753 -42 -336 680 365 -498 112 533 -804 -493 295 -379 -1056 -76 195 -596 -425 521 -69 -460
2034 -460 492 484 -461 83 489 -97 -236 636 492 -316 321 562 14 -280 654 312 -560 458 425 -692
2054 -692 -269 734 -465 -424 127 77 -704 -76 284 -454 -356 484 57 -357 100 528 -39 8 748 231 -260
2075 -260 357 446 -289 111 534 62 -25 468 351 -485 -74 474 -187 -624 93 55 -815 -31 82 -641 -73
2096g3L99n22j92M37J3m42M11N54l33l58N67J82q81L70M03m24k48O28m50l77N19
2117A83K38q17L4M35j42n76O43J10o16L44M84n44j9L52J9m09L04L43j89j36N93
2138F34k09o15O26K27q07j25R21n13l49K60L08n36o0M28o82o5P00j40r02N58M48
2159A07m43k5L13km00O41q4k64K10L10q1k84L14Q1q59L51N81j75l19J75l3n16
2181d02L24K58n69l9O70j63m77J90P5k39K89L09k01l80L04O03p23J86L72l44k99
2202b56P38J57o10J34J76m28J3J65J37l06J15J61n23L63k3k60l65Q68k3n54R4
2223b27L85k11j87K21J77n48O19L08o46J94K5K36l40L13K1j38J05n9j36j23L82
2244C71l77k25l1L14k95j49K40K29m09J90J76k22j91L22q7l3L64K0j81n1M56j41
$$ plain form
2096 -73 326 -196 -388 49 62 -380 31 585 252 -106 461 643 -238 132 535 111 -137 491 41 -336 183
2117 183 421 -396 -362 73 -69 -645 -2 108 -508 -164 320 -224 -243 109 128 -281 23 366 177 41 634
2138 634 425 -190 436 663 -144 -269 652 139 -210 50 358 -178 -238 190 -492 -557 143 3 -899 -341 107
2159 107 -336 -361 -48 -50 -450 191 107 -157 53 363 282 -2 312 393 -466 -115 466 291 -28 147 114 -402
2181 -402 -78 180 -389 -428 242 79 -398 -208 -133 -372 -83 226 25 -355 -51 552 -171 15 387 43 -256
2202 -256 482 639 29 163 339 -89 -76 89 226 -80 35 196 -327 36 13 -247 -612 256 233 -321 -227
2223 -227 158 -53 -240 -19 158 -390 229 537 -109 85 110 346 6 319 340 202 307 248 112 -11 371
2244 371 -6 -231 -262 52 -243 -392 -152 77 -332 -142 34 -188 -379 -57 -144 -177 187 207 26 -25 431 290
2266B90n94N17K64m99K02K61l44k05M22j07l61J99L12l68j62J81j9j74J84J15
2286A14m05J41k2Kj57L63P5k67m0L43m2j88J55M5J89n7L31m39j64K79P2l12L8
2309E4R8j83j69K69l5l28M10j26m33K01J65m1k76M59J52o82N47L42m30jK38j01
2331A30j4j50L89m56J50J78j84j11K30J55m91J73J40k08k43J74o2j07L78j2m07
2352c48j5M62j27n05P60J59n05M25J70m16l66L98L16j11j30K52n3k87J47j36k94
2373b04L12l00M2Q2J30j68o4j74N26k82k7J86j50l70L67J31k64K11J36j42k71
2394b93L63J81o09N97K09k83O9JL2m42M22L4j75k32K79k95p7J12J37l68j46P89
2416C05l95O0M1j81j52L37K49m22KK31J12k19L73o3k19k0J81J6j70J77l14k0P0
$$ plain form
2266 290 -304 213 477 -22 180 441 97 -108 314 207 -154 45 357 -11 -173 8 -11 -185 -1 114
2286 114 -291 -150 -172 -170 -327 36 111 -156 -196 147 105 -83 72 117 306 249 580 141 -23 256 328 16 54
2309 54 152 -31 -200 69 34 -294 116 -10 -443 -242 -77 -118 -394 65 217 -465 82 424 -6 -7 231 130
2331 130 116 -34 355 -101 49 227 43 -68 162 317 -174 -1 139 -69 -312 -138 -200 -307 71 59 -348
2352 -348 -363 99 -28 -533 227 386 -119 306 476 60 -306 92 408 297 167 419 366 79 226 90 -204
2373 -204 108 -192 -150 -68 62 -106 -170 -344 182 -100 -127 59 -91 -461 -94 37 -227 -16 120 -22 -293
2394 -293 70 251 -358 239 448 165 234 235 267 -175 247 281 106 -126 153 -142 -219 -107 30 -338 -484 305
2416 305 -90 -30 11 -170 -322 15 264 -158 -156 75 187 -32 341 278 59 39 220 236 66 243 -71 -91 -21
2439b1K36k84j60L39k39l27L69R2k62j7Q7J21l74L37J82l55J74K65j56j19K95
2460A83M34o09j20M78l25M1J29k69l43M04K50j97j4j17K02k41K0J99k55j04M07
2481A53j81o03N39J95m05Q3M43J3l83J38M07m87j81Q09m76l7N61k31k38L08j89
2502B38n7k30j5J72k95Q0L56n21J4J24L9R0kn9l3j27L79l00K02K05j52r3J57r
2526A63n3J46n6K0l18L38j86j31j80N33l76m57N68j37j10J64P3n5j30J65L6m53
2548d36M98J49n81J51K46J02k46K8L04k03K34K66n05j04M32j4l08K3K92l54j47
2569a73N33l09l21K95l7j51k44O95l11k46j25M91k87J6K89k49J49J37J06j85J09
2590A82J09m79m8O93oo40K41L36m37n7L98j73l02K18j83L2lK69l04j56L12J76
$$ plain form
2439 -21 215 -69 -229 110 -129 -456 -87 5 -257 -274 -187 -66 -440 -103 79 -276 -102 163 7 -112 183
2460 183 617 8 -112 366 41 82 211 -58 -401 3 253 56 42 -75 127 -114 -94 105 -150 -254 153
2481 153 -28 -631 -92 103 -302 -219 224 237 -146 -8 399 -88 -269 540 64 27 588 357 119 427 238
2502 238 181 -49 -64 108 -187 -107 249 -272 -258 -134 -95 -5 -7 -66 -99 -226 153 -147 55 260 108 15 172 163
2526 163 110 256 200 220 -98 240 54 -77 -257 276 -100 -557 11 -126 -236 -72 1 -54 -184 -19 17 -436
2548 -436 62 211 -370 -219 27 129 -117 -89 215 12 246 512 7 -97 335 321 13 36 328 -26 -173
2569 -173 360 51 -270 25 -12 -163 -407 288 -23 -269 -394 97 -190 -174 115 -134 15 152 258 73 182
2590 182 291 -188 -236 457 451 -189 52 388 -49 -106 292 119 -183 35 -148 -116 -119 150 -154 -310 2 178
2612A78n54m5Q76n03k01N86r1k31K25m8k15qL56k37k83M85k6m70K68j6p4r4K56
2635A34j23j35N3J93J22l79Q1k09P7J38K46j93j98K61K7j74M22q5m0l68M60k91
2657A9P1J95K64n97J48L4k67J79M2q4j77o5K42j01m06M67k02l0PJ02k58K91K80
2680A54M8l85P06l80j69J56k51J23k52N78j98m9J98j31j90J0L80k46k85K02J30
2701A49k98q8L37j76k95K55L59n86K03L51m87J00M40j73m7l83O83j80j55L62j84
2722A87l62K06K29m55J92L07l27j07L93p9m76r0P03l87q3J77N3k76J40K54k71
2743g2l80L53J34j92j5L06l14K31N68o92r3N30M0l87O6K27l00L6R9J1m32J98K05
2766A27l93k54O07k37k83K45L46n24K42L61k29j83N0K45m80O84r2l66J28K28K
$$ plain form
2612 178 -376 -421 455 -48 -249 337 246 15 240 192 -23 -31 325 88 -195 290 264 -206 62 46 -28 -122 134
2635 134 11 -124 -71 122 244 -135 -54 -263 -186 -48 198 5 -193 68 95 -79 343 258 218 -150 310 19
2657 19 90 285 549 -48 100 134 -133 46 88 4 -173 -238 4 -97 -503 -36 -238 -268 -261 -159 -417 -126 154
2680 154 202 -183 523 143 -26 130 -121 2 -250 328 130 81 279 148 -42 -32 348 102 -183 19 149
2701 149 -149 -237 100 -76 -371 -116 243 -343 -140 211 -276 -176 264 91 44 -339 344 164 9 371 187
2722 187 -175 31 260 -195 -3 304 -23 -130 263 184 -292 -382 321 -66 -149 28 81 -195 -55 199 -72
2743 -72 -452 -99 35 -157 -172 134 -180 51 619 -73 -166 364 404 17 83 310 10 46 145 156 -276 -78 127
2766 127 -266 -520 87 -150 -433 -188 158 -366 -124 237 8 -175 -125 120 -360 324 232 -134 -6 222 224
2787B24l65K66K31l57K12O9k45j70J76O5k50L39j5n01l5L63J16n93J44J32K5k86
2809d55N97Q0m80L57L36k11l14J61k3j55l2L81m49J63K93l93Q9K75j24k43R7K09
2831A59k65J6J54j14l48L61K4j88P1N89k83j78J29J16l35K4K96j13l72M59K46
2852D48m68P6M04l68j80J54M2k72O3q5K9Q0K87l30k14L74Ml89J99L25m56M77q4
2875A16p9l24M34Q9m35K54K86k21l40L80j14j56o3M29n1m62J81L07p20L51K36
2896I8j22l22M1J18j97K29K22k50n7K07J21n78N41L23l77OK93k39o3J74o4j26
2918b2K54J87n56J00K41j82l32K36K77j87k11J94k12J71j6j17o1R0K43k08k46
2939c57N70k2n04L76Q7j66o4L27n9k01J74J85n25M5L37n2m26K06K69l92Q1r6J48
$$ plain form
2787 224 -141 125 356 -1 211 280 35 -135 41 106 -144 195 180 -321 -356 7 123 -470 -326 -194 -169 -455
2809 -455 142 222 -258 99 435 224 -90 71 48 -107 -139 242 -207 -44 249 -144 -55 220 96 -147 -50 159
2831 159 -106 -90 64 -50 -398 -37 -13 -201 -130 459 176 -2 127 243 -92 -68 228 115 -257 202 448
2852 448 -20 56 460 92 -88 66 108 -164 -101 -186 -157 -77 210 -120 -334 40 44 -345 -146 179 -277 200 116
2875 116 37 -287 147 236 -199 55 341 120 -220 160 46 -110 -173 256 205 -257 -76 231 -489 -138 98
2896 98 -24 -346 -305 -187 -384 -155 67 -183 -240 -33 88 -490 51 374 -3 3 296 57 -6 168 104 -22
2918 -22 232 419 -137 -37 204 22 -310 -74 203 16 -195 -1 -213 -42 -58 -175 -236 -146 97 -111 -357
2939 -357 213 191 -313 63 150 -16 -80 247 188 -13 161 346 -179 -134 203 151 -275 -69 200 -192 -111 -207 -59
2962e9k81J49K31m12M7Q54o08j2L66k56j73L51o7k93L8Q1O1o5J44K74m87R2L78
2985C53l22j44L04Mn69L77J67l77l6M24j64l47K54K59m45L58N7j45j58K85Rm25
3007b81M26J71p6m86M55l8m42J75M40l04q4QJ60o0J55l9o70P34K17o45k94N08
3029C0m3l08N9N16j88l40N47j42l12L76j29k90K78J40j95j51L80K55m42K6L04
3050C71k75j46J58L4m04L87K03m19q0L07q6l66L51k9r5k66K95j84k15N71m6r9
3072c3R2K20l28J37K22j63r0J74J32m70Q9L42l40j32j29L98k06k09M06j06k58
3093b52K59J62m86J19N28k21k83L88j32k90J39L60j97k67N82k92k93K40K52n61
3113b45Q5L46K3k82M3N3l99K11L56l84j52M27J29m87M7L57m19jL54j13r6L18k28
$$ plain form
2962 -59 -340 -191 40 -372 -325 529 -79 -91 275 19 -154 197 130 -163 -125 -44 17 -48 96 370 -117 -25 353
2985 353 31 -113 191 195 -374 3 170 -207 -243 181 17 -330 -76 183 -262 96 153 8 -150 135 144 -281
3007 -281 145 316 240 -246 209 171 -271 -96 344 40 -44 -36 124 64 219 180 -490 244 461 -184 -478 30
3029 30 -13 -321 -262 254 66 -274 273 131 -181 195 66 -224 54 194 -1 -152 228 483 41 67 371
3050 371 96 -50 108 142 -262 125 328 -91 -171 136 50 -316 35 6 -89 -355 -60 -244 -459 112 66 -33
3072 -33 59 279 -49 88 310 147 57 231 363 -107 -18 324 -16 -148 -277 121 -85 -294 112 6 -252
3093 -252 7 169 -317 -198 330 109 -174 214 82 -208 -69 291 94 -173 409 117 -176 64 316 -245
3113 -245 -160 186 209 -73 -30 23 -376 -165 191 -193 -345 82 211 -276 -229 128 -291 -292 62 -51 -147 171 -57
3136e7J55j72M67l86RJ27J38k22j60O65l83l91L90rn01O13j60k57L7L37k49l26
3158c35J86K55m11K94j60J38q1K75k60Q3q7M27k02n71P70k05M8q8L5P3l70N90
3180D04j73l98K73j39j04O7J87j80k08J49J72m59K66P8q4l5K48o3k40J32L23n40
3202c24L83K36l00K20K8n8j74J28j28q6j43N99n18j09K11J68k36j66L82k68p9
3223b34K55J41n28J66J31J7r3J87N7j42Q2L56l98O9J54j17k03K74J31l19r3K76
3245A69L0l88K65J15k99J04K26k57k11L39l3j93K4J08j45m00N47J14m56L39K48
3266B46l95L19o9m5j80K53RM7k21M15m47R0K36o5l42J06L43m60j76L80J82p15
3288d89M59J38k46J11J38p6j7M0R2k72J9L23k12k42K84M0L0j02K31n7k41K98n2
$$ plain form
3136 -57 98 -74 393 7 16 143 281 59 -101 564 181 -210 180 171 -330 283 123 -134 -97 240 -9 -335
3158 -335 -149 106 -305 -11 -171 -33 -114 161 -99 -16 -103 324 122 -449 321 116 164 76 111 184 -186 404
3180 404 231 -167 106 -33 -137 -70 117 -63 -271 -122 50 -409 -143 -65 -149 -184 64 1 -239 -107 216 -324
3202 -324 59 295 -5 215 243 185 11 139 11 -75 -218 381 -137 -246 -35 133 -103 -269 113 -155 -234
3223 -234 21 162 -366 -200 -69 -52 -145 42 99 -43 39 395 -3 66 220 103 -100 174 305 -14 -107 169
3245 169 199 -189 76 191 -108 -4 222 -35 -246 93 60 -133 -109 -1 -146 -546 1 115 -341 -2 246
3266 246 -149 170 101 56 -124 129 138 185 -36 379 -68 22 258 193 -149 -43 300 -160 -336 44 226 -489
3288 -489 -30 108 -138 -27 111 35 18 58 150 -122 -103 220 8 -234 50 90 120 18 249 192 -49 249 197
3311A97l89J71K11l23l5L82l37p6J97J06k98J91K77n09J92J14K98m28J5K49j65
3332D0n7P4k8%MK28m43J82K58r6k56J01L15m22j14P21p32K05J56N1m97J34M37
3355B61m35l7M39k50K1O9J13l63J08L33k26l85M82j8r3m3N65o06n3M13k70k00
3377a75M26K5k51m3L3J2m14M39M4m49K40L20j24m96N37k14j8OL78l34k01N23j52
3400A12k92K22J26m05J40J39M4j15R4n6k41J06K03q2j84K0L69l54J25j39J48j37
3422a57K80j58k58K15L74m32J07M34l45OM1L6l45K14K53j75l56N75k69k31J38
3443e3K10m15p6M42k76n3J54L01m21j62N21jl87J75n0j7J55j04l0J46Q3j94j82
3466b34K05J08j92l2N00k53l35K34K58k57o9J9r4P2L8L74n87J3K30j88P6K38r8
$$ plain form
3311 197 -192 -21 190 -133 -168 214 -123 -199 -2 104 -194 -3 274 -235 -43 71 369 -59 -44 205 40
3332 40 -17 57 29 29 33 261 -182 0 258 162 -94 7 322 -100 -214 507 -225 -20 136 187 -310 -176 261
3355 261 -174 -211 228 -22 -1 68 181 -182 -74 259 33 -352 130 112 19 -24 541 -65 -118 295 25 -175
3377 -175 251 276 25 -18 15 27 -387 52 96 -353 -113 207 83 -413 124 -90 -108 -102 276 -58 -259 264 112
3400 112 -180 42 168 -237 -97 42 86 -29 65 9 -232 -126 77 -5 -189 -169 200 -154 -29 -168 -20 -157
3422 -157 123 -35 -293 -78 296 -136 -29 405 60 66 107 143 -202 12 265 90 -266 309 40 -191 -53
3443 -53 157 -258 -334 108 -168 -221 -67 234 -187 -349 172 171 -216 -41 -91 -108 47 -57 -87 59 142 -52 -234
3466 -234 -29 79 -113 -145 355 102 -233 1 259 2 -67 -48 -142 -70 -32 342 -245 -232 -2 -190 -114 124 26
3489B6q5K82j10j42q7J40M8k92L65K8p4j30J54j4l70L07R3k54P1J17k34o2K42
3512A9k33K4J36J78k36j58L07Ll32L20J75k44J28Jp3m7M6J62k93J25J05j37j14
3535a38N00k74m13N32M7ko12L10K69l78P5L24m80J50L03k50j31J63O9q5P0J06
3557A55l20j10L66Q4l93L65P3m08L12P8j31kL15k91m32J31N26k43n02N25k08J16
3579FJ01j66l09rM85l42q0J63J42j25K51m1k6k27K28p6k09J89L03m92K28j68J61
3602a3j53L50o8m21K14K56k43q9K37L2k36K29k08K1r0K74N6m72M38K60k09r9J45
3625B11R1m14K86J68k98m4M81k50l44O3J70l40J89j6j02j24K80l9k06p1N42m6
3647A87l29K38J1j82L18k35j1j3J72l02q2K52P5k16K36K0k72J64J16o5l84K08
$$ plain form
3489 26 -59 223 113 -29 -116 24 72 -220 145 173 99 -31 123 109 -261 46 139 -115 -44 73 -161 -223 19
3512 19 -214 -190 -54 124 -112 -270 37 40 -292 28 203 -41 87 88 15 -32 14 176 -117 8 113 -24 -138
3535 -138 362 88 -325 207 254 252 -360 -50 219 -159 -84 240 -240 -90 213 -37 -168 -5 64 -21 49 155
3557 155 -165 -275 91 175 -218 147 220 -188 124 202 71 69 384 93 -339 -208 318 75 -427 98 -110 6
3579 6 107 -59 -368 -377 108 -234 -314 -151 -9 -134 117 76 50 -177 51 -25 -234 -45 258 -234 -6 -174 -13
3602 -13 -166 184 116 -305 -91 165 -78 -167 70 102 -134 95 -113 -92 -182 92 148 -324 114 374 165 66 211
3625 211 302 -112 174 342 44 0 481 231 -113 -50 120 -220 -31 -47 -149 -273 7 -32 -238 -309 233 187
3647 187 -142 96 107 -75 243 8 -3 -16 156 -146 -228 24 99 -117 119 139 -133 31 147 82 -302 -94
3669i4K24j73L1J95j94j10R8L52o51K06N25l18j63J09J95l10k6K63k3k61J92R2
3691A59l61K04Pl7%J78l84J43P6R8l52M2J03P8K2J89k22j70K08O5k18K4L97k40
3715Ik87L63j9m2l0K7m7n80P00L00p08M59Q0o9k93L99j39j47R9J07k87J55pLj94
3740a48K4K40n23L06M12l40j02L52k22j27K9l3K76j27J4n6P3j02L29l82o4L62
3762A91j8k03j46K14k2jp2J88l66L84j02l71O33l83LJ15nq8p8J99j86L1p0K47
3786I4o3l13K74J77k04J62R2j25j84K10O3m11K23N7J4k23K46p0k10L0K74l41m3
3809b71M29j29k89J77N2o0J76J57j20m77J05K47l93M59K60m94J38J12k7m84N89
3830A57J22l74m5L66j29k23N8K91k27j75M16o4n46M90j88p6J12R6j75j03M09j60
$$ plain form
3669 -94 130 -43 -12 183 -11 -121 -23 329 -322 -116 409 91 -72 37 232 -78 -104 159 136 -125 67 159
3691 159 -202 2 9 -28 -28 150 -234 -91 -15 83 -269 -227 -124 -46 -24 165 -57 -227 -19 46 -172 -148 249 9
3715 9 -278 85 66 24 -6 21 -26 -606 94 394 -314 145 225 156 -137 262 123 -24 75 182 -105 50 43 46 -148
3740 -148 -124 116 -407 -101 311 -29 -131 221 -1 -128 -99 -132 144 17 31 -25 48 -54 275 -107 -171 191
3762 191 173 -30 -176 38 16 15 -57 131 -235 149 47 -324 309 -74 -71 44 39 -49 -127 72 -114 -83 -153 94
3786 94 31 -282 -8 169 -35 127 219 94 -90 120 183 -228 -5 52 66 -157 89 19 -191 -161 113 -228 -271
3809 -271 158 29 -260 -83 -31 -91 85 242 122 -355 -250 -3 -396 63 323 -171 -33 79 52 -432 157
3830 157 279 -95 -140 226 97 -126 -68 223 -4 -179 237 173 -373 117 -71 -147 -35 61 -114 -217 192 32
3852C2k40L31j13j0k5M1r9O8J87j77l64M45R1j49k31J86Qq4k3K71r2l28N29l19
3876f5N3K05j73j98K67k46J74k0j30J31p7p0L31r5j97L57l65j09L61J21m70K05
3898a0p8r2K54J90k85pL5K72j23k24L95l09k82K61l8L79m27J77J16l45m6M86j66
3921A33j80L52l06j99J41M04m45m1K54r8j07q3M65o37M52q3j06K00O8j01l62M20
3943A41q6k11L69j35n3p9J25M3j80K44K34l81l53O93k34j80R6o0m2L3J52j03p4
3966d1p7L26m79O2L00j14k71O18l08q7k17M43q4k71J59j27l9L08Q8j56k48M26
3988B11l0l36R6K9j77Q4N6o8m4J04lj13K59L8Rk33K87r5k4k36j01J51NJ38L0j99
4014a62K22J97m12J78J88j07k50L7J86j50l8J50P7q4K91l00j9J1J84j82p6Q0k95
$$ plain form
3852 32 -208 123 10 0 -25 16 -83 -15 172 -5 -369 76 167 18 -213 -27 -19 -103 -126 145 53 -275 254 -65
3876 -65 -12 193 20 -178 89 -157 17 -3 -133 -2 -79 -149 182 87 -110 247 -118 -227 134 255 -215 -10
3898 -10 -88 -180 74 264 -21 -28 7 279 156 -68 327 18 -264 -3 -41 338 -89 88 204 -141 -187 299 133
3921 133 -47 305 -1 -200 -59 345 -100 -141 113 15 -92 -175 290 -347 105 22 -84 116 184 83 -279 141
3943 141 55 -156 213 78 25 -54 71 114 -66 178 412 31 -322 371 137 -43 53 -7 -49 -16 136 33 -41
3966 -41 -118 208 -271 -209 91 -23 -294 324 16 -71 -288 155 71 -200 -41 -168 -207 101 189 33 -215 211
3988 211 181 -155 -59 -30 -207 -123 -67 -135 -179 -75 -78 -191 68 106 115 -118 169 74 50 -186 -287 -136 -131 7 37 -162
4014 -162 60 257 -155 23 211 104 -146 -109 77 -73 -111 39 116 32 323 23 4 15 199 17 -59 21 -274
4037b74m5K08L35j20m8k8q3Q6m0N7l11K74K61k01k0K03k97j22K29j5l6k15J40
4060f2kj33J71K10k29k07L39j88K85j11J14j49K01P9l32j35L78l01N6J04m5j19
4082g6J4K6k32L20l8l5M3q2o4P8k28M64j44j45J52k17r1J86L28m18J84K06q6k5
4106A20jk70J10J19j25j00k70K22M73m21J41K71L2m09R8K37j28j54o2K37p5l38
4128b93P8L41P6k40j99Q6L53l33q1P6K39l05L19n7r8N6J26Ll00K1k2J59k64K14
4152d5Nqj04K81J63n99L81j08k58J05R7j30K4K08j06K06k00J83J13r4m10L48j28
4175g6K0J00o0K20kj74Q6l23K13p1p4J44n4l9J24m6q6J13J59k53J95j18k07nK15
4200AL03p04L23M8M2k65L32J03l37O7K9m0L9j9J16l28K36L37m42L41O3j71j87
$$ plain form
4037 -274 -319 -111 224 104 56 28 -55 31 -9 48 -263 11 272 71 51 254 -43 -165 64 49 13 -202 -62
4060 -62 -64 -197 -26 184 -45 -252 87 -101 184 73 187 38 239 318 -14 -149 229 -72 -16 88 43 -76
4082 -76 -62 -36 -268 52 14 -21 22 -60 -124 -46 -274 190 46 -99 53 -164 -255 -69 259 -159 25 231 145 120
4106 120 119 -151 -41 78 -47 -147 -417 -195 278 -143 -2 269 301 -108 -10 227 99 -55 -117 120 45 -293
4128 -293 -215 126 202 -38 -237 -151 202 -131 -212 -136 103 -202 117 60 -38 18 144 147 -153 -132 -154 5 -259 -45
4152 -45 -40 -48 -152 129 292 -307 74 -34 -292 -187 -90 -220 -196 12 -94 112 -88 95 208 114 -296 52 -76
4175 -76 -56 44 -16 204 202 28 114 -209 4 -67 -141 3 -51 -90 34 -12 -98 15 174 -79 116 -2 -209 -214 1
4200 1 304 -400 -77 -29 13 -252 80 183 -154 -87 -58 -98 -59 -78 38 -290 -54 283 -159 182 245 74 -113
4223a13Q9Nj13K50q5q4K11k60J01M8k52N32l53j94L63J55l11K08j5l93J38J27
4245E4P4j67M5K39l47K34m5j24j02K74j82k00M49k62j44K64J49j02p9j28J39M5
4267H4j13L6O9k11M36j30l51K2L35k80K60j75oq1J18J34k46k9J5n2J56MK24jj49
4292F9L2j60J9P1R2n47L73j40J53J56j95j59J80K58j12j99J82kJ09l23N8L00k17
4315bK09j00k92L75j54J7k29K03j21Ro2R1K8L4n0J93j48j6j56J40j11K50o0o1
4339a3j75M00j8k79J21%k60L07J01j21m9j08K41l70L39k41J67k36K87l49R1R5
4361g0J37J32j97J02p2j58K58l41L5J88q6J66J01k00J55j92q1L48j52m0J20l92
4383b39q4J30M49l10N0R4qj55K1O2J02J0j07o7K3m8O6M0j2j50mP2L01n5k92L43
$$ plain form
4223 -113 -24 -19 -132 118 33 -51 160 -100 1 49 -203 329 -24 -218 145 300 -11 197 182 -211 -73 54
4245 54 128 -39 6 245 -102 132 87 -37 -139 135 -47 -247 202 -60 -204 60 209 107 28 -100 39 84
4267 84 -29 7 76 -135 301 171 -180 -158 177 -103 157 -18 -24 -105 13 147 -99 -128 -113 -165 -9 -5 219 218 69
4292 69 101 -59 -40 31 123 -424 -51 -191 -38 118 -77 -236 -56 202 90 -109 73 71 180 -143 -85 215 -2
4315 -2 207 107 -185 190 36 53 -176 27 -94 -85 -147 -56 -28 6 -44 149 1 -15 -171 -31 -142 108 48 -13
4339 -13 -188 212 194 -85 36 36 -224 83 184 63 14 -94 147 -223 116 -125 42 -194 93 -256 -165 -70
4361 -70 67 199 2 104 32 -126 132 -209 -174 14 -72 94 195 -5 150 -42 -123 225 73 33 153 -239
4383 -239 -323 -193 256 -54 -4 90 82 -73 -52 10 112 122 15 -52 -29 -77 -11 29 17 -133 -137 -65 236 181 -111 232
4409B32k59K30l47J09r5K25j08J90j20j13J51l21J0K35J59k09Q9P0j40R1q2J89
4431A86l65O5J36j12J0J53j02j10J76p3j39J9K47l11K56K0J45j71k59K52k36L57
4453A44q3j46J57j45K39k20J86J75n37L26k0k78J83k04J67J90j53L0K01l97L77
4474A92k70J42p8j0R3l6O0k86Q9m4L91l37N3J03j85k2L04j19J29j52l1j20J79
4497D5K03nm96K31K49j34k73O0J75q2K68l01j7K54k68j26K15l7J69k33K17k55
4519a41J67p2k33K18K2j88L15j74J36l2k5N9K20m50J74j24K75J36j59n5l0M3j
4542H1j11J14j13J18M2k57J87k2k01J48j69K1L6J23rk00L23k64L47l37J96J3N
4565G1j53L23J56m52j11K26r6K36l14K59k64L81l19J74j78J08k76N1qK2P1M93
$$ plain form
4409 232 -27 203 -144 -35 -130 95 -13 177 57 -56 95 -226 -216 19 178 -31 58 128 -12 79 -3 186
4431 186 -179 -114 22 -90 -80 73 -29 -139 37 -36 -175 -156 91 -220 36 56 201 30 -229 23 -213 144
4453 144 61 -85 72 -73 166 -54 132 307 -230 96 76 -202 -19 -223 -56 134 -19 11 212 -185 192
4474 192 -78 64 -14 -24 69 33 93 -193 -104 -148 243 -94 -41 62 -123 -145 159 40 169 17 -14 -134 45
4497 45 248 243 -253 -22 227 93 -180 -120 55 -27 241 -60 -77 177 -91 -217 -2 -39 130 -103 114 -141
4519 -141 26 -46 -279 -61 -39 -227 88 -86 50 18 -7 52 272 -178 -4 -128 147 283 124 69 39 82 81
4542 81 -30 84 -29 89 131 -126 61 39 -162 -14 -183 -162 -126 -3 -12 -212 111 -153 194 -143 53 66 71
4565 71 -82 241 397 -55 -166 60 -36 200 -114 145 -119 262 -57 117 -61 47 -229 -178 -186 -164 -93 400
4587D00m57j14J30pj58K56r5j94K55J24k70J04j24J9O8Kl8o8L23k89L05k86J71
4610E7l08K85j59J20J42Qj99Q6k3k54K88O2k56L91l02ok25M81k09r8m8J39o6K74
4634A80r8j29K25p2P2m13L08k3j35m1J73Q9k86J81j64L44j18j78J22O1k74J64
4656a2oN6rj16O5J52R4k55J64j63J07k78J42Q6Qj92L41q6o3K14l88K06Qk11J01
4681c5k03K87k71LJ65J30j11J78j37P4p2L6p9J85j82JJ08k6n9m0N1k5J45m2l15
4706b34K02P0l2K9J69m76K50Q6k14J93j72Pp2k8L77q7oj2l09K62m6L17j66k79
4730a71N1K58l60K48P6k4k38j9OJ70k34M48n6j00j26j0K38j70J29j55J89j21j35
4753a06K01J2j30r2j55L95k27J39j6J79j30r6R6N4J1j93j05J41R1O0l8k60K30
$$ plain form
4587 400 -57 -171 -41 -48 -206 50 -45 -239 16 140 -130 -26 -150 -131 -63 -61 -99 -167 156 -133 172 -114 57
4610 57 -251 34 -125 -5 137 145 -54 32 9 -245 43 105 -151 240 -62 -68 -293 188 -21 -119 -167 -28 -94 180
4634 180 82 -47 178 106 178 -235 73 50 -85 -126 47 136 -150 31 -133 211 93 -85 37 98 -176 -12
4656 -12 -18 38 29 -87 -22 130 224 -31 133 -30 77 -201 -59 27 35 -157 184 98 35 249 -139 67 75 -136 -35
4681 -35 -238 49 -222 -219 -54 76 -35 143 6 80 8 44 -35 150 -32 -31 77 51 -8 -48 3 -22 123 81 -234
4706 -234 -32 38 6 35 204 -272 -22 64 -150 43 -129 -122 -194 -222 155 68 62 50 -259 3 -43 274 108 -171
4730 -171 -120 138 -222 26 102 78 -160 -179 -173 -3 -237 211 155 55 -71 -81 157 -13 116 -39 150 29 -106
4753 -106 95 107 -23 -115 -270 125 -102 37 21 200 70 -26 70 124 135 -58 -163 -22 69 129 91 -169 61
4776F1n0J10J05l42K9J01p8J55j43M7j33K64KJ29l05K7j15J45J0J54l55J05j8
4799i5n0L25k90J27j1l6j20o5K32P5j0j51J45J59j63k08J3L4K3J75j9M3j44K39
4823B28k61LJ13k8n5j17J40R2k86J50p6KK93m3K0j26n9J77j98J88J10j19j04k48
4847b04L86l78L12j81j03J24qK31m7l57L13j75j56J09J27JQ8l28K83j66J42K48
4869B61j77J19j63j16K03l31J65J61k98L26m25J80J80J23j30J0j47J39k02l0l
4890a55K15R9k60k3J43K71l21j08O3k4J67J22k11k66L44mQ4j14J1M0j27j95L27
4913G8n8j37p8J34p0J19J00Lk92L26l0k13J69o1k49L05m8J03o0l04K55J37j94
4936f5N6P9J23R2k81N7K5K8k81J63n3L48q6l03P3J41K1p0r7J04j35K36k8l50J54
$$ plain form
4776 61 11 121 226 -116 -87 14 -64 91 -52 -5 -138 126 128 257 -48 -21 -136 9 19 173 -182 -77 -95
4799 -95 -145 180 -110 17 6 -30 -150 -215 17 92 82 -69 76 235 72 -136 -123 -89 -66 109 90 133 -11 228
4823 228 -33 -30 83 55 0 -117 23 115 -171 -21 -97 -95 198 155 175 49 -10 167 -31 157 267 148 44 -204
4847 -204 182 -196 116 -65 -168 -44 -52 179 132 -225 88 -87 -243 -134 -7 -6 82 -246 37 -129 13 261
4869 261 84 203 40 -76 127 -204 -39 122 -176 150 -275 -95 85 208 78 88 -59 80 -122 -152 -155
4890 -155 60 159 -101 -124 19 290 -31 -139 -76 -100 67 189 -22 -288 56 52 136 22 33 73 -54 -249 78
4913 78 20 -117 -195 -61 -131 -12 88 91 -201 125 95 -118 51 -10 -259 46 -2 101 41 -263 -8 129 -65
4936 -65 -9 70 193 285 4 61 86 114 -167 -4 -57 291 205 -98 -25 116 137 67 -30 74 -61 175 147 -203 -49
4961d9j45P6J14K9p2p4O9O6m8n6J34k91M61j74K15j66J09j55l5J61k98jjJ1j35
4986b55L44qlQ2r9M1n3j16L03k33J10j06Q7j60Q2m8M3N9j08J41k0j48j39K49p4
5011b9j4J15j50J63Lj68q0L24k92Q9m9J23k3J93k90q6j7K53q7J07j08K89l64O7
5035c1K32o9p4P5j72o9J73p2J31O0j39l2J77k49N3J60k37K53j77J29m7j24L04
5058B55p8l3j09j7j31q6O5K66k66k11N36j39R3k98M5J11J35k82J96k9j9K00l18
5081a14J40R0m1Nj26L44k30k73P0M47l38J5J11j20l9j63L82q5J8j42J76l23K55
5104E9q2M0J03k99N1K53j60l9q5K59r2j43J82n4J21j51J7J25j90J43p2n5JJ96
5128A28k9j30m8LJ23J17o9k5k11L20r5L0j46Rm4J22Q5j46J26k95M34k07R8k64
$$ plain form
4961 -49 -194 -118 -4 25 -47 -121 -52 14 -34 -90 44 -247 214 40 255 89 198 43 8 169 -129 -130 -131 -120 -255
4986 -255 89 81 78 160 61 102 49 -67 236 3 113 7 94 -66 16 -32 11 70 -38 103 83 -65 -204 45 -29
5011 -29 -43 72 -78 85 88 -80 -160 164 -128 -39 -88 35 12 205 -85 -171 -188 65 -22 85 -23 266 -98 -31
5035 -31 201 132 58 133 -39 -108 65 -7 124 184 45 13 190 -59 -6 154 -83 170 -7 122 75 -49 255
5058 255 177 144 35 18 -113 -199 -134 132 -134 -345 191 52 145 -153 -108 3 138 -144 52 23 4 204 -114
5081 -114 26 116 75 80 -46 298 68 -205 -135 312 -26 -11 100 -20 -59 -222 160 75 93 -49 127 -196 59
5104 59 -23 17 120 -179 -128 125 -35 -74 -159 100 8 -135 47 -7 114 -37 -20 105 -85 58 -14 -69 -68 128
5128 128 99 -31 -79 -76 47 164 95 70 -141 179 84 114 -32 -23 -67 55 140 -6 120 -175 259 52 150 -114
5152a14K03l0k17K22k6j54o1L3J83k49L59k59Q1Qj12K9J6K50l89L05o8K18m90
5175b62K87p3M0L5J21p8r1j28K32k43K01k59L66j66J18k69K9JJ82j88J72p6Q2
5198C3k1j61L17L7k11K36k80R3n8j19K2J06o0M94l25r7j16K23j11M6j01L3l0K70
5222B20n0r8J77k25K32l10J00J31j44P5k47NJ50Rq7j15Q7o9L43l58K08m1Q1r3
5246a9P8J00j23O3k08L18k95j06K67k39J08KJ73k66J57k4n3J03k34P2J7K01J05
5269A97l15K46q0J1r7O8J04m13L30j83J41q5m3J14N9K0j60r4J98p7O0j4lR1o0
5294A5rP5k50L2J30L8j24j24J42j87M02j33L4j30j31J86k44K22J31j8j21K08l49
5317b05K79o2j00L3j4j4l5J32O8P3q4P0k04q5K98j97J61p8L0jl5r6J5K09l90K06
$$ plain form
5152 -114 89 59 -158 64 38 -116 -177 -144 39 -210 149 -110 -29 -21 -133 -104 -88 162 -227 78 10 228 -262
5175 -262 25 -48 -8 27 148 70 -21 -149 83 -160 41 -218 148 -18 100 -169 -140 -139 43 -145 27 -49 33
5198 33 12 -149 168 205 -6 230 -50 43 -15 -134 -112 -6 -66 428 103 6 -110 113 2 48 -53 -20 -50 220
5222 220 170 72 249 24 256 -54 46 177 33 108 -139 -134 16 25 -62 -177 -90 -159 184 -174 34 -7 74 -19
5246 -19 59 159 36 99 -109 209 -86 -192 75 -164 -56 -54 119 -147 10 -14 -67 36 -198 -126 -109 92 197
5269 197 -118 128 48 59 -38 30 134 -279 51 -132 9 -76 -119 -5 54 74 -86 -180 18 -59 1 -13 -16 75 15
5294 15 6 81 -169 -137 -7 31 -93 -217 -75 -262 140 7 41 -89 -220 -34 -278 -56 75 57 -64 144 -205
5317 -205 74 12 -88 -55 -69 -83 -118 14 82 155 71 141 -63 -148 150 -47 114 36 66 65 30 -66 -51 158 -232 -26
5343b6Q5m5N5j63K13j00j01L08j72p1pJ44j89K5J35M9l73K49j1p4K77k05Lo9L96
5368C33k19k6O2K4k2k30j63L56k16R4J2NJ8q7L16m4k80J82P0k17LL4l79M10Q1
5393A17k4m4L6j26J89k23R2J04N1K9q0k91qJ49p5Q2j13J82l5pJ50q3j74L52j95
5418E5K22j51q1l8N0N8l54K22m5J31K4j26L4J3k77L31j21O2m3jo4O6J15j59J86
5443A09r4j9J15k98J14o2K87j76M8pJ01Pj83pJ86j29L8j02o5J35K6k8j45J88j34
5468i5R0q8K40k08J62k9K1l28J31J45j09J72l2j68P7J29n6Nk6O6j17J2J99p9j52
5493c8p1L01q4o2k0k33J64Q4P1K9J0j82o7j5j0J54J42k29j45J95Q1j8k9L16n17
5518a73J03K42m1O3m09M20r0J71j43kj57q6J91p0j8n1J50l09O0J41K7k98L60K23
$$ plain form
5343 -26 59 14 69 -94 119 19 -82 226 54 -17 -24 120 -69 -44 91 140 -233 16 5 -69 208 3 6 -63 333
5368 333 114 88 150 174 152 -78 -241 115 -101 -7 5 10 28 -59 257 213 -67 115 185 -32 -29 5 -374 36 117
5393 117 93 49 85 -41 148 -75 17 121 172 201 121 -170 -178 -29 -104 -22 -135 47 12 5 155 72 -102 250 55
5418 55 277 126 45 7 57 115 -239 -17 -62 69 93 -33 1 14 -263 68 -53 9 -34 -35 -99 -33 82 -77 109
5443 109 15 -4 111 -187 -73 -135 152 -24 24 17 118 125 -58 -65 121 -8 30 -72 -137 -2 24 -4 -149 39 -95
5468 -95 -5 -93 147 -61 101 72 93 -235 -104 41 -68 104 72 -96 -19 110 54 59 33 99 -18 -6 193 114 -38
5493 -38 -109 192 108 46 26 -207 -43 41 112 141 151 -31 -98 -113 -123 31 173 -56 -201 -6 75 57 28 344 -173
5518 -173 -70 172 131 194 -215 205 115 286 143 141 -16 -102 89 19 1 -50 100 -209 -149 -8 19 -279 81 304
5542C04k81J57n7Q7k55k9O3J95j22l27J09J20M9O5k21J91k52J98k96L75k01Q2
5564d6n3P0QK4rj81J83N7j74J94o2J5K12k08j13j06L93R3j59k44J64K9J7n6j13
5589f5L16l40q2K01J2r0R0l11K22J18K2k06j04K52K06l70p9M7J85j73M09j53j07
5612@J74j97o7K28P5n8l56K13q7J15N1l04N8o4J51P0J15j22o3q8J40j15p3J84
5636b0rO0m7J22r5r0L9K38j95P9J73j32l20M43k71k6J04l3k5N6J76k77r2l7K06
5661B7o6j9Qq4P9K26l64K06K2o1K4n7J40jj85K96l09J92l1r4q7P7J53R5j27l6
5687B4j55K58j42k17K28J42k94K52j87J06N9N4r6j78L50j14j80l6J05l1J09m8
5709Ik32j4K64J06m08L16n7j6j5K81l49K28j91j3N8R3k03J9J05Jm3l3J25P3j22
$$ plain form
5542 304 23 180 123 210 -45 -74 -11 184 62 -265 -156 -36 13 78 -143 48 -204 -6 -302 73 -128 -46
5564 -46 -99 -29 -21 3 -6 -187 -4 53 -121 73 11 26 238 30 -83 -189 204 297 138 -106 58 87 104 48 -65
5589 -65 251 -89 -171 30 42 -48 42 -269 -47 71 93 -113 -217 35 241 -129 -208 -161 24 -149 260 107 0
5612 0 174 -23 -90 138 213 155 -201 12 -75 40 91 -213 -155 -219 -68 2 117 -5 -68 -156 -16 -131 -204 -20
5636 -20 -29 31 -16 106 11 -79 -40 198 3 82 255 123 -197 246 -25 -51 53 20 -5 51 227 -50 -142 -179 27
5661 27 -39 -58 -50 -134 -55 171 -193 13 35 -26 -2 -59 81 80 -105 191 -118 74 43 -51 -138 -61 92 187 60 24
5687 24 -131 127 -15 -232 -4 138 -156 96 -91 15 74 128 32 -146 204 90 -90 -126 -21 -52 57 9
5709 9 -223 -237 27 133 -275 41 -16 -32 -47 234 -115 113 -78 -91 -33 60 -143 -124 -19 -18 -61 -94 31 104 -18
5734a8j47L9K04km2j25L2R5j24L66q7k2l13J79J06j6k79K93l7j3j4o8L0j85K6
5759a22J60J6J04j99K08m59J33J54j86j51K18J85j13J03j67K90N7j58q0k06M98
5780B85k06j96J28N6l7p3N3j56J74j80L42k84M0K60k35M0l00K48K21l55O1J75
5802F1r3J12Kk34J47j36K10k12J99O4j59J22P6m7j60J96N9k57J82j8j00Q2l84
5825b88J94n9J99j12m5J56l1np3K6p4l8K53j22J27j60J56j67K37l2k02K8P6R8
5849A42k05M2k20M76k78R6J71l16J60j75O3k4Q9q3k0j32L36r8L39m57J33J09o0
5872H8j30K2k6J63j08k97L66k74K4K2N8l8L0K4n2M9j02J84l2j28R5m8J77K46k43
5897G0r1L8j20o0M26l75K73k07j31N1k2M8J69j64O3k4j7N8n0J26j72J55k0l08
$$ plain form
5734 -18 -165 -126 78 76 34 -91 -59 36 -88 278 191 169 -144 35 141 125 -154 139 102 89 75 7 37 -148 -122
5759 -122 38 54 158 -41 167 -292 -159 -5 -191 -342 -124 61 -52 51 -116 174 231 73 -7 -213 285
5780 285 79 -117 11 67 30 -43 10 -146 28 -152 190 -94 -54 206 -29 11 -289 -41 180 -175 -114 61
5802 61 -32 80 82 -152 -5 -141 69 -143 56 120 -39 83 159 112 -48 148 207 -50 132 114 14 96 -288
5825 -288 -94 -153 46 -66 -111 45 14 9 -64 -38 -112 -150 103 -19 108 -52 104 -63 174 142 -60 -32 44 142
5849 142 -63 -21 -241 235 -43 53 224 -92 68 -107 -44 -68 21 -62 -82 -214 122 24 363 -94 39 148 88
5872 88 -42 -20 -46 117 9 -288 78 -196 -172 -150 -92 -130 -100 -76 -128 -79 -181 3 -29 -157 -62 -110 67 313 70
5897 70 -21 17 -103 -163 263 -112 161 -46 -177 -126 -148 -100 69 -95 -32 -56 -73 -15 -65 61 -111 44 24 -284
5921b84J42J68J11j75k7J63r6J36k26J98k41j0J6PJ3J83j8j0j38K15j41J62l13
5944a65J05M13m78J07J83j61j15K81j67Q9o5p3o1J76k96K30j17P0m0J64o4J30
5966A46k39kJ50pn1J4P6o2K9k52K20L27l99J84j55j40j86K49J39N4k47J78r7k5
5990i6k11K77M6n7N9J09kj54m6J58k15J63M2k98K87j52j67R8K12NJ55k96j45K93
6014F5o6M9r5l0N8J72j52l0J93k58Ml1J35J05M7r0j68oK06o4O7K13l85r2J66k28
6040b15L15o7j10R5n0J87p5j10m1lJ79n0R7j67J23j05O5J91l25J21K92m02J01
6063D6k74K97o4L4l3j63M50l44l9N4o2J51j51J51j20K48l60j82L38K1O8p7J99
6086A88j39p4M1j95lJ04J90k71J55k0L65k12l80L00k89J63J11l75M99j67R1j52
$$ plain form
5921 -284 -142 26 137 -38 -65 98 2 138 -88 110 -131 -141 -125 -118 -105 78 60 50 -88 127 -14 148 -165
5944 -165 -60 353 -125 -18 165 4 -111 170 3 92 27 -46 -107 69 -227 3 -114 -44 -84 80 16 146
5966 146 -93 -95 55 48 -3 11 87 25 54 -198 22 349 -50 134 -21 -161 -347 -98 41 95 -152 26 -71 -96
5990 -96 -307 -30 16 -41 18 127 125 -29 -75 83 -132 31 73 -225 62 -90 -257 -159 53 58 213 -83 -228 65
6014 65 -1 48 -47 -77 -19 153 1 -29 164 -94 -90 -121 14 119 166 76 -92 -98 108 44 111 324 -61 -153 13 -215
6040 -215 100 33 -77 18 -32 155 80 -30 -71 -74 105 55 152 -15 108 3 68 259 -66 55 347 -55 46
6063 46 -228 69 5 39 6 -157 293 -51 -90 -36 -98 53 -98 53 -67 181 -179 -361 -23 -2 66 -11 188
6086 188 49 -25 16 -179 -182 -78 112 -159 -4 -24 341 129 -251 49 -240 -77 34 -341 158 -9 82 -70
6108g0r6J67j34K17j55J33P3k55L54q3k13Q7p8K33k05j91K17n7K87k16Q6m8K64
6131C17m11j2J3Q3J25PJ59p0j54J8j65n1L27j90j35j04K58j90O4l16O50j41j70
6154h8J56o4L61k86q5M1L8j47O8J48l89L14l3n5K5q7K73j93J5j28J60j35j5j19
6178b25K26J23k22K26j79J81j59RP0J1l79L96J36k42K77k08k43K76j36QK27k56
6200h3P2R3p3o3J91k26K34p7j85n6K59K04l08Q9J92j14l38O3J03J32k44J47M1
6223E3nJ34j55j07N3j08J24m1p3O2Ok3J53j27R4k4j46J63K7j19L76k70j25K70
6247A92j10K17l20p2J79j92L34l24J38K7r9j49J89N5P6j93p3K28lq3j9J60R6k79
6271b5K9j25J58p5Q6N5m09Q7J55J28r1k4J01l3K82m06Q3J25k77J07j0K11j41Q7
$$ plain form
6108 -70 -166 1 -133 84 -71 62 135 -120 234 151 -62 25 -53 180 -25 -216 1 -56 231 15 101 53 317
6131 317 -94 -106 -93 -10 115 122 281 211 57 75 -90 -141 186 -4 -139 -243 15 -175 -111 -427 223 82 -88
6154 -88 68 4 365 79 -6 35 73 -74 -6 142 -247 67 34 -21 4 -83 190 -3 12 -116 44 -91 -106 -225
6178 -225 1 124 -98 128 -51 130 -29 -20 50 61 -318 78 214 -28 249 41 -202 74 -62 -54 173 -83
6200 -83 -11 82 9 -54 137 -89 145 68 -117 -173 86 290 -18 71 263 149 -189 -126 -23 109 -135 12 53
6223 53 48 182 27 -80 -27 -135 -11 -52 -125 -63 -57 -80 73 -54 40 16 -130 33 60 -59 317 47 -78 192
6247 192 82 299 -21 -93 86 -106 228 -96 42 69 -30 -179 10 65 141 -52 -125 103 100 17 -2 158 254 -25
6271 -25 4 -121 37 -38 48 103 -306 -219 -64 64 -27 -51 50 17 299 -107 -24 101 -176 -69 -79 132 -9 78
6295G8J0j38J5j60L28mm2J1j97J56j32J18o0J77k30K28k63j82L83j95J20J1m0
6318hrK15k67K51k63K83j34j59K89k20jL8O3j23P6J87k75j73J45M9L5k19J85p4
6342a09O4J04M6n9k33L9J72k14r3N14j08j40j7J00l6n7p7K89j55R2l43K23Q1l6
6366D7k15K99k3l9j0j39nK90l14J85k55K72k77J21K0M6J2J01j02J58j92P1n2q5
6390h6J42n7K51l43R8l4K18j01M5j12NK80l70K90m14L42l93K50q5L37j81j85J45
6413D2n7QK7oNj9j16J57j21R3K25j70j06P0J02j50J37P8j05J25l48L5M6K47R6
6438B95k08j10q3J6j09K06j29J90j15K01m6l1k46J04J57j22M8J75k40K05j40J16
6460A34M7q2j31pj83M65k50o8k8j95J90O2J26k10J69Lk27J08R1J26j09N2j04J36
$$ plain form
6295 78 88 -50 -35 -195 133 129 87 98 -99 57 -75 43 -17 160 -70 158 -105 -287 96 -99 21 32 -8
6318 -8 -17 198 -69 182 -81 202 68 -91 198 -22 -23 15 78 -45 31 218 -57 -230 -85 -36 -1 -220 -35 -109
6342 -109 -45 59 105 46 -187 -148 24 -190 -283 231 123 -17 -34 66 30 -27 -104 185 30 122 -221 2 83 47
6366 47 -168 131 108 69 59 -80 -85 205 -109 76 -179 93 -184 -63 -43 3 15 116 14 172 -20 51 -1 -86
6390 -86 56 -1 250 -93 5 -29 189 88 133 21 26 306 -64 226 -188 154 -239 11 -74 263 82 -103 42
6413 42 -15 -7 20 14 19 0 -116 41 -80 13 238 68 -38 32 134 -16 121 199 94 219 -129 -94 -48 199 295
6438 295 87 -23 -106 -90 -199 7 -122 68 -47 154 108 77 -169 -65 92 -30 18 193 -47 158 18 134
6460 134 181 99 -32 -39 -222 243 -7 -75 -103 -298 -108 -46 80 -130 39 42 -185 -77 14 140 31 83 -21 115
6484A15p3k2J36lk22K43p4l8J9k29M35l94N5k0K13j29o9L0M5o0q2J40r5o3K38
6509I6nj67J93j36j15K02J49k2l02L47k69L81l82rJ28o8K8q4j38J91J33j10L21
6532C62j85J1r9k4R1o7k3K3j03j36L67j23K34k58Q4k88j29J71R0J19k16M22j75
6555A48j84K48k13M8J38k26OP1j78J94N3j25Q9l28K54J94j84k43P8o0K13l6Q8
6578D5J87j60J11l09J15n1j02K50k03q7J59p1J34J48l00p3J73j76L10k33K78O8
6600B13l66k6L14o4J52J9k65L1j35K69k18J40k14j43L15j8R2K12m88L61j16l19
6622b54K21p3r1J87K03l43R8J49k04J41j45K02j90J02J03j75p3R0J22o6J54q6
6644G2j21K88j08N0PJ7j90p5J04K14l95J99J10k72L9L6L59m43m0p0J93l0K02k90
$$ plain form
6484 115 42 20 156 153 -69 174 100 62 81 -148 287 -107 -52 -72 141 12 -57 -27 18 -42 -124 16 -79 -142 96
6509 96 91 -76 117 -19 -134 68 217 195 -107 240 -29 352 -30 -39 89 21 49 -35 -173 18 151 41 362
6532 362 177 188 89 65 156 89 66 89 -14 -150 217 94 328 70 154 -134 -263 -92 -2 117 -99 323 148
6555 148 -36 212 -1 47 185 -41 -35 36 -142 52 105 -20 69 -259 -5 189 5 -238 -160 -220 -7 -43 45
6578 45 232 72 183 -126 -11 -62 -164 86 -117 -204 -45 -116 18 166 -134 -207 -34 -210 100 -133 145 213
6600 213 -153 -179 135 71 223 242 -23 8 -127 142 -76 64 -150 -293 22 4 96 308 -180 181 65 -254
6622 -254 -33 -106 -197 -10 193 -150 -52 97 -107 34 -111 91 -99 3 106 -69 -142 -52 70 4 158 72
6644 72 -49 239 131 181 188 205 15 -60 44 258 -137 62 172 -100 -61 -25 334 -109 -149 -219 -26 -56 146 -144
6668a44K46j81R8r7p1L77l72J06J51q8j74K24k18K41j35m9K07O0l7j66K93m43
6690a72J91J29j69j97N61l28j33J28R7k20K10M8j33l8k17J44J47j47K00j22K47
6711B26j38j78Q2K3p6j40L25r4j26J01j29L22l25q9K47k3k5j3pJ37j23L6N7r8
6735b8j5l19K37J43%k70N13k70J57l80J76K1J21j80K14k34mJ10k9j65N31k55o0
6758A4r5P2M4r3K74j15O3o3J52m03K14l3k3Q5r4J58k54J8P2l8J36O7Pn5j46J09
6784G3k42J79l6j00K28k01K80k85L7J6j47L26j76kK7l38L37o6KJ16K0L6k17L58
6808B25k50pK19j93q3J73j29J26qJ09j63k06K10k37L3J64k02R9L6pJ4r0J89J80
6832B02l8k61P5pj8J33j41j99K07P2j66PJ90j23M8N1o5M0j70K5J30P3n5R2k59
$$ plain form
6668 -144 102 -79 19 -78 -149 228 -144 -38 113 25 -149 75 -143 98 -37 -86 121 181 144 -22 271 -172
6690 -172 19 148 -21 -218 343 15 -118 10 107 -113 97 145 12 -26 -243 -99 48 -99 101 -21 226
6711 226 88 -90 -8 15 -61 -201 124 30 -96 5 -124 198 -127 -216 31 8 -17 -30 -37 100 -23 13 70 -28
6735 -28 -43 -362 -125 18 18 -252 261 -9 148 -232 -56 -35 86 -94 120 -114 -118 -8 -37 -202 329 74 14
6758 14 -81 -9 35 -58 216 101 164 101 253 -150 64 31 8 93 -1 157 -97 -79 -7 -45 91 158 165 110 -36 73
6784 73 -169 10 -26 -126 102 -99 181 -104 -67 -51 -198 128 -48 -50 -23 -361 -24 -90 -88 28 48 84 -133 225
6808 225 -25 -32 187 -6 -89 84 -45 81 73 182 19 -187 23 -214 -181 -17 -219 -120 -84 -91 -77 -167 22 202
6832 202 164 -97 -22 -29 -47 86 -55 -254 -47 25 -141 -134 56 -67 -19 32 -33 7 -163 -138 -8 65 10 102 -157
6857a57r1J91J13k1q3N1l10J24K78j69J09m28O47l5l15J46N8q3l0R3o7J51l6m82
6881c46M95j79J24j52k8J51r9j93J15O9N9j41J05oN0q1p5p7R8J81J58k6j26k1
6905E5K0j47l1J91j36j26J22K17j20J11j60M1K9J27j84K07k21rN7j11O8J45k69
6928a24K27j67j1M5k43K89Qj55N51l77j1J6QQl38J56K93J3l84K28j17J37m1p6
6952f5rm1J30j07N7K13l1j89l6R3l1M2Lk44J39J63l68J14J46o9O0K10j36j3J21
6977A52l46L41l8L9j67j80O6J88n5m3J44O3j77l8J80k21K53O9k34R9m24M97N3
7000B21j67j19P9J68J78l38P1k8l2J59m03K73mq0m4K03k34m5K99k04jj25J68N9
7024E4Mj35R6K0j02k03K42K98m22J78j18P5J65j08K41l92L45k43Q0k44K81j38
$$ plain form
6857 -157 -248 -57 56 35 -48 3 -307 -183 95 -74 35 -393 254 219 -96 50 108 25 -5 88 21 172 136 -346
6881 -346 149 -30 94 -58 -86 65 -34 -227 -112 -43 16 -125 -20 -26 24 -57 -132 -209 -111 70 228 202 76 55
6905 55 75 -72 -103 88 -48 -174 -52 165 45 156 -4 37 66 193 9 216 -5 -14 43 -68 0 145 -124
6928 -124 103 -64 -75 -30 -273 16 24 -131 420 43 32 48 56 64 -274 -118 175 188 -196 32 -85 52 11 -65
6952 -65 -74 -115 15 -92 -35 178 147 -42 -78 15 -16 26 29 -215 -76 87 -281 -167 -21 -90 -30 180 44 31 152
6977 152 -194 147 109 148 -19 -199 -133 55 0 -43 101 164 -13 -51 129 -92 161 230 -4 95 -329 168 221
7000 221 54 -65 14 182 360 22 93 65 33 192 -211 62 58 -22 -66 137 -97 -142 157 -47 -48 -173 -5 54
7024 54 58 -77 19 39 -63 -266 -24 274 -148 30 -88 -13 152 44 285 -107 238 -5 75 -169 112 -26
7046b6j15L66l2j47O5k64K06J51j06n5p2j2l2j9L61l47j7K97J7l14J94k1j75N8
7070c9J46L5l2O8j41k04J07r9o4J14J29k8J5OK54j43j19p9L20m63nK39k0j14Q
7095a09k26L64J19l32L17l72J01N6L46m48K11j07p3kJ37L2j9k0k4J81j34J83j24
7118E7QK1j34J72n6r2P1J96k18j69J41P1j2q1J44j11J7J7p5J29p6J33j00kj98
7143a47M7J36N6k25L38j18N3j76J3j29mK59l26M6J46J31L8j32Q2q0J4j4J00J52
7167B60r9q5k10m4Q5P0o0J80q0j35O1j17N7j04K21K9P3j28J34j73M5J18j87J44
7191E5k08q7M5L41j88K48m48J96NJ06O4j80J92j12L0l32L52J6p8j89o3K85R7l99
7215b52r8N33l47K86o7J00q6l81M12j03o9P2j68J63K53o4q5R0m2k21L7K14R1R1
$$ plain form
7046 -26 -141 225 193 46 111 -153 53 204 98 43 -29 -41 -73 -92 269 -78 -95 202 219 -95 99 78 -97 -39
7070 -39 107 142 110 178 37 -167 -60 -159 -223 -109 20 -8 7 13 267 124 5 -74 246 -217 -222 17 -3 -117 -109
7095 -109 -335 29 148 -184 133 -239 -138 -82 264 -184 27 -80 -153 -155 -18 14 -5 -25 -49 132 -2 181 57
7118 57 65 86 -48 124 68 -24 47 243 25 -144 -3 68 56 -25 119 8 25 42 -33 96 20 153 53 51 -147
7143 -147 -100 36 92 -133 205 87 140 -36 -23 -152 -156 103 -223 -177 -31 100 138 6 88 8 22 8 108 260
7167 260 161 76 -134 -178 -93 -23 -83 97 17 -118 -57 -174 -117 -221 0 29 102 -26 108 -65 -20 98 -89 55
7191 55 -153 -240 -195 146 -42 206 -242 -46 -41 65 129 -51 141 29 59 -273 79 95 17 -172 -235 50 147 -252
7215 -252 -350 183 -164 122 55 155 69 -312 100 -3 -72 0 -168 -5 248 184 99 189 147 -74 -37 177 268 359
7239C59k42k70r7M24k21l8J13j38K48Q6p4j61K2J74j11k94L53k23R6nL0l4j49
7262a52K61j61J75j85r4o0J85J37j49K57k98R3J86k36M7M2qm2K86l02J11l56L93
7285A30j8J6j22R2j73J4jk14M37o4J36j71m24J44J83q6O6m5K22j1n9K8j42J42
7309H0l33L21j0n6j07K5o6N9K93l46L17k34n3K1J30J5p2J35k43J41k4L0k37J08
7333a06K12P3l52L47m16K39L3j33O7j15L89j07r3k96L27q4j84J75L9P3k68M77
7355B97k88k56Q7o5J16J57K49l20K05j98k44K27N6J42k25j02J63K0R7K3j13J9
7377D7j95J83j47M9J4K40k31QJ35l69L88j92L7M6k3Oj4qK69r1r0p1r7K5J20K9
7403F8k39J43K7l42L19R6N9q7k14J65q0J99j06K5j89K78k32k3K80K4m3J6l20P5
$$ plain form
7239 359 117 -153 -250 174 -47 -85 28 -110 138 224 150 -11 11 185 74 -220 133 -90 6 1 31 -3 -152
7262 -152 109 -52 123 -62 -156 -216 -31 106 -43 214 -84 9 195 -41 6 48 40 -2 284 -18 93 -263 130
7285 130 112 128 6 98 -75 -61 -62 -276 161 97 233 62 -362 -218 -35 -121 -55 -100 122 111 52 80 -62 80
7309 80 -253 68 58 2 -105 -80 -146 -87 206 -140 177 -57 -110 -89 41 56 -16 119 -124 17 -7 23 -214 -106
7333 -106 106 179 -173 174 -242 -3 30 -103 -36 -151 238 131 38 -258 69 -15 -199 -24 15 88 -180 297
7355 297 9 -247 -160 -225 -109 48 297 -23 182 -16 -260 -33 23 165 -60 -162 1 21 118 141 28 47
7377 47 -148 35 -112 -63 -49 191 -40 -32 103 -266 122 -70 -33 13 -10 -4 -18 -26 243 152 62 -9 -106 -81 39 68
7403 68 -171 -28 -1 -343 -24 72 131 44 -170 -5 -85 114 8 33 -156 122 -110 -133 147 171 128 144 -176 -101
7427a01L47l22K26J3n9j28P4P4k59K27l55m1K01J66J8k03M7N5m8R0j15J49j18
7450f2l2L06l15J08J43k46j13L40j43m9J34q2k7m4j9Q0J23j05Q7oK22l07j00n
7474a12O7K47k35L2N9r9J89m1p7j62R0L6k8l2M8O2j47J75l46M70j53L0k69J07
7498h9Q2l0J89k09r0K49k21J83k62K46K40l71r0K79p7Q3j31J80j28Q5j47L7L5
7521D3Nk61J50J11k58J06K48j32J85k08J4p8J53l3M3l8n3j30K55k28n5K24n2J13
7545A24K09o6n9j51K09k31n7K35j54JR1l75K14N7j86N2K26j91kj18K53j20M6Q4
7569I1j85K39j35j01P5j54J98k18J52K37k62K22r8j74M5L54m32J17K29j77N6J56
7591B35j56pk68J51J14m8j75N2j67Q4J44J71l21J53K9k83R7K06j60L68j33nj04
$$ plain form
7427 -101 246 -76 150 163 104 -24 50 124 -135 92 -263 -304 -103 63 81 -122 -75 -20 -68 22 -93 56 -62
7450 -62 -94 212 -103 5 148 -98 -211 129 -14 -63 71 -11 -38 -82 -101 -21 102 -3 84 78 300 -7 -107 -112
7474 -112 -45 202 -33 -1 58 -41 148 107 30 -132 -42 -6 -34 -66 -18 44 -103 72 -274 196 43 73 -196 -89
7498 -89 -7 -37 152 -57 -147 102 -119 64 -198 48 288 -83 -173 106 29 112 -19 161 33 118 -29 8 43
7521 43 48 -213 -63 48 -210 -104 144 12 197 -11 3 -75 78 45 88 50 -3 -133 122 -106 -161 63 11 124
7545 124 333 267 208 57 266 35 -22 213 59 60 151 -224 -10 47 -139 -87 139 -52 -54 -172 81 -39 7 91
7569 91 -94 145 10 -91 -16 -170 28 -190 -38 199 -63 159 61 -113 -68 286 -146 -29 200 23 79 235
7591 235 79 72 -196 -45 69 21 -154 -102 -269 -185 -41 130 -191 -38 -9 -292 -195 11 -149 219 86 81 -23
7614b3Q7J90n1j12M9k67J98r0J61q9j48L34o36N34n3j17O3j43Q9J38q3N1j13R
7638b2P6k19K1L16k31Q4l6O2p0K28k00R5l10K41J7L7k9k04L70j88n2J75l33J84
7662A2j83L15m4p5J05j68J22K6K9m8o0p5K49m9q7N3R9k79J24j44J58j53J63j37
7686d7m8J5L2J34o9l7M8N4K48k82j67J54L7pk0j61K44j87M7j6J0K10l77J47O9
7711C1k36L36n2r7j75M3K3K56n49L44j95L5J88qN1p6K20o1k70L37k29P1l5j15
7735a63L8k5J22J16k0j6K07q8m51K91n1K61l01N9N0l01M24j58L14j02r1j50j5
7758e0J26k8q8k14L10M7j78j49J91P7J13j2m05M71q3L1m4J60k76j14J38K36j45
7781A14j35J46k28K16M3k54K13j75N9K97m03r0K49j25J31N2j61J36%j19O0L90
$$ plain form
7614 -23 64 254 203 91 140 -127 71 -19 142 53 -95 239 -397 137 84 -33 30 -113 -24 114 31 82 -31 -22
7638 -22 54 -165 -144 172 -59 25 -11 51 -19 209 9 104 -206 35 52 89 60 -144 226 38 -14 161 -172 12
7662 12 -171 144 100 25 130 -38 84 110 139 91 31 -44 205 156 69 122 221 -58 66 -78 80 -73 90 -47
7686 -47 -95 -80 -48 86 17 -20 28 82 330 48 -119 35 72 65 45 -116 128 -59 -12 -28 -18 192 -185 -38 31
7711 31 -205 131 79 -18 -193 -150 -127 129 -420 -76 -271 -236 -48 -56 -5 -81 139 78 -192 145 -84 -13 -48 -163
7735 -163 -125 -150 -28 88 68 52 259 171 -280 11 -40 221 -80 -21 29 -272 152 -6 308 206 115 -35 -50
7758 -50 76 48 -40 -254 56 103 -75 -224 -33 44 157 145 -260 211 128 159 115 275 -1 -115 23 259 114
7781 114 -21 125 -103 113 156 -98 115 -60 -1 296 -107 -197 52 -73 58 110 -51 85 85 -34 26 416
7803D16n22K09M1j84R1k36K21J24nl54K62r2j7N6K01l06K29j51j1J20N3J64k26
7826H3L1j12k9p6P9j49J71J29J32R3m76K19lj13n2J16j07J98j31J71n6j08j15
7849a05K18k8J25k46N3k38K19o5J8K06k73K03l43L14k69J97j34K84Kj99Q6p7J02
7872E0kj09K38k83K62q0J70l5k71K24j26J63j85k1o8k6j33J72J43r3m2J1K7j00
7896a14K38l78J65L27l72J15k6L00k58N9j47J22r1K41k19J53r1p1J7Qn1J17j97
7919a53J17k10K64K5m6k75M45J30j10k93K49k11J11L4o7P0l39J92R0J58j34J01
7941A48N6l33L8j2L84k53p8N1p1J70r8k21M7J64K55k11k40J4K12J2j41oK5J50
7965F2j2J36R0k59j76K30j21L5L4J10l24J76N5j16K10j16j88K23k41K21Nm6L1
$$ plain form
7803 416 -106 103 144 -40 51 -185 36 160 155 -199 63 -29 -46 10 211 -95 134 -17 -28 92 145 309 83
7826 83 114 2 -27 -103 -24 -173 -2 127 259 352 -124 95 92 -21 -73 43 -64 134 3 174 118 10 -105
7849 -105 113 85 210 -36 17 -221 -2 -67 -49 157 -116 87 -256 58 -211 -14 -148 136 138 -61 25 -52 50
7872 50 48 -61 177 -106 156 76 246 211 -60 164 38 201 16 -5 -73 -99 -232 -60 83 -10 -52 -41 -14 -114
7896 -114 124 -254 -89 238 -134 -19 -45 255 -3 56 -91 31 -60 181 -38 115 24 -47 -30 -22 -73 44 -153
7919 -153 -36 -246 18 43 -3 -278 167 297 187 -106 143 -68 43 77 10 80 -259 -67 23 181 47 148
7941 148 204 -129 -91 -103 281 28 -50 1 -70 100 2 -219 -172 -8 247 36 -204 -190 22 34 -107 -113 -88 62
7965 62 50 186 276 17 -159 71 -50 -15 19 129 -195 -19 36 -80 130 14 -174 49 -192 29 34 -12 19
7988A9k5J7K28k11j73R4P0j28K50j51j6o0R3K23k66K11j80k32M5O5J45j28J75
8011F5l50M07o5j14J6J38k7j25J09j24J57j74N1J12k13J86P1k99J72Q7m0R4j20
8034A4l9J41R8l59m9K57j63J06j49J24j36K36k61L56k57O0J6K86l51Q1o6j0r5
8057a60K37l0j30L08k87J13j66K61j32j11K69J07l92P7N8K5j00l7q5M7K13q8K
8080aJ94j70k7j72J00O3J4Lj15L35j11r8J70p2Q4o0j48L24m34K52k51M5J83k58
8104a50j55K37j04K28k9j48N5l8J23l59K82j48N37j43k43o8J70Jk22J38j49L83
8126A98l69K42J29j6m58K58R5o1m9K38k66%K0k87J91J02J40k75J20M6Q3j27J54
8149A08k9q6M48n67K42l09j20O1M63l64K09k76K0J34p9rJ62M62m27j9j04l6l7
$$ plain form
7988 19 -6 11 239 28 -145 -51 19 -109 141 -10 -26 -86 7 230 -36 175 -5 -237 -192 -127 18 -110 65
8011 65 -285 122 57 -57 -41 97 70 -55 54 -70 87 -87 -36 76 -137 49 120 -179 -7 80 40 134 14
8034 14 -25 116 214 -145 -194 63 -100 6 -143 -19 -155 81 -180 176 -81 -21 -5 281 -70 11 -55 -65 -160
8057 -160 77 47 -83 225 -62 51 -115 146 14 -97 172 279 -113 -36 22 47 -53 -90 -175 -128 85 -3 -1
8080 -1 193 23 -4 -176 -76 -13 1 4 -111 224 113 15 185 113 197 137 -11 313 -121 131 -120 -75 108 -150
8104 -150 -305 -68 -172 56 27 -121 -66 -104 19 -340 -58 -206 331 188 -55 -123 47 48 -174 -36 -185 198
8126 198 -171 71 200 184 -274 -16 79 18 -31 207 -59 -59 -39 -326 -135 -33 107 -168 -48 -2 81 -46 108
8149 108 79 -7 441 -126 116 -193 -313 -252 211 -153 56 -220 -200 -66 -145 -154 8 470 43 24 -80 -116 -153
8172a53L10k45J67J0j9m7k8j14J25m4l1l6J31m4J05K5k48l7J94
$$ plain form
8172 -153 157 -88 79 89 70 23 -5 -119 6 -38 -69 -105 26 -18 87 112 -136 -173 21
8191B1
$$ Imaginary data points
##PAGE= N=2
##DATA TABLE= (X++(I..I)), XYDATA
0@%%%%%%%%%%%%Qj6J6j6J6j6K4l2L9m7N2o0P2q7R9j10J26j47J67j91K16k40K71
35A44l07L46l86M29m79N33n92O56p24Q00q83R74j075J184j303J437j583J744j925
54a010K129k362K627k931L288l714M230m871N686o768Q275j0508J4147k1016L8099
69B5301j51202j95861N20368l1145m00790K32757K22230l57939K9046L48693k46193
80d735k62242L76890R8666l73307P9138K83526k25298j37842K74620k2148k48774
91a61506J55351J58159k19453l5918K16300r5492j65868J89656R2490k25494k945
102i4720K07153p2581j43287J20635M6337j31758O4098J17944j52715p4752J98791
113H5145R923j98229N7299J48214j06590o0433J25120m3942j11733J24737O1497
$$ plain form
0 0 0 0 0 0 0 0 0 0 0 0 0 0 8 -8 8 -8 8 -8 16 -16 23 -24 28 -32 40 -47 52 -58 68 -79 88 -103 113 -127 144
35 144 -163 183 -203 226 -253 280 -312 344 -380 420 -463 511 -564 620 -683 754 -829 915 -1010
54 -1010 1119 -1243 1384 -1547 1741 -1973 2257 -2614 3072 -3696 4579 -5929 8218 -12798 25301
69 25301 -125901 -321762 198606 167461 -233329 -572 221658 -136281 -107235 241458 -4735
80 -4735 -266977 109913 208579 -164728 -85590 197936 -27362 -165204 109416 87268 -161506
91 -161506 -6155 152004 -67449 -103367 112933 17441 -148427 41229 133719 -91775 -94720
102 -94720 112433 39852 -103435 17200 63537 -68221 -4123 113821 -38894 -113646 85145
113 85145 95068 -103161 -45862 102352 -4238 -64671 60449 16507 -95226 29511 91008
124I1008j67167J1214J60820q1450j11307J24655L2592j32470M7899J05227r8466
135a7445m6393J13458k2783r1442Q1519M6316j10573Q638J12088n1304q7289O8881
147C671M3770o4495K805M4205m2216j7826O5708j1544p7985L1732P4287m3561
159H551n7103M9422K7818m9879O015M2797l8648k2824O5929l182p5152L4971O4798
172E3513o4406l2504Q3472r841p9710N1444N1858p9551p515Q0732m2881n5220
184e0609Q2685Q374j00560M0227Q6631p9714m7933R3856l822p8318N2024L8232
196D1073q2462J3927Q7475n8658o4730Q7836K6106r0452J7979O9479n2355l1319
208c6101P1800j1944o9119M8689M6107p2701j2683P7173k4214o4328N2709L6073
$$ plain form
124 91008 -76159 -64945 95875 14425 -96882 27773 60365 -72105 -24206 81021 -17445
135 -17445 -63838 49620 26837 -64605 16914 63230 -47343 -38705 73383 22079 -65210 3671
147 3671 47441 -17054 -14249 29956 -12260 -30086 35622 24078 -53907 -22175 52112 8551
159 8551 -48552 870 28688 -21191 -15176 27621 -11027 -33851 32078 28896 -46256 -11285 53513
172 53513 -10893 -43397 40075 30234 -49476 1968 53826 -25725 -33240 47492 4611 -50609
184 -50609 32076 40450 -60110 -19883 66748 -12966 -60899 32957 29135 -49183 2841 41073
196 41073 -41389 -27462 60013 1355 -63375 24461 50567 -39885 -21906 47573 -4782 -36101
208 -36101 35699 23755 -45364 3325 49432 -23269 -35952 41221 17007 -47321 5388 41461
220D1461p0016j720O7254l3198m7213O0181J3487p1680K6100O4752n9960l8693
232d9245Q0355L153p7690L5776N4321o4205j3714P5114l1281o2477O8433L0403
244D8943q6598J1050P8054n0046m9237P3366N251p5603L7420N3362o8501j6686
256c9225P7632k4093o4188N6930L3760p1676M482O7018l7969m2443N9269R828
268B9325o1717K4676M8827n0320k2626O1208o986n6230L2556L7515m9786j1561
280b5119N3402j8634m3414M0458K2735n4328L137N3431k9779l8780M8652J4499
292B6260n4959J4442M7658l9218k6229N4608j559n4342L1212L9490n1088j2503
304b6228N7532j7292m7949M2662K4064n5929O102N1775l4838l3684N1674N333
$$ plain form
220 41461 -28555 -30275 36979 3781 -43432 16749 30236 -41444 -15344 49408 -10552 -49245
232 -49245 31110 34263 -43427 -7651 46670 -17535 -31249 43865 12584 -49893 18540 48943
244 48943 -37655 -26605 51449 1403 -47834 25532 30783 -44820 -7400 45962 -22539 -39225
256 -39225 38407 14314 -49874 7056 40816 -30860 -26378 40640 2671 -39772 19497 29325
268 29325 -32392 -7716 41111 -9209 -31835 29373 22387 -33843 -1287 36228 -13558 -25119
280 -25119 28283 9649 -33765 6693 29428 -24900 -21763 31668 1889 -36891 11761 26260
292 26260 -28699 -14257 33401 -5817 -32046 22562 21003 -33339 -2127 37363 -13725 -26228
304 -26228 31304 14012 -33937 8725 32789 -23140 -17038 34737 -101 -33785 17889 23222
316B3222n4806K2565M1188m3859j7298N1426j0422m4774L4631K5910m7410p33
328b0360M7859k2489l4282M0247J3856m5342J0143L9474l0067k3252M1858J721
340A9366m2999J9694L2561l6506j5184M3244p347l9982K6747K5038m0148m577
352b0093M2529j8107l3618L5956J6087m4693P154M1838k7678k6606M1804N092
364A9665m3427J8993L3362l5969j4090M4691r768l9838L0250K3852m2596j970
376a6845M2253k0793l1206L5980J0349m1997J1976L4870l0807j9310M0649j473
388A3646l9399K1591K8510l4877r383L9217j0255l2632K8411J7810l7234K072
400a2523L7696k1245k7098L4541R885l9788R973L3310k7239j9485L6883j085l7132
$$ plain form
316 23222 -31584 -9019 32169 -11690 -28988 22438 12016 -32758 1873 27783 -19627 -20360
328 -20360 27499 5010 -29272 10975 24831 -20511 -10368 29106 -961 -24213 17645 19366
340 19366 -23633 -3939 28622 -7884 -23068 20176 12829 -27153 -406 24632 -15516 -20093
352 -20093 22436 4329 -29289 6667 22754 -21939 -14785 27053 -625 -27231 14573 19665
364 19665 -23762 -4769 28593 -7376 -21466 23225 13457 -26381 3869 27721 -14875 -16845
376 -16845 25408 4615 -26591 9389 19738 -22259 -10283 24587 -6220 -25530 15119 13646
388 13646 -25753 -4162 24348 -10529 -19912 19305 9050 -23582 4829 22639 -14595 -12523
400 -12523 25173 3928 -23170 11371 21256 -18532 -8559 24751 -2488 -21973 14910 13825 -23307
413b3307K0366K6352l5545q798M0280j1848l4818K9461K0205l8743N89L7856k0240
426A810k5329L5272O666l9388J5597L2757l2366j7057M0740l121l7801K1891K4176
439B3847l4587m592L6466j6492k9272L2112J2596l9982O940L5850k4682k3298
451b5094L5623M591l6534J4836K8074k9715j0377L6280q608l2437K7014K0745
463B4398l7396k861L8652j4794k9240K8290J1810l3860Q095K9459k6911j7234
475b1592L7542o31l8784J7181K9366l0750j2634L5156p519k9883K5253J6178l5055
488a6172K830L5287k0203k5263L3965R020l7288R715L2021k4910j7567L2459j044
501A2850l0862J9634J9899l3747l410L7538j4615l2470K7218J8922l3459q94K9263
$$ plain form
413 -23307 -2941 23411 -12134 -20932 19348 7500 -27318 2143 22348 -16395 -15806 22050 1810
426 1810 -23519 11753 18419 -20969 -5372 27385 -4981 -22038 18702 15581 -22220 -329 23847
439 23847 -10740 -15332 21134 4642 -24630 7482 20078 -19904 -12964 22886 -1796 -25094
451 -25094 10529 15120 -21414 -6578 21496 -8219 -18596 17684 9076 -23361 3653 24398
463 24398 -12998 -15859 22793 7999 -21241 7049 18859 -15001 -6906 22553 -4358 -21592
475 -21592 15950 15319 -23465 -6284 23082 -7668 -20302 14854 7335 -22548 2705 18883 -16172
488 -16172 -13342 21945 1742 -23521 10444 19464 -17824 -8109 23912 -998 -18565 13894 12850
501 12850 -18012 1622 21521 -12226 -15636 21902 7287 -25183 2035 20957 -12502 -13396 15867
514A5867j7251j7407L0009R50l4678J6954K9724k9570j6124L5197m70l1350J7653
527d96K0103k8609k982L1273j4216k5056K8264J0700l4711O028L2043k1970k2141
540b1770L0692O371l1545R644K2446k3176p360K9831j0308k8568K5639K0079l3741
553a1766o159L3568q465k3051K0335Q230k6095J0015K4731k5006j5306L2890K079
566A6000l3048J2327K3832k2980j0295K6915o378k3862J9713J2972k8106J586
578a1324K8301j6943k1368K8128R316l1683M384K7537j5575j5491K3073m34k2638
591a4717J7353J6606k8894n760L3623o337k9713J6693J7922k2117k491K0987j3994
604h39j4407K5138L110l0502R069K6761k0029j6538K5661K565k4734J1205J7671
$$ plain form
514 15867 -1384 -18791 11218 12168 -22510 -5556 24168 -5402 -21526 13671 13201 -18149 -496
527 -496 19607 -9002 -11984 19289 5073 -19983 8281 18981 -15730 -9702 22341 371 -21770
540 -21770 8922 15293 -16252 -6608 15838 -7338 -14698 15133 4825 -23743 1896 21975 -11766
553 -11766 -17925 15643 7178 -15873 4462 12692 -13403 -3388 21343 -3663 -18969 13921 16000
566 16000 -17048 -4721 19111 -3869 -14164 12751 6373 -17489 2224 15196 -12910 -11324
578 -11324 16977 34 -21334 6794 16110 -15573 -11189 16348 773 -14718 8355 7921 -14717
591 -14717 2636 19242 -9652 -15412 18211 11874 -17839 -1146 16776 -5341 -7832 13155 -839
604 -839 -15246 9892 13002 -17500 -8431 18330 -1699 -18237 7424 9989 -14745 -3540 14131
617A4131k0722n181K4513q160k0757K0856J1475k7517J351K8524j2996k1545K0204
630D176R728k2253M735J6974j8397p234K6290n277k8299J6258K1697k3472j0446
643a5520K4291l672j8540J6008P919k3102N090K3843j6444j7200K4383P064k6088
656a1968O354K1459j6606j1546K2500j273k1113J3260J2988k2087j720K4692j0922
669D018k1772J9864J2942k4021j615K1046j0184j2316J8529J47k1867J2838J9005
682A6614k1980j0521K6223l17k2856J1665J4059j8272j787K0930j1695j5822K0617
695F858P006k4743M146K2221j5384j4352K1407K595k2161Q658J5829j8110n135
708a1165K1545p273j8881J7593J1692k3074j327K3175q808j6008J6190N634j8428
$$ plain form
617 14131 -6591 -11772 12741 4581 -16176 4680 16155 -11362 -10011 18513 5517 -16028 4176
630 4176 13904 -8349 -3614 13360 -5037 -12271 14019 8742 -19557 -3299 18398 -5074 -15520
643 -15520 8771 5099 -13441 2567 10486 -12616 -7526 16317 -127 -17327 7056 14120 -11968
656 -11968 -5614 15845 -761 -12307 10193 8920 -12193 1067 14055 -8032 -9752 14940 4018
669 4018 -17754 2110 15052 -8969 -10584 10462 278 -12038 6491 6638 -15229 -2391 16614
682 16614 -5366 -15887 10336 10019 -12837 -1172 12887 -5385 -7172 13758 2063 -13759 6858
695 6858 13864 -10879 -6733 15488 104 -14248 7159 9754 -12407 -3749 12080 -6030 -11165
708 -11165 10380 3107 -15774 1819 13511 -9563 -10890 12285 3477 -12531 3659 9293 -9135
721i135O996J5714j6595q395K2430j696k1724J0713J5538j7389n696J8588n694
734C655j5641J4815P206k0224L086J8900j2432j3273J8598M334j9994O029J6243
747A1302j3843p672J8011k409j5863J1723J0648j8172j348J9652p238j6387J4667
760C071P960j7540J558J5204j0913r124J6192K66j7367P664J4006j4820p010J7371
774F518j838j5660J0013J0031j5017j316J6247o932j2686J4395N528j6346K287
787d776J6178j0225j0461J4887K245j5937O520J2090j3578n310J5905k873j5424
800a0759J0456R798j5165k646J6419o329j2419J2612N490j5717K830J5018j0607
813a019q785J5286J976j6198O842J2796j3176n493J5950k744j4358J0520Q731
$$ plain form
721 -9135 -2139 13575 -3020 -11415 11015 9319 -12405 -1692 13846 -3543 -9239 9349 3655
734 3655 -11986 2829 10035 -10189 -7103 11797 -635 -13908 4690 9024 -10970 -4941 11302
747 11302 -2541 -10213 7798 5389 -10474 1249 11897 -6275 -7623 12029 4791 -11596 3071
760 3071 11031 -6509 -4951 10253 -660 -9784 6408 6674 -10693 -3029 10977 -3843 -10853 6518
774 6518 4680 -10980 -967 9064 -5953 -7269 8978 2046 -10640 3755 9283 -7063 -4776
787 -4776 11402 1177 -9284 5603 7848 -8089 -1569 10521 -3057 -8367 7538 4665 -10759
800 -10759 -303 9495 -5670 -8316 8103 1774 -10645 1967 7457 -8260 -5430 9588 -1019
813 -1019 -9804 5482 7458 -8740 -1898 10898 -2278 -7771 8179 5435 -8923 1597 10328
826A0328j5411r68J5380p280j2109J3009N116j6263L105J4071j0656q535J5100
839D887O25j5399P582J1313j2874m326J5637l548j3482J1255P768j5015L45J5097
853I865q000j0739J3391L485j5017M579J2611j1600p096J4693r75j4645Q560R747
867H859j3643k718J4492m796j2329J1423O217j4346J612J3751q473q960J3569
880D658K267j4512N779J1521j1401n337J4077j907j2859Q500Q043j2650j655J3515
894H039o042j0951J1019N088j4010K036J2520q609p887J2583Q84j2785N661J0256
908G802j0930m179J3240j950j1946Q402P732j2288q47J3125n784r485J0479L968
922G339j3035K785J1196q897p094J2602K70j2920N992R350j0900l911J2772k918
$$ plain form
826 10328 -5083 -6051 9329 2049 -10060 2949 8065 -8198 -5093 8978 -1678 -10213 4887
839 4887 5512 -9887 -2305 9008 -3866 -8192 7445 3897 -9585 1670 9438 -5577 -5232 9865
853 9865 1865 -8874 4517 8002 -7015 -2436 10175 -1425 -8521 6172 5197 -9448 -888 8859
867 8859 -4784 -7502 6990 2194 -10135 1288 7505 -6841 -5229 8522 49 -8911 4658
880 4658 6925 -7587 -1808 9713 -1688 -7025 7052 5145 -7714 786 8829 -3821 -5476 8039
894 8039 1997 -8954 2065 7153 -6857 -4821 7699 -910 -8797 3786 4670 -8115 -2454 7802
908 7802 -3128 -7307 5933 3983 -7963 439 8171 -4117 -4964 8161 2377 -7108 3371 7339
922 7339 -5696 -2911 8285 -612 -7706 4896 5166 -7754 -1762 7588 -3312 -7223 5549 2631
936B631j1141Q893O522j2470J48J2462n949r414J1398L796j2643L123J1142q945
950d47n943J1869k0j2184O490Q527j1204l023J2576l561j0984Q938N681j2181
964e466N21J1664o949p863J0863K204j2231M480J0175r483n333J2608r28j1156
978f894P011P222j0308j468J1271m437q997R187M370j1885J778J0701p017p341
992f807J0082J400j0763M133Q124q811l839J1041j856j0403P502O595j0641j073
1006e316J1039m112p983Q372L235r867K545Q997p143n307J0278K92j0711M984
1020f97P860q721l579R842j999q609O342M892r954L82R450n248p357Q804L749
1035E157j0463J685R107n855n321Q959J70q992N320O824q759k419J0401k082r407
$$ plain form
936 2631 -8510 383 6905 -5565 -5417 7045 1096 -8318 3080 6876 -5767 -2644 8498 -447
950 -447 -6390 5479 5459 -6725 -235 8292 -2912 -5935 6641 3080 -7904 1034 6715 -5466
964 -5466 -4945 6719 -230 -8093 2770 4974 -7257 -2777 7398 -2085 -7418 5190 4262 -6894
978 -6894 117 7339 -2969 -4437 6834 2397 -6600 2587 6957 -4928 -3150 7551 534 -6807
992 -6807 3275 4675 -6088 -1955 6169 -2642 -6481 4560 2704 -7699 -197 6398 -4243 -5316
1006 -5316 5723 1611 -6372 2000 5235 -4632 -2087 6910 -233 -5540 4738 5030 -5681 -697
1020 -697 7163 -1558 -5137 4705 2706 -5903 439 5331 -4623 -4241 5209 -39 -7396 1408 5157
1035 5157 -5306 -3621 5486 -369 -5690 3269 3439 -5553 -233 6591 -2168 -4587 5814 3732 -5675
1050e675O423N678q750j015Q859m847o115P775J904r851L348Q387p553n301R537
1065B804P70r581M250O687p367j858Q713k899p362P705M122r900J45J0171m255
1080B145p337P360K935q540K270O830o793l692R084j090r359N605O444q497k685
1095e320R142k397p372O300L679q479J282Q438n667n416R064J655r904L134Q362
1110F501o609m145P931m10p231M981M260q167l26R169m232p954P201M291q742
1125c482j41P550m328m539P280N3p858M218O707p785k940R409j224q096N126N197
1141E147p091j027P745l769n187O870J965q762K652P248n866n027P766R17p827
1156d246K529N712o084j623P595l306o483O589L868q525k53Q574l210n798N980
$$ plain form
1050 -5675 748 6426 -2324 -3339 5520 673 -5442 2333 4237 -5614 -2266 6121 -1432 -6733 2804
1065 2804 3574 -6007 -1757 4930 -2437 -4295 4418 1519 -5843 1862 5984 -3916 -3771 6400 2145
1080 2145 -5192 2168 5103 -3437 -1167 5663 -1130 -4822 4262 3172 -6187 -582 5862 -2635 -5320
1095 -5320 3822 1425 -5947 353 4032 -4447 -3165 5273 -394 -5810 3254 4909 -4995 -1861 6501
1110 6501 -108 -4253 3678 3268 -3963 1018 5278 -2889 -3215 5954 1722 -6232 969 5260 -3482
1125 -3482 -3623 3927 -401 -4940 2340 2393 -5465 -1247 5460 -2325 -5265 4144 2920 -5176 -50 5147
1141 5147 -1944 -2971 4774 1005 -4182 2688 4653 -4109 -1457 5791 -75 -5102 2664 3581 -4246
1156 -4246 -1717 3995 -2089 -3712 3883 577 -5906 683 4551 -3974 -4227 4347 1137 -4661 1319
1171A319K363o928K506N779n965k913Q190o93q175M294N993p261k032P071j959
1186A589n806M807K919p038R66O937n045m956P341J632p993J933O768m865l232
1201d043O575n90n948M816L534o804k14P588k640o492N369L154o632M25N977m161
1217h6l616O218j5o783L167N354n877k954P138o89o545L807M209n513o94N907
1233C028k631m535N978J437o395J723O232m542l594N623R65o251K606M276n280
1248a360j324N996j855n690M436L508o009j239O519k491m776M858J740n849J721
1263a815N087m267k730O386j52o089L127M566m749k024N956j136n170M162K794
1278C946n875J05N601l135m768N481J591o043J148N254m070k813N197on522L198
$$ plain form
1171 1319 3682 -3246 -740 5039 -926 -3839 4351 3658 -4517 -223 5770 -1491 -3523 3548 1589
1186 1589 -4217 590 3509 -3529 -2563 4374 -671 -5627 1714 3346 -4647 -2714 4054 -811 -4043
1201 -4043 2532 1942 -4006 810 4344 -2460 -2674 4914 2274 -4218 1151 4305 -2327 -1902 4075 -86
1217 -86 -3702 2516 2501 -4282 -1115 4239 -1638 -4592 2546 1857 -4688 -881 3328 -2185 -2879 3028
1233 3028 397 -4138 1840 3277 -3118 -1395 4837 295 -3299 2324 3289 -2962 -356 3920 -1360
1248 -1360 -2684 3312 1457 -4233 203 3711 -2298 -3537 2982 491 -4285 573 2313 -3536 -1815
1263 -1815 3272 -995 -3725 2661 2509 -3580 -453 4113 -636 -2660 3296 2160 -3010 1152 3946
1278 3946 -1929 -1824 3777 642 -4126 1355 2946 -3097 -1949 3305 -765 -3578 1619 1613 -3909 -711
1294g11M076n744q62O360j894m852M258K975n514P1N695l412l465N291P64n792
1310b756K175M638m638k681N824l51n766L092L563n317o83N554k294m424M546
1325D82K256n887J080N270l647k973N270O47n214K220M109m095j968N590j119
1340B021m928L677L024n451k06N202k452m312M320J712n368Q86M870l741k892
1355c638N287o7m982K239L958m237j464N416j144m784M171K490m915r1N078k728
1371E89l311M559J099n233J542M437m024k262M848k20m897K504L095m306r56M456
1387A920j505l649L386K058m578K70M511k444l066M597P21m348J651L899l622
1402a99j977M738n83m188K400L084m298p04M292j545l774L348J449m122N52L585
$$ plain form
1294 -711 3365 -2379 -3241 3119 1225 -3627 631 3606 -1908 -1837 3858 446 -3019 2272 3036 -2756
1310 -2756 -581 4057 -581 -3262 2562 2211 -3555 -463 3100 -2217 -2900 2654 360 -4064 482
1325 482 2738 -3149 -2069 3201 -446 -3419 1851 2498 -2716 -496 3613 -482 -2450 3140 2021
1340 2021 -2907 770 3794 -1657 -1863 3339 887 -3425 895 2607 -2761 -1875 2995 -746 -3638
1355 -3638 1649 1582 -3400 -1161 2797 -1440 -2904 2512 1368 -3416 755 3245 -1670 -1761 3317 589
1371 589 -2722 1837 2936 -2297 -755 3682 -342 -2604 2244 2024 -2873 -369 2726 -1580 -2536 1920
1387 1920 415 -3234 152 2210 -2368 -2098 2413 -31 -3097 1500 2221 -2127 -476 3423 -199
1402 -199 -2176 2562 1979 -2209 191 3275 -1023 -1727 2565 1020 -2754 594 2043 -2079 -1527 2058
1418B058k692k364L920O29m425J747L598l450j579M271m49l782K865K429l662
1433h86m09L959j827l074L419J532m242O09L799k810k378L579L32l938J484L075
1449B224l295j531M182j056l482K481K485l706n4L581j627k628L297J624m124
1464a629J190L463k860k234L860M14l886J715K675l151j314L822j074l462K921
1479D50J627l815J16L716k204k622L153J466m193R85L387k941j521M038m62l329
1495b149K218K593l389o92L627q97l119K526J943l544q7L206j998k402L464K84
1511A584l799J271K907k917j485L456Q7l672K077K469l163o28L512j255k878K984
1527E50J345l370N71L553k033k369L108N23l431J534K417k747j305L395o06l378
$$ plain form
1418 2058 -634 -2998 922 1551 -2874 -1127 2471 -979 -2558 1713 1264 -2518 347 2776 -886
1433 -886 -1295 2664 837 -2237 1182 2714 -1528 -919 2880 70 -2308 1271 1603 -2335 -851 2224
1449 2224 -1071 -2602 1580 524 -2958 -477 2008 -1698 -1752 1829 202 -2426 871 2495 -1629
1464 -1629 -439 3024 164 -2070 1790 2204 -1682 33 2708 -443 -1757 2065 991 -2471 450
1479 450 2077 -1738 -1622 2094 -110 -2732 421 1887 -2306 -1321 2066 -875 -2396 1642 1180 -2149
1495 -2149 69 2662 -727 -1419 2208 1311 -1808 718 2661 -883 -970 2236 238 -2164 1300 1584
1511 1584 -2215 -944 1963 -954 -2439 1017 1104 -2568 -491 1978 -1185 -1813 1699 444 -2434 550
1527 550 1895 -1475 -904 2649 616 -1753 1355 1878 -1553 -19 2398 -349 -1654 1741 1135 -2243
1543b243K232J994l403n70L412j361k544K754J016l136O41L009k266j712L426
1558A249L46l626J808K633k479j405L173n20k713K254J397l052J01L014j734k427
1574a981K602J109l483L99K983k022k006L076j66k785J522K390k641r88L284m25
1590H68k801K189J879k968L1K926j583j964K933J91k955Q66K646k444j488K895
1606A221l3l003J560J904k691m34K474q88k277K312J285k947J14L164j596j949
1622a784K312Q23k459N43K460j941j054K943n40k748J692K007k797q19K943o48
1638I33k477J879O75k339N75K144j821j721K711M66l040R68K348j907j063K458
1654G89J59k330J668J443k559q0K462o72k399K261J438k641k50K414j646j256
$$ plain form
1543 -2243 -11 1983 -1420 -1990 1422 61 -2483 271 1287 -1849 -1208 1801 -465 -2177 1249
1558 1249 1595 -2031 -223 2410 -69 -1474 1699 1179 -1534 720 2117 -935 -834 2180 446 -1981
1574 -1981 621 1730 -1753 -1354 1629 -393 -2399 677 511 -2274 -752 1638 -1003 -1991 1293 868
1590 868 -1933 256 2135 -833 -802 2124 541 -1423 1510 1701 -1254 -388 2258 -186 -1674 1221
1606 1221 1188 -1815 -255 1649 -1042 -1476 998 110 -2167 145 1430 -1517 -1403 1761 165 -1784
1622 -1784 528 1351 -1108 -565 1895 -46 -1100 1843 1303 -1445 247 2254 -543 -1362 1581 933
1638 933 -1544 335 1010 -1329 -754 1390 -431 -2152 559 1025 -2015 -1047 1301 -606 -1669 789
1654 789 948 -1382 286 1729 -830 -910 1552 880 -1519 742 2180 -461 -711 1703 57 -1199
1670a199J903N1k277J045K007k103j300K505j16k402J524J550j971n52K603j274
1686fj609K343N63k453M15K684j623j623K320M50k333J047J373j654q09J926n70
1703D41j874J522J361k346l44K195q58j865J731Q98k002L75J841j545j213K622
1719I39J56k480J306J747j923p13K140m37j504J115J137k180L45K047j347k037
1735a689K382O09k387K80J650j106j013J794k48j788J418J031j890l88K172m93
1751C34j584J462J108j879J92J653q89j192J908Oj986J181J194j559q79J762k80
1768E52j761R49J285j548l96J584o04j615J574O02j729K3K010j325r45J745O17
1785A018j938R28J188j349n81J798m9j881J063J249j651l02J540o46j069R90M24
$$ plain form
1670 -1199 704 755 -1522 -477 1530 -573 -1873 632 516 -1886 -362 1188 -783 -1335 1268 -6
1686 -6 -1615 728 1291 -1162 -747 1937 314 -1309 1011 1461 -872 175 1548 -106 -915 1011 441
1703 441 -1433 89 1450 -896 -1240 955 97 -1768 -37 861 -1141 -766 1075 -470 -1683 939
1719 939 1095 -1385 -79 1668 -255 -968 1172 735 -769 346 1483 -697 -352 1695 348 -1689
1735 -1689 693 1302 -1085 -805 845 -261 -1274 520 272 -1516 -98 933 -957 -1345 827 334
1751 334 -1250 212 1320 -559 -367 1286 397 -795 1113 1119 -867 314 1508 -51 -930 832 552
1768 552 -1209 -260 1025 -523 -919 665 61 -1554 20 622 -1107 -1084 926 -399 -1344 401 1018
1785 1018 -920 8 1196 -153 -734 1064 1015 -866 197 1446 -205 -507 1033 387 -682 308 732
1802G32j514J13J267p64j283J747M9j466O33J290j434l77J546j77j479J061J113
1819A057j266k0J489p84j244J541J92j365L18J185r74r52J633k24j626P82J092
1836H34j305n37J435l94j378J016Q65j441j1J485m89j301J473M49j043J22J591
1853A371j471l80J181L11j528O16J173j205n14J172k98j456J223L64j462J02J476
1870F75q91r84J259N33j539J53J568j190m88J393o5j469J061J322j718m8J526
1887A098p45q96J110M01j320P2J240q25p33J171k5j509N64J144j178n20J013N
1905F7j207R16P62j087j98J288l98j030R70O23j159J00J509q96o83J321%j344
1923d46P68O06r75k63J108m41j211J007O01j313k64J197l76j062R32K72r02L59
$$ plain form
1802 732 -782 -669 598 -166 -1449 298 347 -1119 -486 804 -630 -1007 539 362 -1117 -56 1057
1819 1057 -209 -229 1260 476 -768 773 965 -400 -82 1103 129 -823 810 586 -1040 -258 834
1836 834 -471 -1008 427 33 -1345 -329 536 -905 -916 569 80 -1221 252 701 -342 -220 1371
1853 1371 -100 -480 701 1012 -516 100 1273 68 -446 726 428 -1028 195 559 -903 -801 675
1870 675 -216 -1200 59 592 -947 -794 774 -416 -904 489 424 -1045 16 1338 -380 -428 1098
1887 1098 353 -543 567 968 -352 -280 960 135 -598 573 548 -961 -397 747 -431 -951 62 67
1905 67 -1140 -224 538 -549 -747 541 143 -887 83 706 -453 -353 1156 260 -423 898 898 -446
1923 -446 322 928 -47 -310 798 357 -854 153 754 -559 -823 374 -2 -1064 -132 140 -762 -403
1941d03P79o61l63R09K22j130L26J378j063k79R74j9j118P11P10j023k68J155
1959H37m59j199R44M26j025J0R41o45q93J384l35j144Q16O68p62k25J046j0q52
1978d77N41O35j097K93R17n68p55Q12K75q99L74P98q05n91R75L05j394M42O69
1997D50q13m25J108m35r17Q80M47p70k06R68j79r20R27K53p42K62R54r70j60Q41
2017E53R3r79L57O51r11l7J075m97j108J084L19r31qN14j70p25Q14j02q14L33
2037d89R70j040l2J005j86p19N78O59q17j89R26l39p02P68L29q79K4J019p59o95
2057e68Q45J02r63M22O17o22m38O04J59j161R35L83p46M3O36j91n73N70L76n35
2077a05k37R82n71k80P12J27o92J1O21n80k2M35k28n99J71M11n27j96O84j22n09
$$ plain form
1941 -403 376 -285 -648 261 483 -647 -321 1057 -6 -285 689 670 -448 263 973 -50 -318 837
1959 837 378 -821 123 549 -476 -466 475 -170 -1063 321 -14 -1158 -342 326 -436 -661 385 375 -477
1978 -477 64 699 -398 -105 812 244 -511 301 576 -323 51 849 44 -547 428 733 -661 -219 450
1997 450 -363 -788 320 -115 -1032 -152 295 -475 -681 287 108 -812 115 368 -374 -112 842 -128 -288 553
2017 553 646 -333 24 675 -236 -273 802 305 -803 281 600 -331 -339 175 5 -720 94 -8 -822 -489
2037 -489 481 -559 -591 414 228 -491 87 746 -71 -260 666 327 -375 393 722 -157 -133 886 127 -568
2057 -568 277 379 -584 -162 455 -167 -605 -1 158 -1003 -68 315 -431 -388 248 57 -516 54 430 -105
2077 -105 -342 640 69 -211 501 628 -64 -53 568 -12 -34 401 173 -426 -255 156 -371 -567 117 -5 -514
2098e14M54K16p20RQ28n46j23O30N2o38J99P73o57k16R67l45o29K90P34q99J59
2119B4M49q1l32J75Q7p43M2Q84n78n34P11M7o92J45N4J23j41M69J14n23J57N83
2141D40o42Q2P56l54m64K28N68m91K45O7k65m36O85K6q26P8L44m26J41J32K64
2162A52r17M31N95q97L01L21k12l59N00K39k74M9P94n32m28M85J76n25K53M31
2182E83n32j97O88j68q63N20K49n87Q9L37k89k64N08j58m06M55J95l91k46N81
2202A04m9n21K85K09J21j07K90R1m32K91M50m89l26N09k21l96L13J55l35j85M13
2223A70j02m84O74j68n19J60N01m04l47M88R4m36K67M50m40r0J36L52l20R7K90
2244C69n18J34N49k31o25N31j4l83K19R7o1l82M84m09O7J16l8j39r3K02m3k87
$$ plain form
2098 -514 -60 156 -564 -555 273 -273 -396 234 286 -352 -153 620 -37 -253 714 369 -260 30 764 -135 24
2119 24 473 392 60 235 322 -421 -379 505 -73 -607 104 151 -541 -396 -342 -219 -360 109 223 -300 -143 440
2141 440 -202 -120 636 282 -182 46 614 123 368 435 170 -266 419 445 -381 -303 41 -385 -244 -112 152
2162 152 -765 -334 261 -636 -335 -14 -226 -585 -85 154 -120 -71 723 191 -237 248 424 -101 152 583
2182 583 51 -146 542 374 -489 31 280 -307 -218 119 -170 -434 74 -84 -490 -35 160 -231 -477 104
2202 104 55 -466 -181 28 149 42 332 423 -9 282 732 243 -83 426 205 -191 122 277 -58 -243 170
2223 170 68 -416 258 90 -429 -269 232 -172 -519 -31 63 -373 -106 344 -96 -186 -50 302 -18 79 369
2244 369 -149 -15 534 303 -322 209 195 -188 31 128 67 -315 169 -240 -173 -57 -95 -234 -327 -125 -168 -455
2266d55N65q4k63L6M76k72K7K92k6k53j19O31m24j75K15Q5l79K24L14k35l21K35
2288I4j49k22R3M48q66J64L46j24mK44J38k93L88k85j05K6L36o9j56J40L64m90
2310A8j29J61J80j48KOj95P6M76n88l6J78k8j73k38K15k2j48L64J07m93L33K53
2333A71k35k01K93J30j39OK22k82P3N45j64m15M9l2j26K34Q9l14q0M73j33k57
2355i3j57L94r4n46O60l84k80O49n9l30j22L99rN7Po4j02J92K5J36k00K95j49
2378B25j81J02J01k84k28L44Q1l80J67k15PQ5K52j62m36M31q0j03P4K59O6j44
2400a9K32J5j61J01K67k31j85L04k68M7K47l1m39R5J70j34j67J72ln20K81J28
2422i9m1k24K73K5r7j5L42l28Q9L31n1k32L30j1j51J82Q2k58o7J51K75n40K77
$$ plain form
2266 -455 110 26 -237 -201 275 3 30 322 296 43 -76 555 131 -44 171 256 -123 101 415 180 -141 94
2288 94 -55 -277 -184 264 -602 -438 -92 -216 -220 24 162 -131 257 -28 -133 -107 229 160 4 144 508 18
2310 18 -111 50 230 82 84 90 -105 -29 447 -141 -177 1 -27 -200 -438 -223 -245 -393 -29 78 -415 -82 171
2333 171 -64 -265 28 158 19 25 247 -35 38 583 419 4 53 21 -105 129 218 -96 -176 297 164 -93
2355 -93 -250 144 50 -496 164 -220 -500 149 90 -240 -362 37 28 85 92 28 -74 118 143 279 79 374 225
2378 225 44 146 247 -37 -265 79 160 -220 -53 -268 -261 -176 76 -86 -522 -91 -171 -274 -200 59 125 -19
2400 -19 213 228 67 168 435 204 19 323 55 102 349 318 -121 -26 144 10 -157 15 12 -508 -227 -99
2422 -99 -140 -364 -91 -66 -163 -178 164 -164 -75 256 205 -27 303 292 141 323 405 147 80 231 506 -34 243
2445B43o6j11k85J19R9m07M42n4k28n5N72j82n62K24L30k64j0K33kj71K07P4r0
2468E6j3J84l14K92K51l01M6j3j1m2k48K63k19k75L28K5l44K78j7k23j12M19K0
2491C0q9n3K67k75o9L04K47l76K68q7kk47L34j2l82L94K76n95j84O43l69l09J5
2514b71K03j57K03R9j61j36K44L8j77J58m3j51N8K56lm44M33K61j69k48K76j17
2536A52l02M92m1m56J01K25j11j58L30q1l15J51J85p07L2N86j89m9o5N30p84K00
2558b74N26O5m08J14K83n12J71N28l12l29N87l20m7MK27j04l07K26lj48j61J21
2580g3r1m5K18k10j83K66J03k90j27N36k63qM36j18K0l60K72p9M4K88J00l72J45
2603B09M7l5k07P0k2j41J9L88m04r4K56l13j25K59M4k67J63K18l49L2O43r8l03
$$ plain form
2445 243 177 66 -219 -100 -1 -408 34 -20 -248 -303 269 87 -475 -251 79 -185 -195 38 36 -135 72 146 56
2468 56 43 227 -87 205 456 155 201 188 177 135 -113 150 -69 -344 -16 9 -335 -57 -74 -297 -409 10 30
2491 30 -59 -112 155 -120 -189 115 362 -14 254 167 165 -82 252 240 -142 252 528 -67 -251 392 23 -286 -271
2514 -271 -68 -225 -22 77 -84 -220 24 62 -115 43 0 -151 -93 163 160 -284 149 410 241 -7 269 152
2536 152 -150 342 301 -155 -54 171 60 -98 232 151 -164 -13 172 -535 -503 83 -106 -155 -220 310 -474 -274
2558 -274 252 317 -91 23 306 -206 -35 493 181 -148 439 119 72 76 303 199 -108 118 115 -33 -194 -73
2580 -73 -164 -209 9 -201 -384 -118 -15 -305 -432 104 -159 -167 269 151 171 -189 83 4 48 336 436 64 209
2603 209 256 221 14 84 62 -79 -60 328 -76 -170 86 -227 -352 -93 -49 -316 -153 65 -284 -252 391 293 -10
2626a0n1M20k44j63L81k42j72L25J72m35k47N86l69R8K53n21j82K86K05k20j20
$$ plain form
2626 -10 -61 359 115 -48 333 91 -81 244 416 -19 -266 320 -49 49 302 -219 -401 -115 90 -130 -250
$$ [...]
8191A31
##END NTUPLES=NMR FID
##END=
