##TITLE=1H_Pr 54-eth
 CDCl3, 8 sc, 
 5.08.2021
##JCAMPDX= 6.0         $$ Bruker NMR JCAMP-DX V2.0
##DATA TYPE= NMR FID
##DATA CLASS= NTUPLES
##ORIGIN= UXNMR, Bruker Analytische Messtechnik GmbH
##OWNER= root
$$ XWIN-NMR		Version 3.5
$$ Thu Aug  5 10:15:30 2021 Russian Standard Time (UT+4h)  she@DPX200
##.OBSERVE FREQUENCY= 200.131506
##.OBSERVE NUCLEUS= ^1H
##.DELAY= (6, 6)
##.ACQUISITION MODE= SIMULTANEOUS
##.ACQUISITION SCHEME= undefined
##.AVERAGES= 8
##.DIGITISER RES= 18
##SPECTROMETER/DATA SYSTEM= spect
##.PULSE SEQUENCE= zg30
##.SOLVENT NAME= CDCl3
##.SHIFT REFERENCE= (INTERNAL, CDCl3, 0, 15.7039)
##AUDIT TRAIL= $$ (NUMBER, WHEN, WHO, WHERE, WHAT)
$$ ##TITLE= Audit trail, XWIN-NMR		Version 3.5
$$ ##JCAMPDX= 5.01
$$ ##ORIGIN= Bruker BioSpin GmbH
$$ ##OWNER= she
$$ F:/spectra/data/she/nmr/H-F/1/audita.txt
$$ ##AUDIT TRAIL=  $$ (NUMBER, WHEN, WHO, WHERE, WHAT)
(   1,<2021-08-05 10:14:11.14 +0400>,<she>,<DPX200>,
      <created by zg, POWCHK disabled, PULCHK disabled
       configuration hash MD5:
       00 E9 B6 7A A2 85 ED C7 34 08 36 98 17 FE 4E 26
       data hash MD5: 16K
       E6 4B 19 30 46 5B FC B0 12 93 DF 59 11 8C CE 73>)
$$ ##END=
$$ 
$$ hash MD5
$$ 99 75 FD B2 9F 84 79 98 88 AF 06 7F 98 0D F2 B5
##$RELAX= 
##$RELAX= 
##$RELAX= 
##$RELAX= 
##$RELAX= 
##$RELAX= 
$$ Bruker specific parameters
$$ --------------------------
##$DU= <F:/spectra>
##$EXPNO= 1
##$NAME= <H-F>
##$PROCNO= 1
##$TYPE= <nmr>
##$USER= <she>
##$AMP= (0..31)
100 100 100 100 100 100 100 100 100 100 100 100 100 100 100 100 100 100 
100 100 100 100 100 100 100 100 100 100 100 100 100 100 
##$AQSEQ= 0
##$AQ_mod= 1
##$AUNM= <au_zg>
##$AUTOPOS= <>
##$BF1= 200.13
##$BF2= 200.13
##$BF3= 200.13
##$BF4= 200.13
##$BF5= 200.13
##$BF6= 200.13
##$BF7= 200.13
##$BF8= 200.13
##$BYTORDA= 1
##$CFDGTYP= 0
##$CFRGTYP= 5
##$CHEMSTR= <none>
##$CNST= (0..31)
1 1 145 1 1 1 1 1 1 1 1 1 1 1 1 1 1 1 1 1 1 1 1 1 1 1 1 1 1 1 1 1 
##$CPDPRG= <>
##$CPDPRG1= <>
##$CPDPRG2= <>
##$CPDPRG3= <>
##$CPDPRG4= <mlev>
##$CPDPRG5= <mlev>
##$CPDPRG6= <mlev>
##$CPDPRG7= <mlev>
##$CPDPRG8= <mlev>
##$CPDPRGB= <>
##$CPDPRGT= <>
##$D= (0..31)
0 1.2 0 0 0 0 0 0 0 0.06 0 0.03 0 0 0 0 0.0002 0 0 0 0 0 0 0 0 0 0 0 0 
0 0 0 
##$DATE= 1628144050
##$DBL= (0..7)
120 120 120 120 120 120 120 120 
##$DBP= (0..7)
150 150 150 150 150 150 150 150 
##$DBP07= 0
##$DBPNAM0= <>
##$DBPNAM1= <>
##$DBPNAM2= <>
##$DBPNAM3= <>
##$DBPNAM4= <>
##$DBPNAM5= <>
##$DBPNAM6= <>
##$DBPNAM7= <>
##$DBPOAL= (0..7)
0.5 0.5 0.5 0.5 0.5 0.5 0.5 0.5 
##$DBPOFFS= (0..7)
0 0 0 0 0 0 0 0 
##$DE= 6
##$DECBNUC= <off>
##$DECIM= 32
##$DECNUC= <off>
##$DECSTAT= 4
##$DIGMOD= 1
##$DIGTYP= 9
##$DL= (0..7)
0 120 120 120 120 120 120 120 
##$DP= (0..7)
150 150 150 150 150 150 150 150 
##$DP07= 0
##$DPNAME0= <>
##$DPNAME1= <>
##$DPNAME2= <>
##$DPNAME3= <>
##$DPNAME4= <>
##$DPNAME5= <>
##$DPNAME6= <>
##$DPNAME7= <>
##$DPOAL= (0..7)
0.5 0.5 0.5 0.5 0.5 0.5 0.5 0.5 
##$DPOFFS= (0..7)
0 0 0 0 0 0 0 0 
##$DQDMODE= 0
##$DR= 18
##$DS= 0
##$DSLIST= <SSSSSSSSSSSSSSS>
$$ [...]
##$SUBNAM2= <"">
##$SUBNAM3= <"">
##$SUBNAM4= <"">
##$SUBNAM5= <"">
##$SUBNAM6= <"">
##$SUBNAM7= <"">
##$SUBNAM8= <"">
##$SUBNAM9= <"">
##$SW= 20.0188882624521
##$SWIBOX= (0..15)
0 0 2 0 0 0 0 0 0 0 0 0 0 0 0 0 
##$SW_h= 4006.41025641026
##$TD= 16384
##$TD0= 1
##$TE= 0
##$TE2= 300
##$TE3= 300
##$TEG= 300
##$TL= (0..7)
0 120 120 120 120 120 120 120 
##$TP= (0..7)
150 150 150 150 150 150 150 150 
##$TP07= 0
##$TPNAME0= <>
##$TPNAME1= <>
##$TPNAME2= <>
##$TPNAME3= <>
##$TPNAME4= <>
##$TPNAME5= <>
##$TPNAME6= <>
##$TPNAME7= <>
##$TPOAL= (0..7)
0.5 0.5 0.5 0.5 0.5 0.5 0.5 0.5 
##$TPOFFS= (0..7)
0 0 0 0 0 0 0 0 
##$TUNHIN= 0
##$TUNHOUT= 0
##$TUNXOUT= 0
##$USERA1= <user>
##$USERA2= <user>
##$USERA3= <user>
##$USERA4= <user>
##$USERA5= <user>
##$V9= 5
##$VALIST= <valist>
##$VCLIST= <CCCCCCCCCCCCCCC>
##$VD= 0
##$VDLIST= <DDDDDDDDDDDDDDD>
##$VPLIST= <PPPPPPPPPPPPPPP>
##$VTLIST= <TTTTTTTTTTTTTTT>
##$WBST= 1024
##$WBSW= 4
##$XGAIN= (0..3)
0 0 0 0 
##$XL= 0
##$YL= 0
##$YMAX_a= 121497
##$YMIN_a= -224528
##$ZGOPTNS= <>
##$ZL1= 120
##$ZL2= 120
##$ZL3= 120
##$ZL4= 120
##$ABSF1= 10
##$ABSF2= 0
##$ABSG= 5
##$ABSL= 3
##$ALPHA= 0
##$AQORDER= 0
##$ASSFAC= 0
##$ASSFACI= 0
##$ASSFACX= 0
##$ASSWID= 0
##$AUNMP= <proc_1d>
##$AZFE= 0.1
##$AZFW= 0.1
##$BCFW= 1
##$BC_mod= 2
##$BYTORDP= 1
##$COROFFS= 0
##$CY= 11.3945322036743
##$DATMOD= 1
##$DC= 2
##$DFILT= <>
##$DTYPP= 0
##$F1P= 2.36226072786647
##$F2P= -0.459571619588291
##$FCOR= 0.5
##$FTSIZE= 0
##$FT_mod= 4
##$GAMMA= 1
##$GB= 0.15
##$INTBC= 1
##$INTSCL= 1
##$ISEN= 128
##$LB= 0.24
##$LEV0= 0
##$LPBIN= 0
##$MAXI= 10000
##$MC2= 0
##$MEAN= 0
##$ME_mod= 0
##$MI= 1.114404
##$NCOEF= 0
##$NC_proc= 0
##$NLEV= 6
##$NOISF1= 3.799351
##$NOISF2= 2.8
##$NSP= 1
##$NTH_PI= 0
##$NZP= 0
##$OFFSET= 15.70392
##$PC= 1
##$PHC0= -13358.92
##$PHC1= 15.201
##$PH_mod= 1
##$PKNL= yes
##$PPARMOD= 0
##$PSCAL= 0
##$PSIGN= 0
##$REVERSE= no
##$SF= 200.130013532006
##$SI= 16384
##$SIGF1= 3
##$SIGF2= 2
##$SINO= 400
##$SIOLD= 16384
##$SREGLST= <1H.CDCl3>
##$SSB= 0
##$STSI= 0
##$STSR= 0
##$SW_p= 3612.71676300578
##$SYMM= 0
##$S_DEV= 0
##$TDeff= 0
##$TDoff= 0
##$TI= <>
##$TILT= no
##$TM1= 0
##$TM2= 0
##$TOPLEV= 0
##$USERP1= <user>
##$USERP2= <user>
##$USERP3= <user>
##$USERP4= <user>
##$USERP5= <user>
##$WDW= 1
##$XDIM= 8192
##$YMAX_p= 0
##$YMIN_p= 0
$$ End of Bruker specific parameters
$$ ---------------------------------
##NTUPLES= NMR FID
##VAR_NAME=  TIME,          FID/REAL,        FID/IMAG
##SYMBOL=    X,             R,               I
##VAR_TYPE=  INDEPENDENT,   DEPENDENT,       DEPENDENT
##VAR_FORM=  AFFN,          ASDF,            ASDF
##VAR_DIM=   8192,          8192,            8192
##UNITS=     SECONDS,       ARBITRARY UNITS, ARBITRARY UNITS
##FACTOR=    0.0002496,     1,               1
##FIRST=     0,             0,               0
##LAST=      2.0444736,     0,               0
##MIN=       0,             -224528,         0
##MAX=       2.0444736,     121497,          0
$$ Real data points
##PAGE= N=1
##DATA TABLE= (X++(R..R)), XYDATA
$$ [...]
$$ plain form
1825 -268 -280 -379 -269 -57 -518 -221 -29 -225 -411 44 -477 -424 -6 -218 -317 -346 -152 -377 -148 120 -221 -388
1847 -388 259 -312 -162 179 -246 -160 308 36 -180 -33 -33 -95 209 282 -196 104 311 198 -72 149 167 247
1869 247 258 322 -59 351 208 -295 -10 112 262 278 378 -45 -164 483 243 -5 174 231 -126 296 95
1890 95 83 -128 -80 -44 117 -84 -98 -12 260 -127 -102 178 -5 -116 5 -105 -45 -78 -235 37 -266 101 -199
1913 -199 22 61 27 -235 -73 119 -210 123 135 -96 50 38 166 -177 -109 59 -138 20 431 26 274 470
1935 470 194 240 192 100 -121 126 138 1 -3 128 317 172 307 110 -8 145 212 146 269 144 204 19 189
1958 189 248 179 347 -25 172 1 186 -127 329 8 -315 197 376 114 53 -69 56 -367 -57 -42 -186
1979 -186 121 -304 -466 -175 -161 -286 -76 -282 -296 -101 -428 -523 -50 -225 -321 -454 -249 -451 -336 -234 -321 -666
$$ packed form
1825b68j2r9J10K12m61K97J92j96j86M55n21N3M18k12r9k9J94k25K29K68l41j67
1847c88O47n71J50L41m25Q6M68k72k16J47%o2L04P3m78L00K07j13k70K21J8Q0
1869B47J1O4l81M10j43n03K85J22J50J6J00m23j19O47k40k48J79N7l57M22k01
1890I5j2k11M8L6J61k01j4Q6K72l87K5K80j83j11J21j10O0l3j57K72l03L67l00
1913a99K21L9l4k62J62J92l29L33J2k31J46j2J28l43O8J68j97J58M11m05K48J96
1935D70k76M6m8r2k21K47J2j37mJ31J89j45J35j97j18J53O7o6J23j25O0j85J70
1958A89N9o9J68l72J97j71J85l13M56l21l23N12J79k62o1j22J25m23L10J5j44
1979a86L07m25j62K91J4j25K10k06j4J95l27r5M73j75r6j33K05k02J15J02q7l45
$$ plain form
2001 -666 -9 -305 -180 10 -330 -541 -69 -200 -143 -498 107 53 -183 -317 -209 15 121 -246 -8 185 125
2022 125 -111 398 371 -32 282 150 209 143 438 225 316 218 524 136 472 211 151 427 53 387 503 469
2044 469 493 -107 374 486 269 407 221 107 70 439 58 409 27 -75 108 -130 236 -148 -64 -47 -74 66
2066 66 -46 -57 -169 -23 -324 -228 -3 -372 -117 -199 -372 -451 -332 -263 -204 -355 -553 -476 -451 -650 -616 -339 -154
2089 -154 -242 -239 -396 -114 -395 -352 -180 -214 -194 -231 -488 -175 -66 -67 -352 -138 -115 -132 -12 -407 -217 184 126 -304
2113 -304 171 136 173 128 248 53 257 259 108 98 202 150 248 387 160 134 61 400 113 490 505 488 402 346 198
2138 198 402 460 243 -228 354 531 30 322 122 284 98 302 123 -32 454 104 -50 22 249 -110 284
2159 284 74 -387 -60 -206 -220 -44 -43 100 -524 37 36 -343 -143 -369 -315 -381 -244 -569 -202 -348 -533 -375
$$ packed form
2001f66O57k96J25J90l40k11M72j31N7l55O05n4k36j34J08K24J06l67K38J93o0
2022A25k36N09k7m03L14j32N9o6K95k13R1r8L06l88L36k61o0K76l74L34J16l4
2044D69K4o00M81J12k17J38j86j14l7L69l81L51l82j02J83k38L66l84Q4J7k7J40
2066F6j12j1j12J46l01R6K25l69K55q2j73p9J19O9N9j51j98P7K5j99L4K77J85
2089a54q8Lj57K82k81M3J72l4K0l7k57L13J09jk85K14K3j7J20l95J90M01n8m30
2113c04M75l5L7m5J20j95K04Kj51j0J04n2R8J39k27k6p3L39k87L77J5j7q6n6j48
2138A98K04N8k17m71N82J77n01K92k00J62j86K04j79j55M86l50j54P2K27l59L94
2159B84k10m61L27j46j4J76JJ43o24N61jl79K00k26N4o6J37l25L67j46j85J58
$$ plain form
2181 -375 -380 -456 -428 -107 -143 -516 -83 -446 -432 -180 -73 -502 -352 -204 -349 -592 -233 73 -292 -16 -59 -12 136
2204 136 71 -331 -155 37 -174 125 20 -51 140 113 143 -65 236 -66 93 315 374 130 290 630 33 -60
2226 -60 533 303 366 50 358 -33 251 334 190 84 233 124 308 394 191 130 -32 354 269 276 -6 -52 24
2249 24 180 41 73 249 219 -115 61 52 75 -37 -216 157 -191 43 169 156 -238 -320 -73 -557 -224 -104 -224
2272 -224 -344 -243 -194 -475 -209 -439 -114 -235 -240 -144 -159 -391 -258 -111 52 -12 -456 -13 -130 -260 -54 -86
2294 -86 -358 -155 134 -304 -22 -297 -145 -99 15 -212 -154 11 184 -90 -173 379 115 43 108 -27 140 293
2316 293 -67 44 70 220 408 225 239 -137 180 323 17 -42 419 339 -19 177 -106 137 142 213 96 301
2338 301 191 33 158 326 -171 38 468 18 13 88 143 238 170 203 -80 28 130 57 -50 -3 -207 135 300
$$ packed form
2181c75np6K8L21l6l73M33l63J4K52J07m29J50J48j45k43L59L06l65K76m3M7J48
2204A36o5m02J76J92k11K99j05p1J91k7L0k08L01l02J59K22N9k44J60L40n97r3
2226f0N93k30O3l16L08l91K84Q3j44j06J49j09J84Q6k03o1j62L86q5Pk82m6P6
2249B4J56j39L2J76l0l34J76rK3j12j79L73l48K34J26j3l94q2K47m84L33J20j20
2272b24j20J01M9k81K66k30L25j21nR6j5k32J33J47J63o4m44M43j17j30K06l2
2294h6k72K03K89m38K82k75J52M6J14k27N8J65J73k74q3N52k64p2O5j35J67J53
2316B93l60J11K6J50J88j83J4l76L17J43l06n9M61q0l58J96k83K43NP1j17K05
2338C01j10j58J25J68m97K09M30m50nP5N5R5o8L3k83J08J02p3j07M7k04L42J65
$$ plain form
2361 300 -271 -155 -180 -131 -169 65 -9 -75 224 310 -43 -36 110 83 -197 89 -219 -167 417 -178 -220 -174 -69 -88
2385 -88 -26 52 72 -368 7 -254 72 138 191 -92 110 47 -67 213 -19 -156 20 208 -78 169 142 117 -261
2408 -261 -7 83 -191 83 -100 -233 165 470 -51 246 268 14 -201 -131 146 -60 40 -56 -239 -464 -38
2429 -38 -145 -215 -58 37 116 123 -140 88 -98 -60 -259 59 -48 -210 -204 162 21 -121 26 -112 -128 12 17 113
2453 113 -15 -297 -235 -6 75 57 -133 205 -66 -182 -158 172 1 -57 -142 -6 -47 -122 77 -67 149 -118 -246
2476 -246 35 321 -134 188 156 185 82 21 -130 59 -11 334 344 111 115 242 287 214 57 171 -73 189 74
2499 74 -68 51 26 106 162 19 -3 62 -73 -264 9 19 -31 17 -29 -15 -423 -63 -142 -119 85 -288 -106 -51 -99
2524 -99 -269 80 -325 -90 -578 -147 -146 -139 -174 -239 -194 -39 -290 -298 -354 -350 -183 -41 -198 -647 9 -134 -302 31
$$ packed form
2361C00n71J16k5M9l8K34p4o6K99Q6l53PJ46k7k80K86l08N2N84n95m2M6J05j9
2385h8O2P8K0m40L75k61L26O6N3k83K02o3j14K80k32j37J76J88k86K47k7k5l78
2408b61K54R0k74K74j83j33L98L05n21K97K2k54k15P0K77k06J00r6j83k25M26
2429c8j07p0J57R5P9Pk63K28j86L8j99L18j07j62OL66j41j42J47j38j6J40NR6
2453A13j28k82O2K29Q1j8j90L38k71j16K4L30j71n8q5J36m1p5J99j44K16k67j28
2476b46K81K86m55L22l2K9j03o1j51J89p0L45J0k33MJ27M5p3j57J14k44K62j15
2499G4j42J19k5Q0N6j43k2O5j35j91K73J0n0M8m6J4m08L60p9K3K04l73J82N5m8
2524i9j70L49m05K35m88M31JPl5o5M5J55k51qn6MJ67J42j57m49O56j43j68L33
$$ plain form
2548 31 -118 189 -68 -5 7 -65 7 81 143 103 286 37 60 4 81 46 307 321 185 24 184 287 181 85 167
2573 167 356 293 -19 204 242 412 550 48 2 0 -36 277 116 299 329 324 326 39 63 38 141 79 131 247 96
2598 96 51 -89 153 19 -299 -6 -113 -100 -402 -107 13 -1 -327 77 -138 -313 -98 -3 -97 -307 -184 -64
2620 -64 -260 -263 -538 -160 -358 -367 -149 -467 -414 -292 32 50 -377 -281 -295 -85 -322 67 -145 50 43 -132 -363 47
2644 47 -30 49 21 57 181 -24 -108 -105 82 150 125 30 -189 501 293 381 136 37 251 209 211 311 306 159 372 -54
2670 -54 298 452 173 281 132 48 134 356 198 24 334 308 74 159 284 317 336 -34 217 319 5 -131
2692 -131 -29 182 132 134 -41 62 28 -113 93 69 -106 -97 28 -120 -18 -233 -74 -57 27 -230 -156 70 -210
2715 -210 -265 -152 -42 -237 -295 -120 -83 -281 -220 60 -256 -208 -392 -184 -197 -184 -240 -157 -206 -317 -232 -230 80 -313
$$ packed form
2548C1j49L07k57O3J2p2P2P4O2m0J83k49K3n6P7l5K61J4j36j61J60J03j06r6Q2
2573A67J89o3l12K23L8J70J38n02m6kl6L13j61J83L0nKk87K4k5J03o2N2J16j51
2598I6m5j40K42j34l18K93j07J3l02K95J20j4l26M04k15j75K15R5r4k10J23J20
2620f4j96lk75L78j98rK18l18N3J22L24J8m27R6j4K10k37L89k12J95pj75k31M10
2644D7p7P9k8L6J24k05q4LJ87O8k5r5k19O90k08Q8k45r9K14m2KJ00nj47K13m26
2670e4L52J54k79J08j49q4Q6K22j58j74L10k6k34Q5J25L3J9l70K51J02l14j36
2692a31J02K11n0Kj75J03l4j41K06k4j75RJ25j48J02k15J59J7Q4k57P4K26k80
2715b10n5J13J10j95n8J75L7j98O1K80l16M8j84K08j3J3n6Q3m9j11Q5KL10l93
$$ plain form
2739 -313 -156 2 34 -53 -262 -323 1 93 -220 -72 -102 -84 5 137 50 -27 228 19 153 299 167 -82 71
2762 71 114 414 113 386 292 292 256 238 176 223 82 -20 49 178 231 -51 178 -133 -73 117 290 413 171 -136
2786 -136 133 -7 -60 -59 162 -127 98 -43 85 -130 127 122 -225 181 237 -157 -304 -28 -42 -70 -120 -285 -288 -131
2810 -131 -299 -127 64 -9 -303 -186 -5 -229 -166 -167 -123 126 -47 -154 61 -138 -449 93 122 -276 -131 59
2832 59 -77 22 -189 48 -68 -63 89 -67 -90 -74 -4 -53 281 79 -83 -19 -410 9 -103 121 -45 109 31
2855 31 136 111 75 -43 229 -206 -19 379 0 145 43 182 12 111 219 -4 4 249 21 -132 100 485
2877 485 82 186 440 56 -98 -18 68 -297 18 58 -138 204 97 -216 -151 -102 -57 -40 -126 -127 -217 132 147 -130
2901 -130 -324 3 20 -265 90 -172 76 61 133 -99 -43 24 -128 51 -131 -182 -47 -48 57 172 132 -379 -52
$$ packed form
2739c13J57J58L2q7k09o1L24R2l13J48l0J8Q9J32q7p7K55k09J34J46j32k49J53
2762G1M3L00l01K73r4%l6j8o2M7j41j02O9J29N3k82K29l11O0J90J73J23k42l07
2786a36K69j40n3JK21k89K25j41J28k15K57nl47M06N6l94j47K76j4k8n0j65lJ57
2810a31j68J72J91p3k94J17J81k24O3jM4K49j73j07K15j99l11N42K9l98J45J90
2832E9j36R9k11K37j16NJ52j56k3J6P0m9L34k02j62O4l91M19j12K24j66J54p8
2855C1J05k5l6j18K72m35J87L98l79J45j02J39j70R9J08k23QK45k28j53K32L85
2877D85m03J04K54l84j54Q0Q6l65L15M0j96L42j07l13O5M9M5J7q6jr0L49J5k77
2901a30j94L27J7k85L55k62K48j5P2k32N6O7j52J79j82n1J35jJ05J15m0n11L27
$$ plain form
2924 -52 -72 -260 4 31 100 -195 135 -50 133 -208 167 69 -58 158 104 88 278 -150 87 -188 156 13
2946 13 -96 -46 197 -78 50 230 152 23 6 230 93 -112 146 -276 -93 163 -93 83 75 137 27 -62 62
2969 62 108 8 -35 -8 182 0 -122 -113 -109 -147 -95 -80 -169 -283 -4 -317 -411 -141 80 -232 187 -86 -20 130 -96
2994 -96 53 22 -23 101 -102 -46 -191 120 14 -201 -174 -148 93 194 -133 26 172 -234 -299 215 -88 12
3016 12 225 -271 -11 71 19 28 164 68 -57 180 122 15 -199 90 75 6 89 187 -190 -22 56 -41 44 -83 146
3041 146 116 171 126 196 68 -105 -5 -138 57 61 -211 128 -104 -336 222 172 98 -172 112 -174 -261 199 87
3064 87 -22 -295 -159 13 -243 20 296 -40 -216 -144 -9 -94 -116 -282 130 -143 -144 -252 34 166 -481 24
3086 24 48 -35 23 84 26 -55 -150 35 61 142 191 144 -17 -151 -141 -169 324 76 148 82 260 26 146 307 -8
$$ packed form
2924e2k0j88K64K7O9k95L30j85J83l41L75r8j27K16n4j6J90m28K37k75L44j43
2946A3j09N0K43k75J28J80p8j29j7K24j37k05K58m22J83K56k56J76qO2j10q9J24
2969F2M6j00m3K7J90j82j22RMl8N2J5q9j14K79l13r4K70K21l12M19k73O6J50k26
2994i6J49l1m5J24k03N6j45L11j06k15K7K6K41J01l27J59J46m06o5N14l03J00
3016A2K13m96K60Q2n2RJ36r6j25K37n8j07k14K89j5o9Q3R8l77J68P8r7Q5j27K29
3041A46l0N5m5P0j28j73J00j33J95Mk72L39k32k32N58n0p4k70K84k86q7M60j12
3064H7j09k73J36J72k56K63K76l36j76P2J35q5k2j66M12k73jj08K86J32o47N05
3086B4K4q3N8O1n8q1r5J85K6Q1M9m7j61j34J0k8M93k48P2o6J78k34J20J61l15
$$ plain form
3111 -8 30 95 -28 199 134 81 10 81 67 143 430 -126 108 -59 44 36 213 74 -3 -4 10 -61 186 310 333 175
3137 175 -103 -6 170 87 200 126 -267 115 217 -20 -237 -99 -20 44 -125 -382 -3 224 -88 1 -74 154
3159 154 -80 -196 77 201 -238 -96 58 76 -102 -24 -127 -357 -35 -75 -294 -208 -116 -131 -130 43 -58 112 -21
3182 -21 -192 -36 37 88 120 -146 -68 -159 133 211 90 73 274 26 -186 214 -44 47 198 101 208 -100 -31 173
3206 173 -62 208 132 355 221 291 105 -15 216 119 277 -59 194 103 162 -102 -81 62 183 -181 85 280
3228 280 -19 36 130 -117 -221 29 -85 -35 27 -149 -158 247 100 -161 -138 -17 -250 -11 156 13 -231 -122
3250 -122 -57 167 -253 -167 -6 -26 -140 -259 -262 -48 -115 -257 -75 -49 -55 -113 -43 29 50 -7 -330 83 92 -70 130
3275 130 -52 -37 -217 -38 -107 48 50 -95 313 128 -225 -110 -147 81 -302 -111 -16 40 155 249 105 30 -38
$$ packed form
3111hL8O5j23K27o5n3p1P1j4P6K87n56K34j67J03qJ77j39p7jJ4p1K47J24K3j58
3137A75k78R7J76q3J13p4l93L82J02k37k17J38P9O4j69k57L79K27l12Q9p5K28
3159A54k34j16K73J24m39J42J54J8j78P8j03k30L22m0k19Q6R2j5JJ73j01J70j33
3182b1j71J56P3N1L2k66P8r1K92P8j21j7K01k48k12M00k58R1J51r7J07l08O9K04
3206A73k35K70p6K23j34P0j86j20K31r7J58l36K53r1N9k64K1J43J21l64K66J95
3228B80k99N5R4k47j04K50j14N0O2j76rM05j47k61K3J21k33K39J67j43k44J09
3250a22O5K24m20Q6J61k0j14j19lK14o7j42J82K6on8P0P2K1n7l23M13Rj62K00
3275A30j82J5j80J79o9J55Kj45M08j85l53J15l7K28l83J91R5N6J15R4j44p5o8
$$ plain form
3298 -38 -105 130 149 11 -79 144 128 -25 459 -71 208 169 -178 62 287 -7 -23 280 -179 55 -52 -67 99
3321 99 95 -129 211 -124 -220 73 107 -36 -171 -18 -66 65 -223 -85 -252 -165 17 -198 -3 10 5 -205 53
3344 53 -39 54 -138 -249 -140 -212 263 128 -240 -51 -89 -543 -2 -27 -33 -235 -126 -176 -85 -4 -42 100 -47 -217
3368 -217 -211 102 -72 -171 -28 -16 0 -241 34 -248 118 253 -76 -19 60 -72 -254 148 -71 98 -216 -48
3390 -48 -160 40 265 34 -35 -52 -194 30 36 90 -122 -140 73 -211 5 93 77 -60 -26 111 113 52 351 270 61
3415 61 -31 175 -24 -111 -142 -152 26 -256 -11 201 -208 84 -64 164 -172 168 117 98 -168 -177 323 16 -114
3438 -114 -51 -159 108 -57 362 88 -63 59 151 -164 44 -89 -27 177 59 50 -241 -69 -205 -72 215 291
3460 291 -339 -208 137 -226 23 57 11 15 -63 163 -164 49 184 -154 130 -19 484 -40 126 233 24 128
$$ packed form
3298c8o7K35J9j38r0K23j6j53M84n30K79l9l47K40K25k94j6L03m59K34j07j5J66
3321I9mk24L40l35r6K93L4j43j35J53m8J31k88J38j67Q7J82k15J95J3nk10K58
3344E3r2R3j92j11J09p2M75j35l68J89l8m54N41k5ok02J09n0R1Q1l8J42j47j70
3368b17OL13j74r9J43J2J6k41K75k82L66J35l29N7P9j32j82M02k19J69l14J68
3390d8j12K00K25k31o9j7j42K24ON4k12j8K13k84K16Q8j6j37L4J37Ko1K99q1k09
3415F1r2K06j99q7l1j0J78k82K45K12m09K92j48K28l36L40n1j9k66rN00l07j30
3438a14O3j08K67j65M19k74j51J22R2l15K08j33O2K04j18rk91J72j36J33K87P6
3460B91o30J31L45l63K49L4m6Mp8K26l27K13J35l38K84j49N03n24J66J07k09J04
$$ plain form
3482 128 -33 93 226 5 48 30 -205 105 21 27 107 124 62 53 213 74 -21 78 151 75 -134 136 295 -258 -302
3507 -302 -257 85 -109 -9 -3 84 50 -223 -118 -13 13 -80 -136 -175 54 -111 169 -63 -123 -174 176 108 -212 -182
3531 -182 -11 51 173 -275 182 -33 -49 -115 8 122 5 200 -78 166 -12 207 -183 -221 22 -55 -218 238
3553 238 17 74 98 64 -294 -195 -166 109 -162 32 49 122 185 133 207 -153 119 49 17 178 196 -134 -47 220 115
3578 115 177 61 109 146 -105 35 -24 253 -20 -93 -145 -232 116 195 118 -86 235 -102 -8 -117 54 -129 -125 -140
3602 -140 33 111 -72 -308 -76 -41 -119 24 44 -450 -13 120 67 115 -66 -20 -132 -292 40 5 -254 193 -311
3625 -311 -80 -104 -135 131 -10 5 244 -11 -175 69 -120 -125 -114 44 198 -52 99 11 -38 237 -134 -54 -210
3648 -210 -1 9 84 99 190 47 125 30 -209 139 58 -26 -34 27 126 351 155 16 -255 41 235 167 270 155
$$ packed form
3482A28j61J26J33k21M3j8k35L10q4OQ0J7o2rJ60j39r5R9P3p6k09K70J59n53m4
3507c02M5L42j94J00OQ7l4k73J05J05K6r3n6l9K29j65K80k32o0n1L50o8l20L0
3531a82J71O2J22m48M57k15j6o6J23J14j17J95k78K44j78K19l90l8K43p7j63M56
3553B38k21N7K4l4l58R9K9K75k71J94J7P3O3n2P4l60K72p0l2J61J8l30Q7K67j05
3578A15O2j16M8L7k51J40n9K77k73p3n2q7L48P9p7k04L21l37R4j09J71j83Mj5
3602a40J73P8j83k36K32L5p8J43K0m94M37J33n3M8j81M6j12j60L32l5k59M47n04
3625c11K31k4l1K66j41J5K39k55j64K44j89nJ1J58J54k50J51q8m9K75l71Q0j56
3648b10K09J0P5J5R1j43P8r5k39L48q1q4qO1R9K25j96j39k71K96J94o8J03j15
$$ plain form
3672 155 17 190 232 94 145 125 311 -43 59 154 38 196 -81 -31 31 55 -200 54 -50 3 -107 11 -95
3695 -95 -38 2 36 -75 154 -187 -106 12 -167 89 -5 64 -95 -47 -208 -18 -114 -35 80 -130 -94 45 34 -124
3719 -124 110 27 57 99 -120 -129 67 -171 -213 -205 -139 -30 136 -81 -277 -62 50 -82 57 113 4 -69 198 41
3743 41 -234 -194 -3 -27 169 3 -90 -19 348 52 -201 -61 79 -10 108 212 -75 -113 187 3 180 112 9
3766 9 275 -181 -72 38 -57 26 97 -126 191 -323 207 -176 -94 -81 -73 77 112 50 31 31 -62 270 148 240 -91
3791 -91 -52 -120 -175 -285 29 -283 -206 -22 7 -102 15 4 -77 154 -190 -115 -468 280 -176 24 -131 -114 -85 -291
3815 -291 146 -189 5 82 212 -175 -19 56 -10 -262 -204 -273 320 2 -241 108 -1 164 52 -206 7 143
3837 143 -62 -107 -119 -91 91 137 213 9 185 22 -35 77 143 35 70 86 141 -328 56 136 -12 -27 -164 -93
$$ packed form
3672A55j38J73M2j38N1k0J86l54J02R5j16J58k77N0O2K4k55K54j04N3j10J18j06
3695i5N7M0L4j11K29l41Q1J18j79K56r4O9j59M8j61J90r6P9J15k10L6J39j1j58
3719a24K34q3L0M2k19rJ96k38m2QO6J09J66k17j96K15J12j32J39N6j09p3K67j57
3743D1k75M0J91k4J96j66r3P1L67k96k53J40J40q9J18J04k87l8L00j84J77o8j03
3766IK66m56J09J10r5Q3P1k23L17n14N30l83Q2J3QJ50L5o2j9%r3L32j22R2l31
3791i1L9o8n5j10L14l12P7J84K9j09J17j1q1K31l44P5l53P48m56K00j55J7K9k06
3815b91M37l35J94P7J30l87J56P5o6k52N8o9N93l18k43L49j09J65j12k58K13J36
3837A43k05m5j2K8J82M6P6k04J76j63n7J12O6j08L5J6N5m69L84Q0j48j5j37P1
$$ plain form
3861 -93 17 -59 -77 199 -189 -143 59 73 11 -38 -42 -130 -207 140 -120 -113 -46 -283 102 -159 -117 -81 -55 114 -243 190
3887 190 -141 107 107 -158 -196 -39 98 51 200 42 162 -16 -95 128 -84 -56 17 -91 -298 -173 -233 -79 34
3910 34 -144 129 -18 -186 182 135 157 -241 -150 418 -240 -98 72 155 -327 66 136 -135 72 -91 -73 -3 -184
3933 -184 -140 115 80 101 115 38 85 -120 28 -164 -50 -36 -119 2 112 -145 143 -10 130 186 56 -141 221
3956 221 198 50 -15 68 203 172 -12 -121 -107 -61 -169 -77 6 -81 -181 -76 70 73 155 33 48 -197 56 189
3980 189 35 11 -65 -253 -27 156 23 84 56 55 -186 164 -82 121 172 -370 132 -310 187 -54 31 -173 -142
4003 -142 -168 -182 99 64 175 -9 114 -4 120 -184 40 253 171 17 -19 113 -154 132 47 -119 4 5 -9
4026 -9 71 27 -187 21 -212 113 126 349 -121 117 159 105 116 -90 -9 -5 18 -102 -41 -185 -146 82 -9 -7 355 38
$$ packed form
3861i3J10p6j8K76l88M6K02J4o2m9mq8p7L47k60PO7k37L85k61M2L6K6J69l57M33
3887A90l31K48%k65l8J57J37m7J49j58J20j78p9K23k12K8P3j08k07J25o0J54J13
3910C4j78K73j47j68L68m7K2l98R1N68o58J42J70Q3m82L93P0k71K07j63J8P0j81
3933a84M4K55l5K1J4p7M7k05J48j92J14J4q3J21J10k57K88j53J40N6j30j97L62
3956B21k3j48o5Q3J35l1j84j09J4M6j08R2Q3q7j00J05J46LQ2j22J5k45K53J33
3980A89j54k4p6j88K26J83j33O1k8jk41L50k46K03N1n42N02m42M97k41Q5k04L1
4003a42k6j4K81l5J11j84J23j18J24l04K24K13q2j54l6J32k67K86q5j66J23Jj4
4026iQ0m4k14K08k33L25J3K23m70K38M2n4J1k06Q1MK3j20O1j44L9K28r1KL62l17
$$ plain form
4052 38 -98 -197 101 -42 124 14 155 95 113 -113 -12 -121 -80 105 274 -67 -100 -32 -307 0 -240 234
4074 234 12 52 -61 77 -353 95 -33 -227 -17 67 95 125 217 -182 -48 -97 -174 -225 -69 -115 90 261 -133
4097 -133 54 28 -18 74 -99 -310 10 -129 107 -143 -156 37 214 -77 -241 92 97 -96 -251 -187 -243 235 -201
4120 -201 353 -88 -228 77 193 154 257 34 56 -32 69 63 90 -106 -69 -314 132 -91 -4 -69 204 48 52 34
4144 34 -10 -83 -183 -146 73 107 -184 -14 -210 83 -43 41 54 -239 24 135 -143 -152 -93 -122 214 21 -338 -48
4168 -48 275 1 -124 58 131 82 -1 -265 -146 78 -70 -316 -39 169 114 116 53 22 228 -270 -295 76 -69
4191 -69 -14 41 -283 355 284 -62 60 -451 31 -56 -23 -395 72 -99 -174 30 -157 -37 226 56 509 213
4213 213 -30 -54 23 286 107 189 198 -13 -67 181 -2 221 218 195 -56 255 90 129 15 -20 68 -224 78 109
$$ packed form
4052C8j36r9K98j43J66j10J41o0J8k26J01j09M1J85J69l41l3O8k75L07k40M74
4074B34k22M0j13J38m30M48j28j94K10Q4K8L0R2l99J34m9p7n1J56m6K05J71l94
4097a33J87k6m6R2j73k11L20j39K36k50j3J93J77k91j64L33Nj93j55O4n6M78m36
4120b01N54m41j40L05J16l9J03k23K2q8J01oK7j96L7k45M46k23Q7o5K73j56Mj8
4144C4m4p3j00L7K19L4k91J70j96K93j26Q4J3k93K63J11k78rN9k9L36j93l59K90
4168d8L23k74j25J82P3m9q3k64J19K24j48k46K77K08n5Ko3l1K06m98k5L71j45
4191f9N5N5l24O38p1l46J22n11M82q7L3l72M67j71p5K04j87J20K63j70M53k96
4213B13k43k4P7K63j79Q2Rk11n4K48j83K23lk3k51L11j65L9j14l5Q8k92L02L1
$$ plain form
4237 109 81 260 110 8 412 55 -6 -50 270 -148 174 24 165 -93 -76 -27 16 90 -213 -50 -113 175 -5
4260 -5 -150 56 -269 177 -191 -140 -252 -65 -140 -37 -76 89 113 -153 373 65 -93 5 41 -182 -414 270 -152
4283 -152 -79 231 131 18 89 -83 31 -198 -27 112 -195 110 183 273 -65 -96 -71 -124 134 21 29 171 187
4306 187 137 219 125 190 16 165 287 -249 -98 264 50 184 -157 197 158 139 306 74 182 167 -59 91
4328 91 -57 95 22 328 111 -30 -260 -48 -65 172 301 -43 -165 149 -89 -47 -122 -121 -61 -83 -3 -224 -99
4351 -99 20 -157 -179 -38 -157 11 37 -108 102 75 -14 50 128 -162 -17 -45 -80 138 367 -35 64 -54 318
4374 318 112 33 93 123 175 -20 163 124 -69 -44 -137 83 -113 121 42 -276 6 -130 -103 71 -129 71 118
4397 118 29 250 64 70 131 -175 333 14 350 35 103 322 156 182 29 385 -25 145 -40 -57 -62 -44 69
$$ packed form
4237A09k8J79j50j02M04l57o1m4L20m18L22j50J41k58J7M9M3P4l03J63o3K88j80
4260ej45K06l25M46l68N1j12J87p5J03l9J65K4k66N26l08j58R8L6k23k32O84m22
4283a52P3L10j00j13P1j72J14k29J71J39l07L05P3R0l38l1K5n3K58j13QJ42J6
4306A87n0Q2r4O5j74J49J22n36J51L62k14J34l41L54l9j9J67k32J08j5k26J50
4328I1j48J52p3L06k17j41k30K12j7K37J29l44j22L14k38M2p5JO0k2Q0k21J25
4351i9J19j77k2J41j19J68K6j45K10k7q9O4P8k90J45k8l5K18K29m02R9j18L72
4374C18k06p9O0L0N2j95J83l9j93K5r3K20j96K34p9l18K82j36K7J74k00K00M7
4397A18q9K21j86OO1l06N08l19L36l15O8K19j66K6j53L56m10J70j85j7nJ8J13
$$ plain form
4420 69 40 25 163 -109 74 -209 -98 25 -47 11 -19 -206 207 -60 83 -118 269 -321 -110 5 -127 148
4442 148 100 83 129 62 95 170 200 -21 -594 209 43 31 -62 55 145 154 69 -127 234 253 214 85 48 -61 -50 287
4468 287 86 -79 105 62 12 153 98 45 -42 75 -40 138 -144 -290 84 -96 243 44 -48 -136 137 341
4490 341 -23 -61 132 -169 194 32 -54 -197 49 -1 -43 14 2 -50 164 212 -10 42 4 276 -124 -85 13 219
4514 219 -44 370 -52 -64 -11 -284 -32 -33 139 -32 55 246 -92 51 -24 -2 220 89 122 -86 -250 91 -109
4537 -109 -1 -406 -52 56 200 24 -104 -237 -117 -285 -135 -41 -62 -314 -31 -141 197 158 366 -201 141
4558 141 -116 -135 177 65 -30 260 24 -252 12 45 240 -147 80 -313 39 133 12 -33 21 -189 -94 131
4580 131 181 197 104 19 15 16 -127 45 -158 168 86 70 -79 -206 78 -201 57 97 -73 -87 -102 172 -25 -28 -216
$$ packed form
4420F9k9j5J38k72J83k83J11J23p2N8l0j87M13k67J43k01L87n90K11J15j32K75
4442A48m8j7M6o7L3P5L0k21n73Q03j66j2r3J17R0Rq5j96L61J9l9j29l7j09J1L37
4468B87k01j65J84m3n0J41n5n3q7J17j15J78k82j46L74j80L39j99r2q8K73K04
4490C41l64l8J93l01L63j62q6j43K46n0m2N7j2n2K14M8k22N2l8K72m00L9R8K06
4514B19k63M14m22j2N3k73K52jJ72j71Q7J91l38J43p5K2K22j31L3k08j64L41k00
4537a09J08m05L54J08J44j76j28j33J20j68J50R4k1k52K83j10L38l9K08n67L42
4558A41k57j9L12j12r5K90k36k76K64L3J95l87K27l93L52R4j21m5N4k10R5K25
4580A31N0J6r3q5mJj43J72k03L26q2j6j49j27K84k79K58M0j70j4j5K74j97lj88
$$ plain form
4605 -216 75 52 56 -72 -9 -365 -60 -151 157 4 -228 14 -18 -30 84 -126 -187 -191 -299 39 38 -102 -155 -75 59
4630 59 -25 -194 -248 -295 -56 149 58 -49 101 -281 135 -106 -135 76 148 -206 -31 219 281 -140 -185 10 202
4653 202 -65 -113 -338 228 10 -48 -121 -107 279 289 -1 79 -189 142 -71 18 170 -61 97 27 257 47 100
4676 100 -3 -335 86 -167 3 -22 -57 164 78 92 -21 219 -159 185 -98 -215 95 15 -95 -33 -41 -224 107
4699 107 77 125 -121 -3 -74 122 -208 78 -99 -33 -20 77 -125 60 -10 -300 -122 -27 -30 -78 -88 -285 -242 80
4723 80 -115 -230 -112 -25 237 187 -25 -232 243 54 -94 158 -82 37 -63 -26 431 420 -135 -74 14 -37 95
4746 95 257 -17 -115 36 -159 346 -37 138 75 -226 65 160 -32 -32 94 152 224 -2 113 104 -110 73 -10 147
4770 147 -321 -71 -17 -189 -103 14 -61 39 -51 168 -59 161 213 -70 69 -251 69 45 2 -107 -111 46 -8
$$ packed form
4605b16K91k3Mj28O3l56L05r1L08j53k32K42l2j2J14k10o1mj08L38jj40n3Q0J34
4630E9q4j69n4m7K39K05r1j07J50l82M16k41k9K11P2l54J75K50O2m21m5J95J92
4653B02k67m8k25N66k18n8p3J4L86J0k90Q0k68L31k13Q9J52k31J58p0K30k10N3
4676A00j03l32M21k53J70k5l5K21q6J4j13K40l78L44k83j17L10q0j10O2qj83L31
4699A07l0M8k46J18p1J96l30K86j77O6J3R7k02J85p0k90J78R5lm8j0j97M3L22
4723H0j95j15J18Q7K62n0k12k07M75j89j48K52k40J19j00L7M57j1n55O1Q8n1J32
4746I5J62k74r8J51j95N05l83J75o3l01K91R5j92%J26N8P2k26J15rk14J83q3J57
4770A47m68K50N4j72Q6J17p5J00r0K19k27K20N2k83J39l20L20k4m3j09mJ57n4
$$ plain form
4793 -8 70 218 49 12 -35 180 133 -128 -35 -232 -71 -253 90 148 50 142 25 116 -229 182 -40 135 -210 -153
4817 -153 2 -6 228 -27 -106 -29 13 -73 142 -148 -102 -43 146 -86 -10 74 -59 18 241 63 175 -146 117 203
4841 203 8 292 -101 100 -3 20 -129 60 -124 272 94 -44 -75 -78 -4 110 -40 -128 -38 -247 -270 115 -113
4864 -113 -156 155 -45 170 -11 107 -109 203 289 180 154 48 -54 -5 106 -108 155 -230 81 168 -124 -174
4886 -174 -84 -153 -133 11 -27 -259 122 -29 -215 -6 140 -29 -173 44 232 -47 -62 -137 -92 -157 162 -119 157
4909 157 40 -316 83 32 90 -253 -71 -234 194 -235 181 56 58 151 -202 -101 2 -48 63 109 -7 35 134
4932 134 -82 64 19 40 249 63 124 223 -117 237 53 -64 -101 -144 55 -154 -158 7 -60 145 32 -232 228
4955 228 17 246 -328 -53 169 82 -178 -17 -34 106 104 -302 354 37 13 -301 115 -123 238 -156 -156 27
$$ packed form
4793hP8J48j69l7m7K15m7k61R3j97J61j82L43N8r8R2j17R1l45M11k22J75l45N7
4817a53J55qK34k55p9P7M2q6K15k90M6N9J89k32P6Q4j33P7K23j78J12l21K63Q6
4841B03j95K84l93K01j03K3j49J89j84L96j78j38l1lP4J14j50q8R0k09k3L85k28
4864a13m3L11k00K15j81J18k16L12Q6j09k6j06j02M9J11k14K63l85L11Q7k92n0
4886a74R0o9K0J44l8k32L81j51j86K09J46j69j44K17J88k79j5p5M5o5L19k81K76
4909A57j17l56L99n1N8l43J82j63M28m29M16j25KR3l53J01J03n0J11M6j16M2R9
4932A34k16J46m5K1K09j86O1R9l40L54j84j17l7m3J99k09mJ65o7K05j13k64M60
4955B28k11K29n74K75K22q7k60J61j7J40km06O56l17k4l14M16k38L61l94%J83
$$ plain form
4977 27 50 52 24 54 -141 45 -25 176 -276 37 -274 139 -41 -56 107 -111 97 -193 -79 104 55 44 142 246
5001 246 -79 124 201 431 116 -6 -133 167 -145 -35 -38 59 -22 -253 -185 56 -177 -130 -121 -183 -39 -22 195 277
5025 277 -168 7 138 85 177 234 2 -5 243 70 121 57 35 46 273 -124 26 185 45 -117 -229 -219 94
5048 94 -324 -141 371 216 -125 147 -11 7 97 -97 -138 115 -275 -189 161 207 179 -221 47 37 152 2 -41
5071 -41 -369 33 -157 250 166 247 -119 45 -164 214 -371 -325 72 93 -71 -9 -57 212 -15 3 13 132 281
5094 281 44 134 -56 -146 -23 30 313 185 203 1 -33 11 18 123 -133 110 -37 282 -55 -115 271 80 151
5117 151 144 55 33 42 130 -186 253 -21 -140 -88 -71 23 239 46 -269 -21 -104 -102 -17 67 -10 246 0 25 -57 -28
5143 -28 185 -217 -179 -41 -100 -42 -55 53 -37 -97 -103 -63 259 -72 -363 212 -45 122 -91 41 -31 62 -66 -173
$$ packed form
4977B7K3Kk8L0j95J86p0K01m52L13l11M13j80j5J63k18K08k90J14J83m9j1R8J04
5001B46l25K03P7K30l15j22j27L00l12J10lR7q1k31O8K41k33M7Ro2J44J7K17Q2
5025B77m45J75J31n3R2N7k32pK48j73N1o4k2J1K27l97J50J59j40j62j12J0L13
5048I4m18J83N12j55l41K72j58J8R0j94m1K53l90Q6L50M6k8m00K68j0J15j50m3
5071d1l28M02j90M07q4Q1l66J64k09L78n85M6L97K1j64O2m8K69k27J8J0J19J49
5094B81k37R0j90r0J23N3K83j28J8k02l4M4PJ05k56K43j47L19l37o0L86j91P1
5117A51pq9k2RQ8l16M39k74j19N2J7R4K16j93l15K48q3KQ5Q4p7K56k46K5q2K9
5143b8K13m02L8J38n9N8j3J08r0o0oM0L22l31k91N75k57J67k13J32p2R3j28j07
$$ plain form
5167 -173 181 -74 -96 -188 92 138 -195 -4 161 -150 50 -212 -142 107 98 8 -258 -201 42 51 -90 -60 62 -142
5191 -142 250 -4 35 48 163 41 -112 18 65 99 59 -216 -99 186 -72 -298 20 306 -6 29 -41 242
5213 242 -135 -27 -99 -215 253 -103 89 172 58 192 184 3 59 -39 -85 129 19 -28 -224 203 -42 13 142
5236 142 -254 122 -84 -88 -233 21 -47 -49 -1 -24 -175 -489 36 22 83 37 66 -42 146 -23 130 -243 -85 -127
5260 -127 213 -36 -204 51 -31 -160 -219 -204 -48 -70 145 108 -12 -43 33 270 -30 30 25 -205 -239 163 -4 -72
5284 -72 -83 -140 198 217 54 175 231 -15 -129 211 28 2 66 -4 129 55 -11 90 -83 283 34 71 -198 21
5308 21 209 -69 -143 128 66 -21 -85 93 -45 42 -27 -198 -26 162 -8 -4 145 91 -143 -332 -51 -75 126 2
5332 2 -179 -37 -83 -177 -95 152 -10 -12 118 -47 38 -115 -159 -112 194 -92 149 -44 -7 -212 25 100 64 131 -140
$$ packed form
5167a73L54k55k2r2K80M6l33J91J65l11K00k62P0K49rr0k66N7K43Rj41L0J22k04
5191a42L92k54L9J3J15j22j53J30M7L4m0k75J17K85k58k26L18K86l12L5p0K83
5213B42l77J08p2j16M68l56J92Q3j14J34qj81N6r8m6K14j10m7j96M27k45N5J29
5236A42l96L76k06mj45K54o8kM8k3j51l14N25j4O1m6K9j08J88j69J53l73J58m2
5260a27L40k49j68K55q2j29n9J5J56k2K15l7j20l1P6K37l00O0nk30l4M02j67o8
5284g2j1n7L38J9j63J21N6k46j14L40j83k6O4p0J33p4o6J01j73L66k49L7k69K19
5308B1J88k78p4K71o2q7o4J78j38Q7o9j71J72J88j70MJ49n4k34j89K81k4K01j24
5332Bj81J42m6r4Q2K47j62kJ30j65Q5j53m4M7L06k86K41j93L7k05K37P5l6O7k71
$$ plain form
5357 -140 117 392 -38 -243 12 -240 -157 60 -77 85 -152 23 -418 -179 -68 55 151 8 -194 230 131
5378 131 324 29 -58 224 136 266 220 114 50 -162 192 199 17 138 74 -64 -12 139 99 94 -152 30 27 -15 -68
5403 -68 -13 -170 296 38 206 110 -190 -84 -300 -133 -118 -64 203 -54 -217 209 80 -203 71 48 -161 -263
5425 -263 32 -189 104 -68 198 -164 154 -99 -151 -75 -140 -81 -183 -180 100 -73 -86 -49 -171 163 -92 12 -203
5448 -203 -52 -139 -44 -69 72 21 -88 178 -50 17 9 -146 -152 100 121 -61 166 -6 33 21 26 83 -1 -7 -35 34 -89
5475 -89 97 -231 37 149 113 119 -56 122 -88 127 44 0 82 -39 77 -127 78 147 36 79 -232 198 24
5498 24 -27 -28 -80 -103 -223 146 -64 148 -156 -107 19 -13 28 114 58 -130 307 -128 -118 -169 -40 -104 -6 124 -55
5523 -55 52 -252 -95 19 -150 -110 -167 -221 93 -99 99 13 285 140 94 68 -163 116 -30 -101 65 252 -121
$$ packed form
5357a40K57K75m30k05K55k52Q3K17j37J62k37J75m41K39J11J23R6j43k02M24r9
5378A31J93k95q7K82q8J30m6j06o4k12L54Pj82J21o4j38N2J51m0nk46J82lm2n3
5403f8N5j57M66k58J68r6l00J06k16J67J5N4K67k57j63M26j29k83K74k3k09j02
5425b63K95k21K93j72K66l62L18k53n2P6o5N9j02LK80j73j3L7j22L34k55J04k15
5448b03J51q7R5k5J41n1j09K66k28O7qj55oK52K1j82K27j72L9j2NN7q4ok8O9j23
5475h9J86l28K68J12l6Oj75J78k10K15q3m4Q2j21J16k04K05O9j11M3l11M30j74
5498B4n1jn2k3j20L69k10K12l04M9J26l2M1Q6n6j88M37m35J0n1J29o4R8J30j79
5523e5J07l04J57J14j69M0n7n4L14j92J98q6K72j45m6k6k31K79j46p1J66J87l73
$$ plain form
5546 -121 2 -84 -139 48 -78 31 15 224 124 139 127 -15 49 107 -41 97 100 125 -19 -350 -36 151 187 108
5570 108 -60 2 -67 -50 -32 -51 -4 -255 63 94 32 246 -92 227 -74 42 -44 -79 -17 27 117 -8 -93 -37 40
5595 40 33 -123 -64 -259 -12 -282 339 53 -98 185 -115 72 71 -77 -183 370 -318 -6 -158 -261 -113 -7
5617 -7 -49 -178 -26 52 -138 79 -40 142 -28 135 168 68 32 26 -27 271 28 -13 89 -224 174 84 136 -159
5641 -159 -110 -202 178 -107 197 -8 4 -18 -80 -131 20 33 261 -18 47 -81 54 -28 -39 187 -20 96 194 102
5665 102 61 12 154 32 -73 200 473 -32 122 115 42 59 -85 111 80 140 38 141 3 139 93 14 37 -181
5689 -181 74 -141 -76 212 93 -31 -31 -139 86 -104 -368 -65 -13 -93 111 146 -28 82 -192 -57 -141 -170 21
5712 21 -277 -258 222 44 -38 -104 192 -181 -115 -73 90 23 -116 21 65 -33 11 123 -157 61 -159 -47 47 269
$$ packed form
5546a21J23q6n5J87j26J09j6K09j00J5j2j42O4N8j48J38LK5j44l31L14J87L6p9
5570A08j68O2o9J7J8j9M7k51L18L1o2K14l38L19l01J16q6l5O2M4R0j25q5N6P7
5595D0pj56N9j95K47k70O21k86j51K83l00J87jj48j06N53o88L12j52j03J48J06
5617gm2j29J52P8j90K17j19J82j70J63L3j00l6on3K98k43m1J02l13L98r0N2k95
5641a59M9r2L80k85L04k05J2k2o2n1J51J3K28k79O5j28J35q2j1K26k07J16R8r2
5665A02m1m9J42j22j05K73K73n05J54pp3J7j44J96l1O0j02J03j38J36m6p9K3k18
5689a81K55k15O5K88j19j24%j08K25j90k64L03N2q0K04L5j74J10k74J35q4k9J91
5712B1k98J9M80j78q2o6K96l73O6M2J63o7j39J37M4r8M4J12k80K18k20J12R4K22
$$ plain form
5736 269 127 -89 -171 142 43 50 95 -166 -220 76 -43 85 113 287 288 41 24 62 52 51 108 6 -89 316 39
5761 39 -194 57 163 -7 267 -26 117 -160 -105 185 112 -217 153 -7 63 236 -18 38 2 -230 -98 -200
5783 -200 36 39 104 -412 -100 15 221 -21 9 -123 -345 -92 -43 122 -100 -36 87 -96 -76 -62 -160 -142 -80 -134
5807 -134 298 -31 -39 31 269 203 99 -3 204 -28 38 -159 -6 24 -32 -46 -205 -171 56 230 97 -119 -38
5830 -38 -23 -160 -20 127 188 -74 177 180 19 28 -8 25 93 111 256 356 -77 -60 239 -55 -107 83 18 -12 157
5855 157 -179 -10 25 153 -80 77 215 24 77 -108 19 147 224 80 99 -162 -104 87 -104 -133 67 -137
5877 -137 53 235 375 -5 -70 -150 73 138 91 -335 -187 -86 -52 58 -115 169 146 -21 -268 15 90 -112
5899 -112 -459 -182 -244 267 335 -177 -73 1 100 -182 16 -12 61 88 -82 -342 -112 55 76 -191 95 400 32
$$ packed form
5736B69j42k16q2L13r9PM5k61n4K96j19J28K8J74Jk47j7L8j0jN7j02r5M05k77
5761C9k33K51J06j70K74k93J43k77N5K90p3l29L70j60P0J73k54N6l6k32J32j02
5783b00K36LO5n16L12J15K06k42L0j32k22K53M9J65k22O4J23j83K0J4r8J8O2n4
5807a34M32l29qP0K38o6j04j02K07k32O6j97J53L0n6j4j59L4K27J74j33k16Q1
5830c8J5j37J40J47O1k62K51Lj61Rl6L3O8J8J45J00m33J7K99k94n2J90o5l0J69
5855A57l36J69L5J28k33J57J38j91N3j85J27J28P7j44J9k61N8J91j91k9K00k04
5877a37J90J82J40l80o5q0K23O5m7m26J48J01L4J10j73K84k3j67k47K83P5k02
5899a12l47K77o2N11O8n12J04P4R9k82J98k8P3K7j70k60K30J67K1k67K86L05l68
$$ plain form
5922 32 -27 222 97 112 224 -221 6 141 -10 -224 157 212 -86 -41 -20 283 -64 -102 -82 385 0 -98 0
5945 0 76 -16 -36 -92 42 -58 -206 58 112 196 -29 -149 8 -29 -27 98 75 29 129 -3 68 -27 -130 30 -88
5970 -88 -113 -104 -83 82 -56 -47 -127 -49 5 -92 -224 -66 -185 -112 95 7 -157 -101 -63 184 -89 148 31 -113 -104 -110
5996 -110 -206 77 28 -60 -2 -87 231 -88 11 -37 259 54 22 -186 -166 5 -24 151 -274 142 -93 -18 144 90
6020 90 -197 282 85 11 135 -35 197 -124 -77 -256 5 -78 113 40 11 314 -30 143 267 4 246 115
6042 115 55 -222 -297 302 27 41 320 207 -172 -79 -203 48 44 -45 172 -243 5 57 -234 277 -63 171 44
6065 44 -104 219 183 -59 312 59 -174 -201 -221 105 -278 -78 138 -95 -143 -19 65 -110 -90 -112 -90 -15 104
6088 104 190 33 -66 -51 47 -27 -27 25 -67 53 48 186 227 -3 57 18 -6 12 -59 81 124 36 -20 17 -65 -216 325
$$ packed form
5922C2n9K49j25J5J12m45K27J35j51k14L81N5k98M5K1L03l47l8K0M67l85r8R8
5945@P6r2k0n6J34j00j48K64N4Q4k25j20J57l7KJ25k3m6J00j32P1r5j03J60j18
5970h8k5RK1J65j38Rq0P8N4r7j32J58j19P3K07q8j64N6L8K47k73K37j17j44Ro
5996a10r6K83m9q8N8q5L18l19R9m8K96k05l2k08K0J71k9J75m25M16k35P5J62n4
6020I0k87M79j97p4J24j70K32l21M7j79K61q3J91p3k9L03l44J73J24k63K42j31
6042A15o0k77p5N99k75J4K79j13l79R3j24K51mq9K17m15K48N2k91N11l40K34j27
6065D4j48L23l6k42L71k53k33k7k0L26l83K00K16k33m8J24Q4j75K0k2K2P5J19
6088A04Q6j57r9J5R8p4%N2r2J20nJ38M1k30O0l9k4J8p1J40M3q8n6L7q2j51N41
$$ plain form
6115 325 -70 153 24 60 -4 231 110 -88 124 -35 -281 251 147 14 -36 -77 -59 20 235 -77 -38 -86 -98
6138 -98 -110 -162 183 -89 -121 -30 -135 63 72 180 -227 -154 41 103 162 190 185 -24 -14 -52 2 10 -7 -185 50 -205
6164 -205 -89 55 -219 87 65 139 -70 32 -9 -151 49 196 -44 -23 -232 41 -76 175 85 13 -163 -211
6186 -211 69 112 235 96 233 -120 2 -120 13 -221 56 89 492 53 88 25 123 56 -20 40 -24 13 3 -94
6210 -94 174 79 -404 156 -28 -21 389 224 -32 -40 204 20 -108 -274 -290 -102 74 -69 141 -193 1 -100
6232 -100 -117 -198 205 25 106 -330 253 153 -250 68 -180 -7 -169 -275 167 72 30 -121 -24 -159 177 -229
6254 -229 173 100 -232 -208 -30 -116 -65 28 -297 199 -199 -95 -34 81 -125 193 -41 87 -179 -84 110 -39
6276 -39 -140 -100 -201 299 -9 -111 254 179 -141 -35 77 -38 -165 -38 262 -49 -160 -4 -56 57 99 155
$$ packed form
6115C25l95K23j29L6o4K35j21j98K12j59k46N32j04j33n0m1J8P9K15l12L9m8j2
6138i8j2n2L45k72l2R1j05J98RJ08m07P3J95O2N9K8nk09J0l8N4Qj7j78K35k55
6164b05J16J44k74L06k2P4k09J02m1j42K00J47k40K1k09K73j17K51r0p2j76m8
6186b11K80M3J23j39J37l53J22j22J33k34K77L3M03m39L5o3R8o7p6O0o4L7j0r7
6210i4K68r5m83N60j84PM10j65k56qK44j84j28j66j6J88J76j43K10l34J94j01
6232a00j7q1M03j80Q1m36N83j00m03L18k48J73j62j06M42r5m2j51R7j35L36m06
6254b29M02p3l32K4J78q6N1R3l25M96l98J04O1J15k06L18k34J28k66R5J94j49
6276c9j01M0j01N00l08j02L65p5l20J06J12j15j27J27L00l11j11J56n2J13M2N6
$$ plain form
6298 155 -9 180 -45 -9 261 -189 -359 77 216 -119 -88 -48 -78 -6 322 -50 -54 53 -10 -144 116 13 37
6321 37 -205 25 -213 -21 -65 59 106 155 36 -54 131 267 158 185 -104 11 -36 113 16 -44 144 227 285 81
6345 81 130 -129 98 -111 -87 -100 173 -189 78 -215 -58 243 -40 -103 -25 -91 -31 -147 113 41 40 49 40 182 167
6370 167 33 46 -83 -123 189 -4 94 -96 104 -216 29 105 98 186 21 232 36 151 20 13 156 -49 -33
6393 -33 229 138 149 -34 54 -71 91 50 -124 -303 196 94 41 -215 -141 -154 -135 -61 127 60 36 111 -112 104
6417 104 -141 -16 78 40 -146 25 101 -115 307 -37 -83 -306 127 65 -125 -164 -194 -78 -204 154 -220 81
6439 81 117 36 -253 283 28 -121 -251 -6 17 -195 -88 -130 -258 50 -15 146 -17 -433 -154 -111 208 57
6461 57 -135 60 146 -74 340 104 -291 -68 -8 -51 6 -173 83 317 82 -277 61 -207 109 -1 -173 283
$$ packed form
6298A55j64J89k25L6K70m50j70M36J39l35L1M0l0P2L28l72mJ07o3j34K60j03K4
6321C7k42K30k38J92m4J24M7M9j19r0J85J36j09K7k89J15m7J49r7o0J88Q3N8k04
6345H1M9k59K27k09K4j3K73l62K67k93J57L01k83o3P8o6O0j16K60p2jRrJ42j5
6370A67j34J3j29m0L12j93R8j90K00l20K45P6pQ8j65K11j96J15j31pJ43k05J6
6393c3K62r1J1j83Q8j25J62m1j74j79M99j02n3k56P4j3J9P4J88o7k4P5k23K16
6417A04k45J25R4l8j86J71P6k16M22l44m6k23M33o2j90l9l0J16j26L58l74L01
6439H1L6q1k89N36k55j49j30K45K3k12J07m2j28L08o5J61j63m16K79M3L19j51
6461E7j92J95Q6k20M14k36l95K23O0m3N7j79K56K34k35l59L38k68L16j10j72M56
$$ plain form
6483 283 -128 -14 -41 -132 56 93 5 -128 15 23 -124 334 126 -253 -134 204 113 -126 -193 -90 36 117 -111
6506 -111 -20 -229 84 50 90 -30 -17 -191 169 120 -114 -16 167 198 29 -45 -16 -96 69 -175 -65 5 -27 14
6530 14 -181 37 -147 -19 53 -76 193 -162 161 282 53 -164 -86 74 -170 57 -73 116 -32 49 -179
6551 -179 -3 39 -88 -90 63 249 142 234 104 -121 -138 29 -12 -165 80 -353 26 -70 -84 69 141 2 127
6574 127 -232 72 63 248 -43 67 70 -158 -102 29 257 40 -281 -216 -93 224 -56 43 -184 -4 91 -90 138
6597 138 -49 78 -332 176 -137 -72 -218 -183 -171 138 -160 126 -153 4 -39 -153 93 263 121 17 70 -392
6619 -392 173 29 30 63 -45 -240 -60 91 -108 -79 226 12 266 86 -33 10 39 -114 1 -10 -63 -124 58
6642 58 301 -72 -188 182 -27 16 -96 59 -199 40 -83 -79 47 380 202 97 -323 82 24 52 -126 40
$$ packed form
6483B83m11J14k7r1J88L7q8j33J43Qj47M58k08l79J19L38r1k39o7J03J26Q1k28
6506a11R1k09L13l4M0j20J3j74L60m9k34R8J83L1j69p4K9q0J65k44J10P0l2M1
6530A4j95K18j84J28P2j29K69l55L23J21k29k17P8J60k44K27j30J89j48Q1k28
6551a79J76M2j27kJ53J86j07R2j30k25j7J67m1j53K45m33L79r6j4J53P2j39J25
6574A27l59L04rJ85k91J10Lk28N6J31K28k17l21O5J23L17k80R9k27J80R5j81K28
6597A38j87J27m10N08l13O5j46L5J2L09k98K86k79J57m3j14K46J70j42j04N3m62
6619c92N65j44JL3j08j95J80J51j99K9L05k14K54j80j19M3K9j53J15j1n3o1J82
6642E8K43l73j16L70k09M3j12J55k58K39j23MJ26L33j78j05m20M05n8K8j78J66
$$ plain form
6664 40 106 -81 186 -308 -42 87 -57 2 85 83 -6 -132 -97 -104 128 104 82 -48 -135 100 129 5 -391 -387 -149
6689 -149 -292 137 185 -3 13 -62 -170 29 -21 -75 129 -177 171 -146 88 -88 82 5 -98 -79 264 127
6711 127 -100 -68 261 -216 20 -188 15 179 144 -114 -112 84 20 -145 -85 -44 223 118 82 -177 47 -67 51
6734 51 103 -57 118 -228 146 -175 114 -61 -47 -227 37 152 144 289 245 13 -148 146 -93 -6 -241 -52
6756 -52 62 -36 22 79 161 8 -60 47 107 71 -95 132 81 -277 41 123 58 170 256 -214 -72 -27 235 34
6780 34 -53 48 42 -113 -332 -87 113 35 213 134 20 -25 -293 -101 28 46 -59 -49 -113 159 151 65 -100 258
6804 258 159 325 -334 -152 -392 188 5 192 -86 -177 49 123 22 226 73 -1 -236 -175 -248 100 87 -74
6826 -74 186 152 -82 252 -163 146 -148 -123 -13 44 297 -178 83 -228 214 -31 228 -83 10 43 -89 246
$$ packed form
6664D0O6j87K67m94K66J29j44N9Q3kq9j26L5pK32k4k2j30q7K35K9j24l96MK38
6689a49j43M29M8j88J6p5j08J99n0n4K04l06L48l17K34j76J70p7j03J9L43j37
6711A27k27L2L29m77K36k08K03J64l5k58KJ96o4j65O0M1K67j05l6k59K24j14J18
6734E1N2j60J75l46L74l21K89j75J4j80K64J15qJ45m4k32j61K94k39Q7k35J89
6756e2J14r8N8N7Q2j53o8J07O0l6j66K27n1l58L18Q2o5J12Q6m70J42M5K62k01
6780C4q7J01oj55k19K45K00p8J78p9j14m5k68J92J29J8j05J0o4K72qq6j65L58
6804B58r9J66o59J82k40N80j83J87k78r1K26P4j01K04j53p4k35O1p3L48j3j61
6826g4K60l4k34L34m15L09k94K5J10N7K53m75K61l11M42k45K59l11R3L3j32L35
$$ plain form
6848 246 181 131 130 59 184 25 -16 37 72 61 103 226 -35 67 -6 42 0 -140 -54 30 149 83 -106 104 6 -124
6874 -124 45 122 246 52 51 -68 -106 -9 -104 -177 -196 188 283 46 124 -35 -39 17 -284 141 235 241 -27 232 157 287
6900 287 32 -41 -132 67 -82 -140 -83 -140 79 -139 -221 72 -90 -25 -6 -258 285 193 -400 214 204 -10 61 193
6924 193 -227 137 -99 19 21 117 -224 -51 -10 -461 -41 130 178 -151 52 -120 45 -182 -37 141 -65 -20
6946 -20 28 83 60 -59 25 121 -148 -174 -82 -39 61 -8 128 144 -32 -75 206 115 33 4 -176 -300 6 -56 -6 14
6972 14 -72 178 -131 92 -91 226 -38 -72 -11 -280 -29 218 -154 -58 108 -108 -39 82 80 -34 -29 -111 -80 -51
6996 -51 52 -206 -141 18 -102 -95 194 64 66 184 -80 -2 205 47 -21 270 105 110 56 -9 -137 -89 -194 88
7020 88 83 -203 -197 17 211 51 -26 -146 43 121 -132 211 11 -88 -43 -298 143 -155 -26 131 -69 -4 18 -36
$$ packed form
6848B46o5n0jp1J25j59m1N3L5j1M2J23k61J02p3M8m2j40Q6Q4J19o6j89K10r8j30
6874a24J69P7J24j94jj19l8R7r5p3j9L84R5k37P8j59mN6l01M25R4Ok68K59p5J30
6900B87k55p3r1J99j49n8N7n7K19k18q2K93j62O5J9k52N43r2n93O14j0k14P1J32
6924A93m20L64k36J18KR6l41J73M1m51M20J71M8l29K03j72J65k27J45J78k06M5
6946b0M8N5k3j19Q4R6k69k6R2M3J00o9J36J6j76m3K81r1q2k9j80j24L06o2N0K0
6972A4q6K50l09K23j83L17k64l4O1k69K51K47l72R6J66k16O9J21kj14Nq2L1K9
6996e1J03k58O5J59j20PK89j30KJ18k64P8K07j58o8K91j65Nn4o5j28M8j05K82
7020H8nk86OK14J94j60p7j20J89P8k53L43k00r9M5k55M41k98J29J57k00O5K2n4
$$ plain form
7044 -36 116 231 109 4 -66 172 377 84 -150 -153 8 -21 51 86 2 -199 104 191 148 -30 -83 -99 37 -30
7068 -30 -107 97 -115 -135 81 33 258 -40 -22 -60 133 34 -74 223 122 -88 -31 -121 181 -130 -136 145 -238 -40
7092 -40 -59 -371 34 -39 -27 189 18 56 -174 229 14 79 -143 -137 84 108 -82 -61 -147 -113 24 -15 25 24 -38 -13
7118 -13 -103 286 66 -202 -130 155 89 -231 45 104 -46 65 -42 37 -94 -10 -165 44 -22 -54 -33 110 -312
7141 -312 202 -191 55 95 -147 85 -66 -44 -231 -63 266 -21 133 9 229 -28 -53 139 48 -169 -80 37
7163 37 21 -76 -175 -11 33 241 79 86 70 75 -28 119 30 198 -59 -80 56 -17 1 -73 113 293 -111 49 194
7188 194 103 -269 126 -223 130 -34 51 32 -141 -22 198 -166 39 -105 -120 11 -30 48 5 2 -23 64 49 105
7212 105 79 20 40 -16 -87 -32 197 -28 61 19 28 -35 130 -381 -42 -178 70 -28 142 87 73 288 -135 -81 150
$$ packed form
7044c6J52J15j22j05p0K38K05k93k34lJ61k9P2L5q4k01L03Q7m3j78n3j6J36o7
7068c0p7K04k12k0K16m8K25k98J8l8J93r9j08K97j01k10N7r0L02l11oK81l83J98
7092d0j9l12M05p3J2K16j71L8k30M03k15O5k22OK21K4j90K1q6L4J37l9M0jo2K5
7118a3r0L89k20k68P2K85o6l20K76N9j50J11j07P9j31Q4j55K09o6l2K1J43m22
7141c12N14l93K46M0k42K32j51K2j87J68L29k87J54j24K20k57k5J92r1k17Q9J17
7163C7j6r7r9J64M4K08j62Pj6Nj03J47q9J68k57k1J36p3J8p4J86J80m04J60J45
7188A94r1l72L95l49L53j64Q5j9j73J19K20l64K05j44j5J31m1P8m3lk5Q7j5N6
7212A05k6n9K0n6p1N5K29k25Q9m2Ro3J65n11L39j36K48r8J70n5j4K15m23N4K31
$$ plain form
7237 150 107 56 245 15 171 2 142 -43 19 -199 -102 100 -171 103 240 168 -125 52 303 86 -211 -266
7259 -266 209 -127 161 -153 -186 -46 52 -160 -24 -269 -118 -6 -117 40 156 -141 359 132 -97 -288 -96
7280 -96 46 -297 317 96 109 -260 32 141 -162 157 54 -52 -12 -63 -38 162 -28 -106 122 -19 -211 35
7302 35 -43 -257 -185 186 -169 12 -7 -100 -74 28 -43 -44 26 -137 45 -174 156 -38 25 42 11 174 -9 10 -118
7327 -118 -112 -212 192 -19 134 -45 -43 52 -152 59 -75 -148 -3 -143 -131 45 80 -10 -319 9 -117 131 38
7350 38 34 231 372 63 -280 53 44 -38 37 125 -157 250 -51 121 -102 64 156 265 -176 -196 -74 102 54 164
7374 164 268 3 -220 -102 163 -67 252 34 -27 -35 -104 195 170 -78 -3 96 -84 25 -281 88 256 87
7396 87 -155 -14 -114 111 -95 -239 -78 -81 253 98 -128 75 117 44 -5 85 -25 92 95 -34 125 -42 -85
$$ packed form
7237A50m3n1J89k30J56j69J40j85O2k18R7K02k71K74J37p2k93J77K51k17k97n5
7259b66M75l36K88l14l3J40R8k12J36k45J51J12j11J57J16k97N00k27k29j91J92
7280i6J42l43O14k21J3l69K92J09l03L19j03j06M0n1K5K00j90p8K28j41j92K46
7302C5p8k14P2L71l55J81j9r3K6J02p1jP0j63J82k19L30j94O3J7l1J63j83J9j28
7327a18Oj00M04k11J53j79KR5k04K11j34p3J45j40J2J76L5r0l09L28j26K48r3
7350C8mJ97J41l09l43L33rq2P5Q8k82M07l01J72k23J66R2J09m41k0J22J76m8J10
7374A64J04k65k23J18K65k30L19k18o1qo9K99k5k48P5R9j80J09l06L69J68j69
7396H7k42J41j00K25k06j44J61lL34j55k26K03M2p3m9R0j10J17Lj29J59j67m3
$$ plain form
7419 -85 -16 142 65 -162 23 332 86 87 -80 53 -114 80 -186 1 -37 82 -41 -183 -143 -64 -75 -68 -197 234
7443 234 -169 217 59 -87 -291 -7 -123 44 219 231 -143 -286 135 205 -68 94 24 -82 17 -90 92
7464 92 -135 215 -84 -56 53 440 94 106 -13 -303 -10 22 -13 156 96 211 34 -199 -121 -447 82 -60
7486 -60 25 189 -70 -14 116 164 20 75 2 120 -52 -152 -83 -27 238 101 -218 51 -290 -68 54 112 58
7509 58 242 -157 69 114 92 17 -73 -123 -145 7 -92 3 -287 104 54 -77 18 18 -104 124 162 -25 65 73 122 48
7535 48 32 -46 -54 67 -17 272 119 -30 54 48 7 60 70 23 -51 207 -87 -238 -56 -52 164 114 82 216 20 313
7561 313 155 -34 -204 -231 -8 317 178 64 -413 231 212 -70 10 112 57 129 11 72 71 10 72 123 26 -64
7585 -64 -40 -59 246 -268 26 113 -29 -34 -132 -19 -31 -109 30 146 130 60 -44 84 -20 -111 114 -298 86 96
$$ packed form
7419h5O9J58p7k27J85L09k46Jj67J33j67J94k66J87l8J19j23j42M0P9j1Pj29M31
7443B34m03L86j58j46k04K84j16J67J75J2l74j43M21P0k73J62p0j06R9j07J82
7464I2k27L50k99K8J09L87l46J2j19k90K93L2l5J69o0J15j77k33P8l26N29j42
7486f0Q5J64k59N6J30M8j44N5p3J18j72j00O9N6K65j37l19K69l41K22J22N8n4
7509E8J84l99K26M5k2p5r0n0k2J52r9R5k90L91n0j31R5%j22K28L8j87R0QM9p4
7535D8j6p8qJ21q4K89j53j49Q4om1N3J0m7p4K58k94j51J82MK16n0l2J34j96K93
7561C13j58j89j70k7K23L25j39j14m77O44j9k82Q0J02n5P2j18O1jo1O2N1r7r0
7585f4K4j9L05n14K94Q7j42nr8J13j2p8J39J16j6p0j04J28j04r1K25m12L84J0
$$ plain form
7609 96 -174 -181 -21 -110 9 -82 -24 47 -35 108 -227 244 189 60 16 366 -13 214 -174 39 -203 -39 -164
7632 -164 -107 -135 -133 84 -102 -46 -125 -47 207 -65 80 -87 -83 -28 -18 136 43 -159 -136 249 -271 -10 130 232
7656 232 161 -53 -3 114 58 327 205 -122 -68 -116 316 98 132 -85 239 -138 57 14 62 -213 38 -10 -90
7679 -90 -148 -159 -95 -150 -73 139 118 -113 65 -106 126 13 -238 16 274 33 -172 -243 93 -213 -70 7 106
7702 106 -194 281 -90 -39 -343 -106 -40 -90 -147 -128 -6 -28 268 -63 259 -93 -112 224 -20 161 -284 -107
7724 -107 -9 -126 232 239 114 117 -163 242 108 -44 123 118 -48 -77 58 43 -45 34 110 -67 21 -52 -134 -18 -235
7749 -235 72 18 74 11 76 49 -39 204 -184 159 97 -152 53 60 -85 171 166 -140 -200 -19 -71 67 153 44 -61
7774 -61 23 -16 -132 -65 -118 -15 33 -49 8 143 196 -172 142 224 -139 41 211 66 -101 -124 -251 -144 56 -80
$$ packed form
7609I6k70pJ60q9J19r1N8P1q2J43l35M71n5j29m4L50l79K27l88K13k42J64j25
7632a64N7k8KK17j86N6p9P8K54k72J45j67MN5J0J54r3k02K3L85n20K61J40J02
7656B32p1k14N0J17n6K69j22l27N4m8M32k18L4k17L24l77J95m3M8k75K51m8q0
7679i0n8j1O4n5P7K12k1k31J78j71K32j13k51K54K58k41k05p1L36l06J43P7R9
7702A06l00M75l71N1l04K37O6n0n7J9J22k2K96l31L22l52j9L36k44J81m45J77
7724a07R8j17L58Pj25Lk80M05j34j52J67nj66k9J35j5q8P9P6j77Q8p3q2J16k17
7749b35L07n4N6o3O5k7q8K43l88L43o2k49K05Pj45K56nl06o0J81n2J38Q6j09j05
7774f1Q4l9j16O7n3J03M8q2N7J35N3l68L14Q2l63J80J70j45j67k3j27J07K00j36
$$ plain form
7798 -80 65 192 57 -89 4 196 -6 311 -115 76 -25 106 -120 91 19 69 -42 -180 47 -28 433 -255
7820 -255 -130 -267 -73 -73 13 44 48 222 -5 56 -20 -27 70 69 176 14 344 257 23 -54 -104 -9 175 103 41 -120
7846 -120 -119 -143 26 76 83 7 28 230 103 376 1 126 240 -205 186 66 58 -119 243 197 -156 -178 7 23
7870 23 -202 -165 156 123 -19 -84 -143 -57 -86 -106 94 207 361 248 -273 212 -173 221 126 -85 -6 79 -138 166
7894 166 195 -203 152 -90 66 165 -38 -119 -123 -49 116 270 -82 137 204 144 -20 -127 187 -49 -283 168 78
7917 78 -240 -260 -163 101 155 36 7 2 18 -47 -96 124 -95 259 206 -123 72 302 125 19 -226 -112 -159 -61
7941 -61 70 -61 -364 384 -71 -109 77 -13 7 63 -110 -119 -76 -4 48 -375 -132 -163 -183 156 281 -144 -119 -247
7965 -247 -128 376 -49 46 -183 -77 152 -67 -106 335 -170 -29 -154 -13 -169 -49 106 63 118 -91 -75 -55
$$ packed form
7798h0J45J27j35j46R3J92k02L17m26J91j01J31k26K11p2N0j11j38K27p5M61o88
7820b55J25j37J94%Q6L1MJ74k27O1p6pR7jJ07j62L30q7k34p7n0R5J84p2o2j61
7846a20Jk4J69N0Pp6K1K02j27K73l75J25J14m45L91j20qj77L62m6l53k2J85J6
7870B3k25L7L21l3j42o5n9Q6k9k0K00J13J54j13n21M85l85L94r5k11P9Q5k17L04
7894A66K9l98L55k42J56R9k03q1mP4J65J54l52K19O7o0j64j07L14k36k34M51r0
7917G8l18k0R7K64N4j19k9nJ6o5m9K20k19L54n3l29J95K30j77j06k45J14m7R8
7941f1J31j31l03P48m55l8J86r0K0N6j73rM3P2N2m23K43l1k0L39J25m25K5j28
7965b47J19N04m25R5k29J06K29k19l9M41n05J41j25J41j56J20J55m3N5k09J6K0
$$ plain form
7987 -55 -8 -170 -6 -58 218 300 88 -89 -134 50 68 165 -169 64 4 231 -119 -15 -115 -14 58 44 96 33
8011 33 119 282 -64 -102 -24 -39 -82 -292 201 -64 168 -116 39 87 -16 -215 82 56 239 23 143 46 100
8034 100 -47 367 -12 -74 33 -82 -52 -9 -63 -125 167 28 -19 -89 -115 38 46 -191 -127 -3 -429 -79 63 363
8058 363 -98 26 204 52 100 18 -220 -67 -60 -13 -89 -41 -199 216 -130 -64 108 79 28 201 69 195 29
8081 29 -332 -22 -94 -32 -89 -60 -10 -119 -46 70 67 -230 178 125 -68 219 7 -36 83 -66 133 15 5 122
8105 122 218 122 -71 -227 147 224 -56 39 190 66 147 -40 -226 50 -5 -96 -4 -61 -106 125 43 -77 80 -124
8129 -124 -17 -201 -36 40 -67 -182 -22 -332 88 -57 103 -251 98 8 44 116 -117 147 -36 -61 215 124
8151 124 26 103 -18 -131 -189 -51 96 266 -26 175 -112 -283 -24 64 -68 9 55 22 358 -8 189 -107
$$ packed form
7987e5M7j62J64n2K76Q2k12j77m5J84J8R7l34K33o0K27l50J04j00J01P2j4N2o3
8011C3Q6J63l46l8P8j5m3k10M93k65K32k84J55M8j03j99K97k6J83k16J20r7N4
8034A00j47M14l79o2J07j15L0M3n4o2K92j39m7p0k6J53Qk37O4J24m26L50J42L00
8058C63m61J24J78j52M8q2k38J53PM7p6M8j58M15l46O6J72k9n1J73j32J26j66
8081B9l61L10p2O2n7K9N0j09P3J16lk97M08n3j93K87k12m3J19j49J99j18j0J17
8105A22R6r6j93j56L74P7k80R5J51j24Q1j87j86K76n5r1R2n7m5K31q2j20J57k04
8129a24J07j84J65P6j07j15J60l10M20j45J60l54L49r0L6P2k33K64j83k5K76r1
8151A24r8P7j21j13n8J38J47J70k92K01k87j71K59Q8j32P7M6l3L36l66J97k96
$$ plain form
8173 -107 120 -122 164 11 97 150 -98 109 -190 -37 163 66 -148 26 -21 20 -55 -161
$$ packed form
8173a07K27k42K86j53Q6N3k48K07k99J53K00r7k14J74m7M1p5j06
8191a61
$$ Imaginary data points
##PAGE= N=2
##DATA TABLE= (X++(I..I)), XYDATA
$$ plain form
0 0 0 0 0 0 0 0 0 0 0 0 0 0 0 0 8 -8 8 -8 8 -13 16 -16 21 -24 29 -32 40 -45 48 -56 64 -75 85 -95 109 -122
36 -122 133 -150 171 -189 210 -234 258 -286 316 -349 383 -424 466 -513 566 -622 688 -761 840
55 840 -932 1037 -1158 1299 -1470 1674 -1932 2258 -2695 3310 -4235 5777 -8813 16994 -83363
70 -83363 -224528 11841 44745 -102178 -85138 17583 -25345 -86398 -87180 -64824 -31697 -3550
82 -3550 -54124 -102542 -68810 -30927 -67776 -100805 -57896 5626 -28736 -99894 -72615 -12916
94 -12916 -45200 -84528 -45956 -10879 -34718 -46408 -40050 -53056 -30192 12408 -18528 -43785
106 -43785 2534 4365 -50176 -38093 11539 6551 -2658 16970 -4047 -16966 30748 26891 -15159
119 -15159 25920 60491 9124 -10798 25487 35943 24576 26689 34471 39201 38608 29177 22643
$$ packed form
0@%%%%%%%%%%%%%%Qj6J6j6J6k1K9l2L7m5N3o1P2q5R3j04J20j39J60j80K04k31
36a22K55k83L21l60L99m44M92n44O02o65P32q07Q90r79J079j188J310j449J601
55H40j772J969k195K457k769L144l606M190m953O005p545J0012j4590K5807j00357
70h3363j41165K36369L2904j46923J7040J02721m2928o1053p82K2356L3127K8147
82c550n0574m8418L3732L7883l6849l3029M2909O3522l4362p1158K7279N9699
94a2916l2284l9328L8572L5077k3839j1690O358j3006K2864M2600l0936k5257
106d3785M6319J831n4541J2083M9632m988r209J9628k1017j2919M7714l857m2050
119a5159M1079L4571n1367j9922L6285J0456j1367K113P782M730n93r431o534
$$ plain form
132 22643 27888 39354 49110 35830 14067 37358 58124 13403 188 61481 67539 9968 13239
145 13239 49900 23461 -5313 31171 47926 17250 18760 28890 3640 1593 27434 24540 9098
158 9098 13816 12687 -5851 -9412 6724 8192 770 4952 4832 -7207 -16437 -10874 962 -7569
172 -7569 -18208 -730 1711 -28964 -32949 -8838 -7863 -18428 -11277 -8097 -18458 -22967 -29484 -30363
186 -30363 -6182 1195 -24144 -27193 -11036 -20253 -31563 -16006 -1302 -6952 -18288 -23563 -22311
199 -22311 -13543 -9413 -15892 -10052 1615 -9077 -21390 -12918 -2615 -2384 -8009 -8199 2581 2892
213 2892 -12547 -12357 5092 6214 -4866 2878 13036 94 -6629 3016 3726 6200 14912 8375
227 8375 1772 8101 6824 -159 9254 20941 13125 3620 7825 8384 5964 10311 11777 13294 14273
$$ packed form
132B2643N245J1466R756j3280k1763K3291K0766m4721j3215O1293O058n7571L271
145A3239L6661k6439k8774L6484J6755l0676J510J0130k5250k047K5841k894j5442
158I098M718j129j8538l561J6136J468p422M182j20j2039r230N563J1836q531
172g569j0639J7478K441l0675l985K4111R75j0565P151L180j0361m509o517q79
186c0363K4181P377k5339l049J6157r217j1310J5557J4704n650j1336n275J252
199b2311Q768M130o479N840J1667j0692j2313Q472J0303K31n625j90J0780L11
213B892j5439J90J7449J122j1080P744J0158j2942o723R645P10K474Q712o537
227H375o603O329j277o983R413J1687p816r505M205N59k420M347J466J517R79
$$ plain form
242 14273 7210 4425 10698 9971 7225 11640 12824 8216 7544 8919 3075 3343 12289 10297 5706 9817
258 9817 5238 -2167 2893 5031 3712 10277 9811 -3086 -6451 2402 2552 -1312 6810 7208 -3292
273 -3292 -5444 -6164 -5874 3446 4809 -3601 -4114 -2574 -7575 -9621 -3367 1003 -1240 -4110 -8739 -10281
289 -10281 -3983 -6271 -10669 -487 1470 -9631 -10002 -6384 -8733 -7730 -2960 -3721 -6032 -3208 -7652
304 -7652 -14863 -5684 691 -6043 -4409 -671 -7983 -9939 -5080 -3366 -2273 -176 -1585 -5990 -5433
319 -5433 -3062 -4242 375 2553 -3212 -2128 565 -4527 -2259 3168 723 556 2458 840 -335
334 -335 2124 2520 -584 5173 7659 -247 1578 7114 962 801 7719 6275 3992 6066 4286 1848
350 1848 4805 7586 4005 5345 8896 3289 2337 6830 4737 4970 7866 4753 4062 5821 3559 2510
$$ packed form
242A4273p063k785O273p27k746M415J184m608o72J375n844K68Q946j992m591M111
258I817m579p405N060K138j319O565m66j2897l365Q853J50l864Q122L98j0500
273c292k152p20K90R320J363q410n13J540n001k046O254M370k243k870m629j542
289a0281O298k288m398J0182J957j1101l71L618k349J003M770p61k311K824m444
304g652p211R179O375o734J634L738p312j956M859J714J093K097j409m405N57
319e433K371j180M617K178n765J084K693n092K268N427k445j67J902j618j175
334c35K459L96l104N757K486p906J825N536o152j61O918j444k283K074j780k438
350A848K957K781l581J340L551n607r52M493k093K33K896l113o91J759k262j049
$$ plain form
366 2510 5647 6134 3494 4176 5937 1202 1360 5626 1416 1225 6462 2370 -1109 2113 1769 -1262
382 -1262 1265 3436 -181 -1270 1413 -2316 -3725 1542 -188 -2899 7 -2617 -5193 -1774 -2959
397 -2959 -4662 -1587 -1381 -5812 -6116 -2375 -4483 -6273 -2425 -4106 -5786 -3051 -6527 -8060 -2043 -3622
413 -3622 -7646 -4320 -2090 -5720 -7219 -4251 -4170 -4750 -1922 -4629 -6545 -1496 -2583 -6763 -2621 105
429 105 -2996 -3083 -2188 -2536 -1369 239 -2107 -2750 2585 1908 -3601 -212 3151 866 1191 1145 523 4403
447 4403 3792 -1035 1616 7221 3878 -173 4307 5883 2772 4333 4122 2019 7220 6453 200 3750
463 3750 8734 4529 1293 4642 6266 4370 4181 3362 3632 6468 4528 -111 3768 6296 1710 1904
479 1904 3749 1768 2041 2700 -718 293 4579 2352 -3175 -462 3184 -1627 -3295 1064 676 -1412
$$ packed form
366B510L137M87k640O82J761m735J58M266m210j91N237m092l479L222l44l031
382a262K527K171l617j089K683l729j409N267j730k711K906k624k576L419j185
397b959j703L075K06m431l04L741k108j790L848j681j680K735l476j533O017j579
413c622m024L326K230l630j499K968Q1n80K828k707j916N049j087m180M142K726
429A05l101q7Q95l48J167J608k346o43N335o77n509L389L363k285L25m6o22L880
447D403o11m827K651N605l343m051M480J576l111J561k11k103N201p67o253L550
463C750M984m205l236L349J624j896j89q19K70K836j940m639L879K528m586J94
479A904J845j981K73O59l418J011M286k227n527K713L646m811j668M359l88k088
$$ plain form
495 -1412 -1850 -3444 -2750 -1136 -2306 -2252 -1150 -3317 -6084 -3086 -2017 -5684 -2762 88 -5354 -7143
511 -7143 -2699 -4439 -5928 -1172 -2469 -5872 -4157 -3321 -6004 -5043 -1303 -2039 -4168 -4357 -4582 -2552
527 -2552 -2079 -6021 -3104 2761 -2466 -6922 -1342 563 -2397 -2316 -188 -121 671 856 -3682 -2635 4433
544 4433 3395 -1754 467 3242 2815 -45 -1848 4145 8588 2419 -2465 3429 7369 1275 -697
559 -697 7198 7725 2346 2462 3089 3155 6074 5374 2120 3378 7415 5862 -87 441 6813 7686 2734
576 2734 894 5377 6935 -1008 -2024 6641 6797 1306 2098 1784 -1109 901 4086 1336 82 4074
592 4074 705 -6237 -2042 3927 1099 -1912 -2295 -701 -515 -4537 -4548 -167 -35 -4079 -3872 -2700 -4786
609 -4786 -4809 -2189 -4390 -5946 -1080 -2201 -7755 -6335 -3241 -4362 -4532 -4061 -3423 -3698 -5524 -6573 -4709
$$ packed form
495a412m38j594O94J614j170N4J102k167k767K998J069l667K922K850n442j789
511g143M444j740j489M756j297l403J715Q36k683R61L740p36k129j89k25K030
527b552M73l942K917N865n227m456N580J905k960Q1K128O7P92J85m538J047P068
544D433j038n149K221K775m27k860j803N993M443o169m884N894L940o094j972
559f97P895N27n379J16O27O6K919p00l254J258M037j553n949N28O372Q73m952
576B734j840M483J558p943j016Q665J56n491P92l14k893K010L185k750j254L992
592D074l369o942M195N969k828l011l83J594J86m022j1M381J32m044K07J172k086
609d786k3K620k201j556M866j121n554J420L094j121j70M71O38k75j826j049J864
$$ plain form
626 -4709 -1912 -2986 -4029 -2217 -4769 -7032 -1927 -1412 -4920 -1787 1411 -2924 -7324 -2000 2556
641 2556 -1384 -2759 693 1005 -810 -1657 -1306 2497 3826 903 -92 1104 2846 4069 1929 -319
657 -319 3943 8455 2642 -2381 5774 8773 -21 204 8277 7333 2942 2726 3167 4937 6271 4636
673 4636 2932 5280 6965 2474 521 4525 6918 5307 2148 948 5214 5400 -197 77 5112 5354
689 5354 616 -736 2021 1772 135 383 456 2096 2440 -2034 -4078 -309 271 -1286 -816 -341 -2159
706 -2159 -3013 -3918 -4523 -1122 1731 -3342 -6815 -2606 -2486 -5865 -4118 -1612 -2143 -3765 -4706 -5807 -4354
723 -4354 -2415 -3377 -4649 -2984 -2281 -4172 -5412 -4777 -2477 -1237 -3485 -3039 -824 -2734 -5415 -3507
739 -3507 103 -220 -1595 -1034 -1519 -3161 -1730 -70 -152 1923 2128 -1788 -2417 662 1671 1271 2579
$$ packed form
626d709K797j074j043J812k552k263N105N15l508L133L198m335m400N324M556
641B556l940j375L452L12j815q47L51L803J329k923r95J196J742J223k140k248
657c19M262M512n813n023Q155K999q794K25Q073r44m391k16M41J770J334j635
673D636j704K348J685m491j953M004K393j611l159j200M266J86n597K74N035K42
689E354m738j352K757k49j637K48P3J640L44m474k044L769N80j557M70M75j818
706b159q54r05o05L401K853n073l473M209J20l379J747K506n31j622r41j101J453
723d354J939r62j272J665P03j891j240O35K300J240k248M46K215j910k681J908
739c507L610l23j375N61m85j642J431J660q2K075K05l916o29L079J009m00J308
$$ plain form
756 2579 2709 393 291 1375 1684 2809 3819 2251 2235 2550 1390 2406 3055 2710 3406 3558 2777 2682
774 2682 2888 2258 1847 3557 4185 2887 3356 2766 523 1431 3528 2773 2947 3042 1643 107 454 1620
792 1620 2010 2572 2193 -395 -994 203 69 141 1855 1226 -458 -1284 -1523 -744 -310 -412 -361 -224 -661
811 -661 -2868 -2738 -683 -1412 -1400 -55 -1291 -2386 -2322 -3133 -2552 -317 -599 -1896 -1899 -2226 -3658 -3063 -441
830 -441 -765 -1019 -1042 -2989 -3303 -1736 -1241 -904 -14 -702 -1703 -2518 -1562 -1113 -734 558 -469 -1036 -367
849 -367 -1687 -1498 370 169 -260 808 2 -945 -388 88 -173 417 1932 976 -430 190 -177 118 2038
868 2038 1855 680 1521 471 -671 875 2105 1914 1197 1347 918 -69 1178 1119 1123 2462 1667 -92
886 -92 1088 961 374 773 1562 1674 1111 1085 729 -24 710 1185 892 2111 1621 -642 183 420 5 1301
$$ packed form
756B579J30k316j02J084L09J125J010j568j6L15j160J016O49l45O96J52p81r5
774B682K06o30m11J710O28j298M69n90k243R08K097p55J74R5j399j536L47J166
792A620L90N62l79k588n99J197j34P2J714o29j684q26k39P79M34j02N1J37m37
811f61k207J30K055p29J2J345j236j095O4q11N81K235k82j297ll27j432N95K622
830d41l24k54k3j947l14J567M95L37Q90o88j001q15R56M49L79J292j027n67O69
849c67j320J89J868k01m29J068q06r47N57M76k61N90J515r56j406O20l67K95J920
868B038j83j175Q41j050j142J546J230j91p17J50m29r87J247n9MJ339p95j759
886i2J180j27n87L99P89J12n63k6l56p53P34M75k93J219m90k263Q25K37m15J296
$$ plain form
906 1301 1878 862 -425 -58 -582 -651 1182 1749 -267 125 -175 -1307 -6 579 -13 509 378 -741
924 -741 -1160 -310 -106 -596 -26 343 -922 -547 -689 -1927 -427 280 -751 -512 -202 -1295 -1653 -1359 -794
943 -794 -380 96 -532 -1909 -1611 -766 -1794 -564 259 -899 -1162 -1505 -1913 -1125 -125 -488 -1310 -622 -619
962 -619 -1704 -1386 360 -491 -870 -122 -1257 -630 -181 -1033 -718 318 41 -760 -245 33 -759 -171 1063
981 1063 264 170 1253 -301 -471 867 624 431 1330 686 433 606 697 517 1340 2085 862 394 1283
1000 1283 645 567 1988 1442 1258 1834 1481 507 759 1762 1226 854 1566 1457 952 1058 743 693 1782
1019 1782 1219 458 1232 550 208 701 474 603 1264 1264 -355 -429 498 163 -737 392 690 -528 -845 -840
1039 -840 -430 150 -458 -939 -667 -455 -1149 -1335 -845 -821 -627 -359 -1603 -2038 -456 -897 -2182 -1366 -310
$$ packed form
906A301N77j016j287L67n24o9J833N67k016L92l00j132J301N85n92N22j31j119
924g41m19Q50K04m90N70L69j265L75j42j238J500P07j031K39L10j093l58K94N65
943g94M14M76o28j377K98Q45j028J230Q23j158k63l43m08P88J000l63q22O88L
962f19j085L18J746q51l79P48j135O27M49q52L15J036k77q01N15K78p92N88J234
981A063p99r4J083j554j70J338k43j93Q99o44k53J73R1j80Q23P45j223m68Q89
1000A283o38p8J421n46j84N76l53r74K52J003n36l72P12j09n05J06l15n0J089
1019A782n63p61P74o82l42M93k27J29O61%j619p4R27l35r00J129K98j218l17N
1039h40M10N80o08m81K72K12o94j86M90K4J94K68j244m35J582m41j285Q16J056
$$ plain form
1058 -310 -866 -1889 -1967 -753 -899 -1440 -1390 -738 -694 -1505 -1674 -794 -853 -1217 -475 -965 -1368 -250 -432 -1132
1078 -1132 -819 763 217 -1135 -674 1036 -232 -430 538 904 276 11 138 751 -23 476 1118 489
1096 489 560 953 895 145 463 2126 1435 48 950 1928 716 636 1485 1626 1324 739 1315 1001 689 1277
1116 1277 1639 1076 1033 1128 1254 325 183 1521 1311 -88 350 1064 322 61 433 738 -10 -250 609 -47
1136 -47 -558 269 -97 -378 -355 -456 177 -1021 -1432 -103 -104 -1222 -981 -753 -374 -1245 -748 -105 -1289 -964
1156 -964 -657 -1118 -1437 -394 -528 -1063 -1549 -475 -374 -1563 -1359 25 -565 -1220 -1049 -193 -182 -1474 -539
1175 -539 247 -475 -913 -8 -441 -117 218 371 -712 -931 610 572 -639 540 846 -58 -283 -227 1045
1194 1045 988 446 699 527 453 498 825 1052 660 439 800 376 283 1435 636 449 667 949 640 513 761
$$ packed form
1058c10n56j023p8J214j46n41N0O52M4q11j69Q80n9l64P42m90m03J118j82p00
1078a132L13J582n46j352M61J710j268j98R68L66o28k65J27O13p74M99O42o29
1096D89P1L93n8p50L18J663o91j387R02R78j212q0Q49J41l02n85N76l14l12N88
1116A277L62n63m3R5J26r29j42J338k10j399M38P14p42k61L72L05p48k40Q59o56
1136d7n11Q27l66k81K3j01O33j198m11J329jj118K41K28L79q71M97O43j184L25
1156i64L07m61l19J043j34n35m86J074J01j189K04J384n90o55J71Q56J1j292R35
1175e39P86p22m38R05m33L24L35J53j083k19J541l8j211J179L06r04k25N6J272
1194A045n7n42K53j72p4M5L27K27l92k21L61m24r3J152p99j87K18K82l09j27K48
$$ plain form
1215 761 1449 405 468 755 635 699 685 268 576 244 278 670 214 -270 351 317 -265 -521 649 255 -603
1236 -603 -375 253 -741 -640 250 76 -451 -411 -658 -654 -521 -606 -540 -337 -522 -1249 -629 -869 -1198 -317 67 -1019
1258 -1019 -890 -395 -914 -797 -41 -548 -728 -250 -259 -1134 -508 379 -421 -593 89 -940 -911 -249 -78 120
1278 120 55 -27 -507 444 19 -344 0 590 -77 48 811 43 423 807 59 -191 814 1098 269 460
1298 460 743 152 147 858 323 497 1085 -133 -83 1125 413 353 878 186 -428 318 637 430 469 586 96
1319 96 -53 248 154 -120 733 355 -382 212 72 -245 -54 297 -317 -454 -118 -578 -393 -317 -315 -732 61 -22
1341 -22 -1083 -394 -393 -589 -235 143 -215 -425 -480 -352 -683 94 -64 -385 -14 -337 -1207 -314 -88 -412 -172
1362 -172 72 -236 -280 -319 -138 -92 225 -33 -589 -65 154 -268 -86 457 88 300 -44 -61 250 309 391 257
$$ packed form
1215G61O88j044O3K87j20O4j4m17L08l32L4L92m56m84O21l4n82k56J170l94q58
1236f03K28O28r94J01Q90j74n27M0k47MJ33q5O6K03j85p27O20k40l29Q81L84j086
1258a019J29M95n19J17P56n07j80M78rq75O26Q87q00j72O82j029K9O62J71J98
1278A20o5q2m80R51m25l63L44N90o67J25P63p68L80L84p48k50J005K84q29J91
1298D60K83n91nP11n35J74N88j218N0J208p12o0N25o92o14P46L19k07L9J17m90
1319I6j49L01r4k74Q53l78p37N94j40l17J91L51o14j37L36m60J85P6Km17P93q3
1341b2j061O89Jj96L54L78l58k10n5J28l31P77j58l21L71l23q70Q93K26l24K40
1362a72K44l08m4l9J81M6L17k58n56N24K19m22J82N43l69K12l44j7L11N9Q2j34
$$ plain form
1384 257 538 582 -1 122 378 229 753 636 18 293 447 -176 255 419 542 340 651 177 79 529 483
1405 483 98 183 597 -87 236 294 51 79 336 -37 -128 2 -361 -358 -374 90 35 -74 -51 -703 -441 323 -115
1428 -115 -35 14 -555 -620 -336 -362 -309 -128 82 -728 -751 -292 -494 -443 279 -288 -639 -153 -497 -387 -81 -37 -141
1451 -141 -236 -206 -277 -321 -34 -253 61 415 100 44 298 -231 -437 105 195 84 550 354 -39 -12 443 171
1473 171 231 555 -61 114 202 62 242 461 114 230 736 162 127 344 413 338 110 449 224 -238 115 3
1495 3 -95 301 191 211 8 -94 -103 239 271 174 309 354 -419 -416 -38 76 51 86 -261 -462 -109 -111 -451 -6 545
1520 545 -101 -312 -389 -292 -449 -28 -87 -254 198 -207 -462 -92 -41 -229 60 183 -224 -160 -13 -86 -305 171
1542 171 427 -175 28 267 -318 196 186 142 407 132 214 1 91 465 181 366 167 -208 346 368 -50 628
$$ packed form
1384B57K81M4n83J23K56j49N24j17o18K75J54o23M31J64J23k02L11m74r8M50m6
1405D83l85Q5M14o84L23N8k43K8K57l73r1J30l63Lj6M64n5j09K3o52K62P64m38
1428a15Q0M9n69o5K84k6N3J81K10q10k3M59k02N1P22n67l51M86l44J10L06M4j04
1451a41r5L0p1m4K87k19L14L54l15n6K54n29k06N42R0j11M66j96l93K7M55k72
1473A71O0L24o16J75Q8j40J80K19l47J16N06n74l5K17O9p5k28L39k25m62L53j12
1495Cr8L96j10K0k03j02rL42L2r7J35M5p73LL78J14k5L5l47k01L53kl40M45N51
1520E45o46k11p7R7j57M21n9j67M52m05k55L70N1j88K89J23m07O4J47p3k19M76
1542A71K56o02K03K39n85N14j0m4K65k75Q2k13R0L74k84J85j99l75N54K2m18O78
$$ plain form
1564 628 570 103 3 373 30 -356 545 613 -84 608 210 -307 -137 388 -23 68 725 13 -197 -28 -94
1585 -94 140 -234 173 -49 -197 -546 -416 -191 374 -243 -317 -229 -592 -705 -332 -205 -101 -153 -270 -1086 -558
1606 -558 -405 -503 -301 -117 -517 -547 -194 -667 -454 -214 -235 -322 -100 -278 -469 -396 54 -82 -270 360 16 -678
1628 -678 147 386 -412 77 234 -67 -156 -252 238 409 15 186 105 134 319 236 570 465 151 739 542 -20
1650 -20 283 491 427 208 780 894 419 335 484 -239 452 689 463 689 270 264 373 565 600 473 497 136
1672 136 31 364 396 -469 -143 365 100 -385 520 60 41 -7 -108 -167 -376 -58 -441 -319 -162 -443 -610
1693 -610 -594 -330 -76 -180 -762 -589 -682 -556 -394 -513 -349 -804 -335 -445 -414 -637 -140 -372 -703 -476 -692
1714 -692 -85 -401 -339 -92 -312 -758 -429 118 -184 -488 75 -257 -564 -283 153 -535 -59 150 -266 -247 63
$$ packed form
1564F28n8m67j00L70l43l86R01O8o97O92l98n17J70N25m11R1O57p12k10J69o6
1585i4K34l74M07k22j48l49J30K25N65o17p4Q8l63j13L73J27J04n2j17q16N28
1606e58J53r8K02J84m00l0L53m73K13K40k1q7K22j78j91P3M50j36j88O30l44o94
1628f78Q25K39p98M89J57l01q9r6M90J71l94J71q1K9J85q3L34j05l14N88j97n62
1650b0L03K08o4k19N72J14m75q4J49p23O91K37k26K26m19oJ09J92L5j27K4l61
1672A36j05L33L2q65L26N08k65m85R05m60j9m8j01n9k09L18l83J22J57k81j67
1693f10J6K64K54j04n82J73r3J26J62j19J64m55M69j10L1k23M97k32l31K27k16
1714f92O07l16O2K47k20m46L29N47l02l04N63l32l07K81M36o88M76K09m16J9L10
$$ plain form
1735 63 213 237 425 246 196 81 459 413 107 203 276 312 515 174 366 556 240 562 215 298 244 568 759
1758 759 171 227 531 418 469 731 147 185 829 238 190 457 284 -180 320 220 -104 478 533 67 -186 186
1780 186 76 -452 279 11 -166 -54 -159 -142 71 56 -88 -21 -255 -569 -186 28 -558 -338 255 -700 -668
1801 -668 14 -341 -266 -190 -158 -376 -293 -68 -590 -414 -58 -572 -566 -41 -278 -186 -26 -165 -332 -329 -60 -191 -222
1824 -222 -149 -220 -44 422 -230 -18 -12 34 473 110 -102 -119 175 200 53 332 269 -107 193 653 -25 -184 436
1847 436 153 -197 388 13 -5 286 373 147 352 130 50 70 195 86 64 246 49 33 356 38 104 184 290
1870 290 383 129 -51 -133 -58 211 -1 -307 -131 29 -330 224 127 -174 -106 -107 -173 -20 226 -287 28 -48 252
1893 252 -314 -136 -345 -320 -3 -56 -271 -246 238 -346 177 44 -97 123 -175 -34 -150 98 176 65 152 32
$$ packed form
1735F3J50K4J88j79n0j15L78m6l06R6P3L6K03l41J92J90l16L22l47Q3n4L24J91
1758G59n88N6L04j13N1K62n84L8O44n91m8K67j73m64N00j00l24N82N5m66k53L72
1780A86j10n28P31k68j77J12j05J7K13j5j44O7k34l14L83K14n86K20N93r55L2
1801f68O82l55P5P6L2k18Q3K25n22J76L56n14ON25k37R2J60j39j67LK69j31l1
1824b22P3p1J76M66o52K12OM6M39l63k12j7K94K5j47K79o3l76L00M60o78j59O20
1847D36k83l50N85l75j8K91Q7k26K05k22q0K0J25j09k2J82j97j6L23l18O6Q0J06
1870B90R3k54j80q2P5K69k12l06J76J60l59N54r7l01O8jo6J53K46n13L15p6L00
1893B52n66J78k09K5L17n3k15K5M84n84N23j33j41K20k98J41j16K48P8j11Q7j20
$$ plain form
1915 32 -294 -214 399 -109 84 356 -82 189 239 103 -125 184 206 68 305 238 -115 -156 381 -10 -161 -30
1937 -30 -5 55 125 1 -214 73 193 68 -64 -29 -134 -356 217 -113 -357 110 -334 -79 -136 -38 -89 -40 -59
1960 -59 -274 -233 24 -245 -266 -133 -73 -436 218 -182 -206 -318 -22 -15 -446 -347 -42 -182 -266 -72 -262 -3 102
1983 102 -257 -272 -85 10 120 -181 -59 -4 -51 -241 -232 -176 -68 -41 363 91 -82 47 83 90 519 25 -123 300
2007 300 173 94 254 105 372 253 434 639 345 34 340 387 389 479 203 404 205 166 159 133 382 366 65
2030 65 101 94 263 211 39 129 290 -162 29 -113 47 -166 194 82 -22 -209 -74 -163 -152 34 -423 213 5
2053 5 -358 -382 -183 -182 -386 -304 -429 -247 -417 -254 -476 -283 -83 -500 -395 -370 -553 -469 -300 -21 -297 -151 -23
2076 -23 -399 -206 -65 -119 -228 -317 -254 125 83 -387 -213 148 42 -113 24 -82 94 7 184 -11 -1 114
$$ packed form
1915C2l26Q0O13n08J93K72m38K71N0j36k28L09K2j38K37o7l53m1N37l91j51J31
1937c0K5O0P0j24k15K87J20j25j32L5j05k22N73l30k44M67m44K55n7R8n1M9j9
1960e9k15M1K57k69k1J33O0l63O54m00k4j12K96Pm31R9L05j40q4J94j90K59J05
1983A02l59j5J87R5J10l01J22N5m7j90RN6J08K7M04k72j73J29L6PM29m94j48M23
2007C00j27p9J60j49K67j19J81K05k94l11L06M7KR0k76K01j99l9pk6K49j6l01
2030F5L6pJ69n2j72R0J61m52J91j42J60k13L60j12j04j87J35q9J1J86m57O36k08
2053El63k4J99Jk04Q2j25J82j70J63k22J93K00m17J05K5j83Q4J69K79k76J46J28
2076b3l76J93J41n4j09q9O3L79m2m70J74L61j06j55J37j06J76q7J77j95J0J15
$$ plain form
2098 114 -21 347 304 209 283 213 192 298 309 356 315 360 414 112 341 383 199 179 271 433 151 415 277 208 472
2123 472 -25 110 490 -2 -9 358 75 -24 48 188 114 30 133 -184 -9 -169 -371 -42 75 -230 -144 -273
2145 -273 186 -234 -368 -248 -283 -472 -150 -176 -299 -365 -109 -624 -304 -82 -563 -223 -316 -658 -530 -363 -244
2166 -244 -443 -301 -137 -144 -151 -249 -448 -128 -4 -498 -264 176 -230 -344 133 -227 -30 153 -64 -121 -174 92
2188 92 -210 -27 112 129 339 407 287 152 418 288 335 366 306 363 193 380 229 6 295 359 493 349 382
2211 382 297 552 -19 145 404 353 201 357 283 53 104 290 240 363 250 -105 155 305 -72 109 121 -54
2233 -54 -29 -37 -76 91 180 8 -66 -137 -160 -306 -4 -228 -358 -48 -400 -184 -381 -596 -132 49 -523 -276 -276 -247
2257 -247 -153 -375 -315 -63 -333 -226 -147 -90 -38 -32 -80 -215 3 -81 -162 -210 190 -189 -266 -36 78 -193 97 17
$$ packed form
2098A14j35L68m3r5P4p0k1J06J1M7m1M5N4l02K29M2j84k0R2J62k82K64j38o9K64
2123D72m97J35L80m92pL67k83r9P2J40p4q4J03l17J75j60k02L29J17l05Q6j29
2145b73M59m20j34J20l5j89L22k6j23o6K56n15L20K22m81L40r3l42J28J67J19
2166b44j99J42J64ppr8j99L20J24m94K34M40m06j14M77l60J97J83k17n7n3K66
2188I2l02J83J39J7K10O8j20j35K66j30M7L1o0N7j70J87j51k23K89O4J34j44L3
2211C82q5K55n71J64K59n1j52J56p4k30N1J86n0J23j13l55K60J50l77J81J2j75
2233e4K5ql9J67Q9j72p4p1k3j46L02k24j30L10l52K16j97k15M64J81n72K47%K9
2257b47R4k22O0K52k70J07P9N7N2Om8j35K18q4q1m8M00l79p7K30J14k71K90q0
$$ plain form
2281 17 0 -212 19 65 114 133 -33 146 309 106 108 235 -51 193 235 107 312 216 173 192 -61 408 39 212
2305 212 284 -18 158 215 26 327 521 -3 95 80 -243 -194 101 124 0 219 122 131 -26 -70 -74 -369 343 -46
2329 -46 -246 142 69 -95 62 65 -140 -6 28 -338 -237 55 -237 -221 -147 -132 -220 145 12 -284 130 -52 -453
2352 -453 -288 -122 -76 -452 -16 87 -82 -106 12 -278 77 -153 -411 253 -127 -235 -84 303 -6 -100 -233
2373 -233 92 -112 -51 369 38 -193 373 -28 -79 -38 -88 120 193 208 -126 108 27 -147 68 -79 -69 105 84
2396 84 184 155 351 -193 -187 65 262 -112 -22 194 -126 180 -340 -7 124 -222 27 156 -40 68 95 64
2418 64 185 -106 -245 94 -119 169 155 -103 -80 142 -145 -110 -250 224 -121 132 79 154 10 -66 -24 -141 -101
2441 -101 -81 192 178 128 -301 -223 7 7 71 316 50 -174 432 185 -158 -59 334 -150 330 -53 -33 -68 362
$$ packed form
2281A7j7k12K31M6M9J9j66J79J63k03KJ27k86K44M2j28K05r6m3J9k53M69l69J73
2305B12P2l02J76N7j89L01J94n24R8j5l23M9K95K3j24K19r7Rj57m4mk95P12l89
2329d6k00L88p3j64J57Lk05J34L4l66J01K92k92J6P4J5q8L65j33k96M14j82m01
2352d53J65J66M6l76M36J03j69k4J18k90L55k30k58O64l80j08J51L87l09r4j33
2373b33L25k04O1M20l31k31N66m01n1M1n0K08P3J5l34K34q1j74K15j47J0J74k1
2396H4J00k9J96n44OK52J97l74R0K16l20L06n20L33J31l46K49J29j96J08K7l1
2418F4J21k91j39L39k13K88j4k58K3K22k87L5j40M74l45K53n3P5j44p6M2j17M0
2441a01K0K73j4n0m29P8K30%O4K45k66k24O06k47l43R9L93m84M80l83K0l5M30
$$ plain form
2464 362 43 72 31 -5 84 105 -9 246 23 244 -104 -160 345 -285 -194 40 -87 -87 43 -187 -17 127 -21
2487 -21 188 -144 -55 -97 -73 -102 76 -334 -120 -85 -214 6 -443 -93 -141 -103 117 94 1 -282 -131 -152 -15 -296
2511 -296 -267 -270 -284 -58 -196 -155 -30 -179 186 57 -128 -197 -31 -129 33 36 149 40 -304 141 -176 44 246
2534 246 28 179 241 208 295 154 315 -62 94 488 303 263 250 233 50 127 246 498 168 99 146 142 218 19
2558 19 50 475 318 139 352 455 -68 165 434 203 66 97 122 170 173 8 198 7 67 36 20 -26 115 42
2582 42 103 -257 -281 12 -240 -53 -126 45 -325 94 -258 -138 -321 -389 -26 -309 -156 -435 -212 -109 -144 -279
2604 -279 -121 -94 -302 -35 -72 -192 -161 -253 -254 -50 -95 -189 -315 -440 -47 14 56 -72 -414 -28 139 -13 -36 -170
2628 -170 101 -335 80 65 102 34 173 -41 249 -36 243 131 338 420 428 236 287 -83 372 289 183 320 -18
$$ packed form
2464C62l19K9m1l6Q9K1j14K55k23K21l48n6N05o30R1K34j27%J30k30J70J44j48
2487b1K09l32Q9m2K4k9J78m10K14L5j29K20m49L50m8L8K20k3r3k83J51k1J37k81
2511b96K9lj4K26j38M1J25j49L65j29j85o9J66r8J62LJ13j09l44M45l17K20K02
2534B46k18J51O2l3Q7j41J61l77J56L94j85m0j3j7j83P7J19K52l30o9M7mP6j99
2558A9L1M25j57j79K13J03n23K33K69k31j37L1K5M8Lj65J90j91O0l1j6m6J41p3
2582D2O1l60k4K93k52J87p3J71l70M19l52J20j83o8L63k83J53k79K23J03l5j35
2604b79J58K7k08K67l7j20L1r2jK04m5r4j26j25L93O1M2j28l42L86J67j52k3j34
2628a70K71m36M15j5L7o8J39k14K90k85K79j12K07Q2Qj92N1l70M55q3j06J37l38
$$ plain form
2651 -18 194 179 7 34 479 298 43 250 219 -48 394 165 219 -12 49 -151 3 20 188 -57 -35 13 -19
2674 -19 343 -176 -360 241 -146 -336 61 59 47 -380 -341 -370 -178 -97 -299 -178 -142 -2 -352 -78 -295 -283 -411
2697 -411 -202 -336 -97 -127 -293 -500 -220 -419 -164 -202 12 -108 -110 63 -190 -34 31 -311 -182 131 60 55 -24
2720 -24 253 -245 234 37 226 50 159 281 -9 72 -275 121 109 -40 -84 182 121 87 261 162 132 14 97
2743 97 -53 181 384 183 246 140 -129 379 157 2 -2 79 66 -60 303 274 362 -60 82 21 132 271 9
2766 9 18 -203 -77 -63 -110 70 1 -39 -99 106 -71 -504 -57 -42 15 19 -246 177 -161 -171 -77 -58 -102 -153 225 -245
2792 -245 -162 -231 109 -357 -260 -130 -240 -107 -99 -98 -212 62 -328 121 -276 232 -62 -63 -11 -131 129 62 -347 86
2816 86 -27 -158 -134 237 117 51 -153 221 212 -167 72 -14 251 81 49 -312 -165 -40 50 179 226 117 216
$$ packed form
2651a8K12j5j72K7M45j81k55K07l1k67M42k29N4k31O1k00J54J7J68k45K2M8l2
2674a9L62n19j84O01l87j90L97kj2m27L9k9J92Q1k02J21L6J40l50K74k17J2j28
2697d11K09j34K39l0j66k07K80j99K55l8K14j20kJ73k53J56O5l42J29L13p1np9
2720b4K77m98M79j97J89j76J09J22k90Q1l47L96j2j49m4K66o1l4J74r9l0j18Q3
2743I7j50K34K03k01O3j06k69N08k22j55mQ1j3j26L63k9Q8m22J42o1J11J39k62
2766IRk21J26J4m7J80o9m0o0K05j77m33M47J5N7Mk65M23l38j0R4J9m4n1L78m70
2792b45Q3o9L40m66R7J30j10J33QJj14K74l90M49l97N08k94jN2j20K60o7m09M33
2816H6j13j31K4L71j20o6k04L74rl79K39q6K65j70l2l61J47J25R0J29M7j09R9
$$ plain form
2839 216 342 200 71 200 337 210 75 252 -30 148 211 409 -106 13 -141 97 436 137 9 49 190
2860 190 167 -30 5 -252 -118 -20 -302 -81 48 -2 11 39 -34 -81 -22 -187 -207 -175 34 53 106 29 -24 -246 -111
2885 -111 -37 -224 -206 180 -198 -206 -34 -174 -195 -102 93 67 79 -127 -130 -54 11 -151 42 -28 -297 -351 125 275 -70
2910 -70 -89 186 235 32 180 -122 48 365 272 256 -40 161 -326 63 212 213 91 -93 117 -129 129 182 -131
2933 -131 168 -123 -99 67 201 153 115 176 -116 -153 48 -102 2 -214 284 36 -227 -61 42 300 -66 4
2955 4 2 -41 -174 -241 -6 -41 -88 43 -50 1 -204 -161 -281 87 -18 -9 -195 -3 -81 -46 97 39 -143 20 68 4
2981 4 223 45 63 51 189 -114 54 34 255 223 290 -23 160 -13 -74 -12 19 77 29 4 -47 -258 -205 -21 9
3006 9 75 228 -83 119 -110 153 -51 161 180 152 188 82 325 41 -230 -65 -101 16 -182 -218 -120 159 -159
$$ packed form
2839B16J26j42j29J29J37j27j35J77k82J78O3J98n15J19j54K38L39k99j28M0J41
2860A90k3j97L5k57J34R8k82K21J29n0J3K8p3m7N9j65k0L2K09J9N3p7n3k22J35
2885a11P4j87J8L86l78qJ72j40k1R3J95k6J2k06lP6O5j62J93p0k69n4M76J50l45
2910g0j9K75M9k03J48l02J70L17r3j6k96K01m87L89J49Jj22j84K10k46K58N3l13
2933a31K99k91K4J66J34m8l8O1k92l7K01j50J04k16M98k48k63J66J03K58l66P0
2955Dkm3j33o7K35l5m7J31r3N1k05M3j20L68j05Rj86J92p8L5J43n8j82J63M8o4
2981DK19j78J8j2J38l03J68k0K21l2O7l13J83j73o1O2L1N8m8k5n1k11N3J84L0
3006IO6J53l11K02k29K63k04K12J9k8L6j06K43k84k71J65l6J17j98l6R8K79l18
$$ plain form
3029 -159 -29 60 -29 -69 -58 29 -17 -152 -44 -160 -29 248 -96 -200 289 -208 -124 136 -267 -195 -122 -4 -42
3052 -42 -172 307 -399 -289 55 -219 -293 -77 -107 26 -349 -1 -123 -15 19 -37 -80 48 93 199 -216 24
3074 24 -7 -54 50 -25 168 -154 255 -111 300 166 39 -12 -99 -105 125 160 141 260 -146 128 338 146 43
3097 43 138 44 157 33 88 80 -89 139 20 70 316 37 -68 111 -40 -3 -124 5 156 69 45 227 7
3120 7 -144 5 -84 15 -47 -22 -134 5 -158 -266 51 -63 11 191 -89 -104 113 -80 -198 -131 -62 130 -24
3143 -24 2 -200 -163 -184 -112 70 104 -44 16 147 10 -155 -318 -168 128 51 -86 -182 -7 -209 -205 318 29 57
3167 57 -136 90 101 146 -60 -33 54 -78 34 -83 110 -42 -128 52 97 184 -104 130 -70 213 -49 30 384
3190 384 138 546 154 430 174 190 6 -9 -125 250 244 86 69 111 179 -94 -94 -118 144 -141 63 -79 -187
$$ packed form
3029a59J30Q9q9m0J1Q7m6j35J08j16J31K77l44j04M89m97Q4K60m03P2P3J18l8
3052d2j30M79p06J10L44k74p4K16l0J33l75L48j22J08L4n6m3J28M5J06m15K40
3074B4l1m7J04p5J93l22M09l66M11j34j27n1q7oK30L5j9J19m06K74K10j92j03
3097D3R5r4J13j24N5qj69K28j19N0K46k79j05J79j51L7j21J29J51q7k4J82k20
3120Gj51J49q9R9o2K5j12J39j63j08L17j14P4J80k80j5K17j93j18O7O9J92j54
3143b4K6k02L7k1P2J82L4j48O0J31j37j65j63J50K96p7j37r6J75k02MN23k89K8
3167E7j93K26J1M5k06K7Q7j32J12j17J93j52q6J80M5Q7k88K34k00K83k62P9L54
3190C84k46M08l92K76k56J6j84j5j16L75oj58j7M2O8k73%k4K62k85K04j42j08
$$ plain form
3213 -187 270 -21 183 148 -7 -45 -251 -58 138 243 77 -71 -77 -135 -424 -329 34 -225 16 -216 -137 33
3235 33 -47 104 -161 -49 20 74 -65 -122 171 -255 -47 -86 32 -217 108 -80 -64 -101 -30 9 54 -25 -18 71 -298
3260 -298 -96 49 108 213 -151 210 -203 -114 136 -21 62 67 -37 -102 -61 25 297 304 105 160 -24 -150 94 194
3284 194 78 125 98 37 322 6 230 187 433 188 -313 -99 37 -34 91 131 -103 -36 143 -39 173 -107
3306 -107 116 7 96 -196 -14 -21 -10 -70 -275 -88 -110 -128 -53 -104 148 -13 -59 209 -357 -171 -276 102 -181
3329 -181 -453 -38 -3 -42 -139 31 -224 -148 132 -271 -24 114 -202 -95 -70 -291 -77 -225 -343 52 21 3
3351 3 33 96 166 96 -75 -90 -99 -38 -117 -22 146 106 -156 8 314 -146 91 222 119 -155 241 -19 3 182 213
3376 213 -6 -8 306 -93 -17 28 166 -210 -216 8 -74 1 289 -54 -224 134 19 127 41 16 -65 79 -20 -313
$$ packed form
3213a87M57k91K04l5j55l8k06J93J96J05j66j48on8k89R5L63k59K41k32P9J70
3235C3q0J51k65J12O9N4j39n7K93m26K08l9J18k49L25j88J6l7P1L9M5p9PQ9l69
3260b98K02J45N9J05l64L61m13Q9K50j57Q3Nj04o5M1Q6K72Pj99N5j84j26K44J00
3284A94j16M7k7o1K85l16K24m3K46k45n01K14J36p1J25M0k34O7J79j82K12k80
3306a07K23j09Q9k92J82pJ1o0k05J87k2j8P5n1K52j61m6K68n66J86j05L78k83
3329a81k72M15L5l9r7J70k55P6K80m03K47J38l16J07K5k21K14j48j18L95l1j8
3351CL0O3P0p0j71j5rO1p9R5J68m0k62J64L06m60K37J31j03k74L96k60K2J79L1
3376B13k19kL14l99P6M5J38l76oK24q2P5K88l43j70L58j15J08q6k5q1J44r9k93
$$ plain form
3400 -313 -4 -67 111 165 -1 262 -160 143 -8 162 165 -99 -247 -1 -165 75 -87 86 -85 94 410
3421 410 71 -32 -25 -131 -157 7 -195 -109 -16 218 -71 -112 54 -64 -66 -64 -46 -20 162 7 124 -214 161 117
3445 117 -23 -31 35 37 123 165 -62 265 35 -19 -135 -90 118 205 263 179 105 162 132 54 168 -3 46 -5 94 -25
3471 -25 336 18 -150 -88 29 -49 31 155 24 -38 -38 -12 -225 -58 67 69 13 -59 145 48 25 235 133 -304 -61
3496 -61 232 104 -159 103 -185 160 -192 -91 -25 -34 -111 -67 -75 -270 -458 -74 -207 -53 -31 151 -58 67 101
3519 101 -205 -6 -5 -236 187 -67 205 138 -10 -8 231 126 -60 46 -140 272 178 -35 -62 38 35 4 78 173
3543 173 439 -29 -6 -57 137 8 -80 54 15 63 -173 113 -9 -248 193 57 -50 16 154 199 -108 -42 153
3566 153 120 57 28 -185 -195 285 -60 40 -77 143 1 -100 69 25 -144 -257 -105 -1 -152 -202 147 -106
$$ packed form
3400c13L09o3J78N4j66K63m22L03j51J70Lk64j48K46j64K40j62J73j71J79L16
3421D10l39j03Pj06k6J64k02Q6R3K34k89m1J66j18kKJ8K6J82j55J17l38L75m4
3445A17j40qO6KQ6M2k27L27k30n4j16M5K08Q7N8q4p4N7l0p8J14j71M9n1R9j19
3471b5L61l18j68O2J17p8Q0J24j31o2%K6k13J67J25Kn6p2K04r7k3K10j02m37K43
3496f1K93j28k63K62k88L45l52J01O6rp7M4qj95j88L84j33J54K2J82k09J25L4
3519A01l06J99Jk31M23k54K72o7j48KK39j05j86J06j86M12r4k13k7J00ll1P4R5
3543A73K66m68K3n1J94j29q8J34l9M8k36K86j22k39M41j36j07O6J38M5l07O6J95
3566A53l3o3k9k13j0M80l45J00j17K20j42j01J69m4j69j13J52J04j51n0L49k53
$$ plain form
3588 -106 324 -75 -24 -309 -122 0 -274 -23 -82 16 11 -71 -268 -103 -291 -119 -189 56 63 -29 150 85 -109 88
3612 88 221 -28 16 181 -194 -238 52 79 -44 27 92 128 2 170 -220 187 169 -188 -52 47 -241 106 127
3635 127 61 288 59 61 97 64 -42 -46 -146 -50 37 187 299 -85 197 141 -5 16 117 -222 -68 305 -78 -97
3659 -97 -209 147 283 31 -154 -70 -161 219 149 -98 -2 -213 -4 -3 -147 -55 -145 -225 81 -132 272 -21 -305
3682 -305 42 60 260 -76 -278 -38 197 272 -280 -311 -386 34 117 -43 -216 -243 22 64 125 155 -112 -172 -200 -19
3706 -19 -273 -125 15 5 -95 131 72 -122 49 36 231 108 -135 -27 -54 48 155 108 80 51 235 -203 132
3729 132 280 1 -153 34 117 -45 31 -65 -33 116 -80 37 13 -123 324 117 -167 284 164 -78 191 318
3751 318 -35 221 307 -234 12 18 -263 -64 -135 64 35 60 -177 14 -213 -242 135 163 177 43 112 -121 2
$$ packed form
3588a06M30l99N1k85J87J22k74K51n9R8nq2j97J65j88J72p0K45Pr2J79o5j94J97
3612H8J33k49M4J65l75m4K90K7j23P1O5L6j26J68l90M07j8l57J36R9k88L47K1
3635A27o6K27k29KL6l3j06mj00R6Q7J50J12l84K82n6j46K1J01l39J54L73l83j9
3659i7j12L56J36k52j85Q4r1L80p0k47R6k11K09Jj44R2r0q0L06k13M04k93k84
3682c05L47J8K00l36k02K40K35P5n52l1p5M20Q3j60j73k7K65M2O1L0k67o0k8J81
3706a9k54J48J40j0j00K26n9j94J71j3J95j23k43J08k7J02J07m7k8k9J84m38L35
3729A32J48k79j54J87Q3j62P6r6L2J49j96J17k4j36M47k07k84M51j20k42K69J27
3751C18l53K56Q6n41K46Ok81J99p1J99k9K5k37J91k27k9L77K8J4j34O9k33J23
$$ plain form
3774 2 -107 -6 1 -202 -100 -265 -24 -188 42 3 -38 -36 -138 -74 50 105 143 -65 -38 31 -107 -138 -110 11 66
3799 66 137 -13 -235 61 370 -25 -53 180 -13 85 102 -59 -278 117 -26 254 8 -23 219 39 168 6
3821 6 115 18 17 11 11 -47 228 168 -116 -44 -39 291 363 -47 56 -15 -153 7 111 45 193 -171 126 71 91 -162
3847 -162 190 72 210 212 56 213 -280 14 94 175 -15 174 -19 79 -5 -200 164 -121 20 -108 -252 -64
3869 -64 115 -71 -49 -313 13 16 -154 -237 67 157 -23 23 -139 -208 -41 113 4 -110 -270 -216 -95 -168 31
3892 31 -31 -121 -80 19 -12 -127 402 -194 146 -62 117 43 -169 100 -124 180 -142 57 280 -276 21 232
3914 232 117 251 -52 146 81 114 -78 -19 1 227 -112 75 -29 146 -105 -4 107 123 61 -134 175 118
3936 118 100 -55 106 -103 -50 -129 208 -134 106 89 440 16 212 110 94 -57 -141 -65 305 -97 -162 -82 85
$$ packed form
3774Bj09J01Pk03J02j65K41j64K30l9m1Kj02O4J24N5L8k08K7O9j38l1K8J21N5
3799F6P1j50k22K96L09l95k8K33j93R8J7j61k19L95j43K80k46l1K42j80J29j62
3821FJ09r7jo%n8K75o0k84P2NL30P2m10J03p1j38J60J04o6J48l64K97n5K0k53
3847a62L52j18J38Kj56J57m93K94Q0Q1j90J89j93R8q4j95L64k85J41j28j44J88
3869f4J79j86K2k64L26Lj70q3L04R0j80M6j62o9J67J54j09j14j60N4J21p3J99
3892C1o2r0M1R9l1j15N29n96L40k08J79p4k12K69k24L04l22J99K23n56K97K11
3914B32j15J34l03J98o5L3j92N9K0K26l39J87j04J75k51J01J11J6o2j95L09n7
3936A18j8j55J61k09N3p9L37l42K40j7L51m24J96j02j6j51q4P6L70m02o5Q0J67
$$ plain form
3959 85 -6 21 -70 -105 -310 -41 -63 11 -123 -333 123 21 9 -189 -91 -1 83 -126 252 96 71 -138 -8 -130
3983 -130 -11 -218 -99 -15 -126 221 13 32 170 -156 -191 88 -112 -160 64 74 -120 95 -76 0 -116 -39
4005 -39 -4 -5 -33 33 201 296 -165 165 208 160 -98 59 -11 -136 139 -2 -97 -11 35 -122 262 234 328 86 114
4030 114 -59 -10 165 159 353 53 133 95 -230 -246 -140 -168 117 -188 41 -110 -80 162 110 -79 97 127 145 121
4054 121 -153 -14 -147 -84 225 122 -263 -57 6 -96 10 5 42 25 -98 207 -55 -99 -136 -47 158 -3 -183
4077 -183 12 77 37 -103 129 167 -84 -143 51 -9 -34 175 84 -42 -38 -194 239 58 52 -263 -102 332 44 -211
4101 -211 188 17 64 199 -58 -66 63 -203 -130 -52 -197 135 89 -12 -188 194 20 93 -87 139 36 -34 -28
4124 -28 143 138 158 252 -175 12 -153 67 -105 69 -55 -107 -247 -234 189 -48 272 167 -105 -112 45 39 377 120
$$ packed form
3959H5r1K7r1l5k05K69k2P4j34k10M56j02j2j98R8R0Q4k09L78j56k5k09J30j22
3983a30J19k07J19Q4j11L47k08J9J38l26l5K79k00m8K24J0j94K15j71P6j16P7
4005c9L5jk8O6J68R5m61L30M3m8k58J57p0j25K75j41r5Q6M6j57L84k8R4k42K8
4030A14j73M9J75oJ94l00Q0l8l25j6J06k8K85l05K29j51L0K42n2j89J76L0J8k4
4054A21k74J39j33O3L09j03l85K06O3j02J06nL7j7j23L05k62m4l7Q9K05j61j80
4077a83J95O5m0j40K32L8k51n9J94o0k5K09r1j26Mj56M33j81ol15J61M34k88k55
4101b11L99j71M7J35k57qJ29k66P3P8j45L32m6j01j76L82j74P3j80K26j03p0O
4124b8J71nK0R4m27J87j65K20j72J74j24n2j40J3M23k37L20j05k72pJ57oL38k57
$$ plain form
4148 120 -4 9 283 -68 -73 41 -167 107 -129 -282 16 172 183 136 -178 -43 -80 -171 -143 35 -120 235 27
4171 27 -76 -350 -78 81 -194 -4 61 15 -125 -54 -52 47 36 235 -191 -88 32 -203 -67 43 -250 116 -80
4194 -80 61 -21 64 -161 -13 -101 413 -22 -151 -243 -28 -145 -85 65 94 -82 -1 19 -210 14 45 65 37 -57
4218 -57 -3 69 -69 -87 -9 66 -44 -140 -48 -108 -71 72 -194 -49 -204 -130 -180 -136 -24 -88 -107 -97 -196 -59 14 -165
4244 -165 -156 -36 -108 51 -104 53 -155 156 76 -53 251 -142 186 15 -96 24 -79 -65 -226 -125 -86 223
4266 223 -98 131 -48 -194 106 57 180 -140 59 -152 88 197 91 177 -68 -31 2 136 159 170 185 18
4288 18 51 134 -125 -14 -149 2 112 25 84 -79 126 -118 56 -36 -86 99 115 23 -161 145 -21 -247 191
4311 191 -202 -164 214 78 -98 314 153 -30 -320 35 172 20 65 -144 62 -68 -86 -54 -103 -215 -40 -104
$$ packed form
4148A20j24J3K74l51nJ14k08K74k36j53K98J56J1m7l14J35l7r1K8J78j55L55k08
4171B7j03k74K72J59k75J90O5m6j40P1KR9j1J99m26J03J20k35J36J10k93L66j96
4194h0J41q2Q5k25J48q8N14m35j29r2K15j17O0J50K9j76Q1K0k29K24L1K0k8r4
4218e7N4P2j38j8P8P5j10r6R2o0L7J43k66J45j55P4n0M4J12o4j9J0r9J37P3j79
4244a65RJ20p2J59j55J57k08L11q0j29L04l93L28j71j11J20j03J4j61J01L9L09
4266B23l21K29j79j46L00m9J23l20J99k11K40J09j06Q6k45L7L3J34K3J1J5j67
4288A8L3Q3k59J11j35J51J10q7N9j63K05k44J74r2n0J85J6r2j84L06j66k26M38
4311A91l93L8L78j36j76M12j61j83k90L55J37j52M5k09K06j30j8L2m9j12J75o4
$$ plain form
4333 -104 160 -206 90 9 -38 -13 -7 84 -241 -9 250 -71 124 55 107 -216 -1 -54 66 186 178 -95 -103 56
4357 56 239 -228 -88 121 147 116 46 25 81 158 -121 290 8 -64 136 125 -135 150 83 118 -90 58 293 -110
4381 -110 -134 -54 -119 93 -19 27 -230 -112 24 -29 175 -34 -15 57 4 -59 100 -123 -53 -86 33 41 333 -1
4405 -1 -142 84 82 291 59 -57 -128 113 133 -178 -141 -11 -4 39 28 -236 122 -117 335 -181 -323 188 184 102 -118
4430 -118 10 189 52 -25 -90 122 174 59 139 -339 -60 215 -100 -137 -138 221 71 -156 -43 288 141 -148
4452 -148 138 -166 346 71 71 123 290 23 42 39 36 21 11 -234 -41 -64 281 -11 -136 113 133 -92 99 166
4476 166 221 66 8 128 242 -150 162 -71 8 -9 265 184 116 34 135 -99 -261 50 -390 8 71 -111 202
4499 202 -127 -49 144 -8 -50 6 -49 6 248 -25 -2 -87 2 -120 177 -139 -106 -118 -45 -8 -24 77 -155 37
$$ packed form
4333a04K64l66K96q1m7K5OR1l25K32K59l21J95o9N2l23K15n3J20J20qk73qJ59
4357E6J83m67J40K09K6l1p0k1N6P7k79M11k82p2K00j1k60K85o7L5k08J48K35m03
4381a10k4Q0o5K12j12M6k57J18J36n3K04k09J9P2n3o3J59k23P0l3J19QK92l34
4405aj41K26kK09k32j16p1K41K0l11L7J30PM3j1k64L58k39M52n16j42N11mq2k20
4430a18J28J79j37p7o5K12N2j15Q0m78K79K75l15l7jL59j50k27J13L31j47k89
4452a48K86l04N12k75%N2J67k67J9llj5j0k45J93k3L45k92j25K49K0k25J91O7
4476A66N5j55n8J20J14l92L12k33P9j7K74q1o8q2J01k34j62L11m40L98O3j82L13
4499B02l29P8J93j52m2N6n5N5K42k73K3q5Q9j22K97l16L3j2P3L7j6J01k32J92
$$ plain form
4523 37 -70 -97 57 124 -16 51 -130 27 82 -13 23 -289 -31 102 -70 129 95 -256 -123 -4 -33 -7 72 92
4547 92 3 104 129 226 -41 40 90 -43 -296 54 -65 343 -34 -217 50 13 211 -249 -48 -434 -17 -254
4569 -254 28 92 81 -9 300 -222 395 24 -272 -33 38 -98 -219 -97 -4 -26 -305 246 10 -89 -10 4 143
4592 143 -16 73 -71 133 -191 138 128 -108 -56 -47 75 -130 -148 -132 -76 -66 98 25 34 396 109 -65 -26 -172
4616 -172 -58 -136 -235 -126 90 -31 -219 84 -275 197 147 -254 -60 67 -352 16 -97 -68 41 49 107 30 115
4639 115 7 85 -296 -25 168 353 36 118 -28 -145 -144 -39 -42 170 198 61 111 5 264 82 -61 80 155
4662 155 223 -135 128 148 33 -49 -89 -28 -233 32 -177 149 -76 -94 148 -128 60 -6 133 -85 76 13 12
4685 12 -118 182 -51 87 21 -176 -158 -211 207 -173 -59 -55 -65 93 120 -321 105 -68 40 -244 -140 196 198
$$ packed form
4523C7j07k7J54O7j40O7j81J57N5r5L6l12K58J33j72J99l4l51J33J19k9K6P9K0
4547I2q9J01K5R7k67Q1N0j33k53L50j19M08l77j83K67l7J98m60K01l86M17k37
4569b54K82O4j1r0L09n22O17l71k96K39P1j36j21J22R3k2k79N51k36r9P9J4J39
4592A43j59Q9j44K04l24L29j0k36N2RJ22k05j8J6N6J0J64p3RL62k87j74L9j46
4616a72J14p8r9J09K16j21j88L03l59M72n0m01J94J27m19L68j13K9J09QN8p7Q5
4639A15j08P8l81K71J93J85l17Q2j46j17JJ05lK12K8j37N0j06K59j82j43J41P5
4662A55O8l58K63K0j15q2m0O1k05K65k09L26k25j8K42k76J88o6J39k18J61o3j
4685A2j30L00k33J38o6j97J8n3M18l80J14Mj0J58K7m41M26j73J08k84J04L36K
$$ plain form
4708 198 -178 -202 185 -143 -68 -59 66 -211 131 -39 417 159 32 -225 99 -138 52 140 49 225 8 -16
4730 -16 -203 -79 -39 189 -24 298 161 111 12 80 43 87 9 -114 -185 -124 -89 -166 -145 -94 -86 -69 -156 -74 -46 -173 43
4757 43 -60 -2 -35 -137 129 45 -71 152 -321 -10 -30 -249 -1 -144 30 -202 -35 -308 -173 29 -336 -65
4779 -65 -150 -328 -144 -65 122 110 47 23 72 -30 -95 -181 110 -5 -141 -174 59 -73 -299 135 260 -36 -99 104
4803 104 -104 171 -48 -183 114 58 153 165 103 -40 -2 -83 -185 -44 267 10 -121 225 -273 -25 -46 -20 141
4826 141 -24 2 49 1 99 -7 20 -63 118 77 -66 -63 183 260 182 19 -5 -258 33 -17 -216 12 -304 -175
4850 -175 -182 -77 -202 1 102 60 183 -48 -87 -95 75 -175 -119 -133 113 269 100 -292 2 30 218 -44 385
4873 385 -24 -127 82 -117 -75 -65 -130 -38 -255 -194 42 51 221 -101 195 -102 -94 -244 -247 -118 122 -56 -123 -25
$$ packed form
4708A98l76k4L87l28P5RJ25k77L42j70M56k58j27k57L24k37J90Q8r1J76k17k4
4730a6j87J24M0K28k13L22j37n0r9O8l7M4p8j23p1O1L5p7K1N1QJ7q7Q2K8j27K16
4757D3j03N8l3j02K66q4j16K23m73L11k0k19K48j43J74k32J67k73J35K02l65K71
4779f5q5j78J84P9J87j2o3k4M9j02o5q6K91j15j36l3K33j32k26M34J25k96o3K03
4803A04k08K75k19j35K97n6R5J2o2j43L8q1j02J41L11k57j31L46m98K48k1K6J61
4826A41j65K6M7m8R8j06K7q3J81m1j43LK46P7p8j63k4k53K91n0j99K28l16J29
4850a75pJ05j25K03J01m2J23k31l9qJ70k50N6j4K46J56j69l92K94K8J88k62M29
4873C85m09j03K09j99M2J0o5R2k17O1K36RJ70l22K96k97Qj50lJ29K40j78o7R8
$$ plain form
4897 -25 -81 236 140 -118 -402 -44 -51 -77 -52 137 -153 -87 342 17 -39 -32 35 217 166 76 69 115 24 238 -7 -119
4923 -119 20 -231 46 -51 -40 183 -91 -27 135 71 1 283 23 -54 -47 -87 26 -83 -87 168 35 -72 147 2
4947 2 119 -126 38 164 90 -30 -308 126 -39 8 272 -6 -95 -266 -233 171 -407 53 -105 58 262 -37
4969 -37 -40 -136 -78 -73 102 229 -67 -69 -6 116 208 133 -190 54 72 115 47 54 -178 55 41 -148 157 36 -48 239
4995 239 124 4 -195 12 -25 -106 103 -107 77 -228 19 96 -126 -209 -117 122 3 166 -14 -176 269 54
5017 54 -233 -22 173 -22 42 -122 -28 134 -48 127 -148 10 179 78 33 70 113 65 -10 162 -12 -75 -181
5040 -181 132 159 230 -19 162 314 71 90 -269 -10 -165 140 -342 -40 39 -202 19 72 25 33 -151 -110 74
5063 74 -73 98 -39 108 89 -13 -44 -90 -37 -92 -210 138 -49 -85 -187 -238 29 -40 129 71 -25 50 219 51
$$ packed form
4897b5n6L17r6k58k84L58pk6K5J89k90O6M29l25n6PO7J82n1r0pM6r1K14k45j12
4923a19J39k51K77r7J1K23k74O4J62o4p0K82k60p7Pm0J13j09mK55j33j07K19j45
4947BJ17k45J64J26p4j20k78M34j65M7K64k78q9j71L3M04n78M60j58J63K04k99
4969c7lr6N8NJ75J27k96kO3J22R2p5l23K44J8M3o8Pk32K33j4j89L05j21q4K87
4995B39j15j20j99K07l7q1K09k10J84l05K47P7k22q3R2K39j19J63j80j62M45k15
5017E4k87K11J95j95O4j64R4J62j82J75k75J58J69j01m5L7M3m8p5J72j74o3j06
5040a81L13K7P1k49J81J52k43J9l59K59j55L05m82L02P9k41K21N3m7Qj84M1J84
5063G4j47J71j37J47j9j02l1m6N3n5j18L48j87l6j02n1K67o9J69n8r6P5J69j68
$$ plain form
5087 51 -42 369 -40 84 50 82 281 104 -78 4 95 27 44 -90 151 162 -192 -41 63 53 -135 156 54
5110 54 144 -79 74 -124 -49 99 78 27 -112 207 -52 81 -35 -141 -46 -18 122 -120 -110 64 -148 -34 97
5133 97 23 -172 36 -256 -118 -353 -259 163 147 263 -155 -82 34 242 -172 -100 -115 -210 29 -159 99 -132 202
5156 202 -38 -8 -107 -200 -204 -7 36 -23 -199 28 258 82 95 -23 41 160 26 195 173 -136 -50 33 187 233
5180 233 -51 -25 -154 204 -27 -183 364 300 -154 312 156 -67 19 72 -28 110 -46 92 -121 7 144
5201 144 29 218 -63 -119 -91 -62 330 136 -75 -253 -56 46 243 -1 -10 82 -152 8 -41 202 54 -174
5223 -174 53 113 -55 202 -110 -328 -127 -267 -56 86 -66 157 -222 -180 -34 -218 -70 4 59 46 14 59
5245 59 73 -303 -71 -46 -5 143 -310 -90 -2 -112 -71 -188 101 -79 -64 34 5 -109 -47 -47 111 205 75 -36
$$ packed form
5087E1r3M11m09J24l4L2J99j77j82Q2R1o8J7j34K41J1l54J51J04j0j88K91j02
5110E4R0k23J53j98P5J48k1n1j39L19k59J33j16j06R5K8J40k42J0J74k12J14J31
5133I7p4j95K08k92J38k35R4M22j6J16m18P3J16K08m14P2j5r5K39j88K58k31L34
5156B02k40L0r9r3mJ97M3n9j76K27K30j76J3j18O4J19j34J69k2l09Q6Q3J54M6
5180B33k84K6j29L58k31j56N47o4m54M66j56k23Q6N3j00J38j56J38k13J28J37
5201A44j15J89k81n6K8K9L92j94k11j78J97J02J97k44rR2k34J60m9K43j48k28
5223a74K27O0j68K57l12k18K01j40K11J42j52K23l79M2J46j84J48P4N5j3l2M5
5245E9J4l76K32K5M1J48m53K20Q8j10M1j17K89j80J5R8k9j14O2%J58R4j30j11
$$ plain form
5269 -36 141 316 -62 -159 112 2 214 0 -40 286 -104 112 -197 82 116 2 100 43 88 140 -37 29 97
5292 97 -77 -14 167 79 -29 204 -72 40 89 -12 -531 134 238 -21 66 34 -111 -126 -163 -91 -143 -57 -50 -300
5316 -300 66 70 -131 -116 1 149 -138 -32 38 -31 144 -119 -34 -260 -20 79 -80 -281 -196 166 -111 129 -352
5339 -352 -16 -2 157 85 46 107 -23 103 -302 -67 -211 -122 -155 -72 89 49 -104 -8 -128 -100 62 -165 70
5362 70 149 132 66 316 118 91 76 51 168 339 339 -316 -148 359 213 -20 146 -42 304 63 96 -34 163
5385 163 18 306 -224 -48 -221 7 -90 -62 119 -188 103 -53 146 11 -385 18 269 95 -195 -21 91
5406 91 233 167 91 -85 -200 -165 -286 -301 218 -117 -33 20 16 -179 -129 277 -29 -103 -81 -134 -44 265 -179 236 -235
5431 -235 -43 133 164 -274 -215 -137 -177 -17 -56 32 -90 171 62 -103 66 89 378 37 -35 25 -147 213 -49
$$ packed form
5269c6J77J75l78r7K71j10K12k14m0L26l90K16l09K79L4j14R8n7M5N2j77O6O8
5292I7j74O3J81q8j08K33k76J12M9j01n19O65J04k59Q7l2j45j5l7P2n2Q6Pk50
5316c00L66Mk01J5J17J48k87J06P0o9J75k63Q5k26K40R9j59k01Q5L62k77K40m81
5339c52L36J4J59p2l9O1j30J26m05K35j44Q9l3Q3J61m0j53R6j20K8J62k27K35
5362G0P9j7o6K50j98k7j5k5J17J71%o55J68N07j46k33J66j88L46k41L3j30J97
5385A63j45K88n30J76j73K28r7K8J81l07K91j56J99j35l96M03K51j74k90J74J12
5406I1J42o6p6j76j15L5j21j5N19l35Q4N3mj95N0M06l06p4K2n3R0L09m44M15m71
5431b35J92J76L1m38N9P8m0J60l9Q8j22K61j09j65J69K3K89l41p2O0j72L60k62
$$ plain form
5454 -49 140 -365 41 -67 19 123 -16 65 113 74 -342 65 203 293 90 -75 -23 87 -126 27 291 60
5476 60 -6 86 -76 63 24 173 116 4 130 249 -157 139 -277 -59 -86 -84 89 -218 -4 -143 -164 -169 111 -23
5500 -23 98 -108 -127 -207 -79 51 285 -21 -106 -19 92 26 163 -94 -132 -44 109 -270 82 -34 -117 -47 -137 87
5524 87 45 174 -215 -162 159 189 -5 89 10 -65 59 -205 114 196 -49 13 145 51 -178 192 284 16 -107 -166
5548 -166 245 123 -70 -67 74 108 305 105 2 125 -118 28 153 110 93 0 -129 147 66 -5 -7 76 228 -261
5572 -261 -74 442 100 -94 -53 -42 -18 -152 201 1 -33 -282 -40 -319 16 -121 -93 51 -66 31 -22 155
5594 155 -72 -8 -200 -211 -75 -53 -12 -111 100 -97 33 -18 -101 -25 130 -51 -9 143 -28 -68 -204 -183 -81 78
5618 78 133 -73 -65 -92 176 92 145 -130 23 209 74 -152 32 71 218 -25 107 118 -20 110 -182 231 27
$$ packed form
5454d9J89n05M06j08Q6J04j39Q1M8l9m16M07J38R0k03j65N2J10k13J53K64k31
5476F0o6R2j62J39l9J49n7j12J26J19m06K96m16K18k7KJ73l07K14j39k1nK80j34
5500b3J21k06j9q0J28J30K34l06q5Q7J11o6J37k57l8Q8J53l79L52j16q3P0r0K24
5524H7m2J29l89N3L21L0j94R4p9p5J24k64L19Q2k45O2J32r4k29L70R2k68j23n9
5548a66M11j22j93LJ41L4J97k00j03J23k43J46J25m3j7r3j29K76q1p1kQ3J52m89
5572b61J87N16l42j94M1J1K4j34L53k00l4k49K42k79L35j37K8J44j17R7n3J77
5594A55k27O4j92j1J36K2M1r9K11j97J30n1q3P6J55j81M2J52j71m0j36K1J02J59
5618G8N5k06Qk7K68q4N3k75J53J86j35k26J84L9J47k43J32J1j38J30k92M13k04
$$ plain form
5641 27 211 3 93 7 -77 180 -44 -18 68 74 -133 -30 -2 -240 24 123 -86 -81 -142 -58 -207 -182 302 -104 3
5666 3 -278 -46 -99 280 -74 -18 16 -53 -71 23 -165 47 265 219 -86 -252 -133 -12 156 43 95 158 -66 -195
5690 -195 37 -3 -40 -93 -21 -75 -49 17 -57 -241 -134 133 117 104 104 -116 228 -117 -213 258 -155 67 70 314 -337
5715 -337 -218 -87 -165 148 212 32 148 341 133 138 44 89 265 231 -147 4 -48 220 -6 83 -141 -91 -43 48
5739 48 237 143 146 -177 -147 76 101 -108 81 130 105 295 -47 -52 16 3 6 317 -205 63 -102 -273 43 -75 -39
5764 -39 -158 -131 -116 187 -32 -185 -92 -26 -191 -78 94 -63 -167 -55 -126 -124 -182 -4 155 87 -87 287 -117
5787 -117 7 -16 107 42 -60 -48 99 -3 76 150 -292 150 -247 -112 -72 -100 148 -127 22 113 -15 142 -352
5810 -352 -166 -134 19 269 -122 87 -114 -116 -171 66 -49 256 72 -55 -100 38 113 90 0 -117 55 78 86 -154
$$ packed form
5641B7J84k08R0q6q4K57k24K6Q6Ok07J03K8k38K64R9k09No1Q4j49K5M84m06J07
5666Ck81K32n3L79l54N6L4o9j8R4j88K12K18m6l05j66J19J21J68j13N2O3k24j29
5690a95K32m0l7n3P2n4K6O6p4j84J07K67j6j3%k20L44l45r6M71m13K22LK44o51
5715c37J19J31p8L13O4j80J16J93k08Nr4M5J76l4l78J51n2K68k26Q9k24N0M8R1
5739D8J89r4Ll23L0K23K5k09J89M9k5J90l42nO8j3LL11n22K68j65j71L16j18L6
5764c9j19K7J5L03k19j53R3O6j65J13J72j57j04J12p1Kn8J78J59o8j74L74m04
5787a17J24k3J23o5j02J2J47j02P9P4m42M42l97J35M0k8K48k75J49R1j28J57m94
5810c52J86L2J53K50l91K09k01kn5K37j15L05j84j27m5J38P5k3r0j17J72K3Qk40
$$ plain form
5834 -154 207 71 57 19 122 282 96 -177 -121 37 -152 44 -49 124 7 187 77 243 84 -234 106
5855 106 -159 28 8 -38 97 16 -222 -8 179 -133 -157 5 99 -34 -6 7 -159 -178 -102 72 124 112 -49 -162
5879 -162 4 -484 -132 217 -8 45 228 -36 -252 54 -30 258 -128 268 98 90 -221 53 13 37 68 25 -136
5902 -136 -8 -221 31 183 148 57 -3 58 -280 -69 -113 -35 190 70 138 17 162 31 -142 -15 175 -142
5924 -142 127 191 -75 -320 -395 217 20 -126 60 129 32 -74 -214 81 -112 -60 -111 103 -301 -210 175 246 236
5947 236 115 102 -180 -165 9 206 -128 -141 -201 51 -123 -28 -142 118 -242 -69 -45 -269 25 -111 -283 -167
5969 -167 38 -121 -37 46 109 -2 27 -22 126 45 168 134 -273 63 40 74 126 -11 -153 -69 83 -10 -84 94
5993 94 15 -1 90 -10 116 176 117 219 277 -35 0 -59 38 103 -40 -71 17 -252 163 113 240 27 -258 7 -45
$$ packed form
5834a54L61j36j4l8J03J60j86k73N6J58j89J96r3J73j17J80j10J66j59l18L40
5855A06k65J87k0m6J35q1k38K14J87l12k4J62R4j33K8J3j66j9P6J74N2j2j61j13
5879a62J66m88L52L49k25N3J83k64k16L06q4K88l86L96j70ql11K74m0K4L1m3j61
5902a36J28k13K52J52l5r1o0O1l38K11m4P8K25j20O8j21J45j31j73J27J90l17
5924a42K69O4k66k45p5O12j97j46J86O9r7j06j40K95j93N2n1K14m04R1L85P1j0
5947B36j21j3k82J5J74J97l34j3o0K52j74R5j14K60l60J73K4k24K94j36j72J16
5969a67K05j59Q4Q3O3j11K9m9J48q1J23l4m07L36k3L4N2j37j42Q4J52r3p4J78
5993I4p9j6R1j00J26O0n9J02N8l12L5n9R7O5j43l1Q8k69M15n0J27k13k85K65n2
$$ plain form
6018 -45 36 -13 110 73 -140 75 109 92 35 285 189 -196 43 102 -191 -40 -298 -191 -259 -111 -86 196 -239 -177
6042 -177 -80 -70 -127 201 -43 131 -199 -149 -48 3 82 97 50 62 -150 177 12 -211 23 117 -104 -50 81 -67
6066 -67 -282 -102 -152 29 51 -58 -106 -211 143 -48 -38 136 74 192 158 172 -343 98 44 161 117 -381 226
6089 226 -53 179 -171 -171 300 72 -117 -205 68 116 -5 153 -87 -18 -105 -229 33 45 168 -83 60 6 59
$$ packed form
6018d5Q1m9J23l7k13K15L4j7n7K50r6l85K39N9k93J51k58J07o8J48K5K82m35O2
6042a77R7J0n7L28k44J74l30N0J01N1P9J5m7J2k12L27j65k23K34R4k21N4J31j48
6066f7k15J80n0J81K2j09m8j05L54j91J0J74o2J18l4J4n15M41n4J17m4m98O07
6089B26k79K32l50%M71k28j89q8K73M8j21J58k40O9q7j24K62J2J23k51J43n4N3
$$ [...]
8191a29
##END NTUPLES=NMR FID
##END=
